{"text_format":"1","workbook":"xlsx","n_sheets":10,"sheets":["INTRO","COUNTRY_INFO","DEC","ALB_MBD","PZQ","IVM","IVM+","SUMMARY","SHIPMENT","DATA_POLICY"],"not_rendered":{"charts":0,"images":3,"macros":1,"external_links":0,"defined_names":10,"comments":9,"pivot_tables":0},"unopened":[],"bounds":{"document_bytes":16777216,"sheet_cells":100000,"rows_first":2000,"rows_last":500,"rows_between":2000,"halvings":0,"cell_chars":16384,"cell_head_chars":4096},"cells_cut":0,"cells_raw":0,"read":"whole","date_system":"1900"}

{"sheet":"INTRO","index":0,"n_rows":51,"n_cols":8,"rows_kept":51,"cut":false,"hidden":false,"merged":[[21,1,21,4],[46,1,46,4],[38,1,38,2],[40,1,40,2],[42,1,42,2],[44,1,44,2],[36,1,36,2],[22,2,23,4],[25,2,26,4],[27,1,27,4],[32,1,32,2],[29,1,29,4],[30,1,30,4],[28,2,28,4],[24,1,24,4],[34,1,34,2],[0,1,0,4],[2,1,2,4],[1,1,1,4],[5,1,5,4],[3,1,3,4],[7,2,7,4],[11,1,11,4],[4,1,4,4],[10,2,10,4],[20,2,20,4],[17,1,17,4],[13,1,13,4],[18,2,18,4],[8,2,8,4],[9,2,9,4],[19,1,19,4],[12,1,12,4],[16,1,16,4],[14,1,14,4],[15,1,15,4]]}
[]
[null,"Formulaire de demande commune de médicaments pour CP v.4.1"]
[]
[null,"Dans le cadre des efforts mondiaux entrepris pour accélérer l'expansion de la chimioprévention (CP) pour l'élimination de la filariose lymphatique et la lutte contre la schistosomiase et les géohelminthiases, l'Organisation mondiale de la Santé (OMS) facilite l'approvisionnement en albendazole, comprimés de 400 mg (GSK), pour les programmes nationaux d'élimination de la filariose lymphatique et programmes nationaux de lutte contre les géohelminthiases; en diethylcarbamazine, comprimés de 100 mg (Eisai), pour les programmes nationaux d'élimination de la filariose lymphatique; en mebendazole, comprimés de 500 mg (J&J) pour les programmes nationaux de lutte contre les géohelminthiases et en praziquantel, comprimés de 600 mg (Merck KGaA), destinés aux enfants d'âge scolaire, pour les programmes nationaux de lutte contre la schistosomiase. L'OMS contribue également à l'approvisionnement en ivermectine, comprimés de 3 mg (Merck), pour les programmes de donation pour l'onchocercose et la filariose lymphatique. \nCet outil Excel est concu pour aider les pays à quantifier le nombre de comprimés nécessaires, selon le traitement de chimioprévention requis, pour atteindre les objectifs de couverture de traitement de populations et districts pour l'année de la demande de médicaments. Le résultat de cet outil est une demande commune de médicaments pour la chimioprévention des maladies tropicales négligées, qui peut être imprimée, signée et soumise à l'OMS pour la demande de ces médicaments. "]
[]
[null,"Structure de l'application (feuilles de travail) :"]
[]
[null,"INTRO","Cette feuille contient des instructions pour compléter le formulaire de demande de médicaments pour la chimioprévention et des informations sur le statut de la chimioprévention pour les maladies d'endémie du pays."]
[null,"COUNTRY_INFO","Cette feuille contient des informations sur la structure administrative du pays, la population par groupe d'âge, le statut d'endémicité pour chaque maladie, la population devant être traitée par chimioprévention et les interventions prévues."]
[null,"DEC, ALB_MBD, PZQ et IVM","Ces feuilles contiennent des informations sur l'endémicité des districts ciblés pour le traitement aux médicaments spécifiques à la chimioprévention, les plans de traitement, et le nombre de comprimés requis et demandés."]
[null,"SUMMARY","Cette feuille inclut un résumé du nombre de comprimés demandés, des informations concernant le stock et les dates de soumission de la demande de médicaments. Avant de générer le rapport (run macros), veuillez sélectionner le médicament pour lequel le rapport est nécessaire. Veuillez suivre la même règle pour voir le nombre de personnes à traiter pour les maladies spécifiques. \nCette feuille doit être imprimée et soumise en tant que \"Formulaire de demande commune de médicaments pour chimioprévention\" (voir les instructions pour la soumission du formulaire sous la feuille SUMMARY)."]
[]
[null,"Instructions pour la saisie des données"]
[]
[null,"La plupart des cellules des feuilles de travail mentionnées ci-dessus contiennent des formules calculées automatiquement en fonction du protocole de traitement recommandé par l'OMS pour chaque maladie.\nVoir : https://www.who.int/publications/i/item/9789241599993."]
[]
[null,"Veuillez entrer vos données dans les cellules en fonction de leur code de couleur :"]
[]
[null,null,"Blanc - la cellule n'est pas protégée. Veuillez entrer la valeur de l'indicateur demandé."]
[]
[null,null,"Jaune - la cellule est protégée et inclut le nom de l'indicateur. Aucune entrée de données requise."]
[]
[null,null,"Orange - la cellule n'est pas protégée et contient un menu déroulant. Veuillez sélectionner la valeur dans le menu déroulant. "]
[]
[]
[null,null,"Vert - la cellule n'est pas protégée et contient des formules. Veuillez changer la valeur indiquée uniquement si vos données sont différentes de celles calculées automatiquement.  "]
[]
[]
[null,null,"Bleu - la cellule est protégée et contient des formules. Aucune entrée de données requise. "]
[]
[null,"Données pays"]
[]
[null,"PAYS",null,null,"TOGO",null,"TG","TGO"]
[null,null,null,null,5]
[null,"Année de la demande de médicaments",null,null,2024]
[]
[null,"Le pays est-il endémique à la filariose lymphatique (FL) ?",null,null,"Endémique mais pas de CP"]
[]
[null,"Le pays est-il endémique à l'onchocercose (ONCHO) ? ",null,null,"Endémique"]
[]
[null,"Le pays est-il endémique aux géohelminthiases (STH) ?",null,null,"Endémique"]
[]
[null,"Le pays est-il endémique à la schistosomiase (SCH) ?",null,null,"Endémique"]
[]
[null,"Combien d'unités administratives compte le pays ?",null,null,39]
[]
[null,"Si les données démographiques par groupe d'âge ne sont pas disponibles au second niveau administratif, veuillez entrer la proportion (%) de population, par groupe d'âge, du pays. Si les données sont disponibles, veuillez laisser les cellules vierges."]
[null,"1-4 ans","Enfants d'âge pré-scolaire (EAPréS)",null,0.16]
[null,"5-14 ans","Enfants d'âge scolaire (EAS)",null,0.3]
[null,"15 ans et plus","Adultes",null,0.5]
[null,"15-49 ans","Femmes en âge de procréer (FAP)",null,0.22700000000000001]

{"sheet":"COUNTRY_INFO","index":1,"n_rows":49,"n_cols":35,"rows_kept":49,"cut":false,"hidden":false,"merged":[[3,0,3,2],[3,7,3,10],[3,21,3,24],[5,0,5,2],[3,26,3,29],[5,26,5,29],[5,3,5,6],[5,7,5,10],[5,11,5,20],[5,21,5,24],[6,3,7,3],[6,2,7,2],[6,1,7,1],[6,0,7,0],[6,21,7,21],[6,13,6,16],[6,11,7,11],[6,12,7,12],[6,7,7,7],[6,8,7,8],[6,9,7,9],[6,10,7,10],[6,6,7,6],[6,5,7,5],[6,4,7,4],[6,28,7,28],[6,29,7,29],[6,17,6,20],[6,25,7,25],[6,22,7,22],[6,23,7,23],[6,24,7,24],[6,26,7,26],[6,27,7,27]]}
["INFORMATIONS PAYS"]
["Struture administrative, population par groupe d'âge, statut d'endémicité et interventions planifiées"]
[]
["TOTAL",null,null,{"$f":"SUBTOTAL(9,D$10:D$1010)","v":8472175},{"$f":"SUBTOTAL(9,E$10:E$1010)","v":1355548},2541655,4236099,null,null,null,null,{"$f":"SUBTOTAL(9,L$10:L$1010)","v":0},4196811,1348810,2529021,311673,4189504,964886.35219630064,1807110.2748283201,739929.20537289302,3511925.8323975136]
[]
["Structure administrative du pays",null,null,"Population",null,null,null,"Endémicité",null,null,null,"Population nécessitant la CP",null,null,null,null,null,null,null,null,null,"Nombre de tournées de traitement prévues pour l'année",null,null,null,"Criteria to apply for \nIVM+DEC+ALB therapy","Enquêtes épidémiologiques planifiées pour l’année"]
["Pays","Région/Département","District","Total","EAPréS","EAS","Adultes","FL","Oncho","STH","SCH","FL","ONCHO","STH",null,null,null,"SCH",null,null,null,"FL","Oncho","STH","SCH","FL","FL","Oncho","STH","SCH"]
[null,null,null,null,null,null,null,null,null,null,null,null,null,"EAPréS","EAS","FAP","TOTAL","EAPréS","EAS","Adultes","TOTAL",null,null,null,null,null,null,null,null,null,null,null,null,"IU_ID","IU_Name"]
[null,null,null,null,null,null,null,null,null,null,null,null,null,null,null,null,null,null,null,null,null,null,null,null,null,null,null,null,null,null,"x","x",null,"x","x"]
[{"$f":"IF(INTRO!$E$33<>0,INTRO!$E$33, \" \")","v":"TOGO"},"CENTRALE","BLITTA",170869,{"$f":"IF(INTRO!$E$48=\"\",\"\",ROUND($D10*INTRO!$E$48,0))","v":27339},{"$f":"IF(INTRO!$E$49=\"\",\"\",ROUND($D10*INTRO!$E$49,0))","v":51261},{"$f":"IF(INTRO!$E$50=\"\",\"\",ROUND($D10*INTRO!$E$50,0))","v":85435},99,19,21,11,{"$f":"IF(INTRO!$E$37=\"Endémique\",IF($H10>0,IF($H10=4,\"Inconnu\",IF($H10=99,\"Interrompu\",$D10)),0),\"Non requis\")","v":"Non requis"},121713,{"$f":"IF(INTRO!$E$41=\"Endémique\", IF($J10>1, IF($J10=4, \"Inconnu\", IF($J10=99, \"Surveillance\", E10)), 0),\"Non requis\")","v":27339},{"$f":"IF(INTRO!$E$41=\"Endémique\", IF($J10>1, IF($J10=4, \"Inconnu\", IF($J10=99, \"Surveillance\", F10)), 0),\"Non requis\")","v":51261},0,{"$f":"IF(INTRO!$E$41=\"Endémique\", IF($J10>1, IF($J10=4, \"Inconnu\", IF($J10=99, \"Surveillance\", SUM($N10:$P10))), 0),\"Non requis\")","v":78600},29210.509055999999,54769.704479999993,50714.120637599997,{"$f":"+SUM(R10:T10)","v":134694.33417359999},null,1,1,2,null,null,null,"Oui","Oui",null,null,null,48666,"BLITA"]
[{"$f":"IF(INTRO!$E$33<>0,INTRO!$E$33, \" \")","v":"TOGO"},"CENTRALE","MÔ",54888,{"$f":"IF(INTRO!$E$48=\"\",\"\",ROUND($D11*INTRO!$E$48,0))","v":8782},{"$f":"IF(INTRO!$E$49=\"\",\"\",ROUND($D11*INTRO!$E$49,0))","v":16466},{"$f":"IF(INTRO!$E$50=\"\",\"\",ROUND($D11*INTRO!$E$50,0))","v":27444},99,19,21,11,{"$f":"IF(INTRO!$E$37=\"Endémique\",IF($H11>0,IF($H11=4,\"Inconnu\",IF($H11=99,\"Interrompu\",$D11)),0),\"Non requis\")","v":"Non requis"},50222,{"$f":"IF(INTRO!$E$41=\"Endémique\", IF($J11>1, IF($J11=4, \"Inconnu\", IF($J11=99, \"Surveillance\", E11)), 0),\"Non requis\")","v":8782},{"$f":"IF(INTRO!$E$41=\"Endémique\", IF($J11>1, IF($J11=4, \"Inconnu\", IF($J11=99, \"Surveillance\", F11)), 0),\"Non requis\")","v":16466},0,{"$f":"IF(INTRO!$E$41=\"Endémique\", IF($J11>1, IF($J11=4, \"Inconnu\", IF($J11=99, \"Surveillance\", SUM($N11:$P11))), 0),\"Non requis\")","v":25248},5186.42688,9724.5503999999983,0,{"$f":"+SUM(R11:T11)","v":14910.977279999999},null,2,1,1,null,null,null,"Oui","Oui",null,null,null,48706,"MÔ"]
[{"$f":"IF(INTRO!$E$33<>0,INTRO!$E$33, \" \")","v":"TOGO"},"CENTRALE","SOTOUBOUA",145325,{"$f":"IF(INTRO!$E$48=\"\",\"\",ROUND($D12*INTRO!$E$48,0))","v":23252},{"$f":"IF(INTRO!$E$49=\"\",\"\",ROUND($D12*INTRO!$E$49,0))","v":43598},{"$f":"IF(INTRO!$E$50=\"\",\"\",ROUND($D12*INTRO!$E$50,0))","v":72663},99,19,21,11,{"$f":"IF(INTRO!$E$37=\"Endémique\",IF($H12>0,IF($H12=4,\"Inconnu\",IF($H12=99,\"Interrompu\",$D12)),0),\"Non requis\")","v":"Non requis"},75655,{"$f":"IF(INTRO!$E$41=\"Endémique\", IF($J12>1, IF($J12=4, \"Inconnu\", IF($J12=99, \"Surveillance\", E12)), 0),\"Non requis\")","v":23252},{"$f":"IF(INTRO!$E$41=\"Endémique\", IF($J12>1, IF($J12=4, \"Inconnu\", IF($J12=99, \"Surveillance\", F12)), 0),\"Non requis\")","v":43598},0,{"$f":"IF(INTRO!$E$41=\"Endémique\", IF($J12>1, IF($J12=4, \"Inconnu\", IF($J12=99, \"Surveillance\", SUM($N12:$P12))), 0),\"Non requis\")","v":66850},16186.522368000002,30349.729439999999,1324.5771432000001,47860.828951200005,null,1,1,1,null,null,null,"Oui","Oui",null,null,null,48707,"SOTOUBOUA"]
[{"$f":"IF(INTRO!$E$33<>0,INTRO!$E$33, \" \")","v":"TOGO"},"CENTRALE","TCHAMBA",209918,{"$f":"IF(INTRO!$E$48=\"\",\"\",ROUND($D13*INTRO!$E$48,0))","v":33587},{"$f":"IF(INTRO!$E$49=\"\",\"\",ROUND($D13*INTRO!$E$49,0))","v":62975},{"$f":"IF(INTRO!$E$50=\"\",\"\",ROUND($D13*INTRO!$E$50,0))","v":104959},99,19,21,99,{"$f":"IF(INTRO!$E$37=\"Endémique\",IF($H13>0,IF($H13=4,\"Inconnu\",IF($H13=99,\"Interrompu\",$D13)),0),\"Non requis\")","v":"Non requis"},135776,{"$f":"IF(INTRO!$E$41=\"Endémique\", IF($J13>1, IF($J13=4, \"Inconnu\", IF($J13=99, \"Surveillance\", E13)), 0),\"Non requis\")","v":33587},{"$f":"IF(INTRO!$E$41=\"Endémique\", IF($J13>1, IF($J13=4, \"Inconnu\", IF($J13=99, \"Surveillance\", F13)), 0),\"Non requis\")","v":62975},0,{"$f":"IF(INTRO!$E$41=\"Endémique\", IF($J13>1, IF($J13=4, \"Inconnu\", IF($J13=99, \"Surveillance\", SUM($N13:$P13))), 0),\"Non requis\")","v":96562},31842.719424000006,59705.098919999989,0,91547.818343999999,null,1,1,1,null,null,null,"Oui","Oui",null,null,null,48668,"TCHAMBA"]
[{"$f":"IF(INTRO!$E$33<>0,INTRO!$E$33, \" \")","v":"TOGO"},"CENTRALE","TCHAOUDJO",251543,{"$f":"IF(INTRO!$E$48=\"\",\"\",ROUND($D14*INTRO!$E$48,0))","v":40247},{"$f":"IF(INTRO!$E$49=\"\",\"\",ROUND($D14*INTRO!$E$49,0))","v":75463},{"$f":"IF(INTRO!$E$50=\"\",\"\",ROUND($D14*INTRO!$E$50,0))","v":125772},99,19,21,11,{"$f":"IF(INTRO!$E$37=\"Endémique\",IF($H14>0,IF($H14=4,\"Inconnu\",IF($H14=99,\"Interrompu\",$D14)),0),\"Non requis\")","v":"Non requis"},129153,{"$f":"IF(INTRO!$E$41=\"Endémique\", IF($J14>1, IF($J14=4, \"Inconnu\", IF($J14=99, \"Surveillance\", E14)), 0),\"Non requis\")","v":40247},{"$f":"IF(INTRO!$E$41=\"Endémique\", IF($J14>1, IF($J14=4, \"Inconnu\", IF($J14=99, \"Surveillance\", F14)), 0),\"Non requis\")","v":75463},0,{"$f":"IF(INTRO!$E$41=\"Endémique\", IF($J14>1, IF($J14=4, \"Inconnu\", IF($J14=99, \"Surveillance\", SUM($N14:$P14))), 0),\"Non requis\")","v":115710},28386.30816,53224.327799999992,11330.931768,92941.56772799998,null,2,1,1,null,null,null,"Oui","Oui",null,null,null,48669,"TCHAOUDJO"]
[{"$f":"IF(INTRO!$E$33<>0,INTRO!$E$33, \" \")","v":"TOGO"},"GRAND LOME","AGOE-NYIVE",923766,{"$f":"IF(INTRO!$E$48=\"\",\"\",ROUND($D15*INTRO!$E$48,0))","v":147803},{"$f":"IF(INTRO!$E$49=\"\",\"\",ROUND($D15*INTRO!$E$49,0))","v":277130},{"$f":"IF(INTRO!$E$50=\"\",\"\",ROUND($D15*INTRO!$E$50,0))","v":461883},99,19,11,11,{"$f":"IF(INTRO!$E$37=\"Endémique\",IF($H15>0,IF($H15=4,\"Inconnu\",IF($H15=99,\"Interrompu\",$D15)),0),\"Non requis\")","v":"Non requis"},0,{"$f":"IF(INTRO!$E$41=\"Endémique\", IF($J15>1, IF($J15=4, \"Inconnu\", IF($J15=99, \"Surveillance\", E15)), 0),\"Non requis\")","v":147803},{"$f":"IF(INTRO!$E$41=\"Endémique\", IF($J15>1, IF($J15=4, \"Inconnu\", IF($J15=99, \"Surveillance\", F15)), 0),\"Non requis\")","v":277130},0,{"$f":"IF(INTRO!$E$41=\"Endémique\", IF($J15>1, IF($J15=4, \"Inconnu\", IF($J15=99, \"Surveillance\", SUM($N15:$P15))), 0),\"Non requis\")","v":424933},79974.801215999993,149952.75227999996,167621.48699999999,397549.04049599997,null,0,1,2,null,null,null,null,null,null,null,null,48713,"AGOE-NYIVE"]
[{"$f":"IF(INTRO!$E$33<>0,INTRO!$E$33, \" \")","v":"TOGO"},"GRAND LOME","GOLFE",1366433,{"$f":"IF(INTRO!$E$48=\"\",\"\",ROUND($D16*INTRO!$E$48,0))","v":218629},{"$f":"IF(INTRO!$E$49=\"\",\"\",ROUND($D16*INTRO!$E$49,0))","v":409930},{"$f":"IF(INTRO!$E$50=\"\",\"\",ROUND($D16*INTRO!$E$50,0))","v":683217},99,0,11,99,{"$f":"IF(INTRO!$E$37=\"Endémique\",IF($H16>0,IF($H16=4,\"Inconnu\",IF($H16=99,\"Interrompu\",$D16)),0),\"Non requis\")","v":"Non requis"},0,{"$f":"IF(INTRO!$E$41=\"Endémique\", IF($J16>1, IF($J16=4, \"Inconnu\", IF($J16=99, \"Surveillance\", E16)), 0),\"Non requis\")","v":218629},{"$f":"IF(INTRO!$E$41=\"Endémique\", IF($J16>1, IF($J16=4, \"Inconnu\", IF($J16=99, \"Surveillance\", F16)), 0),\"Non requis\")","v":409930},0,{"$f":"IF(INTRO!$E$41=\"Endémique\", IF($J16>1, IF($J16=4, \"Inconnu\", IF($J16=99, \"Surveillance\", SUM($N16:$P16))), 0),\"Non requis\")","v":628559},28517.449728000003,53470.218240000002,0,81987.667968000009,null,0,1,1,null,null,null,null,null,null,null,null,48684,"GOLFE (District 1, 2, 3,4 and most of 5)"]
[{"$f":"IF(INTRO!$E$33<>0,INTRO!$E$33, \" \")","v":"TOGO"},"KARA","ASSOLI",69483,{"$f":"IF(INTRO!$E$48=\"\",\"\",ROUND($D17*INTRO!$E$48,0))","v":11117},{"$f":"IF(INTRO!$E$49=\"\",\"\",ROUND($D17*INTRO!$E$49,0))","v":20845},{"$f":"IF(INTRO!$E$50=\"\",\"\",ROUND($D17*INTRO!$E$50,0))","v":34742},99,19,11,11,{"$f":"IF(INTRO!$E$37=\"Endémique\",IF($H17>0,IF($H17=4,\"Inconnu\",IF($H17=99,\"Interrompu\",$D17)),0),\"Non requis\")","v":"Non requis"},49668,{"$f":"IF(INTRO!$E$41=\"Endémique\", IF($J17>1, IF($J17=4, \"Inconnu\", IF($J17=99, \"Surveillance\", E17)), 0),\"Non requis\")","v":11117},{"$f":"IF(INTRO!$E$41=\"Endémique\", IF($J17>1, IF($J17=4, \"Inconnu\", IF($J17=99, \"Surveillance\", F17)), 0),\"Non requis\")","v":20845},0,{"$f":"IF(INTRO!$E$41=\"Endémique\", IF($J17>1, IF($J17=4, \"Inconnu\", IF($J17=99, \"Surveillance\", SUM($N17:$P17))), 0),\"Non requis\")","v":31962},7554.8732160000009,14165.387279999999,4622.6580000000004,26342.918495999998,null,2,1,2,null,null,"Oui",null,null,null,null,null,48670,"ASSOLI"]
[{"$f":"IF(INTRO!$E$33<>0,INTRO!$E$33, \" \")","v":"TOGO"},"KARA","BASSAR",159140,{"$f":"IF(INTRO!$E$48=\"\",\"\",ROUND($D18*INTRO!$E$48,0))","v":25462},{"$f":"IF(INTRO!$E$49=\"\",\"\",ROUND($D18*INTRO!$E$49,0))","v":47742},{"$f":"IF(INTRO!$E$50=\"\",\"\",ROUND($D18*INTRO!$E$50,0))","v":79570},99,19,21,11,{"$f":"IF(INTRO!$E$37=\"Endémique\",IF($H18>0,IF($H18=4,\"Inconnu\",IF($H18=99,\"Interrompu\",$D18)),0),\"Non requis\")","v":"Non requis"},115417,{"$f":"IF(INTRO!$E$41=\"Endémique\", IF($J18>1, IF($J18=4, \"Inconnu\", IF($J18=99, \"Surveillance\", E18)), 0),\"Non requis\")","v":25462},{"$f":"IF(INTRO!$E$41=\"Endémique\", IF($J18>1, IF($J18=4, \"Inconnu\", IF($J18=99, \"Surveillance\", F18)), 0),\"Non requis\")","v":47742},0,{"$f":"IF(INTRO!$E$41=\"Endémique\", IF($J18>1, IF($J18=4, \"Inconnu\", IF($J18=99, \"Surveillance\", SUM($N18:$P18))), 0),\"Non requis\")","v":73204},21649.876799999998,40593.518999999993,3388.0637999999999,65631.459599999987,null,2,1,1,null,null,"Oui","Oui","Oui",null,null,null,48671,"BASSAR"]
[{"$f":"IF(INTRO!$E$33<>0,INTRO!$E$33, \" \")","v":"TOGO"},"KARA","BINAH",88117,{"$f":"IF(INTRO!$E$48=\"\",\"\",ROUND($D19*INTRO!$E$48,0))","v":14099},{"$f":"IF(INTRO!$E$49=\"\",\"\",ROUND($D19*INTRO!$E$49,0))","v":26435},{"$f":"IF(INTRO!$E$50=\"\",\"\",ROUND($D19*INTRO!$E$50,0))","v":44059},99,19,21,11,{"$f":"IF(INTRO!$E$37=\"Endémique\",IF($H19>0,IF($H19=4,\"Inconnu\",IF($H19=99,\"Interrompu\",$D19)),0),\"Non requis\")","v":"Non requis"},56160,{"$f":"IF(INTRO!$E$41=\"Endémique\", IF($J19>1, IF($J19=4, \"Inconnu\", IF($J19=99, \"Surveillance\", E19)), 0),\"Non requis\")","v":14099},{"$f":"IF(INTRO!$E$41=\"Endémique\", IF($J19>1, IF($J19=4, \"Inconnu\", IF($J19=99, \"Surveillance\", F19)), 0),\"Non requis\")","v":26435},0,{"$f":"IF(INTRO!$E$41=\"Endémique\", IF($J19>1, IF($J19=4, \"Inconnu\", IF($J19=99, \"Surveillance\", SUM($N19:$P19))), 0),\"Non requis\")","v":40534},12693.253248000001,23799.849839999995,16463.051929199999,52956.155017199999,null,2,1,1,null,null,"Oui",null,null,null,null,null,48672,"BINAH"]
[{"$f":"IF(INTRO!$E$33<>0,INTRO!$E$33, \" \")","v":"TOGO"},"KARA","DANKPEN",194300,{"$f":"IF(INTRO!$E$48=\"\",\"\",ROUND($D20*INTRO!$E$48,0))","v":31088},{"$f":"IF(INTRO!$E$49=\"\",\"\",ROUND($D20*INTRO!$E$49,0))","v":58290},{"$f":"IF(INTRO!$E$50=\"\",\"\",ROUND($D20*INTRO!$E$50,0))","v":97150},99,19,21,11,{"$f":"IF(INTRO!$E$37=\"Endémique\",IF($H20>0,IF($H20=4,\"Inconnu\",IF($H20=99,\"Interrompu\",$D20)),0),\"Non requis\")","v":"Non requis"},167203,{"$f":"IF(INTRO!$E$41=\"Endémique\", IF($J20>1, IF($J20=4, \"Inconnu\", IF($J20=99, \"Surveillance\", E20)), 0),\"Non requis\")","v":31088},{"$f":"IF(INTRO!$E$41=\"Endémique\", IF($J20>1, IF($J20=4, \"Inconnu\", IF($J20=99, \"Surveillance\", F20)), 0),\"Non requis\")","v":58290},0,{"$f":"IF(INTRO!$E$41=\"Endémique\", IF($J20>1, IF($J20=4, \"Inconnu\", IF($J20=99, \"Surveillance\", SUM($N20:$P20))), 0),\"Non requis\")","v":89378},10353.108479999999,19412.078399999999,0,29765.186879999997,null,2,1,1,null,null,"Oui",null,null,null,null,null,48673,"DANKPEN"]
[{"$f":"IF(INTRO!$E$33<>0,INTRO!$E$33, \" \")","v":"TOGO"},"KARA","DOUFELGOU",88711,{"$f":"IF(INTRO!$E$48=\"\",\"\",ROUND($D21*INTRO!$E$48,0))","v":14194},{"$f":"IF(INTRO!$E$49=\"\",\"\",ROUND($D21*INTRO!$E$49,0))","v":26613},{"$f":"IF(INTRO!$E$50=\"\",\"\",ROUND($D21*INTRO!$E$50,0))","v":44356},99,19,21,11,{"$f":"IF(INTRO!$E$37=\"Endémique\",IF($H21>0,IF($H21=4,\"Inconnu\",IF($H21=99,\"Interrompu\",$D21)),0),\"Non requis\")","v":"Non requis"},81793,{"$f":"IF(INTRO!$E$41=\"Endémique\", IF($J21>1, IF($J21=4, \"Inconnu\", IF($J21=99, \"Surveillance\", E21)), 0),\"Non requis\")","v":14194},{"$f":"IF(INTRO!$E$41=\"Endémique\", IF($J21>1, IF($J21=4, \"Inconnu\", IF($J21=99, \"Surveillance\", F21)), 0),\"Non requis\")","v":26613},0,{"$f":"IF(INTRO!$E$41=\"Endémique\", IF($J21>1, IF($J21=4, \"Inconnu\", IF($J21=99, \"Surveillance\", SUM($N21:$P21))), 0),\"Non requis\")","v":40807},14915.749056000001,27967.029480000001,14506.472594399998,57389.251130399993,null,2,1,2,null,null,"Oui",null,null,null,null,null,48674,"DOULFELGOU"]
[{"$f":"IF(INTRO!$E$33<>0,INTRO!$E$33, \" \")","v":"TOGO"},"KARA","KERAN",134675,{"$f":"IF(INTRO!$E$48=\"\",\"\",ROUND($D22*INTRO!$E$48,0))","v":21548},{"$f":"IF(INTRO!$E$49=\"\",\"\",ROUND($D22*INTRO!$E$49,0))","v":40403},{"$f":"IF(INTRO!$E$50=\"\",\"\",ROUND($D22*INTRO!$E$50,0))","v":67338},99,19,11,11,{"$f":"IF(INTRO!$E$37=\"Endémique\",IF($H22>0,IF($H22=4,\"Inconnu\",IF($H22=99,\"Interrompu\",$D22)),0),\"Non requis\")","v":"Non requis"},126017,{"$f":"IF(INTRO!$E$41=\"Endémique\", IF($J22>1, IF($J22=4, \"Inconnu\", IF($J22=99, \"Surveillance\", E22)), 0),\"Non requis\")","v":21548},{"$f":"IF(INTRO!$E$41=\"Endémique\", IF($J22>1, IF($J22=4, \"Inconnu\", IF($J22=99, \"Surveillance\", F22)), 0),\"Non requis\")","v":40403},0,{"$f":"IF(INTRO!$E$41=\"Endémique\", IF($J22>1, IF($J22=4, \"Inconnu\", IF($J22=99, \"Surveillance\", SUM($N22:$P22))), 0),\"Non requis\")","v":61951},21716.681664,40718.778120000003,18515.372218800003,80950.832002800016,null,2,1,1,null,null,"Oui",null,null,null,null,null,48675,"KERAN"]
[{"$f":"IF(INTRO!$E$33<>0,INTRO!$E$33, \" \")","v":"TOGO"},"KARA","KOZAH",296940,{"$f":"IF(INTRO!$E$48=\"\",\"\",ROUND($D23*INTRO!$E$48,0))","v":47510},{"$f":"IF(INTRO!$E$49=\"\",\"\",ROUND($D23*INTRO!$E$49,0))","v":89082},{"$f":"IF(INTRO!$E$50=\"\",\"\",ROUND($D23*INTRO!$E$50,0))","v":148470},99,19,11,11,{"$f":"IF(INTRO!$E$37=\"Endémique\",IF($H23>0,IF($H23=4,\"Inconnu\",IF($H23=99,\"Interrompu\",$D23)),0),\"Non requis\")","v":"Non requis"},174818,{"$f":"IF(INTRO!$E$41=\"Endémique\", IF($J23>1, IF($J23=4, \"Inconnu\", IF($J23=99, \"Surveillance\", E23)), 0),\"Non requis\")","v":47510},{"$f":"IF(INTRO!$E$41=\"Endémique\", IF($J23>1, IF($J23=4, \"Inconnu\", IF($J23=99, \"Surveillance\", F23)), 0),\"Non requis\")","v":89082},0,{"$f":"IF(INTRO!$E$41=\"Endémique\", IF($J23>1, IF($J23=4, \"Inconnu\", IF($J23=99, \"Surveillance\", SUM($N23:$P23))), 0),\"Non requis\")","v":136592},48809.180352000003,91517.213160000014,47678.535795600001,188004.92930760002,null,2,1,2,null,null,"Oui",null,null,null,null,null,48676,"KOZAH"]
[{"$f":"IF(INTRO!$E$33<>0,INTRO!$E$33, \" \")","v":"TOGO"},"MARITIME","AVE",116389,{"$f":"IF(INTRO!$E$48=\"\",\"\",ROUND($D24*INTRO!$E$48,0))","v":18622},{"$f":"IF(INTRO!$E$49=\"\",\"\",ROUND($D24*INTRO!$E$49,0))","v":34917},{"$f":"IF(INTRO!$E$50=\"\",\"\",ROUND($D24*INTRO!$E$50,0))","v":58195},99,99,11,11,{"$f":"IF(INTRO!$E$37=\"Endémique\",IF($H24>0,IF($H24=4,\"Inconnu\",IF($H24=99,\"Interrompu\",$D24)),0),\"Non requis\")","v":"Non requis"},106722,{"$f":"IF(INTRO!$E$41=\"Endémique\", IF($J24>1, IF($J24=4, \"Inconnu\", IF($J24=99, \"Surveillance\", E24)), 0),\"Non requis\")","v":18622},{"$f":"IF(INTRO!$E$41=\"Endémique\", IF($J24>1, IF($J24=4, \"Inconnu\", IF($J24=99, \"Surveillance\", F24)), 0),\"Non requis\")","v":34917},0,{"$f":"IF(INTRO!$E$41=\"Endémique\", IF($J24>1, IF($J24=4, \"Inconnu\", IF($J24=99, \"Surveillance\", SUM($N24:$P24))), 0),\"Non requis\")","v":53539},21375.417407999998,40078.907639999998,6212.9531352000013,67667.278183200004,null,0,1,1,null,null,null,null,null,null,null,null,48677,"AVE"]
[{"$f":"IF(INTRO!$E$33<>0,INTRO!$E$33, \" \")","v":"TOGO"},"MARITIME","BAS MONO",99274,{"$f":"IF(INTRO!$E$48=\"\",\"\",ROUND($D25*INTRO!$E$48,0))","v":15884},{"$f":"IF(INTRO!$E$49=\"\",\"\",ROUND($D25*INTRO!$E$49,0))","v":29782},{"$f":"IF(INTRO!$E$50=\"\",\"\",ROUND($D25*INTRO!$E$50,0))","v":49637},99,99,21,11,{"$f":"IF(INTRO!$E$37=\"Endémique\",IF($H25>0,IF($H25=4,\"Inconnu\",IF($H25=99,\"Interrompu\",$D25)),0),\"Non requis\")","v":"Non requis"},31284,{"$f":"IF(INTRO!$E$41=\"Endémique\", IF($J25>1, IF($J25=4, \"Inconnu\", IF($J25=99, \"Surveillance\", E25)), 0),\"Non requis\")","v":15884},{"$f":"IF(INTRO!$E$41=\"Endémique\", IF($J25>1, IF($J25=4, \"Inconnu\", IF($J25=99, \"Surveillance\", F25)), 0),\"Non requis\")","v":29782},0,{"$f":"IF(INTRO!$E$41=\"Endémique\", IF($J25>1, IF($J25=4, \"Inconnu\", IF($J25=99, \"Surveillance\", SUM($N25:$P25))), 0),\"Non requis\")","v":45666},11727.215424000004,21988.528920000001,0,33715.744344000006,null,0,1,1,null,null,null,null,null,null,null,null,48678,"BAS MONO"]
[{"$f":"IF(INTRO!$E$33<>0,INTRO!$E$33, \" \")","v":"TOGO"},"MARITIME","LACS",252472,{"$f":"IF(INTRO!$E$48=\"\",\"\",ROUND($D26*INTRO!$E$48,0))","v":40396},{"$f":"IF(INTRO!$E$49=\"\",\"\",ROUND($D26*INTRO!$E$49,0))","v":75742},{"$f":"IF(INTRO!$E$50=\"\",\"\",ROUND($D26*INTRO!$E$50,0))","v":126236},99,99,21,99,{"$f":"IF(INTRO!$E$37=\"Endémique\",IF($H26>0,IF($H26=4,\"Inconnu\",IF($H26=99,\"Interrompu\",$D26)),0),\"Non requis\")","v":"Non requis"},0,{"$f":"IF(INTRO!$E$41=\"Endémique\", IF($J26>1, IF($J26=4, \"Inconnu\", IF($J26=99, \"Surveillance\", E26)), 0),\"Non requis\")","v":40396},{"$f":"IF(INTRO!$E$41=\"Endémique\", IF($J26>1, IF($J26=4, \"Inconnu\", IF($J26=99, \"Surveillance\", F26)), 0),\"Non requis\")","v":75742},0,{"$f":"IF(INTRO!$E$41=\"Endémique\", IF($J26>1, IF($J26=4, \"Inconnu\", IF($J26=99, \"Surveillance\", SUM($N26:$P26))), 0),\"Non requis\")","v":116138},26502.608447999995,49692.39084,28630.141799999998,104825.14108799999,null,0,1,2,null,null,null,null,null,null,null,null,48680,"LACS"]
[{"$f":"IF(INTRO!$E$33<>0,INTRO!$E$33, \" \")","v":"TOGO"},"MARITIME","VO",234852,{"$f":"IF(INTRO!$E$48=\"\",\"\",ROUND($D27*INTRO!$E$48,0))","v":37576},{"$f":"IF(INTRO!$E$49=\"\",\"\",ROUND($D27*INTRO!$E$49,0))","v":70456},{"$f":"IF(INTRO!$E$50=\"\",\"\",ROUND($D27*INTRO!$E$50,0))","v":117426},99,99,22,11,{"$f":"IF(INTRO!$E$37=\"Endémique\",IF($H27>0,IF($H27=4,\"Inconnu\",IF($H27=99,\"Interrompu\",$D27)),0),\"Non requis\")","v":"Non requis"},0,{"$f":"IF(INTRO!$E$41=\"Endémique\", IF($J27>1, IF($J27=4, \"Inconnu\", IF($J27=99, \"Surveillance\", E27)), 0),\"Non requis\")","v":37576},{"$f":"IF(INTRO!$E$41=\"Endémique\", IF($J27>1, IF($J27=4, \"Inconnu\", IF($J27=99, \"Surveillance\", F27)), 0),\"Non requis\")","v":70456},0,{"$f":"IF(INTRO!$E$41=\"Endémique\", IF($J27>1, IF($J27=4, \"Inconnu\", IF($J27=99, \"Surveillance\", SUM($N27:$P27))), 0),\"Non requis\")","v":108032},30137.385408000002,56507.59764,23431.065599999998,110076.048648,null,0,1,2,null,null,null,null,null,null,null,null,48681,"VO"]
[{"$f":"IF(INTRO!$E$33<>0,INTRO!$E$33, \" \")","v":"TOGO"},"MARITIME","YOTO",182987,{"$f":"IF(INTRO!$E$48=\"\",\"\",ROUND($D28*INTRO!$E$48,0))","v":29278},{"$f":"IF(INTRO!$E$49=\"\",\"\",ROUND($D28*INTRO!$E$49,0))","v":54896},{"$f":"IF(INTRO!$E$50=\"\",\"\",ROUND($D28*INTRO!$E$50,0))","v":91494},99,19,21,11,{"$f":"IF(INTRO!$E$37=\"Endémique\",IF($H28>0,IF($H28=4,\"Inconnu\",IF($H28=99,\"Interrompu\",$D28)),0),\"Non requis\")","v":"Non requis"},179780,{"$f":"IF(INTRO!$E$41=\"Endémique\", IF($J28>1, IF($J28=4, \"Inconnu\", IF($J28=99, \"Surveillance\", E28)), 0),\"Non requis\")","v":29278},{"$f":"IF(INTRO!$E$41=\"Endémique\", IF($J28>1, IF($J28=4, \"Inconnu\", IF($J28=99, \"Surveillance\", F28)), 0),\"Non requis\")","v":54896},{"$f":"IF(INTRO!$E$41=\"Endémique\", IF($J28>1, IF($J28=4, \"Inconnu\", IF($J28=99, \"Surveillance\", ROUND(D28*INTRO!$E$51,0))), 0),\"Non requis\")","v":41538},{"$f":"IF(INTRO!$E$41=\"Endémique\", IF($J28>1, IF($J28=4, \"Inconnu\", IF($J28=99, \"Surveillance\", SUM($N28:$P28))), 0),\"Non requis\")","v":125712},35020.064063999998,65662.620119999992,1020.1625160000001,101702.84669999998,null,1,2,1,null,null,null,null,null,null,null,null,48682,"YOTO"]
[{"$f":"IF(INTRO!$E$33<>0,INTRO!$E$33, \" \")","v":"TOGO"},"MARITIME","ZIO",523298,{"$f":"IF(INTRO!$E$48=\"\",\"\",ROUND($D29*INTRO!$E$48,0))","v":83728},{"$f":"IF(INTRO!$E$49=\"\",\"\",ROUND($D29*INTRO!$E$49,0))","v":156989},{"$f":"IF(INTRO!$E$50=\"\",\"\",ROUND($D29*INTRO!$E$50,0))","v":261649},99,99,11,11,{"$f":"IF(INTRO!$E$37=\"Endémique\",IF($H29>0,IF($H29=4,\"Inconnu\",IF($H29=99,\"Interrompu\",$D29)),0),\"Non requis\")","v":"Non requis"},294458,{"$f":"IF(INTRO!$E$41=\"Endémique\", IF($J29>1, IF($J29=4, \"Inconnu\", IF($J29=99, \"Surveillance\", E29)), 0),\"Non requis\")","v":83728},{"$f":"IF(INTRO!$E$41=\"Endémique\", IF($J29>1, IF($J29=4, \"Inconnu\", IF($J29=99, \"Surveillance\", F29)), 0),\"Non requis\")","v":156989},0,{"$f":"IF(INTRO!$E$41=\"Endémique\", IF($J29>1, IF($J29=4, \"Inconnu\", IF($J29=99, \"Surveillance\", SUM($N29:$P29))), 0),\"Non requis\")","v":240717},63435.331967999984,118941.24743999998,29773.722600000001,212150.30200799997,null,0,1,2,null,null,null,null,null,null,null,null,48683,"ZIO"]
[{"$f":"IF(INTRO!$E$33<>0,INTRO!$E$33, \" \")","v":"TOGO"},"PLATEAUX","AGOU",89785,{"$f":"IF(INTRO!$E$48=\"\",\"\",ROUND($D30*INTRO!$E$48,0))","v":14366},{"$f":"IF(INTRO!$E$49=\"\",\"\",ROUND($D30*INTRO!$E$49,0))","v":26936},{"$f":"IF(INTRO!$E$50=\"\",\"\",ROUND($D30*INTRO!$E$50,0))","v":44893},99,19,11,11,{"$f":"IF(INTRO!$E$37=\"Endémique\",IF($H30>0,IF($H30=4,\"Inconnu\",IF($H30=99,\"Interrompu\",$D30)),0),\"Non requis\")","v":"Non requis"},88598,{"$f":"IF(INTRO!$E$41=\"Endémique\", IF($J30>1, IF($J30=4, \"Inconnu\", IF($J30=99, \"Surveillance\", E30)), 0),\"Non requis\")","v":14366},{"$f":"IF(INTRO!$E$41=\"Endémique\", IF($J30>1, IF($J30=4, \"Inconnu\", IF($J30=99, \"Surveillance\", F30)), 0),\"Non requis\")","v":26936},0,{"$f":"IF(INTRO!$E$41=\"Endémique\", IF($J30>1, IF($J30=4, \"Inconnu\", IF($J30=99, \"Surveillance\", SUM($N30:$P30))), 0),\"Non requis\")","v":41302},11897.146462924798,22307.149617983996,10147.517745119998,44351.813826028796,null,1,1,2,null,null,null,"Oui","Oui",null,null,null,48689,"AGOU"]
[{"$f":"IF(INTRO!$E$33<>0,INTRO!$E$33, \" \")","v":"TOGO"},"PLATEAUX","AKEBOU",77265,{"$f":"IF(INTRO!$E$48=\"\",\"\",ROUND($D31*INTRO!$E$48,0))","v":12362},{"$f":"IF(INTRO!$E$49=\"\",\"\",ROUND($D31*INTRO!$E$49,0))","v":23180},{"$f":"IF(INTRO!$E$50=\"\",\"\",ROUND($D31*INTRO!$E$50,0))","v":38633},99,19,11,21,{"$f":"IF(INTRO!$E$37=\"Endémique\",IF($H31>0,IF($H31=4,\"Inconnu\",IF($H31=99,\"Interrompu\",$D31)),0),\"Non requis\")","v":"Non requis"},76043,{"$f":"IF(INTRO!$E$41=\"Endémique\", IF($J31>1, IF($J31=4, \"Inconnu\", IF($J31=99, \"Surveillance\", E31)), 0),\"Non requis\")","v":12362},{"$f":"IF(INTRO!$E$41=\"Endémique\", IF($J31>1, IF($J31=4, \"Inconnu\", IF($J31=99, \"Surveillance\", F31)), 0),\"Non requis\")","v":23180},0,{"$f":"IF(INTRO!$E$41=\"Endémique\", IF($J31>1, IF($J31=4, \"Inconnu\", IF($J31=99, \"Surveillance\", SUM($N31:$P31))), 0),\"Non requis\")","v":35542},10892.143303372799,20422.768693823993,12651.067457279998,43965.979454476794,null,1,1,1,null,null,null,"Oui","Oui",null,null,null,48691,"AKEBOU"]
[{"$f":"IF(INTRO!$E$33<>0,INTRO!$E$33, \" \")","v":"TOGO"},"PLATEAUX","AMOU",119484,{"$f":"IF(INTRO!$E$48=\"\",\"\",ROUND($D32*INTRO!$E$48,0))","v":19117},{"$f":"IF(INTRO!$E$49=\"\",\"\",ROUND($D32*INTRO!$E$49,0))","v":35845},{"$f":"IF(INTRO!$E$50=\"\",\"\",ROUND($D32*INTRO!$E$50,0))","v":59742},99,19,21,21,{"$f":"IF(INTRO!$E$37=\"Endémique\",IF($H32>0,IF($H32=4,\"Inconnu\",IF($H32=99,\"Interrompu\",$D32)),0),\"Non requis\")","v":"Non requis"},132297,{"$f":"IF(INTRO!$E$41=\"Endémique\", IF($J32>1, IF($J32=4, \"Inconnu\", IF($J32=99, \"Surveillance\", E32)), 0),\"Non requis\")","v":19117},{"$f":"IF(INTRO!$E$41=\"Endémique\", IF($J32>1, IF($J32=4, \"Inconnu\", IF($J32=99, \"Surveillance\", F32)), 0),\"Non requis\")","v":35845},0,{"$f":"IF(INTRO!$E$41=\"Endémique\", IF($J32>1, IF($J32=4, \"Inconnu\", IF($J32=99, \"Surveillance\", SUM($N32:$P32))), 0),\"Non requis\")","v":54962},19538.711594035198,36635.084238815994,22549.863782880002,78723.659615731187,null,2,1,2,null,null,null,"Oui","Oui",null,null,null,48690,"AMOU"]
[{"$f":"IF(INTRO!$E$33<>0,INTRO!$E$33, \" \")","v":"TOGO"},"PLATEAUX","ANIE",188541,{"$f":"IF(INTRO!$E$48=\"\",\"\",ROUND($D33*INTRO!$E$48,0))","v":30167},{"$f":"IF(INTRO!$E$49=\"\",\"\",ROUND($D33*INTRO!$E$49,0))","v":56562},{"$f":"IF(INTRO!$E$50=\"\",\"\",ROUND($D33*INTRO!$E$50,0))","v":94271},99,19,22,11,{"$f":"IF(INTRO!$E$37=\"Endémique\",IF($H33>0,IF($H33=4,\"Inconnu\",IF($H33=99,\"Interrompu\",$D33)),0),\"Non requis\")","v":"Non requis"},130239,{"$f":"IF(INTRO!$E$41=\"Endémique\", IF($J33>1, IF($J33=4, \"Inconnu\", IF($J33=99, \"Surveillance\", E33)), 0),\"Non requis\")","v":30167},{"$f":"IF(INTRO!$E$41=\"Endémique\", IF($J33>1, IF($J33=4, \"Inconnu\", IF($J33=99, \"Surveillance\", F33)), 0),\"Non requis\")","v":56562},0,{"$f":"IF(INTRO!$E$41=\"Endémique\", IF($J33>1, IF($J33=4, \"Inconnu\", IF($J33=99, \"Surveillance\", SUM($N33:$P33))), 0),\"Non requis\")","v":86729},28044.815516928007,52584.029094239995,26646.916826879999,107275.76143804799,null,1,1,1,null,null,null,null,null,null,null,null,48692,"ANIE"]
[{"$f":"IF(INTRO!$E$33<>0,INTRO!$E$33, \" \")","v":"TOGO"},"PLATEAUX","DANYI",42113,{"$f":"IF(INTRO!$E$48=\"\",\"\",ROUND($D34*INTRO!$E$48,0))","v":6738},{"$f":"IF(INTRO!$E$49=\"\",\"\",ROUND($D34*INTRO!$E$49,0))","v":12634},{"$f":"IF(INTRO!$E$50=\"\",\"\",ROUND($D34*INTRO!$E$50,0))","v":21057},99,19,11,21,{"$f":"IF(INTRO!$E$37=\"Endémique\",IF($H34>0,IF($H34=4,\"Inconnu\",IF($H34=99,\"Interrompu\",$D34)),0),\"Non requis\")","v":"Non requis"},40188,0,0,0,{"$f":"IF(INTRO!$E$41=\"Endémique\", IF($J34>1, IF($J34=4, \"Inconnu\", IF($J34=99, \"Surveillance\", SUM($N34:$P34))), 0),\"Non requis\")","v":0},7766.0101532159988,14561.269037279999,0,22327.279190495996,null,2,0,0,null,null,null,"Oui","Oui",null,null,null,48693,"DANYI"]
[{"$f":"IF(INTRO!$E$33<>0,INTRO!$E$33, \" \")","v":"TOGO"},"PLATEAUX","EST-MONO",172113,{"$f":"IF(INTRO!$E$48=\"\",\"\",ROUND($D35*INTRO!$E$48,0))","v":27538},{"$f":"IF(INTRO!$E$49=\"\",\"\",ROUND($D35*INTRO!$E$49,0))","v":51634},{"$f":"IF(INTRO!$E$50=\"\",\"\",ROUND($D35*INTRO!$E$50,0))","v":86057},99,19,21,99,{"$f":"IF(INTRO!$E$37=\"Endémique\",IF($H35>0,IF($H35=4,\"Inconnu\",IF($H35=99,\"Interrompu\",$D35)),0),\"Non requis\")","v":"Non requis"},144393,{"$f":"IF(INTRO!$E$41=\"Endémique\", IF($J35>1, IF($J35=4, \"Inconnu\", IF($J35=99, \"Surveillance\", E35)), 0),\"Non requis\")","v":27538},{"$f":"IF(INTRO!$E$41=\"Endémique\", IF($J35>1, IF($J35=4, \"Inconnu\", IF($J35=99, \"Surveillance\", F35)), 0),\"Non requis\")","v":51634},{"$f":"IF(INTRO!$E$41=\"Endémique\", IF($J35>1, IF($J35=4, \"Inconnu\", IF($J35=99, \"Surveillance\", ROUND(D35*INTRO!$E$51,0))), 0),\"Non requis\")","v":39070},{"$f":"IF(INTRO!$E$41=\"Endémique\", IF($J35>1, IF($J35=4, \"Inconnu\", IF($J35=99, \"Surveillance\", SUM($N35:$P35))), 0),\"Non requis\")","v":118242},19957.743951667195,35369.134369631996,0,55326.878321299191,null,1,2,1,null,null,null,null,null,null,null,null,48694,"EST MONO"]
[{"$f":"IF(INTRO!$E$33<>0,INTRO!$E$33, \" \")","v":"TOGO"},"PLATEAUX","HAHO",319292,{"$f":"IF(INTRO!$E$48=\"\",\"\",ROUND($D36*INTRO!$E$48,0))","v":51087},{"$f":"IF(INTRO!$E$49=\"\",\"\",ROUND($D36*INTRO!$E$49,0))","v":95788},{"$f":"IF(INTRO!$E$50=\"\",\"\",ROUND($D36*INTRO!$E$50,0))","v":159646},99,19,22,21,{"$f":"IF(INTRO!$E$37=\"Endémique\",IF($H36>0,IF($H36=4,\"Inconnu\",IF($H36=99,\"Interrompu\",$D36)),0),\"Non requis\")","v":"Non requis"},259934,{"$f":"IF(INTRO!$E$41=\"Endémique\", IF($J36>1, IF($J36=4, \"Inconnu\", IF($J36=99, \"Surveillance\", E36)), 0),\"Non requis\")","v":51087},{"$f":"IF(INTRO!$E$41=\"Endémique\", IF($J36>1, IF($J36=4, \"Inconnu\", IF($J36=99, \"Surveillance\", F36)), 0),\"Non requis\")","v":95788},{"$f":"IF(INTRO!$E$41=\"Endémique\", IF($J36>1, IF($J36=4, \"Inconnu\", IF($J36=99, \"Surveillance\", ROUND(D36*INTRO!$E$51,0))), 0),\"Non requis\")","v":72479},{"$f":"IF(INTRO!$E$41=\"Endémique\", IF($J36>1, IF($J36=4, \"Inconnu\", IF($J36=99, \"Surveillance\", SUM($N36:$P36))), 0),\"Non requis\")","v":219354},44195.519815372798,82866.599653823971,56321.46363664799,183383.58310584477,null,2,2,1,null,null,null,"Oui","Oui",null,null,null,48695,"HAHO"]
[{"$f":"IF(INTRO!$E$33<>0,INTRO!$E$33, \" \")","v":"TOGO"},"PLATEAUX","KLOTO",152779,{"$f":"IF(INTRO!$E$48=\"\",\"\",ROUND($D37*INTRO!$E$48,0))","v":24445},{"$f":"IF(INTRO!$E$49=\"\",\"\",ROUND($D37*INTRO!$E$49,0))","v":45834},{"$f":"IF(INTRO!$E$50=\"\",\"\",ROUND($D37*INTRO!$E$50,0))","v":76390},99,19,11,21,{"$f":"IF(INTRO!$E$37=\"Endémique\",IF($H37>0,IF($H37=4,\"Inconnu\",IF($H37=99,\"Interrompu\",$D37)),0),\"Non requis\")","v":"Non requis"},62911,{"$f":"IF(INTRO!$E$41=\"Endémique\", IF($J37>1, IF($J37=4, \"Inconnu\", IF($J37=99, \"Surveillance\", E37)), 0),\"Non requis\")","v":24445},{"$f":"IF(INTRO!$E$41=\"Endémique\", IF($J37>1, IF($J37=4, \"Inconnu\", IF($J37=99, \"Surveillance\", F37)), 0),\"Non requis\")","v":45834},0,{"$f":"IF(INTRO!$E$41=\"Endémique\", IF($J37>1, IF($J37=4, \"Inconnu\", IF($J37=99, \"Surveillance\", SUM($N37:$P37))), 0),\"Non requis\")","v":70279},21627.802893311997,40552.130424959985,1946.7436044873598,64126.676922759347,null,1,1,1,null,null,null,"Oui","Oui",null,null,null,48696,"KLOTO"]
[{"$f":"IF(INTRO!$E$33<>0,INTRO!$E$33, \" \")","v":"TOGO"},"PLATEAUX","KPELE",84705,{"$f":"IF(INTRO!$E$48=\"\",\"\",ROUND($D38*INTRO!$E$48,0))","v":13553},{"$f":"IF(INTRO!$E$49=\"\",\"\",ROUND($D38*INTRO!$E$49,0))","v":25412},{"$f":"IF(INTRO!$E$50=\"\",\"\",ROUND($D38*INTRO!$E$50,0))","v":42353},99,19,21,11,{"$f":"IF(INTRO!$E$37=\"Endémique\",IF($H38>0,IF($H38=4,\"Inconnu\",IF($H38=99,\"Interrompu\",$D38)),0),\"Non requis\")","v":"Non requis"},70989,{"$f":"IF(INTRO!$E$41=\"Endémique\", IF($J38>1, IF($J38=4, \"Inconnu\", IF($J38=99, \"Surveillance\", E38)), 0),\"Non requis\")","v":13553},{"$f":"IF(INTRO!$E$41=\"Endémique\", IF($J38>1, IF($J38=4, \"Inconnu\", IF($J38=99, \"Surveillance\", F38)), 0),\"Non requis\")","v":25412},0,{"$f":"IF(INTRO!$E$41=\"Endémique\", IF($J38>1, IF($J38=4, \"Inconnu\", IF($J38=99, \"Surveillance\", SUM($N38:$P38))), 0),\"Non requis\")","v":38965},10644.602256691198,19958.629231295996,4599.2384524799991,35202.469940467192,null,1,1,2,null,null,null,"Oui","Oui",null,null,null,48697,"KPELE"]
[{"$f":"IF(INTRO!$E$33<>0,INTRO!$E$33, \" \")","v":"TOGO"},"PLATEAUX","MOYEN-MONO",94717,{"$f":"IF(INTRO!$E$48=\"\",\"\",ROUND($D39*INTRO!$E$48,0))","v":15155},{"$f":"IF(INTRO!$E$49=\"\",\"\",ROUND($D39*INTRO!$E$49,0))","v":28415},{"$f":"IF(INTRO!$E$50=\"\",\"\",ROUND($D39*INTRO!$E$50,0))","v":47359},99,19,11,11,{"$f":"IF(INTRO!$E$37=\"Endémique\",IF($H39>0,IF($H39=4,\"Inconnu\",IF($H39=99,\"Interrompu\",$D39)),0),\"Non requis\")","v":"Non requis"},63487,{"$f":"IF(INTRO!$E$41=\"Endémique\", IF($J39>1, IF($J39=4, \"Inconnu\", IF($J39=99, \"Surveillance\", E39)), 0),\"Non requis\")","v":15155},{"$f":"IF(INTRO!$E$41=\"Endémique\", IF($J39>1, IF($J39=4, \"Inconnu\", IF($J39=99, \"Surveillance\", F39)), 0),\"Non requis\")","v":28415},0,{"$f":"IF(INTRO!$E$41=\"Endémique\", IF($J39>1, IF($J39=4, \"Inconnu\", IF($J39=99, \"Surveillance\", SUM($N39:$P39))), 0),\"Non requis\")","v":43570},17123.162892595199,32105.930423616002,18102.387552479999,67331.4808686912,null,1,1,2,null,null,null,"Oui","Oui",null,null,null,48698,"MOYEN MONO"]
[{"$f":"IF(INTRO!$E$33<>0,INTRO!$E$33, \" \")","v":"TOGO"},"PLATEAUX","OGOU",265261,{"$f":"IF(INTRO!$E$48=\"\",\"\",ROUND($D40*INTRO!$E$48,0))","v":42442},{"$f":"IF(INTRO!$E$49=\"\",\"\",ROUND($D40*INTRO!$E$49,0))","v":79578},{"$f":"IF(INTRO!$E$50=\"\",\"\",ROUND($D40*INTRO!$E$50,0))","v":132631},99,19,22,11,{"$f":"IF(INTRO!$E$37=\"Endémique\",IF($H40>0,IF($H40=4,\"Inconnu\",IF($H40=99,\"Interrompu\",$D40)),0),\"Non requis\")","v":"Non requis"},140103,{"$f":"IF(INTRO!$E$41=\"Endémique\", IF($J40>1, IF($J40=4, \"Inconnu\", IF($J40=99, \"Surveillance\", E40)), 0),\"Non requis\")","v":42442},{"$f":"IF(INTRO!$E$41=\"Endémique\", IF($J40>1, IF($J40=4, \"Inconnu\", IF($J40=99, \"Surveillance\", F40)), 0),\"Non requis\")","v":79578},{"$f":"IF(INTRO!$E$41=\"Endémique\", IF($J40>1, IF($J40=4, \"Inconnu\", IF($J40=99, \"Surveillance\", ROUND(D40*INTRO!$E$51,0))), 0),\"Non requis\")","v":60214},{"$f":"IF(INTRO!$E$41=\"Endémique\", IF($J40>1, IF($J40=4, \"Inconnu\", IF($J40=99, \"Surveillance\", SUM($N40:$P40))), 0),\"Non requis\")","v":182234},38001.260408831993,71252.363266559987,75443.740747200005,184697.36442259199,null,2,2,2,null,null,null,null,null,null,null,null,48699,"OGOU"]
[{"$f":"IF(INTRO!$E$33<>0,INTRO!$E$33, \" \")","v":"TOGO"},"PLATEAUX","WAWA",106013,{"$f":"IF(INTRO!$E$48=\"\",\"\",ROUND($D41*INTRO!$E$48,0))","v":16962},{"$f":"IF(INTRO!$E$49=\"\",\"\",ROUND($D41*INTRO!$E$49,0))","v":31804},{"$f":"IF(INTRO!$E$50=\"\",\"\",ROUND($D41*INTRO!$E$50,0))","v":53007},99,19,11,21,{"$f":"IF(INTRO!$E$37=\"Endémique\",IF($H41>0,IF($H41=4,\"Inconnu\",IF($H41=99,\"Interrompu\",$D41)),0),\"Non requis\")","v":"Non requis"},108755,{"$f":"IF(INTRO!$E$41=\"Endémique\", IF($J41>1, IF($J41=4, \"Inconnu\", IF($J41=99, \"Surveillance\", E41)), 0),\"Non requis\")","v":16962},{"$f":"IF(INTRO!$E$41=\"Endémique\", IF($J41>1, IF($J41=4, \"Inconnu\", IF($J41=99, \"Surveillance\", F41)), 0),\"Non requis\")","v":31804},0,{"$f":"IF(INTRO!$E$41=\"Endémique\", IF($J41>1, IF($J41=4, \"Inconnu\", IF($J41=99, \"Surveillance\", SUM($N41:$P41))), 0),\"Non requis\")","v":48766},14321.800897689598,26853.376683167997,10647.0683928,51822.245973657591,null,1,1,1,null,null,null,"Oui","Oui",null,null,null,48700,"WAWA"]
[{"$f":"IF(INTRO!$E$33<>0,INTRO!$E$33, \" \")","v":"TOGO"},"SAVANES","CINKASSE",134959,{"$f":"IF(INTRO!$E$48=\"\",\"\",ROUND($D42*INTRO!$E$48,0))","v":21593},{"$f":"IF(INTRO!$E$49=\"\",\"\",ROUND($D42*INTRO!$E$49,0))","v":40488},{"$f":"IF(INTRO!$E$50=\"\",\"\",ROUND($D42*INTRO!$E$50,0))","v":67480},99,19,11,11,{"$f":"IF(INTRO!$E$37=\"Endémique\",IF($H42>0,IF($H42=4,\"Inconnu\",IF($H42=99,\"Interrompu\",$D42)),0),\"Non requis\")","v":"Non requis"},74611,{"$f":"IF(INTRO!$E$41=\"Endémique\", IF($J42>1, IF($J42=4, \"Inconnu\", IF($J42=99, \"Surveillance\", E42)), 0),\"Non requis\")","v":21593},{"$f":"IF(INTRO!$E$41=\"Endémique\", IF($J42>1, IF($J42=4, \"Inconnu\", IF($J42=99, \"Surveillance\", F42)), 0),\"Non requis\")","v":40488},0,{"$f":"IF(INTRO!$E$41=\"Endémique\", IF($J42>1, IF($J42=4, \"Inconnu\", IF($J42=99, \"Surveillance\", SUM($N42:$P42))), 0),\"Non requis\")","v":62081},15953.783436288,29913.343943040003,23698.318993200002,69565.446372528007,null,2,1,1,null,null,null,null,null,null,null,null,48701,"CINKASSE"]
[{"$f":"IF(INTRO!$E$33<>0,INTRO!$E$33, \" \")","v":"TOGO"},"SAVANES","KPENDJAL",92476,{"$f":"IF(INTRO!$E$48=\"\",\"\",ROUND($D43*INTRO!$E$48,0))","v":14796},{"$f":"IF(INTRO!$E$49=\"\",\"\",ROUND($D43*INTRO!$E$49,0))","v":27743},{"$f":"IF(INTRO!$E$50=\"\",\"\",ROUND($D43*INTRO!$E$50,0))","v":46238},99,19,11,21,{"$f":"IF(INTRO!$E$37=\"Endémique\",IF($H43>0,IF($H43=4,\"Inconnu\",IF($H43=99,\"Interrompu\",$D43)),0),\"Non requis\")","v":"Non requis"},87256,{"$f":"IF(INTRO!$E$41=\"Endémique\", IF($J43>1, IF($J43=4, \"Inconnu\", IF($J43=99, \"Surveillance\", E43)), 0),\"Non requis\")","v":14796},{"$f":"IF(INTRO!$E$41=\"Endémique\", IF($J43>1, IF($J43=4, \"Inconnu\", IF($J43=99, \"Surveillance\", F43)), 0),\"Non requis\")","v":27743},0,{"$f":"IF(INTRO!$E$41=\"Endémique\", IF($J43>1, IF($J43=4, \"Inconnu\", IF($J43=99, \"Surveillance\", SUM($N43:$P43))), 0),\"Non requis\")","v":42539},11870.8410110976,22257.826895807997,0,34128.667906905597,null,2,1,0,null,null,null,null,null,null,null,null,48708,"KPENDJAL"]
[{"$f":"IF(INTRO!$E$33<>0,INTRO!$E$33, \" \")","v":"TOGO"},"SAVANES","KPENDJAL-OUEST",129069,{"$f":"IF(INTRO!$E$48=\"\",\"\",ROUND($D44*INTRO!$E$48,0))","v":20651},{"$f":"IF(INTRO!$E$49=\"\",\"\",ROUND($D44*INTRO!$E$49,0))","v":38721},{"$f":"IF(INTRO!$E$50=\"\",\"\",ROUND($D44*INTRO!$E$50,0))","v":64535},99,19,11,21,{"$f":"IF(INTRO!$E$37=\"Endémique\",IF($H44>0,IF($H44=4,\"Inconnu\",IF($H44=99,\"Interrompu\",$D44)),0),\"Non requis\")","v":"Non requis"},133846,{"$f":"IF(INTRO!$E$41=\"Endémique\", IF($J44>1, IF($J44=4, \"Inconnu\", IF($J44=99, \"Surveillance\", E44)), 0),\"Non requis\")","v":20651},{"$f":"IF(INTRO!$E$41=\"Endémique\", IF($J44>1, IF($J44=4, \"Inconnu\", IF($J44=99, \"Surveillance\", F44)), 0),\"Non requis\")","v":38721},0,{"$f":"IF(INTRO!$E$41=\"Endémique\", IF($J44>1, IF($J44=4, \"Inconnu\", IF($J44=99, \"Surveillance\", SUM($N44:$P44))), 0),\"Non requis\")","v":59372},21324.278449152,39983.022092159998,8747.9328081599997,70055.233349471993,null,2,1,2,null,null,null,null,null,null,null,null,48709,"KPENDJAL-OUEST"]
[{"$f":"IF(INTRO!$E$33<>0,INTRO!$E$33, \" \")","v":"TOGO"},"SAVANES","OTI",130658,{"$f":"IF(INTRO!$E$48=\"\",\"\",ROUND($D45*INTRO!$E$48,0))","v":20905},{"$f":"IF(INTRO!$E$49=\"\",\"\",ROUND($D45*INTRO!$E$49,0))","v":39197},{"$f":"IF(INTRO!$E$50=\"\",\"\",ROUND($D45*INTRO!$E$50,0))","v":65329},99,19,11,11,{"$f":"IF(INTRO!$E$37=\"Endémique\",IF($H45>0,IF($H45=4,\"Inconnu\",IF($H45=99,\"Interrompu\",$D45)),0),\"Non requis\")","v":"Non requis"},85586,{"$f":"IF(INTRO!$E$41=\"Endémique\", IF($J45>1, IF($J45=4, \"Inconnu\", IF($J45=99, \"Surveillance\", E45)), 0),\"Non requis\")","v":20905},{"$f":"IF(INTRO!$E$41=\"Endémique\", IF($J45>1, IF($J45=4, \"Inconnu\", IF($J45=99, \"Surveillance\", F45)), 0),\"Non requis\")","v":39197},{"$f":"IF(INTRO!$E$41=\"Endémique\", IF($J45>1, IF($J45=4, \"Inconnu\", IF($J45=99, \"Surveillance\", ROUND(D45*INTRO!$E$51,0))), 0),\"Non requis\")","v":29659},{"$f":"IF(INTRO!$E$41=\"Endémique\", IF($J45>1, IF($J45=4, \"Inconnu\", IF($J45=99, \"Surveillance\", SUM($N45:$P45))), 0),\"Non requis\")","v":89761},23606.613644543995,44262.400583520001,4145.0056905599995,72014.019918623992,null,2,2,1,null,null,null,null,null,null,null,null,48710,"OTI"]
[{"$f":"IF(INTRO!$E$33<>0,INTRO!$E$33, \" \")","v":"TOGO"},"SAVANES","OTI-SUD",157373,{"$f":"IF(INTRO!$E$48=\"\",\"\",ROUND($D46*INTRO!$E$48,0))","v":25180},{"$f":"IF(INTRO!$E$49=\"\",\"\",ROUND($D46*INTRO!$E$49,0))","v":47212},{"$f":"IF(INTRO!$E$50=\"\",\"\",ROUND($D46*INTRO!$E$50,0))","v":78687},99,19,11,11,{"$f":"IF(INTRO!$E$37=\"Endémique\",IF($H46>0,IF($H46=4,\"Inconnu\",IF($H46=99,\"Interrompu\",$D46)),0),\"Non requis\")","v":"Non requis"},128797,{"$f":"IF(INTRO!$E$41=\"Endémique\", IF($J46>1, IF($J46=4, \"Inconnu\", IF($J46=99, \"Surveillance\", E46)), 0),\"Non requis\")","v":25180},{"$f":"IF(INTRO!$E$41=\"Endémique\", IF($J46>1, IF($J46=4, \"Inconnu\", IF($J46=99, \"Surveillance\", F46)), 0),\"Non requis\")","v":47212},{"$f":"IF(INTRO!$E$41=\"Endémique\", IF($J46>1, IF($J46=4, \"Inconnu\", IF($J46=99, \"Surveillance\", ROUND(D46*INTRO!$E$51,0))), 0),\"Non requis\")","v":35724},{"$f":"IF(INTRO!$E$41=\"Endémique\", IF($J46>1, IF($J46=4, \"Inconnu\", IF($J46=99, \"Surveillance\", SUM($N46:$P46))), 0),\"Non requis\")","v":108116},23212.200491827203,43522.87592217599,24908.981177505597,91644.057591508797,null,2,2,1,null,null,null,null,null,null,null,null,48711,"OTI-SUD"]
[{"$f":"IF(INTRO!$E$33<>0,INTRO!$E$33, \" \")","v":"TOGO"},"SAVANES","TANDJOUARE",145328,{"$f":"IF(INTRO!$E$48=\"\",\"\",ROUND($D47*INTRO!$E$48,0))","v":23252},{"$f":"IF(INTRO!$E$49=\"\",\"\",ROUND($D47*INTRO!$E$49,0))","v":43598},{"$f":"IF(INTRO!$E$50=\"\",\"\",ROUND($D47*INTRO!$E$50,0))","v":72664},99,19,11,11,{"$f":"IF(INTRO!$E$37=\"Endémique\",IF($H47>0,IF($H47=4,\"Inconnu\",IF($H47=99,\"Interrompu\",$D47)),0),\"Non requis\")","v":"Non requis"},168188,{"$f":"IF(INTRO!$E$41=\"Endémique\", IF($J47>1, IF($J47=4, \"Inconnu\", IF($J47=99, \"Surveillance\", E47)), 0),\"Non requis\")","v":23252},{"$f":"IF(INTRO!$E$41=\"Endémique\", IF($J47>1, IF($J47=4, \"Inconnu\", IF($J47=99, \"Surveillance\", F47)), 0),\"Non requis\")","v":43598},{"$f":"IF(INTRO!$E$41=\"Endémique\", IF($J47>1, IF($J47=4, \"Inconnu\", IF($J47=99, \"Surveillance\", ROUND(D47*INTRO!$E$51,0))), 0),\"Non requis\")","v":32989},{"$f":"IF(INTRO!$E$41=\"Endémique\", IF($J47>1, IF($J47=4, \"Inconnu\", IF($J47=99, \"Surveillance\", SUM($N47:$P47))), 0),\"Non requis\")","v":99839},25851.345533798398,48471.272875871997,0,74322.618409670395,null,2,2,1,null,null,null,null,null,null,null,null,48704,"TANDJOARE"]
[{"$f":"IF(INTRO!$E$33<>0,INTRO!$E$33, \" \")","v":"TOGO"},"SAVANES","TONE",406864,{"$f":"IF(INTRO!$E$48=\"\",\"\",ROUND($D48*INTRO!$E$48,0))","v":65098},{"$f":"IF(INTRO!$E$49=\"\",\"\",ROUND($D48*INTRO!$E$49,0))","v":122059},{"$f":"IF(INTRO!$E$50=\"\",\"\",ROUND($D48*INTRO!$E$50,0))","v":203432},99,19,11,99,{"$f":"IF(INTRO!$E$37=\"Endémique\",IF($H48>0,IF($H48=4,\"Inconnu\",IF($H48=99,\"Interrompu\",$D48)),0),\"Non requis\")","v":"Non requis"},304751,{"$f":"IF(INTRO!$E$41=\"Endémique\", IF($J48>1, IF($J48=4, \"Inconnu\", IF($J48=99, \"Surveillance\", E48)), 0),\"Non requis\")","v":65098},{"$f":"IF(INTRO!$E$41=\"Endémique\", IF($J48>1, IF($J48=4, \"Inconnu\", IF($J48=99, \"Surveillance\", F48)), 0),\"Non requis\")","v":122059},0,{"$f":"IF(INTRO!$E$41=\"Endémique\", IF($J48>1, IF($J48=4, \"Inconnu\", IF($J48=99, \"Surveillance\", SUM($N48:$P48))), 0),\"Non requis\")","v":187157},53861.087114956783,100989.53834054401,14139.641967212157,168990.26742271296,null,2,1,1,null,null,null,null,null,null,null,null,48705,"TONE"]
[null,null,null,null,null,null,null,null,null,null,11]

{"sheet":"DEC","index":2,"n_rows":48,"n_cols":12,"rows_kept":48,"cut":false,"hidden":true,"merged":[[3,0,3,2],[5,0,5,2],[6,5,7,5],[6,2,7,2],[6,1,7,1],[6,10,7,10],[6,0,7,0],[6,11,7,11],[5,3,5,6],[5,9,5,11],[6,4,7,4],[6,3,7,3],[6,8,7,8],[6,7,7,7],[6,6,7,6],[6,9,7,9]]}
["Diethylcarbamazine (DEC)"]
["Structure administrative, population ciblée par groupe d'âge, plan de traitement et information sur les comprimés"]
[]
["TOTAL",null,null,{"$f":"SUBTOTAL(9,D$10:D$1010)","v":0},0,0,0,null,{"$f":"SUBTOTAL(9,I$10:I$1010)","v":0},0,0,0]
[]
["Structure administrative du pays",null,null,"Population nécessitant un traitement avec DEC",null,null,null,"Plan de traitement","Population cible","Diethylcarbamazine (DEC)"]
["Pays","Région/Département","District","EAPréS","EAS","Adultes","Total","FL","FL","Total requis","Reste en stock","Comprimés devant être fournis"]
[]
[]
[{"$f":"IF(INTRO!$E$39<>\"Non endémique\", \" \", IF(INTRO!$E$37=\"Non endémique\",\" \", IF(COUNTRY_INFO!A10=0,\" \",COUNTRY_INFO!A10)))","v":" "},{"$f":"IF(INTRO!$E$39<>\"Non endémique\", \" \", IF(INTRO!$E$37=\"Non endémique\",\" \", IF(COUNTRY_INFO!B10=0,\" \",COUNTRY_INFO!B10)))","v":" "},{"$f":"IF(INTRO!$E$39<>\"Non endémique\", \" \", IF(INTRO!$E$37=\"Non endémique\",\" \", IF(COUNTRY_INFO!C10=0,\" \",COUNTRY_INFO!C10)))","v":" "},{"$f":"IF(INTRO!$E$39<>\"Non endémique\", 0, IF(INTRO!$E$37=\"Non endémique\",0,IF(COUNTRY_INFO!$H10=1,COUNTRY_INFO!E10,0)))","v":0},{"$f":"IF(INTRO!$E$39<>\"Non endémique\", 0, IF(INTRO!$E$37=\"Non endémique\",0,IF(COUNTRY_INFO!$H10=1,COUNTRY_INFO!F10,0)))","v":0},{"$f":"IF(INTRO!$E$39<>\"Non endémique\", 0, IF(INTRO!$E$37=\"Non endémique\",0,IF(COUNTRY_INFO!$H10=1,COUNTRY_INFO!G10,0)))","v":0},{"$f":"SUM(D10:F10)","v":0},{"$f":"IF(INTRO!$E$39=\"Non endémique\",IF(INTRO!$E$37=\"Non endémique\",\"Non requis\",COUNTRY_INFO!V10),\"Traiter avec IVM\")","v":"Traiter avec IVM"},{"$f":"IF(H10=1,G10,0)","v":0},{"$f":"IF(I10>0,I10*2.5,0)","v":0},null,{"$f":"IF($J10>$K10,$J10-$K10,0)","v":0}]
[{"$f":"IF(INTRO!$E$39<>\"Non endémique\", \" \", IF(INTRO!$E$37=\"Non endémique\",\" \", IF(COUNTRY_INFO!A11=0,\" \",COUNTRY_INFO!A11)))","v":" "},{"$f":"IF(INTRO!$E$39<>\"Non endémique\", \" \", IF(INTRO!$E$37=\"Non endémique\",\" \", IF(COUNTRY_INFO!B11=0,\" \",COUNTRY_INFO!B11)))","v":" "},{"$f":"IF(INTRO!$E$39<>\"Non endémique\", \" \", IF(INTRO!$E$37=\"Non endémique\",\" \", IF(COUNTRY_INFO!C11=0,\" \",COUNTRY_INFO!C11)))","v":" "},{"$f":"IF(INTRO!$E$39<>\"Non endémique\", 0, IF(INTRO!$E$37=\"Non endémique\",0,IF(COUNTRY_INFO!$H11=1,COUNTRY_INFO!E11,0)))","v":0},{"$f":"IF(INTRO!$E$39<>\"Non endémique\", 0, IF(INTRO!$E$37=\"Non endémique\",0,IF(COUNTRY_INFO!$H11=1,COUNTRY_INFO!F11,0)))","v":0},{"$f":"IF(INTRO!$E$39<>\"Non endémique\", 0, IF(INTRO!$E$37=\"Non endémique\",0,IF(COUNTRY_INFO!$H11=1,COUNTRY_INFO!G11,0)))","v":0},{"$f":"SUM(D11:F11)","v":0},{"$f":"IF(INTRO!$E$39=\"Non endémique\",IF(INTRO!$E$37=\"Non endémique\",\"Non requis\",COUNTRY_INFO!V11),\"Traiter avec IVM\")","v":"Traiter avec IVM"},{"$f":"IF(H11=1,G11,0)","v":0},{"$f":"IF(I11>0,I11*2.5,0)","v":0},null,0]
[{"$f":"IF(INTRO!$E$39<>\"Non endémique\", \" \", IF(INTRO!$E$37=\"Non endémique\",\" \", IF(COUNTRY_INFO!A12=0,\" \",COUNTRY_INFO!A12)))","v":" "},{"$f":"IF(INTRO!$E$39<>\"Non endémique\", \" \", IF(INTRO!$E$37=\"Non endémique\",\" \", IF(COUNTRY_INFO!B12=0,\" \",COUNTRY_INFO!B12)))","v":" "},{"$f":"IF(INTRO!$E$39<>\"Non endémique\", \" \", IF(INTRO!$E$37=\"Non endémique\",\" \", IF(COUNTRY_INFO!C12=0,\" \",COUNTRY_INFO!C12)))","v":" "},{"$f":"IF(INTRO!$E$39<>\"Non endémique\", 0, IF(INTRO!$E$37=\"Non endémique\",0,IF(COUNTRY_INFO!$H12=1,COUNTRY_INFO!E12,0)))","v":0},{"$f":"IF(INTRO!$E$39<>\"Non endémique\", 0, IF(INTRO!$E$37=\"Non endémique\",0,IF(COUNTRY_INFO!$H12=1,COUNTRY_INFO!F12,0)))","v":0},{"$f":"IF(INTRO!$E$39<>\"Non endémique\", 0, IF(INTRO!$E$37=\"Non endémique\",0,IF(COUNTRY_INFO!$H12=1,COUNTRY_INFO!G12,0)))","v":0},0,{"$f":"IF(INTRO!$E$39=\"Non endémique\",IF(INTRO!$E$37=\"Non endémique\",\"Non requis\",COUNTRY_INFO!V12),\"Traiter avec IVM\")","v":"Traiter avec IVM"},0,0,null,0]
[{"$f":"IF(INTRO!$E$39<>\"Non endémique\", \" \", IF(INTRO!$E$37=\"Non endémique\",\" \", IF(COUNTRY_INFO!A13=0,\" \",COUNTRY_INFO!A13)))","v":" "},{"$f":"IF(INTRO!$E$39<>\"Non endémique\", \" \", IF(INTRO!$E$37=\"Non endémique\",\" \", IF(COUNTRY_INFO!B13=0,\" \",COUNTRY_INFO!B13)))","v":" "},{"$f":"IF(INTRO!$E$39<>\"Non endémique\", \" \", IF(INTRO!$E$37=\"Non endémique\",\" \", IF(COUNTRY_INFO!C13=0,\" \",COUNTRY_INFO!C13)))","v":" "},{"$f":"IF(INTRO!$E$39<>\"Non endémique\", 0, IF(INTRO!$E$37=\"Non endémique\",0,IF(COUNTRY_INFO!$H13=1,COUNTRY_INFO!E13,0)))","v":0},{"$f":"IF(INTRO!$E$39<>\"Non endémique\", 0, IF(INTRO!$E$37=\"Non endémique\",0,IF(COUNTRY_INFO!$H13=1,COUNTRY_INFO!F13,0)))","v":0},{"$f":"IF(INTRO!$E$39<>\"Non endémique\", 0, IF(INTRO!$E$37=\"Non endémique\",0,IF(COUNTRY_INFO!$H13=1,COUNTRY_INFO!G13,0)))","v":0},0,{"$f":"IF(INTRO!$E$39=\"Non endémique\",IF(INTRO!$E$37=\"Non endémique\",\"Non requis\",COUNTRY_INFO!V13),\"Traiter avec IVM\")","v":"Traiter avec IVM"},0,0,null,0]
[{"$f":"IF(INTRO!$E$39<>\"Non endémique\", \" \", IF(INTRO!$E$37=\"Non endémique\",\" \", IF(COUNTRY_INFO!A14=0,\" \",COUNTRY_INFO!A14)))","v":" "},{"$f":"IF(INTRO!$E$39<>\"Non endémique\", \" \", IF(INTRO!$E$37=\"Non endémique\",\" \", IF(COUNTRY_INFO!B14=0,\" \",COUNTRY_INFO!B14)))","v":" "},{"$f":"IF(INTRO!$E$39<>\"Non endémique\", \" \", IF(INTRO!$E$37=\"Non endémique\",\" \", IF(COUNTRY_INFO!C14=0,\" \",COUNTRY_INFO!C14)))","v":" "},{"$f":"IF(INTRO!$E$39<>\"Non endémique\", 0, IF(INTRO!$E$37=\"Non endémique\",0,IF(COUNTRY_INFO!$H14=1,COUNTRY_INFO!E14,0)))","v":0},{"$f":"IF(INTRO!$E$39<>\"Non endémique\", 0, IF(INTRO!$E$37=\"Non endémique\",0,IF(COUNTRY_INFO!$H14=1,COUNTRY_INFO!F14,0)))","v":0},{"$f":"IF(INTRO!$E$39<>\"Non endémique\", 0, IF(INTRO!$E$37=\"Non endémique\",0,IF(COUNTRY_INFO!$H14=1,COUNTRY_INFO!G14,0)))","v":0},0,{"$f":"IF(INTRO!$E$39=\"Non endémique\",IF(INTRO!$E$37=\"Non endémique\",\"Non requis\",COUNTRY_INFO!V14),\"Traiter avec IVM\")","v":"Traiter avec IVM"},0,0,null,0]
[{"$f":"IF(INTRO!$E$39<>\"Non endémique\", \" \", IF(INTRO!$E$37=\"Non endémique\",\" \", IF(COUNTRY_INFO!A15=0,\" \",COUNTRY_INFO!A15)))","v":" "},{"$f":"IF(INTRO!$E$39<>\"Non endémique\", \" \", IF(INTRO!$E$37=\"Non endémique\",\" \", IF(COUNTRY_INFO!B15=0,\" \",COUNTRY_INFO!B15)))","v":" "},{"$f":"IF(INTRO!$E$39<>\"Non endémique\", \" \", IF(INTRO!$E$37=\"Non endémique\",\" \", IF(COUNTRY_INFO!C15=0,\" \",COUNTRY_INFO!C15)))","v":" "},{"$f":"IF(INTRO!$E$39<>\"Non endémique\", 0, IF(INTRO!$E$37=\"Non endémique\",0,IF(COUNTRY_INFO!$H15=1,COUNTRY_INFO!E15,0)))","v":0},{"$f":"IF(INTRO!$E$39<>\"Non endémique\", 0, IF(INTRO!$E$37=\"Non endémique\",0,IF(COUNTRY_INFO!$H15=1,COUNTRY_INFO!F15,0)))","v":0},{"$f":"IF(INTRO!$E$39<>\"Non endémique\", 0, IF(INTRO!$E$37=\"Non endémique\",0,IF(COUNTRY_INFO!$H15=1,COUNTRY_INFO!G15,0)))","v":0},0,{"$f":"IF(INTRO!$E$39=\"Non endémique\",IF(INTRO!$E$37=\"Non endémique\",\"Non requis\",COUNTRY_INFO!V15),\"Traiter avec IVM\")","v":"Traiter avec IVM"},0,0,null,0]
[{"$f":"IF(INTRO!$E$39<>\"Non endémique\", \" \", IF(INTRO!$E$37=\"Non endémique\",\" \", IF(COUNTRY_INFO!A16=0,\" \",COUNTRY_INFO!A16)))","v":" "},{"$f":"IF(INTRO!$E$39<>\"Non endémique\", \" \", IF(INTRO!$E$37=\"Non endémique\",\" \", IF(COUNTRY_INFO!B16=0,\" \",COUNTRY_INFO!B16)))","v":" "},{"$f":"IF(INTRO!$E$39<>\"Non endémique\", \" \", IF(INTRO!$E$37=\"Non endémique\",\" \", IF(COUNTRY_INFO!C16=0,\" \",COUNTRY_INFO!C16)))","v":" "},{"$f":"IF(INTRO!$E$39<>\"Non endémique\", 0, IF(INTRO!$E$37=\"Non endémique\",0,IF(COUNTRY_INFO!$H16=1,COUNTRY_INFO!E16,0)))","v":0},{"$f":"IF(INTRO!$E$39<>\"Non endémique\", 0, IF(INTRO!$E$37=\"Non endémique\",0,IF(COUNTRY_INFO!$H16=1,COUNTRY_INFO!F16,0)))","v":0},{"$f":"IF(INTRO!$E$39<>\"Non endémique\", 0, IF(INTRO!$E$37=\"Non endémique\",0,IF(COUNTRY_INFO!$H16=1,COUNTRY_INFO!G16,0)))","v":0},0,{"$f":"IF(INTRO!$E$39=\"Non endémique\",IF(INTRO!$E$37=\"Non endémique\",\"Non requis\",COUNTRY_INFO!V16),\"Traiter avec IVM\")","v":"Traiter avec IVM"},0,0,null,0]
[{"$f":"IF(INTRO!$E$39<>\"Non endémique\", \" \", IF(INTRO!$E$37=\"Non endémique\",\" \", IF(COUNTRY_INFO!A17=0,\" \",COUNTRY_INFO!A17)))","v":" "},{"$f":"IF(INTRO!$E$39<>\"Non endémique\", \" \", IF(INTRO!$E$37=\"Non endémique\",\" \", IF(COUNTRY_INFO!B17=0,\" \",COUNTRY_INFO!B17)))","v":" "},{"$f":"IF(INTRO!$E$39<>\"Non endémique\", \" \", IF(INTRO!$E$37=\"Non endémique\",\" \", IF(COUNTRY_INFO!C17=0,\" \",COUNTRY_INFO!C17)))","v":" "},{"$f":"IF(INTRO!$E$39<>\"Non endémique\", 0, IF(INTRO!$E$37=\"Non endémique\",0,IF(COUNTRY_INFO!$H17=1,COUNTRY_INFO!E17,0)))","v":0},{"$f":"IF(INTRO!$E$39<>\"Non endémique\", 0, IF(INTRO!$E$37=\"Non endémique\",0,IF(COUNTRY_INFO!$H17=1,COUNTRY_INFO!F17,0)))","v":0},{"$f":"IF(INTRO!$E$39<>\"Non endémique\", 0, IF(INTRO!$E$37=\"Non endémique\",0,IF(COUNTRY_INFO!$H17=1,COUNTRY_INFO!G17,0)))","v":0},0,{"$f":"IF(INTRO!$E$39=\"Non endémique\",IF(INTRO!$E$37=\"Non endémique\",\"Non requis\",COUNTRY_INFO!V17),\"Traiter avec IVM\")","v":"Traiter avec IVM"},0,0,null,0]
[{"$f":"IF(INTRO!$E$39<>\"Non endémique\", \" \", IF(INTRO!$E$37=\"Non endémique\",\" \", IF(COUNTRY_INFO!A18=0,\" \",COUNTRY_INFO!A18)))","v":" "},{"$f":"IF(INTRO!$E$39<>\"Non endémique\", \" \", IF(INTRO!$E$37=\"Non endémique\",\" \", IF(COUNTRY_INFO!B18=0,\" \",COUNTRY_INFO!B18)))","v":" "},{"$f":"IF(INTRO!$E$39<>\"Non endémique\", \" \", IF(INTRO!$E$37=\"Non endémique\",\" \", IF(COUNTRY_INFO!C18=0,\" \",COUNTRY_INFO!C18)))","v":" "},{"$f":"IF(INTRO!$E$39<>\"Non endémique\", 0, IF(INTRO!$E$37=\"Non endémique\",0,IF(COUNTRY_INFO!$H18=1,COUNTRY_INFO!E18,0)))","v":0},{"$f":"IF(INTRO!$E$39<>\"Non endémique\", 0, IF(INTRO!$E$37=\"Non endémique\",0,IF(COUNTRY_INFO!$H18=1,COUNTRY_INFO!F18,0)))","v":0},{"$f":"IF(INTRO!$E$39<>\"Non endémique\", 0, IF(INTRO!$E$37=\"Non endémique\",0,IF(COUNTRY_INFO!$H18=1,COUNTRY_INFO!G18,0)))","v":0},0,{"$f":"IF(INTRO!$E$39=\"Non endémique\",IF(INTRO!$E$37=\"Non endémique\",\"Non requis\",COUNTRY_INFO!V18),\"Traiter avec IVM\")","v":"Traiter avec IVM"},0,0,null,0]
[{"$f":"IF(INTRO!$E$39<>\"Non endémique\", \" \", IF(INTRO!$E$37=\"Non endémique\",\" \", IF(COUNTRY_INFO!A19=0,\" \",COUNTRY_INFO!A19)))","v":" "},{"$f":"IF(INTRO!$E$39<>\"Non endémique\", \" \", IF(INTRO!$E$37=\"Non endémique\",\" \", IF(COUNTRY_INFO!B19=0,\" \",COUNTRY_INFO!B19)))","v":" "},{"$f":"IF(INTRO!$E$39<>\"Non endémique\", \" \", IF(INTRO!$E$37=\"Non endémique\",\" \", IF(COUNTRY_INFO!C19=0,\" \",COUNTRY_INFO!C19)))","v":" "},{"$f":"IF(INTRO!$E$39<>\"Non endémique\", 0, IF(INTRO!$E$37=\"Non endémique\",0,IF(COUNTRY_INFO!$H19=1,COUNTRY_INFO!E19,0)))","v":0},{"$f":"IF(INTRO!$E$39<>\"Non endémique\", 0, IF(INTRO!$E$37=\"Non endémique\",0,IF(COUNTRY_INFO!$H19=1,COUNTRY_INFO!F19,0)))","v":0},{"$f":"IF(INTRO!$E$39<>\"Non endémique\", 0, IF(INTRO!$E$37=\"Non endémique\",0,IF(COUNTRY_INFO!$H19=1,COUNTRY_INFO!G19,0)))","v":0},0,{"$f":"IF(INTRO!$E$39=\"Non endémique\",IF(INTRO!$E$37=\"Non endémique\",\"Non requis\",COUNTRY_INFO!V19),\"Traiter avec IVM\")","v":"Traiter avec IVM"},0,0,null,0]
[{"$f":"IF(INTRO!$E$39<>\"Non endémique\", \" \", IF(INTRO!$E$37=\"Non endémique\",\" \", IF(COUNTRY_INFO!A20=0,\" \",COUNTRY_INFO!A20)))","v":" "},{"$f":"IF(INTRO!$E$39<>\"Non endémique\", \" \", IF(INTRO!$E$37=\"Non endémique\",\" \", IF(COUNTRY_INFO!B20=0,\" \",COUNTRY_INFO!B20)))","v":" "},{"$f":"IF(INTRO!$E$39<>\"Non endémique\", \" \", IF(INTRO!$E$37=\"Non endémique\",\" \", IF(COUNTRY_INFO!C20=0,\" \",COUNTRY_INFO!C20)))","v":" "},{"$f":"IF(INTRO!$E$39<>\"Non endémique\", 0, IF(INTRO!$E$37=\"Non endémique\",0,IF(COUNTRY_INFO!$H20=1,COUNTRY_INFO!E20,0)))","v":0},{"$f":"IF(INTRO!$E$39<>\"Non endémique\", 0, IF(INTRO!$E$37=\"Non endémique\",0,IF(COUNTRY_INFO!$H20=1,COUNTRY_INFO!F20,0)))","v":0},{"$f":"IF(INTRO!$E$39<>\"Non endémique\", 0, IF(INTRO!$E$37=\"Non endémique\",0,IF(COUNTRY_INFO!$H20=1,COUNTRY_INFO!G20,0)))","v":0},0,{"$f":"IF(INTRO!$E$39=\"Non endémique\",IF(INTRO!$E$37=\"Non endémique\",\"Non requis\",COUNTRY_INFO!V20),\"Traiter avec IVM\")","v":"Traiter avec IVM"},0,0,null,0]
[{"$f":"IF(INTRO!$E$39<>\"Non endémique\", \" \", IF(INTRO!$E$37=\"Non endémique\",\" \", IF(COUNTRY_INFO!A21=0,\" \",COUNTRY_INFO!A21)))","v":" "},{"$f":"IF(INTRO!$E$39<>\"Non endémique\", \" \", IF(INTRO!$E$37=\"Non endémique\",\" \", IF(COUNTRY_INFO!B21=0,\" \",COUNTRY_INFO!B21)))","v":" "},{"$f":"IF(INTRO!$E$39<>\"Non endémique\", \" \", IF(INTRO!$E$37=\"Non endémique\",\" \", IF(COUNTRY_INFO!C21=0,\" \",COUNTRY_INFO!C21)))","v":" "},{"$f":"IF(INTRO!$E$39<>\"Non endémique\", 0, IF(INTRO!$E$37=\"Non endémique\",0,IF(COUNTRY_INFO!$H21=1,COUNTRY_INFO!E21,0)))","v":0},{"$f":"IF(INTRO!$E$39<>\"Non endémique\", 0, IF(INTRO!$E$37=\"Non endémique\",0,IF(COUNTRY_INFO!$H21=1,COUNTRY_INFO!F21,0)))","v":0},{"$f":"IF(INTRO!$E$39<>\"Non endémique\", 0, IF(INTRO!$E$37=\"Non endémique\",0,IF(COUNTRY_INFO!$H21=1,COUNTRY_INFO!G21,0)))","v":0},0,{"$f":"IF(INTRO!$E$39=\"Non endémique\",IF(INTRO!$E$37=\"Non endémique\",\"Non requis\",COUNTRY_INFO!V21),\"Traiter avec IVM\")","v":"Traiter avec IVM"},0,0,null,0]
[{"$f":"IF(INTRO!$E$39<>\"Non endémique\", \" \", IF(INTRO!$E$37=\"Non endémique\",\" \", IF(COUNTRY_INFO!A22=0,\" \",COUNTRY_INFO!A22)))","v":" "},{"$f":"IF(INTRO!$E$39<>\"Non endémique\", \" \", IF(INTRO!$E$37=\"Non endémique\",\" \", IF(COUNTRY_INFO!B22=0,\" \",COUNTRY_INFO!B22)))","v":" "},{"$f":"IF(INTRO!$E$39<>\"Non endémique\", \" \", IF(INTRO!$E$37=\"Non endémique\",\" \", IF(COUNTRY_INFO!C22=0,\" \",COUNTRY_INFO!C22)))","v":" "},{"$f":"IF(INTRO!$E$39<>\"Non endémique\", 0, IF(INTRO!$E$37=\"Non endémique\",0,IF(COUNTRY_INFO!$H22=1,COUNTRY_INFO!E22,0)))","v":0},{"$f":"IF(INTRO!$E$39<>\"Non endémique\", 0, IF(INTRO!$E$37=\"Non endémique\",0,IF(COUNTRY_INFO!$H22=1,COUNTRY_INFO!F22,0)))","v":0},{"$f":"IF(INTRO!$E$39<>\"Non endémique\", 0, IF(INTRO!$E$37=\"Non endémique\",0,IF(COUNTRY_INFO!$H22=1,COUNTRY_INFO!G22,0)))","v":0},0,{"$f":"IF(INTRO!$E$39=\"Non endémique\",IF(INTRO!$E$37=\"Non endémique\",\"Non requis\",COUNTRY_INFO!V22),\"Traiter avec IVM\")","v":"Traiter avec IVM"},0,0,null,0]
[{"$f":"IF(INTRO!$E$39<>\"Non endémique\", \" \", IF(INTRO!$E$37=\"Non endémique\",\" \", IF(COUNTRY_INFO!A23=0,\" \",COUNTRY_INFO!A23)))","v":" "},{"$f":"IF(INTRO!$E$39<>\"Non endémique\", \" \", IF(INTRO!$E$37=\"Non endémique\",\" \", IF(COUNTRY_INFO!B23=0,\" \",COUNTRY_INFO!B23)))","v":" "},{"$f":"IF(INTRO!$E$39<>\"Non endémique\", \" \", IF(INTRO!$E$37=\"Non endémique\",\" \", IF(COUNTRY_INFO!C23=0,\" \",COUNTRY_INFO!C23)))","v":" "},{"$f":"IF(INTRO!$E$39<>\"Non endémique\", 0, IF(INTRO!$E$37=\"Non endémique\",0,IF(COUNTRY_INFO!$H23=1,COUNTRY_INFO!E23,0)))","v":0},{"$f":"IF(INTRO!$E$39<>\"Non endémique\", 0, IF(INTRO!$E$37=\"Non endémique\",0,IF(COUNTRY_INFO!$H23=1,COUNTRY_INFO!F23,0)))","v":0},{"$f":"IF(INTRO!$E$39<>\"Non endémique\", 0, IF(INTRO!$E$37=\"Non endémique\",0,IF(COUNTRY_INFO!$H23=1,COUNTRY_INFO!G23,0)))","v":0},0,{"$f":"IF(INTRO!$E$39=\"Non endémique\",IF(INTRO!$E$37=\"Non endémique\",\"Non requis\",COUNTRY_INFO!V23),\"Traiter avec IVM\")","v":"Traiter avec IVM"},0,0,null,0]
[{"$f":"IF(INTRO!$E$39<>\"Non endémique\", \" \", IF(INTRO!$E$37=\"Non endémique\",\" \", IF(COUNTRY_INFO!A24=0,\" \",COUNTRY_INFO!A24)))","v":" "},{"$f":"IF(INTRO!$E$39<>\"Non endémique\", \" \", IF(INTRO!$E$37=\"Non endémique\",\" \", IF(COUNTRY_INFO!B24=0,\" \",COUNTRY_INFO!B24)))","v":" "},{"$f":"IF(INTRO!$E$39<>\"Non endémique\", \" \", IF(INTRO!$E$37=\"Non endémique\",\" \", IF(COUNTRY_INFO!C24=0,\" \",COUNTRY_INFO!C24)))","v":" "},{"$f":"IF(INTRO!$E$39<>\"Non endémique\", 0, IF(INTRO!$E$37=\"Non endémique\",0,IF(COUNTRY_INFO!$H24=1,COUNTRY_INFO!E24,0)))","v":0},{"$f":"IF(INTRO!$E$39<>\"Non endémique\", 0, IF(INTRO!$E$37=\"Non endémique\",0,IF(COUNTRY_INFO!$H24=1,COUNTRY_INFO!F24,0)))","v":0},{"$f":"IF(INTRO!$E$39<>\"Non endémique\", 0, IF(INTRO!$E$37=\"Non endémique\",0,IF(COUNTRY_INFO!$H24=1,COUNTRY_INFO!G24,0)))","v":0},0,{"$f":"IF(INTRO!$E$39=\"Non endémique\",IF(INTRO!$E$37=\"Non endémique\",\"Non requis\",COUNTRY_INFO!V24),\"Traiter avec IVM\")","v":"Traiter avec IVM"},0,0,null,0]
[{"$f":"IF(INTRO!$E$39<>\"Non endémique\", \" \", IF(INTRO!$E$37=\"Non endémique\",\" \", IF(COUNTRY_INFO!A25=0,\" \",COUNTRY_INFO!A25)))","v":" "},{"$f":"IF(INTRO!$E$39<>\"Non endémique\", \" \", IF(INTRO!$E$37=\"Non endémique\",\" \", IF(COUNTRY_INFO!B25=0,\" \",COUNTRY_INFO!B25)))","v":" "},{"$f":"IF(INTRO!$E$39<>\"Non endémique\", \" \", IF(INTRO!$E$37=\"Non endémique\",\" \", IF(COUNTRY_INFO!C25=0,\" \",COUNTRY_INFO!C25)))","v":" "},{"$f":"IF(INTRO!$E$39<>\"Non endémique\", 0, IF(INTRO!$E$37=\"Non endémique\",0,IF(COUNTRY_INFO!$H25=1,COUNTRY_INFO!E25,0)))","v":0},{"$f":"IF(INTRO!$E$39<>\"Non endémique\", 0, IF(INTRO!$E$37=\"Non endémique\",0,IF(COUNTRY_INFO!$H25=1,COUNTRY_INFO!F25,0)))","v":0},{"$f":"IF(INTRO!$E$39<>\"Non endémique\", 0, IF(INTRO!$E$37=\"Non endémique\",0,IF(COUNTRY_INFO!$H25=1,COUNTRY_INFO!G25,0)))","v":0},0,{"$f":"IF(INTRO!$E$39=\"Non endémique\",IF(INTRO!$E$37=\"Non endémique\",\"Non requis\",COUNTRY_INFO!V25),\"Traiter avec IVM\")","v":"Traiter avec IVM"},0,0,null,0]
[{"$f":"IF(INTRO!$E$39<>\"Non endémique\", \" \", IF(INTRO!$E$37=\"Non endémique\",\" \", IF(COUNTRY_INFO!A26=0,\" \",COUNTRY_INFO!A26)))","v":" "},{"$f":"IF(INTRO!$E$39<>\"Non endémique\", \" \", IF(INTRO!$E$37=\"Non endémique\",\" \", IF(COUNTRY_INFO!B26=0,\" \",COUNTRY_INFO!B26)))","v":" "},{"$f":"IF(INTRO!$E$39<>\"Non endémique\", \" \", IF(INTRO!$E$37=\"Non endémique\",\" \", IF(COUNTRY_INFO!C26=0,\" \",COUNTRY_INFO!C26)))","v":" "},{"$f":"IF(INTRO!$E$39<>\"Non endémique\", 0, IF(INTRO!$E$37=\"Non endémique\",0,IF(COUNTRY_INFO!$H26=1,COUNTRY_INFO!E26,0)))","v":0},{"$f":"IF(INTRO!$E$39<>\"Non endémique\", 0, IF(INTRO!$E$37=\"Non endémique\",0,IF(COUNTRY_INFO!$H26=1,COUNTRY_INFO!F26,0)))","v":0},{"$f":"IF(INTRO!$E$39<>\"Non endémique\", 0, IF(INTRO!$E$37=\"Non endémique\",0,IF(COUNTRY_INFO!$H26=1,COUNTRY_INFO!G26,0)))","v":0},0,{"$f":"IF(INTRO!$E$39=\"Non endémique\",IF(INTRO!$E$37=\"Non endémique\",\"Non requis\",COUNTRY_INFO!V26),\"Traiter avec IVM\")","v":"Traiter avec IVM"},0,0,null,0]
[{"$f":"IF(INTRO!$E$39<>\"Non endémique\", \" \", IF(INTRO!$E$37=\"Non endémique\",\" \", IF(COUNTRY_INFO!A27=0,\" \",COUNTRY_INFO!A27)))","v":" "},{"$f":"IF(INTRO!$E$39<>\"Non endémique\", \" \", IF(INTRO!$E$37=\"Non endémique\",\" \", IF(COUNTRY_INFO!B27=0,\" \",COUNTRY_INFO!B27)))","v":" "},{"$f":"IF(INTRO!$E$39<>\"Non endémique\", \" \", IF(INTRO!$E$37=\"Non endémique\",\" \", IF(COUNTRY_INFO!C27=0,\" \",COUNTRY_INFO!C27)))","v":" "},{"$f":"IF(INTRO!$E$39<>\"Non endémique\", 0, IF(INTRO!$E$37=\"Non endémique\",0,IF(COUNTRY_INFO!$H27=1,COUNTRY_INFO!E27,0)))","v":0},{"$f":"IF(INTRO!$E$39<>\"Non endémique\", 0, IF(INTRO!$E$37=\"Non endémique\",0,IF(COUNTRY_INFO!$H27=1,COUNTRY_INFO!F27,0)))","v":0},{"$f":"IF(INTRO!$E$39<>\"Non endémique\", 0, IF(INTRO!$E$37=\"Non endémique\",0,IF(COUNTRY_INFO!$H27=1,COUNTRY_INFO!G27,0)))","v":0},0,{"$f":"IF(INTRO!$E$39=\"Non endémique\",IF(INTRO!$E$37=\"Non endémique\",\"Non requis\",COUNTRY_INFO!V27),\"Traiter avec IVM\")","v":"Traiter avec IVM"},0,0,null,0]
[{"$f":"IF(INTRO!$E$39<>\"Non endémique\", \" \", IF(INTRO!$E$37=\"Non endémique\",\" \", IF(COUNTRY_INFO!A28=0,\" \",COUNTRY_INFO!A28)))","v":" "},{"$f":"IF(INTRO!$E$39<>\"Non endémique\", \" \", IF(INTRO!$E$37=\"Non endémique\",\" \", IF(COUNTRY_INFO!B28=0,\" \",COUNTRY_INFO!B28)))","v":" "},{"$f":"IF(INTRO!$E$39<>\"Non endémique\", \" \", IF(INTRO!$E$37=\"Non endémique\",\" \", IF(COUNTRY_INFO!C28=0,\" \",COUNTRY_INFO!C28)))","v":" "},{"$f":"IF(INTRO!$E$39<>\"Non endémique\", 0, IF(INTRO!$E$37=\"Non endémique\",0,IF(COUNTRY_INFO!$H28=1,COUNTRY_INFO!E28,0)))","v":0},{"$f":"IF(INTRO!$E$39<>\"Non endémique\", 0, IF(INTRO!$E$37=\"Non endémique\",0,IF(COUNTRY_INFO!$H28=1,COUNTRY_INFO!F28,0)))","v":0},{"$f":"IF(INTRO!$E$39<>\"Non endémique\", 0, IF(INTRO!$E$37=\"Non endémique\",0,IF(COUNTRY_INFO!$H28=1,COUNTRY_INFO!G28,0)))","v":0},0,{"$f":"IF(INTRO!$E$39=\"Non endémique\",IF(INTRO!$E$37=\"Non endémique\",\"Non requis\",COUNTRY_INFO!V28),\"Traiter avec IVM\")","v":"Traiter avec IVM"},0,0,null,0]
[{"$f":"IF(INTRO!$E$39<>\"Non endémique\", \" \", IF(INTRO!$E$37=\"Non endémique\",\" \", IF(COUNTRY_INFO!A29=0,\" \",COUNTRY_INFO!A29)))","v":" "},{"$f":"IF(INTRO!$E$39<>\"Non endémique\", \" \", IF(INTRO!$E$37=\"Non endémique\",\" \", IF(COUNTRY_INFO!B29=0,\" \",COUNTRY_INFO!B29)))","v":" "},{"$f":"IF(INTRO!$E$39<>\"Non endémique\", \" \", IF(INTRO!$E$37=\"Non endémique\",\" \", IF(COUNTRY_INFO!C29=0,\" \",COUNTRY_INFO!C29)))","v":" "},{"$f":"IF(INTRO!$E$39<>\"Non endémique\", 0, IF(INTRO!$E$37=\"Non endémique\",0,IF(COUNTRY_INFO!$H29=1,COUNTRY_INFO!E29,0)))","v":0},{"$f":"IF(INTRO!$E$39<>\"Non endémique\", 0, IF(INTRO!$E$37=\"Non endémique\",0,IF(COUNTRY_INFO!$H29=1,COUNTRY_INFO!F29,0)))","v":0},{"$f":"IF(INTRO!$E$39<>\"Non endémique\", 0, IF(INTRO!$E$37=\"Non endémique\",0,IF(COUNTRY_INFO!$H29=1,COUNTRY_INFO!G29,0)))","v":0},0,{"$f":"IF(INTRO!$E$39=\"Non endémique\",IF(INTRO!$E$37=\"Non endémique\",\"Non requis\",COUNTRY_INFO!V29),\"Traiter avec IVM\")","v":"Traiter avec IVM"},0,0,null,0]
[{"$f":"IF(INTRO!$E$39<>\"Non endémique\", \" \", IF(INTRO!$E$37=\"Non endémique\",\" \", IF(COUNTRY_INFO!A30=0,\" \",COUNTRY_INFO!A30)))","v":" "},{"$f":"IF(INTRO!$E$39<>\"Non endémique\", \" \", IF(INTRO!$E$37=\"Non endémique\",\" \", IF(COUNTRY_INFO!B30=0,\" \",COUNTRY_INFO!B30)))","v":" "},{"$f":"IF(INTRO!$E$39<>\"Non endémique\", \" \", IF(INTRO!$E$37=\"Non endémique\",\" \", IF(COUNTRY_INFO!C30=0,\" \",COUNTRY_INFO!C30)))","v":" "},{"$f":"IF(INTRO!$E$39<>\"Non endémique\", 0, IF(INTRO!$E$37=\"Non endémique\",0,IF(COUNTRY_INFO!$H30=1,COUNTRY_INFO!E30,0)))","v":0},{"$f":"IF(INTRO!$E$39<>\"Non endémique\", 0, IF(INTRO!$E$37=\"Non endémique\",0,IF(COUNTRY_INFO!$H30=1,COUNTRY_INFO!F30,0)))","v":0},{"$f":"IF(INTRO!$E$39<>\"Non endémique\", 0, IF(INTRO!$E$37=\"Non endémique\",0,IF(COUNTRY_INFO!$H30=1,COUNTRY_INFO!G30,0)))","v":0},0,{"$f":"IF(INTRO!$E$39=\"Non endémique\",IF(INTRO!$E$37=\"Non endémique\",\"Non requis\",COUNTRY_INFO!V30),\"Traiter avec IVM\")","v":"Traiter avec IVM"},0,0,null,0]
[{"$f":"IF(INTRO!$E$39<>\"Non endémique\", \" \", IF(INTRO!$E$37=\"Non endémique\",\" \", IF(COUNTRY_INFO!A31=0,\" \",COUNTRY_INFO!A31)))","v":" "},{"$f":"IF(INTRO!$E$39<>\"Non endémique\", \" \", IF(INTRO!$E$37=\"Non endémique\",\" \", IF(COUNTRY_INFO!B31=0,\" \",COUNTRY_INFO!B31)))","v":" "},{"$f":"IF(INTRO!$E$39<>\"Non endémique\", \" \", IF(INTRO!$E$37=\"Non endémique\",\" \", IF(COUNTRY_INFO!C31=0,\" \",COUNTRY_INFO!C31)))","v":" "},{"$f":"IF(INTRO!$E$39<>\"Non endémique\", 0, IF(INTRO!$E$37=\"Non endémique\",0,IF(COUNTRY_INFO!$H31=1,COUNTRY_INFO!E31,0)))","v":0},{"$f":"IF(INTRO!$E$39<>\"Non endémique\", 0, IF(INTRO!$E$37=\"Non endémique\",0,IF(COUNTRY_INFO!$H31=1,COUNTRY_INFO!F31,0)))","v":0},{"$f":"IF(INTRO!$E$39<>\"Non endémique\", 0, IF(INTRO!$E$37=\"Non endémique\",0,IF(COUNTRY_INFO!$H31=1,COUNTRY_INFO!G31,0)))","v":0},0,{"$f":"IF(INTRO!$E$39=\"Non endémique\",IF(INTRO!$E$37=\"Non endémique\",\"Non requis\",COUNTRY_INFO!V31),\"Traiter avec IVM\")","v":"Traiter avec IVM"},0,0,null,0]
[{"$f":"IF(INTRO!$E$39<>\"Non endémique\", \" \", IF(INTRO!$E$37=\"Non endémique\",\" \", IF(COUNTRY_INFO!A32=0,\" \",COUNTRY_INFO!A32)))","v":" "},{"$f":"IF(INTRO!$E$39<>\"Non endémique\", \" \", IF(INTRO!$E$37=\"Non endémique\",\" \", IF(COUNTRY_INFO!B32=0,\" \",COUNTRY_INFO!B32)))","v":" "},{"$f":"IF(INTRO!$E$39<>\"Non endémique\", \" \", IF(INTRO!$E$37=\"Non endémique\",\" \", IF(COUNTRY_INFO!C32=0,\" \",COUNTRY_INFO!C32)))","v":" "},{"$f":"IF(INTRO!$E$39<>\"Non endémique\", 0, IF(INTRO!$E$37=\"Non endémique\",0,IF(COUNTRY_INFO!$H32=1,COUNTRY_INFO!E32,0)))","v":0},{"$f":"IF(INTRO!$E$39<>\"Non endémique\", 0, IF(INTRO!$E$37=\"Non endémique\",0,IF(COUNTRY_INFO!$H32=1,COUNTRY_INFO!F32,0)))","v":0},{"$f":"IF(INTRO!$E$39<>\"Non endémique\", 0, IF(INTRO!$E$37=\"Non endémique\",0,IF(COUNTRY_INFO!$H32=1,COUNTRY_INFO!G32,0)))","v":0},0,{"$f":"IF(INTRO!$E$39=\"Non endémique\",IF(INTRO!$E$37=\"Non endémique\",\"Non requis\",COUNTRY_INFO!V32),\"Traiter avec IVM\")","v":"Traiter avec IVM"},0,0,null,0]
[{"$f":"IF(INTRO!$E$39<>\"Non endémique\", \" \", IF(INTRO!$E$37=\"Non endémique\",\" \", IF(COUNTRY_INFO!A33=0,\" \",COUNTRY_INFO!A33)))","v":" "},{"$f":"IF(INTRO!$E$39<>\"Non endémique\", \" \", IF(INTRO!$E$37=\"Non endémique\",\" \", IF(COUNTRY_INFO!B33=0,\" \",COUNTRY_INFO!B33)))","v":" "},{"$f":"IF(INTRO!$E$39<>\"Non endémique\", \" \", IF(INTRO!$E$37=\"Non endémique\",\" \", IF(COUNTRY_INFO!C33=0,\" \",COUNTRY_INFO!C33)))","v":" "},{"$f":"IF(INTRO!$E$39<>\"Non endémique\", 0, IF(INTRO!$E$37=\"Non endémique\",0,IF(COUNTRY_INFO!$H33=1,COUNTRY_INFO!E33,0)))","v":0},{"$f":"IF(INTRO!$E$39<>\"Non endémique\", 0, IF(INTRO!$E$37=\"Non endémique\",0,IF(COUNTRY_INFO!$H33=1,COUNTRY_INFO!F33,0)))","v":0},{"$f":"IF(INTRO!$E$39<>\"Non endémique\", 0, IF(INTRO!$E$37=\"Non endémique\",0,IF(COUNTRY_INFO!$H33=1,COUNTRY_INFO!G33,0)))","v":0},0,{"$f":"IF(INTRO!$E$39=\"Non endémique\",IF(INTRO!$E$37=\"Non endémique\",\"Non requis\",COUNTRY_INFO!V33),\"Traiter avec IVM\")","v":"Traiter avec IVM"},0,0,null,0]
[{"$f":"IF(INTRO!$E$39<>\"Non endémique\", \" \", IF(INTRO!$E$37=\"Non endémique\",\" \", IF(COUNTRY_INFO!A34=0,\" \",COUNTRY_INFO!A34)))","v":" "},{"$f":"IF(INTRO!$E$39<>\"Non endémique\", \" \", IF(INTRO!$E$37=\"Non endémique\",\" \", IF(COUNTRY_INFO!B34=0,\" \",COUNTRY_INFO!B34)))","v":" "},{"$f":"IF(INTRO!$E$39<>\"Non endémique\", \" \", IF(INTRO!$E$37=\"Non endémique\",\" \", IF(COUNTRY_INFO!C34=0,\" \",COUNTRY_INFO!C34)))","v":" "},{"$f":"IF(INTRO!$E$39<>\"Non endémique\", 0, IF(INTRO!$E$37=\"Non endémique\",0,IF(COUNTRY_INFO!$H34=1,COUNTRY_INFO!E34,0)))","v":0},{"$f":"IF(INTRO!$E$39<>\"Non endémique\", 0, IF(INTRO!$E$37=\"Non endémique\",0,IF(COUNTRY_INFO!$H34=1,COUNTRY_INFO!F34,0)))","v":0},{"$f":"IF(INTRO!$E$39<>\"Non endémique\", 0, IF(INTRO!$E$37=\"Non endémique\",0,IF(COUNTRY_INFO!$H34=1,COUNTRY_INFO!G34,0)))","v":0},0,{"$f":"IF(INTRO!$E$39=\"Non endémique\",IF(INTRO!$E$37=\"Non endémique\",\"Non requis\",COUNTRY_INFO!V34),\"Traiter avec IVM\")","v":"Traiter avec IVM"},0,0,null,0]
[{"$f":"IF(INTRO!$E$39<>\"Non endémique\", \" \", IF(INTRO!$E$37=\"Non endémique\",\" \", IF(COUNTRY_INFO!A35=0,\" \",COUNTRY_INFO!A35)))","v":" "},{"$f":"IF(INTRO!$E$39<>\"Non endémique\", \" \", IF(INTRO!$E$37=\"Non endémique\",\" \", IF(COUNTRY_INFO!B35=0,\" \",COUNTRY_INFO!B35)))","v":" "},{"$f":"IF(INTRO!$E$39<>\"Non endémique\", \" \", IF(INTRO!$E$37=\"Non endémique\",\" \", IF(COUNTRY_INFO!C35=0,\" \",COUNTRY_INFO!C35)))","v":" "},{"$f":"IF(INTRO!$E$39<>\"Non endémique\", 0, IF(INTRO!$E$37=\"Non endémique\",0,IF(COUNTRY_INFO!$H35=1,COUNTRY_INFO!E35,0)))","v":0},{"$f":"IF(INTRO!$E$39<>\"Non endémique\", 0, IF(INTRO!$E$37=\"Non endémique\",0,IF(COUNTRY_INFO!$H35=1,COUNTRY_INFO!F35,0)))","v":0},{"$f":"IF(INTRO!$E$39<>\"Non endémique\", 0, IF(INTRO!$E$37=\"Non endémique\",0,IF(COUNTRY_INFO!$H35=1,COUNTRY_INFO!G35,0)))","v":0},0,{"$f":"IF(INTRO!$E$39=\"Non endémique\",IF(INTRO!$E$37=\"Non endémique\",\"Non requis\",COUNTRY_INFO!V35),\"Traiter avec IVM\")","v":"Traiter avec IVM"},0,0,null,0]
[{"$f":"IF(INTRO!$E$39<>\"Non endémique\", \" \", IF(INTRO!$E$37=\"Non endémique\",\" \", IF(COUNTRY_INFO!A36=0,\" \",COUNTRY_INFO!A36)))","v":" "},{"$f":"IF(INTRO!$E$39<>\"Non endémique\", \" \", IF(INTRO!$E$37=\"Non endémique\",\" \", IF(COUNTRY_INFO!B36=0,\" \",COUNTRY_INFO!B36)))","v":" "},{"$f":"IF(INTRO!$E$39<>\"Non endémique\", \" \", IF(INTRO!$E$37=\"Non endémique\",\" \", IF(COUNTRY_INFO!C36=0,\" \",COUNTRY_INFO!C36)))","v":" "},{"$f":"IF(INTRO!$E$39<>\"Non endémique\", 0, IF(INTRO!$E$37=\"Non endémique\",0,IF(COUNTRY_INFO!$H36=1,COUNTRY_INFO!E36,0)))","v":0},{"$f":"IF(INTRO!$E$39<>\"Non endémique\", 0, IF(INTRO!$E$37=\"Non endémique\",0,IF(COUNTRY_INFO!$H36=1,COUNTRY_INFO!F36,0)))","v":0},{"$f":"IF(INTRO!$E$39<>\"Non endémique\", 0, IF(INTRO!$E$37=\"Non endémique\",0,IF(COUNTRY_INFO!$H36=1,COUNTRY_INFO!G36,0)))","v":0},0,{"$f":"IF(INTRO!$E$39=\"Non endémique\",IF(INTRO!$E$37=\"Non endémique\",\"Non requis\",COUNTRY_INFO!V36),\"Traiter avec IVM\")","v":"Traiter avec IVM"},0,0,null,0]
[{"$f":"IF(INTRO!$E$39<>\"Non endémique\", \" \", IF(INTRO!$E$37=\"Non endémique\",\" \", IF(COUNTRY_INFO!A37=0,\" \",COUNTRY_INFO!A37)))","v":" "},{"$f":"IF(INTRO!$E$39<>\"Non endémique\", \" \", IF(INTRO!$E$37=\"Non endémique\",\" \", IF(COUNTRY_INFO!B37=0,\" \",COUNTRY_INFO!B37)))","v":" "},{"$f":"IF(INTRO!$E$39<>\"Non endémique\", \" \", IF(INTRO!$E$37=\"Non endémique\",\" \", IF(COUNTRY_INFO!C37=0,\" \",COUNTRY_INFO!C37)))","v":" "},{"$f":"IF(INTRO!$E$39<>\"Non endémique\", 0, IF(INTRO!$E$37=\"Non endémique\",0,IF(COUNTRY_INFO!$H37=1,COUNTRY_INFO!E37,0)))","v":0},{"$f":"IF(INTRO!$E$39<>\"Non endémique\", 0, IF(INTRO!$E$37=\"Non endémique\",0,IF(COUNTRY_INFO!$H37=1,COUNTRY_INFO!F37,0)))","v":0},{"$f":"IF(INTRO!$E$39<>\"Non endémique\", 0, IF(INTRO!$E$37=\"Non endémique\",0,IF(COUNTRY_INFO!$H37=1,COUNTRY_INFO!G37,0)))","v":0},0,{"$f":"IF(INTRO!$E$39=\"Non endémique\",IF(INTRO!$E$37=\"Non endémique\",\"Non requis\",COUNTRY_INFO!V37),\"Traiter avec IVM\")","v":"Traiter avec IVM"},0,0,null,0]
[{"$f":"IF(INTRO!$E$39<>\"Non endémique\", \" \", IF(INTRO!$E$37=\"Non endémique\",\" \", IF(COUNTRY_INFO!A38=0,\" \",COUNTRY_INFO!A38)))","v":" "},{"$f":"IF(INTRO!$E$39<>\"Non endémique\", \" \", IF(INTRO!$E$37=\"Non endémique\",\" \", IF(COUNTRY_INFO!B38=0,\" \",COUNTRY_INFO!B38)))","v":" "},{"$f":"IF(INTRO!$E$39<>\"Non endémique\", \" \", IF(INTRO!$E$37=\"Non endémique\",\" \", IF(COUNTRY_INFO!C38=0,\" \",COUNTRY_INFO!C38)))","v":" "},{"$f":"IF(INTRO!$E$39<>\"Non endémique\", 0, IF(INTRO!$E$37=\"Non endémique\",0,IF(COUNTRY_INFO!$H38=1,COUNTRY_INFO!E38,0)))","v":0},{"$f":"IF(INTRO!$E$39<>\"Non endémique\", 0, IF(INTRO!$E$37=\"Non endémique\",0,IF(COUNTRY_INFO!$H38=1,COUNTRY_INFO!F38,0)))","v":0},{"$f":"IF(INTRO!$E$39<>\"Non endémique\", 0, IF(INTRO!$E$37=\"Non endémique\",0,IF(COUNTRY_INFO!$H38=1,COUNTRY_INFO!G38,0)))","v":0},0,{"$f":"IF(INTRO!$E$39=\"Non endémique\",IF(INTRO!$E$37=\"Non endémique\",\"Non requis\",COUNTRY_INFO!V38),\"Traiter avec IVM\")","v":"Traiter avec IVM"},0,0,null,0]
[{"$f":"IF(INTRO!$E$39<>\"Non endémique\", \" \", IF(INTRO!$E$37=\"Non endémique\",\" \", IF(COUNTRY_INFO!A39=0,\" \",COUNTRY_INFO!A39)))","v":" "},{"$f":"IF(INTRO!$E$39<>\"Non endémique\", \" \", IF(INTRO!$E$37=\"Non endémique\",\" \", IF(COUNTRY_INFO!B39=0,\" \",COUNTRY_INFO!B39)))","v":" "},{"$f":"IF(INTRO!$E$39<>\"Non endémique\", \" \", IF(INTRO!$E$37=\"Non endémique\",\" \", IF(COUNTRY_INFO!C39=0,\" \",COUNTRY_INFO!C39)))","v":" "},{"$f":"IF(INTRO!$E$39<>\"Non endémique\", 0, IF(INTRO!$E$37=\"Non endémique\",0,IF(COUNTRY_INFO!$H39=1,COUNTRY_INFO!E39,0)))","v":0},{"$f":"IF(INTRO!$E$39<>\"Non endémique\", 0, IF(INTRO!$E$37=\"Non endémique\",0,IF(COUNTRY_INFO!$H39=1,COUNTRY_INFO!F39,0)))","v":0},{"$f":"IF(INTRO!$E$39<>\"Non endémique\", 0, IF(INTRO!$E$37=\"Non endémique\",0,IF(COUNTRY_INFO!$H39=1,COUNTRY_INFO!G39,0)))","v":0},0,{"$f":"IF(INTRO!$E$39=\"Non endémique\",IF(INTRO!$E$37=\"Non endémique\",\"Non requis\",COUNTRY_INFO!V39),\"Traiter avec IVM\")","v":"Traiter avec IVM"},0,0,null,0]
[{"$f":"IF(INTRO!$E$39<>\"Non endémique\", \" \", IF(INTRO!$E$37=\"Non endémique\",\" \", IF(COUNTRY_INFO!A40=0,\" \",COUNTRY_INFO!A40)))","v":" "},{"$f":"IF(INTRO!$E$39<>\"Non endémique\", \" \", IF(INTRO!$E$37=\"Non endémique\",\" \", IF(COUNTRY_INFO!B40=0,\" \",COUNTRY_INFO!B40)))","v":" "},{"$f":"IF(INTRO!$E$39<>\"Non endémique\", \" \", IF(INTRO!$E$37=\"Non endémique\",\" \", IF(COUNTRY_INFO!C40=0,\" \",COUNTRY_INFO!C40)))","v":" "},{"$f":"IF(INTRO!$E$39<>\"Non endémique\", 0, IF(INTRO!$E$37=\"Non endémique\",0,IF(COUNTRY_INFO!$H40=1,COUNTRY_INFO!E40,0)))","v":0},{"$f":"IF(INTRO!$E$39<>\"Non endémique\", 0, IF(INTRO!$E$37=\"Non endémique\",0,IF(COUNTRY_INFO!$H40=1,COUNTRY_INFO!F40,0)))","v":0},{"$f":"IF(INTRO!$E$39<>\"Non endémique\", 0, IF(INTRO!$E$37=\"Non endémique\",0,IF(COUNTRY_INFO!$H40=1,COUNTRY_INFO!G40,0)))","v":0},0,{"$f":"IF(INTRO!$E$39=\"Non endémique\",IF(INTRO!$E$37=\"Non endémique\",\"Non requis\",COUNTRY_INFO!V40),\"Traiter avec IVM\")","v":"Traiter avec IVM"},0,0,null,0]
[{"$f":"IF(INTRO!$E$39<>\"Non endémique\", \" \", IF(INTRO!$E$37=\"Non endémique\",\" \", IF(COUNTRY_INFO!A41=0,\" \",COUNTRY_INFO!A41)))","v":" "},{"$f":"IF(INTRO!$E$39<>\"Non endémique\", \" \", IF(INTRO!$E$37=\"Non endémique\",\" \", IF(COUNTRY_INFO!B41=0,\" \",COUNTRY_INFO!B41)))","v":" "},{"$f":"IF(INTRO!$E$39<>\"Non endémique\", \" \", IF(INTRO!$E$37=\"Non endémique\",\" \", IF(COUNTRY_INFO!C41=0,\" \",COUNTRY_INFO!C41)))","v":" "},{"$f":"IF(INTRO!$E$39<>\"Non endémique\", 0, IF(INTRO!$E$37=\"Non endémique\",0,IF(COUNTRY_INFO!$H41=1,COUNTRY_INFO!E41,0)))","v":0},{"$f":"IF(INTRO!$E$39<>\"Non endémique\", 0, IF(INTRO!$E$37=\"Non endémique\",0,IF(COUNTRY_INFO!$H41=1,COUNTRY_INFO!F41,0)))","v":0},{"$f":"IF(INTRO!$E$39<>\"Non endémique\", 0, IF(INTRO!$E$37=\"Non endémique\",0,IF(COUNTRY_INFO!$H41=1,COUNTRY_INFO!G41,0)))","v":0},0,{"$f":"IF(INTRO!$E$39=\"Non endémique\",IF(INTRO!$E$37=\"Non endémique\",\"Non requis\",COUNTRY_INFO!V41),\"Traiter avec IVM\")","v":"Traiter avec IVM"},0,0,null,0]
[{"$f":"IF(INTRO!$E$39<>\"Non endémique\", \" \", IF(INTRO!$E$37=\"Non endémique\",\" \", IF(COUNTRY_INFO!A42=0,\" \",COUNTRY_INFO!A42)))","v":" "},{"$f":"IF(INTRO!$E$39<>\"Non endémique\", \" \", IF(INTRO!$E$37=\"Non endémique\",\" \", IF(COUNTRY_INFO!B42=0,\" \",COUNTRY_INFO!B42)))","v":" "},{"$f":"IF(INTRO!$E$39<>\"Non endémique\", \" \", IF(INTRO!$E$37=\"Non endémique\",\" \", IF(COUNTRY_INFO!C42=0,\" \",COUNTRY_INFO!C42)))","v":" "},{"$f":"IF(INTRO!$E$39<>\"Non endémique\", 0, IF(INTRO!$E$37=\"Non endémique\",0,IF(COUNTRY_INFO!$H42=1,COUNTRY_INFO!E42,0)))","v":0},{"$f":"IF(INTRO!$E$39<>\"Non endémique\", 0, IF(INTRO!$E$37=\"Non endémique\",0,IF(COUNTRY_INFO!$H42=1,COUNTRY_INFO!F42,0)))","v":0},{"$f":"IF(INTRO!$E$39<>\"Non endémique\", 0, IF(INTRO!$E$37=\"Non endémique\",0,IF(COUNTRY_INFO!$H42=1,COUNTRY_INFO!G42,0)))","v":0},0,{"$f":"IF(INTRO!$E$39=\"Non endémique\",IF(INTRO!$E$37=\"Non endémique\",\"Non requis\",COUNTRY_INFO!V42),\"Traiter avec IVM\")","v":"Traiter avec IVM"},0,0,null,0]
[{"$f":"IF(INTRO!$E$39<>\"Non endémique\", \" \", IF(INTRO!$E$37=\"Non endémique\",\" \", IF(COUNTRY_INFO!A43=0,\" \",COUNTRY_INFO!A43)))","v":" "},{"$f":"IF(INTRO!$E$39<>\"Non endémique\", \" \", IF(INTRO!$E$37=\"Non endémique\",\" \", IF(COUNTRY_INFO!B43=0,\" \",COUNTRY_INFO!B43)))","v":" "},{"$f":"IF(INTRO!$E$39<>\"Non endémique\", \" \", IF(INTRO!$E$37=\"Non endémique\",\" \", IF(COUNTRY_INFO!C43=0,\" \",COUNTRY_INFO!C43)))","v":" "},{"$f":"IF(INTRO!$E$39<>\"Non endémique\", 0, IF(INTRO!$E$37=\"Non endémique\",0,IF(COUNTRY_INFO!$H43=1,COUNTRY_INFO!E43,0)))","v":0},{"$f":"IF(INTRO!$E$39<>\"Non endémique\", 0, IF(INTRO!$E$37=\"Non endémique\",0,IF(COUNTRY_INFO!$H43=1,COUNTRY_INFO!F43,0)))","v":0},{"$f":"IF(INTRO!$E$39<>\"Non endémique\", 0, IF(INTRO!$E$37=\"Non endémique\",0,IF(COUNTRY_INFO!$H43=1,COUNTRY_INFO!G43,0)))","v":0},0,{"$f":"IF(INTRO!$E$39=\"Non endémique\",IF(INTRO!$E$37=\"Non endémique\",\"Non requis\",COUNTRY_INFO!V43),\"Traiter avec IVM\")","v":"Traiter avec IVM"},0,0,null,0]
[{"$f":"IF(INTRO!$E$39<>\"Non endémique\", \" \", IF(INTRO!$E$37=\"Non endémique\",\" \", IF(COUNTRY_INFO!A44=0,\" \",COUNTRY_INFO!A44)))","v":" "},{"$f":"IF(INTRO!$E$39<>\"Non endémique\", \" \", IF(INTRO!$E$37=\"Non endémique\",\" \", IF(COUNTRY_INFO!B44=0,\" \",COUNTRY_INFO!B44)))","v":" "},{"$f":"IF(INTRO!$E$39<>\"Non endémique\", \" \", IF(INTRO!$E$37=\"Non endémique\",\" \", IF(COUNTRY_INFO!C44=0,\" \",COUNTRY_INFO!C44)))","v":" "},{"$f":"IF(INTRO!$E$39<>\"Non endémique\", 0, IF(INTRO!$E$37=\"Non endémique\",0,IF(COUNTRY_INFO!$H44=1,COUNTRY_INFO!E44,0)))","v":0},{"$f":"IF(INTRO!$E$39<>\"Non endémique\", 0, IF(INTRO!$E$37=\"Non endémique\",0,IF(COUNTRY_INFO!$H44=1,COUNTRY_INFO!F44,0)))","v":0},{"$f":"IF(INTRO!$E$39<>\"Non endémique\", 0, IF(INTRO!$E$37=\"Non endémique\",0,IF(COUNTRY_INFO!$H44=1,COUNTRY_INFO!G44,0)))","v":0},0,{"$f":"IF(INTRO!$E$39=\"Non endémique\",IF(INTRO!$E$37=\"Non endémique\",\"Non requis\",COUNTRY_INFO!V44),\"Traiter avec IVM\")","v":"Traiter avec IVM"},0,0,null,0]
[{"$f":"IF(INTRO!$E$39<>\"Non endémique\", \" \", IF(INTRO!$E$37=\"Non endémique\",\" \", IF(COUNTRY_INFO!A45=0,\" \",COUNTRY_INFO!A45)))","v":" "},{"$f":"IF(INTRO!$E$39<>\"Non endémique\", \" \", IF(INTRO!$E$37=\"Non endémique\",\" \", IF(COUNTRY_INFO!B45=0,\" \",COUNTRY_INFO!B45)))","v":" "},{"$f":"IF(INTRO!$E$39<>\"Non endémique\", \" \", IF(INTRO!$E$37=\"Non endémique\",\" \", IF(COUNTRY_INFO!C45=0,\" \",COUNTRY_INFO!C45)))","v":" "},{"$f":"IF(INTRO!$E$39<>\"Non endémique\", 0, IF(INTRO!$E$37=\"Non endémique\",0,IF(COUNTRY_INFO!$H45=1,COUNTRY_INFO!E45,0)))","v":0},{"$f":"IF(INTRO!$E$39<>\"Non endémique\", 0, IF(INTRO!$E$37=\"Non endémique\",0,IF(COUNTRY_INFO!$H45=1,COUNTRY_INFO!F45,0)))","v":0},{"$f":"IF(INTRO!$E$39<>\"Non endémique\", 0, IF(INTRO!$E$37=\"Non endémique\",0,IF(COUNTRY_INFO!$H45=1,COUNTRY_INFO!G45,0)))","v":0},0,{"$f":"IF(INTRO!$E$39=\"Non endémique\",IF(INTRO!$E$37=\"Non endémique\",\"Non requis\",COUNTRY_INFO!V45),\"Traiter avec IVM\")","v":"Traiter avec IVM"},0,0,null,0]
[{"$f":"IF(INTRO!$E$39<>\"Non endémique\", \" \", IF(INTRO!$E$37=\"Non endémique\",\" \", IF(COUNTRY_INFO!A46=0,\" \",COUNTRY_INFO!A46)))","v":" "},{"$f":"IF(INTRO!$E$39<>\"Non endémique\", \" \", IF(INTRO!$E$37=\"Non endémique\",\" \", IF(COUNTRY_INFO!B46=0,\" \",COUNTRY_INFO!B46)))","v":" "},{"$f":"IF(INTRO!$E$39<>\"Non endémique\", \" \", IF(INTRO!$E$37=\"Non endémique\",\" \", IF(COUNTRY_INFO!C46=0,\" \",COUNTRY_INFO!C46)))","v":" "},{"$f":"IF(INTRO!$E$39<>\"Non endémique\", 0, IF(INTRO!$E$37=\"Non endémique\",0,IF(COUNTRY_INFO!$H46=1,COUNTRY_INFO!E46,0)))","v":0},{"$f":"IF(INTRO!$E$39<>\"Non endémique\", 0, IF(INTRO!$E$37=\"Non endémique\",0,IF(COUNTRY_INFO!$H46=1,COUNTRY_INFO!F46,0)))","v":0},{"$f":"IF(INTRO!$E$39<>\"Non endémique\", 0, IF(INTRO!$E$37=\"Non endémique\",0,IF(COUNTRY_INFO!$H46=1,COUNTRY_INFO!G46,0)))","v":0},0,{"$f":"IF(INTRO!$E$39=\"Non endémique\",IF(INTRO!$E$37=\"Non endémique\",\"Non requis\",COUNTRY_INFO!V46),\"Traiter avec IVM\")","v":"Traiter avec IVM"},0,0,null,0]
[{"$f":"IF(INTRO!$E$39<>\"Non endémique\", \" \", IF(INTRO!$E$37=\"Non endémique\",\" \", IF(COUNTRY_INFO!A47=0,\" \",COUNTRY_INFO!A47)))","v":" "},{"$f":"IF(INTRO!$E$39<>\"Non endémique\", \" \", IF(INTRO!$E$37=\"Non endémique\",\" \", IF(COUNTRY_INFO!B47=0,\" \",COUNTRY_INFO!B47)))","v":" "},{"$f":"IF(INTRO!$E$39<>\"Non endémique\", \" \", IF(INTRO!$E$37=\"Non endémique\",\" \", IF(COUNTRY_INFO!C47=0,\" \",COUNTRY_INFO!C47)))","v":" "},{"$f":"IF(INTRO!$E$39<>\"Non endémique\", 0, IF(INTRO!$E$37=\"Non endémique\",0,IF(COUNTRY_INFO!$H47=1,COUNTRY_INFO!E47,0)))","v":0},{"$f":"IF(INTRO!$E$39<>\"Non endémique\", 0, IF(INTRO!$E$37=\"Non endémique\",0,IF(COUNTRY_INFO!$H47=1,COUNTRY_INFO!F47,0)))","v":0},{"$f":"IF(INTRO!$E$39<>\"Non endémique\", 0, IF(INTRO!$E$37=\"Non endémique\",0,IF(COUNTRY_INFO!$H47=1,COUNTRY_INFO!G47,0)))","v":0},0,{"$f":"IF(INTRO!$E$39=\"Non endémique\",IF(INTRO!$E$37=\"Non endémique\",\"Non requis\",COUNTRY_INFO!V47),\"Traiter avec IVM\")","v":"Traiter avec IVM"},0,0,null,0]
[{"$f":"IF(INTRO!$E$39<>\"Non endémique\", \" \", IF(INTRO!$E$37=\"Non endémique\",\" \", IF(COUNTRY_INFO!A48=0,\" \",COUNTRY_INFO!A48)))","v":" "},{"$f":"IF(INTRO!$E$39<>\"Non endémique\", \" \", IF(INTRO!$E$37=\"Non endémique\",\" \", IF(COUNTRY_INFO!B48=0,\" \",COUNTRY_INFO!B48)))","v":" "},{"$f":"IF(INTRO!$E$39<>\"Non endémique\", \" \", IF(INTRO!$E$37=\"Non endémique\",\" \", IF(COUNTRY_INFO!C48=0,\" \",COUNTRY_INFO!C48)))","v":" "},{"$f":"IF(INTRO!$E$39<>\"Non endémique\", 0, IF(INTRO!$E$37=\"Non endémique\",0,IF(COUNTRY_INFO!$H48=1,COUNTRY_INFO!E48,0)))","v":0},{"$f":"IF(INTRO!$E$39<>\"Non endémique\", 0, IF(INTRO!$E$37=\"Non endémique\",0,IF(COUNTRY_INFO!$H48=1,COUNTRY_INFO!F48,0)))","v":0},{"$f":"IF(INTRO!$E$39<>\"Non endémique\", 0, IF(INTRO!$E$37=\"Non endémique\",0,IF(COUNTRY_INFO!$H48=1,COUNTRY_INFO!G48,0)))","v":0},0,{"$f":"IF(INTRO!$E$39=\"Non endémique\",IF(INTRO!$E$37=\"Non endémique\",\"Non requis\",COUNTRY_INFO!V48),\"Traiter avec IVM\")","v":"Traiter avec IVM"},0,0,null,0]

{"sheet":"ALB_MBD","index":3,"n_rows":48,"n_cols":21,"rows_kept":48,"cut":false,"hidden":false,"merged":[[6,9,6,10],[6,11,7,11],[0,6,0,10],[1,6,1,7],[1,9,1,10],[5,6,5,11],[6,6,6,7],[3,0,3,2],[3,3,3,4],[5,0,5,2],[5,3,5,4],[5,5,7,5],[6,0,7,0],[6,1,7,1],[6,2,7,2],[6,3,7,3],[6,4,7,4],[5,12,5,17],[6,20,7,20],[5,18,5,20],[6,18,7,18],[6,19,7,19],[6,16,7,16],[6,17,7,17],[6,15,7,15],[6,12,7,12],[6,13,7,13],[6,14,7,14]]}
["Albendazole (ALB) et Mebendazole (MBD)",null,null,null,null,null,"Choisir le médicament pour le traitement de STH \npour chaque groupe d'âge"]
["Structure administrative, population ciblée par groupe d'âge, plan de traitement et information sur les comprimés",null,null,null,null,null,"ALB",null,"ALB","ALB"]
[]
["TOTAL",null,null,null,null,{"$f":"SUBTOTAL(9,F$10:F$1010)","v":0},null,{"$f":"SUBTOTAL(9,H$10:H$1010)","v":1568492},2940924,null,623346,5132762,0,0,0,5132762,0,5132762,0,0,0]
[]
["Structure administrative du pays",null,null,"Plan de traitement",null,"Population couverte par le PEFL avec ALB","Population cible pour STH",null,null,null,null,null,"Albendazole (ALB)",null,null,null,null,null,"Mebendazole (MBD)"]
["Pays","Région/Département","District","FL","STH",null,"EAPréS",null,"EAS","FAP",null,"Total","Total requis (FL)","Reste en stock (FL)","Comprimés devant être fournis (FL)","Total requis (STH)","Reste en stock (STH)","Comprimés devant être fournis (STH)","Total requis","Reste en stock","Comprimés devant être fournis"]
[null,null,null,null,null,null,"Tournées","Personnes","Personnes","Tournées","Personnes"]
[]
[{"$f":"IF(AND(INTRO!$E$37=\"Non endémique\",INTRO!$E$41=\"Non endémique\"),\" \",IF(COUNTRY_INFO!A10=0,\" \",COUNTRY_INFO!A10))","v":"TOGO"},{"$f":"IF(AND(INTRO!$E$37=\"Non endémique\",INTRO!$E$41=\"Non endémique\"),\" \",IF(COUNTRY_INFO!B10=0,\" \",COUNTRY_INFO!B10))","v":"CENTRALE"},{"$f":"IF(AND(INTRO!$E$37=\"Non endémique\",INTRO!$E$41=\"Non endémique\"),\" \",IF(COUNTRY_INFO!C10=0,\" \",COUNTRY_INFO!C10))","v":"BLITTA"},{"$f":"IF(AND(INTRO!$E$37=\"Non endémique\",INTRO!$E$41=\"Non endémique\"),0,COUNTRY_INFO!V10)","v":0},{"$f":"IF(AND(INTRO!$E$37=\"Non endémique\",INTRO!$E$41=\"Non endémique\"),0,COUNTRY_INFO!X10)","v":1},{"$f":"IF(INTRO!$E$39=\"Non endémique\",IF($D10=1,DEC!I10,0),IF($D10=1,IVM!G10,0))","v":0},1,{"$f":"IF(OR(COUNTRY_INFO!N10=\"Inconnu\",COUNTRY_INFO!N10=\"Surveillance\",COUNTRY_INFO!N10=\"Non requis\",COUNTRY_INFO!N10=0),0,IF(INTRO!$E$39=\"Non endémique\",IF(AND($E10<>0,$G10=\"\"),IF($F10=0,COUNTRY_INFO!N10*$E10,COUNTRY_INFO!N10*($E10-$D10)),IF(AND($E10<>0,$G10<>0),IF($F10=0,COUNTRY_INFO!N10*$G10,COUNTRY_INFO!N10*($G10-$D10)),0)),IF($G10=\"\",COUNTRY_INFO!N10*$E10,COUNTRY_INFO!N10*$G10)))","v":27339},{"$f":"IF(OR(COUNTRY_INFO!O10=\"Inconnu\",COUNTRY_INFO!O10=\"Surveillance\",COUNTRY_INFO!O10=\"Non requis\",COUNTRY_INFO!O10=0),0,IF($E10<>0, IF($F10=0,COUNTRY_INFO!O10*$E10,COUNTRY_INFO!O10*($E10-$D10)),COUNTRY_INFO!O10*$E10))","v":51261},0,{"$f":"IF(OR(COUNTRY_INFO!P10=\"Inconnu\",COUNTRY_INFO!P10=\"Surveillance\",COUNTRY_INFO!P10=\"Non requis\",COUNTRY_INFO!P10=0),0,IF(AND($E10<>0,$J10=\"\"),IF($F10=0,COUNTRY_INFO!P10*$E10,COUNTRY_INFO!P10*($E10-$D10)), IF(AND($E10<>0,$J10<>0),IF($F10=0,COUNTRY_INFO!P10*$J10,COUNTRY_INFO!P10*($J10-$D10)), COUNTRY_INFO!P10*$J10)))","v":0},{"$f":"ROUND($H10,0)+ROUND($I10,0)+ROUND($K10,0)","v":78600},{"$f":"$F10","v":0},null,{"$f":"IF($M10>$N10, $M10-$N10,0)","v":0},{"$f":"ROUND((IF($G$2=\"ALB\",$H10,0)+IF($I$2=\"ALB\",$I10,0)+IF($J$2=\"ALB\",$K10,0)),0)","v":78600},null,{"$f":"IF($P10>$Q10,$P10-$Q10,0)","v":78600},{"$f":"ROUND((IF($G$2=\"MBD\",$H10,0)+IF($I$2=\"MBD\",$I10,0)+IF($J$2=\"MBD\",$K10,0)),0)","v":0},null,{"$f":"IF($S10>$T10,$S10-$T10,0)","v":0}]
[{"$f":"IF(AND(INTRO!$E$37=\"Non endémique\",INTRO!$E$41=\"Non endémique\"),\" \",IF(COUNTRY_INFO!A11=0,\" \",COUNTRY_INFO!A11))","v":"TOGO"},{"$f":"IF(AND(INTRO!$E$37=\"Non endémique\",INTRO!$E$41=\"Non endémique\"),\" \",IF(COUNTRY_INFO!B11=0,\" \",COUNTRY_INFO!B11))","v":"CENTRALE"},{"$f":"IF(AND(INTRO!$E$37=\"Non endémique\",INTRO!$E$41=\"Non endémique\"),\" \",IF(COUNTRY_INFO!C11=0,\" \",COUNTRY_INFO!C11))","v":"MÔ"},{"$f":"IF(AND(INTRO!$E$37=\"Non endémique\",INTRO!$E$41=\"Non endémique\"),0,COUNTRY_INFO!V11)","v":0},{"$f":"IF(AND(INTRO!$E$37=\"Non endémique\",INTRO!$E$41=\"Non endémique\"),0,COUNTRY_INFO!X11)","v":1},{"$f":"IF(INTRO!$E$39=\"Non endémique\",IF($D11=1,DEC!I11,0),IF($D11=1,IVM!G11,0))","v":0},1,{"$f":"IF(OR(COUNTRY_INFO!N11=\"Inconnu\",COUNTRY_INFO!N11=\"Surveillance\",COUNTRY_INFO!N11=\"Non requis\",COUNTRY_INFO!N11=0),0,IF(INTRO!$E$39=\"Non endémique\",IF(AND($E11<>0,$G11=\"\"),IF($F11=0,COUNTRY_INFO!N11*$E11,COUNTRY_INFO!N11*($E11-$D11)),IF(AND($E11<>0,$G11<>0),IF($F11=0,COUNTRY_INFO!N11*$G11,COUNTRY_INFO!N11*($G11-$D11)),0)),IF($G11=\"\",COUNTRY_INFO!N11*$E11,COUNTRY_INFO!N11*$G11)))","v":8782},{"$f":"IF(OR(COUNTRY_INFO!O11=\"Inconnu\",COUNTRY_INFO!O11=\"Surveillance\",COUNTRY_INFO!O11=\"Non requis\",COUNTRY_INFO!O11=0),0,IF($E11<>0, IF($F11=0,COUNTRY_INFO!O11*$E11,COUNTRY_INFO!O11*($E11-$D11)),COUNTRY_INFO!O11*$E11))","v":16466},0,{"$f":"IF(OR(COUNTRY_INFO!P11=\"Inconnu\",COUNTRY_INFO!P11=\"Surveillance\",COUNTRY_INFO!P11=\"Non requis\",COUNTRY_INFO!P11=0),0,IF(AND($E11<>0,$J11=\"\"),IF($F11=0,COUNTRY_INFO!P11*$E11,COUNTRY_INFO!P11*($E11-$D11)), IF(AND($E11<>0,$J11<>0),IF($F11=0,COUNTRY_INFO!P11*$J11,COUNTRY_INFO!P11*($J11-$D11)), COUNTRY_INFO!P11*$J11)))","v":0},25248,0,null,0,25248,null,25248,0,null,0]
[{"$f":"IF(AND(INTRO!$E$37=\"Non endémique\",INTRO!$E$41=\"Non endémique\"),\" \",IF(COUNTRY_INFO!A12=0,\" \",COUNTRY_INFO!A12))","v":"TOGO"},{"$f":"IF(AND(INTRO!$E$37=\"Non endémique\",INTRO!$E$41=\"Non endémique\"),\" \",IF(COUNTRY_INFO!B12=0,\" \",COUNTRY_INFO!B12))","v":"CENTRALE"},{"$f":"IF(AND(INTRO!$E$37=\"Non endémique\",INTRO!$E$41=\"Non endémique\"),\" \",IF(COUNTRY_INFO!C12=0,\" \",COUNTRY_INFO!C12))","v":"SOTOUBOUA"},{"$f":"IF(AND(INTRO!$E$37=\"Non endémique\",INTRO!$E$41=\"Non endémique\"),0,COUNTRY_INFO!V12)","v":0},{"$f":"IF(AND(INTRO!$E$37=\"Non endémique\",INTRO!$E$41=\"Non endémique\"),0,COUNTRY_INFO!X12)","v":1},{"$f":"IF(INTRO!$E$39=\"Non endémique\",IF($D12=1,DEC!I12,0),IF($D12=1,IVM!G12,0))","v":0},1,{"$f":"IF(OR(COUNTRY_INFO!N12=\"Inconnu\",COUNTRY_INFO!N12=\"Surveillance\",COUNTRY_INFO!N12=\"Non requis\",COUNTRY_INFO!N12=0),0,IF(INTRO!$E$39=\"Non endémique\",IF(AND($E12<>0,$G12=\"\"),IF($F12=0,COUNTRY_INFO!N12*$E12,COUNTRY_INFO!N12*($E12-$D12)),IF(AND($E12<>0,$G12<>0),IF($F12=0,COUNTRY_INFO!N12*$G12,COUNTRY_INFO!N12*($G12-$D12)),0)),IF($G12=\"\",COUNTRY_INFO!N12*$E12,COUNTRY_INFO!N12*$G12)))","v":23252},{"$f":"IF(OR(COUNTRY_INFO!O12=\"Inconnu\",COUNTRY_INFO!O12=\"Surveillance\",COUNTRY_INFO!O12=\"Non requis\",COUNTRY_INFO!O12=0),0,IF($E12<>0, IF($F12=0,COUNTRY_INFO!O12*$E12,COUNTRY_INFO!O12*($E12-$D12)),COUNTRY_INFO!O12*$E12))","v":43598},0,{"$f":"IF(OR(COUNTRY_INFO!P12=\"Inconnu\",COUNTRY_INFO!P12=\"Surveillance\",COUNTRY_INFO!P12=\"Non requis\",COUNTRY_INFO!P12=0),0,IF(AND($E12<>0,$J12=\"\"),IF($F12=0,COUNTRY_INFO!P12*$E12,COUNTRY_INFO!P12*($E12-$D12)), IF(AND($E12<>0,$J12<>0),IF($F12=0,COUNTRY_INFO!P12*$J12,COUNTRY_INFO!P12*($J12-$D12)), COUNTRY_INFO!P12*$J12)))","v":0},66850,0,null,0,66850,null,66850,0,null,0]
[{"$f":"IF(AND(INTRO!$E$37=\"Non endémique\",INTRO!$E$41=\"Non endémique\"),\" \",IF(COUNTRY_INFO!A13=0,\" \",COUNTRY_INFO!A13))","v":"TOGO"},{"$f":"IF(AND(INTRO!$E$37=\"Non endémique\",INTRO!$E$41=\"Non endémique\"),\" \",IF(COUNTRY_INFO!B13=0,\" \",COUNTRY_INFO!B13))","v":"CENTRALE"},{"$f":"IF(AND(INTRO!$E$37=\"Non endémique\",INTRO!$E$41=\"Non endémique\"),\" \",IF(COUNTRY_INFO!C13=0,\" \",COUNTRY_INFO!C13))","v":"TCHAMBA"},{"$f":"IF(AND(INTRO!$E$37=\"Non endémique\",INTRO!$E$41=\"Non endémique\"),0,COUNTRY_INFO!V13)","v":0},{"$f":"IF(AND(INTRO!$E$37=\"Non endémique\",INTRO!$E$41=\"Non endémique\"),0,COUNTRY_INFO!X13)","v":1},{"$f":"IF(INTRO!$E$39=\"Non endémique\",IF($D13=1,DEC!I13,0),IF($D13=1,IVM!G13,0))","v":0},1,{"$f":"IF(OR(COUNTRY_INFO!N13=\"Inconnu\",COUNTRY_INFO!N13=\"Surveillance\",COUNTRY_INFO!N13=\"Non requis\",COUNTRY_INFO!N13=0),0,IF(INTRO!$E$39=\"Non endémique\",IF(AND($E13<>0,$G13=\"\"),IF($F13=0,COUNTRY_INFO!N13*$E13,COUNTRY_INFO!N13*($E13-$D13)),IF(AND($E13<>0,$G13<>0),IF($F13=0,COUNTRY_INFO!N13*$G13,COUNTRY_INFO!N13*($G13-$D13)),0)),IF($G13=\"\",COUNTRY_INFO!N13*$E13,COUNTRY_INFO!N13*$G13)))","v":33587},{"$f":"IF(OR(COUNTRY_INFO!O13=\"Inconnu\",COUNTRY_INFO!O13=\"Surveillance\",COUNTRY_INFO!O13=\"Non requis\",COUNTRY_INFO!O13=0),0,IF($E13<>0, IF($F13=0,COUNTRY_INFO!O13*$E13,COUNTRY_INFO!O13*($E13-$D13)),COUNTRY_INFO!O13*$E13))","v":62975},0,{"$f":"IF(OR(COUNTRY_INFO!P13=\"Inconnu\",COUNTRY_INFO!P13=\"Surveillance\",COUNTRY_INFO!P13=\"Non requis\",COUNTRY_INFO!P13=0),0,IF(AND($E13<>0,$J13=\"\"),IF($F13=0,COUNTRY_INFO!P13*$E13,COUNTRY_INFO!P13*($E13-$D13)), IF(AND($E13<>0,$J13<>0),IF($F13=0,COUNTRY_INFO!P13*$J13,COUNTRY_INFO!P13*($J13-$D13)), COUNTRY_INFO!P13*$J13)))","v":0},96562,0,null,0,96562,null,96562,0,null,0]
[{"$f":"IF(AND(INTRO!$E$37=\"Non endémique\",INTRO!$E$41=\"Non endémique\"),\" \",IF(COUNTRY_INFO!A14=0,\" \",COUNTRY_INFO!A14))","v":"TOGO"},{"$f":"IF(AND(INTRO!$E$37=\"Non endémique\",INTRO!$E$41=\"Non endémique\"),\" \",IF(COUNTRY_INFO!B14=0,\" \",COUNTRY_INFO!B14))","v":"CENTRALE"},{"$f":"IF(AND(INTRO!$E$37=\"Non endémique\",INTRO!$E$41=\"Non endémique\"),\" \",IF(COUNTRY_INFO!C14=0,\" \",COUNTRY_INFO!C14))","v":"TCHAOUDJO"},{"$f":"IF(AND(INTRO!$E$37=\"Non endémique\",INTRO!$E$41=\"Non endémique\"),0,COUNTRY_INFO!V14)","v":0},{"$f":"IF(AND(INTRO!$E$37=\"Non endémique\",INTRO!$E$41=\"Non endémique\"),0,COUNTRY_INFO!X14)","v":1},{"$f":"IF(INTRO!$E$39=\"Non endémique\",IF($D14=1,DEC!I14,0),IF($D14=1,IVM!G14,0))","v":0},1,{"$f":"IF(OR(COUNTRY_INFO!N14=\"Inconnu\",COUNTRY_INFO!N14=\"Surveillance\",COUNTRY_INFO!N14=\"Non requis\",COUNTRY_INFO!N14=0),0,IF(INTRO!$E$39=\"Non endémique\",IF(AND($E14<>0,$G14=\"\"),IF($F14=0,COUNTRY_INFO!N14*$E14,COUNTRY_INFO!N14*($E14-$D14)),IF(AND($E14<>0,$G14<>0),IF($F14=0,COUNTRY_INFO!N14*$G14,COUNTRY_INFO!N14*($G14-$D14)),0)),IF($G14=\"\",COUNTRY_INFO!N14*$E14,COUNTRY_INFO!N14*$G14)))","v":40247},{"$f":"IF(OR(COUNTRY_INFO!O14=\"Inconnu\",COUNTRY_INFO!O14=\"Surveillance\",COUNTRY_INFO!O14=\"Non requis\",COUNTRY_INFO!O14=0),0,IF($E14<>0, IF($F14=0,COUNTRY_INFO!O14*$E14,COUNTRY_INFO!O14*($E14-$D14)),COUNTRY_INFO!O14*$E14))","v":75463},0,{"$f":"IF(OR(COUNTRY_INFO!P14=\"Inconnu\",COUNTRY_INFO!P14=\"Surveillance\",COUNTRY_INFO!P14=\"Non requis\",COUNTRY_INFO!P14=0),0,IF(AND($E14<>0,$J14=\"\"),IF($F14=0,COUNTRY_INFO!P14*$E14,COUNTRY_INFO!P14*($E14-$D14)), IF(AND($E14<>0,$J14<>0),IF($F14=0,COUNTRY_INFO!P14*$J14,COUNTRY_INFO!P14*($J14-$D14)), COUNTRY_INFO!P14*$J14)))","v":0},115710,0,null,0,115710,null,115710,0,null,0]
[{"$f":"IF(AND(INTRO!$E$37=\"Non endémique\",INTRO!$E$41=\"Non endémique\"),\" \",IF(COUNTRY_INFO!A15=0,\" \",COUNTRY_INFO!A15))","v":"TOGO"},{"$f":"IF(AND(INTRO!$E$37=\"Non endémique\",INTRO!$E$41=\"Non endémique\"),\" \",IF(COUNTRY_INFO!B15=0,\" \",COUNTRY_INFO!B15))","v":"GRAND LOME"},{"$f":"IF(AND(INTRO!$E$37=\"Non endémique\",INTRO!$E$41=\"Non endémique\"),\" \",IF(COUNTRY_INFO!C15=0,\" \",COUNTRY_INFO!C15))","v":"AGOE-NYIVE"},{"$f":"IF(AND(INTRO!$E$37=\"Non endémique\",INTRO!$E$41=\"Non endémique\"),0,COUNTRY_INFO!V15)","v":0},{"$f":"IF(AND(INTRO!$E$37=\"Non endémique\",INTRO!$E$41=\"Non endémique\"),0,COUNTRY_INFO!X15)","v":1},{"$f":"IF(INTRO!$E$39=\"Non endémique\",IF($D15=1,DEC!I15,0),IF($D15=1,IVM!G15,0))","v":0},1,{"$f":"IF(OR(COUNTRY_INFO!N15=\"Inconnu\",COUNTRY_INFO!N15=\"Surveillance\",COUNTRY_INFO!N15=\"Non requis\",COUNTRY_INFO!N15=0),0,IF(INTRO!$E$39=\"Non endémique\",IF(AND($E15<>0,$G15=\"\"),IF($F15=0,COUNTRY_INFO!N15*$E15,COUNTRY_INFO!N15*($E15-$D15)),IF(AND($E15<>0,$G15<>0),IF($F15=0,COUNTRY_INFO!N15*$G15,COUNTRY_INFO!N15*($G15-$D15)),0)),IF($G15=\"\",COUNTRY_INFO!N15*$E15,COUNTRY_INFO!N15*$G15)))","v":147803},{"$f":"IF(OR(COUNTRY_INFO!O15=\"Inconnu\",COUNTRY_INFO!O15=\"Surveillance\",COUNTRY_INFO!O15=\"Non requis\",COUNTRY_INFO!O15=0),0,IF($E15<>0, IF($F15=0,COUNTRY_INFO!O15*$E15,COUNTRY_INFO!O15*($E15-$D15)),COUNTRY_INFO!O15*$E15))","v":277130},0,{"$f":"IF(OR(COUNTRY_INFO!P15=\"Inconnu\",COUNTRY_INFO!P15=\"Surveillance\",COUNTRY_INFO!P15=\"Non requis\",COUNTRY_INFO!P15=0),0,IF(AND($E15<>0,$J15=\"\"),IF($F15=0,COUNTRY_INFO!P15*$E15,COUNTRY_INFO!P15*($E15-$D15)), IF(AND($E15<>0,$J15<>0),IF($F15=0,COUNTRY_INFO!P15*$J15,COUNTRY_INFO!P15*($J15-$D15)), COUNTRY_INFO!P15*$J15)))","v":0},424933,0,null,0,424933,null,424933,0,null,0]
[{"$f":"IF(AND(INTRO!$E$37=\"Non endémique\",INTRO!$E$41=\"Non endémique\"),\" \",IF(COUNTRY_INFO!A16=0,\" \",COUNTRY_INFO!A16))","v":"TOGO"},{"$f":"IF(AND(INTRO!$E$37=\"Non endémique\",INTRO!$E$41=\"Non endémique\"),\" \",IF(COUNTRY_INFO!B16=0,\" \",COUNTRY_INFO!B16))","v":"GRAND LOME"},{"$f":"IF(AND(INTRO!$E$37=\"Non endémique\",INTRO!$E$41=\"Non endémique\"),\" \",IF(COUNTRY_INFO!C16=0,\" \",COUNTRY_INFO!C16))","v":"GOLFE"},{"$f":"IF(AND(INTRO!$E$37=\"Non endémique\",INTRO!$E$41=\"Non endémique\"),0,COUNTRY_INFO!V16)","v":0},{"$f":"IF(AND(INTRO!$E$37=\"Non endémique\",INTRO!$E$41=\"Non endémique\"),0,COUNTRY_INFO!X16)","v":1},{"$f":"IF(INTRO!$E$39=\"Non endémique\",IF($D16=1,DEC!I16,0),IF($D16=1,IVM!G16,0))","v":0},1,{"$f":"IF(OR(COUNTRY_INFO!N16=\"Inconnu\",COUNTRY_INFO!N16=\"Surveillance\",COUNTRY_INFO!N16=\"Non requis\",COUNTRY_INFO!N16=0),0,IF(INTRO!$E$39=\"Non endémique\",IF(AND($E16<>0,$G16=\"\"),IF($F16=0,COUNTRY_INFO!N16*$E16,COUNTRY_INFO!N16*($E16-$D16)),IF(AND($E16<>0,$G16<>0),IF($F16=0,COUNTRY_INFO!N16*$G16,COUNTRY_INFO!N16*($G16-$D16)),0)),IF($G16=\"\",COUNTRY_INFO!N16*$E16,COUNTRY_INFO!N16*$G16)))","v":218629},{"$f":"IF(OR(COUNTRY_INFO!O16=\"Inconnu\",COUNTRY_INFO!O16=\"Surveillance\",COUNTRY_INFO!O16=\"Non requis\",COUNTRY_INFO!O16=0),0,IF($E16<>0, IF($F16=0,COUNTRY_INFO!O16*$E16,COUNTRY_INFO!O16*($E16-$D16)),COUNTRY_INFO!O16*$E16))","v":409930},0,{"$f":"IF(OR(COUNTRY_INFO!P16=\"Inconnu\",COUNTRY_INFO!P16=\"Surveillance\",COUNTRY_INFO!P16=\"Non requis\",COUNTRY_INFO!P16=0),0,IF(AND($E16<>0,$J16=\"\"),IF($F16=0,COUNTRY_INFO!P16*$E16,COUNTRY_INFO!P16*($E16-$D16)), IF(AND($E16<>0,$J16<>0),IF($F16=0,COUNTRY_INFO!P16*$J16,COUNTRY_INFO!P16*($J16-$D16)), COUNTRY_INFO!P16*$J16)))","v":0},628559,0,null,0,628559,null,628559,0,null,0]
[{"$f":"IF(AND(INTRO!$E$37=\"Non endémique\",INTRO!$E$41=\"Non endémique\"),\" \",IF(COUNTRY_INFO!A17=0,\" \",COUNTRY_INFO!A17))","v":"TOGO"},{"$f":"IF(AND(INTRO!$E$37=\"Non endémique\",INTRO!$E$41=\"Non endémique\"),\" \",IF(COUNTRY_INFO!B17=0,\" \",COUNTRY_INFO!B17))","v":"KARA"},{"$f":"IF(AND(INTRO!$E$37=\"Non endémique\",INTRO!$E$41=\"Non endémique\"),\" \",IF(COUNTRY_INFO!C17=0,\" \",COUNTRY_INFO!C17))","v":"ASSOLI"},{"$f":"IF(AND(INTRO!$E$37=\"Non endémique\",INTRO!$E$41=\"Non endémique\"),0,COUNTRY_INFO!V17)","v":0},{"$f":"IF(AND(INTRO!$E$37=\"Non endémique\",INTRO!$E$41=\"Non endémique\"),0,COUNTRY_INFO!X17)","v":1},{"$f":"IF(INTRO!$E$39=\"Non endémique\",IF($D17=1,DEC!I17,0),IF($D17=1,IVM!G17,0))","v":0},1,{"$f":"IF(OR(COUNTRY_INFO!N17=\"Inconnu\",COUNTRY_INFO!N17=\"Surveillance\",COUNTRY_INFO!N17=\"Non requis\",COUNTRY_INFO!N17=0),0,IF(INTRO!$E$39=\"Non endémique\",IF(AND($E17<>0,$G17=\"\"),IF($F17=0,COUNTRY_INFO!N17*$E17,COUNTRY_INFO!N17*($E17-$D17)),IF(AND($E17<>0,$G17<>0),IF($F17=0,COUNTRY_INFO!N17*$G17,COUNTRY_INFO!N17*($G17-$D17)),0)),IF($G17=\"\",COUNTRY_INFO!N17*$E17,COUNTRY_INFO!N17*$G17)))","v":11117},{"$f":"IF(OR(COUNTRY_INFO!O17=\"Inconnu\",COUNTRY_INFO!O17=\"Surveillance\",COUNTRY_INFO!O17=\"Non requis\",COUNTRY_INFO!O17=0),0,IF($E17<>0, IF($F17=0,COUNTRY_INFO!O17*$E17,COUNTRY_INFO!O17*($E17-$D17)),COUNTRY_INFO!O17*$E17))","v":20845},0,{"$f":"IF(OR(COUNTRY_INFO!P17=\"Inconnu\",COUNTRY_INFO!P17=\"Surveillance\",COUNTRY_INFO!P17=\"Non requis\",COUNTRY_INFO!P17=0),0,IF(AND($E17<>0,$J17=\"\"),IF($F17=0,COUNTRY_INFO!P17*$E17,COUNTRY_INFO!P17*($E17-$D17)), IF(AND($E17<>0,$J17<>0),IF($F17=0,COUNTRY_INFO!P17*$J17,COUNTRY_INFO!P17*($J17-$D17)), COUNTRY_INFO!P17*$J17)))","v":0},31962,0,null,0,31962,null,31962,0,null,0]
[{"$f":"IF(AND(INTRO!$E$37=\"Non endémique\",INTRO!$E$41=\"Non endémique\"),\" \",IF(COUNTRY_INFO!A18=0,\" \",COUNTRY_INFO!A18))","v":"TOGO"},{"$f":"IF(AND(INTRO!$E$37=\"Non endémique\",INTRO!$E$41=\"Non endémique\"),\" \",IF(COUNTRY_INFO!B18=0,\" \",COUNTRY_INFO!B18))","v":"KARA"},{"$f":"IF(AND(INTRO!$E$37=\"Non endémique\",INTRO!$E$41=\"Non endémique\"),\" \",IF(COUNTRY_INFO!C18=0,\" \",COUNTRY_INFO!C18))","v":"BASSAR"},{"$f":"IF(AND(INTRO!$E$37=\"Non endémique\",INTRO!$E$41=\"Non endémique\"),0,COUNTRY_INFO!V18)","v":0},{"$f":"IF(AND(INTRO!$E$37=\"Non endémique\",INTRO!$E$41=\"Non endémique\"),0,COUNTRY_INFO!X18)","v":1},{"$f":"IF(INTRO!$E$39=\"Non endémique\",IF($D18=1,DEC!I18,0),IF($D18=1,IVM!G18,0))","v":0},1,{"$f":"IF(OR(COUNTRY_INFO!N18=\"Inconnu\",COUNTRY_INFO!N18=\"Surveillance\",COUNTRY_INFO!N18=\"Non requis\",COUNTRY_INFO!N18=0),0,IF(INTRO!$E$39=\"Non endémique\",IF(AND($E18<>0,$G18=\"\"),IF($F18=0,COUNTRY_INFO!N18*$E18,COUNTRY_INFO!N18*($E18-$D18)),IF(AND($E18<>0,$G18<>0),IF($F18=0,COUNTRY_INFO!N18*$G18,COUNTRY_INFO!N18*($G18-$D18)),0)),IF($G18=\"\",COUNTRY_INFO!N18*$E18,COUNTRY_INFO!N18*$G18)))","v":25462},{"$f":"IF(OR(COUNTRY_INFO!O18=\"Inconnu\",COUNTRY_INFO!O18=\"Surveillance\",COUNTRY_INFO!O18=\"Non requis\",COUNTRY_INFO!O18=0),0,IF($E18<>0, IF($F18=0,COUNTRY_INFO!O18*$E18,COUNTRY_INFO!O18*($E18-$D18)),COUNTRY_INFO!O18*$E18))","v":47742},0,{"$f":"IF(OR(COUNTRY_INFO!P18=\"Inconnu\",COUNTRY_INFO!P18=\"Surveillance\",COUNTRY_INFO!P18=\"Non requis\",COUNTRY_INFO!P18=0),0,IF(AND($E18<>0,$J18=\"\"),IF($F18=0,COUNTRY_INFO!P18*$E18,COUNTRY_INFO!P18*($E18-$D18)), IF(AND($E18<>0,$J18<>0),IF($F18=0,COUNTRY_INFO!P18*$J18,COUNTRY_INFO!P18*($J18-$D18)), COUNTRY_INFO!P18*$J18)))","v":0},73204,0,null,0,73204,null,73204,0,null,0]
[{"$f":"IF(AND(INTRO!$E$37=\"Non endémique\",INTRO!$E$41=\"Non endémique\"),\" \",IF(COUNTRY_INFO!A19=0,\" \",COUNTRY_INFO!A19))","v":"TOGO"},{"$f":"IF(AND(INTRO!$E$37=\"Non endémique\",INTRO!$E$41=\"Non endémique\"),\" \",IF(COUNTRY_INFO!B19=0,\" \",COUNTRY_INFO!B19))","v":"KARA"},{"$f":"IF(AND(INTRO!$E$37=\"Non endémique\",INTRO!$E$41=\"Non endémique\"),\" \",IF(COUNTRY_INFO!C19=0,\" \",COUNTRY_INFO!C19))","v":"BINAH"},{"$f":"IF(AND(INTRO!$E$37=\"Non endémique\",INTRO!$E$41=\"Non endémique\"),0,COUNTRY_INFO!V19)","v":0},{"$f":"IF(AND(INTRO!$E$37=\"Non endémique\",INTRO!$E$41=\"Non endémique\"),0,COUNTRY_INFO!X19)","v":1},{"$f":"IF(INTRO!$E$39=\"Non endémique\",IF($D19=1,DEC!I19,0),IF($D19=1,IVM!G19,0))","v":0},1,{"$f":"IF(OR(COUNTRY_INFO!N19=\"Inconnu\",COUNTRY_INFO!N19=\"Surveillance\",COUNTRY_INFO!N19=\"Non requis\",COUNTRY_INFO!N19=0),0,IF(INTRO!$E$39=\"Non endémique\",IF(AND($E19<>0,$G19=\"\"),IF($F19=0,COUNTRY_INFO!N19*$E19,COUNTRY_INFO!N19*($E19-$D19)),IF(AND($E19<>0,$G19<>0),IF($F19=0,COUNTRY_INFO!N19*$G19,COUNTRY_INFO!N19*($G19-$D19)),0)),IF($G19=\"\",COUNTRY_INFO!N19*$E19,COUNTRY_INFO!N19*$G19)))","v":14099},{"$f":"IF(OR(COUNTRY_INFO!O19=\"Inconnu\",COUNTRY_INFO!O19=\"Surveillance\",COUNTRY_INFO!O19=\"Non requis\",COUNTRY_INFO!O19=0),0,IF($E19<>0, IF($F19=0,COUNTRY_INFO!O19*$E19,COUNTRY_INFO!O19*($E19-$D19)),COUNTRY_INFO!O19*$E19))","v":26435},0,{"$f":"IF(OR(COUNTRY_INFO!P19=\"Inconnu\",COUNTRY_INFO!P19=\"Surveillance\",COUNTRY_INFO!P19=\"Non requis\",COUNTRY_INFO!P19=0),0,IF(AND($E19<>0,$J19=\"\"),IF($F19=0,COUNTRY_INFO!P19*$E19,COUNTRY_INFO!P19*($E19-$D19)), IF(AND($E19<>0,$J19<>0),IF($F19=0,COUNTRY_INFO!P19*$J19,COUNTRY_INFO!P19*($J19-$D19)), COUNTRY_INFO!P19*$J19)))","v":0},40534,0,null,0,40534,null,40534,0,null,0]
[{"$f":"IF(AND(INTRO!$E$37=\"Non endémique\",INTRO!$E$41=\"Non endémique\"),\" \",IF(COUNTRY_INFO!A20=0,\" \",COUNTRY_INFO!A20))","v":"TOGO"},{"$f":"IF(AND(INTRO!$E$37=\"Non endémique\",INTRO!$E$41=\"Non endémique\"),\" \",IF(COUNTRY_INFO!B20=0,\" \",COUNTRY_INFO!B20))","v":"KARA"},{"$f":"IF(AND(INTRO!$E$37=\"Non endémique\",INTRO!$E$41=\"Non endémique\"),\" \",IF(COUNTRY_INFO!C20=0,\" \",COUNTRY_INFO!C20))","v":"DANKPEN"},{"$f":"IF(AND(INTRO!$E$37=\"Non endémique\",INTRO!$E$41=\"Non endémique\"),0,COUNTRY_INFO!V20)","v":0},{"$f":"IF(AND(INTRO!$E$37=\"Non endémique\",INTRO!$E$41=\"Non endémique\"),0,COUNTRY_INFO!X20)","v":1},{"$f":"IF(INTRO!$E$39=\"Non endémique\",IF($D20=1,DEC!I20,0),IF($D20=1,IVM!G20,0))","v":0},1,{"$f":"IF(OR(COUNTRY_INFO!N20=\"Inconnu\",COUNTRY_INFO!N20=\"Surveillance\",COUNTRY_INFO!N20=\"Non requis\",COUNTRY_INFO!N20=0),0,IF(INTRO!$E$39=\"Non endémique\",IF(AND($E20<>0,$G20=\"\"),IF($F20=0,COUNTRY_INFO!N20*$E20,COUNTRY_INFO!N20*($E20-$D20)),IF(AND($E20<>0,$G20<>0),IF($F20=0,COUNTRY_INFO!N20*$G20,COUNTRY_INFO!N20*($G20-$D20)),0)),IF($G20=\"\",COUNTRY_INFO!N20*$E20,COUNTRY_INFO!N20*$G20)))","v":31088},{"$f":"IF(OR(COUNTRY_INFO!O20=\"Inconnu\",COUNTRY_INFO!O20=\"Surveillance\",COUNTRY_INFO!O20=\"Non requis\",COUNTRY_INFO!O20=0),0,IF($E20<>0, IF($F20=0,COUNTRY_INFO!O20*$E20,COUNTRY_INFO!O20*($E20-$D20)),COUNTRY_INFO!O20*$E20))","v":58290},0,{"$f":"IF(OR(COUNTRY_INFO!P20=\"Inconnu\",COUNTRY_INFO!P20=\"Surveillance\",COUNTRY_INFO!P20=\"Non requis\",COUNTRY_INFO!P20=0),0,IF(AND($E20<>0,$J20=\"\"),IF($F20=0,COUNTRY_INFO!P20*$E20,COUNTRY_INFO!P20*($E20-$D20)), IF(AND($E20<>0,$J20<>0),IF($F20=0,COUNTRY_INFO!P20*$J20,COUNTRY_INFO!P20*($J20-$D20)), COUNTRY_INFO!P20*$J20)))","v":0},89378,0,null,0,89378,null,89378,0,null,0]
[{"$f":"IF(AND(INTRO!$E$37=\"Non endémique\",INTRO!$E$41=\"Non endémique\"),\" \",IF(COUNTRY_INFO!A21=0,\" \",COUNTRY_INFO!A21))","v":"TOGO"},{"$f":"IF(AND(INTRO!$E$37=\"Non endémique\",INTRO!$E$41=\"Non endémique\"),\" \",IF(COUNTRY_INFO!B21=0,\" \",COUNTRY_INFO!B21))","v":"KARA"},{"$f":"IF(AND(INTRO!$E$37=\"Non endémique\",INTRO!$E$41=\"Non endémique\"),\" \",IF(COUNTRY_INFO!C21=0,\" \",COUNTRY_INFO!C21))","v":"DOUFELGOU"},{"$f":"IF(AND(INTRO!$E$37=\"Non endémique\",INTRO!$E$41=\"Non endémique\"),0,COUNTRY_INFO!V21)","v":0},{"$f":"IF(AND(INTRO!$E$37=\"Non endémique\",INTRO!$E$41=\"Non endémique\"),0,COUNTRY_INFO!X21)","v":1},{"$f":"IF(INTRO!$E$39=\"Non endémique\",IF($D21=1,DEC!I21,0),IF($D21=1,IVM!G21,0))","v":0},1,{"$f":"IF(OR(COUNTRY_INFO!N21=\"Inconnu\",COUNTRY_INFO!N21=\"Surveillance\",COUNTRY_INFO!N21=\"Non requis\",COUNTRY_INFO!N21=0),0,IF(INTRO!$E$39=\"Non endémique\",IF(AND($E21<>0,$G21=\"\"),IF($F21=0,COUNTRY_INFO!N21*$E21,COUNTRY_INFO!N21*($E21-$D21)),IF(AND($E21<>0,$G21<>0),IF($F21=0,COUNTRY_INFO!N21*$G21,COUNTRY_INFO!N21*($G21-$D21)),0)),IF($G21=\"\",COUNTRY_INFO!N21*$E21,COUNTRY_INFO!N21*$G21)))","v":14194},{"$f":"IF(OR(COUNTRY_INFO!O21=\"Inconnu\",COUNTRY_INFO!O21=\"Surveillance\",COUNTRY_INFO!O21=\"Non requis\",COUNTRY_INFO!O21=0),0,IF($E21<>0, IF($F21=0,COUNTRY_INFO!O21*$E21,COUNTRY_INFO!O21*($E21-$D21)),COUNTRY_INFO!O21*$E21))","v":26613},0,{"$f":"IF(OR(COUNTRY_INFO!P21=\"Inconnu\",COUNTRY_INFO!P21=\"Surveillance\",COUNTRY_INFO!P21=\"Non requis\",COUNTRY_INFO!P21=0),0,IF(AND($E21<>0,$J21=\"\"),IF($F21=0,COUNTRY_INFO!P21*$E21,COUNTRY_INFO!P21*($E21-$D21)), IF(AND($E21<>0,$J21<>0),IF($F21=0,COUNTRY_INFO!P21*$J21,COUNTRY_INFO!P21*($J21-$D21)), COUNTRY_INFO!P21*$J21)))","v":0},40807,0,null,0,40807,null,40807,0,null,0]
[{"$f":"IF(AND(INTRO!$E$37=\"Non endémique\",INTRO!$E$41=\"Non endémique\"),\" \",IF(COUNTRY_INFO!A22=0,\" \",COUNTRY_INFO!A22))","v":"TOGO"},{"$f":"IF(AND(INTRO!$E$37=\"Non endémique\",INTRO!$E$41=\"Non endémique\"),\" \",IF(COUNTRY_INFO!B22=0,\" \",COUNTRY_INFO!B22))","v":"KARA"},{"$f":"IF(AND(INTRO!$E$37=\"Non endémique\",INTRO!$E$41=\"Non endémique\"),\" \",IF(COUNTRY_INFO!C22=0,\" \",COUNTRY_INFO!C22))","v":"KERAN"},{"$f":"IF(AND(INTRO!$E$37=\"Non endémique\",INTRO!$E$41=\"Non endémique\"),0,COUNTRY_INFO!V22)","v":0},{"$f":"IF(AND(INTRO!$E$37=\"Non endémique\",INTRO!$E$41=\"Non endémique\"),0,COUNTRY_INFO!X22)","v":1},{"$f":"IF(INTRO!$E$39=\"Non endémique\",IF($D22=1,DEC!I22,0),IF($D22=1,IVM!G22,0))","v":0},1,{"$f":"IF(OR(COUNTRY_INFO!N22=\"Inconnu\",COUNTRY_INFO!N22=\"Surveillance\",COUNTRY_INFO!N22=\"Non requis\",COUNTRY_INFO!N22=0),0,IF(INTRO!$E$39=\"Non endémique\",IF(AND($E22<>0,$G22=\"\"),IF($F22=0,COUNTRY_INFO!N22*$E22,COUNTRY_INFO!N22*($E22-$D22)),IF(AND($E22<>0,$G22<>0),IF($F22=0,COUNTRY_INFO!N22*$G22,COUNTRY_INFO!N22*($G22-$D22)),0)),IF($G22=\"\",COUNTRY_INFO!N22*$E22,COUNTRY_INFO!N22*$G22)))","v":21548},{"$f":"IF(OR(COUNTRY_INFO!O22=\"Inconnu\",COUNTRY_INFO!O22=\"Surveillance\",COUNTRY_INFO!O22=\"Non requis\",COUNTRY_INFO!O22=0),0,IF($E22<>0, IF($F22=0,COUNTRY_INFO!O22*$E22,COUNTRY_INFO!O22*($E22-$D22)),COUNTRY_INFO!O22*$E22))","v":40403},0,{"$f":"IF(OR(COUNTRY_INFO!P22=\"Inconnu\",COUNTRY_INFO!P22=\"Surveillance\",COUNTRY_INFO!P22=\"Non requis\",COUNTRY_INFO!P22=0),0,IF(AND($E22<>0,$J22=\"\"),IF($F22=0,COUNTRY_INFO!P22*$E22,COUNTRY_INFO!P22*($E22-$D22)), IF(AND($E22<>0,$J22<>0),IF($F22=0,COUNTRY_INFO!P22*$J22,COUNTRY_INFO!P22*($J22-$D22)), COUNTRY_INFO!P22*$J22)))","v":0},61951,0,null,0,61951,null,61951,0,null,0]
[{"$f":"IF(AND(INTRO!$E$37=\"Non endémique\",INTRO!$E$41=\"Non endémique\"),\" \",IF(COUNTRY_INFO!A23=0,\" \",COUNTRY_INFO!A23))","v":"TOGO"},{"$f":"IF(AND(INTRO!$E$37=\"Non endémique\",INTRO!$E$41=\"Non endémique\"),\" \",IF(COUNTRY_INFO!B23=0,\" \",COUNTRY_INFO!B23))","v":"KARA"},{"$f":"IF(AND(INTRO!$E$37=\"Non endémique\",INTRO!$E$41=\"Non endémique\"),\" \",IF(COUNTRY_INFO!C23=0,\" \",COUNTRY_INFO!C23))","v":"KOZAH"},{"$f":"IF(AND(INTRO!$E$37=\"Non endémique\",INTRO!$E$41=\"Non endémique\"),0,COUNTRY_INFO!V23)","v":0},{"$f":"IF(AND(INTRO!$E$37=\"Non endémique\",INTRO!$E$41=\"Non endémique\"),0,COUNTRY_INFO!X23)","v":1},{"$f":"IF(INTRO!$E$39=\"Non endémique\",IF($D23=1,DEC!I23,0),IF($D23=1,IVM!G23,0))","v":0},1,{"$f":"IF(OR(COUNTRY_INFO!N23=\"Inconnu\",COUNTRY_INFO!N23=\"Surveillance\",COUNTRY_INFO!N23=\"Non requis\",COUNTRY_INFO!N23=0),0,IF(INTRO!$E$39=\"Non endémique\",IF(AND($E23<>0,$G23=\"\"),IF($F23=0,COUNTRY_INFO!N23*$E23,COUNTRY_INFO!N23*($E23-$D23)),IF(AND($E23<>0,$G23<>0),IF($F23=0,COUNTRY_INFO!N23*$G23,COUNTRY_INFO!N23*($G23-$D23)),0)),IF($G23=\"\",COUNTRY_INFO!N23*$E23,COUNTRY_INFO!N23*$G23)))","v":47510},{"$f":"IF(OR(COUNTRY_INFO!O23=\"Inconnu\",COUNTRY_INFO!O23=\"Surveillance\",COUNTRY_INFO!O23=\"Non requis\",COUNTRY_INFO!O23=0),0,IF($E23<>0, IF($F23=0,COUNTRY_INFO!O23*$E23,COUNTRY_INFO!O23*($E23-$D23)),COUNTRY_INFO!O23*$E23))","v":89082},0,{"$f":"IF(OR(COUNTRY_INFO!P23=\"Inconnu\",COUNTRY_INFO!P23=\"Surveillance\",COUNTRY_INFO!P23=\"Non requis\",COUNTRY_INFO!P23=0),0,IF(AND($E23<>0,$J23=\"\"),IF($F23=0,COUNTRY_INFO!P23*$E23,COUNTRY_INFO!P23*($E23-$D23)), IF(AND($E23<>0,$J23<>0),IF($F23=0,COUNTRY_INFO!P23*$J23,COUNTRY_INFO!P23*($J23-$D23)), COUNTRY_INFO!P23*$J23)))","v":0},136592,0,null,0,136592,null,136592,0,null,0]
[{"$f":"IF(AND(INTRO!$E$37=\"Non endémique\",INTRO!$E$41=\"Non endémique\"),\" \",IF(COUNTRY_INFO!A24=0,\" \",COUNTRY_INFO!A24))","v":"TOGO"},{"$f":"IF(AND(INTRO!$E$37=\"Non endémique\",INTRO!$E$41=\"Non endémique\"),\" \",IF(COUNTRY_INFO!B24=0,\" \",COUNTRY_INFO!B24))","v":"MARITIME"},{"$f":"IF(AND(INTRO!$E$37=\"Non endémique\",INTRO!$E$41=\"Non endémique\"),\" \",IF(COUNTRY_INFO!C24=0,\" \",COUNTRY_INFO!C24))","v":"AVE"},{"$f":"IF(AND(INTRO!$E$37=\"Non endémique\",INTRO!$E$41=\"Non endémique\"),0,COUNTRY_INFO!V24)","v":0},{"$f":"IF(AND(INTRO!$E$37=\"Non endémique\",INTRO!$E$41=\"Non endémique\"),0,COUNTRY_INFO!X24)","v":1},{"$f":"IF(INTRO!$E$39=\"Non endémique\",IF($D24=1,DEC!I24,0),IF($D24=1,IVM!G24,0))","v":0},1,{"$f":"IF(OR(COUNTRY_INFO!N24=\"Inconnu\",COUNTRY_INFO!N24=\"Surveillance\",COUNTRY_INFO!N24=\"Non requis\",COUNTRY_INFO!N24=0),0,IF(INTRO!$E$39=\"Non endémique\",IF(AND($E24<>0,$G24=\"\"),IF($F24=0,COUNTRY_INFO!N24*$E24,COUNTRY_INFO!N24*($E24-$D24)),IF(AND($E24<>0,$G24<>0),IF($F24=0,COUNTRY_INFO!N24*$G24,COUNTRY_INFO!N24*($G24-$D24)),0)),IF($G24=\"\",COUNTRY_INFO!N24*$E24,COUNTRY_INFO!N24*$G24)))","v":18622},{"$f":"IF(OR(COUNTRY_INFO!O24=\"Inconnu\",COUNTRY_INFO!O24=\"Surveillance\",COUNTRY_INFO!O24=\"Non requis\",COUNTRY_INFO!O24=0),0,IF($E24<>0, IF($F24=0,COUNTRY_INFO!O24*$E24,COUNTRY_INFO!O24*($E24-$D24)),COUNTRY_INFO!O24*$E24))","v":34917},0,{"$f":"IF(OR(COUNTRY_INFO!P24=\"Inconnu\",COUNTRY_INFO!P24=\"Surveillance\",COUNTRY_INFO!P24=\"Non requis\",COUNTRY_INFO!P24=0),0,IF(AND($E24<>0,$J24=\"\"),IF($F24=0,COUNTRY_INFO!P24*$E24,COUNTRY_INFO!P24*($E24-$D24)), IF(AND($E24<>0,$J24<>0),IF($F24=0,COUNTRY_INFO!P24*$J24,COUNTRY_INFO!P24*($J24-$D24)), COUNTRY_INFO!P24*$J24)))","v":0},53539,0,null,0,53539,null,53539,0,null,0]
[{"$f":"IF(AND(INTRO!$E$37=\"Non endémique\",INTRO!$E$41=\"Non endémique\"),\" \",IF(COUNTRY_INFO!A25=0,\" \",COUNTRY_INFO!A25))","v":"TOGO"},{"$f":"IF(AND(INTRO!$E$37=\"Non endémique\",INTRO!$E$41=\"Non endémique\"),\" \",IF(COUNTRY_INFO!B25=0,\" \",COUNTRY_INFO!B25))","v":"MARITIME"},{"$f":"IF(AND(INTRO!$E$37=\"Non endémique\",INTRO!$E$41=\"Non endémique\"),\" \",IF(COUNTRY_INFO!C25=0,\" \",COUNTRY_INFO!C25))","v":"BAS MONO"},{"$f":"IF(AND(INTRO!$E$37=\"Non endémique\",INTRO!$E$41=\"Non endémique\"),0,COUNTRY_INFO!V25)","v":0},{"$f":"IF(AND(INTRO!$E$37=\"Non endémique\",INTRO!$E$41=\"Non endémique\"),0,COUNTRY_INFO!X25)","v":1},{"$f":"IF(INTRO!$E$39=\"Non endémique\",IF($D25=1,DEC!I25,0),IF($D25=1,IVM!G25,0))","v":0},1,{"$f":"IF(OR(COUNTRY_INFO!N25=\"Inconnu\",COUNTRY_INFO!N25=\"Surveillance\",COUNTRY_INFO!N25=\"Non requis\",COUNTRY_INFO!N25=0),0,IF(INTRO!$E$39=\"Non endémique\",IF(AND($E25<>0,$G25=\"\"),IF($F25=0,COUNTRY_INFO!N25*$E25,COUNTRY_INFO!N25*($E25-$D25)),IF(AND($E25<>0,$G25<>0),IF($F25=0,COUNTRY_INFO!N25*$G25,COUNTRY_INFO!N25*($G25-$D25)),0)),IF($G25=\"\",COUNTRY_INFO!N25*$E25,COUNTRY_INFO!N25*$G25)))","v":15884},{"$f":"IF(OR(COUNTRY_INFO!O25=\"Inconnu\",COUNTRY_INFO!O25=\"Surveillance\",COUNTRY_INFO!O25=\"Non requis\",COUNTRY_INFO!O25=0),0,IF($E25<>0, IF($F25=0,COUNTRY_INFO!O25*$E25,COUNTRY_INFO!O25*($E25-$D25)),COUNTRY_INFO!O25*$E25))","v":29782},0,{"$f":"IF(OR(COUNTRY_INFO!P25=\"Inconnu\",COUNTRY_INFO!P25=\"Surveillance\",COUNTRY_INFO!P25=\"Non requis\",COUNTRY_INFO!P25=0),0,IF(AND($E25<>0,$J25=\"\"),IF($F25=0,COUNTRY_INFO!P25*$E25,COUNTRY_INFO!P25*($E25-$D25)), IF(AND($E25<>0,$J25<>0),IF($F25=0,COUNTRY_INFO!P25*$J25,COUNTRY_INFO!P25*($J25-$D25)), COUNTRY_INFO!P25*$J25)))","v":0},45666,0,null,0,45666,null,45666,0,null,0]
[{"$f":"IF(AND(INTRO!$E$37=\"Non endémique\",INTRO!$E$41=\"Non endémique\"),\" \",IF(COUNTRY_INFO!A26=0,\" \",COUNTRY_INFO!A26))","v":"TOGO"},{"$f":"IF(AND(INTRO!$E$37=\"Non endémique\",INTRO!$E$41=\"Non endémique\"),\" \",IF(COUNTRY_INFO!B26=0,\" \",COUNTRY_INFO!B26))","v":"MARITIME"},{"$f":"IF(AND(INTRO!$E$37=\"Non endémique\",INTRO!$E$41=\"Non endémique\"),\" \",IF(COUNTRY_INFO!C26=0,\" \",COUNTRY_INFO!C26))","v":"LACS"},{"$f":"IF(AND(INTRO!$E$37=\"Non endémique\",INTRO!$E$41=\"Non endémique\"),0,COUNTRY_INFO!V26)","v":0},{"$f":"IF(AND(INTRO!$E$37=\"Non endémique\",INTRO!$E$41=\"Non endémique\"),0,COUNTRY_INFO!X26)","v":1},{"$f":"IF(INTRO!$E$39=\"Non endémique\",IF($D26=1,DEC!I26,0),IF($D26=1,IVM!G26,0))","v":0},1,{"$f":"IF(OR(COUNTRY_INFO!N26=\"Inconnu\",COUNTRY_INFO!N26=\"Surveillance\",COUNTRY_INFO!N26=\"Non requis\",COUNTRY_INFO!N26=0),0,IF(INTRO!$E$39=\"Non endémique\",IF(AND($E26<>0,$G26=\"\"),IF($F26=0,COUNTRY_INFO!N26*$E26,COUNTRY_INFO!N26*($E26-$D26)),IF(AND($E26<>0,$G26<>0),IF($F26=0,COUNTRY_INFO!N26*$G26,COUNTRY_INFO!N26*($G26-$D26)),0)),IF($G26=\"\",COUNTRY_INFO!N26*$E26,COUNTRY_INFO!N26*$G26)))","v":40396},{"$f":"IF(OR(COUNTRY_INFO!O26=\"Inconnu\",COUNTRY_INFO!O26=\"Surveillance\",COUNTRY_INFO!O26=\"Non requis\",COUNTRY_INFO!O26=0),0,IF($E26<>0, IF($F26=0,COUNTRY_INFO!O26*$E26,COUNTRY_INFO!O26*($E26-$D26)),COUNTRY_INFO!O26*$E26))","v":75742},0,{"$f":"IF(OR(COUNTRY_INFO!P26=\"Inconnu\",COUNTRY_INFO!P26=\"Surveillance\",COUNTRY_INFO!P26=\"Non requis\",COUNTRY_INFO!P26=0),0,IF(AND($E26<>0,$J26=\"\"),IF($F26=0,COUNTRY_INFO!P26*$E26,COUNTRY_INFO!P26*($E26-$D26)), IF(AND($E26<>0,$J26<>0),IF($F26=0,COUNTRY_INFO!P26*$J26,COUNTRY_INFO!P26*($J26-$D26)), COUNTRY_INFO!P26*$J26)))","v":0},116138,0,null,0,116138,null,116138,0,null,0]
[{"$f":"IF(AND(INTRO!$E$37=\"Non endémique\",INTRO!$E$41=\"Non endémique\"),\" \",IF(COUNTRY_INFO!A27=0,\" \",COUNTRY_INFO!A27))","v":"TOGO"},{"$f":"IF(AND(INTRO!$E$37=\"Non endémique\",INTRO!$E$41=\"Non endémique\"),\" \",IF(COUNTRY_INFO!B27=0,\" \",COUNTRY_INFO!B27))","v":"MARITIME"},{"$f":"IF(AND(INTRO!$E$37=\"Non endémique\",INTRO!$E$41=\"Non endémique\"),\" \",IF(COUNTRY_INFO!C27=0,\" \",COUNTRY_INFO!C27))","v":"VO"},{"$f":"IF(AND(INTRO!$E$37=\"Non endémique\",INTRO!$E$41=\"Non endémique\"),0,COUNTRY_INFO!V27)","v":0},{"$f":"IF(AND(INTRO!$E$37=\"Non endémique\",INTRO!$E$41=\"Non endémique\"),0,COUNTRY_INFO!X27)","v":1},{"$f":"IF(INTRO!$E$39=\"Non endémique\",IF($D27=1,DEC!I27,0),IF($D27=1,IVM!G27,0))","v":0},1,{"$f":"IF(OR(COUNTRY_INFO!N27=\"Inconnu\",COUNTRY_INFO!N27=\"Surveillance\",COUNTRY_INFO!N27=\"Non requis\",COUNTRY_INFO!N27=0),0,IF(INTRO!$E$39=\"Non endémique\",IF(AND($E27<>0,$G27=\"\"),IF($F27=0,COUNTRY_INFO!N27*$E27,COUNTRY_INFO!N27*($E27-$D27)),IF(AND($E27<>0,$G27<>0),IF($F27=0,COUNTRY_INFO!N27*$G27,COUNTRY_INFO!N27*($G27-$D27)),0)),IF($G27=\"\",COUNTRY_INFO!N27*$E27,COUNTRY_INFO!N27*$G27)))","v":37576},{"$f":"IF(OR(COUNTRY_INFO!O27=\"Inconnu\",COUNTRY_INFO!O27=\"Surveillance\",COUNTRY_INFO!O27=\"Non requis\",COUNTRY_INFO!O27=0),0,IF($E27<>0, IF($F27=0,COUNTRY_INFO!O27*$E27,COUNTRY_INFO!O27*($E27-$D27)),COUNTRY_INFO!O27*$E27))","v":70456},0,{"$f":"IF(OR(COUNTRY_INFO!P27=\"Inconnu\",COUNTRY_INFO!P27=\"Surveillance\",COUNTRY_INFO!P27=\"Non requis\",COUNTRY_INFO!P27=0),0,IF(AND($E27<>0,$J27=\"\"),IF($F27=0,COUNTRY_INFO!P27*$E27,COUNTRY_INFO!P27*($E27-$D27)), IF(AND($E27<>0,$J27<>0),IF($F27=0,COUNTRY_INFO!P27*$J27,COUNTRY_INFO!P27*($J27-$D27)), COUNTRY_INFO!P27*$J27)))","v":0},108032,0,null,0,108032,null,108032,0,null,0]
[{"$f":"IF(AND(INTRO!$E$37=\"Non endémique\",INTRO!$E$41=\"Non endémique\"),\" \",IF(COUNTRY_INFO!A28=0,\" \",COUNTRY_INFO!A28))","v":"TOGO"},{"$f":"IF(AND(INTRO!$E$37=\"Non endémique\",INTRO!$E$41=\"Non endémique\"),\" \",IF(COUNTRY_INFO!B28=0,\" \",COUNTRY_INFO!B28))","v":"MARITIME"},{"$f":"IF(AND(INTRO!$E$37=\"Non endémique\",INTRO!$E$41=\"Non endémique\"),\" \",IF(COUNTRY_INFO!C28=0,\" \",COUNTRY_INFO!C28))","v":"YOTO"},{"$f":"IF(AND(INTRO!$E$37=\"Non endémique\",INTRO!$E$41=\"Non endémique\"),0,COUNTRY_INFO!V28)","v":0},{"$f":"IF(AND(INTRO!$E$37=\"Non endémique\",INTRO!$E$41=\"Non endémique\"),0,COUNTRY_INFO!X28)","v":2},{"$f":"IF(INTRO!$E$39=\"Non endémique\",IF($D28=1,DEC!I28,0),IF($D28=1,IVM!G28,0))","v":0},2,{"$f":"IF(OR(COUNTRY_INFO!N28=\"Inconnu\",COUNTRY_INFO!N28=\"Surveillance\",COUNTRY_INFO!N28=\"Non requis\",COUNTRY_INFO!N28=0),0,IF(INTRO!$E$39=\"Non endémique\",IF(AND($E28<>0,$G28=\"\"),IF($F28=0,COUNTRY_INFO!N28*$E28,COUNTRY_INFO!N28*($E28-$D28)),IF(AND($E28<>0,$G28<>0),IF($F28=0,COUNTRY_INFO!N28*$G28,COUNTRY_INFO!N28*($G28-$D28)),0)),IF($G28=\"\",COUNTRY_INFO!N28*$E28,COUNTRY_INFO!N28*$G28)))","v":58556},{"$f":"IF(OR(COUNTRY_INFO!O28=\"Inconnu\",COUNTRY_INFO!O28=\"Surveillance\",COUNTRY_INFO!O28=\"Non requis\",COUNTRY_INFO!O28=0),0,IF($E28<>0, IF($F28=0,COUNTRY_INFO!O28*$E28,COUNTRY_INFO!O28*($E28-$D28)),COUNTRY_INFO!O28*$E28))","v":109792},2,{"$f":"IF(OR(COUNTRY_INFO!P28=\"Inconnu\",COUNTRY_INFO!P28=\"Surveillance\",COUNTRY_INFO!P28=\"Non requis\",COUNTRY_INFO!P28=0),0,IF(AND($E28<>0,$J28=\"\"),IF($F28=0,COUNTRY_INFO!P28*$E28,COUNTRY_INFO!P28*($E28-$D28)), IF(AND($E28<>0,$J28<>0),IF($F28=0,COUNTRY_INFO!P28*$J28,COUNTRY_INFO!P28*($J28-$D28)), COUNTRY_INFO!P28*$J28)))","v":83076},251424,0,null,0,251424,null,251424,0,null,0]
[{"$f":"IF(AND(INTRO!$E$37=\"Non endémique\",INTRO!$E$41=\"Non endémique\"),\" \",IF(COUNTRY_INFO!A29=0,\" \",COUNTRY_INFO!A29))","v":"TOGO"},{"$f":"IF(AND(INTRO!$E$37=\"Non endémique\",INTRO!$E$41=\"Non endémique\"),\" \",IF(COUNTRY_INFO!B29=0,\" \",COUNTRY_INFO!B29))","v":"MARITIME"},{"$f":"IF(AND(INTRO!$E$37=\"Non endémique\",INTRO!$E$41=\"Non endémique\"),\" \",IF(COUNTRY_INFO!C29=0,\" \",COUNTRY_INFO!C29))","v":"ZIO"},{"$f":"IF(AND(INTRO!$E$37=\"Non endémique\",INTRO!$E$41=\"Non endémique\"),0,COUNTRY_INFO!V29)","v":0},{"$f":"IF(AND(INTRO!$E$37=\"Non endémique\",INTRO!$E$41=\"Non endémique\"),0,COUNTRY_INFO!X29)","v":1},{"$f":"IF(INTRO!$E$39=\"Non endémique\",IF($D29=1,DEC!I29,0),IF($D29=1,IVM!G29,0))","v":0},1,{"$f":"IF(OR(COUNTRY_INFO!N29=\"Inconnu\",COUNTRY_INFO!N29=\"Surveillance\",COUNTRY_INFO!N29=\"Non requis\",COUNTRY_INFO!N29=0),0,IF(INTRO!$E$39=\"Non endémique\",IF(AND($E29<>0,$G29=\"\"),IF($F29=0,COUNTRY_INFO!N29*$E29,COUNTRY_INFO!N29*($E29-$D29)),IF(AND($E29<>0,$G29<>0),IF($F29=0,COUNTRY_INFO!N29*$G29,COUNTRY_INFO!N29*($G29-$D29)),0)),IF($G29=\"\",COUNTRY_INFO!N29*$E29,COUNTRY_INFO!N29*$G29)))","v":83728},{"$f":"IF(OR(COUNTRY_INFO!O29=\"Inconnu\",COUNTRY_INFO!O29=\"Surveillance\",COUNTRY_INFO!O29=\"Non requis\",COUNTRY_INFO!O29=0),0,IF($E29<>0, IF($F29=0,COUNTRY_INFO!O29*$E29,COUNTRY_INFO!O29*($E29-$D29)),COUNTRY_INFO!O29*$E29))","v":156989},0,{"$f":"IF(OR(COUNTRY_INFO!P29=\"Inconnu\",COUNTRY_INFO!P29=\"Surveillance\",COUNTRY_INFO!P29=\"Non requis\",COUNTRY_INFO!P29=0),0,IF(AND($E29<>0,$J29=\"\"),IF($F29=0,COUNTRY_INFO!P29*$E29,COUNTRY_INFO!P29*($E29-$D29)), IF(AND($E29<>0,$J29<>0),IF($F29=0,COUNTRY_INFO!P29*$J29,COUNTRY_INFO!P29*($J29-$D29)), COUNTRY_INFO!P29*$J29)))","v":0},240717,0,null,0,240717,null,240717,0,null,0]
[{"$f":"IF(AND(INTRO!$E$37=\"Non endémique\",INTRO!$E$41=\"Non endémique\"),\" \",IF(COUNTRY_INFO!A30=0,\" \",COUNTRY_INFO!A30))","v":"TOGO"},{"$f":"IF(AND(INTRO!$E$37=\"Non endémique\",INTRO!$E$41=\"Non endémique\"),\" \",IF(COUNTRY_INFO!B30=0,\" \",COUNTRY_INFO!B30))","v":"PLATEAUX"},{"$f":"IF(AND(INTRO!$E$37=\"Non endémique\",INTRO!$E$41=\"Non endémique\"),\" \",IF(COUNTRY_INFO!C30=0,\" \",COUNTRY_INFO!C30))","v":"AGOU"},{"$f":"IF(AND(INTRO!$E$37=\"Non endémique\",INTRO!$E$41=\"Non endémique\"),0,COUNTRY_INFO!V30)","v":0},{"$f":"IF(AND(INTRO!$E$37=\"Non endémique\",INTRO!$E$41=\"Non endémique\"),0,COUNTRY_INFO!X30)","v":1},{"$f":"IF(INTRO!$E$39=\"Non endémique\",IF($D30=1,DEC!I30,0),IF($D30=1,IVM!G30,0))","v":0},1,{"$f":"IF(OR(COUNTRY_INFO!N30=\"Inconnu\",COUNTRY_INFO!N30=\"Surveillance\",COUNTRY_INFO!N30=\"Non requis\",COUNTRY_INFO!N30=0),0,IF(INTRO!$E$39=\"Non endémique\",IF(AND($E30<>0,$G30=\"\"),IF($F30=0,COUNTRY_INFO!N30*$E30,COUNTRY_INFO!N30*($E30-$D30)),IF(AND($E30<>0,$G30<>0),IF($F30=0,COUNTRY_INFO!N30*$G30,COUNTRY_INFO!N30*($G30-$D30)),0)),IF($G30=\"\",COUNTRY_INFO!N30*$E30,COUNTRY_INFO!N30*$G30)))","v":14366},{"$f":"IF(OR(COUNTRY_INFO!O30=\"Inconnu\",COUNTRY_INFO!O30=\"Surveillance\",COUNTRY_INFO!O30=\"Non requis\",COUNTRY_INFO!O30=0),0,IF($E30<>0, IF($F30=0,COUNTRY_INFO!O30*$E30,COUNTRY_INFO!O30*($E30-$D30)),COUNTRY_INFO!O30*$E30))","v":26936},0,{"$f":"IF(OR(COUNTRY_INFO!P30=\"Inconnu\",COUNTRY_INFO!P30=\"Surveillance\",COUNTRY_INFO!P30=\"Non requis\",COUNTRY_INFO!P30=0),0,IF(AND($E30<>0,$J30=\"\"),IF($F30=0,COUNTRY_INFO!P30*$E30,COUNTRY_INFO!P30*($E30-$D30)), IF(AND($E30<>0,$J30<>0),IF($F30=0,COUNTRY_INFO!P30*$J30,COUNTRY_INFO!P30*($J30-$D30)), COUNTRY_INFO!P30*$J30)))","v":0},41302,0,null,0,41302,null,41302,0,null,0]
[{"$f":"IF(AND(INTRO!$E$37=\"Non endémique\",INTRO!$E$41=\"Non endémique\"),\" \",IF(COUNTRY_INFO!A31=0,\" \",COUNTRY_INFO!A31))","v":"TOGO"},{"$f":"IF(AND(INTRO!$E$37=\"Non endémique\",INTRO!$E$41=\"Non endémique\"),\" \",IF(COUNTRY_INFO!B31=0,\" \",COUNTRY_INFO!B31))","v":"PLATEAUX"},{"$f":"IF(AND(INTRO!$E$37=\"Non endémique\",INTRO!$E$41=\"Non endémique\"),\" \",IF(COUNTRY_INFO!C31=0,\" \",COUNTRY_INFO!C31))","v":"AKEBOU"},{"$f":"IF(AND(INTRO!$E$37=\"Non endémique\",INTRO!$E$41=\"Non endémique\"),0,COUNTRY_INFO!V31)","v":0},{"$f":"IF(AND(INTRO!$E$37=\"Non endémique\",INTRO!$E$41=\"Non endémique\"),0,COUNTRY_INFO!X31)","v":1},{"$f":"IF(INTRO!$E$39=\"Non endémique\",IF($D31=1,DEC!I31,0),IF($D31=1,IVM!G31,0))","v":0},1,{"$f":"IF(OR(COUNTRY_INFO!N31=\"Inconnu\",COUNTRY_INFO!N31=\"Surveillance\",COUNTRY_INFO!N31=\"Non requis\",COUNTRY_INFO!N31=0),0,IF(INTRO!$E$39=\"Non endémique\",IF(AND($E31<>0,$G31=\"\"),IF($F31=0,COUNTRY_INFO!N31*$E31,COUNTRY_INFO!N31*($E31-$D31)),IF(AND($E31<>0,$G31<>0),IF($F31=0,COUNTRY_INFO!N31*$G31,COUNTRY_INFO!N31*($G31-$D31)),0)),IF($G31=\"\",COUNTRY_INFO!N31*$E31,COUNTRY_INFO!N31*$G31)))","v":12362},{"$f":"IF(OR(COUNTRY_INFO!O31=\"Inconnu\",COUNTRY_INFO!O31=\"Surveillance\",COUNTRY_INFO!O31=\"Non requis\",COUNTRY_INFO!O31=0),0,IF($E31<>0, IF($F31=0,COUNTRY_INFO!O31*$E31,COUNTRY_INFO!O31*($E31-$D31)),COUNTRY_INFO!O31*$E31))","v":23180},0,{"$f":"IF(OR(COUNTRY_INFO!P31=\"Inconnu\",COUNTRY_INFO!P31=\"Surveillance\",COUNTRY_INFO!P31=\"Non requis\",COUNTRY_INFO!P31=0),0,IF(AND($E31<>0,$J31=\"\"),IF($F31=0,COUNTRY_INFO!P31*$E31,COUNTRY_INFO!P31*($E31-$D31)), IF(AND($E31<>0,$J31<>0),IF($F31=0,COUNTRY_INFO!P31*$J31,COUNTRY_INFO!P31*($J31-$D31)), COUNTRY_INFO!P31*$J31)))","v":0},35542,0,null,0,35542,null,35542,0,null,0]
[{"$f":"IF(AND(INTRO!$E$37=\"Non endémique\",INTRO!$E$41=\"Non endémique\"),\" \",IF(COUNTRY_INFO!A32=0,\" \",COUNTRY_INFO!A32))","v":"TOGO"},{"$f":"IF(AND(INTRO!$E$37=\"Non endémique\",INTRO!$E$41=\"Non endémique\"),\" \",IF(COUNTRY_INFO!B32=0,\" \",COUNTRY_INFO!B32))","v":"PLATEAUX"},{"$f":"IF(AND(INTRO!$E$37=\"Non endémique\",INTRO!$E$41=\"Non endémique\"),\" \",IF(COUNTRY_INFO!C32=0,\" \",COUNTRY_INFO!C32))","v":"AMOU"},{"$f":"IF(AND(INTRO!$E$37=\"Non endémique\",INTRO!$E$41=\"Non endémique\"),0,COUNTRY_INFO!V32)","v":0},{"$f":"IF(AND(INTRO!$E$37=\"Non endémique\",INTRO!$E$41=\"Non endémique\"),0,COUNTRY_INFO!X32)","v":1},{"$f":"IF(INTRO!$E$39=\"Non endémique\",IF($D32=1,DEC!I32,0),IF($D32=1,IVM!G32,0))","v":0},1,{"$f":"IF(OR(COUNTRY_INFO!N32=\"Inconnu\",COUNTRY_INFO!N32=\"Surveillance\",COUNTRY_INFO!N32=\"Non requis\",COUNTRY_INFO!N32=0),0,IF(INTRO!$E$39=\"Non endémique\",IF(AND($E32<>0,$G32=\"\"),IF($F32=0,COUNTRY_INFO!N32*$E32,COUNTRY_INFO!N32*($E32-$D32)),IF(AND($E32<>0,$G32<>0),IF($F32=0,COUNTRY_INFO!N32*$G32,COUNTRY_INFO!N32*($G32-$D32)),0)),IF($G32=\"\",COUNTRY_INFO!N32*$E32,COUNTRY_INFO!N32*$G32)))","v":19117},{"$f":"IF(OR(COUNTRY_INFO!O32=\"Inconnu\",COUNTRY_INFO!O32=\"Surveillance\",COUNTRY_INFO!O32=\"Non requis\",COUNTRY_INFO!O32=0),0,IF($E32<>0, IF($F32=0,COUNTRY_INFO!O32*$E32,COUNTRY_INFO!O32*($E32-$D32)),COUNTRY_INFO!O32*$E32))","v":35845},0,{"$f":"IF(OR(COUNTRY_INFO!P32=\"Inconnu\",COUNTRY_INFO!P32=\"Surveillance\",COUNTRY_INFO!P32=\"Non requis\",COUNTRY_INFO!P32=0),0,IF(AND($E32<>0,$J32=\"\"),IF($F32=0,COUNTRY_INFO!P32*$E32,COUNTRY_INFO!P32*($E32-$D32)), IF(AND($E32<>0,$J32<>0),IF($F32=0,COUNTRY_INFO!P32*$J32,COUNTRY_INFO!P32*($J32-$D32)), COUNTRY_INFO!P32*$J32)))","v":0},54962,0,null,0,54962,null,54962,0,null,0]
[{"$f":"IF(AND(INTRO!$E$37=\"Non endémique\",INTRO!$E$41=\"Non endémique\"),\" \",IF(COUNTRY_INFO!A33=0,\" \",COUNTRY_INFO!A33))","v":"TOGO"},{"$f":"IF(AND(INTRO!$E$37=\"Non endémique\",INTRO!$E$41=\"Non endémique\"),\" \",IF(COUNTRY_INFO!B33=0,\" \",COUNTRY_INFO!B33))","v":"PLATEAUX"},{"$f":"IF(AND(INTRO!$E$37=\"Non endémique\",INTRO!$E$41=\"Non endémique\"),\" \",IF(COUNTRY_INFO!C33=0,\" \",COUNTRY_INFO!C33))","v":"ANIE"},{"$f":"IF(AND(INTRO!$E$37=\"Non endémique\",INTRO!$E$41=\"Non endémique\"),0,COUNTRY_INFO!V33)","v":0},{"$f":"IF(AND(INTRO!$E$37=\"Non endémique\",INTRO!$E$41=\"Non endémique\"),0,COUNTRY_INFO!X33)","v":1},{"$f":"IF(INTRO!$E$39=\"Non endémique\",IF($D33=1,DEC!I33,0),IF($D33=1,IVM!G33,0))","v":0},1,{"$f":"IF(OR(COUNTRY_INFO!N33=\"Inconnu\",COUNTRY_INFO!N33=\"Surveillance\",COUNTRY_INFO!N33=\"Non requis\",COUNTRY_INFO!N33=0),0,IF(INTRO!$E$39=\"Non endémique\",IF(AND($E33<>0,$G33=\"\"),IF($F33=0,COUNTRY_INFO!N33*$E33,COUNTRY_INFO!N33*($E33-$D33)),IF(AND($E33<>0,$G33<>0),IF($F33=0,COUNTRY_INFO!N33*$G33,COUNTRY_INFO!N33*($G33-$D33)),0)),IF($G33=\"\",COUNTRY_INFO!N33*$E33,COUNTRY_INFO!N33*$G33)))","v":30167},{"$f":"IF(OR(COUNTRY_INFO!O33=\"Inconnu\",COUNTRY_INFO!O33=\"Surveillance\",COUNTRY_INFO!O33=\"Non requis\",COUNTRY_INFO!O33=0),0,IF($E33<>0, IF($F33=0,COUNTRY_INFO!O33*$E33,COUNTRY_INFO!O33*($E33-$D33)),COUNTRY_INFO!O33*$E33))","v":56562},0,{"$f":"IF(OR(COUNTRY_INFO!P33=\"Inconnu\",COUNTRY_INFO!P33=\"Surveillance\",COUNTRY_INFO!P33=\"Non requis\",COUNTRY_INFO!P33=0),0,IF(AND($E33<>0,$J33=\"\"),IF($F33=0,COUNTRY_INFO!P33*$E33,COUNTRY_INFO!P33*($E33-$D33)), IF(AND($E33<>0,$J33<>0),IF($F33=0,COUNTRY_INFO!P33*$J33,COUNTRY_INFO!P33*($J33-$D33)), COUNTRY_INFO!P33*$J33)))","v":0},86729,0,null,0,86729,null,86729,0,null,0]
[{"$f":"IF(AND(INTRO!$E$37=\"Non endémique\",INTRO!$E$41=\"Non endémique\"),\" \",IF(COUNTRY_INFO!A34=0,\" \",COUNTRY_INFO!A34))","v":"TOGO"},{"$f":"IF(AND(INTRO!$E$37=\"Non endémique\",INTRO!$E$41=\"Non endémique\"),\" \",IF(COUNTRY_INFO!B34=0,\" \",COUNTRY_INFO!B34))","v":"PLATEAUX"},{"$f":"IF(AND(INTRO!$E$37=\"Non endémique\",INTRO!$E$41=\"Non endémique\"),\" \",IF(COUNTRY_INFO!C34=0,\" \",COUNTRY_INFO!C34))","v":"DANYI"},{"$f":"IF(AND(INTRO!$E$37=\"Non endémique\",INTRO!$E$41=\"Non endémique\"),0,COUNTRY_INFO!V34)","v":0},{"$f":"IF(AND(INTRO!$E$37=\"Non endémique\",INTRO!$E$41=\"Non endémique\"),0,COUNTRY_INFO!X34)","v":0},{"$f":"IF(INTRO!$E$39=\"Non endémique\",IF($D34=1,DEC!I34,0),IF($D34=1,IVM!G34,0))","v":0},0,{"$f":"IF(OR(COUNTRY_INFO!N34=\"Inconnu\",COUNTRY_INFO!N34=\"Surveillance\",COUNTRY_INFO!N34=\"Non requis\",COUNTRY_INFO!N34=0),0,IF(INTRO!$E$39=\"Non endémique\",IF(AND($E34<>0,$G34=\"\"),IF($F34=0,COUNTRY_INFO!N34*$E34,COUNTRY_INFO!N34*($E34-$D34)),IF(AND($E34<>0,$G34<>0),IF($F34=0,COUNTRY_INFO!N34*$G34,COUNTRY_INFO!N34*($G34-$D34)),0)),IF($G34=\"\",COUNTRY_INFO!N34*$E34,COUNTRY_INFO!N34*$G34)))","v":0},{"$f":"IF(OR(COUNTRY_INFO!O34=\"Inconnu\",COUNTRY_INFO!O34=\"Surveillance\",COUNTRY_INFO!O34=\"Non requis\",COUNTRY_INFO!O34=0),0,IF($E34<>0, IF($F34=0,COUNTRY_INFO!O34*$E34,COUNTRY_INFO!O34*($E34-$D34)),COUNTRY_INFO!O34*$E34))","v":0},0,{"$f":"IF(OR(COUNTRY_INFO!P34=\"Inconnu\",COUNTRY_INFO!P34=\"Surveillance\",COUNTRY_INFO!P34=\"Non requis\",COUNTRY_INFO!P34=0),0,IF(AND($E34<>0,$J34=\"\"),IF($F34=0,COUNTRY_INFO!P34*$E34,COUNTRY_INFO!P34*($E34-$D34)), IF(AND($E34<>0,$J34<>0),IF($F34=0,COUNTRY_INFO!P34*$J34,COUNTRY_INFO!P34*($J34-$D34)), COUNTRY_INFO!P34*$J34)))","v":0},0,0,null,0,0,null,0,0,null,0]
[{"$f":"IF(AND(INTRO!$E$37=\"Non endémique\",INTRO!$E$41=\"Non endémique\"),\" \",IF(COUNTRY_INFO!A35=0,\" \",COUNTRY_INFO!A35))","v":"TOGO"},{"$f":"IF(AND(INTRO!$E$37=\"Non endémique\",INTRO!$E$41=\"Non endémique\"),\" \",IF(COUNTRY_INFO!B35=0,\" \",COUNTRY_INFO!B35))","v":"PLATEAUX"},{"$f":"IF(AND(INTRO!$E$37=\"Non endémique\",INTRO!$E$41=\"Non endémique\"),\" \",IF(COUNTRY_INFO!C35=0,\" \",COUNTRY_INFO!C35))","v":"EST-MONO"},{"$f":"IF(AND(INTRO!$E$37=\"Non endémique\",INTRO!$E$41=\"Non endémique\"),0,COUNTRY_INFO!V35)","v":0},{"$f":"IF(AND(INTRO!$E$37=\"Non endémique\",INTRO!$E$41=\"Non endémique\"),0,COUNTRY_INFO!X35)","v":2},{"$f":"IF(INTRO!$E$39=\"Non endémique\",IF($D35=1,DEC!I35,0),IF($D35=1,IVM!G35,0))","v":0},2,{"$f":"IF(OR(COUNTRY_INFO!N35=\"Inconnu\",COUNTRY_INFO!N35=\"Surveillance\",COUNTRY_INFO!N35=\"Non requis\",COUNTRY_INFO!N35=0),0,IF(INTRO!$E$39=\"Non endémique\",IF(AND($E35<>0,$G35=\"\"),IF($F35=0,COUNTRY_INFO!N35*$E35,COUNTRY_INFO!N35*($E35-$D35)),IF(AND($E35<>0,$G35<>0),IF($F35=0,COUNTRY_INFO!N35*$G35,COUNTRY_INFO!N35*($G35-$D35)),0)),IF($G35=\"\",COUNTRY_INFO!N35*$E35,COUNTRY_INFO!N35*$G35)))","v":55076},{"$f":"IF(OR(COUNTRY_INFO!O35=\"Inconnu\",COUNTRY_INFO!O35=\"Surveillance\",COUNTRY_INFO!O35=\"Non requis\",COUNTRY_INFO!O35=0),0,IF($E35<>0, IF($F35=0,COUNTRY_INFO!O35*$E35,COUNTRY_INFO!O35*($E35-$D35)),COUNTRY_INFO!O35*$E35))","v":103268},2,{"$f":"IF(OR(COUNTRY_INFO!P35=\"Inconnu\",COUNTRY_INFO!P35=\"Surveillance\",COUNTRY_INFO!P35=\"Non requis\",COUNTRY_INFO!P35=0),0,IF(AND($E35<>0,$J35=\"\"),IF($F35=0,COUNTRY_INFO!P35*$E35,COUNTRY_INFO!P35*($E35-$D35)), IF(AND($E35<>0,$J35<>0),IF($F35=0,COUNTRY_INFO!P35*$J35,COUNTRY_INFO!P35*($J35-$D35)), COUNTRY_INFO!P35*$J35)))","v":78140},236484,0,null,0,236484,null,236484,0,null,0]
[{"$f":"IF(AND(INTRO!$E$37=\"Non endémique\",INTRO!$E$41=\"Non endémique\"),\" \",IF(COUNTRY_INFO!A36=0,\" \",COUNTRY_INFO!A36))","v":"TOGO"},{"$f":"IF(AND(INTRO!$E$37=\"Non endémique\",INTRO!$E$41=\"Non endémique\"),\" \",IF(COUNTRY_INFO!B36=0,\" \",COUNTRY_INFO!B36))","v":"PLATEAUX"},{"$f":"IF(AND(INTRO!$E$37=\"Non endémique\",INTRO!$E$41=\"Non endémique\"),\" \",IF(COUNTRY_INFO!C36=0,\" \",COUNTRY_INFO!C36))","v":"HAHO"},{"$f":"IF(AND(INTRO!$E$37=\"Non endémique\",INTRO!$E$41=\"Non endémique\"),0,COUNTRY_INFO!V36)","v":0},{"$f":"IF(AND(INTRO!$E$37=\"Non endémique\",INTRO!$E$41=\"Non endémique\"),0,COUNTRY_INFO!X36)","v":2},{"$f":"IF(INTRO!$E$39=\"Non endémique\",IF($D36=1,DEC!I36,0),IF($D36=1,IVM!G36,0))","v":0},2,{"$f":"IF(OR(COUNTRY_INFO!N36=\"Inconnu\",COUNTRY_INFO!N36=\"Surveillance\",COUNTRY_INFO!N36=\"Non requis\",COUNTRY_INFO!N36=0),0,IF(INTRO!$E$39=\"Non endémique\",IF(AND($E36<>0,$G36=\"\"),IF($F36=0,COUNTRY_INFO!N36*$E36,COUNTRY_INFO!N36*($E36-$D36)),IF(AND($E36<>0,$G36<>0),IF($F36=0,COUNTRY_INFO!N36*$G36,COUNTRY_INFO!N36*($G36-$D36)),0)),IF($G36=\"\",COUNTRY_INFO!N36*$E36,COUNTRY_INFO!N36*$G36)))","v":102174},{"$f":"IF(OR(COUNTRY_INFO!O36=\"Inconnu\",COUNTRY_INFO!O36=\"Surveillance\",COUNTRY_INFO!O36=\"Non requis\",COUNTRY_INFO!O36=0),0,IF($E36<>0, IF($F36=0,COUNTRY_INFO!O36*$E36,COUNTRY_INFO!O36*($E36-$D36)),COUNTRY_INFO!O36*$E36))","v":191576},2,{"$f":"IF(OR(COUNTRY_INFO!P36=\"Inconnu\",COUNTRY_INFO!P36=\"Surveillance\",COUNTRY_INFO!P36=\"Non requis\",COUNTRY_INFO!P36=0),0,IF(AND($E36<>0,$J36=\"\"),IF($F36=0,COUNTRY_INFO!P36*$E36,COUNTRY_INFO!P36*($E36-$D36)), IF(AND($E36<>0,$J36<>0),IF($F36=0,COUNTRY_INFO!P36*$J36,COUNTRY_INFO!P36*($J36-$D36)), COUNTRY_INFO!P36*$J36)))","v":144958},438708,0,null,0,438708,null,438708,0,null,0]
[{"$f":"IF(AND(INTRO!$E$37=\"Non endémique\",INTRO!$E$41=\"Non endémique\"),\" \",IF(COUNTRY_INFO!A37=0,\" \",COUNTRY_INFO!A37))","v":"TOGO"},{"$f":"IF(AND(INTRO!$E$37=\"Non endémique\",INTRO!$E$41=\"Non endémique\"),\" \",IF(COUNTRY_INFO!B37=0,\" \",COUNTRY_INFO!B37))","v":"PLATEAUX"},{"$f":"IF(AND(INTRO!$E$37=\"Non endémique\",INTRO!$E$41=\"Non endémique\"),\" \",IF(COUNTRY_INFO!C37=0,\" \",COUNTRY_INFO!C37))","v":"KLOTO"},{"$f":"IF(AND(INTRO!$E$37=\"Non endémique\",INTRO!$E$41=\"Non endémique\"),0,COUNTRY_INFO!V37)","v":0},{"$f":"IF(AND(INTRO!$E$37=\"Non endémique\",INTRO!$E$41=\"Non endémique\"),0,COUNTRY_INFO!X37)","v":1},{"$f":"IF(INTRO!$E$39=\"Non endémique\",IF($D37=1,DEC!I37,0),IF($D37=1,IVM!G37,0))","v":0},1,{"$f":"IF(OR(COUNTRY_INFO!N37=\"Inconnu\",COUNTRY_INFO!N37=\"Surveillance\",COUNTRY_INFO!N37=\"Non requis\",COUNTRY_INFO!N37=0),0,IF(INTRO!$E$39=\"Non endémique\",IF(AND($E37<>0,$G37=\"\"),IF($F37=0,COUNTRY_INFO!N37*$E37,COUNTRY_INFO!N37*($E37-$D37)),IF(AND($E37<>0,$G37<>0),IF($F37=0,COUNTRY_INFO!N37*$G37,COUNTRY_INFO!N37*($G37-$D37)),0)),IF($G37=\"\",COUNTRY_INFO!N37*$E37,COUNTRY_INFO!N37*$G37)))","v":24445},{"$f":"IF(OR(COUNTRY_INFO!O37=\"Inconnu\",COUNTRY_INFO!O37=\"Surveillance\",COUNTRY_INFO!O37=\"Non requis\",COUNTRY_INFO!O37=0),0,IF($E37<>0, IF($F37=0,COUNTRY_INFO!O37*$E37,COUNTRY_INFO!O37*($E37-$D37)),COUNTRY_INFO!O37*$E37))","v":45834},0,{"$f":"IF(OR(COUNTRY_INFO!P37=\"Inconnu\",COUNTRY_INFO!P37=\"Surveillance\",COUNTRY_INFO!P37=\"Non requis\",COUNTRY_INFO!P37=0),0,IF(AND($E37<>0,$J37=\"\"),IF($F37=0,COUNTRY_INFO!P37*$E37,COUNTRY_INFO!P37*($E37-$D37)), IF(AND($E37<>0,$J37<>0),IF($F37=0,COUNTRY_INFO!P37*$J37,COUNTRY_INFO!P37*($J37-$D37)), COUNTRY_INFO!P37*$J37)))","v":0},70279,0,null,0,70279,null,70279,0,null,0]
[{"$f":"IF(AND(INTRO!$E$37=\"Non endémique\",INTRO!$E$41=\"Non endémique\"),\" \",IF(COUNTRY_INFO!A38=0,\" \",COUNTRY_INFO!A38))","v":"TOGO"},{"$f":"IF(AND(INTRO!$E$37=\"Non endémique\",INTRO!$E$41=\"Non endémique\"),\" \",IF(COUNTRY_INFO!B38=0,\" \",COUNTRY_INFO!B38))","v":"PLATEAUX"},{"$f":"IF(AND(INTRO!$E$37=\"Non endémique\",INTRO!$E$41=\"Non endémique\"),\" \",IF(COUNTRY_INFO!C38=0,\" \",COUNTRY_INFO!C38))","v":"KPELE"},{"$f":"IF(AND(INTRO!$E$37=\"Non endémique\",INTRO!$E$41=\"Non endémique\"),0,COUNTRY_INFO!V38)","v":0},{"$f":"IF(AND(INTRO!$E$37=\"Non endémique\",INTRO!$E$41=\"Non endémique\"),0,COUNTRY_INFO!X38)","v":1},{"$f":"IF(INTRO!$E$39=\"Non endémique\",IF($D38=1,DEC!I38,0),IF($D38=1,IVM!G38,0))","v":0},1,{"$f":"IF(OR(COUNTRY_INFO!N38=\"Inconnu\",COUNTRY_INFO!N38=\"Surveillance\",COUNTRY_INFO!N38=\"Non requis\",COUNTRY_INFO!N38=0),0,IF(INTRO!$E$39=\"Non endémique\",IF(AND($E38<>0,$G38=\"\"),IF($F38=0,COUNTRY_INFO!N38*$E38,COUNTRY_INFO!N38*($E38-$D38)),IF(AND($E38<>0,$G38<>0),IF($F38=0,COUNTRY_INFO!N38*$G38,COUNTRY_INFO!N38*($G38-$D38)),0)),IF($G38=\"\",COUNTRY_INFO!N38*$E38,COUNTRY_INFO!N38*$G38)))","v":13553},{"$f":"IF(OR(COUNTRY_INFO!O38=\"Inconnu\",COUNTRY_INFO!O38=\"Surveillance\",COUNTRY_INFO!O38=\"Non requis\",COUNTRY_INFO!O38=0),0,IF($E38<>0, IF($F38=0,COUNTRY_INFO!O38*$E38,COUNTRY_INFO!O38*($E38-$D38)),COUNTRY_INFO!O38*$E38))","v":25412},0,{"$f":"IF(OR(COUNTRY_INFO!P38=\"Inconnu\",COUNTRY_INFO!P38=\"Surveillance\",COUNTRY_INFO!P38=\"Non requis\",COUNTRY_INFO!P38=0),0,IF(AND($E38<>0,$J38=\"\"),IF($F38=0,COUNTRY_INFO!P38*$E38,COUNTRY_INFO!P38*($E38-$D38)), IF(AND($E38<>0,$J38<>0),IF($F38=0,COUNTRY_INFO!P38*$J38,COUNTRY_INFO!P38*($J38-$D38)), COUNTRY_INFO!P38*$J38)))","v":0},38965,0,null,0,38965,null,38965,0,null,0]
[{"$f":"IF(AND(INTRO!$E$37=\"Non endémique\",INTRO!$E$41=\"Non endémique\"),\" \",IF(COUNTRY_INFO!A39=0,\" \",COUNTRY_INFO!A39))","v":"TOGO"},{"$f":"IF(AND(INTRO!$E$37=\"Non endémique\",INTRO!$E$41=\"Non endémique\"),\" \",IF(COUNTRY_INFO!B39=0,\" \",COUNTRY_INFO!B39))","v":"PLATEAUX"},{"$f":"IF(AND(INTRO!$E$37=\"Non endémique\",INTRO!$E$41=\"Non endémique\"),\" \",IF(COUNTRY_INFO!C39=0,\" \",COUNTRY_INFO!C39))","v":"MOYEN-MONO"},{"$f":"IF(AND(INTRO!$E$37=\"Non endémique\",INTRO!$E$41=\"Non endémique\"),0,COUNTRY_INFO!V39)","v":0},{"$f":"IF(AND(INTRO!$E$37=\"Non endémique\",INTRO!$E$41=\"Non endémique\"),0,COUNTRY_INFO!X39)","v":1},{"$f":"IF(INTRO!$E$39=\"Non endémique\",IF($D39=1,DEC!I39,0),IF($D39=1,IVM!G39,0))","v":0},1,{"$f":"IF(OR(COUNTRY_INFO!N39=\"Inconnu\",COUNTRY_INFO!N39=\"Surveillance\",COUNTRY_INFO!N39=\"Non requis\",COUNTRY_INFO!N39=0),0,IF(INTRO!$E$39=\"Non endémique\",IF(AND($E39<>0,$G39=\"\"),IF($F39=0,COUNTRY_INFO!N39*$E39,COUNTRY_INFO!N39*($E39-$D39)),IF(AND($E39<>0,$G39<>0),IF($F39=0,COUNTRY_INFO!N39*$G39,COUNTRY_INFO!N39*($G39-$D39)),0)),IF($G39=\"\",COUNTRY_INFO!N39*$E39,COUNTRY_INFO!N39*$G39)))","v":15155},{"$f":"IF(OR(COUNTRY_INFO!O39=\"Inconnu\",COUNTRY_INFO!O39=\"Surveillance\",COUNTRY_INFO!O39=\"Non requis\",COUNTRY_INFO!O39=0),0,IF($E39<>0, IF($F39=0,COUNTRY_INFO!O39*$E39,COUNTRY_INFO!O39*($E39-$D39)),COUNTRY_INFO!O39*$E39))","v":28415},0,{"$f":"IF(OR(COUNTRY_INFO!P39=\"Inconnu\",COUNTRY_INFO!P39=\"Surveillance\",COUNTRY_INFO!P39=\"Non requis\",COUNTRY_INFO!P39=0),0,IF(AND($E39<>0,$J39=\"\"),IF($F39=0,COUNTRY_INFO!P39*$E39,COUNTRY_INFO!P39*($E39-$D39)), IF(AND($E39<>0,$J39<>0),IF($F39=0,COUNTRY_INFO!P39*$J39,COUNTRY_INFO!P39*($J39-$D39)), COUNTRY_INFO!P39*$J39)))","v":0},43570,0,null,0,43570,null,43570,0,null,0]
[{"$f":"IF(AND(INTRO!$E$37=\"Non endémique\",INTRO!$E$41=\"Non endémique\"),\" \",IF(COUNTRY_INFO!A40=0,\" \",COUNTRY_INFO!A40))","v":"TOGO"},{"$f":"IF(AND(INTRO!$E$37=\"Non endémique\",INTRO!$E$41=\"Non endémique\"),\" \",IF(COUNTRY_INFO!B40=0,\" \",COUNTRY_INFO!B40))","v":"PLATEAUX"},{"$f":"IF(AND(INTRO!$E$37=\"Non endémique\",INTRO!$E$41=\"Non endémique\"),\" \",IF(COUNTRY_INFO!C40=0,\" \",COUNTRY_INFO!C40))","v":"OGOU"},{"$f":"IF(AND(INTRO!$E$37=\"Non endémique\",INTRO!$E$41=\"Non endémique\"),0,COUNTRY_INFO!V40)","v":0},{"$f":"IF(AND(INTRO!$E$37=\"Non endémique\",INTRO!$E$41=\"Non endémique\"),0,COUNTRY_INFO!X40)","v":2},{"$f":"IF(INTRO!$E$39=\"Non endémique\",IF($D40=1,DEC!I40,0),IF($D40=1,IVM!G40,0))","v":0},2,{"$f":"IF(OR(COUNTRY_INFO!N40=\"Inconnu\",COUNTRY_INFO!N40=\"Surveillance\",COUNTRY_INFO!N40=\"Non requis\",COUNTRY_INFO!N40=0),0,IF(INTRO!$E$39=\"Non endémique\",IF(AND($E40<>0,$G40=\"\"),IF($F40=0,COUNTRY_INFO!N40*$E40,COUNTRY_INFO!N40*($E40-$D40)),IF(AND($E40<>0,$G40<>0),IF($F40=0,COUNTRY_INFO!N40*$G40,COUNTRY_INFO!N40*($G40-$D40)),0)),IF($G40=\"\",COUNTRY_INFO!N40*$E40,COUNTRY_INFO!N40*$G40)))","v":84884},{"$f":"IF(OR(COUNTRY_INFO!O40=\"Inconnu\",COUNTRY_INFO!O40=\"Surveillance\",COUNTRY_INFO!O40=\"Non requis\",COUNTRY_INFO!O40=0),0,IF($E40<>0, IF($F40=0,COUNTRY_INFO!O40*$E40,COUNTRY_INFO!O40*($E40-$D40)),COUNTRY_INFO!O40*$E40))","v":159156},2,{"$f":"IF(OR(COUNTRY_INFO!P40=\"Inconnu\",COUNTRY_INFO!P40=\"Surveillance\",COUNTRY_INFO!P40=\"Non requis\",COUNTRY_INFO!P40=0),0,IF(AND($E40<>0,$J40=\"\"),IF($F40=0,COUNTRY_INFO!P40*$E40,COUNTRY_INFO!P40*($E40-$D40)), IF(AND($E40<>0,$J40<>0),IF($F40=0,COUNTRY_INFO!P40*$J40,COUNTRY_INFO!P40*($J40-$D40)), COUNTRY_INFO!P40*$J40)))","v":120428},364468,0,null,0,364468,null,364468,0,null,0]
[{"$f":"IF(AND(INTRO!$E$37=\"Non endémique\",INTRO!$E$41=\"Non endémique\"),\" \",IF(COUNTRY_INFO!A41=0,\" \",COUNTRY_INFO!A41))","v":"TOGO"},{"$f":"IF(AND(INTRO!$E$37=\"Non endémique\",INTRO!$E$41=\"Non endémique\"),\" \",IF(COUNTRY_INFO!B41=0,\" \",COUNTRY_INFO!B41))","v":"PLATEAUX"},{"$f":"IF(AND(INTRO!$E$37=\"Non endémique\",INTRO!$E$41=\"Non endémique\"),\" \",IF(COUNTRY_INFO!C41=0,\" \",COUNTRY_INFO!C41))","v":"WAWA"},{"$f":"IF(AND(INTRO!$E$37=\"Non endémique\",INTRO!$E$41=\"Non endémique\"),0,COUNTRY_INFO!V41)","v":0},{"$f":"IF(AND(INTRO!$E$37=\"Non endémique\",INTRO!$E$41=\"Non endémique\"),0,COUNTRY_INFO!X41)","v":1},{"$f":"IF(INTRO!$E$39=\"Non endémique\",IF($D41=1,DEC!I41,0),IF($D41=1,IVM!G41,0))","v":0},1,{"$f":"IF(OR(COUNTRY_INFO!N41=\"Inconnu\",COUNTRY_INFO!N41=\"Surveillance\",COUNTRY_INFO!N41=\"Non requis\",COUNTRY_INFO!N41=0),0,IF(INTRO!$E$39=\"Non endémique\",IF(AND($E41<>0,$G41=\"\"),IF($F41=0,COUNTRY_INFO!N41*$E41,COUNTRY_INFO!N41*($E41-$D41)),IF(AND($E41<>0,$G41<>0),IF($F41=0,COUNTRY_INFO!N41*$G41,COUNTRY_INFO!N41*($G41-$D41)),0)),IF($G41=\"\",COUNTRY_INFO!N41*$E41,COUNTRY_INFO!N41*$G41)))","v":16962},{"$f":"IF(OR(COUNTRY_INFO!O41=\"Inconnu\",COUNTRY_INFO!O41=\"Surveillance\",COUNTRY_INFO!O41=\"Non requis\",COUNTRY_INFO!O41=0),0,IF($E41<>0, IF($F41=0,COUNTRY_INFO!O41*$E41,COUNTRY_INFO!O41*($E41-$D41)),COUNTRY_INFO!O41*$E41))","v":31804},0,{"$f":"IF(OR(COUNTRY_INFO!P41=\"Inconnu\",COUNTRY_INFO!P41=\"Surveillance\",COUNTRY_INFO!P41=\"Non requis\",COUNTRY_INFO!P41=0),0,IF(AND($E41<>0,$J41=\"\"),IF($F41=0,COUNTRY_INFO!P41*$E41,COUNTRY_INFO!P41*($E41-$D41)), IF(AND($E41<>0,$J41<>0),IF($F41=0,COUNTRY_INFO!P41*$J41,COUNTRY_INFO!P41*($J41-$D41)), COUNTRY_INFO!P41*$J41)))","v":0},48766,0,null,0,48766,null,48766,0,null,0]
[{"$f":"IF(AND(INTRO!$E$37=\"Non endémique\",INTRO!$E$41=\"Non endémique\"),\" \",IF(COUNTRY_INFO!A42=0,\" \",COUNTRY_INFO!A42))","v":"TOGO"},{"$f":"IF(AND(INTRO!$E$37=\"Non endémique\",INTRO!$E$41=\"Non endémique\"),\" \",IF(COUNTRY_INFO!B42=0,\" \",COUNTRY_INFO!B42))","v":"SAVANES"},{"$f":"IF(AND(INTRO!$E$37=\"Non endémique\",INTRO!$E$41=\"Non endémique\"),\" \",IF(COUNTRY_INFO!C42=0,\" \",COUNTRY_INFO!C42))","v":"CINKASSE"},{"$f":"IF(AND(INTRO!$E$37=\"Non endémique\",INTRO!$E$41=\"Non endémique\"),0,COUNTRY_INFO!V42)","v":0},{"$f":"IF(AND(INTRO!$E$37=\"Non endémique\",INTRO!$E$41=\"Non endémique\"),0,COUNTRY_INFO!X42)","v":1},{"$f":"IF(INTRO!$E$39=\"Non endémique\",IF($D42=1,DEC!I42,0),IF($D42=1,IVM!G42,0))","v":0},1,{"$f":"IF(OR(COUNTRY_INFO!N42=\"Inconnu\",COUNTRY_INFO!N42=\"Surveillance\",COUNTRY_INFO!N42=\"Non requis\",COUNTRY_INFO!N42=0),0,IF(INTRO!$E$39=\"Non endémique\",IF(AND($E42<>0,$G42=\"\"),IF($F42=0,COUNTRY_INFO!N42*$E42,COUNTRY_INFO!N42*($E42-$D42)),IF(AND($E42<>0,$G42<>0),IF($F42=0,COUNTRY_INFO!N42*$G42,COUNTRY_INFO!N42*($G42-$D42)),0)),IF($G42=\"\",COUNTRY_INFO!N42*$E42,COUNTRY_INFO!N42*$G42)))","v":21593},{"$f":"IF(OR(COUNTRY_INFO!O42=\"Inconnu\",COUNTRY_INFO!O42=\"Surveillance\",COUNTRY_INFO!O42=\"Non requis\",COUNTRY_INFO!O42=0),0,IF($E42<>0, IF($F42=0,COUNTRY_INFO!O42*$E42,COUNTRY_INFO!O42*($E42-$D42)),COUNTRY_INFO!O42*$E42))","v":40488},0,{"$f":"IF(OR(COUNTRY_INFO!P42=\"Inconnu\",COUNTRY_INFO!P42=\"Surveillance\",COUNTRY_INFO!P42=\"Non requis\",COUNTRY_INFO!P42=0),0,IF(AND($E42<>0,$J42=\"\"),IF($F42=0,COUNTRY_INFO!P42*$E42,COUNTRY_INFO!P42*($E42-$D42)), IF(AND($E42<>0,$J42<>0),IF($F42=0,COUNTRY_INFO!P42*$J42,COUNTRY_INFO!P42*($J42-$D42)), COUNTRY_INFO!P42*$J42)))","v":0},62081,0,null,0,62081,null,62081,0,null,0]
[{"$f":"IF(AND(INTRO!$E$37=\"Non endémique\",INTRO!$E$41=\"Non endémique\"),\" \",IF(COUNTRY_INFO!A43=0,\" \",COUNTRY_INFO!A43))","v":"TOGO"},{"$f":"IF(AND(INTRO!$E$37=\"Non endémique\",INTRO!$E$41=\"Non endémique\"),\" \",IF(COUNTRY_INFO!B43=0,\" \",COUNTRY_INFO!B43))","v":"SAVANES"},{"$f":"IF(AND(INTRO!$E$37=\"Non endémique\",INTRO!$E$41=\"Non endémique\"),\" \",IF(COUNTRY_INFO!C43=0,\" \",COUNTRY_INFO!C43))","v":"KPENDJAL"},{"$f":"IF(AND(INTRO!$E$37=\"Non endémique\",INTRO!$E$41=\"Non endémique\"),0,COUNTRY_INFO!V43)","v":0},{"$f":"IF(AND(INTRO!$E$37=\"Non endémique\",INTRO!$E$41=\"Non endémique\"),0,COUNTRY_INFO!X43)","v":1},{"$f":"IF(INTRO!$E$39=\"Non endémique\",IF($D43=1,DEC!I43,0),IF($D43=1,IVM!G43,0))","v":0},1,{"$f":"IF(OR(COUNTRY_INFO!N43=\"Inconnu\",COUNTRY_INFO!N43=\"Surveillance\",COUNTRY_INFO!N43=\"Non requis\",COUNTRY_INFO!N43=0),0,IF(INTRO!$E$39=\"Non endémique\",IF(AND($E43<>0,$G43=\"\"),IF($F43=0,COUNTRY_INFO!N43*$E43,COUNTRY_INFO!N43*($E43-$D43)),IF(AND($E43<>0,$G43<>0),IF($F43=0,COUNTRY_INFO!N43*$G43,COUNTRY_INFO!N43*($G43-$D43)),0)),IF($G43=\"\",COUNTRY_INFO!N43*$E43,COUNTRY_INFO!N43*$G43)))","v":14796},{"$f":"IF(OR(COUNTRY_INFO!O43=\"Inconnu\",COUNTRY_INFO!O43=\"Surveillance\",COUNTRY_INFO!O43=\"Non requis\",COUNTRY_INFO!O43=0),0,IF($E43<>0, IF($F43=0,COUNTRY_INFO!O43*$E43,COUNTRY_INFO!O43*($E43-$D43)),COUNTRY_INFO!O43*$E43))","v":27743},0,{"$f":"IF(OR(COUNTRY_INFO!P43=\"Inconnu\",COUNTRY_INFO!P43=\"Surveillance\",COUNTRY_INFO!P43=\"Non requis\",COUNTRY_INFO!P43=0),0,IF(AND($E43<>0,$J43=\"\"),IF($F43=0,COUNTRY_INFO!P43*$E43,COUNTRY_INFO!P43*($E43-$D43)), IF(AND($E43<>0,$J43<>0),IF($F43=0,COUNTRY_INFO!P43*$J43,COUNTRY_INFO!P43*($J43-$D43)), COUNTRY_INFO!P43*$J43)))","v":0},42539,0,null,0,42539,null,42539,0,null,0]
[{"$f":"IF(AND(INTRO!$E$37=\"Non endémique\",INTRO!$E$41=\"Non endémique\"),\" \",IF(COUNTRY_INFO!A44=0,\" \",COUNTRY_INFO!A44))","v":"TOGO"},{"$f":"IF(AND(INTRO!$E$37=\"Non endémique\",INTRO!$E$41=\"Non endémique\"),\" \",IF(COUNTRY_INFO!B44=0,\" \",COUNTRY_INFO!B44))","v":"SAVANES"},{"$f":"IF(AND(INTRO!$E$37=\"Non endémique\",INTRO!$E$41=\"Non endémique\"),\" \",IF(COUNTRY_INFO!C44=0,\" \",COUNTRY_INFO!C44))","v":"KPENDJAL-OUEST"},{"$f":"IF(AND(INTRO!$E$37=\"Non endémique\",INTRO!$E$41=\"Non endémique\"),0,COUNTRY_INFO!V44)","v":0},{"$f":"IF(AND(INTRO!$E$37=\"Non endémique\",INTRO!$E$41=\"Non endémique\"),0,COUNTRY_INFO!X44)","v":1},{"$f":"IF(INTRO!$E$39=\"Non endémique\",IF($D44=1,DEC!I44,0),IF($D44=1,IVM!G44,0))","v":0},1,{"$f":"IF(OR(COUNTRY_INFO!N44=\"Inconnu\",COUNTRY_INFO!N44=\"Surveillance\",COUNTRY_INFO!N44=\"Non requis\",COUNTRY_INFO!N44=0),0,IF(INTRO!$E$39=\"Non endémique\",IF(AND($E44<>0,$G44=\"\"),IF($F44=0,COUNTRY_INFO!N44*$E44,COUNTRY_INFO!N44*($E44-$D44)),IF(AND($E44<>0,$G44<>0),IF($F44=0,COUNTRY_INFO!N44*$G44,COUNTRY_INFO!N44*($G44-$D44)),0)),IF($G44=\"\",COUNTRY_INFO!N44*$E44,COUNTRY_INFO!N44*$G44)))","v":20651},{"$f":"IF(OR(COUNTRY_INFO!O44=\"Inconnu\",COUNTRY_INFO!O44=\"Surveillance\",COUNTRY_INFO!O44=\"Non requis\",COUNTRY_INFO!O44=0),0,IF($E44<>0, IF($F44=0,COUNTRY_INFO!O44*$E44,COUNTRY_INFO!O44*($E44-$D44)),COUNTRY_INFO!O44*$E44))","v":38721},0,{"$f":"IF(OR(COUNTRY_INFO!P44=\"Inconnu\",COUNTRY_INFO!P44=\"Surveillance\",COUNTRY_INFO!P44=\"Non requis\",COUNTRY_INFO!P44=0),0,IF(AND($E44<>0,$J44=\"\"),IF($F44=0,COUNTRY_INFO!P44*$E44,COUNTRY_INFO!P44*($E44-$D44)), IF(AND($E44<>0,$J44<>0),IF($F44=0,COUNTRY_INFO!P44*$J44,COUNTRY_INFO!P44*($J44-$D44)), COUNTRY_INFO!P44*$J44)))","v":0},59372,0,null,0,59372,null,59372,0,null,0]
[{"$f":"IF(AND(INTRO!$E$37=\"Non endémique\",INTRO!$E$41=\"Non endémique\"),\" \",IF(COUNTRY_INFO!A45=0,\" \",COUNTRY_INFO!A45))","v":"TOGO"},{"$f":"IF(AND(INTRO!$E$37=\"Non endémique\",INTRO!$E$41=\"Non endémique\"),\" \",IF(COUNTRY_INFO!B45=0,\" \",COUNTRY_INFO!B45))","v":"SAVANES"},{"$f":"IF(AND(INTRO!$E$37=\"Non endémique\",INTRO!$E$41=\"Non endémique\"),\" \",IF(COUNTRY_INFO!C45=0,\" \",COUNTRY_INFO!C45))","v":"OTI"},{"$f":"IF(AND(INTRO!$E$37=\"Non endémique\",INTRO!$E$41=\"Non endémique\"),0,COUNTRY_INFO!V45)","v":0},{"$f":"IF(AND(INTRO!$E$37=\"Non endémique\",INTRO!$E$41=\"Non endémique\"),0,COUNTRY_INFO!X45)","v":2},{"$f":"IF(INTRO!$E$39=\"Non endémique\",IF($D45=1,DEC!I45,0),IF($D45=1,IVM!G45,0))","v":0},2,{"$f":"IF(OR(COUNTRY_INFO!N45=\"Inconnu\",COUNTRY_INFO!N45=\"Surveillance\",COUNTRY_INFO!N45=\"Non requis\",COUNTRY_INFO!N45=0),0,IF(INTRO!$E$39=\"Non endémique\",IF(AND($E45<>0,$G45=\"\"),IF($F45=0,COUNTRY_INFO!N45*$E45,COUNTRY_INFO!N45*($E45-$D45)),IF(AND($E45<>0,$G45<>0),IF($F45=0,COUNTRY_INFO!N45*$G45,COUNTRY_INFO!N45*($G45-$D45)),0)),IF($G45=\"\",COUNTRY_INFO!N45*$E45,COUNTRY_INFO!N45*$G45)))","v":41810},{"$f":"IF(OR(COUNTRY_INFO!O45=\"Inconnu\",COUNTRY_INFO!O45=\"Surveillance\",COUNTRY_INFO!O45=\"Non requis\",COUNTRY_INFO!O45=0),0,IF($E45<>0, IF($F45=0,COUNTRY_INFO!O45*$E45,COUNTRY_INFO!O45*($E45-$D45)),COUNTRY_INFO!O45*$E45))","v":78394},2,{"$f":"IF(OR(COUNTRY_INFO!P45=\"Inconnu\",COUNTRY_INFO!P45=\"Surveillance\",COUNTRY_INFO!P45=\"Non requis\",COUNTRY_INFO!P45=0),0,IF(AND($E45<>0,$J45=\"\"),IF($F45=0,COUNTRY_INFO!P45*$E45,COUNTRY_INFO!P45*($E45-$D45)), IF(AND($E45<>0,$J45<>0),IF($F45=0,COUNTRY_INFO!P45*$J45,COUNTRY_INFO!P45*($J45-$D45)), COUNTRY_INFO!P45*$J45)))","v":59318},179522,0,null,0,179522,null,179522,0,null,0]
[{"$f":"IF(AND(INTRO!$E$37=\"Non endémique\",INTRO!$E$41=\"Non endémique\"),\" \",IF(COUNTRY_INFO!A46=0,\" \",COUNTRY_INFO!A46))","v":"TOGO"},{"$f":"IF(AND(INTRO!$E$37=\"Non endémique\",INTRO!$E$41=\"Non endémique\"),\" \",IF(COUNTRY_INFO!B46=0,\" \",COUNTRY_INFO!B46))","v":"SAVANES"},{"$f":"IF(AND(INTRO!$E$37=\"Non endémique\",INTRO!$E$41=\"Non endémique\"),\" \",IF(COUNTRY_INFO!C46=0,\" \",COUNTRY_INFO!C46))","v":"OTI-SUD"},{"$f":"IF(AND(INTRO!$E$37=\"Non endémique\",INTRO!$E$41=\"Non endémique\"),0,COUNTRY_INFO!V46)","v":0},{"$f":"IF(AND(INTRO!$E$37=\"Non endémique\",INTRO!$E$41=\"Non endémique\"),0,COUNTRY_INFO!X46)","v":2},{"$f":"IF(INTRO!$E$39=\"Non endémique\",IF($D46=1,DEC!I46,0),IF($D46=1,IVM!G46,0))","v":0},2,{"$f":"IF(OR(COUNTRY_INFO!N46=\"Inconnu\",COUNTRY_INFO!N46=\"Surveillance\",COUNTRY_INFO!N46=\"Non requis\",COUNTRY_INFO!N46=0),0,IF(INTRO!$E$39=\"Non endémique\",IF(AND($E46<>0,$G46=\"\"),IF($F46=0,COUNTRY_INFO!N46*$E46,COUNTRY_INFO!N46*($E46-$D46)),IF(AND($E46<>0,$G46<>0),IF($F46=0,COUNTRY_INFO!N46*$G46,COUNTRY_INFO!N46*($G46-$D46)),0)),IF($G46=\"\",COUNTRY_INFO!N46*$E46,COUNTRY_INFO!N46*$G46)))","v":50360},{"$f":"IF(OR(COUNTRY_INFO!O46=\"Inconnu\",COUNTRY_INFO!O46=\"Surveillance\",COUNTRY_INFO!O46=\"Non requis\",COUNTRY_INFO!O46=0),0,IF($E46<>0, IF($F46=0,COUNTRY_INFO!O46*$E46,COUNTRY_INFO!O46*($E46-$D46)),COUNTRY_INFO!O46*$E46))","v":94424},2,{"$f":"IF(OR(COUNTRY_INFO!P46=\"Inconnu\",COUNTRY_INFO!P46=\"Surveillance\",COUNTRY_INFO!P46=\"Non requis\",COUNTRY_INFO!P46=0),0,IF(AND($E46<>0,$J46=\"\"),IF($F46=0,COUNTRY_INFO!P46*$E46,COUNTRY_INFO!P46*($E46-$D46)), IF(AND($E46<>0,$J46<>0),IF($F46=0,COUNTRY_INFO!P46*$J46,COUNTRY_INFO!P46*($J46-$D46)), COUNTRY_INFO!P46*$J46)))","v":71448},216232,0,null,0,216232,null,216232,0,null,0]
[{"$f":"IF(AND(INTRO!$E$37=\"Non endémique\",INTRO!$E$41=\"Non endémique\"),\" \",IF(COUNTRY_INFO!A47=0,\" \",COUNTRY_INFO!A47))","v":"TOGO"},{"$f":"IF(AND(INTRO!$E$37=\"Non endémique\",INTRO!$E$41=\"Non endémique\"),\" \",IF(COUNTRY_INFO!B47=0,\" \",COUNTRY_INFO!B47))","v":"SAVANES"},{"$f":"IF(AND(INTRO!$E$37=\"Non endémique\",INTRO!$E$41=\"Non endémique\"),\" \",IF(COUNTRY_INFO!C47=0,\" \",COUNTRY_INFO!C47))","v":"TANDJOUARE"},{"$f":"IF(AND(INTRO!$E$37=\"Non endémique\",INTRO!$E$41=\"Non endémique\"),0,COUNTRY_INFO!V47)","v":0},{"$f":"IF(AND(INTRO!$E$37=\"Non endémique\",INTRO!$E$41=\"Non endémique\"),0,COUNTRY_INFO!X47)","v":2},{"$f":"IF(INTRO!$E$39=\"Non endémique\",IF($D47=1,DEC!I47,0),IF($D47=1,IVM!G47,0))","v":0},2,{"$f":"IF(OR(COUNTRY_INFO!N47=\"Inconnu\",COUNTRY_INFO!N47=\"Surveillance\",COUNTRY_INFO!N47=\"Non requis\",COUNTRY_INFO!N47=0),0,IF(INTRO!$E$39=\"Non endémique\",IF(AND($E47<>0,$G47=\"\"),IF($F47=0,COUNTRY_INFO!N47*$E47,COUNTRY_INFO!N47*($E47-$D47)),IF(AND($E47<>0,$G47<>0),IF($F47=0,COUNTRY_INFO!N47*$G47,COUNTRY_INFO!N47*($G47-$D47)),0)),IF($G47=\"\",COUNTRY_INFO!N47*$E47,COUNTRY_INFO!N47*$G47)))","v":46504},{"$f":"IF(OR(COUNTRY_INFO!O47=\"Inconnu\",COUNTRY_INFO!O47=\"Surveillance\",COUNTRY_INFO!O47=\"Non requis\",COUNTRY_INFO!O47=0),0,IF($E47<>0, IF($F47=0,COUNTRY_INFO!O47*$E47,COUNTRY_INFO!O47*($E47-$D47)),COUNTRY_INFO!O47*$E47))","v":87196},2,{"$f":"IF(OR(COUNTRY_INFO!P47=\"Inconnu\",COUNTRY_INFO!P47=\"Surveillance\",COUNTRY_INFO!P47=\"Non requis\",COUNTRY_INFO!P47=0),0,IF(AND($E47<>0,$J47=\"\"),IF($F47=0,COUNTRY_INFO!P47*$E47,COUNTRY_INFO!P47*($E47-$D47)), IF(AND($E47<>0,$J47<>0),IF($F47=0,COUNTRY_INFO!P47*$J47,COUNTRY_INFO!P47*($J47-$D47)), COUNTRY_INFO!P47*$J47)))","v":65978},199678,0,null,0,199678,null,199678,0,null,0]
[{"$f":"IF(AND(INTRO!$E$37=\"Non endémique\",INTRO!$E$41=\"Non endémique\"),\" \",IF(COUNTRY_INFO!A48=0,\" \",COUNTRY_INFO!A48))","v":"TOGO"},{"$f":"IF(AND(INTRO!$E$37=\"Non endémique\",INTRO!$E$41=\"Non endémique\"),\" \",IF(COUNTRY_INFO!B48=0,\" \",COUNTRY_INFO!B48))","v":"SAVANES"},{"$f":"IF(AND(INTRO!$E$37=\"Non endémique\",INTRO!$E$41=\"Non endémique\"),\" \",IF(COUNTRY_INFO!C48=0,\" \",COUNTRY_INFO!C48))","v":"TONE"},{"$f":"IF(AND(INTRO!$E$37=\"Non endémique\",INTRO!$E$41=\"Non endémique\"),0,COUNTRY_INFO!V48)","v":0},{"$f":"IF(AND(INTRO!$E$37=\"Non endémique\",INTRO!$E$41=\"Non endémique\"),0,COUNTRY_INFO!X48)","v":1},{"$f":"IF(INTRO!$E$39=\"Non endémique\",IF($D48=1,DEC!I48,0),IF($D48=1,IVM!G48,0))","v":0},1,{"$f":"IF(OR(COUNTRY_INFO!N48=\"Inconnu\",COUNTRY_INFO!N48=\"Surveillance\",COUNTRY_INFO!N48=\"Non requis\",COUNTRY_INFO!N48=0),0,IF(INTRO!$E$39=\"Non endémique\",IF(AND($E48<>0,$G48=\"\"),IF($F48=0,COUNTRY_INFO!N48*$E48,COUNTRY_INFO!N48*($E48-$D48)),IF(AND($E48<>0,$G48<>0),IF($F48=0,COUNTRY_INFO!N48*$G48,COUNTRY_INFO!N48*($G48-$D48)),0)),IF($G48=\"\",COUNTRY_INFO!N48*$E48,COUNTRY_INFO!N48*$G48)))","v":65098},{"$f":"IF(OR(COUNTRY_INFO!O48=\"Inconnu\",COUNTRY_INFO!O48=\"Surveillance\",COUNTRY_INFO!O48=\"Non requis\",COUNTRY_INFO!O48=0),0,IF($E48<>0, IF($F48=0,COUNTRY_INFO!O48*$E48,COUNTRY_INFO!O48*($E48-$D48)),COUNTRY_INFO!O48*$E48))","v":122059},0,{"$f":"IF(OR(COUNTRY_INFO!P48=\"Inconnu\",COUNTRY_INFO!P48=\"Surveillance\",COUNTRY_INFO!P48=\"Non requis\",COUNTRY_INFO!P48=0),0,IF(AND($E48<>0,$J48=\"\"),IF($F48=0,COUNTRY_INFO!P48*$E48,COUNTRY_INFO!P48*($E48-$D48)), IF(AND($E48<>0,$J48<>0),IF($F48=0,COUNTRY_INFO!P48*$J48,COUNTRY_INFO!P48*($J48-$D48)), COUNTRY_INFO!P48*$J48)))","v":0},187157,0,null,0,187157,null,187157,0,null,0]

{"sheet":"PZQ","index":4,"n_rows":48,"n_cols":18,"rows_kept":48,"cut":false,"hidden":false,"merged":[[3,0,3,2],[5,0,5,2],[5,4,5,7],[5,8,5,9],[6,17,7,17],[6,6,7,6],[6,7,7,7],[6,9,7,9],[6,0,7,0],[6,1,7,1],[6,2,7,2],[6,4,7,4],[5,3,7,3],[6,5,7,5],[6,8,7,8],[6,12,7,12],[5,12,5,17],[5,10,5,11],[6,10,7,10],[6,14,7,14],[6,15,7,15],[6,16,7,16],[6,13,7,13],[6,11,7,11]]}
["Praziquantel (PZQ)"]
["Structure administrative, population ciblée par groupe d'âge, plan de traitement et information sur les comprimés"]
[]
["TOTAL",null,null,null,{"$f":"SUBTOTAL(9,E$10:E$1010)","v":945249.50103198702},1770291.1788952323,739929.20537289302,3455469.885300112,null,690984.56506060786,null,null,{"$f":"SUBTOTAL(9,M$10:M$1010)","v":0},3851872.3577904645,2600097.6161186798,6451969.9739091424,0,6451969.9739091424]
[]
["Structure administrative du pays",null,null,"Plan de traitement\nSCH","Population cible pour SCH",null,null,null,"Hotspots",null,"Année précédent l’AMM",null,"Praziquantel (PZQ)"]
["Pays","Région/Département","District",null,"EAPréS","EAS","Adultes","Total","Prévue","Population","Tournées","Groupes d'âge","EAPréS","EAS","Adultes","Total requis","Reste en stock","Comprimés devant être fournis"]
[]
[]
[{"$f":"IF(INTRO!$E$43=\"Non endémique\",\" \", IF(COUNTRY_INFO!A10=0,\" \",COUNTRY_INFO!A10))","v":"TOGO"},{"$f":"IF(INTRO!$E$43=\"Non endémique\",\" \", IF(COUNTRY_INFO!B10=0,\" \",COUNTRY_INFO!B10))","v":"CENTRALE"},{"$f":"IF(INTRO!$E$43=\"Non endémique\",\" \", IF(COUNTRY_INFO!C10=0,\" \",COUNTRY_INFO!C10))","v":"BLITTA"},{"$f":"IF(INTRO!$E$43=\"Non endémique\", \"Non requis\", COUNTRY_INFO!Y10)","v":2},{"$f":"IF(OR(COUNTRY_INFO!R10=\"Inconnu\",COUNTRY_INFO!R10=\"Surveillance\",COUNTRY_INFO!R10=\"Non requis\",COUNTRY_INFO!R10=0),0,IF($D10<>0, COUNTRY_INFO!R10,0))","v":29210.509055999999},{"$f":"IF(OR(COUNTRY_INFO!S10=\"Inconnu\",COUNTRY_INFO!S10=\"Surveillance\",COUNTRY_INFO!S10=\"Non requis\",COUNTRY_INFO!S10=0),0,IF($D10<>0, COUNTRY_INFO!S10,0))","v":54769.704479999993},{"$f":"IF(OR(COUNTRY_INFO!T10=\"Inconnu\",COUNTRY_INFO!T10=\"Surveillance\",COUNTRY_INFO!T10=\"Non requis\",COUNTRY_INFO!T10=0),0,IF($D10<>0, COUNTRY_INFO!T10,0))","v":50714.120637599997},{"$f":"SUM(E10:G10)","v":134694.33417359999},"Oui",25937.399807999998,2,"EAS et Adultes",null,{"$f":"IF($I10<>\"Oui\",$F10*2,($F10+ROUND(J10*$F10/SUM(COUNTRY_INFO!$E10:$G10),0))*2)","v":126859.40895999999},{"$f":"IF($I10<>\"Oui\",$G10*3,($G10+ROUND(J10*$G10/SUM(COUNTRY_INFO!$E10:$G10),0))*3)","v":176199.3619128},{"$f":"SUM(M10:O10)","v":303058.77087279997},null,{"$f":"IF($P10>$Q10,P10-Q10,0)","v":303058.77087279997}]
[{"$f":"IF(INTRO!$E$43=\"Non endémique\",\" \", IF(COUNTRY_INFO!A11=0,\" \",COUNTRY_INFO!A11))","v":"TOGO"},{"$f":"IF(INTRO!$E$43=\"Non endémique\",\" \", IF(COUNTRY_INFO!B11=0,\" \",COUNTRY_INFO!B11))","v":"CENTRALE"},{"$f":"IF(INTRO!$E$43=\"Non endémique\",\" \", IF(COUNTRY_INFO!C11=0,\" \",COUNTRY_INFO!C11))","v":"MÔ"},{"$f":"IF(INTRO!$E$43=\"Non endémique\", \"Non requis\", COUNTRY_INFO!Y11)","v":1},{"$f":"IF(OR(COUNTRY_INFO!R11=\"Inconnu\",COUNTRY_INFO!R11=\"Surveillance\",COUNTRY_INFO!R11=\"Non requis\",COUNTRY_INFO!R11=0),0,IF($D11<>0, COUNTRY_INFO!R11,0))","v":5186.42688},{"$f":"IF(OR(COUNTRY_INFO!S11=\"Inconnu\",COUNTRY_INFO!S11=\"Surveillance\",COUNTRY_INFO!S11=\"Non requis\",COUNTRY_INFO!S11=0),0,IF($D11<>0, COUNTRY_INFO!S11,0))","v":9724.5503999999983},{"$f":"IF(OR(COUNTRY_INFO!T11=\"Inconnu\",COUNTRY_INFO!T11=\"Surveillance\",COUNTRY_INFO!T11=\"Non requis\",COUNTRY_INFO!T11=0),0,IF($D11<>0, COUNTRY_INFO!T11,0))","v":0},{"$f":"SUM(E11:G11)","v":14910.977279999999},null,null,null,null,null,{"$f":"IF($I11<>\"Oui\",$F11*2,($F11+ROUND(J11*$F11/SUM(COUNTRY_INFO!$E11:$G11),0))*2)","v":19449.100799999997},{"$f":"IF($I11<>\"Oui\",$G11*3,($G11+ROUND(J11*$G11/SUM(COUNTRY_INFO!$E11:$G11),0))*3)","v":0},{"$f":"SUM(M11:O11)","v":19449.100799999997},null,{"$f":"IF($P11>$Q11,P11-Q11,0)","v":19449.100799999997}]
[{"$f":"IF(INTRO!$E$43=\"Non endémique\",\" \", IF(COUNTRY_INFO!A12=0,\" \",COUNTRY_INFO!A12))","v":"TOGO"},{"$f":"IF(INTRO!$E$43=\"Non endémique\",\" \", IF(COUNTRY_INFO!B12=0,\" \",COUNTRY_INFO!B12))","v":"CENTRALE"},{"$f":"IF(INTRO!$E$43=\"Non endémique\",\" \", IF(COUNTRY_INFO!C12=0,\" \",COUNTRY_INFO!C12))","v":"SOTOUBOUA"},{"$f":"IF(INTRO!$E$43=\"Non endémique\", \"Non requis\", COUNTRY_INFO!Y12)","v":1},{"$f":"IF(OR(COUNTRY_INFO!R12=\"Inconnu\",COUNTRY_INFO!R12=\"Surveillance\",COUNTRY_INFO!R12=\"Non requis\",COUNTRY_INFO!R12=0),0,IF($D12<>0, COUNTRY_INFO!R12,0))","v":16186.522368000002},{"$f":"IF(OR(COUNTRY_INFO!S12=\"Inconnu\",COUNTRY_INFO!S12=\"Surveillance\",COUNTRY_INFO!S12=\"Non requis\",COUNTRY_INFO!S12=0),0,IF($D12<>0, COUNTRY_INFO!S12,0))","v":30349.729439999999},{"$f":"IF(OR(COUNTRY_INFO!T12=\"Inconnu\",COUNTRY_INFO!T12=\"Surveillance\",COUNTRY_INFO!T12=\"Non requis\",COUNTRY_INFO!T12=0),0,IF($D12<>0, COUNTRY_INFO!T12,0))","v":1324.5771432000001},47860.828951200005,null,null,null,null,null,{"$f":"IF($I12<>\"Oui\",$F12*2,($F12+ROUND(J12*$F12/SUM(COUNTRY_INFO!$E12:$G12),0))*2)","v":60699.458879999998},{"$f":"IF($I12<>\"Oui\",$G12*3,($G12+ROUND(J12*$G12/SUM(COUNTRY_INFO!$E12:$G12),0))*3)","v":3973.7314296000004},64673.190309600002,null,64673.190309600002]
[{"$f":"IF(INTRO!$E$43=\"Non endémique\",\" \", IF(COUNTRY_INFO!A13=0,\" \",COUNTRY_INFO!A13))","v":"TOGO"},{"$f":"IF(INTRO!$E$43=\"Non endémique\",\" \", IF(COUNTRY_INFO!B13=0,\" \",COUNTRY_INFO!B13))","v":"CENTRALE"},{"$f":"IF(INTRO!$E$43=\"Non endémique\",\" \", IF(COUNTRY_INFO!C13=0,\" \",COUNTRY_INFO!C13))","v":"TCHAMBA"},{"$f":"IF(INTRO!$E$43=\"Non endémique\", \"Non requis\", COUNTRY_INFO!Y13)","v":1},{"$f":"IF(OR(COUNTRY_INFO!R13=\"Inconnu\",COUNTRY_INFO!R13=\"Surveillance\",COUNTRY_INFO!R13=\"Non requis\",COUNTRY_INFO!R13=0),0,IF($D13<>0, COUNTRY_INFO!R13,0))","v":31842.719424000006},{"$f":"IF(OR(COUNTRY_INFO!S13=\"Inconnu\",COUNTRY_INFO!S13=\"Surveillance\",COUNTRY_INFO!S13=\"Non requis\",COUNTRY_INFO!S13=0),0,IF($D13<>0, COUNTRY_INFO!S13,0))","v":59705.098919999989},{"$f":"IF(OR(COUNTRY_INFO!T13=\"Inconnu\",COUNTRY_INFO!T13=\"Surveillance\",COUNTRY_INFO!T13=\"Non requis\",COUNTRY_INFO!T13=0),0,IF($D13<>0, COUNTRY_INFO!T13,0))","v":0},91547.818343999999,null,null,null,null,null,{"$f":"IF($I13<>\"Oui\",$F13*2,($F13+ROUND(J13*$F13/SUM(COUNTRY_INFO!$E13:$G13),0))*2)","v":119410.19783999998},{"$f":"IF($I13<>\"Oui\",$G13*3,($G13+ROUND(J13*$G13/SUM(COUNTRY_INFO!$E13:$G13),0))*3)","v":0},119410.19783999998,null,119410.19783999998]
[{"$f":"IF(INTRO!$E$43=\"Non endémique\",\" \", IF(COUNTRY_INFO!A14=0,\" \",COUNTRY_INFO!A14))","v":"TOGO"},{"$f":"IF(INTRO!$E$43=\"Non endémique\",\" \", IF(COUNTRY_INFO!B14=0,\" \",COUNTRY_INFO!B14))","v":"CENTRALE"},{"$f":"IF(INTRO!$E$43=\"Non endémique\",\" \", IF(COUNTRY_INFO!C14=0,\" \",COUNTRY_INFO!C14))","v":"TCHAOUDJO"},{"$f":"IF(INTRO!$E$43=\"Non endémique\", \"Non requis\", COUNTRY_INFO!Y14)","v":1},{"$f":"IF(OR(COUNTRY_INFO!R14=\"Inconnu\",COUNTRY_INFO!R14=\"Surveillance\",COUNTRY_INFO!R14=\"Non requis\",COUNTRY_INFO!R14=0),0,IF($D14<>0, COUNTRY_INFO!R14,0))","v":28386.30816},{"$f":"IF(OR(COUNTRY_INFO!S14=\"Inconnu\",COUNTRY_INFO!S14=\"Surveillance\",COUNTRY_INFO!S14=\"Non requis\",COUNTRY_INFO!S14=0),0,IF($D14<>0, COUNTRY_INFO!S14,0))","v":53224.327799999992},{"$f":"IF(OR(COUNTRY_INFO!T14=\"Inconnu\",COUNTRY_INFO!T14=\"Surveillance\",COUNTRY_INFO!T14=\"Non requis\",COUNTRY_INFO!T14=0),0,IF($D14<>0, COUNTRY_INFO!T14,0))","v":11330.931768},92941.56772799998,null,null,null,null,null,{"$f":"IF($I14<>\"Oui\",$F14*2,($F14+ROUND(J14*$F14/SUM(COUNTRY_INFO!$E14:$G14),0))*2)","v":106448.65559999998},{"$f":"IF($I14<>\"Oui\",$G14*3,($G14+ROUND(J14*$G14/SUM(COUNTRY_INFO!$E14:$G14),0))*3)","v":33992.795303999999},140441.45090399997,null,140441.45090399997]
[{"$f":"IF(INTRO!$E$43=\"Non endémique\",\" \", IF(COUNTRY_INFO!A15=0,\" \",COUNTRY_INFO!A15))","v":"TOGO"},{"$f":"IF(INTRO!$E$43=\"Non endémique\",\" \", IF(COUNTRY_INFO!B15=0,\" \",COUNTRY_INFO!B15))","v":"GRAND LOME"},{"$f":"IF(INTRO!$E$43=\"Non endémique\",\" \", IF(COUNTRY_INFO!C15=0,\" \",COUNTRY_INFO!C15))","v":"AGOE-NYIVE"},{"$f":"IF(INTRO!$E$43=\"Non endémique\", \"Non requis\", COUNTRY_INFO!Y15)","v":2},{"$f":"IF(OR(COUNTRY_INFO!R15=\"Inconnu\",COUNTRY_INFO!R15=\"Surveillance\",COUNTRY_INFO!R15=\"Non requis\",COUNTRY_INFO!R15=0),0,IF($D15<>0, COUNTRY_INFO!R15,0))","v":79974.801215999993},{"$f":"IF(OR(COUNTRY_INFO!S15=\"Inconnu\",COUNTRY_INFO!S15=\"Surveillance\",COUNTRY_INFO!S15=\"Non requis\",COUNTRY_INFO!S15=0),0,IF($D15<>0, COUNTRY_INFO!S15,0))","v":149952.75227999996},{"$f":"IF(OR(COUNTRY_INFO!T15=\"Inconnu\",COUNTRY_INFO!T15=\"Surveillance\",COUNTRY_INFO!T15=\"Non requis\",COUNTRY_INFO!T15=0),0,IF($D15<>0, COUNTRY_INFO!T15,0))","v":167621.48699999999},397549.04049599997,"Oui",321833.25503999996,2,"EAS et Adultes",null,{"$f":"IF($I15<>\"Oui\",$F15*2,($F15+ROUND(J15*$F15/SUM(COUNTRY_INFO!$E15:$G15),0))*2)","v":408743.50455999991},{"$f":"IF($I15<>\"Oui\",$G15*3,($G15+ROUND(J15*$G15/SUM(COUNTRY_INFO!$E15:$G15),0))*3)","v":685357.46100000001},1094100.9655599999,null,1094100.9655599999]
[{"$f":"IF(INTRO!$E$43=\"Non endémique\",\" \", IF(COUNTRY_INFO!A16=0,\" \",COUNTRY_INFO!A16))","v":"TOGO"},{"$f":"IF(INTRO!$E$43=\"Non endémique\",\" \", IF(COUNTRY_INFO!B16=0,\" \",COUNTRY_INFO!B16))","v":"GRAND LOME"},{"$f":"IF(INTRO!$E$43=\"Non endémique\",\" \", IF(COUNTRY_INFO!C16=0,\" \",COUNTRY_INFO!C16))","v":"GOLFE"},{"$f":"IF(INTRO!$E$43=\"Non endémique\", \"Non requis\", COUNTRY_INFO!Y16)","v":1},{"$f":"IF(OR(COUNTRY_INFO!R16=\"Inconnu\",COUNTRY_INFO!R16=\"Surveillance\",COUNTRY_INFO!R16=\"Non requis\",COUNTRY_INFO!R16=0),0,IF($D16<>0, COUNTRY_INFO!R16,0))","v":28517.449728000003},{"$f":"IF(OR(COUNTRY_INFO!S16=\"Inconnu\",COUNTRY_INFO!S16=\"Surveillance\",COUNTRY_INFO!S16=\"Non requis\",COUNTRY_INFO!S16=0),0,IF($D16<>0, COUNTRY_INFO!S16,0))","v":53470.218240000002},{"$f":"IF(OR(COUNTRY_INFO!T16=\"Inconnu\",COUNTRY_INFO!T16=\"Surveillance\",COUNTRY_INFO!T16=\"Non requis\",COUNTRY_INFO!T16=0),0,IF($D16<>0, COUNTRY_INFO!T16,0))","v":0},81987.667968000009,null,null,null,null,null,{"$f":"IF($I16<>\"Oui\",$F16*2,($F16+ROUND(J16*$F16/SUM(COUNTRY_INFO!$E16:$G16),0))*2)","v":106940.43648},{"$f":"IF($I16<>\"Oui\",$G16*3,($G16+ROUND(J16*$G16/SUM(COUNTRY_INFO!$E16:$G16),0))*3)","v":0},106940.43648,null,106940.43648]
[{"$f":"IF(INTRO!$E$43=\"Non endémique\",\" \", IF(COUNTRY_INFO!A17=0,\" \",COUNTRY_INFO!A17))","v":"TOGO"},{"$f":"IF(INTRO!$E$43=\"Non endémique\",\" \", IF(COUNTRY_INFO!B17=0,\" \",COUNTRY_INFO!B17))","v":"KARA"},{"$f":"IF(INTRO!$E$43=\"Non endémique\",\" \", IF(COUNTRY_INFO!C17=0,\" \",COUNTRY_INFO!C17))","v":"ASSOLI"},{"$f":"IF(INTRO!$E$43=\"Non endémique\", \"Non requis\", COUNTRY_INFO!Y17)","v":2},{"$f":"IF(OR(COUNTRY_INFO!R17=\"Inconnu\",COUNTRY_INFO!R17=\"Surveillance\",COUNTRY_INFO!R17=\"Non requis\",COUNTRY_INFO!R17=0),0,IF($D17<>0, COUNTRY_INFO!R17,0))","v":7554.8732160000009},{"$f":"IF(OR(COUNTRY_INFO!S17=\"Inconnu\",COUNTRY_INFO!S17=\"Surveillance\",COUNTRY_INFO!S17=\"Non requis\",COUNTRY_INFO!S17=0),0,IF($D17<>0, COUNTRY_INFO!S17,0))","v":14165.387279999999},{"$f":"IF(OR(COUNTRY_INFO!T17=\"Inconnu\",COUNTRY_INFO!T17=\"Surveillance\",COUNTRY_INFO!T17=\"Non requis\",COUNTRY_INFO!T17=0),0,IF($D17<>0, COUNTRY_INFO!T17,0))","v":4622.6580000000004},26342.918495999998,"Oui",8875.5033600000006,2,"EAS et Adultes",null,{"$f":"IF($I17<>\"Oui\",$F17*2,($F17+ROUND(J17*$F17/SUM(COUNTRY_INFO!$E17:$G17),0))*2)","v":32100.774559999998},{"$f":"IF($I17<>\"Oui\",$G17*3,($G17+ROUND(J17*$G17/SUM(COUNTRY_INFO!$E17:$G17),0))*3)","v":15712.974000000002},47813.74856,null,47813.74856]
[{"$f":"IF(INTRO!$E$43=\"Non endémique\",\" \", IF(COUNTRY_INFO!A18=0,\" \",COUNTRY_INFO!A18))","v":"TOGO"},{"$f":"IF(INTRO!$E$43=\"Non endémique\",\" \", IF(COUNTRY_INFO!B18=0,\" \",COUNTRY_INFO!B18))","v":"KARA"},{"$f":"IF(INTRO!$E$43=\"Non endémique\",\" \", IF(COUNTRY_INFO!C18=0,\" \",COUNTRY_INFO!C18))","v":"BASSAR"},{"$f":"IF(INTRO!$E$43=\"Non endémique\", \"Non requis\", COUNTRY_INFO!Y18)","v":1},{"$f":"IF(OR(COUNTRY_INFO!R18=\"Inconnu\",COUNTRY_INFO!R18=\"Surveillance\",COUNTRY_INFO!R18=\"Non requis\",COUNTRY_INFO!R18=0),0,IF($D18<>0, COUNTRY_INFO!R18,0))","v":21649.876799999998},{"$f":"IF(OR(COUNTRY_INFO!S18=\"Inconnu\",COUNTRY_INFO!S18=\"Surveillance\",COUNTRY_INFO!S18=\"Non requis\",COUNTRY_INFO!S18=0),0,IF($D18<>0, COUNTRY_INFO!S18,0))","v":40593.518999999993},{"$f":"IF(OR(COUNTRY_INFO!T18=\"Inconnu\",COUNTRY_INFO!T18=\"Surveillance\",COUNTRY_INFO!T18=\"Non requis\",COUNTRY_INFO!T18=0),0,IF($D18<>0, COUNTRY_INFO!T18,0))","v":3388.0637999999999},65631.459599999987,null,null,null,null,null,{"$f":"IF($I18<>\"Oui\",$F18*2,($F18+ROUND(J18*$F18/SUM(COUNTRY_INFO!$E18:$G18),0))*2)","v":81187.037999999986},{"$f":"IF($I18<>\"Oui\",$G18*3,($G18+ROUND(J18*$G18/SUM(COUNTRY_INFO!$E18:$G18),0))*3)","v":10164.1914},91351.229399999982,null,91351.229399999982]
[{"$f":"IF(INTRO!$E$43=\"Non endémique\",\" \", IF(COUNTRY_INFO!A19=0,\" \",COUNTRY_INFO!A19))","v":"TOGO"},{"$f":"IF(INTRO!$E$43=\"Non endémique\",\" \", IF(COUNTRY_INFO!B19=0,\" \",COUNTRY_INFO!B19))","v":"KARA"},{"$f":"IF(INTRO!$E$43=\"Non endémique\",\" \", IF(COUNTRY_INFO!C19=0,\" \",COUNTRY_INFO!C19))","v":"BINAH"},{"$f":"IF(INTRO!$E$43=\"Non endémique\", \"Non requis\", COUNTRY_INFO!Y19)","v":1},{"$f":"IF(OR(COUNTRY_INFO!R19=\"Inconnu\",COUNTRY_INFO!R19=\"Surveillance\",COUNTRY_INFO!R19=\"Non requis\",COUNTRY_INFO!R19=0),0,IF($D19<>0, COUNTRY_INFO!R19,0))","v":12693.253248000001},{"$f":"IF(OR(COUNTRY_INFO!S19=\"Inconnu\",COUNTRY_INFO!S19=\"Surveillance\",COUNTRY_INFO!S19=\"Non requis\",COUNTRY_INFO!S19=0),0,IF($D19<>0, COUNTRY_INFO!S19,0))","v":23799.849839999995},{"$f":"IF(OR(COUNTRY_INFO!T19=\"Inconnu\",COUNTRY_INFO!T19=\"Surveillance\",COUNTRY_INFO!T19=\"Non requis\",COUNTRY_INFO!T19=0),0,IF($D19<>0, COUNTRY_INFO!T19,0))","v":16463.051929199999},52956.155017199999,null,null,null,null,null,{"$f":"IF($I19<>\"Oui\",$F19*2,($F19+ROUND(J19*$F19/SUM(COUNTRY_INFO!$E19:$G19),0))*2)","v":47599.699679999991},{"$f":"IF($I19<>\"Oui\",$G19*3,($G19+ROUND(J19*$G19/SUM(COUNTRY_INFO!$E19:$G19),0))*3)","v":49389.155787600001},96988.855467599991,null,96988.855467599991]
[{"$f":"IF(INTRO!$E$43=\"Non endémique\",\" \", IF(COUNTRY_INFO!A20=0,\" \",COUNTRY_INFO!A20))","v":"TOGO"},{"$f":"IF(INTRO!$E$43=\"Non endémique\",\" \", IF(COUNTRY_INFO!B20=0,\" \",COUNTRY_INFO!B20))","v":"KARA"},{"$f":"IF(INTRO!$E$43=\"Non endémique\",\" \", IF(COUNTRY_INFO!C20=0,\" \",COUNTRY_INFO!C20))","v":"DANKPEN"},{"$f":"IF(INTRO!$E$43=\"Non endémique\", \"Non requis\", COUNTRY_INFO!Y20)","v":1},{"$f":"IF(OR(COUNTRY_INFO!R20=\"Inconnu\",COUNTRY_INFO!R20=\"Surveillance\",COUNTRY_INFO!R20=\"Non requis\",COUNTRY_INFO!R20=0),0,IF($D20<>0, COUNTRY_INFO!R20,0))","v":10353.108479999999},{"$f":"IF(OR(COUNTRY_INFO!S20=\"Inconnu\",COUNTRY_INFO!S20=\"Surveillance\",COUNTRY_INFO!S20=\"Non requis\",COUNTRY_INFO!S20=0),0,IF($D20<>0, COUNTRY_INFO!S20,0))","v":19412.078399999999},{"$f":"IF(OR(COUNTRY_INFO!T20=\"Inconnu\",COUNTRY_INFO!T20=\"Surveillance\",COUNTRY_INFO!T20=\"Non requis\",COUNTRY_INFO!T20=0),0,IF($D20<>0, COUNTRY_INFO!T20,0))","v":0},29765.186879999997,null,null,null,null,null,{"$f":"IF($I20<>\"Oui\",$F20*2,($F20+ROUND(J20*$F20/SUM(COUNTRY_INFO!$E20:$G20),0))*2)","v":38824.156799999997},{"$f":"IF($I20<>\"Oui\",$G20*3,($G20+ROUND(J20*$G20/SUM(COUNTRY_INFO!$E20:$G20),0))*3)","v":0},38824.156799999997,null,38824.156799999997]
[{"$f":"IF(INTRO!$E$43=\"Non endémique\",\" \", IF(COUNTRY_INFO!A21=0,\" \",COUNTRY_INFO!A21))","v":"TOGO"},{"$f":"IF(INTRO!$E$43=\"Non endémique\",\" \", IF(COUNTRY_INFO!B21=0,\" \",COUNTRY_INFO!B21))","v":"KARA"},{"$f":"IF(INTRO!$E$43=\"Non endémique\",\" \", IF(COUNTRY_INFO!C21=0,\" \",COUNTRY_INFO!C21))","v":"DOUFELGOU"},{"$f":"IF(INTRO!$E$43=\"Non endémique\", \"Non requis\", COUNTRY_INFO!Y21)","v":2},{"$f":"IF(OR(COUNTRY_INFO!R21=\"Inconnu\",COUNTRY_INFO!R21=\"Surveillance\",COUNTRY_INFO!R21=\"Non requis\",COUNTRY_INFO!R21=0),0,IF($D21<>0, COUNTRY_INFO!R21,0))","v":14915.749056000001},{"$f":"IF(OR(COUNTRY_INFO!S21=\"Inconnu\",COUNTRY_INFO!S21=\"Surveillance\",COUNTRY_INFO!S21=\"Non requis\",COUNTRY_INFO!S21=0),0,IF($D21<>0, COUNTRY_INFO!S21,0))","v":27967.029480000001},{"$f":"IF(OR(COUNTRY_INFO!T21=\"Inconnu\",COUNTRY_INFO!T21=\"Surveillance\",COUNTRY_INFO!T21=\"Non requis\",COUNTRY_INFO!T21=0),0,IF($D21<>0, COUNTRY_INFO!T21,0))","v":14506.472594399998},57389.251130399993,"Oui",21434.488703999999,2,"EAS et Adultes",null,{"$f":"IF($I21<>\"Oui\",$F21*2,($F21+ROUND(J21*$F21/SUM(COUNTRY_INFO!$E21:$G21),0))*2)","v":70012.058959999995},{"$f":"IF($I21<>\"Oui\",$G21*3,($G21+ROUND(J21*$G21/SUM(COUNTRY_INFO!$E21:$G21),0))*3)","v":54472.417783199999},124484.47674319999,null,124484.47674319999]
[{"$f":"IF(INTRO!$E$43=\"Non endémique\",\" \", IF(COUNTRY_INFO!A22=0,\" \",COUNTRY_INFO!A22))","v":"TOGO"},{"$f":"IF(INTRO!$E$43=\"Non endémique\",\" \", IF(COUNTRY_INFO!B22=0,\" \",COUNTRY_INFO!B22))","v":"KARA"},{"$f":"IF(INTRO!$E$43=\"Non endémique\",\" \", IF(COUNTRY_INFO!C22=0,\" \",COUNTRY_INFO!C22))","v":"KERAN"},{"$f":"IF(INTRO!$E$43=\"Non endémique\", \"Non requis\", COUNTRY_INFO!Y22)","v":1},{"$f":"IF(OR(COUNTRY_INFO!R22=\"Inconnu\",COUNTRY_INFO!R22=\"Surveillance\",COUNTRY_INFO!R22=\"Non requis\",COUNTRY_INFO!R22=0),0,IF($D22<>0, COUNTRY_INFO!R22,0))","v":21716.681664},{"$f":"IF(OR(COUNTRY_INFO!S22=\"Inconnu\",COUNTRY_INFO!S22=\"Surveillance\",COUNTRY_INFO!S22=\"Non requis\",COUNTRY_INFO!S22=0),0,IF($D22<>0, COUNTRY_INFO!S22,0))","v":40718.778120000003},{"$f":"IF(OR(COUNTRY_INFO!T22=\"Inconnu\",COUNTRY_INFO!T22=\"Surveillance\",COUNTRY_INFO!T22=\"Non requis\",COUNTRY_INFO!T22=0),0,IF($D22<>0, COUNTRY_INFO!T22,0))","v":18515.372218800003},80950.832002800016,null,null,null,null,null,{"$f":"IF($I22<>\"Oui\",$F22*2,($F22+ROUND(J22*$F22/SUM(COUNTRY_INFO!$E22:$G22),0))*2)","v":81437.556240000005},{"$f":"IF($I22<>\"Oui\",$G22*3,($G22+ROUND(J22*$G22/SUM(COUNTRY_INFO!$E22:$G22),0))*3)","v":55546.116656400009},136983.67289640001,null,136983.67289640001]
[{"$f":"IF(INTRO!$E$43=\"Non endémique\",\" \", IF(COUNTRY_INFO!A23=0,\" \",COUNTRY_INFO!A23))","v":"TOGO"},{"$f":"IF(INTRO!$E$43=\"Non endémique\",\" \", IF(COUNTRY_INFO!B23=0,\" \",COUNTRY_INFO!B23))","v":"KARA"},{"$f":"IF(INTRO!$E$43=\"Non endémique\",\" \", IF(COUNTRY_INFO!C23=0,\" \",COUNTRY_INFO!C23))","v":"KOZAH"},{"$f":"IF(INTRO!$E$43=\"Non endémique\", \"Non requis\", COUNTRY_INFO!Y23)","v":2},{"$f":"IF(OR(COUNTRY_INFO!R23=\"Inconnu\",COUNTRY_INFO!R23=\"Surveillance\",COUNTRY_INFO!R23=\"Non requis\",COUNTRY_INFO!R23=0),0,IF($D23<>0, COUNTRY_INFO!R23,0))","v":48809.180352000003},{"$f":"IF(OR(COUNTRY_INFO!S23=\"Inconnu\",COUNTRY_INFO!S23=\"Surveillance\",COUNTRY_INFO!S23=\"Non requis\",COUNTRY_INFO!S23=0),0,IF($D23<>0, COUNTRY_INFO!S23,0))","v":91517.213160000014},{"$f":"IF(OR(COUNTRY_INFO!T23=\"Inconnu\",COUNTRY_INFO!T23=\"Surveillance\",COUNTRY_INFO!T23=\"Non requis\",COUNTRY_INFO!T23=0),0,IF($D23<>0, COUNTRY_INFO!T23,0))","v":47678.535795600001},188004.92930760002,"Oui",38603.996927999993,2,"EAS et Adultes",null,{"$f":"IF($I23<>\"Oui\",$F23*2,($F23+ROUND(J23*$F23/SUM(COUNTRY_INFO!$E23:$G23),0))*2)","v":207822.42632000003},{"$f":"IF($I23<>\"Oui\",$G23*3,($G23+ROUND(J23*$G23/SUM(COUNTRY_INFO!$E23:$G23),0))*3)","v":162406.60738679999},370229.03370680002,null,370229.03370680002]
[{"$f":"IF(INTRO!$E$43=\"Non endémique\",\" \", IF(COUNTRY_INFO!A24=0,\" \",COUNTRY_INFO!A24))","v":"TOGO"},{"$f":"IF(INTRO!$E$43=\"Non endémique\",\" \", IF(COUNTRY_INFO!B24=0,\" \",COUNTRY_INFO!B24))","v":"MARITIME"},{"$f":"IF(INTRO!$E$43=\"Non endémique\",\" \", IF(COUNTRY_INFO!C24=0,\" \",COUNTRY_INFO!C24))","v":"AVE"},{"$f":"IF(INTRO!$E$43=\"Non endémique\", \"Non requis\", COUNTRY_INFO!Y24)","v":1},{"$f":"IF(OR(COUNTRY_INFO!R24=\"Inconnu\",COUNTRY_INFO!R24=\"Surveillance\",COUNTRY_INFO!R24=\"Non requis\",COUNTRY_INFO!R24=0),0,IF($D24<>0, COUNTRY_INFO!R24,0))","v":21375.417407999998},{"$f":"IF(OR(COUNTRY_INFO!S24=\"Inconnu\",COUNTRY_INFO!S24=\"Surveillance\",COUNTRY_INFO!S24=\"Non requis\",COUNTRY_INFO!S24=0),0,IF($D24<>0, COUNTRY_INFO!S24,0))","v":40078.907639999998},{"$f":"IF(OR(COUNTRY_INFO!T24=\"Inconnu\",COUNTRY_INFO!T24=\"Surveillance\",COUNTRY_INFO!T24=\"Non requis\",COUNTRY_INFO!T24=0),0,IF($D24<>0, COUNTRY_INFO!T24,0))","v":6212.9531352000013},67667.278183200004,null,null,null,null,null,{"$f":"IF($I24<>\"Oui\",$F24*2,($F24+ROUND(J24*$F24/SUM(COUNTRY_INFO!$E24:$G24),0))*2)","v":80157.815279999995},{"$f":"IF($I24<>\"Oui\",$G24*3,($G24+ROUND(J24*$G24/SUM(COUNTRY_INFO!$E24:$G24),0))*3)","v":18638.859405600004},98796.674685599995,null,98796.674685599995]
[{"$f":"IF(INTRO!$E$43=\"Non endémique\",\" \", IF(COUNTRY_INFO!A25=0,\" \",COUNTRY_INFO!A25))","v":"TOGO"},{"$f":"IF(INTRO!$E$43=\"Non endémique\",\" \", IF(COUNTRY_INFO!B25=0,\" \",COUNTRY_INFO!B25))","v":"MARITIME"},{"$f":"IF(INTRO!$E$43=\"Non endémique\",\" \", IF(COUNTRY_INFO!C25=0,\" \",COUNTRY_INFO!C25))","v":"BAS MONO"},{"$f":"IF(INTRO!$E$43=\"Non endémique\", \"Non requis\", COUNTRY_INFO!Y25)","v":1},{"$f":"IF(OR(COUNTRY_INFO!R25=\"Inconnu\",COUNTRY_INFO!R25=\"Surveillance\",COUNTRY_INFO!R25=\"Non requis\",COUNTRY_INFO!R25=0),0,IF($D25<>0, COUNTRY_INFO!R25,0))","v":11727.215424000004},{"$f":"IF(OR(COUNTRY_INFO!S25=\"Inconnu\",COUNTRY_INFO!S25=\"Surveillance\",COUNTRY_INFO!S25=\"Non requis\",COUNTRY_INFO!S25=0),0,IF($D25<>0, COUNTRY_INFO!S25,0))","v":21988.528920000001},{"$f":"IF(OR(COUNTRY_INFO!T25=\"Inconnu\",COUNTRY_INFO!T25=\"Surveillance\",COUNTRY_INFO!T25=\"Non requis\",COUNTRY_INFO!T25=0),0,IF($D25<>0, COUNTRY_INFO!T25,0))","v":0},33715.744344000006,null,null,null,null,null,{"$f":"IF($I25<>\"Oui\",$F25*2,($F25+ROUND(J25*$F25/SUM(COUNTRY_INFO!$E25:$G25),0))*2)","v":43977.057840000001},{"$f":"IF($I25<>\"Oui\",$G25*3,($G25+ROUND(J25*$G25/SUM(COUNTRY_INFO!$E25:$G25),0))*3)","v":0},43977.057840000001,null,43977.057840000001]
[{"$f":"IF(INTRO!$E$43=\"Non endémique\",\" \", IF(COUNTRY_INFO!A26=0,\" \",COUNTRY_INFO!A26))","v":"TOGO"},{"$f":"IF(INTRO!$E$43=\"Non endémique\",\" \", IF(COUNTRY_INFO!B26=0,\" \",COUNTRY_INFO!B26))","v":"MARITIME"},{"$f":"IF(INTRO!$E$43=\"Non endémique\",\" \", IF(COUNTRY_INFO!C26=0,\" \",COUNTRY_INFO!C26))","v":"LACS"},{"$f":"IF(INTRO!$E$43=\"Non endémique\", \"Non requis\", COUNTRY_INFO!Y26)","v":2},{"$f":"IF(OR(COUNTRY_INFO!R26=\"Inconnu\",COUNTRY_INFO!R26=\"Surveillance\",COUNTRY_INFO!R26=\"Non requis\",COUNTRY_INFO!R26=0),0,IF($D26<>0, COUNTRY_INFO!R26,0))","v":26502.608447999995},{"$f":"IF(OR(COUNTRY_INFO!S26=\"Inconnu\",COUNTRY_INFO!S26=\"Surveillance\",COUNTRY_INFO!S26=\"Non requis\",COUNTRY_INFO!S26=0),0,IF($D26<>0, COUNTRY_INFO!S26,0))","v":49692.39084},{"$f":"IF(OR(COUNTRY_INFO!T26=\"Inconnu\",COUNTRY_INFO!T26=\"Surveillance\",COUNTRY_INFO!T26=\"Non requis\",COUNTRY_INFO!T26=0),0,IF($D26<>0, COUNTRY_INFO!T26,0))","v":28630.141799999998},104825.14108799999,"Oui",54969.872256000002,2,"EAS et Adultes",null,{"$f":"IF($I26<>\"Oui\",$F26*2,($F26+ROUND(J26*$F26/SUM(COUNTRY_INFO!$E26:$G26),0))*2)","v":121924.78168},{"$f":"IF($I26<>\"Oui\",$G26*3,($G26+ROUND(J26*$G26/SUM(COUNTRY_INFO!$E26:$G26),0))*3)","v":105369.42539999999},227294.20707999999,null,227294.20707999999]
[{"$f":"IF(INTRO!$E$43=\"Non endémique\",\" \", IF(COUNTRY_INFO!A27=0,\" \",COUNTRY_INFO!A27))","v":"TOGO"},{"$f":"IF(INTRO!$E$43=\"Non endémique\",\" \", IF(COUNTRY_INFO!B27=0,\" \",COUNTRY_INFO!B27))","v":"MARITIME"},{"$f":"IF(INTRO!$E$43=\"Non endémique\",\" \", IF(COUNTRY_INFO!C27=0,\" \",COUNTRY_INFO!C27))","v":"VO"},{"$f":"IF(INTRO!$E$43=\"Non endémique\", \"Non requis\", COUNTRY_INFO!Y27)","v":2},{"$f":"IF(OR(COUNTRY_INFO!R27=\"Inconnu\",COUNTRY_INFO!R27=\"Surveillance\",COUNTRY_INFO!R27=\"Non requis\",COUNTRY_INFO!R27=0),0,IF($D27<>0, COUNTRY_INFO!R27,0))","v":30137.385408000002},{"$f":"IF(OR(COUNTRY_INFO!S27=\"Inconnu\",COUNTRY_INFO!S27=\"Surveillance\",COUNTRY_INFO!S27=\"Non requis\",COUNTRY_INFO!S27=0),0,IF($D27<>0, COUNTRY_INFO!S27,0))","v":56507.59764},{"$f":"IF(OR(COUNTRY_INFO!T27=\"Inconnu\",COUNTRY_INFO!T27=\"Surveillance\",COUNTRY_INFO!T27=\"Non requis\",COUNTRY_INFO!T27=0),0,IF($D27<>0, COUNTRY_INFO!T27,0))","v":23431.065599999998},110076.048648,"Oui",44987.645951999999,2,"EAS et Adultes",null,{"$f":"IF($I27<>\"Oui\",$F27*2,($F27+ROUND(J27*$F27/SUM(COUNTRY_INFO!$E27:$G27),0))*2)","v":135565.19527999999},{"$f":"IF($I27<>\"Oui\",$G27*3,($G27+ROUND(J27*$G27/SUM(COUNTRY_INFO!$E27:$G27),0))*3)","v":84318.196799999991},219883.39207999996,null,219883.39207999996]
[{"$f":"IF(INTRO!$E$43=\"Non endémique\",\" \", IF(COUNTRY_INFO!A28=0,\" \",COUNTRY_INFO!A28))","v":"TOGO"},{"$f":"IF(INTRO!$E$43=\"Non endémique\",\" \", IF(COUNTRY_INFO!B28=0,\" \",COUNTRY_INFO!B28))","v":"MARITIME"},{"$f":"IF(INTRO!$E$43=\"Non endémique\",\" \", IF(COUNTRY_INFO!C28=0,\" \",COUNTRY_INFO!C28))","v":"YOTO"},{"$f":"IF(INTRO!$E$43=\"Non endémique\", \"Non requis\", COUNTRY_INFO!Y28)","v":1},{"$f":"IF(OR(COUNTRY_INFO!R28=\"Inconnu\",COUNTRY_INFO!R28=\"Surveillance\",COUNTRY_INFO!R28=\"Non requis\",COUNTRY_INFO!R28=0),0,IF($D28<>0, COUNTRY_INFO!R28,0))","v":35020.064063999998},{"$f":"IF(OR(COUNTRY_INFO!S28=\"Inconnu\",COUNTRY_INFO!S28=\"Surveillance\",COUNTRY_INFO!S28=\"Non requis\",COUNTRY_INFO!S28=0),0,IF($D28<>0, COUNTRY_INFO!S28,0))","v":65662.620119999992},{"$f":"IF(OR(COUNTRY_INFO!T28=\"Inconnu\",COUNTRY_INFO!T28=\"Surveillance\",COUNTRY_INFO!T28=\"Non requis\",COUNTRY_INFO!T28=0),0,IF($D28<>0, COUNTRY_INFO!T28,0))","v":1020.1625160000001},101702.84669999998,null,null,null,null,null,{"$f":"IF($I28<>\"Oui\",$F28*2,($F28+ROUND(J28*$F28/SUM(COUNTRY_INFO!$E28:$G28),0))*2)","v":131325.24023999998},{"$f":"IF($I28<>\"Oui\",$G28*3,($G28+ROUND(J28*$G28/SUM(COUNTRY_INFO!$E28:$G28),0))*3)","v":3060.4875480000001},134385.72778799999,null,134385.72778799999]
[{"$f":"IF(INTRO!$E$43=\"Non endémique\",\" \", IF(COUNTRY_INFO!A29=0,\" \",COUNTRY_INFO!A29))","v":"TOGO"},{"$f":"IF(INTRO!$E$43=\"Non endémique\",\" \", IF(COUNTRY_INFO!B29=0,\" \",COUNTRY_INFO!B29))","v":"MARITIME"},{"$f":"IF(INTRO!$E$43=\"Non endémique\",\" \", IF(COUNTRY_INFO!C29=0,\" \",COUNTRY_INFO!C29))","v":"ZIO"},{"$f":"IF(INTRO!$E$43=\"Non endémique\", \"Non requis\", COUNTRY_INFO!Y29)","v":2},{"$f":"IF(OR(COUNTRY_INFO!R29=\"Inconnu\",COUNTRY_INFO!R29=\"Surveillance\",COUNTRY_INFO!R29=\"Non requis\",COUNTRY_INFO!R29=0),0,IF($D29<>0, COUNTRY_INFO!R29,0))","v":63435.331967999984},{"$f":"IF(OR(COUNTRY_INFO!S29=\"Inconnu\",COUNTRY_INFO!S29=\"Surveillance\",COUNTRY_INFO!S29=\"Non requis\",COUNTRY_INFO!S29=0),0,IF($D29<>0, COUNTRY_INFO!S29,0))","v":118941.24743999998},{"$f":"IF(OR(COUNTRY_INFO!T29=\"Inconnu\",COUNTRY_INFO!T29=\"Surveillance\",COUNTRY_INFO!T29=\"Non requis\",COUNTRY_INFO!T29=0),0,IF($D29<>0, COUNTRY_INFO!T29,0))","v":29773.722600000001},212150.30200799997,"Oui",36350.073215999997,2,"EAS et Adultes",null,{"$f":"IF($I29<>\"Oui\",$F29*2,($F29+ROUND(J29*$F29/SUM(COUNTRY_INFO!$E29:$G29),0))*2)","v":255094.49487999995},{"$f":"IF($I29<>\"Oui\",$G29*3,($G29+ROUND(J29*$G29/SUM(COUNTRY_INFO!$E29:$G29),0))*3)","v":95783.167799999996},350877.66267999995,null,350877.66267999995]
[{"$f":"IF(INTRO!$E$43=\"Non endémique\",\" \", IF(COUNTRY_INFO!A30=0,\" \",COUNTRY_INFO!A30))","v":"TOGO"},{"$f":"IF(INTRO!$E$43=\"Non endémique\",\" \", IF(COUNTRY_INFO!B30=0,\" \",COUNTRY_INFO!B30))","v":"PLATEAUX"},{"$f":"IF(INTRO!$E$43=\"Non endémique\",\" \", IF(COUNTRY_INFO!C30=0,\" \",COUNTRY_INFO!C30))","v":"AGOU"},{"$f":"IF(INTRO!$E$43=\"Non endémique\", \"Non requis\", COUNTRY_INFO!Y30)","v":2},{"$f":"IF(OR(COUNTRY_INFO!R30=\"Inconnu\",COUNTRY_INFO!R30=\"Surveillance\",COUNTRY_INFO!R30=\"Non requis\",COUNTRY_INFO!R30=0),0,IF($D30<>0, COUNTRY_INFO!R30,0))","v":11897.146462924798},{"$f":"IF(OR(COUNTRY_INFO!S30=\"Inconnu\",COUNTRY_INFO!S30=\"Surveillance\",COUNTRY_INFO!S30=\"Non requis\",COUNTRY_INFO!S30=0),0,IF($D30<>0, COUNTRY_INFO!S30,0))","v":22307.149617983996},{"$f":"IF(OR(COUNTRY_INFO!T30=\"Inconnu\",COUNTRY_INFO!T30=\"Surveillance\",COUNTRY_INFO!T30=\"Non requis\",COUNTRY_INFO!T30=0),0,IF($D30<>0, COUNTRY_INFO!T30,0))","v":10147.517745119998},44351.813826028796,"Oui",3549.2125003775996,2,"EAS et Adultes",null,{"$f":"IF($I30<>\"Oui\",$F30*2,($F30+ROUND(J30*$F30/SUM(COUNTRY_INFO!$E30:$G30),0))*2)","v":46452.299235967992},{"$f":"IF($I30<>\"Oui\",$G30*3,($G30+ROUND(J30*$G30/SUM(COUNTRY_INFO!$E30:$G30),0))*3)","v":31696.553235359992},78148.852471327991,null,78148.852471327991]
[{"$f":"IF(INTRO!$E$43=\"Non endémique\",\" \", IF(COUNTRY_INFO!A31=0,\" \",COUNTRY_INFO!A31))","v":"TOGO"},{"$f":"IF(INTRO!$E$43=\"Non endémique\",\" \", IF(COUNTRY_INFO!B31=0,\" \",COUNTRY_INFO!B31))","v":"PLATEAUX"},{"$f":"IF(INTRO!$E$43=\"Non endémique\",\" \", IF(COUNTRY_INFO!C31=0,\" \",COUNTRY_INFO!C31))","v":"AKEBOU"},{"$f":"IF(INTRO!$E$43=\"Non endémique\", \"Non requis\", COUNTRY_INFO!Y31)","v":1},{"$f":"IF(OR(COUNTRY_INFO!R31=\"Inconnu\",COUNTRY_INFO!R31=\"Surveillance\",COUNTRY_INFO!R31=\"Non requis\",COUNTRY_INFO!R31=0),0,IF($D31<>0, COUNTRY_INFO!R31,0))","v":10892.143303372799},{"$f":"IF(OR(COUNTRY_INFO!S31=\"Inconnu\",COUNTRY_INFO!S31=\"Surveillance\",COUNTRY_INFO!S31=\"Non requis\",COUNTRY_INFO!S31=0),0,IF($D31<>0, COUNTRY_INFO!S31,0))","v":20422.768693823993},{"$f":"IF(OR(COUNTRY_INFO!T31=\"Inconnu\",COUNTRY_INFO!T31=\"Surveillance\",COUNTRY_INFO!T31=\"Non requis\",COUNTRY_INFO!T31=0),0,IF($D31<>0, COUNTRY_INFO!T31,0))","v":12651.067457279998},43965.979454476794,null,null,null,null,null,{"$f":"IF($I31<>\"Oui\",$F31*2,($F31+ROUND(J31*$F31/SUM(COUNTRY_INFO!$E31:$G31),0))*2)","v":40845.537387647986},{"$f":"IF($I31<>\"Oui\",$G31*3,($G31+ROUND(J31*$G31/SUM(COUNTRY_INFO!$E31:$G31),0))*3)","v":37953.202371839994},78798.739759487973,null,78798.739759487973]
[{"$f":"IF(INTRO!$E$43=\"Non endémique\",\" \", IF(COUNTRY_INFO!A32=0,\" \",COUNTRY_INFO!A32))","v":"TOGO"},{"$f":"IF(INTRO!$E$43=\"Non endémique\",\" \", IF(COUNTRY_INFO!B32=0,\" \",COUNTRY_INFO!B32))","v":"PLATEAUX"},{"$f":"IF(INTRO!$E$43=\"Non endémique\",\" \", IF(COUNTRY_INFO!C32=0,\" \",COUNTRY_INFO!C32))","v":"AMOU"},{"$f":"IF(INTRO!$E$43=\"Non endémique\", \"Non requis\", COUNTRY_INFO!Y32)","v":2},{"$f":"IF(OR(COUNTRY_INFO!R32=\"Inconnu\",COUNTRY_INFO!R32=\"Surveillance\",COUNTRY_INFO!R32=\"Non requis\",COUNTRY_INFO!R32=0),0,IF($D32<>0, COUNTRY_INFO!R32,0))","v":19538.711594035198},{"$f":"IF(OR(COUNTRY_INFO!S32=\"Inconnu\",COUNTRY_INFO!S32=\"Surveillance\",COUNTRY_INFO!S32=\"Non requis\",COUNTRY_INFO!S32=0),0,IF($D32<>0, COUNTRY_INFO!S32,0))","v":36635.084238815994},{"$f":"IF(OR(COUNTRY_INFO!T32=\"Inconnu\",COUNTRY_INFO!T32=\"Surveillance\",COUNTRY_INFO!T32=\"Non requis\",COUNTRY_INFO!T32=0),0,IF($D32<>0, COUNTRY_INFO!T32,0))","v":22549.863782880002},78723.659615731187,"Oui",8319.6050144255987,2,"EAS et Adultes",null,{"$f":"IF($I32<>\"Oui\",$F32*2,($F32+ROUND(J32*$F32/SUM(COUNTRY_INFO!$E32:$G32),0))*2)","v":78584.168477631989},{"$f":"IF($I32<>\"Oui\",$G32*3,($G32+ROUND(J32*$G32/SUM(COUNTRY_INFO!$E32:$G32),0))*3)","v":72557.59134864001},151141.759826272,null,151141.759826272]
[{"$f":"IF(INTRO!$E$43=\"Non endémique\",\" \", IF(COUNTRY_INFO!A33=0,\" \",COUNTRY_INFO!A33))","v":"TOGO"},{"$f":"IF(INTRO!$E$43=\"Non endémique\",\" \", IF(COUNTRY_INFO!B33=0,\" \",COUNTRY_INFO!B33))","v":"PLATEAUX"},{"$f":"IF(INTRO!$E$43=\"Non endémique\",\" \", IF(COUNTRY_INFO!C33=0,\" \",COUNTRY_INFO!C33))","v":"ANIE"},{"$f":"IF(INTRO!$E$43=\"Non endémique\", \"Non requis\", COUNTRY_INFO!Y33)","v":1},{"$f":"IF(OR(COUNTRY_INFO!R33=\"Inconnu\",COUNTRY_INFO!R33=\"Surveillance\",COUNTRY_INFO!R33=\"Non requis\",COUNTRY_INFO!R33=0),0,IF($D33<>0, COUNTRY_INFO!R33,0))","v":28044.815516928007},{"$f":"IF(OR(COUNTRY_INFO!S33=\"Inconnu\",COUNTRY_INFO!S33=\"Surveillance\",COUNTRY_INFO!S33=\"Non requis\",COUNTRY_INFO!S33=0),0,IF($D33<>0, COUNTRY_INFO!S33,0))","v":52584.029094239995},{"$f":"IF(OR(COUNTRY_INFO!T33=\"Inconnu\",COUNTRY_INFO!T33=\"Surveillance\",COUNTRY_INFO!T33=\"Non requis\",COUNTRY_INFO!T33=0),0,IF($D33<>0, COUNTRY_INFO!T33,0))","v":26646.916826879999},107275.76143804799,null,null,null,null,null,{"$f":"IF($I33<>\"Oui\",$F33*2,($F33+ROUND(J33*$F33/SUM(COUNTRY_INFO!$E33:$G33),0))*2)","v":105168.05818847999},{"$f":"IF($I33<>\"Oui\",$G33*3,($G33+ROUND(J33*$G33/SUM(COUNTRY_INFO!$E33:$G33),0))*3)","v":79940.750480639996},185108.80866911999,null,185108.80866911999]
[{"$f":"IF(INTRO!$E$43=\"Non endémique\",\" \", IF(COUNTRY_INFO!A34=0,\" \",COUNTRY_INFO!A34))","v":"TOGO"},{"$f":"IF(INTRO!$E$43=\"Non endémique\",\" \", IF(COUNTRY_INFO!B34=0,\" \",COUNTRY_INFO!B34))","v":"PLATEAUX"},{"$f":"IF(INTRO!$E$43=\"Non endémique\",\" \", IF(COUNTRY_INFO!C34=0,\" \",COUNTRY_INFO!C34))","v":"DANYI"},{"$f":"IF(INTRO!$E$43=\"Non endémique\", \"Non requis\", COUNTRY_INFO!Y34)","v":0},{"$f":"IF(OR(COUNTRY_INFO!R34=\"Inconnu\",COUNTRY_INFO!R34=\"Surveillance\",COUNTRY_INFO!R34=\"Non requis\",COUNTRY_INFO!R34=0),0,IF($D34<>0, COUNTRY_INFO!R34,0))","v":0},{"$f":"IF(OR(COUNTRY_INFO!S34=\"Inconnu\",COUNTRY_INFO!S34=\"Surveillance\",COUNTRY_INFO!S34=\"Non requis\",COUNTRY_INFO!S34=0),0,IF($D34<>0, COUNTRY_INFO!S34,0))","v":0},{"$f":"IF(OR(COUNTRY_INFO!T34=\"Inconnu\",COUNTRY_INFO!T34=\"Surveillance\",COUNTRY_INFO!T34=\"Non requis\",COUNTRY_INFO!T34=0),0,IF($D34<>0, COUNTRY_INFO!T34,0))","v":0},0,null,null,null,null,null,{"$f":"IF($I34<>\"Oui\",$F34*2,($F34+ROUND(J34*$F34/SUM(COUNTRY_INFO!$E34:$G34),0))*2)","v":0},{"$f":"IF($I34<>\"Oui\",$G34*3,($G34+ROUND(J34*$G34/SUM(COUNTRY_INFO!$E34:$G34),0))*3)","v":0},0,null,0]
[{"$f":"IF(INTRO!$E$43=\"Non endémique\",\" \", IF(COUNTRY_INFO!A35=0,\" \",COUNTRY_INFO!A35))","v":"TOGO"},{"$f":"IF(INTRO!$E$43=\"Non endémique\",\" \", IF(COUNTRY_INFO!B35=0,\" \",COUNTRY_INFO!B35))","v":"PLATEAUX"},{"$f":"IF(INTRO!$E$43=\"Non endémique\",\" \", IF(COUNTRY_INFO!C35=0,\" \",COUNTRY_INFO!C35))","v":"EST-MONO"},{"$f":"IF(INTRO!$E$43=\"Non endémique\", \"Non requis\", COUNTRY_INFO!Y35)","v":1},{"$f":"IF(OR(COUNTRY_INFO!R35=\"Inconnu\",COUNTRY_INFO!R35=\"Surveillance\",COUNTRY_INFO!R35=\"Non requis\",COUNTRY_INFO!R35=0),0,IF($D35<>0, COUNTRY_INFO!R35,0))","v":19957.743951667195},{"$f":"IF(OR(COUNTRY_INFO!S35=\"Inconnu\",COUNTRY_INFO!S35=\"Surveillance\",COUNTRY_INFO!S35=\"Non requis\",COUNTRY_INFO!S35=0),0,IF($D35<>0, COUNTRY_INFO!S35,0))","v":35369.134369631996},{"$f":"IF(OR(COUNTRY_INFO!T35=\"Inconnu\",COUNTRY_INFO!T35=\"Surveillance\",COUNTRY_INFO!T35=\"Non requis\",COUNTRY_INFO!T35=0),0,IF($D35<>0, COUNTRY_INFO!T35,0))","v":0},55326.878321299191,null,null,null,null,null,{"$f":"IF($I35<>\"Oui\",$F35*2,($F35+ROUND(J35*$F35/SUM(COUNTRY_INFO!$E35:$G35),0))*2)","v":70738.268739263993},{"$f":"IF($I35<>\"Oui\",$G35*3,($G35+ROUND(J35*$G35/SUM(COUNTRY_INFO!$E35:$G35),0))*3)","v":0},70738.268739263993,null,70738.268739263993]
[{"$f":"IF(INTRO!$E$43=\"Non endémique\",\" \", IF(COUNTRY_INFO!A36=0,\" \",COUNTRY_INFO!A36))","v":"TOGO"},{"$f":"IF(INTRO!$E$43=\"Non endémique\",\" \", IF(COUNTRY_INFO!B36=0,\" \",COUNTRY_INFO!B36))","v":"PLATEAUX"},{"$f":"IF(INTRO!$E$43=\"Non endémique\",\" \", IF(COUNTRY_INFO!C36=0,\" \",COUNTRY_INFO!C36))","v":"HAHO"},{"$f":"IF(INTRO!$E$43=\"Non endémique\", \"Non requis\", COUNTRY_INFO!Y36)","v":1},{"$f":"IF(OR(COUNTRY_INFO!R36=\"Inconnu\",COUNTRY_INFO!R36=\"Surveillance\",COUNTRY_INFO!R36=\"Non requis\",COUNTRY_INFO!R36=0),0,IF($D36<>0, COUNTRY_INFO!R36,0))","v":44195.519815372798},{"$f":"IF(OR(COUNTRY_INFO!S36=\"Inconnu\",COUNTRY_INFO!S36=\"Surveillance\",COUNTRY_INFO!S36=\"Non requis\",COUNTRY_INFO!S36=0),0,IF($D36<>0, COUNTRY_INFO!S36,0))","v":82866.599653823971},{"$f":"IF(OR(COUNTRY_INFO!T36=\"Inconnu\",COUNTRY_INFO!T36=\"Surveillance\",COUNTRY_INFO!T36=\"Non requis\",COUNTRY_INFO!T36=0),0,IF($D36<>0, COUNTRY_INFO!T36,0))","v":56321.46363664799},183383.58310584477,null,null,null,null,null,{"$f":"IF($I36<>\"Oui\",$F36*2,($F36+ROUND(J36*$F36/SUM(COUNTRY_INFO!$E36:$G36),0))*2)","v":165733.19930764794},{"$f":"IF($I36<>\"Oui\",$G36*3,($G36+ROUND(J36*$G36/SUM(COUNTRY_INFO!$E36:$G36),0))*3)","v":168964.39090994396},334697.5902175919,null,334697.5902175919]
[{"$f":"IF(INTRO!$E$43=\"Non endémique\",\" \", IF(COUNTRY_INFO!A37=0,\" \",COUNTRY_INFO!A37))","v":"TOGO"},{"$f":"IF(INTRO!$E$43=\"Non endémique\",\" \", IF(COUNTRY_INFO!B37=0,\" \",COUNTRY_INFO!B37))","v":"PLATEAUX"},{"$f":"IF(INTRO!$E$43=\"Non endémique\",\" \", IF(COUNTRY_INFO!C37=0,\" \",COUNTRY_INFO!C37))","v":"KLOTO"},{"$f":"IF(INTRO!$E$43=\"Non endémique\", \"Non requis\", COUNTRY_INFO!Y37)","v":1},{"$f":"IF(OR(COUNTRY_INFO!R37=\"Inconnu\",COUNTRY_INFO!R37=\"Surveillance\",COUNTRY_INFO!R37=\"Non requis\",COUNTRY_INFO!R37=0),0,IF($D37<>0, COUNTRY_INFO!R37,0))","v":21627.802893311997},{"$f":"IF(OR(COUNTRY_INFO!S37=\"Inconnu\",COUNTRY_INFO!S37=\"Surveillance\",COUNTRY_INFO!S37=\"Non requis\",COUNTRY_INFO!S37=0),0,IF($D37<>0, COUNTRY_INFO!S37,0))","v":40552.130424959985},{"$f":"IF(OR(COUNTRY_INFO!T37=\"Inconnu\",COUNTRY_INFO!T37=\"Surveillance\",COUNTRY_INFO!T37=\"Non requis\",COUNTRY_INFO!T37=0),0,IF($D37<>0, COUNTRY_INFO!T37,0))","v":1946.7436044873598},64126.676922759347,null,null,null,null,null,{"$f":"IF($I37<>\"Oui\",$F37*2,($F37+ROUND(J37*$F37/SUM(COUNTRY_INFO!$E37:$G37),0))*2)","v":81104.26084991997},{"$f":"IF($I37<>\"Oui\",$G37*3,($G37+ROUND(J37*$G37/SUM(COUNTRY_INFO!$E37:$G37),0))*3)","v":5840.2308134620798},86944.491663382054,null,86944.491663382054]
[{"$f":"IF(INTRO!$E$43=\"Non endémique\",\" \", IF(COUNTRY_INFO!A38=0,\" \",COUNTRY_INFO!A38))","v":"TOGO"},{"$f":"IF(INTRO!$E$43=\"Non endémique\",\" \", IF(COUNTRY_INFO!B38=0,\" \",COUNTRY_INFO!B38))","v":"PLATEAUX"},{"$f":"IF(INTRO!$E$43=\"Non endémique\",\" \", IF(COUNTRY_INFO!C38=0,\" \",COUNTRY_INFO!C38))","v":"KPELE"},{"$f":"IF(INTRO!$E$43=\"Non endémique\", \"Non requis\", COUNTRY_INFO!Y38)","v":2},{"$f":"IF(OR(COUNTRY_INFO!R38=\"Inconnu\",COUNTRY_INFO!R38=\"Surveillance\",COUNTRY_INFO!R38=\"Non requis\",COUNTRY_INFO!R38=0),0,IF($D38<>0, COUNTRY_INFO!R38,0))","v":10644.602256691198},{"$f":"IF(OR(COUNTRY_INFO!S38=\"Inconnu\",COUNTRY_INFO!S38=\"Surveillance\",COUNTRY_INFO!S38=\"Non requis\",COUNTRY_INFO!S38=0),0,IF($D38<>0, COUNTRY_INFO!S38,0))","v":19958.629231295996},{"$f":"IF(OR(COUNTRY_INFO!T38=\"Inconnu\",COUNTRY_INFO!T38=\"Surveillance\",COUNTRY_INFO!T38=\"Non requis\",COUNTRY_INFO!T38=0),0,IF($D38<>0, COUNTRY_INFO!T38,0))","v":4599.2384524799991},35202.469940467192,"Oui",8830.5378287615986,2,"EAS et Adultes",null,{"$f":"IF($I38<>\"Oui\",$F38*2,($F38+ROUND(J38*$F38/SUM(COUNTRY_INFO!$E38:$G38),0))*2)","v":44251.258462591992},{"$f":"IF($I38<>\"Oui\",$G38*3,($G38+ROUND(J38*$G38/SUM(COUNTRY_INFO!$E38:$G38),0))*3)","v":15294.715357439996},59545.973820031984,null,59545.973820031984]
[{"$f":"IF(INTRO!$E$43=\"Non endémique\",\" \", IF(COUNTRY_INFO!A39=0,\" \",COUNTRY_INFO!A39))","v":"TOGO"},{"$f":"IF(INTRO!$E$43=\"Non endémique\",\" \", IF(COUNTRY_INFO!B39=0,\" \",COUNTRY_INFO!B39))","v":"PLATEAUX"},{"$f":"IF(INTRO!$E$43=\"Non endémique\",\" \", IF(COUNTRY_INFO!C39=0,\" \",COUNTRY_INFO!C39))","v":"MOYEN-MONO"},{"$f":"IF(INTRO!$E$43=\"Non endémique\", \"Non requis\", COUNTRY_INFO!Y39)","v":2},{"$f":"IF(OR(COUNTRY_INFO!R39=\"Inconnu\",COUNTRY_INFO!R39=\"Surveillance\",COUNTRY_INFO!R39=\"Non requis\",COUNTRY_INFO!R39=0),0,IF($D39<>0, COUNTRY_INFO!R39,0))","v":17123.162892595199},{"$f":"IF(OR(COUNTRY_INFO!S39=\"Inconnu\",COUNTRY_INFO!S39=\"Surveillance\",COUNTRY_INFO!S39=\"Non requis\",COUNTRY_INFO!S39=0),0,IF($D39<>0, COUNTRY_INFO!S39,0))","v":32105.930423616002},{"$f":"IF(OR(COUNTRY_INFO!T39=\"Inconnu\",COUNTRY_INFO!T39=\"Surveillance\",COUNTRY_INFO!T39=\"Non requis\",COUNTRY_INFO!T39=0),0,IF($D39<>0, COUNTRY_INFO!T39,0))","v":18102.387552479999},67331.4808686912,"Oui",16126.253718220798,2,"EAS et Adultes",null,{"$f":"IF($I39<>\"Oui\",$F39*2,($F39+ROUND(J39*$F39/SUM(COUNTRY_INFO!$E39:$G39),0))*2)","v":75599.860847232005},{"$f":"IF($I39<>\"Oui\",$G39*3,($G39+ROUND(J39*$G39/SUM(COUNTRY_INFO!$E39:$G39),0))*3)","v":63937.16265744},139537.02350467199,null,139537.02350467199]
[{"$f":"IF(INTRO!$E$43=\"Non endémique\",\" \", IF(COUNTRY_INFO!A40=0,\" \",COUNTRY_INFO!A40))","v":"TOGO"},{"$f":"IF(INTRO!$E$43=\"Non endémique\",\" \", IF(COUNTRY_INFO!B40=0,\" \",COUNTRY_INFO!B40))","v":"PLATEAUX"},{"$f":"IF(INTRO!$E$43=\"Non endémique\",\" \", IF(COUNTRY_INFO!C40=0,\" \",COUNTRY_INFO!C40))","v":"OGOU"},{"$f":"IF(INTRO!$E$43=\"Non endémique\", \"Non requis\", COUNTRY_INFO!Y40)","v":2},{"$f":"IF(OR(COUNTRY_INFO!R40=\"Inconnu\",COUNTRY_INFO!R40=\"Surveillance\",COUNTRY_INFO!R40=\"Non requis\",COUNTRY_INFO!R40=0),0,IF($D40<>0, COUNTRY_INFO!R40,0))","v":38001.260408831993},{"$f":"IF(OR(COUNTRY_INFO!S40=\"Inconnu\",COUNTRY_INFO!S40=\"Surveillance\",COUNTRY_INFO!S40=\"Non requis\",COUNTRY_INFO!S40=0),0,IF($D40<>0, COUNTRY_INFO!S40,0))","v":71252.363266559987},{"$f":"IF(OR(COUNTRY_INFO!T40=\"Inconnu\",COUNTRY_INFO!T40=\"Surveillance\",COUNTRY_INFO!T40=\"Non requis\",COUNTRY_INFO!T40=0),0,IF($D40<>0, COUNTRY_INFO!T40,0))","v":75443.740747200005},184697.36442259199,"Oui",92925.020327731196,2,"EAS et Adultes",null,{"$f":"IF($I40<>\"Oui\",$F40*2,($F40+ROUND(J40*$F40/SUM(COUNTRY_INFO!$E40:$G40),0))*2)","v":194506.72653311997},{"$f":"IF($I40<>\"Oui\",$G40*3,($G40+ROUND(J40*$G40/SUM(COUNTRY_INFO!$E40:$G40),0))*3)","v":308921.22224160004},503427.94877472002,null,503427.94877472002]
[{"$f":"IF(INTRO!$E$43=\"Non endémique\",\" \", IF(COUNTRY_INFO!A41=0,\" \",COUNTRY_INFO!A41))","v":"TOGO"},{"$f":"IF(INTRO!$E$43=\"Non endémique\",\" \", IF(COUNTRY_INFO!B41=0,\" \",COUNTRY_INFO!B41))","v":"PLATEAUX"},{"$f":"IF(INTRO!$E$43=\"Non endémique\",\" \", IF(COUNTRY_INFO!C41=0,\" \",COUNTRY_INFO!C41))","v":"WAWA"},{"$f":"IF(INTRO!$E$43=\"Non endémique\", \"Non requis\", COUNTRY_INFO!Y41)","v":1},{"$f":"IF(OR(COUNTRY_INFO!R41=\"Inconnu\",COUNTRY_INFO!R41=\"Surveillance\",COUNTRY_INFO!R41=\"Non requis\",COUNTRY_INFO!R41=0),0,IF($D41<>0, COUNTRY_INFO!R41,0))","v":14321.800897689598},{"$f":"IF(OR(COUNTRY_INFO!S41=\"Inconnu\",COUNTRY_INFO!S41=\"Surveillance\",COUNTRY_INFO!S41=\"Non requis\",COUNTRY_INFO!S41=0),0,IF($D41<>0, COUNTRY_INFO!S41,0))","v":26853.376683167997},{"$f":"IF(OR(COUNTRY_INFO!T41=\"Inconnu\",COUNTRY_INFO!T41=\"Surveillance\",COUNTRY_INFO!T41=\"Non requis\",COUNTRY_INFO!T41=0),0,IF($D41<>0, COUNTRY_INFO!T41,0))","v":10647.0683928},51822.245973657591,null,null,null,null,null,{"$f":"IF($I41<>\"Oui\",$F41*2,($F41+ROUND(J41*$F41/SUM(COUNTRY_INFO!$E41:$G41),0))*2)","v":53706.753366335994},{"$f":"IF($I41<>\"Oui\",$G41*3,($G41+ROUND(J41*$G41/SUM(COUNTRY_INFO!$E41:$G41),0))*3)","v":31941.2051784},85647.958544736,null,85647.958544736]
[{"$f":"IF(INTRO!$E$43=\"Non endémique\",\" \", IF(COUNTRY_INFO!A42=0,\" \",COUNTRY_INFO!A42))","v":"TOGO"},{"$f":"IF(INTRO!$E$43=\"Non endémique\",\" \", IF(COUNTRY_INFO!B42=0,\" \",COUNTRY_INFO!B42))","v":"SAVANES"},{"$f":"IF(INTRO!$E$43=\"Non endémique\",\" \", IF(COUNTRY_INFO!C42=0,\" \",COUNTRY_INFO!C42))","v":"CINKASSE"},{"$f":"IF(INTRO!$E$43=\"Non endémique\", \"Non requis\", COUNTRY_INFO!Y42)","v":1},{"$f":"IF(OR(COUNTRY_INFO!R42=\"Inconnu\",COUNTRY_INFO!R42=\"Surveillance\",COUNTRY_INFO!R42=\"Non requis\",COUNTRY_INFO!R42=0),0,IF($D42<>0, COUNTRY_INFO!R42,0))","v":15953.783436288},{"$f":"IF(OR(COUNTRY_INFO!S42=\"Inconnu\",COUNTRY_INFO!S42=\"Surveillance\",COUNTRY_INFO!S42=\"Non requis\",COUNTRY_INFO!S42=0),0,IF($D42<>0, COUNTRY_INFO!S42,0))","v":29913.343943040003},{"$f":"IF(OR(COUNTRY_INFO!T42=\"Inconnu\",COUNTRY_INFO!T42=\"Surveillance\",COUNTRY_INFO!T42=\"Non requis\",COUNTRY_INFO!T42=0),0,IF($D42<>0, COUNTRY_INFO!T42,0))","v":23698.318993200002},69565.446372528007,null,null,null,null,null,{"$f":"IF($I42<>\"Oui\",$F42*2,($F42+ROUND(J42*$F42/SUM(COUNTRY_INFO!$E42:$G42),0))*2)","v":59826.687886080006},{"$f":"IF($I42<>\"Oui\",$G42*3,($G42+ROUND(J42*$G42/SUM(COUNTRY_INFO!$E42:$G42),0))*3)","v":71094.956979600014},130921.64486568002,null,130921.64486568002]
[{"$f":"IF(INTRO!$E$43=\"Non endémique\",\" \", IF(COUNTRY_INFO!A43=0,\" \",COUNTRY_INFO!A43))","v":"TOGO"},{"$f":"IF(INTRO!$E$43=\"Non endémique\",\" \", IF(COUNTRY_INFO!B43=0,\" \",COUNTRY_INFO!B43))","v":"SAVANES"},{"$f":"IF(INTRO!$E$43=\"Non endémique\",\" \", IF(COUNTRY_INFO!C43=0,\" \",COUNTRY_INFO!C43))","v":"KPENDJAL"},{"$f":"IF(INTRO!$E$43=\"Non endémique\", \"Non requis\", COUNTRY_INFO!Y43)","v":0},{"$f":"IF(OR(COUNTRY_INFO!R43=\"Inconnu\",COUNTRY_INFO!R43=\"Surveillance\",COUNTRY_INFO!R43=\"Non requis\",COUNTRY_INFO!R43=0),0,IF($D43<>0, COUNTRY_INFO!R43,0))","v":0},{"$f":"IF(OR(COUNTRY_INFO!S43=\"Inconnu\",COUNTRY_INFO!S43=\"Surveillance\",COUNTRY_INFO!S43=\"Non requis\",COUNTRY_INFO!S43=0),0,IF($D43<>0, COUNTRY_INFO!S43,0))","v":0},{"$f":"IF(OR(COUNTRY_INFO!T43=\"Inconnu\",COUNTRY_INFO!T43=\"Surveillance\",COUNTRY_INFO!T43=\"Non requis\",COUNTRY_INFO!T43=0),0,IF($D43<>0, COUNTRY_INFO!T43,0))","v":0},0,null,null,null,null,null,{"$f":"IF($I43<>\"Oui\",$F43*2,($F43+ROUND(J43*$F43/SUM(COUNTRY_INFO!$E43:$G43),0))*2)","v":0},{"$f":"IF($I43<>\"Oui\",$G43*3,($G43+ROUND(J43*$G43/SUM(COUNTRY_INFO!$E43:$G43),0))*3)","v":0},0,null,0]
[{"$f":"IF(INTRO!$E$43=\"Non endémique\",\" \", IF(COUNTRY_INFO!A44=0,\" \",COUNTRY_INFO!A44))","v":"TOGO"},{"$f":"IF(INTRO!$E$43=\"Non endémique\",\" \", IF(COUNTRY_INFO!B44=0,\" \",COUNTRY_INFO!B44))","v":"SAVANES"},{"$f":"IF(INTRO!$E$43=\"Non endémique\",\" \", IF(COUNTRY_INFO!C44=0,\" \",COUNTRY_INFO!C44))","v":"KPENDJAL-OUEST"},{"$f":"IF(INTRO!$E$43=\"Non endémique\", \"Non requis\", COUNTRY_INFO!Y44)","v":2},{"$f":"IF(OR(COUNTRY_INFO!R44=\"Inconnu\",COUNTRY_INFO!R44=\"Surveillance\",COUNTRY_INFO!R44=\"Non requis\",COUNTRY_INFO!R44=0),0,IF($D44<>0, COUNTRY_INFO!R44,0))","v":21324.278449152},{"$f":"IF(OR(COUNTRY_INFO!S44=\"Inconnu\",COUNTRY_INFO!S44=\"Surveillance\",COUNTRY_INFO!S44=\"Non requis\",COUNTRY_INFO!S44=0),0,IF($D44<>0, COUNTRY_INFO!S44,0))","v":39983.022092159998},{"$f":"IF(OR(COUNTRY_INFO!T44=\"Inconnu\",COUNTRY_INFO!T44=\"Surveillance\",COUNTRY_INFO!T44=\"Non requis\",COUNTRY_INFO!T44=0),0,IF($D44<>0, COUNTRY_INFO!T44,0))","v":8747.9328081599997},70055.233349471993,"Oui",8241.7004070912008,2,"EAS et Adultes",null,{"$f":"IF($I44<>\"Oui\",$F44*2,($F44+ROUND(J44*$F44/SUM(COUNTRY_INFO!$E44:$G44),0))*2)","v":85284.044184319995},{"$f":"IF($I44<>\"Oui\",$G44*3,($G44+ROUND(J44*$G44/SUM(COUNTRY_INFO!$E44:$G44),0))*3)","v":27989.798424479999},113273.8426088,null,113273.8426088]
[{"$f":"IF(INTRO!$E$43=\"Non endémique\",\" \", IF(COUNTRY_INFO!A45=0,\" \",COUNTRY_INFO!A45))","v":"TOGO"},{"$f":"IF(INTRO!$E$43=\"Non endémique\",\" \", IF(COUNTRY_INFO!B45=0,\" \",COUNTRY_INFO!B45))","v":"SAVANES"},{"$f":"IF(INTRO!$E$43=\"Non endémique\",\" \", IF(COUNTRY_INFO!C45=0,\" \",COUNTRY_INFO!C45))","v":"OTI"},{"$f":"IF(INTRO!$E$43=\"Non endémique\", \"Non requis\", COUNTRY_INFO!Y45)","v":1},{"$f":"IF(OR(COUNTRY_INFO!R45=\"Inconnu\",COUNTRY_INFO!R45=\"Surveillance\",COUNTRY_INFO!R45=\"Non requis\",COUNTRY_INFO!R45=0),0,IF($D45<>0, COUNTRY_INFO!R45,0))","v":23606.613644543995},{"$f":"IF(OR(COUNTRY_INFO!S45=\"Inconnu\",COUNTRY_INFO!S45=\"Surveillance\",COUNTRY_INFO!S45=\"Non requis\",COUNTRY_INFO!S45=0),0,IF($D45<>0, COUNTRY_INFO!S45,0))","v":44262.400583520001},{"$f":"IF(OR(COUNTRY_INFO!T45=\"Inconnu\",COUNTRY_INFO!T45=\"Surveillance\",COUNTRY_INFO!T45=\"Non requis\",COUNTRY_INFO!T45=0),0,IF($D45<>0, COUNTRY_INFO!T45,0))","v":4145.0056905599995},72014.019918623992,null,null,null,null,null,{"$f":"IF($I45<>\"Oui\",$F45*2,($F45+ROUND(J45*$F45/SUM(COUNTRY_INFO!$E45:$G45),0))*2)","v":88524.801167040001},{"$f":"IF($I45<>\"Oui\",$G45*3,($G45+ROUND(J45*$G45/SUM(COUNTRY_INFO!$E45:$G45),0))*3)","v":12435.017071679998},100959.81823872001,null,100959.81823872001]
[{"$f":"IF(INTRO!$E$43=\"Non endémique\",\" \", IF(COUNTRY_INFO!A46=0,\" \",COUNTRY_INFO!A46))","v":"TOGO"},{"$f":"IF(INTRO!$E$43=\"Non endémique\",\" \", IF(COUNTRY_INFO!B46=0,\" \",COUNTRY_INFO!B46))","v":"SAVANES"},{"$f":"IF(INTRO!$E$43=\"Non endémique\",\" \", IF(COUNTRY_INFO!C46=0,\" \",COUNTRY_INFO!C46))","v":"OTI-SUD"},{"$f":"IF(INTRO!$E$43=\"Non endémique\", \"Non requis\", COUNTRY_INFO!Y46)","v":1},{"$f":"IF(OR(COUNTRY_INFO!R46=\"Inconnu\",COUNTRY_INFO!R46=\"Surveillance\",COUNTRY_INFO!R46=\"Non requis\",COUNTRY_INFO!R46=0),0,IF($D46<>0, COUNTRY_INFO!R46,0))","v":23212.200491827203},{"$f":"IF(OR(COUNTRY_INFO!S46=\"Inconnu\",COUNTRY_INFO!S46=\"Surveillance\",COUNTRY_INFO!S46=\"Non requis\",COUNTRY_INFO!S46=0),0,IF($D46<>0, COUNTRY_INFO!S46,0))","v":43522.87592217599},{"$f":"IF(OR(COUNTRY_INFO!T46=\"Inconnu\",COUNTRY_INFO!T46=\"Surveillance\",COUNTRY_INFO!T46=\"Non requis\",COUNTRY_INFO!T46=0),0,IF($D46<>0, COUNTRY_INFO!T46,0))","v":24908.981177505597},91644.057591508797,null,null,null,null,null,{"$f":"IF($I46<>\"Oui\",$F46*2,($F46+ROUND(J46*$F46/SUM(COUNTRY_INFO!$E46:$G46),0))*2)","v":87045.75184435198},{"$f":"IF($I46<>\"Oui\",$G46*3,($G46+ROUND(J46*$G46/SUM(COUNTRY_INFO!$E46:$G46),0))*3)","v":74726.943532516787},161772.69537686877,null,161772.69537686877]
[{"$f":"IF(INTRO!$E$43=\"Non endémique\",\" \", IF(COUNTRY_INFO!A47=0,\" \",COUNTRY_INFO!A47))","v":"TOGO"},{"$f":"IF(INTRO!$E$43=\"Non endémique\",\" \", IF(COUNTRY_INFO!B47=0,\" \",COUNTRY_INFO!B47))","v":"SAVANES"},{"$f":"IF(INTRO!$E$43=\"Non endémique\",\" \", IF(COUNTRY_INFO!C47=0,\" \",COUNTRY_INFO!C47))","v":"TANDJOUARE"},{"$f":"IF(INTRO!$E$43=\"Non endémique\", \"Non requis\", COUNTRY_INFO!Y47)","v":1},{"$f":"IF(OR(COUNTRY_INFO!R47=\"Inconnu\",COUNTRY_INFO!R47=\"Surveillance\",COUNTRY_INFO!R47=\"Non requis\",COUNTRY_INFO!R47=0),0,IF($D47<>0, COUNTRY_INFO!R47,0))","v":25851.345533798398},{"$f":"IF(OR(COUNTRY_INFO!S47=\"Inconnu\",COUNTRY_INFO!S47=\"Surveillance\",COUNTRY_INFO!S47=\"Non requis\",COUNTRY_INFO!S47=0),0,IF($D47<>0, COUNTRY_INFO!S47,0))","v":48471.272875871997},{"$f":"IF(OR(COUNTRY_INFO!T47=\"Inconnu\",COUNTRY_INFO!T47=\"Surveillance\",COUNTRY_INFO!T47=\"Non requis\",COUNTRY_INFO!T47=0),0,IF($D47<>0, COUNTRY_INFO!T47,0))","v":0},74322.618409670395,null,null,null,null,null,{"$f":"IF($I47<>\"Oui\",$F47*2,($F47+ROUND(J47*$F47/SUM(COUNTRY_INFO!$E47:$G47),0))*2)","v":96942.545751743994},{"$f":"IF($I47<>\"Oui\",$G47*3,($G47+ROUND(J47*$G47/SUM(COUNTRY_INFO!$E47:$G47),0))*3)","v":0},96942.545751743994,null,96942.545751743994]
[{"$f":"IF(INTRO!$E$43=\"Non endémique\",\" \", IF(COUNTRY_INFO!A48=0,\" \",COUNTRY_INFO!A48))","v":"TOGO"},{"$f":"IF(INTRO!$E$43=\"Non endémique\",\" \", IF(COUNTRY_INFO!B48=0,\" \",COUNTRY_INFO!B48))","v":"SAVANES"},{"$f":"IF(INTRO!$E$43=\"Non endémique\",\" \", IF(COUNTRY_INFO!C48=0,\" \",COUNTRY_INFO!C48))","v":"TONE"},{"$f":"IF(INTRO!$E$43=\"Non endémique\", \"Non requis\", COUNTRY_INFO!Y48)","v":1},{"$f":"IF(OR(COUNTRY_INFO!R48=\"Inconnu\",COUNTRY_INFO!R48=\"Surveillance\",COUNTRY_INFO!R48=\"Non requis\",COUNTRY_INFO!R48=0),0,IF($D48<>0, COUNTRY_INFO!R48,0))","v":53861.087114956783},{"$f":"IF(OR(COUNTRY_INFO!S48=\"Inconnu\",COUNTRY_INFO!S48=\"Surveillance\",COUNTRY_INFO!S48=\"Non requis\",COUNTRY_INFO!S48=0),0,IF($D48<>0, COUNTRY_INFO!S48,0))","v":100989.53834054401},{"$f":"IF(OR(COUNTRY_INFO!T48=\"Inconnu\",COUNTRY_INFO!T48=\"Surveillance\",COUNTRY_INFO!T48=\"Non requis\",COUNTRY_INFO!T48=0),0,IF($D48<>0, COUNTRY_INFO!T48,0))","v":14139.641967212157},168990.26742271296,null,null,null,null,null,{"$f":"IF($I48<>\"Oui\",$F48*2,($F48+ROUND(J48*$F48/SUM(COUNTRY_INFO!$E48:$G48),0))*2)","v":201979.07668108802},{"$f":"IF($I48<>\"Oui\",$G48*3,($G48+ROUND(J48*$G48/SUM(COUNTRY_INFO!$E48:$G48),0))*3)","v":42418.925901636474},244398.0025827245,null,244398.0025827245]

{"sheet":"IVM","index":5,"n_rows":48,"n_cols":14,"rows_kept":48,"cut":false,"hidden":false,"merged":[[5,3,7,3],[6,13,7,13],[6,8,7,8],[6,6,7,6],[6,7,7,7],[6,9,7,9],[6,10,7,10],[6,11,7,11],[3,0,3,2],[3,4,3,5],[6,4,7,4],[6,5,7,5],[5,8,5,13],[6,0,7,0],[6,1,7,1],[6,2,7,2],[5,0,5,2],[5,4,5,5],[5,6,5,7],[6,12,7,12]]}
["Ivermectine (IVM)"]
["Structure administrative, population ciblée par groupe d'âge, plan de traitement et information sur les comprimés"]
[]
["TOTAL",null,null,{"$f":"SUBTOTAL(9,D$10:D$1010)","v":4196811},null,null,{"$f":"SUBTOTAL(9,G$10:G$1010)","v":0},3441385,0,14396734.799999999,0,14396734.799999999,0,14396734.799999999]
[]
["Structure administrative du pays",null,null,"Population nécessitant un traitement avec IVM","Plan de traitement",null,"Population cible",null,"Ivermectine (IVM)"]
["Pays","Région/Département","District",null,"FL","Oncho","FL","Oncho","FL uniquement","Oncho uniquement","FL+Oncho","Total requis","Reste en stock","Comprimés devant être fournis"]
[]
[]
[{"$f":"IF(INTRO!$E$39=\"Non endémique\",\" \",IF(COUNTRY_INFO!A10=0,\" \",COUNTRY_INFO!A10))","v":"TOGO"},{"$f":"IF(INTRO!$E$39=\"Non endémique\",\" \",IF(COUNTRY_INFO!B10=0,\" \",COUNTRY_INFO!B10))","v":"CENTRALE"},{"$f":"IF(INTRO!$E$39=\"Non endémique\",\" \",IF(COUNTRY_INFO!C10=0,\" \",COUNTRY_INFO!C10))","v":"BLITTA"},121713,{"$f":"IF(AND(INTRO!$E$39=\"Non endémique\",INTRO!$E$37=\"Non endémique\"),\"Non requis\",IF(INTRO!$E$39=\"Non endémique\",\"Traiter avec DEC\",COUNTRY_INFO!V10))","v":0},{"$f":"IF(INTRO!$E$39<>\"Non endémique\",COUNTRY_INFO!W10,\"Non requis\")","v":1},{"$f":"IF(COUNTRY_INFO!H10=1, IF($E10=1,$D10, 0),0)","v":0},99805,{"$f":"IF(G10<H10,0,IF($E10=1, (G10-H10)*2.8, 0))","v":0},{"$f":"IF($E10<$F10, H10*(F10-E10)*2.8, 0)","v":279454},{"$f":"IF(AND($E10=1, $F10<>0), H10*2.8, 0)","v":0},{"$f":"SUM(I10:K10)","v":279454},null,{"$f":"IF($L10>$M10,$L10-$M10,0)","v":279454}]
[{"$f":"IF(INTRO!$E$39=\"Non endémique\",\" \",IF(COUNTRY_INFO!A11=0,\" \",COUNTRY_INFO!A11))","v":"TOGO"},{"$f":"IF(INTRO!$E$39=\"Non endémique\",\" \",IF(COUNTRY_INFO!B11=0,\" \",COUNTRY_INFO!B11))","v":"CENTRALE"},{"$f":"IF(INTRO!$E$39=\"Non endémique\",\" \",IF(COUNTRY_INFO!C11=0,\" \",COUNTRY_INFO!C11))","v":"MÔ"},50222,{"$f":"IF(AND(INTRO!$E$39=\"Non endémique\",INTRO!$E$37=\"Non endémique\"),\"Non requis\",IF(INTRO!$E$39=\"Non endémique\",\"Traiter avec DEC\",COUNTRY_INFO!V11))","v":0},{"$f":"IF(INTRO!$E$39<>\"Non endémique\",COUNTRY_INFO!W11,\"Non requis\")","v":2},{"$f":"IF(COUNTRY_INFO!H11=1, IF($E11=1,$D11, 0),0)","v":0},41182,0,230619.19999999998,{"$f":"IF(AND($E11=1, $F11<>0), H11*2.8, 0)","v":0},{"$f":"SUM(I11:K11)","v":230619.19999999998},null,230619.19999999998]
[{"$f":"IF(INTRO!$E$39=\"Non endémique\",\" \",IF(COUNTRY_INFO!A12=0,\" \",COUNTRY_INFO!A12))","v":"TOGO"},{"$f":"IF(INTRO!$E$39=\"Non endémique\",\" \",IF(COUNTRY_INFO!B12=0,\" \",COUNTRY_INFO!B12))","v":"CENTRALE"},{"$f":"IF(INTRO!$E$39=\"Non endémique\",\" \",IF(COUNTRY_INFO!C12=0,\" \",COUNTRY_INFO!C12))","v":"SOTOUBOUA"},75655,{"$f":"IF(AND(INTRO!$E$39=\"Non endémique\",INTRO!$E$37=\"Non endémique\"),\"Non requis\",IF(INTRO!$E$39=\"Non endémique\",\"Traiter avec DEC\",COUNTRY_INFO!V12))","v":0},{"$f":"IF(INTRO!$E$39<>\"Non endémique\",COUNTRY_INFO!W12,\"Non requis\")","v":1},{"$f":"IF(COUNTRY_INFO!H12=1, IF($E12=1,$D12, 0),0)","v":0},62037,0,173703.59999999998,0,173703.59999999998,null,173703.59999999998]
[{"$f":"IF(INTRO!$E$39=\"Non endémique\",\" \",IF(COUNTRY_INFO!A13=0,\" \",COUNTRY_INFO!A13))","v":"TOGO"},{"$f":"IF(INTRO!$E$39=\"Non endémique\",\" \",IF(COUNTRY_INFO!B13=0,\" \",COUNTRY_INFO!B13))","v":"CENTRALE"},{"$f":"IF(INTRO!$E$39=\"Non endémique\",\" \",IF(COUNTRY_INFO!C13=0,\" \",COUNTRY_INFO!C13))","v":"TCHAMBA"},135776,{"$f":"IF(AND(INTRO!$E$39=\"Non endémique\",INTRO!$E$37=\"Non endémique\"),\"Non requis\",IF(INTRO!$E$39=\"Non endémique\",\"Traiter avec DEC\",COUNTRY_INFO!V13))","v":0},{"$f":"IF(INTRO!$E$39<>\"Non endémique\",COUNTRY_INFO!W13,\"Non requis\")","v":1},{"$f":"IF(COUNTRY_INFO!H13=1, IF($E13=1,$D13, 0),0)","v":0},111336,0,311740.79999999999,0,311740.79999999999,null,311740.79999999999]
[{"$f":"IF(INTRO!$E$39=\"Non endémique\",\" \",IF(COUNTRY_INFO!A14=0,\" \",COUNTRY_INFO!A14))","v":"TOGO"},{"$f":"IF(INTRO!$E$39=\"Non endémique\",\" \",IF(COUNTRY_INFO!B14=0,\" \",COUNTRY_INFO!B14))","v":"CENTRALE"},{"$f":"IF(INTRO!$E$39=\"Non endémique\",\" \",IF(COUNTRY_INFO!C14=0,\" \",COUNTRY_INFO!C14))","v":"TCHAOUDJO"},129153,{"$f":"IF(AND(INTRO!$E$39=\"Non endémique\",INTRO!$E$37=\"Non endémique\"),\"Non requis\",IF(INTRO!$E$39=\"Non endémique\",\"Traiter avec DEC\",COUNTRY_INFO!V14))","v":0},{"$f":"IF(INTRO!$E$39<>\"Non endémique\",COUNTRY_INFO!W14,\"Non requis\")","v":2},{"$f":"IF(COUNTRY_INFO!H14=1, IF($E14=1,$D14, 0),0)","v":0},105905,0,593068,0,593068,null,593068]
[{"$f":"IF(INTRO!$E$39=\"Non endémique\",\" \",IF(COUNTRY_INFO!A15=0,\" \",COUNTRY_INFO!A15))","v":"TOGO"},{"$f":"IF(INTRO!$E$39=\"Non endémique\",\" \",IF(COUNTRY_INFO!B15=0,\" \",COUNTRY_INFO!B15))","v":"GRAND LOME"},{"$f":"IF(INTRO!$E$39=\"Non endémique\",\" \",IF(COUNTRY_INFO!C15=0,\" \",COUNTRY_INFO!C15))","v":"AGOE-NYIVE"},0,{"$f":"IF(AND(INTRO!$E$39=\"Non endémique\",INTRO!$E$37=\"Non endémique\"),\"Non requis\",IF(INTRO!$E$39=\"Non endémique\",\"Traiter avec DEC\",COUNTRY_INFO!V15))","v":0},{"$f":"IF(INTRO!$E$39<>\"Non endémique\",COUNTRY_INFO!W15,\"Non requis\")","v":0},{"$f":"IF(COUNTRY_INFO!H15=1, IF($E15=1,$D15, 0),0)","v":0},"                     -    ",0,0,0,0,null,0]
[{"$f":"IF(INTRO!$E$39=\"Non endémique\",\" \",IF(COUNTRY_INFO!A16=0,\" \",COUNTRY_INFO!A16))","v":"TOGO"},{"$f":"IF(INTRO!$E$39=\"Non endémique\",\" \",IF(COUNTRY_INFO!B16=0,\" \",COUNTRY_INFO!B16))","v":"GRAND LOME"},{"$f":"IF(INTRO!$E$39=\"Non endémique\",\" \",IF(COUNTRY_INFO!C16=0,\" \",COUNTRY_INFO!C16))","v":"GOLFE"},0,{"$f":"IF(AND(INTRO!$E$39=\"Non endémique\",INTRO!$E$37=\"Non endémique\"),\"Non requis\",IF(INTRO!$E$39=\"Non endémique\",\"Traiter avec DEC\",COUNTRY_INFO!V16))","v":0},{"$f":"IF(INTRO!$E$39<>\"Non endémique\",COUNTRY_INFO!W16,\"Non requis\")","v":0},{"$f":"IF(COUNTRY_INFO!H16=1, IF($E16=1,$D16, 0),0)","v":0},"                     -    ",0,0,0,0,null,0]
[{"$f":"IF(INTRO!$E$39=\"Non endémique\",\" \",IF(COUNTRY_INFO!A17=0,\" \",COUNTRY_INFO!A17))","v":"TOGO"},{"$f":"IF(INTRO!$E$39=\"Non endémique\",\" \",IF(COUNTRY_INFO!B17=0,\" \",COUNTRY_INFO!B17))","v":"KARA"},{"$f":"IF(INTRO!$E$39=\"Non endémique\",\" \",IF(COUNTRY_INFO!C17=0,\" \",COUNTRY_INFO!C17))","v":"ASSOLI"},49668,{"$f":"IF(AND(INTRO!$E$39=\"Non endémique\",INTRO!$E$37=\"Non endémique\"),\"Non requis\",IF(INTRO!$E$39=\"Non endémique\",\"Traiter avec DEC\",COUNTRY_INFO!V17))","v":0},{"$f":"IF(INTRO!$E$39<>\"Non endémique\",COUNTRY_INFO!W17,\"Non requis\")","v":2},{"$f":"IF(COUNTRY_INFO!H17=1, IF($E17=1,$D17, 0),0)","v":0},40728,0,228076.79999999999,0,228076.79999999999,null,228076.79999999999]
[{"$f":"IF(INTRO!$E$39=\"Non endémique\",\" \",IF(COUNTRY_INFO!A18=0,\" \",COUNTRY_INFO!A18))","v":"TOGO"},{"$f":"IF(INTRO!$E$39=\"Non endémique\",\" \",IF(COUNTRY_INFO!B18=0,\" \",COUNTRY_INFO!B18))","v":"KARA"},{"$f":"IF(INTRO!$E$39=\"Non endémique\",\" \",IF(COUNTRY_INFO!C18=0,\" \",COUNTRY_INFO!C18))","v":"BASSAR"},115417,{"$f":"IF(AND(INTRO!$E$39=\"Non endémique\",INTRO!$E$37=\"Non endémique\"),\"Non requis\",IF(INTRO!$E$39=\"Non endémique\",\"Traiter avec DEC\",COUNTRY_INFO!V18))","v":0},{"$f":"IF(INTRO!$E$39<>\"Non endémique\",COUNTRY_INFO!W18,\"Non requis\")","v":2},{"$f":"IF(COUNTRY_INFO!H18=1, IF($E18=1,$D18, 0),0)","v":0},94642,0,529995.19999999995,0,529995.19999999995,null,529995.19999999995]
[{"$f":"IF(INTRO!$E$39=\"Non endémique\",\" \",IF(COUNTRY_INFO!A19=0,\" \",COUNTRY_INFO!A19))","v":"TOGO"},{"$f":"IF(INTRO!$E$39=\"Non endémique\",\" \",IF(COUNTRY_INFO!B19=0,\" \",COUNTRY_INFO!B19))","v":"KARA"},{"$f":"IF(INTRO!$E$39=\"Non endémique\",\" \",IF(COUNTRY_INFO!C19=0,\" \",COUNTRY_INFO!C19))","v":"BINAH"},56160,{"$f":"IF(AND(INTRO!$E$39=\"Non endémique\",INTRO!$E$37=\"Non endémique\"),\"Non requis\",IF(INTRO!$E$39=\"Non endémique\",\"Traiter avec DEC\",COUNTRY_INFO!V19))","v":0},{"$f":"IF(INTRO!$E$39<>\"Non endémique\",COUNTRY_INFO!W19,\"Non requis\")","v":2},{"$f":"IF(COUNTRY_INFO!H19=1, IF($E19=1,$D19, 0),0)","v":0},46051,0,257885.59999999998,0,257885.59999999998,null,257885.59999999998]
[{"$f":"IF(INTRO!$E$39=\"Non endémique\",\" \",IF(COUNTRY_INFO!A20=0,\" \",COUNTRY_INFO!A20))","v":"TOGO"},{"$f":"IF(INTRO!$E$39=\"Non endémique\",\" \",IF(COUNTRY_INFO!B20=0,\" \",COUNTRY_INFO!B20))","v":"KARA"},{"$f":"IF(INTRO!$E$39=\"Non endémique\",\" \",IF(COUNTRY_INFO!C20=0,\" \",COUNTRY_INFO!C20))","v":"DANKPEN"},167203,{"$f":"IF(AND(INTRO!$E$39=\"Non endémique\",INTRO!$E$37=\"Non endémique\"),\"Non requis\",IF(INTRO!$E$39=\"Non endémique\",\"Traiter avec DEC\",COUNTRY_INFO!V20))","v":0},{"$f":"IF(INTRO!$E$39<>\"Non endémique\",COUNTRY_INFO!W20,\"Non requis\")","v":2},{"$f":"IF(COUNTRY_INFO!H20=1, IF($E20=1,$D20, 0),0)","v":0},137106,0,767793.6,0,767793.6,null,767793.6]
[{"$f":"IF(INTRO!$E$39=\"Non endémique\",\" \",IF(COUNTRY_INFO!A21=0,\" \",COUNTRY_INFO!A21))","v":"TOGO"},{"$f":"IF(INTRO!$E$39=\"Non endémique\",\" \",IF(COUNTRY_INFO!B21=0,\" \",COUNTRY_INFO!B21))","v":"KARA"},{"$f":"IF(INTRO!$E$39=\"Non endémique\",\" \",IF(COUNTRY_INFO!C21=0,\" \",COUNTRY_INFO!C21))","v":"DOUFELGOU"},81793,{"$f":"IF(AND(INTRO!$E$39=\"Non endémique\",INTRO!$E$37=\"Non endémique\"),\"Non requis\",IF(INTRO!$E$39=\"Non endémique\",\"Traiter avec DEC\",COUNTRY_INFO!V21))","v":0},{"$f":"IF(INTRO!$E$39<>\"Non endémique\",COUNTRY_INFO!W21,\"Non requis\")","v":2},{"$f":"IF(COUNTRY_INFO!H21=1, IF($E21=1,$D21, 0),0)","v":0},67070,0,375592,0,375592,null,375592]
[{"$f":"IF(INTRO!$E$39=\"Non endémique\",\" \",IF(COUNTRY_INFO!A22=0,\" \",COUNTRY_INFO!A22))","v":"TOGO"},{"$f":"IF(INTRO!$E$39=\"Non endémique\",\" \",IF(COUNTRY_INFO!B22=0,\" \",COUNTRY_INFO!B22))","v":"KARA"},{"$f":"IF(INTRO!$E$39=\"Non endémique\",\" \",IF(COUNTRY_INFO!C22=0,\" \",COUNTRY_INFO!C22))","v":"KERAN"},126017,{"$f":"IF(AND(INTRO!$E$39=\"Non endémique\",INTRO!$E$37=\"Non endémique\"),\"Non requis\",IF(INTRO!$E$39=\"Non endémique\",\"Traiter avec DEC\",COUNTRY_INFO!V22))","v":0},{"$f":"IF(INTRO!$E$39<>\"Non endémique\",COUNTRY_INFO!W22,\"Non requis\")","v":2},{"$f":"IF(COUNTRY_INFO!H22=1, IF($E22=1,$D22, 0),0)","v":0},103334,0,578670.39999999991,0,578670.39999999991,null,578670.39999999991]
[{"$f":"IF(INTRO!$E$39=\"Non endémique\",\" \",IF(COUNTRY_INFO!A23=0,\" \",COUNTRY_INFO!A23))","v":"TOGO"},{"$f":"IF(INTRO!$E$39=\"Non endémique\",\" \",IF(COUNTRY_INFO!B23=0,\" \",COUNTRY_INFO!B23))","v":"KARA"},{"$f":"IF(INTRO!$E$39=\"Non endémique\",\" \",IF(COUNTRY_INFO!C23=0,\" \",COUNTRY_INFO!C23))","v":"KOZAH"},174818,{"$f":"IF(AND(INTRO!$E$39=\"Non endémique\",INTRO!$E$37=\"Non endémique\"),\"Non requis\",IF(INTRO!$E$39=\"Non endémique\",\"Traiter avec DEC\",COUNTRY_INFO!V23))","v":0},{"$f":"IF(INTRO!$E$39<>\"Non endémique\",COUNTRY_INFO!W23,\"Non requis\")","v":2},{"$f":"IF(COUNTRY_INFO!H23=1, IF($E23=1,$D23, 0),0)","v":0},143351,0,802765.6,0,802765.6,null,802765.6]
[{"$f":"IF(INTRO!$E$39=\"Non endémique\",\" \",IF(COUNTRY_INFO!A24=0,\" \",COUNTRY_INFO!A24))","v":"TOGO"},{"$f":"IF(INTRO!$E$39=\"Non endémique\",\" \",IF(COUNTRY_INFO!B24=0,\" \",COUNTRY_INFO!B24))","v":"MARITIME"},{"$f":"IF(INTRO!$E$39=\"Non endémique\",\" \",IF(COUNTRY_INFO!C24=0,\" \",COUNTRY_INFO!C24))","v":"AVE"},106722,{"$f":"IF(AND(INTRO!$E$39=\"Non endémique\",INTRO!$E$37=\"Non endémique\"),\"Non requis\",IF(INTRO!$E$39=\"Non endémique\",\"Traiter avec DEC\",COUNTRY_INFO!V24))","v":0},{"$f":"IF(INTRO!$E$39<>\"Non endémique\",COUNTRY_INFO!W24,\"Non requis\")","v":0},{"$f":"IF(COUNTRY_INFO!H24=1, IF($E24=1,$D24, 0),0)","v":0},87512,0,0,0,0,null,0]
[{"$f":"IF(INTRO!$E$39=\"Non endémique\",\" \",IF(COUNTRY_INFO!A25=0,\" \",COUNTRY_INFO!A25))","v":"TOGO"},{"$f":"IF(INTRO!$E$39=\"Non endémique\",\" \",IF(COUNTRY_INFO!B25=0,\" \",COUNTRY_INFO!B25))","v":"MARITIME"},{"$f":"IF(INTRO!$E$39=\"Non endémique\",\" \",IF(COUNTRY_INFO!C25=0,\" \",COUNTRY_INFO!C25))","v":"BAS MONO"},31284,{"$f":"IF(AND(INTRO!$E$39=\"Non endémique\",INTRO!$E$37=\"Non endémique\"),\"Non requis\",IF(INTRO!$E$39=\"Non endémique\",\"Traiter avec DEC\",COUNTRY_INFO!V25))","v":0},{"$f":"IF(INTRO!$E$39<>\"Non endémique\",COUNTRY_INFO!W25,\"Non requis\")","v":0},{"$f":"IF(COUNTRY_INFO!H25=1, IF($E25=1,$D25, 0),0)","v":0},25653,0,0,0,0,null,0]
[{"$f":"IF(INTRO!$E$39=\"Non endémique\",\" \",IF(COUNTRY_INFO!A26=0,\" \",COUNTRY_INFO!A26))","v":"TOGO"},{"$f":"IF(INTRO!$E$39=\"Non endémique\",\" \",IF(COUNTRY_INFO!B26=0,\" \",COUNTRY_INFO!B26))","v":"MARITIME"},{"$f":"IF(INTRO!$E$39=\"Non endémique\",\" \",IF(COUNTRY_INFO!C26=0,\" \",COUNTRY_INFO!C26))","v":"LACS"},0,{"$f":"IF(AND(INTRO!$E$39=\"Non endémique\",INTRO!$E$37=\"Non endémique\"),\"Non requis\",IF(INTRO!$E$39=\"Non endémique\",\"Traiter avec DEC\",COUNTRY_INFO!V26))","v":0},{"$f":"IF(INTRO!$E$39<>\"Non endémique\",COUNTRY_INFO!W26,\"Non requis\")","v":0},{"$f":"IF(COUNTRY_INFO!H26=1, IF($E26=1,$D26, 0),0)","v":0},"                     -    ",0,0,0,0,null,0]
[{"$f":"IF(INTRO!$E$39=\"Non endémique\",\" \",IF(COUNTRY_INFO!A27=0,\" \",COUNTRY_INFO!A27))","v":"TOGO"},{"$f":"IF(INTRO!$E$39=\"Non endémique\",\" \",IF(COUNTRY_INFO!B27=0,\" \",COUNTRY_INFO!B27))","v":"MARITIME"},{"$f":"IF(INTRO!$E$39=\"Non endémique\",\" \",IF(COUNTRY_INFO!C27=0,\" \",COUNTRY_INFO!C27))","v":"VO"},0,{"$f":"IF(AND(INTRO!$E$39=\"Non endémique\",INTRO!$E$37=\"Non endémique\"),\"Non requis\",IF(INTRO!$E$39=\"Non endémique\",\"Traiter avec DEC\",COUNTRY_INFO!V27))","v":0},{"$f":"IF(INTRO!$E$39<>\"Non endémique\",COUNTRY_INFO!W27,\"Non requis\")","v":0},{"$f":"IF(COUNTRY_INFO!H27=1, IF($E27=1,$D27, 0),0)","v":0},"                     -    ",0,0,0,0,null,0]
[{"$f":"IF(INTRO!$E$39=\"Non endémique\",\" \",IF(COUNTRY_INFO!A28=0,\" \",COUNTRY_INFO!A28))","v":"TOGO"},{"$f":"IF(INTRO!$E$39=\"Non endémique\",\" \",IF(COUNTRY_INFO!B28=0,\" \",COUNTRY_INFO!B28))","v":"MARITIME"},{"$f":"IF(INTRO!$E$39=\"Non endémique\",\" \",IF(COUNTRY_INFO!C28=0,\" \",COUNTRY_INFO!C28))","v":"YOTO"},179780,{"$f":"IF(AND(INTRO!$E$39=\"Non endémique\",INTRO!$E$37=\"Non endémique\"),\"Non requis\",IF(INTRO!$E$39=\"Non endémique\",\"Traiter avec DEC\",COUNTRY_INFO!V28))","v":0},{"$f":"IF(INTRO!$E$39<>\"Non endémique\",COUNTRY_INFO!W28,\"Non requis\")","v":1},{"$f":"IF(COUNTRY_INFO!H28=1, IF($E28=1,$D28, 0),0)","v":0},147420,0,412776,0,412776,null,412776]
[{"$f":"IF(INTRO!$E$39=\"Non endémique\",\" \",IF(COUNTRY_INFO!A29=0,\" \",COUNTRY_INFO!A29))","v":"TOGO"},{"$f":"IF(INTRO!$E$39=\"Non endémique\",\" \",IF(COUNTRY_INFO!B29=0,\" \",COUNTRY_INFO!B29))","v":"MARITIME"},{"$f":"IF(INTRO!$E$39=\"Non endémique\",\" \",IF(COUNTRY_INFO!C29=0,\" \",COUNTRY_INFO!C29))","v":"ZIO"},294458,{"$f":"IF(AND(INTRO!$E$39=\"Non endémique\",INTRO!$E$37=\"Non endémique\"),\"Non requis\",IF(INTRO!$E$39=\"Non endémique\",\"Traiter avec DEC\",COUNTRY_INFO!V29))","v":0},{"$f":"IF(INTRO!$E$39<>\"Non endémique\",COUNTRY_INFO!W29,\"Non requis\")","v":0},{"$f":"IF(COUNTRY_INFO!H29=1, IF($E29=1,$D29, 0),0)","v":0},241456,0,0,0,0,null,0]
[{"$f":"IF(INTRO!$E$39=\"Non endémique\",\" \",IF(COUNTRY_INFO!A30=0,\" \",COUNTRY_INFO!A30))","v":"TOGO"},{"$f":"IF(INTRO!$E$39=\"Non endémique\",\" \",IF(COUNTRY_INFO!B30=0,\" \",COUNTRY_INFO!B30))","v":"PLATEAUX"},{"$f":"IF(INTRO!$E$39=\"Non endémique\",\" \",IF(COUNTRY_INFO!C30=0,\" \",COUNTRY_INFO!C30))","v":"AGOU"},88598,{"$f":"IF(AND(INTRO!$E$39=\"Non endémique\",INTRO!$E$37=\"Non endémique\"),\"Non requis\",IF(INTRO!$E$39=\"Non endémique\",\"Traiter avec DEC\",COUNTRY_INFO!V30))","v":0},{"$f":"IF(INTRO!$E$39<>\"Non endémique\",COUNTRY_INFO!W30,\"Non requis\")","v":1},{"$f":"IF(COUNTRY_INFO!H30=1, IF($E30=1,$D30, 0),0)","v":0},72650,0,203420,0,203420,null,203420]
[{"$f":"IF(INTRO!$E$39=\"Non endémique\",\" \",IF(COUNTRY_INFO!A31=0,\" \",COUNTRY_INFO!A31))","v":"TOGO"},{"$f":"IF(INTRO!$E$39=\"Non endémique\",\" \",IF(COUNTRY_INFO!B31=0,\" \",COUNTRY_INFO!B31))","v":"PLATEAUX"},{"$f":"IF(INTRO!$E$39=\"Non endémique\",\" \",IF(COUNTRY_INFO!C31=0,\" \",COUNTRY_INFO!C31))","v":"AKEBOU"},76043,{"$f":"IF(AND(INTRO!$E$39=\"Non endémique\",INTRO!$E$37=\"Non endémique\"),\"Non requis\",IF(INTRO!$E$39=\"Non endémique\",\"Traiter avec DEC\",COUNTRY_INFO!V31))","v":0},{"$f":"IF(INTRO!$E$39<>\"Non endémique\",COUNTRY_INFO!W31,\"Non requis\")","v":1},{"$f":"IF(COUNTRY_INFO!H31=1, IF($E31=1,$D31, 0),0)","v":0},62355,0,174594,0,174594,null,174594]
[{"$f":"IF(INTRO!$E$39=\"Non endémique\",\" \",IF(COUNTRY_INFO!A32=0,\" \",COUNTRY_INFO!A32))","v":"TOGO"},{"$f":"IF(INTRO!$E$39=\"Non endémique\",\" \",IF(COUNTRY_INFO!B32=0,\" \",COUNTRY_INFO!B32))","v":"PLATEAUX"},{"$f":"IF(INTRO!$E$39=\"Non endémique\",\" \",IF(COUNTRY_INFO!C32=0,\" \",COUNTRY_INFO!C32))","v":"AMOU"},132297,{"$f":"IF(AND(INTRO!$E$39=\"Non endémique\",INTRO!$E$37=\"Non endémique\"),\"Non requis\",IF(INTRO!$E$39=\"Non endémique\",\"Traiter avec DEC\",COUNTRY_INFO!V32))","v":0},{"$f":"IF(INTRO!$E$39<>\"Non endémique\",COUNTRY_INFO!W32,\"Non requis\")","v":2},{"$f":"IF(COUNTRY_INFO!H32=1, IF($E32=1,$D32, 0),0)","v":0},108484,0,607510.39999999991,0,607510.39999999991,null,607510.39999999991]
[{"$f":"IF(INTRO!$E$39=\"Non endémique\",\" \",IF(COUNTRY_INFO!A33=0,\" \",COUNTRY_INFO!A33))","v":"TOGO"},{"$f":"IF(INTRO!$E$39=\"Non endémique\",\" \",IF(COUNTRY_INFO!B33=0,\" \",COUNTRY_INFO!B33))","v":"PLATEAUX"},{"$f":"IF(INTRO!$E$39=\"Non endémique\",\" \",IF(COUNTRY_INFO!C33=0,\" \",COUNTRY_INFO!C33))","v":"ANIE"},130239,{"$f":"IF(AND(INTRO!$E$39=\"Non endémique\",INTRO!$E$37=\"Non endémique\"),\"Non requis\",IF(INTRO!$E$39=\"Non endémique\",\"Traiter avec DEC\",COUNTRY_INFO!V33))","v":0},{"$f":"IF(INTRO!$E$39<>\"Non endémique\",COUNTRY_INFO!W33,\"Non requis\")","v":1},{"$f":"IF(COUNTRY_INFO!H33=1, IF($E33=1,$D33, 0),0)","v":0},106796,0,299028.8,0,299028.8,null,299028.8]
[{"$f":"IF(INTRO!$E$39=\"Non endémique\",\" \",IF(COUNTRY_INFO!A34=0,\" \",COUNTRY_INFO!A34))","v":"TOGO"},{"$f":"IF(INTRO!$E$39=\"Non endémique\",\" \",IF(COUNTRY_INFO!B34=0,\" \",COUNTRY_INFO!B34))","v":"PLATEAUX"},{"$f":"IF(INTRO!$E$39=\"Non endémique\",\" \",IF(COUNTRY_INFO!C34=0,\" \",COUNTRY_INFO!C34))","v":"DANYI"},40188,{"$f":"IF(AND(INTRO!$E$39=\"Non endémique\",INTRO!$E$37=\"Non endémique\"),\"Non requis\",IF(INTRO!$E$39=\"Non endémique\",\"Traiter avec DEC\",COUNTRY_INFO!V34))","v":0},{"$f":"IF(INTRO!$E$39<>\"Non endémique\",COUNTRY_INFO!W34,\"Non requis\")","v":2},{"$f":"IF(COUNTRY_INFO!H34=1, IF($E34=1,$D34, 0),0)","v":0},32954,0,184542.4,0,184542.4,null,184542.4]
[{"$f":"IF(INTRO!$E$39=\"Non endémique\",\" \",IF(COUNTRY_INFO!A35=0,\" \",COUNTRY_INFO!A35))","v":"TOGO"},{"$f":"IF(INTRO!$E$39=\"Non endémique\",\" \",IF(COUNTRY_INFO!B35=0,\" \",COUNTRY_INFO!B35))","v":"PLATEAUX"},{"$f":"IF(INTRO!$E$39=\"Non endémique\",\" \",IF(COUNTRY_INFO!C35=0,\" \",COUNTRY_INFO!C35))","v":"EST-MONO"},144393,{"$f":"IF(AND(INTRO!$E$39=\"Non endémique\",INTRO!$E$37=\"Non endémique\"),\"Non requis\",IF(INTRO!$E$39=\"Non endémique\",\"Traiter avec DEC\",COUNTRY_INFO!V35))","v":0},{"$f":"IF(INTRO!$E$39<>\"Non endémique\",COUNTRY_INFO!W35,\"Non requis\")","v":1},{"$f":"IF(COUNTRY_INFO!H35=1, IF($E35=1,$D35, 0),0)","v":0},118402,0,331525.59999999998,0,331525.59999999998,null,331525.59999999998]
[{"$f":"IF(INTRO!$E$39=\"Non endémique\",\" \",IF(COUNTRY_INFO!A36=0,\" \",COUNTRY_INFO!A36))","v":"TOGO"},{"$f":"IF(INTRO!$E$39=\"Non endémique\",\" \",IF(COUNTRY_INFO!B36=0,\" \",COUNTRY_INFO!B36))","v":"PLATEAUX"},{"$f":"IF(INTRO!$E$39=\"Non endémique\",\" \",IF(COUNTRY_INFO!C36=0,\" \",COUNTRY_INFO!C36))","v":"HAHO"},259934,{"$f":"IF(AND(INTRO!$E$39=\"Non endémique\",INTRO!$E$37=\"Non endémique\"),\"Non requis\",IF(INTRO!$E$39=\"Non endémique\",\"Traiter avec DEC\",COUNTRY_INFO!V36))","v":0},{"$f":"IF(INTRO!$E$39<>\"Non endémique\",COUNTRY_INFO!W36,\"Non requis\")","v":2},{"$f":"IF(COUNTRY_INFO!H36=1, IF($E36=1,$D36, 0),0)","v":0},213146,0,1193617.5999999999,0,1193617.5999999999,null,1193617.5999999999]
[{"$f":"IF(INTRO!$E$39=\"Non endémique\",\" \",IF(COUNTRY_INFO!A37=0,\" \",COUNTRY_INFO!A37))","v":"TOGO"},{"$f":"IF(INTRO!$E$39=\"Non endémique\",\" \",IF(COUNTRY_INFO!B37=0,\" \",COUNTRY_INFO!B37))","v":"PLATEAUX"},{"$f":"IF(INTRO!$E$39=\"Non endémique\",\" \",IF(COUNTRY_INFO!C37=0,\" \",COUNTRY_INFO!C37))","v":"KLOTO"},62911,{"$f":"IF(AND(INTRO!$E$39=\"Non endémique\",INTRO!$E$37=\"Non endémique\"),\"Non requis\",IF(INTRO!$E$39=\"Non endémique\",\"Traiter avec DEC\",COUNTRY_INFO!V37))","v":0},{"$f":"IF(INTRO!$E$39<>\"Non endémique\",COUNTRY_INFO!W37,\"Non requis\")","v":1},{"$f":"IF(COUNTRY_INFO!H37=1, IF($E37=1,$D37, 0),0)","v":0},51587,0,144443.59999999998,0,144443.59999999998,null,144443.59999999998]
[{"$f":"IF(INTRO!$E$39=\"Non endémique\",\" \",IF(COUNTRY_INFO!A38=0,\" \",COUNTRY_INFO!A38))","v":"TOGO"},{"$f":"IF(INTRO!$E$39=\"Non endémique\",\" \",IF(COUNTRY_INFO!B38=0,\" \",COUNTRY_INFO!B38))","v":"PLATEAUX"},{"$f":"IF(INTRO!$E$39=\"Non endémique\",\" \",IF(COUNTRY_INFO!C38=0,\" \",COUNTRY_INFO!C38))","v":"KPELE"},70989,{"$f":"IF(AND(INTRO!$E$39=\"Non endémique\",INTRO!$E$37=\"Non endémique\"),\"Non requis\",IF(INTRO!$E$39=\"Non endémique\",\"Traiter avec DEC\",COUNTRY_INFO!V38))","v":0},{"$f":"IF(INTRO!$E$39<>\"Non endémique\",COUNTRY_INFO!W38,\"Non requis\")","v":1},{"$f":"IF(COUNTRY_INFO!H38=1, IF($E38=1,$D38, 0),0)","v":0},58211,0,162990.79999999999,0,162990.79999999999,null,162990.79999999999]
[{"$f":"IF(INTRO!$E$39=\"Non endémique\",\" \",IF(COUNTRY_INFO!A39=0,\" \",COUNTRY_INFO!A39))","v":"TOGO"},{"$f":"IF(INTRO!$E$39=\"Non endémique\",\" \",IF(COUNTRY_INFO!B39=0,\" \",COUNTRY_INFO!B39))","v":"PLATEAUX"},{"$f":"IF(INTRO!$E$39=\"Non endémique\",\" \",IF(COUNTRY_INFO!C39=0,\" \",COUNTRY_INFO!C39))","v":"MOYEN-MONO"},63487,{"$f":"IF(AND(INTRO!$E$39=\"Non endémique\",INTRO!$E$37=\"Non endémique\"),\"Non requis\",IF(INTRO!$E$39=\"Non endémique\",\"Traiter avec DEC\",COUNTRY_INFO!V39))","v":0},{"$f":"IF(INTRO!$E$39<>\"Non endémique\",COUNTRY_INFO!W39,\"Non requis\")","v":1},{"$f":"IF(COUNTRY_INFO!H39=1, IF($E39=1,$D39, 0),0)","v":0},52059,0,145765.19999999998,0,145765.19999999998,null,145765.19999999998]
[{"$f":"IF(INTRO!$E$39=\"Non endémique\",\" \",IF(COUNTRY_INFO!A40=0,\" \",COUNTRY_INFO!A40))","v":"TOGO"},{"$f":"IF(INTRO!$E$39=\"Non endémique\",\" \",IF(COUNTRY_INFO!B40=0,\" \",COUNTRY_INFO!B40))","v":"PLATEAUX"},{"$f":"IF(INTRO!$E$39=\"Non endémique\",\" \",IF(COUNTRY_INFO!C40=0,\" \",COUNTRY_INFO!C40))","v":"OGOU"},140103,{"$f":"IF(AND(INTRO!$E$39=\"Non endémique\",INTRO!$E$37=\"Non endémique\"),\"Non requis\",IF(INTRO!$E$39=\"Non endémique\",\"Traiter avec DEC\",COUNTRY_INFO!V40))","v":0},{"$f":"IF(INTRO!$E$39<>\"Non endémique\",COUNTRY_INFO!W40,\"Non requis\")","v":2},{"$f":"IF(COUNTRY_INFO!H40=1, IF($E40=1,$D40, 0),0)","v":0},114884,0,643350.39999999991,0,643350.39999999991,null,643350.39999999991]
[{"$f":"IF(INTRO!$E$39=\"Non endémique\",\" \",IF(COUNTRY_INFO!A41=0,\" \",COUNTRY_INFO!A41))","v":"TOGO"},{"$f":"IF(INTRO!$E$39=\"Non endémique\",\" \",IF(COUNTRY_INFO!B41=0,\" \",COUNTRY_INFO!B41))","v":"PLATEAUX"},{"$f":"IF(INTRO!$E$39=\"Non endémique\",\" \",IF(COUNTRY_INFO!C41=0,\" \",COUNTRY_INFO!C41))","v":"WAWA"},108755,{"$f":"IF(AND(INTRO!$E$39=\"Non endémique\",INTRO!$E$37=\"Non endémique\"),\"Non requis\",IF(INTRO!$E$39=\"Non endémique\",\"Traiter avec DEC\",COUNTRY_INFO!V41))","v":0},{"$f":"IF(INTRO!$E$39<>\"Non endémique\",COUNTRY_INFO!W41,\"Non requis\")","v":1},{"$f":"IF(COUNTRY_INFO!H41=1, IF($E41=1,$D41, 0),0)","v":0},89179,0,249701.19999999998,0,249701.19999999998,null,249701.19999999998]
[{"$f":"IF(INTRO!$E$39=\"Non endémique\",\" \",IF(COUNTRY_INFO!A42=0,\" \",COUNTRY_INFO!A42))","v":"TOGO"},{"$f":"IF(INTRO!$E$39=\"Non endémique\",\" \",IF(COUNTRY_INFO!B42=0,\" \",COUNTRY_INFO!B42))","v":"SAVANES"},{"$f":"IF(INTRO!$E$39=\"Non endémique\",\" \",IF(COUNTRY_INFO!C42=0,\" \",COUNTRY_INFO!C42))","v":"CINKASSE"},74611,{"$f":"IF(AND(INTRO!$E$39=\"Non endémique\",INTRO!$E$37=\"Non endémique\"),\"Non requis\",IF(INTRO!$E$39=\"Non endémique\",\"Traiter avec DEC\",COUNTRY_INFO!V42))","v":0},{"$f":"IF(INTRO!$E$39<>\"Non endémique\",COUNTRY_INFO!W42,\"Non requis\")","v":2},{"$f":"IF(COUNTRY_INFO!H42=1, IF($E42=1,$D42, 0),0)","v":0},61181,0,342613.6,0,342613.6,null,342613.6]
[{"$f":"IF(INTRO!$E$39=\"Non endémique\",\" \",IF(COUNTRY_INFO!A43=0,\" \",COUNTRY_INFO!A43))","v":"TOGO"},{"$f":"IF(INTRO!$E$39=\"Non endémique\",\" \",IF(COUNTRY_INFO!B43=0,\" \",COUNTRY_INFO!B43))","v":"SAVANES"},{"$f":"IF(INTRO!$E$39=\"Non endémique\",\" \",IF(COUNTRY_INFO!C43=0,\" \",COUNTRY_INFO!C43))","v":"KPENDJAL"},87256,{"$f":"IF(AND(INTRO!$E$39=\"Non endémique\",INTRO!$E$37=\"Non endémique\"),\"Non requis\",IF(INTRO!$E$39=\"Non endémique\",\"Traiter avec DEC\",COUNTRY_INFO!V43))","v":0},{"$f":"IF(INTRO!$E$39<>\"Non endémique\",COUNTRY_INFO!W43,\"Non requis\")","v":2},{"$f":"IF(COUNTRY_INFO!H43=1, IF($E43=1,$D43, 0),0)","v":0},71550,0,400680,0,400680,null,400680]
[{"$f":"IF(INTRO!$E$39=\"Non endémique\",\" \",IF(COUNTRY_INFO!A44=0,\" \",COUNTRY_INFO!A44))","v":"TOGO"},{"$f":"IF(INTRO!$E$39=\"Non endémique\",\" \",IF(COUNTRY_INFO!B44=0,\" \",COUNTRY_INFO!B44))","v":"SAVANES"},{"$f":"IF(INTRO!$E$39=\"Non endémique\",\" \",IF(COUNTRY_INFO!C44=0,\" \",COUNTRY_INFO!C44))","v":"KPENDJAL-OUEST"},133846,{"$f":"IF(AND(INTRO!$E$39=\"Non endémique\",INTRO!$E$37=\"Non endémique\"),\"Non requis\",IF(INTRO!$E$39=\"Non endémique\",\"Traiter avec DEC\",COUNTRY_INFO!V44))","v":0},{"$f":"IF(INTRO!$E$39<>\"Non endémique\",COUNTRY_INFO!W44,\"Non requis\")","v":2},{"$f":"IF(COUNTRY_INFO!H44=1, IF($E44=1,$D44, 0),0)","v":0},109754,0,614622.39999999991,0,614622.39999999991,null,614622.39999999991]
[{"$f":"IF(INTRO!$E$39=\"Non endémique\",\" \",IF(COUNTRY_INFO!A45=0,\" \",COUNTRY_INFO!A45))","v":"TOGO"},{"$f":"IF(INTRO!$E$39=\"Non endémique\",\" \",IF(COUNTRY_INFO!B45=0,\" \",COUNTRY_INFO!B45))","v":"SAVANES"},{"$f":"IF(INTRO!$E$39=\"Non endémique\",\" \",IF(COUNTRY_INFO!C45=0,\" \",COUNTRY_INFO!C45))","v":"OTI"},85586,{"$f":"IF(AND(INTRO!$E$39=\"Non endémique\",INTRO!$E$37=\"Non endémique\"),\"Non requis\",IF(INTRO!$E$39=\"Non endémique\",\"Traiter avec DEC\",COUNTRY_INFO!V45))","v":0},{"$f":"IF(INTRO!$E$39<>\"Non endémique\",COUNTRY_INFO!W45,\"Non requis\")","v":2},{"$f":"IF(COUNTRY_INFO!H45=1, IF($E45=1,$D45, 0),0)","v":0},70181,0,393013.6,0,393013.6,null,393013.6]
[{"$f":"IF(INTRO!$E$39=\"Non endémique\",\" \",IF(COUNTRY_INFO!A46=0,\" \",COUNTRY_INFO!A46))","v":"TOGO"},{"$f":"IF(INTRO!$E$39=\"Non endémique\",\" \",IF(COUNTRY_INFO!B46=0,\" \",COUNTRY_INFO!B46))","v":"SAVANES"},{"$f":"IF(INTRO!$E$39=\"Non endémique\",\" \",IF(COUNTRY_INFO!C46=0,\" \",COUNTRY_INFO!C46))","v":"OTI-SUD"},128797,{"$f":"IF(AND(INTRO!$E$39=\"Non endémique\",INTRO!$E$37=\"Non endémique\"),\"Non requis\",IF(INTRO!$E$39=\"Non endémique\",\"Traiter avec DEC\",COUNTRY_INFO!V46))","v":0},{"$f":"IF(INTRO!$E$39<>\"Non endémique\",COUNTRY_INFO!W46,\"Non requis\")","v":2},{"$f":"IF(COUNTRY_INFO!H46=1, IF($E46=1,$D46, 0),0)","v":0},105614,0,591438.39999999991,0,591438.39999999991,null,591438.39999999991]
[{"$f":"IF(INTRO!$E$39=\"Non endémique\",\" \",IF(COUNTRY_INFO!A47=0,\" \",COUNTRY_INFO!A47))","v":"TOGO"},{"$f":"IF(INTRO!$E$39=\"Non endémique\",\" \",IF(COUNTRY_INFO!B47=0,\" \",COUNTRY_INFO!B47))","v":"SAVANES"},{"$f":"IF(INTRO!$E$39=\"Non endémique\",\" \",IF(COUNTRY_INFO!C47=0,\" \",COUNTRY_INFO!C47))","v":"TANDJOUARE"},168188,{"$f":"IF(AND(INTRO!$E$39=\"Non endémique\",INTRO!$E$37=\"Non endémique\"),\"Non requis\",IF(INTRO!$E$39=\"Non endémique\",\"Traiter avec DEC\",COUNTRY_INFO!V47))","v":0},{"$f":"IF(INTRO!$E$39<>\"Non endémique\",COUNTRY_INFO!W47,\"Non requis\")","v":2},{"$f":"IF(COUNTRY_INFO!H47=1, IF($E47=1,$D47, 0),0)","v":0},137914,0,772318.39999999991,0,772318.39999999991,null,772318.39999999991]
[{"$f":"IF(INTRO!$E$39=\"Non endémique\",\" \",IF(COUNTRY_INFO!A48=0,\" \",COUNTRY_INFO!A48))","v":"TOGO"},{"$f":"IF(INTRO!$E$39=\"Non endémique\",\" \",IF(COUNTRY_INFO!B48=0,\" \",COUNTRY_INFO!B48))","v":"SAVANES"},{"$f":"IF(INTRO!$E$39=\"Non endémique\",\" \",IF(COUNTRY_INFO!C48=0,\" \",COUNTRY_INFO!C48))","v":"TONE"},304751,{"$f":"IF(AND(INTRO!$E$39=\"Non endémique\",INTRO!$E$37=\"Non endémique\"),\"Non requis\",IF(INTRO!$E$39=\"Non endémique\",\"Traiter avec DEC\",COUNTRY_INFO!V48))","v":0},{"$f":"IF(INTRO!$E$39<>\"Non endémique\",COUNTRY_INFO!W48,\"Non requis\")","v":2},{"$f":"IF(COUNTRY_INFO!H48=1, IF($E48=1,$D48, 0),0)","v":0},249896,0,1399417.5999999999,0,1399417.5999999999,null,1399417.5999999999]

{"sheet":"IVM+","index":6,"n_rows":48,"n_cols":8,"rows_kept":48,"cut":false,"hidden":true,"merged":[[6,0,7,0],[6,1,7,1],[6,2,7,2],[6,3,7,3],[3,0,3,2],[5,0,5,2],[6,5,7,5],[6,6,7,6],[6,7,7,7],[5,4,7,4],[5,5,5,7]]}
["Ivermectine (IVM) pour IDA thérapie"]
["Structure administrative, population ciblée par groupe d'âge, plan de traitement et information sur les comprimés"]
[]
["TOTAL",null,null,null,{"$f":"SUBTOTAL(9,E$10:E$1010)","v":0},0,0,0]
[]
["Structure administrative du pays",null,null,"Plan de traitement","Population nécessitant un traitement avec IVM\n(IDA thérapie)","Ivermectine (IVM)"]
["Pays","Région/Département","District","FL",null,"Total requis","Reste en stock","Comprimés devant être fournis"]
[]
[]
[{"$f":"IF(AND(INTRO!$E$37=\"Endémique\",INTRO!$E$39=\"Non endémique\"),IF(COUNTRY_INFO!A10=0,\" \",COUNTRY_INFO!A10),\" \")","v":" "},{"$f":"IF(AND(INTRO!$E$37=\"Endémique\",INTRO!$E$39=\"Non endémique\"),IF(COUNTRY_INFO!B10=0,\" \",COUNTRY_INFO!B10),\" \")","v":" "},{"$f":"IF(AND(INTRO!$E$37=\"Endémique\",INTRO!$E$39=\"Non endémique\"),IF(COUNTRY_INFO!C10=0,\" \",COUNTRY_INFO!C10),\" \")","v":" "},{"$f":"IF(COUNTRY_INFO!Z10<>\"\",COUNTRY_INFO!V10,0)","v":0},{"$f":"IF(AND(COUNTRY_INFO!Z10<>\"\",COUNTRY_INFO!$H10=1),COUNTRY_INFO!F10+COUNTRY_INFO!G10,0)","v":0},{"$f":"E10*2.8","v":0},null,{"$f":"IF($F10>$G10,$F10-$G10,0)","v":0}]
[{"$f":"IF(AND(INTRO!$E$37=\"Endémique\",INTRO!$E$39=\"Non endémique\"),IF(COUNTRY_INFO!A11=0,\" \",COUNTRY_INFO!A11),\" \")","v":" "},{"$f":"IF(AND(INTRO!$E$37=\"Endémique\",INTRO!$E$39=\"Non endémique\"),IF(COUNTRY_INFO!B11=0,\" \",COUNTRY_INFO!B11),\" \")","v":" "},{"$f":"IF(AND(INTRO!$E$37=\"Endémique\",INTRO!$E$39=\"Non endémique\"),IF(COUNTRY_INFO!C11=0,\" \",COUNTRY_INFO!C11),\" \")","v":" "},{"$f":"IF(COUNTRY_INFO!Z11<>\"\",COUNTRY_INFO!V11,0)","v":0},{"$f":"IF(AND(COUNTRY_INFO!Z11<>\"\",COUNTRY_INFO!$H11=1),COUNTRY_INFO!F11+COUNTRY_INFO!G11,0)","v":0},{"$f":"E11*2.8","v":0},null,0]
[{"$f":"IF(AND(INTRO!$E$37=\"Endémique\",INTRO!$E$39=\"Non endémique\"),IF(COUNTRY_INFO!A12=0,\" \",COUNTRY_INFO!A12),\" \")","v":" "},{"$f":"IF(AND(INTRO!$E$37=\"Endémique\",INTRO!$E$39=\"Non endémique\"),IF(COUNTRY_INFO!B12=0,\" \",COUNTRY_INFO!B12),\" \")","v":" "},{"$f":"IF(AND(INTRO!$E$37=\"Endémique\",INTRO!$E$39=\"Non endémique\"),IF(COUNTRY_INFO!C12=0,\" \",COUNTRY_INFO!C12),\" \")","v":" "},{"$f":"IF(COUNTRY_INFO!Z12<>\"\",COUNTRY_INFO!V12,0)","v":0},{"$f":"IF(AND(COUNTRY_INFO!Z12<>\"\",COUNTRY_INFO!$H12=1),COUNTRY_INFO!F12+COUNTRY_INFO!G12,0)","v":0},0,null,0]
[{"$f":"IF(AND(INTRO!$E$37=\"Endémique\",INTRO!$E$39=\"Non endémique\"),IF(COUNTRY_INFO!A13=0,\" \",COUNTRY_INFO!A13),\" \")","v":" "},{"$f":"IF(AND(INTRO!$E$37=\"Endémique\",INTRO!$E$39=\"Non endémique\"),IF(COUNTRY_INFO!B13=0,\" \",COUNTRY_INFO!B13),\" \")","v":" "},{"$f":"IF(AND(INTRO!$E$37=\"Endémique\",INTRO!$E$39=\"Non endémique\"),IF(COUNTRY_INFO!C13=0,\" \",COUNTRY_INFO!C13),\" \")","v":" "},{"$f":"IF(COUNTRY_INFO!Z13<>\"\",COUNTRY_INFO!V13,0)","v":0},{"$f":"IF(AND(COUNTRY_INFO!Z13<>\"\",COUNTRY_INFO!$H13=1),COUNTRY_INFO!F13+COUNTRY_INFO!G13,0)","v":0},0,null,0]
[{"$f":"IF(AND(INTRO!$E$37=\"Endémique\",INTRO!$E$39=\"Non endémique\"),IF(COUNTRY_INFO!A14=0,\" \",COUNTRY_INFO!A14),\" \")","v":" "},{"$f":"IF(AND(INTRO!$E$37=\"Endémique\",INTRO!$E$39=\"Non endémique\"),IF(COUNTRY_INFO!B14=0,\" \",COUNTRY_INFO!B14),\" \")","v":" "},{"$f":"IF(AND(INTRO!$E$37=\"Endémique\",INTRO!$E$39=\"Non endémique\"),IF(COUNTRY_INFO!C14=0,\" \",COUNTRY_INFO!C14),\" \")","v":" "},{"$f":"IF(COUNTRY_INFO!Z14<>\"\",COUNTRY_INFO!V14,0)","v":0},{"$f":"IF(AND(COUNTRY_INFO!Z14<>\"\",COUNTRY_INFO!$H14=1),COUNTRY_INFO!F14+COUNTRY_INFO!G14,0)","v":0},0,null,0]
[{"$f":"IF(AND(INTRO!$E$37=\"Endémique\",INTRO!$E$39=\"Non endémique\"),IF(COUNTRY_INFO!A15=0,\" \",COUNTRY_INFO!A15),\" \")","v":" "},{"$f":"IF(AND(INTRO!$E$37=\"Endémique\",INTRO!$E$39=\"Non endémique\"),IF(COUNTRY_INFO!B15=0,\" \",COUNTRY_INFO!B15),\" \")","v":" "},{"$f":"IF(AND(INTRO!$E$37=\"Endémique\",INTRO!$E$39=\"Non endémique\"),IF(COUNTRY_INFO!C15=0,\" \",COUNTRY_INFO!C15),\" \")","v":" "},{"$f":"IF(COUNTRY_INFO!Z15<>\"\",COUNTRY_INFO!V15,0)","v":0},{"$f":"IF(AND(COUNTRY_INFO!Z15<>\"\",COUNTRY_INFO!$H15=1),COUNTRY_INFO!F15+COUNTRY_INFO!G15,0)","v":0},0,null,0]
[{"$f":"IF(AND(INTRO!$E$37=\"Endémique\",INTRO!$E$39=\"Non endémique\"),IF(COUNTRY_INFO!A16=0,\" \",COUNTRY_INFO!A16),\" \")","v":" "},{"$f":"IF(AND(INTRO!$E$37=\"Endémique\",INTRO!$E$39=\"Non endémique\"),IF(COUNTRY_INFO!B16=0,\" \",COUNTRY_INFO!B16),\" \")","v":" "},{"$f":"IF(AND(INTRO!$E$37=\"Endémique\",INTRO!$E$39=\"Non endémique\"),IF(COUNTRY_INFO!C16=0,\" \",COUNTRY_INFO!C16),\" \")","v":" "},{"$f":"IF(COUNTRY_INFO!Z16<>\"\",COUNTRY_INFO!V16,0)","v":0},{"$f":"IF(AND(COUNTRY_INFO!Z16<>\"\",COUNTRY_INFO!$H16=1),COUNTRY_INFO!F16+COUNTRY_INFO!G16,0)","v":0},0,null,0]
[{"$f":"IF(AND(INTRO!$E$37=\"Endémique\",INTRO!$E$39=\"Non endémique\"),IF(COUNTRY_INFO!A17=0,\" \",COUNTRY_INFO!A17),\" \")","v":" "},{"$f":"IF(AND(INTRO!$E$37=\"Endémique\",INTRO!$E$39=\"Non endémique\"),IF(COUNTRY_INFO!B17=0,\" \",COUNTRY_INFO!B17),\" \")","v":" "},{"$f":"IF(AND(INTRO!$E$37=\"Endémique\",INTRO!$E$39=\"Non endémique\"),IF(COUNTRY_INFO!C17=0,\" \",COUNTRY_INFO!C17),\" \")","v":" "},{"$f":"IF(COUNTRY_INFO!Z17<>\"\",COUNTRY_INFO!V17,0)","v":0},{"$f":"IF(AND(COUNTRY_INFO!Z17<>\"\",COUNTRY_INFO!$H17=1),COUNTRY_INFO!F17+COUNTRY_INFO!G17,0)","v":0},0,null,0]
[{"$f":"IF(AND(INTRO!$E$37=\"Endémique\",INTRO!$E$39=\"Non endémique\"),IF(COUNTRY_INFO!A18=0,\" \",COUNTRY_INFO!A18),\" \")","v":" "},{"$f":"IF(AND(INTRO!$E$37=\"Endémique\",INTRO!$E$39=\"Non endémique\"),IF(COUNTRY_INFO!B18=0,\" \",COUNTRY_INFO!B18),\" \")","v":" "},{"$f":"IF(AND(INTRO!$E$37=\"Endémique\",INTRO!$E$39=\"Non endémique\"),IF(COUNTRY_INFO!C18=0,\" \",COUNTRY_INFO!C18),\" \")","v":" "},{"$f":"IF(COUNTRY_INFO!Z18<>\"\",COUNTRY_INFO!V18,0)","v":0},{"$f":"IF(AND(COUNTRY_INFO!Z18<>\"\",COUNTRY_INFO!$H18=1),COUNTRY_INFO!F18+COUNTRY_INFO!G18,0)","v":0},0,null,0]
[{"$f":"IF(AND(INTRO!$E$37=\"Endémique\",INTRO!$E$39=\"Non endémique\"),IF(COUNTRY_INFO!A19=0,\" \",COUNTRY_INFO!A19),\" \")","v":" "},{"$f":"IF(AND(INTRO!$E$37=\"Endémique\",INTRO!$E$39=\"Non endémique\"),IF(COUNTRY_INFO!B19=0,\" \",COUNTRY_INFO!B19),\" \")","v":" "},{"$f":"IF(AND(INTRO!$E$37=\"Endémique\",INTRO!$E$39=\"Non endémique\"),IF(COUNTRY_INFO!C19=0,\" \",COUNTRY_INFO!C19),\" \")","v":" "},{"$f":"IF(COUNTRY_INFO!Z19<>\"\",COUNTRY_INFO!V19,0)","v":0},{"$f":"IF(AND(COUNTRY_INFO!Z19<>\"\",COUNTRY_INFO!$H19=1),COUNTRY_INFO!F19+COUNTRY_INFO!G19,0)","v":0},0,null,0]
[{"$f":"IF(AND(INTRO!$E$37=\"Endémique\",INTRO!$E$39=\"Non endémique\"),IF(COUNTRY_INFO!A20=0,\" \",COUNTRY_INFO!A20),\" \")","v":" "},{"$f":"IF(AND(INTRO!$E$37=\"Endémique\",INTRO!$E$39=\"Non endémique\"),IF(COUNTRY_INFO!B20=0,\" \",COUNTRY_INFO!B20),\" \")","v":" "},{"$f":"IF(AND(INTRO!$E$37=\"Endémique\",INTRO!$E$39=\"Non endémique\"),IF(COUNTRY_INFO!C20=0,\" \",COUNTRY_INFO!C20),\" \")","v":" "},{"$f":"IF(COUNTRY_INFO!Z20<>\"\",COUNTRY_INFO!V20,0)","v":0},{"$f":"IF(AND(COUNTRY_INFO!Z20<>\"\",COUNTRY_INFO!$H20=1),COUNTRY_INFO!F20+COUNTRY_INFO!G20,0)","v":0},0,null,0]
[{"$f":"IF(AND(INTRO!$E$37=\"Endémique\",INTRO!$E$39=\"Non endémique\"),IF(COUNTRY_INFO!A21=0,\" \",COUNTRY_INFO!A21),\" \")","v":" "},{"$f":"IF(AND(INTRO!$E$37=\"Endémique\",INTRO!$E$39=\"Non endémique\"),IF(COUNTRY_INFO!B21=0,\" \",COUNTRY_INFO!B21),\" \")","v":" "},{"$f":"IF(AND(INTRO!$E$37=\"Endémique\",INTRO!$E$39=\"Non endémique\"),IF(COUNTRY_INFO!C21=0,\" \",COUNTRY_INFO!C21),\" \")","v":" "},{"$f":"IF(COUNTRY_INFO!Z21<>\"\",COUNTRY_INFO!V21,0)","v":0},{"$f":"IF(AND(COUNTRY_INFO!Z21<>\"\",COUNTRY_INFO!$H21=1),COUNTRY_INFO!F21+COUNTRY_INFO!G21,0)","v":0},0,null,0]
[{"$f":"IF(AND(INTRO!$E$37=\"Endémique\",INTRO!$E$39=\"Non endémique\"),IF(COUNTRY_INFO!A22=0,\" \",COUNTRY_INFO!A22),\" \")","v":" "},{"$f":"IF(AND(INTRO!$E$37=\"Endémique\",INTRO!$E$39=\"Non endémique\"),IF(COUNTRY_INFO!B22=0,\" \",COUNTRY_INFO!B22),\" \")","v":" "},{"$f":"IF(AND(INTRO!$E$37=\"Endémique\",INTRO!$E$39=\"Non endémique\"),IF(COUNTRY_INFO!C22=0,\" \",COUNTRY_INFO!C22),\" \")","v":" "},{"$f":"IF(COUNTRY_INFO!Z22<>\"\",COUNTRY_INFO!V22,0)","v":0},{"$f":"IF(AND(COUNTRY_INFO!Z22<>\"\",COUNTRY_INFO!$H22=1),COUNTRY_INFO!F22+COUNTRY_INFO!G22,0)","v":0},0,null,0]
[{"$f":"IF(AND(INTRO!$E$37=\"Endémique\",INTRO!$E$39=\"Non endémique\"),IF(COUNTRY_INFO!A23=0,\" \",COUNTRY_INFO!A23),\" \")","v":" "},{"$f":"IF(AND(INTRO!$E$37=\"Endémique\",INTRO!$E$39=\"Non endémique\"),IF(COUNTRY_INFO!B23=0,\" \",COUNTRY_INFO!B23),\" \")","v":" "},{"$f":"IF(AND(INTRO!$E$37=\"Endémique\",INTRO!$E$39=\"Non endémique\"),IF(COUNTRY_INFO!C23=0,\" \",COUNTRY_INFO!C23),\" \")","v":" "},{"$f":"IF(COUNTRY_INFO!Z23<>\"\",COUNTRY_INFO!V23,0)","v":0},{"$f":"IF(AND(COUNTRY_INFO!Z23<>\"\",COUNTRY_INFO!$H23=1),COUNTRY_INFO!F23+COUNTRY_INFO!G23,0)","v":0},0,null,0]
[{"$f":"IF(AND(INTRO!$E$37=\"Endémique\",INTRO!$E$39=\"Non endémique\"),IF(COUNTRY_INFO!A24=0,\" \",COUNTRY_INFO!A24),\" \")","v":" "},{"$f":"IF(AND(INTRO!$E$37=\"Endémique\",INTRO!$E$39=\"Non endémique\"),IF(COUNTRY_INFO!B24=0,\" \",COUNTRY_INFO!B24),\" \")","v":" "},{"$f":"IF(AND(INTRO!$E$37=\"Endémique\",INTRO!$E$39=\"Non endémique\"),IF(COUNTRY_INFO!C24=0,\" \",COUNTRY_INFO!C24),\" \")","v":" "},{"$f":"IF(COUNTRY_INFO!Z24<>\"\",COUNTRY_INFO!V24,0)","v":0},{"$f":"IF(AND(COUNTRY_INFO!Z24<>\"\",COUNTRY_INFO!$H24=1),COUNTRY_INFO!F24+COUNTRY_INFO!G24,0)","v":0},0,null,0]
[{"$f":"IF(AND(INTRO!$E$37=\"Endémique\",INTRO!$E$39=\"Non endémique\"),IF(COUNTRY_INFO!A25=0,\" \",COUNTRY_INFO!A25),\" \")","v":" "},{"$f":"IF(AND(INTRO!$E$37=\"Endémique\",INTRO!$E$39=\"Non endémique\"),IF(COUNTRY_INFO!B25=0,\" \",COUNTRY_INFO!B25),\" \")","v":" "},{"$f":"IF(AND(INTRO!$E$37=\"Endémique\",INTRO!$E$39=\"Non endémique\"),IF(COUNTRY_INFO!C25=0,\" \",COUNTRY_INFO!C25),\" \")","v":" "},{"$f":"IF(COUNTRY_INFO!Z25<>\"\",COUNTRY_INFO!V25,0)","v":0},{"$f":"IF(AND(COUNTRY_INFO!Z25<>\"\",COUNTRY_INFO!$H25=1),COUNTRY_INFO!F25+COUNTRY_INFO!G25,0)","v":0},0,null,0]
[{"$f":"IF(AND(INTRO!$E$37=\"Endémique\",INTRO!$E$39=\"Non endémique\"),IF(COUNTRY_INFO!A26=0,\" \",COUNTRY_INFO!A26),\" \")","v":" "},{"$f":"IF(AND(INTRO!$E$37=\"Endémique\",INTRO!$E$39=\"Non endémique\"),IF(COUNTRY_INFO!B26=0,\" \",COUNTRY_INFO!B26),\" \")","v":" "},{"$f":"IF(AND(INTRO!$E$37=\"Endémique\",INTRO!$E$39=\"Non endémique\"),IF(COUNTRY_INFO!C26=0,\" \",COUNTRY_INFO!C26),\" \")","v":" "},{"$f":"IF(COUNTRY_INFO!Z26<>\"\",COUNTRY_INFO!V26,0)","v":0},{"$f":"IF(AND(COUNTRY_INFO!Z26<>\"\",COUNTRY_INFO!$H26=1),COUNTRY_INFO!F26+COUNTRY_INFO!G26,0)","v":0},0,null,0]
[{"$f":"IF(AND(INTRO!$E$37=\"Endémique\",INTRO!$E$39=\"Non endémique\"),IF(COUNTRY_INFO!A27=0,\" \",COUNTRY_INFO!A27),\" \")","v":" "},{"$f":"IF(AND(INTRO!$E$37=\"Endémique\",INTRO!$E$39=\"Non endémique\"),IF(COUNTRY_INFO!B27=0,\" \",COUNTRY_INFO!B27),\" \")","v":" "},{"$f":"IF(AND(INTRO!$E$37=\"Endémique\",INTRO!$E$39=\"Non endémique\"),IF(COUNTRY_INFO!C27=0,\" \",COUNTRY_INFO!C27),\" \")","v":" "},{"$f":"IF(COUNTRY_INFO!Z27<>\"\",COUNTRY_INFO!V27,0)","v":0},{"$f":"IF(AND(COUNTRY_INFO!Z27<>\"\",COUNTRY_INFO!$H27=1),COUNTRY_INFO!F27+COUNTRY_INFO!G27,0)","v":0},0,null,0]
[{"$f":"IF(AND(INTRO!$E$37=\"Endémique\",INTRO!$E$39=\"Non endémique\"),IF(COUNTRY_INFO!A28=0,\" \",COUNTRY_INFO!A28),\" \")","v":" "},{"$f":"IF(AND(INTRO!$E$37=\"Endémique\",INTRO!$E$39=\"Non endémique\"),IF(COUNTRY_INFO!B28=0,\" \",COUNTRY_INFO!B28),\" \")","v":" "},{"$f":"IF(AND(INTRO!$E$37=\"Endémique\",INTRO!$E$39=\"Non endémique\"),IF(COUNTRY_INFO!C28=0,\" \",COUNTRY_INFO!C28),\" \")","v":" "},{"$f":"IF(COUNTRY_INFO!Z28<>\"\",COUNTRY_INFO!V28,0)","v":0},{"$f":"IF(AND(COUNTRY_INFO!Z28<>\"\",COUNTRY_INFO!$H28=1),COUNTRY_INFO!F28+COUNTRY_INFO!G28,0)","v":0},0,null,0]
[{"$f":"IF(AND(INTRO!$E$37=\"Endémique\",INTRO!$E$39=\"Non endémique\"),IF(COUNTRY_INFO!A29=0,\" \",COUNTRY_INFO!A29),\" \")","v":" "},{"$f":"IF(AND(INTRO!$E$37=\"Endémique\",INTRO!$E$39=\"Non endémique\"),IF(COUNTRY_INFO!B29=0,\" \",COUNTRY_INFO!B29),\" \")","v":" "},{"$f":"IF(AND(INTRO!$E$37=\"Endémique\",INTRO!$E$39=\"Non endémique\"),IF(COUNTRY_INFO!C29=0,\" \",COUNTRY_INFO!C29),\" \")","v":" "},{"$f":"IF(COUNTRY_INFO!Z29<>\"\",COUNTRY_INFO!V29,0)","v":0},{"$f":"IF(AND(COUNTRY_INFO!Z29<>\"\",COUNTRY_INFO!$H29=1),COUNTRY_INFO!F29+COUNTRY_INFO!G29,0)","v":0},0,null,0]
[{"$f":"IF(AND(INTRO!$E$37=\"Endémique\",INTRO!$E$39=\"Non endémique\"),IF(COUNTRY_INFO!A30=0,\" \",COUNTRY_INFO!A30),\" \")","v":" "},{"$f":"IF(AND(INTRO!$E$37=\"Endémique\",INTRO!$E$39=\"Non endémique\"),IF(COUNTRY_INFO!B30=0,\" \",COUNTRY_INFO!B30),\" \")","v":" "},{"$f":"IF(AND(INTRO!$E$37=\"Endémique\",INTRO!$E$39=\"Non endémique\"),IF(COUNTRY_INFO!C30=0,\" \",COUNTRY_INFO!C30),\" \")","v":" "},{"$f":"IF(COUNTRY_INFO!Z30<>\"\",COUNTRY_INFO!V30,0)","v":0},{"$f":"IF(AND(COUNTRY_INFO!Z30<>\"\",COUNTRY_INFO!$H30=1),COUNTRY_INFO!F30+COUNTRY_INFO!G30,0)","v":0},0,null,0]
[{"$f":"IF(AND(INTRO!$E$37=\"Endémique\",INTRO!$E$39=\"Non endémique\"),IF(COUNTRY_INFO!A31=0,\" \",COUNTRY_INFO!A31),\" \")","v":" "},{"$f":"IF(AND(INTRO!$E$37=\"Endémique\",INTRO!$E$39=\"Non endémique\"),IF(COUNTRY_INFO!B31=0,\" \",COUNTRY_INFO!B31),\" \")","v":" "},{"$f":"IF(AND(INTRO!$E$37=\"Endémique\",INTRO!$E$39=\"Non endémique\"),IF(COUNTRY_INFO!C31=0,\" \",COUNTRY_INFO!C31),\" \")","v":" "},{"$f":"IF(COUNTRY_INFO!Z31<>\"\",COUNTRY_INFO!V31,0)","v":0},{"$f":"IF(AND(COUNTRY_INFO!Z31<>\"\",COUNTRY_INFO!$H31=1),COUNTRY_INFO!F31+COUNTRY_INFO!G31,0)","v":0},0,null,0]
[{"$f":"IF(AND(INTRO!$E$37=\"Endémique\",INTRO!$E$39=\"Non endémique\"),IF(COUNTRY_INFO!A32=0,\" \",COUNTRY_INFO!A32),\" \")","v":" "},{"$f":"IF(AND(INTRO!$E$37=\"Endémique\",INTRO!$E$39=\"Non endémique\"),IF(COUNTRY_INFO!B32=0,\" \",COUNTRY_INFO!B32),\" \")","v":" "},{"$f":"IF(AND(INTRO!$E$37=\"Endémique\",INTRO!$E$39=\"Non endémique\"),IF(COUNTRY_INFO!C32=0,\" \",COUNTRY_INFO!C32),\" \")","v":" "},{"$f":"IF(COUNTRY_INFO!Z32<>\"\",COUNTRY_INFO!V32,0)","v":0},{"$f":"IF(AND(COUNTRY_INFO!Z32<>\"\",COUNTRY_INFO!$H32=1),COUNTRY_INFO!F32+COUNTRY_INFO!G32,0)","v":0},0,null,0]
[{"$f":"IF(AND(INTRO!$E$37=\"Endémique\",INTRO!$E$39=\"Non endémique\"),IF(COUNTRY_INFO!A33=0,\" \",COUNTRY_INFO!A33),\" \")","v":" "},{"$f":"IF(AND(INTRO!$E$37=\"Endémique\",INTRO!$E$39=\"Non endémique\"),IF(COUNTRY_INFO!B33=0,\" \",COUNTRY_INFO!B33),\" \")","v":" "},{"$f":"IF(AND(INTRO!$E$37=\"Endémique\",INTRO!$E$39=\"Non endémique\"),IF(COUNTRY_INFO!C33=0,\" \",COUNTRY_INFO!C33),\" \")","v":" "},{"$f":"IF(COUNTRY_INFO!Z33<>\"\",COUNTRY_INFO!V33,0)","v":0},{"$f":"IF(AND(COUNTRY_INFO!Z33<>\"\",COUNTRY_INFO!$H33=1),COUNTRY_INFO!F33+COUNTRY_INFO!G33,0)","v":0},0,null,0]
[{"$f":"IF(AND(INTRO!$E$37=\"Endémique\",INTRO!$E$39=\"Non endémique\"),IF(COUNTRY_INFO!A34=0,\" \",COUNTRY_INFO!A34),\" \")","v":" "},{"$f":"IF(AND(INTRO!$E$37=\"Endémique\",INTRO!$E$39=\"Non endémique\"),IF(COUNTRY_INFO!B34=0,\" \",COUNTRY_INFO!B34),\" \")","v":" "},{"$f":"IF(AND(INTRO!$E$37=\"Endémique\",INTRO!$E$39=\"Non endémique\"),IF(COUNTRY_INFO!C34=0,\" \",COUNTRY_INFO!C34),\" \")","v":" "},{"$f":"IF(COUNTRY_INFO!Z34<>\"\",COUNTRY_INFO!V34,0)","v":0},{"$f":"IF(AND(COUNTRY_INFO!Z34<>\"\",COUNTRY_INFO!$H34=1),COUNTRY_INFO!F34+COUNTRY_INFO!G34,0)","v":0},0,null,0]
[{"$f":"IF(AND(INTRO!$E$37=\"Endémique\",INTRO!$E$39=\"Non endémique\"),IF(COUNTRY_INFO!A35=0,\" \",COUNTRY_INFO!A35),\" \")","v":" "},{"$f":"IF(AND(INTRO!$E$37=\"Endémique\",INTRO!$E$39=\"Non endémique\"),IF(COUNTRY_INFO!B35=0,\" \",COUNTRY_INFO!B35),\" \")","v":" "},{"$f":"IF(AND(INTRO!$E$37=\"Endémique\",INTRO!$E$39=\"Non endémique\"),IF(COUNTRY_INFO!C35=0,\" \",COUNTRY_INFO!C35),\" \")","v":" "},{"$f":"IF(COUNTRY_INFO!Z35<>\"\",COUNTRY_INFO!V35,0)","v":0},{"$f":"IF(AND(COUNTRY_INFO!Z35<>\"\",COUNTRY_INFO!$H35=1),COUNTRY_INFO!F35+COUNTRY_INFO!G35,0)","v":0},0,null,0]
[{"$f":"IF(AND(INTRO!$E$37=\"Endémique\",INTRO!$E$39=\"Non endémique\"),IF(COUNTRY_INFO!A36=0,\" \",COUNTRY_INFO!A36),\" \")","v":" "},{"$f":"IF(AND(INTRO!$E$37=\"Endémique\",INTRO!$E$39=\"Non endémique\"),IF(COUNTRY_INFO!B36=0,\" \",COUNTRY_INFO!B36),\" \")","v":" "},{"$f":"IF(AND(INTRO!$E$37=\"Endémique\",INTRO!$E$39=\"Non endémique\"),IF(COUNTRY_INFO!C36=0,\" \",COUNTRY_INFO!C36),\" \")","v":" "},{"$f":"IF(COUNTRY_INFO!Z36<>\"\",COUNTRY_INFO!V36,0)","v":0},{"$f":"IF(AND(COUNTRY_INFO!Z36<>\"\",COUNTRY_INFO!$H36=1),COUNTRY_INFO!F36+COUNTRY_INFO!G36,0)","v":0},0,null,0]
[{"$f":"IF(AND(INTRO!$E$37=\"Endémique\",INTRO!$E$39=\"Non endémique\"),IF(COUNTRY_INFO!A37=0,\" \",COUNTRY_INFO!A37),\" \")","v":" "},{"$f":"IF(AND(INTRO!$E$37=\"Endémique\",INTRO!$E$39=\"Non endémique\"),IF(COUNTRY_INFO!B37=0,\" \",COUNTRY_INFO!B37),\" \")","v":" "},{"$f":"IF(AND(INTRO!$E$37=\"Endémique\",INTRO!$E$39=\"Non endémique\"),IF(COUNTRY_INFO!C37=0,\" \",COUNTRY_INFO!C37),\" \")","v":" "},{"$f":"IF(COUNTRY_INFO!Z37<>\"\",COUNTRY_INFO!V37,0)","v":0},{"$f":"IF(AND(COUNTRY_INFO!Z37<>\"\",COUNTRY_INFO!$H37=1),COUNTRY_INFO!F37+COUNTRY_INFO!G37,0)","v":0},0,null,0]
[{"$f":"IF(AND(INTRO!$E$37=\"Endémique\",INTRO!$E$39=\"Non endémique\"),IF(COUNTRY_INFO!A38=0,\" \",COUNTRY_INFO!A38),\" \")","v":" "},{"$f":"IF(AND(INTRO!$E$37=\"Endémique\",INTRO!$E$39=\"Non endémique\"),IF(COUNTRY_INFO!B38=0,\" \",COUNTRY_INFO!B38),\" \")","v":" "},{"$f":"IF(AND(INTRO!$E$37=\"Endémique\",INTRO!$E$39=\"Non endémique\"),IF(COUNTRY_INFO!C38=0,\" \",COUNTRY_INFO!C38),\" \")","v":" "},{"$f":"IF(COUNTRY_INFO!Z38<>\"\",COUNTRY_INFO!V38,0)","v":0},{"$f":"IF(AND(COUNTRY_INFO!Z38<>\"\",COUNTRY_INFO!$H38=1),COUNTRY_INFO!F38+COUNTRY_INFO!G38,0)","v":0},0,null,0]
[{"$f":"IF(AND(INTRO!$E$37=\"Endémique\",INTRO!$E$39=\"Non endémique\"),IF(COUNTRY_INFO!A39=0,\" \",COUNTRY_INFO!A39),\" \")","v":" "},{"$f":"IF(AND(INTRO!$E$37=\"Endémique\",INTRO!$E$39=\"Non endémique\"),IF(COUNTRY_INFO!B39=0,\" \",COUNTRY_INFO!B39),\" \")","v":" "},{"$f":"IF(AND(INTRO!$E$37=\"Endémique\",INTRO!$E$39=\"Non endémique\"),IF(COUNTRY_INFO!C39=0,\" \",COUNTRY_INFO!C39),\" \")","v":" "},{"$f":"IF(COUNTRY_INFO!Z39<>\"\",COUNTRY_INFO!V39,0)","v":0},{"$f":"IF(AND(COUNTRY_INFO!Z39<>\"\",COUNTRY_INFO!$H39=1),COUNTRY_INFO!F39+COUNTRY_INFO!G39,0)","v":0},0,null,0]
[{"$f":"IF(AND(INTRO!$E$37=\"Endémique\",INTRO!$E$39=\"Non endémique\"),IF(COUNTRY_INFO!A40=0,\" \",COUNTRY_INFO!A40),\" \")","v":" "},{"$f":"IF(AND(INTRO!$E$37=\"Endémique\",INTRO!$E$39=\"Non endémique\"),IF(COUNTRY_INFO!B40=0,\" \",COUNTRY_INFO!B40),\" \")","v":" "},{"$f":"IF(AND(INTRO!$E$37=\"Endémique\",INTRO!$E$39=\"Non endémique\"),IF(COUNTRY_INFO!C40=0,\" \",COUNTRY_INFO!C40),\" \")","v":" "},{"$f":"IF(COUNTRY_INFO!Z40<>\"\",COUNTRY_INFO!V40,0)","v":0},{"$f":"IF(AND(COUNTRY_INFO!Z40<>\"\",COUNTRY_INFO!$H40=1),COUNTRY_INFO!F40+COUNTRY_INFO!G40,0)","v":0},0,null,0]
[{"$f":"IF(AND(INTRO!$E$37=\"Endémique\",INTRO!$E$39=\"Non endémique\"),IF(COUNTRY_INFO!A41=0,\" \",COUNTRY_INFO!A41),\" \")","v":" "},{"$f":"IF(AND(INTRO!$E$37=\"Endémique\",INTRO!$E$39=\"Non endémique\"),IF(COUNTRY_INFO!B41=0,\" \",COUNTRY_INFO!B41),\" \")","v":" "},{"$f":"IF(AND(INTRO!$E$37=\"Endémique\",INTRO!$E$39=\"Non endémique\"),IF(COUNTRY_INFO!C41=0,\" \",COUNTRY_INFO!C41),\" \")","v":" "},{"$f":"IF(COUNTRY_INFO!Z41<>\"\",COUNTRY_INFO!V41,0)","v":0},{"$f":"IF(AND(COUNTRY_INFO!Z41<>\"\",COUNTRY_INFO!$H41=1),COUNTRY_INFO!F41+COUNTRY_INFO!G41,0)","v":0},0,null,0]
[{"$f":"IF(AND(INTRO!$E$37=\"Endémique\",INTRO!$E$39=\"Non endémique\"),IF(COUNTRY_INFO!A42=0,\" \",COUNTRY_INFO!A42),\" \")","v":" "},{"$f":"IF(AND(INTRO!$E$37=\"Endémique\",INTRO!$E$39=\"Non endémique\"),IF(COUNTRY_INFO!B42=0,\" \",COUNTRY_INFO!B42),\" \")","v":" "},{"$f":"IF(AND(INTRO!$E$37=\"Endémique\",INTRO!$E$39=\"Non endémique\"),IF(COUNTRY_INFO!C42=0,\" \",COUNTRY_INFO!C42),\" \")","v":" "},{"$f":"IF(COUNTRY_INFO!Z42<>\"\",COUNTRY_INFO!V42,0)","v":0},{"$f":"IF(AND(COUNTRY_INFO!Z42<>\"\",COUNTRY_INFO!$H42=1),COUNTRY_INFO!F42+COUNTRY_INFO!G42,0)","v":0},0,null,0]
[{"$f":"IF(AND(INTRO!$E$37=\"Endémique\",INTRO!$E$39=\"Non endémique\"),IF(COUNTRY_INFO!A43=0,\" \",COUNTRY_INFO!A43),\" \")","v":" "},{"$f":"IF(AND(INTRO!$E$37=\"Endémique\",INTRO!$E$39=\"Non endémique\"),IF(COUNTRY_INFO!B43=0,\" \",COUNTRY_INFO!B43),\" \")","v":" "},{"$f":"IF(AND(INTRO!$E$37=\"Endémique\",INTRO!$E$39=\"Non endémique\"),IF(COUNTRY_INFO!C43=0,\" \",COUNTRY_INFO!C43),\" \")","v":" "},{"$f":"IF(COUNTRY_INFO!Z43<>\"\",COUNTRY_INFO!V43,0)","v":0},{"$f":"IF(AND(COUNTRY_INFO!Z43<>\"\",COUNTRY_INFO!$H43=1),COUNTRY_INFO!F43+COUNTRY_INFO!G43,0)","v":0},0,null,0]
[{"$f":"IF(AND(INTRO!$E$37=\"Endémique\",INTRO!$E$39=\"Non endémique\"),IF(COUNTRY_INFO!A44=0,\" \",COUNTRY_INFO!A44),\" \")","v":" "},{"$f":"IF(AND(INTRO!$E$37=\"Endémique\",INTRO!$E$39=\"Non endémique\"),IF(COUNTRY_INFO!B44=0,\" \",COUNTRY_INFO!B44),\" \")","v":" "},{"$f":"IF(AND(INTRO!$E$37=\"Endémique\",INTRO!$E$39=\"Non endémique\"),IF(COUNTRY_INFO!C44=0,\" \",COUNTRY_INFO!C44),\" \")","v":" "},{"$f":"IF(COUNTRY_INFO!Z44<>\"\",COUNTRY_INFO!V44,0)","v":0},{"$f":"IF(AND(COUNTRY_INFO!Z44<>\"\",COUNTRY_INFO!$H44=1),COUNTRY_INFO!F44+COUNTRY_INFO!G44,0)","v":0},0,null,0]
[{"$f":"IF(AND(INTRO!$E$37=\"Endémique\",INTRO!$E$39=\"Non endémique\"),IF(COUNTRY_INFO!A45=0,\" \",COUNTRY_INFO!A45),\" \")","v":" "},{"$f":"IF(AND(INTRO!$E$37=\"Endémique\",INTRO!$E$39=\"Non endémique\"),IF(COUNTRY_INFO!B45=0,\" \",COUNTRY_INFO!B45),\" \")","v":" "},{"$f":"IF(AND(INTRO!$E$37=\"Endémique\",INTRO!$E$39=\"Non endémique\"),IF(COUNTRY_INFO!C45=0,\" \",COUNTRY_INFO!C45),\" \")","v":" "},{"$f":"IF(COUNTRY_INFO!Z45<>\"\",COUNTRY_INFO!V45,0)","v":0},{"$f":"IF(AND(COUNTRY_INFO!Z45<>\"\",COUNTRY_INFO!$H45=1),COUNTRY_INFO!F45+COUNTRY_INFO!G45,0)","v":0},0,null,0]
[{"$f":"IF(AND(INTRO!$E$37=\"Endémique\",INTRO!$E$39=\"Non endémique\"),IF(COUNTRY_INFO!A46=0,\" \",COUNTRY_INFO!A46),\" \")","v":" "},{"$f":"IF(AND(INTRO!$E$37=\"Endémique\",INTRO!$E$39=\"Non endémique\"),IF(COUNTRY_INFO!B46=0,\" \",COUNTRY_INFO!B46),\" \")","v":" "},{"$f":"IF(AND(INTRO!$E$37=\"Endémique\",INTRO!$E$39=\"Non endémique\"),IF(COUNTRY_INFO!C46=0,\" \",COUNTRY_INFO!C46),\" \")","v":" "},{"$f":"IF(COUNTRY_INFO!Z46<>\"\",COUNTRY_INFO!V46,0)","v":0},{"$f":"IF(AND(COUNTRY_INFO!Z46<>\"\",COUNTRY_INFO!$H46=1),COUNTRY_INFO!F46+COUNTRY_INFO!G46,0)","v":0},0,null,0]
[{"$f":"IF(AND(INTRO!$E$37=\"Endémique\",INTRO!$E$39=\"Non endémique\"),IF(COUNTRY_INFO!A47=0,\" \",COUNTRY_INFO!A47),\" \")","v":" "},{"$f":"IF(AND(INTRO!$E$37=\"Endémique\",INTRO!$E$39=\"Non endémique\"),IF(COUNTRY_INFO!B47=0,\" \",COUNTRY_INFO!B47),\" \")","v":" "},{"$f":"IF(AND(INTRO!$E$37=\"Endémique\",INTRO!$E$39=\"Non endémique\"),IF(COUNTRY_INFO!C47=0,\" \",COUNTRY_INFO!C47),\" \")","v":" "},{"$f":"IF(COUNTRY_INFO!Z47<>\"\",COUNTRY_INFO!V47,0)","v":0},{"$f":"IF(AND(COUNTRY_INFO!Z47<>\"\",COUNTRY_INFO!$H47=1),COUNTRY_INFO!F47+COUNTRY_INFO!G47,0)","v":0},0,null,0]
[{"$f":"IF(AND(INTRO!$E$37=\"Endémique\",INTRO!$E$39=\"Non endémique\"),IF(COUNTRY_INFO!A48=0,\" \",COUNTRY_INFO!A48),\" \")","v":" "},{"$f":"IF(AND(INTRO!$E$37=\"Endémique\",INTRO!$E$39=\"Non endémique\"),IF(COUNTRY_INFO!B48=0,\" \",COUNTRY_INFO!B48),\" \")","v":" "},{"$f":"IF(AND(INTRO!$E$37=\"Endémique\",INTRO!$E$39=\"Non endémique\"),IF(COUNTRY_INFO!C48=0,\" \",COUNTRY_INFO!C48),\" \")","v":" "},{"$f":"IF(COUNTRY_INFO!Z48<>\"\",COUNTRY_INFO!V48,0)","v":0},{"$f":"IF(AND(COUNTRY_INFO!Z48<>\"\",COUNTRY_INFO!$H48=1),COUNTRY_INFO!F48+COUNTRY_INFO!G48,0)","v":0},0,null,0]

{"sheet":"SUMMARY","index":7,"n_rows":93,"n_cols":8,"rows_kept":93,"cut":false,"hidden":false,"merged":[[73,4,73,5],[60,4,60,6],[61,4,61,6],[62,4,62,6],[72,2,72,3],[72,4,72,5],[81,2,81,7],[83,3,83,7],[59,4,59,6],[50,1,50,7],[56,1,56,7],[51,1,51,7],[52,1,52,7],[80,1,80,7],[58,1,58,7],[78,1,78,7],[79,1,79,7],[66,1,66,7],[76,2,76,3],[74,2,74,3],[74,4,74,5],[73,2,73,3],[55,1,55,7],[9,1,10,1],[9,3,9,6],[9,2,10,2],[17,1,19,1],[21,1,23,1],[25,1,27,1],[9,7,10,7],[32,2,35,4],[84,3,84,7],[83,1,83,2],[0,1,0,7],[1,1,1,7],[2,1,2,5],[3,1,3,7],[4,1,4,7],[6,1,6,7],[5,2,5,5],[65,1,65,7],[54,1,54,7],[53,1,53,7],[36,1,36,7],[41,2,41,3],[41,4,41,5],[41,6,41,7],[57,1,57,7],[82,2,82,6],[63,4,63,6],[75,2,75,3],[97,1,97,7],[75,4,75,5],[70,4,70,5],[71,4,71,5],[70,2,70,3],[71,2,71,3],[92,1,92,7],[76,4,76,5],[87,1,87,7],[91,1,91,7],[86,1,86,7],[84,1,84,2]]}
[]
[null,"Formulaire de demande commune de médicaments pour CP v.4.1"]
[]
[null,"Ce formulaire constitue une demande officielle du Gouvernement à l'OMS pour l'approvisionnement des médicaments mentionnés ci-dessus. Pour garantir la livraison des médicaments à temps, la demande de médicaments CP doit être soumise au moins 9 mois avant la première date d'administration massive de médicaments prévue dans l'année civile de la demande."]
[]
[null,"Pays",{"$f":"IF(INTRO!$E$33<>0,INTRO!$E$33,\" \")","v":"TOGO"},null,null,null,"Année",{"$f":"IF(INTRO!$E$35<>0,INTRO!$E$35,\" \")","v":2024}]
[]
[null,"Information on PC medicines requested to WHO"]
[]
[null,"Le médicament","Groupe ciblé","Nombre de comprimés",null,null,null,"Préciser l’origine"]
[null,null,null,"Requis","En stock","En cours de demande","Demandés"]
[null,"Diethylcarbamazine","TOUTE",0,0,null,{"$f":"IF(D12>(E12+F12),D12-E12-F12, 0)","v":0}]
[null,null,null,null,null,null,0]
[null,"Ivermectine","TOUTE",14396734.799999999,0,null,14396734.799999999,"MDP"]
[]
[null,"Albendazole pour FL","TOUTE",0,0,null,0]
[null,null,null,null,null,null,0]
[null,"Albendazole pour STH","EAPréS",1568492,null,null,1568492,"OMS"]
[null,null,"EAS",2940924,null,null,2940924,"OMS"]
[null,null,"Adultes",623346,null,null,623346,"OMS"]
[]
[null,"Mebendazole","EAPréS",null,null,null,0]
[null,null,"EAS",null,null,null,0]
[null,null,"Adultes",null,null,null,0]
[]
[null,"Praziquantel","EAPréS",0,null,null,0]
[null,null,"EAS",3851872.3577904645,null,null,3851872.3577904645,"OMS"]
[null,null,"Adultes",2600097.6161186798,null,null,{"$f":"IF(D28>(E28+F28),D28-E28-F28, 0)","v":2600097.6161186798},"OMS"]
[]
[null,"Nombre de personnes devant être traitées avec le médicament donné"]
[]
[null,"La maladie",null,null,null,"1er tour","2ème tour","3ème tour"]
[null,"Filariose lymphatique","Ces chiffres sont estimés uniquement pour les goupes d'âge ciblés pour le traitement avec les médicaments donnés, dans les régions où le traitement de maladies spécifiques est requis",null,null,0]
[null,"Onchocercose",null,null,null,3441385,2054927]
[null,"Schistosomiase",null,null,null,2510220.3842681255,690984.56506060786]
[null,"Géohelminthiases",null,null,null,5318632,943258,0]
[]
[]
[]
[null,"Informations sur les interventions CP planifiées "]
[]
[null,"Le médicament","Veuillez sélectionner une date (mois et année) pour la 1ère tournée de CP",null,"Veuillez sélectionner une date (mois et année) pour la 2ème tournée de CP",null,"Date à laquelle les médicaments devraient atteindre l’entrepôt national"]
[null,"Diethylcarbamazine"]
[null,"Ivermectine","Mai",2024,"Novembre",2024,"Février",2024]
[null,"Albendazole pour FL"]
[null,"Albendazole pour STH","Mai",2024,"Novembre",2024,"Février",2024]
[null,"Mebendazole"]
[null,"Praziquantel","Mai",2024,"Novembre",2024,"Février",2024]
[]
[null,"Récapitulatif - Checklist"]
[null,"Submission"]
[null,"Que faut-il soumettre ?"]
[null,"L'approvisionnement des médicaments demandés doit être basé sur des données épidémiologiques à jour, des plans d'utilisation des médicaments spécifiques et sur la capacité de mise en oeuvre. La liste suivante permet d'assurer que tous les formulaires et toutes les informations sont fournis à l'OMS (en format électronique)."]
[null,"Formulaire de demande commune de médicaments pour chimioprévention"]
[null,"Formulaire de rapport commun"]
[null,"Déclaration des données épidémiologiques pour la CP"]
[]
[null,"Disponibilité de financement pour la mise en oeuvre de tournées pendant l’année pour laquelle les medicaments ont été demandés"]
[]
[null,"Maladies ciblées pour la mise en oeuvre","# de traitements ","Financement assuré pour","Origine",null,null,"Montant"]
[null,"Filariose lymphatique",{"$f":"SUM(F33:H33)","v":0}]
[null,"Onchocercose",{"$f":"SUM(F34:H34)","v":5496312},"Tous","USAID"]
[null,"Schistosomiase",{"$f":"SUM(F35:H35)","v":3201204.9493287336},"Tous","USAID"]
[null,"Géohelminthiases",{"$f":"SUM(F36:H36)","v":6261890},"Tous","USAID"]
[]
[null,"Qui doit remplir le formulaire ?"]
[null,"Le Coordonnateur national MTN doit compiler toutes les informations nécessaires pour compléter le formulaire de demande.  En l'absence d'un coordonnateur, les gestionnaires de programmes spécifiques devraient coordonner leurs sections respectives. Une fois finalisée, chaque demande individuelle doit être approuvée par le Ministère de la Santé."]
[]
[null,"Informations concernant la (les) personne(s) ayant rempli le formulaire"]
[]
[null,"Titre/fonction ","Nom",null,"Téléphone",null,"Email","Date"]
[null,"Coordonnateur MTN/CP","Dr Piham GNOSSIKE",null,"(+228)90698617",null,"jacquesgnoss@yahoo.fr","2023-04-23"]
[null,"Gestionnaire de programme SCH","M. IBARIN Morou",null,"(+228)90995654",null,"ibarinmorou@yahoo.fr","2023-04-23"]
[]
[]
[]
[]
[]
[null,"L’OMS recommende que tous les effets secondaires graves suspectés d’être associés à l’ingestion de médicaments de CP soient rapportés en suivant les lignes directrices nationales de pharmacovigilance.  En l’absence d’un système de pharmacovigilance national, contactez le département de Contrôle des Maladies Tropicales Négligées pour être conseillé."]
[null,"L’OMS s’est engagée à rendre possible la donation de médicaments en fournissant gratuitement: a) albendazole, mebendazole et praziquantel à l’entrepôt national du Ministère de la Santé et b) diethylcarbamazine au port d’entrée du pays receveur."]
[null,"L’institution soumettant la présente requête est responsable de: a) l’organisation du déchargement des médicaments du camion, du stockage dans l’entrepôt national et de l’expédition vers les centres où aura lieu la distribution finale; b) de l’enregistrement, si nécessaire, des médicaments donnés, auprès des autorités nationales en charge; et de c) de l’information de n’importe quels changements ayant trait à leurs campagnes de traitement (par exemple le report d’une date planifiée de distribution en masse de médicaments, le remplacement d’un coordonateur MTN, etc.)."]
[null,null,"J’ai pris connaissance et accepté la politique de la communication \nde données de l’OMS"]
[null,null,"Je confirme que toutes les informations fournies dans ce formulaire sont complètes et correctes"]
[null,"Nom et signature \ndu Coordonnateur MTN ou du \nReprésentant du Ministère de la Santé",null,"Dr Piham GNOSSIKE"]
[null,"Date",null,"2023-06-22"]
[]
[null,"Si vous avez plus d'un destinataire final pour les médicaments de chimioprévention demandés, veuillez compléter les informations de la rubrique \"Informations concernant l'envoi et le destinataire\" dans la feuille de travail SHIPMENT."]
[null,"Veuillez envoyer le rapport national (signé et sous format électronique) au représentant de I'OMS du pays en mettant en copie:"]
[null,"Siège de l'OMS ","PC_JointForms@who.int"]
[null,"Bureau régional de l'OMS","Conseiller régional MTN"]
[null,"Mectizan donation programme","Dr Yao Sodahlon, email: ysodahlon@taskforce.org"]
[]
[null,"Veuillez noter que votre demande sera examinée par un panel d'experts indépendants (Comité ad hoc d’évaluation conjointe). Les informations contenues dans ce formulaire, le rapport commun d'activités (ou rapport national d'activités) et le plan d'action annuel sont essentiels à l'OMS pour assurer un usage optimal des médicaments. Dans le cadre de ses activités courantes de suivi et d'évaluation, et afin d'honorer ses obligations contractuelles envers les bailleurs de fonds  et autres partenaires, l'OMS et ses agents affiliés se réservent le droit d'inspecter, périodiquement, les stocks de médicaments au niveau national. "]

{"sheet":"SHIPMENT","index":8,"n_rows":48,"n_cols":8,"rows_kept":48,"cut":false,"hidden":false,"merged":[[34,1,34,7],[36,1,36,7],[0,1,0,7],[1,1,1,7],[2,1,2,5],[17,5,17,7],[18,5,18,7],[19,2,19,4],[19,5,19,7],[21,2,21,4],[3,2,3,5],[4,1,4,7],[22,2,22,4],[22,5,22,7],[15,2,15,4],[20,5,20,7],[15,5,15,7],[20,2,20,4],[18,2,18,4],[16,2,16,4],[47,1,54,7],[45,1,45,7],[37,1,37,6],[38,1,38,5],[40,1,40,7],[41,1,41,6],[39,1,39,6],[42,1,42,6],[43,1,43,7],[25,2,25,4],[25,5,25,7],[24,1,24,7],[6,1,6,7],[7,2,7,4],[7,5,7,7],[8,2,8,4],[8,5,8,7],[9,2,9,4],[9,5,9,7],[10,2,10,4],[10,5,10,7],[11,2,11,4],[11,5,11,7],[12,2,12,4],[12,5,12,7],[13,2,13,4],[13,5,13,7],[14,2,14,4],[14,5,14,7],[23,2,23,4],[23,5,23,7],[21,5,21,7],[16,5,16,7],[17,2,17,4],[26,2,26,4],[26,5,26,7],[27,2,27,4],[27,5,27,7],[28,2,28,4],[28,5,28,7],[32,2,32,4],[32,5,32,7],[29,2,29,4],[29,5,29,7],[30,2,30,4],[30,5,30,7],[31,2,31,4],[31,5,31,7]]}
[]
[null,"Formulaire de demande commune de médicaments pour CP v.4.1"]
[]
[null,"Pays",{"$f":"IF(INTRO!$E$33<>0,INTRO!$E$33,\" \")","v":"TOGO"},null,null,null,"Année",{"$f":"IF(INTRO!$E$35<>0,INTRO!$E$35,\" \")","v":2024}]
[]
[null,"Information on shipment and consignee "]
[]
[null,null,"Destinataire",null,null,"Destinataire final\nsi différent du destinaire précédent"]
[null,"Nom","Dr Fatoumata Binta DIALLO",null,null,"Dr Piham GNOSSIKE"]
[null,"Département/Unité","Représentante OMS Togo",null,null,"Programme National  MTN (PNMTN)"]
[null,"Organisation","OMS TOGO",null,null,"MSHPAUS/TOGO"]
[null,"Téléphone","(+228) 22 21 33 60 ou (+228)22 22 42 92",null,null,"(+228) 90 69 86 17"]
[null,"Fax","00228 22 21 78 32 ",null,null,"-"]
[null,"E-mail","diallof@who.int",null,null,"jacquesgnoss@yahoo.fr"]
[null,"Adresse postale","53 QAD, rue ADAME",null,null,"S/C SG_MSHPAUS BP 336 Lomé /Togo"]
[]
[null,null,"Destinataire",null,null,"Destinataire final\nsi différent du destinaire précédent"]
[null,"Nom"]
[null,"Département/Unité"]
[null,"Organisation"]
[null,"Téléphone"]
[null,"Fax"]
[null,"E-mail"]
[null,"Adresse postale"]
[]
[null,null,"Destinataire",null,null,"Destinataire final\nsi différent du destinaire précédent"]
[null,"Nom"]
[null,"Département/Unité"]
[null,"Organisation"]
[null,"Téléphone"]
[null,"Fax"]
[null,"E-mail"]
[null,"Adresse postale"]
[]
[]
[null,"Information concernant les obligations légales d’importation"]
[]
[null,"Est le permis d'importation nécessaire?",null,null,null,null,null,"Oui"]
[null,"Combien de temps cela prend-il pour obtenir le permis d’importation?",null,null,null,null,"1 à 2","Semaines"]
[null,"Avez vous besoin que certains documents soient remis en même temps que la demande de permis d’importation?",null,null,null,null,null,"Oui"]
[null,"Documents nécessaires: Certificat d'analyse des lots de médicaments, Certificats de don, Lettre de transport (LTA/LTM), Packing list, Commercial Invoice"]
[null,"Est-ce que le destinataire doit procéder au dédouanement avant que l’expédition puisse avoir lieu?",null,null,null,null,null,"Oui"]
[null,"Y a-t-il des informations supplémentaires qui pourraient être utiles afin d’assurer un dédouanement et une livraison rapide des médicaments dans votre pays?",null,null,null,null,null,"Oui"]
[null,"Attestation d'assurance, Document de Connaissement et le Bordéreau de suivi électronique de cargaison"]
[]
[null,"Remarques supplémentaires éventuelles liées à cette requête"]
[]
[null,"Le Guide de traitement SCH (endémicité des sous-districts) actualisé au niveau du pays (en pièce jointe, format Excel) a été utilisé pour déterminer les populations nécessitant le traitement SCH pour l'année 2024.  Cette mise à jour a vu le nombre de HOTSPOTS chuter de 74 avant 2022 à 49 en 2023 après les évaluations de 2021/2022. Le fichier d'analyse par SOUS-DISTRICT doit être mis à jour avec l'appui technique de l'OMS. En 2021/2022 135 sous-districts ont reçu une évaluation d'impact dans 13 districts. Les sous-districts restants dans ces 13 districts et ceux des 26 districts restants seront évalués en 2023 et 2024. Le pays a décidé d'appliquer les nouvelles directives de l'OMS aux Sous-districts nouvellement évalués et progressivement à chaque sous-district évalué jusqu'en 2024. En outre pour ce JRSM 2024, les données démographiques ont été actualisées en utilisant les nouvelles données du RGPH-5/2022 avec taux d'accroissement de 2,30%."]

{"sheet":"DATA_POLICY","index":9,"n_rows":39,"n_cols":8,"rows_kept":39,"cut":false,"hidden":true,"merged":[[55,1,55,2],[0,1,0,5],[1,1,1,7],[3,3,3,5],[6,1,6,7],[8,1,12,7],[13,1,16,7],[17,1,21,7],[22,1,25,7],[26,2,36,7],[38,1,45,7]]}
[]
[null,"Formulaire de demande commune de médicaments pour CP v.4.1"]
[]
[null,"Pays",null,{"$f":"IF(INTRO!$E$33<>0,INTRO!$E$33,\" \")","v":"TOGO"},null,null,"Année",{"$f":"IF(INTRO!$E$35<>0,INTRO!$E$35,\" \")","v":2024}]
[]
[]
[null,"Déclaration de principe sur la communication de données par l’OMS"]
[]
[null,"Les données sont le fondement de toutes les mesures rationnelles de santé publique et les avantages de la communication de données, y compris pour la science et la santé publique, sont largement reconnus. L’OMS souhaite promouvoir autant que possible la communication de données sanitaires, y compris, mais pas uniquement, de données épidémiologiques et de surveillance."]
[]
[]
[]
[]
[null,{"$f":"\"À cet égard, et sans préjudice des instruments juridiquement contraignants régissant la communication et la publication d’informations, le Ministère de la santé de \" & D4 & \", en fournissant des données à l’OMS :\"","v":"À cet égard, et sans préjudice des instruments juridiquement contraignants régissant la communication et la publication d’informations, le Ministère de la santé de TOGO, en fournissant des données à l’OMS :"}]
[]
[]
[]
[null,"confirme que toutes les données à fournir à l’OMS, ont été collectées conformément à la législation nationale applicable, y compris aux lois de protection des données visant à préserver l’anonymat des personnes identifiables ;"]
[]
[]
[]
[]
[null,{"$f":"\"convient que l’OMS aura le droit, toujours sous réserve des mesures visant à garantir l’utilisation éthique et sécurisée des données et toujours sous réserve d’une reconnaissance appropriée de la part de \"&D4&\":\"","v":"convient que l’OMS aura le droit, toujours sous réserve des mesures visant à garantir l’utilisation éthique et sécurisée des données et toujours sous réserve d’une reconnaissance appropriée de la part de TOGO:"}]
[]
[]
[]
[null,null,"de publier les données, dépourvues de tout élément d’identification personnelle (ci-après dénommées « les données ») et de les mettre à la disposition de toute partie intéressée, sur demande (dans la mesure où elles n’ont pas, ou pas encore, été publiées par l’OMS), selon des modalités autorisant leur utilisation non commerciale et sans but lucratif à des fins de santé publique (pour autant que l’OMS garde la maîtrise de la publication des données) ;\nd’utiliser, de compiler, d’agréger, d’évaluer et d’analyser les données et de publier et de diffuser les résultats obtenus grâce à ces données en rapport avec des travaux de l’OMS et conformément aux politiques et pratiques de l’Organisation."]
[]
[]
[]
[]
[]
[]
[]
[]
[]
[]
[]
[null,{"$f":"CONCATENATE(\"Sauf lorsque des instruments juridiquement contraignants (RSI, Règlement de Nomenclature de l’OMS, de 1967, etc.) disposent que les données doivent être communiquées et publiées, le Ministère de la santé de \", D4,\" peut, pour certaines données, décider de ne pas appliquer (tout ou partie des) (les) dispositions qui précèdent,\" & \" en informant l’OMS par écrit à l’adresse suivante, à condition que cette notification précise clairement les données, \" & \"dont il s’agit et indique clairement lesquelles des dispositions qui précèdent ne seront pas appliquées, et pour quels motifs.\")","v":"Sauf lorsque des instruments juridiquement contraignants (RSI, Règlement de Nomenclature de l’OMS, de 1967, etc.) disposent que les données doivent être communiquées et publiées, le Ministère de la santé de TOGO peut, pour certaines données, décider de ne pas appliquer (tout ou partie des) (les) dispositions qui précèdent, en informant l’OMS par écrit à l’adresse suivante, à condition que cette notification précise clairement les données, dont il s’agit et indique clairement lesquelles des dispositions qui précèdent ne seront pas appliquées, et pour quels motifs."}]