{"text_format":"1","workbook":"xlsx","n_sheets":13,"sheets":["INTRO","COUNTRY_INFO","MDA1","MDA2","MDA3","T1","T2","T3_R1","T3_R2","DISTRICT","SUMMARY","PROFILE","DATA_POLICY"],"not_rendered":{"charts":8,"images":3,"macros":1,"external_links":0,"defined_names":5,"comments":11,"pivot_tables":0},"unopened":[],"bounds":{"document_bytes":16777216,"sheet_cells":100000,"rows_first":2000,"rows_last":500,"rows_between":2000,"halvings":0,"cell_chars":16384,"cell_head_chars":4096},"cells_cut":0,"cells_raw":0,"read":"whole","date_system":"1900"}

{"sheet":"INTRO","index":0,"n_rows":50,"n_cols":5,"rows_kept":50,"cut":false,"hidden":false,"merged":[[45,1,45,2],[10,2,10,4],[41,1,41,2],[43,1,43,2],[46,1,46,4],[33,1,33,2],[35,1,35,2],[26,2,27,4],[37,1,37,2],[39,1,39,2],[28,1,28,4],[29,2,29,4],[30,1,30,4],[31,1,31,4],[20,1,20,4],[21,2,21,4],[22,1,22,4],[23,2,24,4],[25,1,25,4],[15,1,15,4],[16,1,16,4],[17,1,17,4],[18,1,18,4],[19,2,19,4],[9,2,9,4],[11,2,11,4],[12,1,12,4],[13,1,13,4],[14,1,14,4],[7,2,7,4],[8,2,8,4],[0,1,0,4],[1,1,1,4],[2,1,2,4],[3,1,3,4],[4,1,4,4],[5,1,5,4]]}
[]
[null,"Formulaire de Rapport Commun v.3.1"]
[]
[null,"Le but de ce formulaire de rapport commun - disponible sous forme de fichier Excel - est de mettre à disposition des autorités sanitaires nationales et des gestionnaires de données un outil standardisé qui réponde aux défis, facilite l'intégration et par conséquent contribue à améliorer la gestion de programme. Ce formulaire tend à standardiser le rapport de résultats des programmes nationaux, améliore la disponibilité et la coordination des données de chimioprévention à travers les Bureaux des Régions de l'Organisation mondiale de la Santé. \nLes autorités nationales sont priées de compléter ce formulaire et de le soumettre à l'Organisation mondiale de la Santé avant le 15 août de l'année en cours pour rapporter les données des activités de chimioprévention mises en oeuvre l'année précédente."]
[]
[null,"Structure de l'application (feuilles de travail) :"]
[]
[null,"INTRO","Cette feuille contient des instructions pour compléter le formulaire de rapport commun et des informations sur le statut de la chimioprévention pour les maladies d'endémie du pays. "]
[null,"COUNTRY_INFO","Cette feuille contient des informations sur la structure administrative du pays, la population par groupe d'âge, le statut d'endémicité pour chaque maladie, la population devant être traitée par chimioprévention, les interventions prévues et les interventions mises en oeuvre. "]
[null,"MDA1, MDA2, MDA3, T1, T2 et T3","Ces feuilles contiennent des informations sur l'endémicité des districts ciblés pour le traitement aux médicaments spécifiques pour la chimioprévention, les plans de traitement, et le nombre de personnes traitées par groupe d'âge. "]
[null,"DISTRICT","Cette feuille contient un résumé sur les personnes traitées, par maladie, au niveau de mise en oeuvre. Si les données par genre (sexe) sont disponibles, merci de les saisir.  "]
[null,"SUMMARY","Cette feuille contient un résumé sur les personnes traitées, par maladie et par type d'intervention de chimioprévention. Avant de générer le rapport (exécuter macro), veuillez sélectionner la maladie pour laquelle vous souhaitez un rapport. Veuillez suivre le même processus pour générer les divers rapports. \nCette feuille doit être imprimée et soumise comme formulaire de rapport commun (voir les instructions pour la soumission du formulaire sous la feuille SUMMARY). "]
[]
[null,"Instructions pour la saisie des données"]
[]
[null,"La plupart des cellules des feuilles de travail mentionnées ci-dessus contiennent des formules calculées automatiquement en fonction du protocole de traitement recommandé par l'OMS pour chaque maladie.\nVoir : http://www.who.int/neglected_diseases/preventive_chemotherapy/pct_manual/en/index.html"]
[]
[null,"Veuillez entrer vos données dans les cellules en fonction de leur code de couleur :"]
[]
[null,null,"Blanc - la cellule n'est pas protégée. Veuillez entrer la valeur de l'indicateur demandé."]
[]
[null,null,"Jaune - la cellule est protégée et inclut le nom de l'indicateur. Aucune entrée de données requise."]
[]
[null,null,"Orange - la cellule n'est pas protégée et contient un menu déroulant. Veuillez sélectionner la valeur dans le menu déroulant. "]
[]
[]
[null,null,"Vert - la cellule n'est pas protégée et contient des formules. Veuillez changer la valeur indiquée uniquement si vos données sont différentes de celles calculées automatiquement.  "]
[]
[]
[null,null,"Bleu - la cellule est protégée et contient des formules. Aucune entrée de données requise. "]
[]
[null,"Données pays"]
[]
[null,"PAYS",null,null,"Togo"]
[]
[null,"Année de rapport des données",null,null,2019]
[]
[null,"Le pays est-il endémique à la filariose lymphatique (FL) ?",null,null,"Endémique mais pas de CP"]
[]
[null,"Le pays est-il endémique à l'onchocercose (ONCHO) ? ",null,null,"Endémique"]
[]
[null,"Le pays est-il endémique aux géohelminthiases (STH) ?",null,null,"Endémique"]
[]
[null,"Le pays est-il endémique à la schistosomiase (SCH) ?",null,null,"Endémique"]
[]
[null,"Combien d'unités administratives compte le pays ?",null,null,41]
[null,"Si les données démographiques par groupe d'âge ne sont pas disponibles au second niveau administratif, veuillez entrer la proportion (%) de population, par groupe d'âge, du pays. Si les données sont disponibles, veuillez laisser les cellules vierges."]
[null,"1-4 ans","Enfants d'âge pré-scolaire (EAPréS)",null,0.16]
[null,"5-14 ans","Enfants d'âge scolaire (EAS)",null,0.3]
[null,"15 ans et plus","Adultes",null,0.5]

{"sheet":"COUNTRY_INFO","index":1,"n_rows":50,"n_cols":25,"rows_kept":50,"cut":false,"hidden":false,"merged":[[3,0,3,2],[3,7,3,10],[3,19,3,20],[5,0,5,2],[3,15,3,18],[5,15,5,18],[3,21,3,22],[5,21,5,22],[5,3,5,6],[5,7,5,10],[5,11,5,14],[5,19,5,20]]}
["INFORMATIONS PAYS"]
["Structure administrative, population par groupe d'âge, statut d'endémicité, interventions planifiées et interventions mises en oeuvre"]
[]
["TOTAL",null,null,{"$f":"SUM(D$9:D$1000)","v":7617283},{"$f":"SUM(E$9:E$1000)","v":1218767},{"$f":"SUM(F$9:F$1000)","v":2285184},{"$f":"SUM(G$9:G$1000)","v":3808651},null,null,null,null,{"$f":"SUM(L$9:L$1000)","v":0},{"$f":"SUM(M$9:M$1000)","v":3688250},{"$f":"SUM(N$9:N$1000)","v":2393570},{"$f":"SUM(O$9:O$1000)","v":2464416.6100000003}]
[]
["Structure administrative du pays",null,null,"Population",null,null,null,"Endémicité",null,null,null,"Population nécessitant la CP",null,null,null,"Nombre de tournées de traitement prévues pour l'année",null,null,null,"Mise en oeuvre de la chimioprévention",null,"Cliquer ci-dessous pour voir la stratégie recommandée"]
["Pays","Région/Département","District","Total","EAPréS","EAS","Adultes","FL","Oncho","STH","SCH","FL","Oncho","STH","SCH","FL","Oncho","STH","SCH","TOURNEE 1","TOURNEE 2",null,null,"IU_ID","IU_Name"]
[]
[{"$f":"IF(INTRO!$E$34<>0,INTRO!$E$34,\"\")","v":"Togo"},"CENTRALE","BLITTA",169020,{"$f":"IF(INTRO!$E$48=\"\",\"\",ROUND($D9*INTRO!$E$48,0))","v":27043},{"$f":"IF(INTRO!$E$49=\"\",\"\",ROUND($D9*INTRO!$E$49,0))","v":50706},{"$f":"IF(INTRO!$E$50=\"\",\"\",ROUND($D9*INTRO!$E$50,0))","v":84510},null,1,3,2,{"$f":"IF(INTRO!$E$38=\"Endémique\", IF($H9>0, IF($H9=4,\"Inconnu\", IF($H9=99,\"Interrompu\", $D9)), 0),\"Non requis\")","v":"Non requis"},107943,{"$f":"IF(INTRO!$E$42=\"Endémique\", IF(AND($J9>1,$J9<5), IF($J9=4, \"Inconnu\", E9+F9), 0),\"Non requis\")","v":77749},{"$f":"IF(INTRO!$E$44=\"Endémique\", IF(AND($K9>0,$K9<5), IF($K9=4,\"Inconnu\", IF($K9=1, $F9*0.33, IF($K9=2, $F9*0.5+$G9*0.2, SUM(F9:G9)))), 0),\"Non requis\")","v":42255},null,1,1,1,"MDA3 (IVM)","T1 (PZQ+ALB/MBD)","MDA 3","T2",48666,"BLITA"]
[{"$f":"IF(INTRO!$E$34<>0,INTRO!$E$34,\"\")","v":"Togo"},"CENTRALE","MÔ",45488,{"$f":"IF(INTRO!$E$48=\"\",\"\",ROUND($D10*INTRO!$E$48,0))","v":7278},{"$f":"IF(INTRO!$E$49=\"\",\"\",ROUND($D10*INTRO!$E$49,0))","v":13646},{"$f":"IF(INTRO!$E$50=\"\",\"\",ROUND($D10*INTRO!$E$50,0))","v":22744},null,1,2,1,{"$f":"IF(INTRO!$E$38=\"Endémique\", IF($H10>0, IF($H10=4,\"Inconnu\", IF($H10=99,\"Interrompu\", $D10)), 0),\"Non requis\")","v":"Non requis"},44934,{"$f":"IF(INTRO!$E$42=\"Endémique\", IF(AND($J10>1,$J10<5), IF($J10=4, \"Inconnu\", E10+F10), 0),\"Non requis\")","v":20924},{"$f":"IF(INTRO!$E$44=\"Endémique\", IF(AND($K10>0,$K10<5), IF($K10=4,\"Inconnu\", IF($K10=1, $F10*0.33, IF($K10=2, $F10*0.5+$G10*0.2, SUM(F10:G10)))), 0),\"Non requis\")","v":4503.18},null,2,1,1,"MDA3 (IVM)","T3 (ALB/MBD)","MDA 3","T2",48706,"MÔ"]
[{"$f":"IF(INTRO!$E$34<>0,INTRO!$E$34,\"\")","v":"Togo"},"CENTRALE","SOTOUBOUA",149829,{"$f":"IF(INTRO!$E$48=\"\",\"\",ROUND($D11*INTRO!$E$48,0))","v":23973},{"$f":"IF(INTRO!$E$49=\"\",\"\",ROUND($D11*INTRO!$E$49,0))","v":44949},{"$f":"IF(INTRO!$E$50=\"\",\"\",ROUND($D11*INTRO!$E$50,0))","v":74915},null,1,3,2,{"$f":"IF(INTRO!$E$38=\"Endémique\", IF($H11>0, IF($H11=4,\"Inconnu\", IF($H11=99,\"Interrompu\", $D11)), 0),\"Non requis\")","v":"Non requis"},66657,{"$f":"IF(INTRO!$E$42=\"Endémique\", IF(AND($J11>1,$J11<5), IF($J11=4, \"Inconnu\", E11+F11), 0),\"Non requis\")","v":68922},{"$f":"IF(INTRO!$E$44=\"Endémique\", IF(AND($K11>0,$K11<5), IF($K11=4,\"Inconnu\", IF($K11=1, $F11*0.33, IF($K11=2, $F11*0.5+$G11*0.2, SUM(F11:G11)))), 0),\"Non requis\")","v":37457.5},null,1,1,1,"MDA3 (IVM)","T3 (ALB/MBD)","MDA 3","T2",48707,"SOTOUBOUA"]
[{"$f":"IF(INTRO!$E$34<>0,INTRO!$E$34,\"\")","v":"Togo"},"CENTRALE","TCHAMBA",160724,{"$f":"IF(INTRO!$E$48=\"\",\"\",ROUND($D12*INTRO!$E$48,0))","v":25716},{"$f":"IF(INTRO!$E$49=\"\",\"\",ROUND($D12*INTRO!$E$49,0))","v":48217},{"$f":"IF(INTRO!$E$50=\"\",\"\",ROUND($D12*INTRO!$E$50,0))","v":80362},null,1,3,1,{"$f":"IF(INTRO!$E$38=\"Endémique\", IF($H12>0, IF($H12=4,\"Inconnu\", IF($H12=99,\"Interrompu\", $D12)), 0),\"Non requis\")","v":"Non requis"},113706,{"$f":"IF(INTRO!$E$42=\"Endémique\", IF(AND($J12>1,$J12<5), IF($J12=4, \"Inconnu\", E12+F12), 0),\"Non requis\")","v":73933},{"$f":"IF(INTRO!$E$44=\"Endémique\", IF(AND($K12>0,$K12<5), IF($K12=4,\"Inconnu\", IF($K12=1, $F12*0.33, IF($K12=2, $F12*0.5+$G12*0.2, SUM(F12:G12)))), 0),\"Non requis\")","v":15911.61},null,1,1,1,"MDA3 (IVM)","T3 (ALB/MBD)","MDA 3","T2",48668,"TCHAMBA"]
[{"$f":"IF(INTRO!$E$34<>0,INTRO!$E$34,\"\")","v":"Togo"},"CENTRALE","TCHAOUDJO",234977,{"$f":"IF(INTRO!$E$48=\"\",\"\",ROUND($D13*INTRO!$E$48,0))","v":37596},{"$f":"IF(INTRO!$E$49=\"\",\"\",ROUND($D13*INTRO!$E$49,0))","v":70493},{"$f":"IF(INTRO!$E$50=\"\",\"\",ROUND($D13*INTRO!$E$50,0))","v":117489},null,1,3,2,{"$f":"IF(INTRO!$E$38=\"Endémique\", IF($H13>0, IF($H13=4,\"Inconnu\", IF($H13=99,\"Interrompu\", $D13)), 0),\"Non requis\")","v":"Non requis"},99760,{"$f":"IF(INTRO!$E$42=\"Endémique\", IF(AND($J13>1,$J13<5), IF($J13=4, \"Inconnu\", E13+F13), 0),\"Non requis\")","v":108089},{"$f":"IF(INTRO!$E$44=\"Endémique\", IF(AND($K13>0,$K13<5), IF($K13=4,\"Inconnu\", IF($K13=1, $F13*0.33, IF($K13=2, $F13*0.5+$G13*0.2, SUM(F13:G13)))), 0),\"Non requis\")","v":58744.3},null,2,1,1,"MDA3 (IVM)","T3 (ALB/MBD)","MDA 3","T2",48669,"TCHAOUDJO"]
[{"$f":"IF(INTRO!$E$34<>0,INTRO!$E$34,\"\")","v":"Togo"},"KARA","ASSOLI",63242,{"$f":"IF(INTRO!$E$48=\"\",\"\",ROUND($D14*INTRO!$E$48,0))","v":10119},{"$f":"IF(INTRO!$E$49=\"\",\"\",ROUND($D14*INTRO!$E$49,0))","v":18973},{"$f":"IF(INTRO!$E$50=\"\",\"\",ROUND($D14*INTRO!$E$50,0))","v":31621},null,1,2,2,{"$f":"IF(INTRO!$E$38=\"Endémique\", IF($H14>0, IF($H14=4,\"Inconnu\", IF($H14=99,\"Interrompu\", $D14)), 0),\"Non requis\")","v":"Non requis"},44126,{"$f":"IF(INTRO!$E$42=\"Endémique\", IF(AND($J14>1,$J14<5), IF($J14=4, \"Inconnu\", E14+F14), 0),\"Non requis\")","v":29092},{"$f":"IF(INTRO!$E$44=\"Endémique\", IF(AND($K14>0,$K14<5), IF($K14=4,\"Inconnu\", IF($K14=1, $F14*0.33, IF($K14=2, $F14*0.5+$G14*0.2, SUM(F14:G14)))), 0),\"Non requis\")","v":15810.7},null,2,1,1,"MDA3 (IVM)","T3 (ALB/MBD)","MDA 3","T2",48670,"ASSOLI"]
[{"$f":"IF(INTRO!$E$34<>0,INTRO!$E$34,\"\")","v":"Togo"},"KARA","BASSAR",146374,{"$f":"IF(INTRO!$E$48=\"\",\"\",ROUND($D15*INTRO!$E$48,0))","v":23420},{"$f":"IF(INTRO!$E$49=\"\",\"\",ROUND($D15*INTRO!$E$49,0))","v":43912},{"$f":"IF(INTRO!$E$50=\"\",\"\",ROUND($D15*INTRO!$E$50,0))","v":73187},null,1,2,3,{"$f":"IF(INTRO!$E$38=\"Endémique\", IF($H15>0, IF($H15=4,\"Inconnu\", IF($H15=99,\"Interrompu\", $D15)), 0),\"Non requis\")","v":"Non requis"},98761,{"$f":"IF(INTRO!$E$42=\"Endémique\", IF(AND($J15>1,$J15<5), IF($J15=4, \"Inconnu\", E15+F15), 0),\"Non requis\")","v":67332},{"$f":"IF(INTRO!$E$44=\"Endémique\", IF(AND($K15>0,$K15<5), IF($K15=4,\"Inconnu\", IF($K15=1, $F15*0.33, IF($K15=2, $F15*0.5+$G15*0.2, SUM(F15:G15)))), 0),\"Non requis\")","v":117099},null,2,1,1,"MDA3 (IVM)","T3 (ALB/MBD)","MDA 3","T2",48671,"BASSAR"]
[{"$f":"IF(INTRO!$E$34<>0,INTRO!$E$34,\"\")","v":"Togo"},"KARA","BINAH",86647,{"$f":"IF(INTRO!$E$48=\"\",\"\",ROUND($D16*INTRO!$E$48,0))","v":13864},{"$f":"IF(INTRO!$E$49=\"\",\"\",ROUND($D16*INTRO!$E$49,0))","v":25994},{"$f":"IF(INTRO!$E$50=\"\",\"\",ROUND($D16*INTRO!$E$50,0))","v":43324},null,1,3,2,{"$f":"IF(INTRO!$E$38=\"Endémique\", IF($H16>0, IF($H16=4,\"Inconnu\", IF($H16=99,\"Interrompu\", $D16)), 0),\"Non requis\")","v":"Non requis"},50271,{"$f":"IF(INTRO!$E$42=\"Endémique\", IF(AND($J16>1,$J16<5), IF($J16=4, \"Inconnu\", E16+F16), 0),\"Non requis\")","v":39858},{"$f":"IF(INTRO!$E$44=\"Endémique\", IF(AND($K16>0,$K16<5), IF($K16=4,\"Inconnu\", IF($K16=1, $F16*0.33, IF($K16=2, $F16*0.5+$G16*0.2, SUM(F16:G16)))), 0),\"Non requis\")","v":21661.800000000003},null,2,1,1,"MDA3 (IVM)","T3 (ALB/MBD)","MDA 3","T2",48672,"BINAH"]
[{"$f":"IF(INTRO!$E$34<>0,INTRO!$E$34,\"\")","v":"Togo"},"KARA","DANKPEN",158383,{"$f":"IF(INTRO!$E$48=\"\",\"\",ROUND($D17*INTRO!$E$48,0))","v":25341},{"$f":"IF(INTRO!$E$49=\"\",\"\",ROUND($D17*INTRO!$E$49,0))","v":47515},{"$f":"IF(INTRO!$E$50=\"\",\"\",ROUND($D17*INTRO!$E$50,0))","v":79192},null,1,2,1,{"$f":"IF(INTRO!$E$38=\"Endémique\", IF($H17>0, IF($H17=4,\"Inconnu\", IF($H17=99,\"Interrompu\", $D17)), 0),\"Non requis\")","v":"Non requis"},150654,{"$f":"IF(INTRO!$E$42=\"Endémique\", IF(AND($J17>1,$J17<5), IF($J17=4, \"Inconnu\", E17+F17), 0),\"Non requis\")","v":72856},{"$f":"IF(INTRO!$E$44=\"Endémique\", IF(AND($K17>0,$K17<5), IF($K17=4,\"Inconnu\", IF($K17=1, $F17*0.33, IF($K17=2, $F17*0.5+$G17*0.2, SUM(F17:G17)))), 0),\"Non requis\")","v":15679.95},null,2,1,1,"MDA3 (IVM)","T3 (ALB/MBD)","MDA 3","T2",48673,"DANKPEN"]
[{"$f":"IF(INTRO!$E$34<>0,INTRO!$E$34,\"\")","v":"Togo"},"KARA","DOULFELGOU",97065,{"$f":"IF(INTRO!$E$48=\"\",\"\",ROUND($D18*INTRO!$E$48,0))","v":15530},{"$f":"IF(INTRO!$E$49=\"\",\"\",ROUND($D18*INTRO!$E$49,0))","v":29120},{"$f":"IF(INTRO!$E$50=\"\",\"\",ROUND($D18*INTRO!$E$50,0))","v":48533},null,1,3,2,{"$f":"IF(INTRO!$E$38=\"Endémique\", IF($H18>0, IF($H18=4,\"Inconnu\", IF($H18=99,\"Interrompu\", $D18)), 0),\"Non requis\")","v":"Non requis"},74072,{"$f":"IF(INTRO!$E$42=\"Endémique\", IF(AND($J18>1,$J18<5), IF($J18=4, \"Inconnu\", E18+F18), 0),\"Non requis\")","v":44650},{"$f":"IF(INTRO!$E$44=\"Endémique\", IF(AND($K18>0,$K18<5), IF($K18=4,\"Inconnu\", IF($K18=1, $F18*0.33, IF($K18=2, $F18*0.5+$G18*0.2, SUM(F18:G18)))), 0),\"Non requis\")","v":24266.6},null,2,1,1,"MDA3 (IVM)","T3 (ALB/MBD)","MDA 3","T2",48674,"DOULFELGOU"]
[{"$f":"IF(INTRO!$E$34<>0,INTRO!$E$34,\"\")","v":"Togo"},"KARA","KERAN",114742,{"$f":"IF(INTRO!$E$48=\"\",\"\",ROUND($D19*INTRO!$E$48,0))","v":18359},{"$f":"IF(INTRO!$E$49=\"\",\"\",ROUND($D19*INTRO!$E$49,0))","v":34423},{"$f":"IF(INTRO!$E$50=\"\",\"\",ROUND($D19*INTRO!$E$50,0))","v":57371},null,1,2,2,{"$f":"IF(INTRO!$E$38=\"Endémique\", IF($H19>0, IF($H19=4,\"Inconnu\", IF($H19=99,\"Interrompu\", $D19)), 0),\"Non requis\")","v":"Non requis"},122658,{"$f":"IF(INTRO!$E$42=\"Endémique\", IF(AND($J19>1,$J19<5), IF($J19=4, \"Inconnu\", E19+F19), 0),\"Non requis\")","v":52782},{"$f":"IF(INTRO!$E$44=\"Endémique\", IF(AND($K19>0,$K19<5), IF($K19=4,\"Inconnu\", IF($K19=1, $F19*0.33, IF($K19=2, $F19*0.5+$G19*0.2, SUM(F19:G19)))), 0),\"Non requis\")","v":28685.7},null,2,1,1,"MDA3 (IVM)","T3 (ALB/MBD)","MDA 3","T2",48675,"KERAN"]
[{"$f":"IF(INTRO!$E$34<>0,INTRO!$E$34,\"\")","v":"Togo"},"KARA","KOZAH",280332,{"$f":"IF(INTRO!$E$48=\"\",\"\",ROUND($D20*INTRO!$E$48,0))","v":44853},{"$f":"IF(INTRO!$E$49=\"\",\"\",ROUND($D20*INTRO!$E$49,0))","v":84100},{"$f":"IF(INTRO!$E$50=\"\",\"\",ROUND($D20*INTRO!$E$50,0))","v":140166},null,1,2,2,{"$f":"IF(INTRO!$E$38=\"Endémique\", IF($H20>0, IF($H20=4,\"Inconnu\", IF($H20=99,\"Interrompu\", $D20)), 0),\"Non requis\")","v":"Non requis"},158935,{"$f":"IF(INTRO!$E$42=\"Endémique\", IF(AND($J20>1,$J20<5), IF($J20=4, \"Inconnu\", E20+F20), 0),\"Non requis\")","v":128953},{"$f":"IF(INTRO!$E$44=\"Endémique\", IF(AND($K20>0,$K20<5), IF($K20=4,\"Inconnu\", IF($K20=1, $F20*0.33, IF($K20=2, $F20*0.5+$G20*0.2, SUM(F20:G20)))), 0),\"Non requis\")","v":70083.199999999997},null,2,1,1,"MDA3 (IVM)","T3 (ALB/MBD)","MDA 3","T2",48676,"KOZAH"]
[{"$f":"IF(INTRO!$E$34<>0,INTRO!$E$34,\"\")","v":"Togo"},"LOME-COMMUNE","DISTRICT N°1",32461,{"$f":"IF(INTRO!$E$48=\"\",\"\",ROUND($D21*INTRO!$E$48,0))","v":5194},{"$f":"IF(INTRO!$E$49=\"\",\"\",ROUND($D21*INTRO!$E$49,0))","v":9738},{"$f":"IF(INTRO!$E$50=\"\",\"\",ROUND($D21*INTRO!$E$50,0))","v":16231},null,0,0,0,{"$f":"IF(INTRO!$E$38=\"Endémique\", IF($H21>0, IF($H21=4,\"Inconnu\", IF($H21=99,\"Interrompu\", $D21)), 0),\"Non requis\")","v":"Non requis"},0,{"$f":"IF(INTRO!$E$42=\"Endémique\", IF(AND($J21>1,$J21<5), IF($J21=4, \"Inconnu\", E21+F21), 0),\"Non requis\")","v":0},{"$f":"IF(INTRO!$E$44=\"Endémique\", IF(AND($K21>0,$K21<5), IF($K21=4,\"Inconnu\", IF($K21=1, $F21*0.33, IF($K21=2, $F21*0.5+$G21*0.2, SUM(F21:G21)))), 0),\"Non requis\")","v":0},null,0,0,0,null,null," "," ",48684,"DISTRICT N°1"]
[{"$f":"IF(INTRO!$E$34<>0,INTRO!$E$34,\"\")","v":"Togo"},"LOME-COMMUNE","DISTRICT N°2",432840,{"$f":"IF(INTRO!$E$48=\"\",\"\",ROUND($D22*INTRO!$E$48,0))","v":69254},{"$f":"IF(INTRO!$E$49=\"\",\"\",ROUND($D22*INTRO!$E$49,0))","v":129852},{"$f":"IF(INTRO!$E$50=\"\",\"\",ROUND($D22*INTRO!$E$50,0))","v":216420},null,0,0,0,{"$f":"IF(INTRO!$E$38=\"Endémique\", IF($H22>0, IF($H22=4,\"Inconnu\", IF($H22=99,\"Interrompu\", $D22)), 0),\"Non requis\")","v":"Non requis"},0,{"$f":"IF(INTRO!$E$42=\"Endémique\", IF(AND($J22>1,$J22<5), IF($J22=4, \"Inconnu\", E22+F22), 0),\"Non requis\")","v":0},{"$f":"IF(INTRO!$E$44=\"Endémique\", IF(AND($K22>0,$K22<5), IF($K22=4,\"Inconnu\", IF($K22=1, $F22*0.33, IF($K22=2, $F22*0.5+$G22*0.2, SUM(F22:G22)))), 0),\"Non requis\")","v":0},null,0,0,0,null,null," "," ",48685,"DISTRICT N°2"]
[{"$f":"IF(INTRO!$E$34<>0,INTRO!$E$34,\"\")","v":"Togo"},"LOME-COMMUNE","DISTRICT N°3",233454,{"$f":"IF(INTRO!$E$48=\"\",\"\",ROUND($D23*INTRO!$E$48,0))","v":37353},{"$f":"IF(INTRO!$E$49=\"\",\"\",ROUND($D23*INTRO!$E$49,0))","v":70036},{"$f":"IF(INTRO!$E$50=\"\",\"\",ROUND($D23*INTRO!$E$50,0))","v":116727},null,0,0,0,{"$f":"IF(INTRO!$E$38=\"Endémique\", IF($H23>0, IF($H23=4,\"Inconnu\", IF($H23=99,\"Interrompu\", $D23)), 0),\"Non requis\")","v":"Non requis"},0,{"$f":"IF(INTRO!$E$42=\"Endémique\", IF(AND($J23>1,$J23<5), IF($J23=4, \"Inconnu\", E23+F23), 0),\"Non requis\")","v":0},{"$f":"IF(INTRO!$E$44=\"Endémique\", IF(AND($K23>0,$K23<5), IF($K23=4,\"Inconnu\", IF($K23=1, $F23*0.33, IF($K23=2, $F23*0.5+$G23*0.2, SUM(F23:G23)))), 0),\"Non requis\")","v":0},null,0,0,0,null,null," "," ",48686,"DISTRICT N°3"]
[{"$f":"IF(INTRO!$E$34<>0,INTRO!$E$34,\"\")","v":"Togo"},"LOME-COMMUNE","DISTRICT N°4",75018,{"$f":"IF(INTRO!$E$48=\"\",\"\",ROUND($D24*INTRO!$E$48,0))","v":12003},{"$f":"IF(INTRO!$E$49=\"\",\"\",ROUND($D24*INTRO!$E$49,0))","v":22505},{"$f":"IF(INTRO!$E$50=\"\",\"\",ROUND($D24*INTRO!$E$50,0))","v":37509},null,0,0,0,{"$f":"IF(INTRO!$E$38=\"Endémique\", IF($H24>0, IF($H24=4,\"Inconnu\", IF($H24=99,\"Interrompu\", $D24)), 0),\"Non requis\")","v":"Non requis"},0,{"$f":"IF(INTRO!$E$42=\"Endémique\", IF(AND($J24>1,$J24<5), IF($J24=4, \"Inconnu\", E24+F24), 0),\"Non requis\")","v":0},{"$f":"IF(INTRO!$E$44=\"Endémique\", IF(AND($K24>0,$K24<5), IF($K24=4,\"Inconnu\", IF($K24=1, $F24*0.33, IF($K24=2, $F24*0.5+$G24*0.2, SUM(F24:G24)))), 0),\"Non requis\")","v":0},null,0,0,0,null,null," "," ",48687,"DISTRICT N°4"]
[{"$f":"IF(INTRO!$E$34<>0,INTRO!$E$34,\"\")","v":"Togo"},"LOME-COMMUNE","DISTRICT N°5",271345,{"$f":"IF(INTRO!$E$48=\"\",\"\",ROUND($D25*INTRO!$E$48,0))","v":43415},{"$f":"IF(INTRO!$E$49=\"\",\"\",ROUND($D25*INTRO!$E$49,0))","v":81404},{"$f":"IF(INTRO!$E$50=\"\",\"\",ROUND($D25*INTRO!$E$50,0))","v":135673},null,0,0,0,{"$f":"IF(INTRO!$E$38=\"Endémique\", IF($H25>0, IF($H25=4,\"Inconnu\", IF($H25=99,\"Interrompu\", $D25)), 0),\"Non requis\")","v":"Non requis"},0,{"$f":"IF(INTRO!$E$42=\"Endémique\", IF(AND($J25>1,$J25<5), IF($J25=4, \"Inconnu\", E25+F25), 0),\"Non requis\")","v":0},{"$f":"IF(INTRO!$E$44=\"Endémique\", IF(AND($K25>0,$K25<5), IF($K25=4,\"Inconnu\", IF($K25=1, $F25*0.33, IF($K25=2, $F25*0.5+$G25*0.2, SUM(F25:G25)))), 0),\"Non requis\")","v":0},null,0,0,0,null,null," "," ",48688,"DISTRICT N°5"]
[{"$f":"IF(INTRO!$E$34<>0,INTRO!$E$34,\"\")","v":"Togo"},"MARITIME","AVE",115667,{"$f":"IF(INTRO!$E$48=\"\",\"\",ROUND($D26*INTRO!$E$48,0))","v":18507},{"$f":"IF(INTRO!$E$49=\"\",\"\",ROUND($D26*INTRO!$E$49,0))","v":34700},{"$f":"IF(INTRO!$E$50=\"\",\"\",ROUND($D26*INTRO!$E$50,0))","v":57834},null,1,1,2,{"$f":"IF(INTRO!$E$38=\"Endémique\", IF($H26>0, IF($H26=4,\"Inconnu\", IF($H26=99,\"Interrompu\", $D26)), 0),\"Non requis\")","v":"Non requis"},97475,{"$f":"IF(INTRO!$E$42=\"Endémique\", IF(AND($J26>1,$J26<5), IF($J26=4, \"Inconnu\", E26+F26), 0),\"Non requis\")","v":0},{"$f":"IF(INTRO!$E$44=\"Endémique\", IF(AND($K26>0,$K26<5), IF($K26=4,\"Inconnu\", IF($K26=1, $F26*0.33, IF($K26=2, $F26*0.5+$G26*0.2, SUM(F26:G26)))), 0),\"Non requis\")","v":28916.800000000003},null,1,1,0,"MDA3 (IVM)","T3 (ALB/MBD)","MDA 3","T2",48677,"AVE"]
[{"$f":"IF(INTRO!$E$34<>0,INTRO!$E$34,\"\")","v":"Togo"},"MARITIME","BAS MONO",108573,{"$f":"IF(INTRO!$E$48=\"\",\"\",ROUND($D27*INTRO!$E$48,0))","v":17372},{"$f":"IF(INTRO!$E$49=\"\",\"\",ROUND($D27*INTRO!$E$49,0))","v":32572},{"$f":"IF(INTRO!$E$50=\"\",\"\",ROUND($D27*INTRO!$E$50,0))","v":54287},null,1,3,1,{"$f":"IF(INTRO!$E$38=\"Endémique\", IF($H27>0, IF($H27=4,\"Inconnu\", IF($H27=99,\"Interrompu\", $D27)), 0),\"Non requis\")","v":"Non requis"},19451,{"$f":"IF(INTRO!$E$42=\"Endémique\", IF(AND($J27>1,$J27<5), IF($J27=4, \"Inconnu\", E27+F27), 0),\"Non requis\")","v":49944},{"$f":"IF(INTRO!$E$44=\"Endémique\", IF(AND($K27>0,$K27<5), IF($K27=4,\"Inconnu\", IF($K27=1, $F27*0.33, IF($K27=2, $F27*0.5+$G27*0.2, SUM(F27:G27)))), 0),\"Non requis\")","v":10748.76},null,1,1,0,"MDA3 (IVM)","T1 (PZQ+ALB/MBD)","MDA 3","T2",48678,"BAS MONO"]
[{"$f":"IF(INTRO!$E$34<>0,INTRO!$E$34,\"\")","v":"Togo"},"MARITIME","GOLFE",908357,{"$f":"IF(INTRO!$E$48=\"\",\"\",ROUND($D28*INTRO!$E$48,0))","v":145337},{"$f":"IF(INTRO!$E$49=\"\",\"\",ROUND($D28*INTRO!$E$49,0))","v":272507},{"$f":"IF(INTRO!$E$50=\"\",\"\",ROUND($D28*INTRO!$E$50,0))","v":454179},null,0,1,2,{"$f":"IF(INTRO!$E$38=\"Endémique\", IF($H28>0, IF($H28=4,\"Inconnu\", IF($H28=99,\"Interrompu\", $D28)), 0),\"Non requis\")","v":"Non requis"},0,{"$f":"IF(INTRO!$E$42=\"Endémique\", IF(AND($J28>1,$J28<5), IF($J28=4, \"Inconnu\", E28+F28), 0),\"Non requis\")","v":0},{"$f":"IF(INTRO!$E$44=\"Endémique\", IF(AND($K28>0,$K28<5), IF($K28=4,\"Inconnu\", IF($K28=1, $F28*0.33, IF($K28=2, $F28*0.5+$G28*0.2, SUM(F28:G28)))), 0),\"Non requis\")","v":227089.3},null,0,1,0,null,"T3 (ALB/MBD)"," ","T2",48679,"GOLFE"]
[{"$f":"IF(INTRO!$E$34<>0,INTRO!$E$34,\"\")","v":"Togo"},"MARITIME","LACS",212647,{"$f":"IF(INTRO!$E$48=\"\",\"\",ROUND($D29*INTRO!$E$48,0))","v":34024},{"$f":"IF(INTRO!$E$49=\"\",\"\",ROUND($D29*INTRO!$E$49,0))","v":63794},{"$f":"IF(INTRO!$E$50=\"\",\"\",ROUND($D29*INTRO!$E$50,0))","v":106324},null,0,2,2,{"$f":"IF(INTRO!$E$38=\"Endémique\", IF($H29>0, IF($H29=4,\"Inconnu\", IF($H29=99,\"Interrompu\", $D29)), 0),\"Non requis\")","v":"Non requis"},0,{"$f":"IF(INTRO!$E$42=\"Endémique\", IF(AND($J29>1,$J29<5), IF($J29=4, \"Inconnu\", E29+F29), 0),\"Non requis\")","v":97818},{"$f":"IF(INTRO!$E$44=\"Endémique\", IF(AND($K29>0,$K29<5), IF($K29=4,\"Inconnu\", IF($K29=1, $F29*0.33, IF($K29=2, $F29*0.5+$G29*0.2, SUM(F29:G29)))), 0),\"Non requis\")","v":53161.8},null,0,1,0,null,"T3 (ALB/MBD)"," ","T2",48680,"LACS"]
[{"$f":"IF(INTRO!$E$34<>0,INTRO!$E$34,\"\")","v":"Togo"},"MARITIME","VO",257550,{"$f":"IF(INTRO!$E$48=\"\",\"\",ROUND($D30*INTRO!$E$48,0))","v":41208},{"$f":"IF(INTRO!$E$49=\"\",\"\",ROUND($D30*INTRO!$E$49,0))","v":77265},{"$f":"IF(INTRO!$E$50=\"\",\"\",ROUND($D30*INTRO!$E$50,0))","v":128775},null,0,3,2,{"$f":"IF(INTRO!$E$38=\"Endémique\", IF($H30>0, IF($H30=4,\"Inconnu\", IF($H30=99,\"Interrompu\", $D30)), 0),\"Non requis\")","v":"Non requis"},0,{"$f":"IF(INTRO!$E$42=\"Endémique\", IF(AND($J30>1,$J30<5), IF($J30=4, \"Inconnu\", E30+F30), 0),\"Non requis\")","v":118473},{"$f":"IF(INTRO!$E$44=\"Endémique\", IF(AND($K30>0,$K30<5), IF($K30=4,\"Inconnu\", IF($K30=1, $F30*0.33, IF($K30=2, $F30*0.5+$G30*0.2, SUM(F30:G30)))), 0),\"Non requis\")","v":64387.5},null,0,1,0,null,"T3 (ALB/MBD)"," ","T2",48681,"VO"]
[{"$f":"IF(INTRO!$E$34<>0,INTRO!$E$34,\"\")","v":"Togo"},"MARITIME","YOTO",202875,{"$f":"IF(INTRO!$E$48=\"\",\"\",ROUND($D31*INTRO!$E$48,0))","v":32460},{"$f":"IF(INTRO!$E$49=\"\",\"\",ROUND($D31*INTRO!$E$49,0))","v":60863},{"$f":"IF(INTRO!$E$50=\"\",\"\",ROUND($D31*INTRO!$E$50,0))","v":101438},null,1,2,2,{"$f":"IF(INTRO!$E$38=\"Endémique\", IF($H31>0, IF($H31=4,\"Inconnu\", IF($H31=99,\"Interrompu\", $D31)), 0),\"Non requis\")","v":"Non requis"},166459,{"$f":"IF(INTRO!$E$42=\"Endémique\", IF(AND($J31>1,$J31<5), IF($J31=4, \"Inconnu\", E31+F31), 0),\"Non requis\")","v":93323},{"$f":"IF(INTRO!$E$44=\"Endémique\", IF(AND($K31>0,$K31<5), IF($K31=4,\"Inconnu\", IF($K31=1, $F31*0.33, IF($K31=2, $F31*0.5+$G31*0.2, SUM(F31:G31)))), 0),\"Non requis\")","v":50719.100000000006},null,1,2,0,"MDA3 (IVM)","T3 (ALB/MBD)","MDA 1","T2",48682,"YOTO"]
[{"$f":"IF(INTRO!$E$34<>0,INTRO!$E$34,\"\")","v":"Togo"},"MARITIME","ZIO",366584,{"$f":"IF(INTRO!$E$48=\"\",\"\",ROUND($D32*INTRO!$E$48,0))","v":58653},{"$f":"IF(INTRO!$E$49=\"\",\"\",ROUND($D32*INTRO!$E$49,0))","v":109975},{"$f":"IF(INTRO!$E$50=\"\",\"\",ROUND($D32*INTRO!$E$50,0))","v":183292},null,1,3,2,{"$f":"IF(INTRO!$E$38=\"Endémique\", IF($H32>0, IF($H32=4,\"Inconnu\", IF($H32=99,\"Interrompu\", $D32)), 0),\"Non requis\")","v":"Non requis"},253117,{"$f":"IF(INTRO!$E$42=\"Endémique\", IF(AND($J32>1,$J32<5), IF($J32=4, \"Inconnu\", E32+F32), 0),\"Non requis\")","v":168628},{"$f":"IF(INTRO!$E$44=\"Endémique\", IF(AND($K32>0,$K32<5), IF($K32=4,\"Inconnu\", IF($K32=1, $F32*0.33, IF($K32=2, $F32*0.5+$G32*0.2, SUM(F32:G32)))), 0),\"Non requis\")","v":91645.9},null,1,1,0,"MDA3 (IVM)","T1 (PZQ+ALB/MBD)","MDA 3","T2",48683,"ZIO"]
[{"$f":"IF(INTRO!$E$34<>0,INTRO!$E$34,\"\")","v":"Togo"},"PLATEAUX","AGOU",104882,{"$f":"IF(INTRO!$E$48=\"\",\"\",ROUND($D33*INTRO!$E$48,0))","v":16781},{"$f":"IF(INTRO!$E$49=\"\",\"\",ROUND($D33*INTRO!$E$49,0))","v":31465},{"$f":"IF(INTRO!$E$50=\"\",\"\",ROUND($D33*INTRO!$E$50,0))","v":52441},null,1,2,3,{"$f":"IF(INTRO!$E$38=\"Endémique\", IF($H33>0, IF($H33=4,\"Inconnu\", IF($H33=99,\"Interrompu\", $D33)), 0),\"Non requis\")","v":"Non requis"},76657,{"$f":"IF(INTRO!$E$42=\"Endémique\", IF(AND($J33>1,$J33<5), IF($J33=4, \"Inconnu\", E33+F33), 0),\"Non requis\")","v":48246},{"$f":"IF(INTRO!$E$44=\"Endémique\", IF(AND($K33>0,$K33<5), IF($K33=4,\"Inconnu\", IF($K33=1, $F33*0.33, IF($K33=2, $F33*0.5+$G33*0.2, SUM(F33:G33)))), 0),\"Non requis\")","v":83906},null,1,1,0,"MDA3 (IVM)","T3 (ALB/MBD)","MDA 3","T2",48689,"AGOU"]
[{"$f":"IF(INTRO!$E$34<>0,INTRO!$E$34,\"\")","v":"Togo"},"PLATEAUX","AKEBOU",75738,{"$f":"IF(INTRO!$E$48=\"\",\"\",ROUND($D34*INTRO!$E$48,0))","v":12118},{"$f":"IF(INTRO!$E$49=\"\",\"\",ROUND($D34*INTRO!$E$49,0))","v":22721},{"$f":"IF(INTRO!$E$50=\"\",\"\",ROUND($D34*INTRO!$E$50,0))","v":37869},null,1,1,2,{"$f":"IF(INTRO!$E$38=\"Endémique\", IF($H34>0, IF($H34=4,\"Inconnu\", IF($H34=99,\"Interrompu\", $D34)), 0),\"Non requis\")","v":"Non requis"},67892,{"$f":"IF(INTRO!$E$42=\"Endémique\", IF(AND($J34>1,$J34<5), IF($J34=4, \"Inconnu\", E34+F34), 0),\"Non requis\")","v":0},{"$f":"IF(INTRO!$E$44=\"Endémique\", IF(AND($K34>0,$K34<5), IF($K34=4,\"Inconnu\", IF($K34=1, $F34*0.33, IF($K34=2, $F34*0.5+$G34*0.2, SUM(F34:G34)))), 0),\"Non requis\")","v":18934.3},null,1,1,0,"MDA3 (IVM)","T3 (ALB/MBD)","MDA 3","T2",48691,"AKEBOU"]
[{"$f":"IF(INTRO!$E$34<>0,INTRO!$E$34,\"\")","v":"Togo"},"PLATEAUX","AMOU",129407,{"$f":"IF(INTRO!$E$48=\"\",\"\",ROUND($D35*INTRO!$E$48,0))","v":20705},{"$f":"IF(INTRO!$E$49=\"\",\"\",ROUND($D35*INTRO!$E$49,0))","v":38822},{"$f":"IF(INTRO!$E$50=\"\",\"\",ROUND($D35*INTRO!$E$50,0))","v":64704},null,1,3,2,{"$f":"IF(INTRO!$E$38=\"Endémique\", IF($H35>0, IF($H35=4,\"Inconnu\", IF($H35=99,\"Interrompu\", $D35)), 0),\"Non requis\")","v":"Non requis"},110207,{"$f":"IF(INTRO!$E$42=\"Endémique\", IF(AND($J35>1,$J35<5), IF($J35=4, \"Inconnu\", E35+F35), 0),\"Non requis\")","v":59527},{"$f":"IF(INTRO!$E$44=\"Endémique\", IF(AND($K35>0,$K35<5), IF($K35=4,\"Inconnu\", IF($K35=1, $F35*0.33, IF($K35=2, $F35*0.5+$G35*0.2, SUM(F35:G35)))), 0),\"Non requis\")","v":32351.800000000003},null,2,1,0,"MDA3 (IVM)","T3 (ALB/MBD)","MDA 3","T2",48690,"AMOU"]
[{"$f":"IF(INTRO!$E$34<>0,INTRO!$E$34,\"\")","v":"Togo"},"PLATEAUX","ANIE",152468,{"$f":"IF(INTRO!$E$48=\"\",\"\",ROUND($D36*INTRO!$E$48,0))","v":24395},{"$f":"IF(INTRO!$E$49=\"\",\"\",ROUND($D36*INTRO!$E$49,0))","v":45740},{"$f":"IF(INTRO!$E$50=\"\",\"\",ROUND($D36*INTRO!$E$50,0))","v":76234},null,1,3,3,{"$f":"IF(INTRO!$E$38=\"Endémique\", IF($H36>0, IF($H36=4,\"Inconnu\", IF($H36=99,\"Interrompu\", $D36)), 0),\"Non requis\")","v":"Non requis"},113100,{"$f":"IF(INTRO!$E$42=\"Endémique\", IF(AND($J36>1,$J36<5), IF($J36=4, \"Inconnu\", E36+F36), 0),\"Non requis\")","v":70135},{"$f":"IF(INTRO!$E$44=\"Endémique\", IF(AND($K36>0,$K36<5), IF($K36=4,\"Inconnu\", IF($K36=1, $F36*0.33, IF($K36=2, $F36*0.5+$G36*0.2, SUM(F36:G36)))), 0),\"Non requis\")","v":121974},null,1,1,1,"MDA3 (IVM)","T3 (ALB/MBD)","MDA 3","T2",48692,"ANIE"]
[{"$f":"IF(INTRO!$E$34<>0,INTRO!$E$34,\"\")","v":"Togo"},"PLATEAUX","DANYI",47998,{"$f":"IF(INTRO!$E$48=\"\",\"\",ROUND($D37*INTRO!$E$48,0))","v":7680},{"$f":"IF(INTRO!$E$49=\"\",\"\",ROUND($D37*INTRO!$E$49,0))","v":14399},{"$f":"IF(INTRO!$E$50=\"\",\"\",ROUND($D37*INTRO!$E$50,0))","v":23999},null,1,2,1,{"$f":"IF(INTRO!$E$38=\"Endémique\", IF($H37>0, IF($H37=4,\"Inconnu\", IF($H37=99,\"Interrompu\", $D37)), 0),\"Non requis\")","v":"Non requis"},35696,{"$f":"IF(INTRO!$E$42=\"Endémique\", IF(AND($J37>1,$J37<5), IF($J37=4, \"Inconnu\", E37+F37), 0),\"Non requis\")","v":22079},{"$f":"IF(INTRO!$E$44=\"Endémique\", IF(AND($K37>0,$K37<5), IF($K37=4,\"Inconnu\", IF($K37=1, $F37*0.33, IF($K37=2, $F37*0.5+$G37*0.2, SUM(F37:G37)))), 0),\"Non requis\")","v":4751.67},null,2,1,0,"MDA3 (IVM)","T3 (ALB/MBD)","MDA 3"," ",48693,"DANYI"]
[{"$f":"IF(INTRO!$E$34<>0,INTRO!$E$34,\"\")","v":"Togo"},"PLATEAUX","EST MONO",148281,{"$f":"IF(INTRO!$E$48=\"\",\"\",ROUND($D38*INTRO!$E$48,0))","v":23725},{"$f":"IF(INTRO!$E$49=\"\",\"\",ROUND($D38*INTRO!$E$49,0))","v":44484},{"$f":"IF(INTRO!$E$50=\"\",\"\",ROUND($D38*INTRO!$E$50,0))","v":74141},null,1,3,3,{"$f":"IF(INTRO!$E$38=\"Endémique\", IF($H38>0, IF($H38=4,\"Inconnu\", IF($H38=99,\"Interrompu\", $D38)), 0),\"Non requis\")","v":"Non requis"},119061,{"$f":"IF(INTRO!$E$42=\"Endémique\", IF(AND($J38>1,$J38<5), IF($J38=4, \"Inconnu\", E38+F38), 0),\"Non requis\")","v":68209},{"$f":"IF(INTRO!$E$44=\"Endémique\", IF(AND($K38>0,$K38<5), IF($K38=4,\"Inconnu\", IF($K38=1, $F38*0.33, IF($K38=2, $F38*0.5+$G38*0.2, SUM(F38:G38)))), 0),\"Non requis\")","v":118625},null,1,2,1,"MDA3 (IVM)","T3 (ALB/MBD)","MDA 1","T2",48694,"EST MONO"]
[{"$f":"IF(INTRO!$E$34<>0,INTRO!$E$34,\"\")","v":"Togo"},"PLATEAUX","HAHO",301900,{"$f":"IF(INTRO!$E$48=\"\",\"\",ROUND($D39*INTRO!$E$48,0))","v":48304},{"$f":"IF(INTRO!$E$49=\"\",\"\",ROUND($D39*INTRO!$E$49,0))","v":90570},{"$f":"IF(INTRO!$E$50=\"\",\"\",ROUND($D39*INTRO!$E$50,0))","v":150950},null,1,3,3,{"$f":"IF(INTRO!$E$38=\"Endémique\", IF($H39>0, IF($H39=4,\"Inconnu\", IF($H39=99,\"Interrompu\", $D39)), 0),\"Non requis\")","v":"Non requis"},242970,{"$f":"IF(INTRO!$E$42=\"Endémique\", IF(AND($J39>1,$J39<5), IF($J39=4, \"Inconnu\", E39+F39), 0),\"Non requis\")","v":138874},{"$f":"IF(INTRO!$E$44=\"Endémique\", IF(AND($K39>0,$K39<5), IF($K39=4,\"Inconnu\", IF($K39=1, $F39*0.33, IF($K39=2, $F39*0.5+$G39*0.2, SUM(F39:G39)))), 0),\"Non requis\")","v":241520},null,2,2,1,"MDA3 (IVM)","T3 (ALB/MBD)","MDA 1","T2",48695,"HAHO"]
[{"$f":"IF(INTRO!$E$34<>0,INTRO!$E$34,\"\")","v":"Togo"},"PLATEAUX","KLOTO",173183,{"$f":"IF(INTRO!$E$48=\"\",\"\",ROUND($D40*INTRO!$E$48,0))","v":27709},{"$f":"IF(INTRO!$E$49=\"\",\"\",ROUND($D40*INTRO!$E$49,0))","v":51955},{"$f":"IF(INTRO!$E$50=\"\",\"\",ROUND($D40*INTRO!$E$50,0))","v":86592},null,1,1,3,{"$f":"IF(INTRO!$E$38=\"Endémique\", IF($H40>0, IF($H40=4,\"Inconnu\", IF($H40=99,\"Interrompu\", $D40)), 0),\"Non requis\")","v":"Non requis"},57159,{"$f":"IF(INTRO!$E$42=\"Endémique\", IF(AND($J40>1,$J40<5), IF($J40=4, \"Inconnu\", E40+F40), 0),\"Non requis\")","v":0},{"$f":"IF(INTRO!$E$44=\"Endémique\", IF(AND($K40>0,$K40<5), IF($K40=4,\"Inconnu\", IF($K40=1, $F40*0.33, IF($K40=2, $F40*0.5+$G40*0.2, SUM(F40:G40)))), 0),\"Non requis\")","v":138547},null,1,1,0,"MDA3 (IVM)","T3 (ALB/MBD)","MDA 3","T2",48696,"KLOTO"]
[{"$f":"IF(INTRO!$E$34<>0,INTRO!$E$34,\"\")","v":"Togo"},"PLATEAUX","KPELE",93167,{"$f":"IF(INTRO!$E$48=\"\",\"\",ROUND($D41*INTRO!$E$48,0))","v":14907},{"$f":"IF(INTRO!$E$49=\"\",\"\",ROUND($D41*INTRO!$E$49,0))","v":27950},{"$f":"IF(INTRO!$E$50=\"\",\"\",ROUND($D41*INTRO!$E$50,0))","v":46584},null,1,3,2,{"$f":"IF(INTRO!$E$38=\"Endémique\", IF($H41>0, IF($H41=4,\"Inconnu\", IF($H41=99,\"Interrompu\", $D41)), 0),\"Non requis\")","v":"Non requis"},64548,{"$f":"IF(INTRO!$E$42=\"Endémique\", IF(AND($J41>1,$J41<5), IF($J41=4, \"Inconnu\", E41+F41), 0),\"Non requis\")","v":42857},{"$f":"IF(INTRO!$E$44=\"Endémique\", IF(AND($K41>0,$K41<5), IF($K41=4,\"Inconnu\", IF($K41=1, $F41*0.33, IF($K41=2, $F41*0.5+$G41*0.2, SUM(F41:G41)))), 0),\"Non requis\")","v":23291.800000000003},null,1,1,0,"MDA3 (IVM)","T3 (ALB/MBD)","MDA 3","T2",48697,"KPELE"]
[{"$f":"IF(INTRO!$E$34<>0,INTRO!$E$34,\"\")","v":"Togo"},"PLATEAUX","MOYEN MONO",93519,{"$f":"IF(INTRO!$E$48=\"\",\"\",ROUND($D42*INTRO!$E$48,0))","v":14963},{"$f":"IF(INTRO!$E$49=\"\",\"\",ROUND($D42*INTRO!$E$49,0))","v":28056},{"$f":"IF(INTRO!$E$50=\"\",\"\",ROUND($D42*INTRO!$E$50,0))","v":46760},null,1,2,2,{"$f":"IF(INTRO!$E$38=\"Endémique\", IF($H42>0, IF($H42=4,\"Inconnu\", IF($H42=99,\"Interrompu\", $D42)), 0),\"Non requis\")","v":"Non requis"},55930,{"$f":"IF(INTRO!$E$42=\"Endémique\", IF(AND($J42>1,$J42<5), IF($J42=4, \"Inconnu\", E42+F42), 0),\"Non requis\")","v":43019},{"$f":"IF(INTRO!$E$44=\"Endémique\", IF(AND($K42>0,$K42<5), IF($K42=4,\"Inconnu\", IF($K42=1, $F42*0.33, IF($K42=2, $F42*0.5+$G42*0.2, SUM(F42:G42)))), 0),\"Non requis\")","v":23380},null,1,1,0,"MDA3 (IVM)","T3 (ALB/MBD)","MDA 3","T2",48698,"MOYEN MONO"]
[{"$f":"IF(INTRO!$E$34<>0,INTRO!$E$34,\"\")","v":"Togo"},"PLATEAUX","OGOU",241456,{"$f":"IF(INTRO!$E$48=\"\",\"\",ROUND($D43*INTRO!$E$48,0))","v":38633},{"$f":"IF(INTRO!$E$49=\"\",\"\",ROUND($D43*INTRO!$E$49,0))","v":72437},{"$f":"IF(INTRO!$E$50=\"\",\"\",ROUND($D43*INTRO!$E$50,0))","v":120728},null,1,3,3,{"$f":"IF(INTRO!$E$38=\"Endémique\", IF($H43>0, IF($H43=4,\"Inconnu\", IF($H43=99,\"Interrompu\", $D43)), 0),\"Non requis\")","v":"Non requis"},124094,{"$f":"IF(INTRO!$E$42=\"Endémique\", IF(AND($J43>1,$J43<5), IF($J43=4, \"Inconnu\", E43+F43), 0),\"Non requis\")","v":111070},{"$f":"IF(INTRO!$E$44=\"Endémique\", IF(AND($K43>0,$K43<5), IF($K43=4,\"Inconnu\", IF($K43=1, $F43*0.33, IF($K43=2, $F43*0.5+$G43*0.2, SUM(F43:G43)))), 0),\"Non requis\")","v":193165},null,2,2,1,"MDA3 (IVM)","T3 (ALB/MBD)","MDA 1","T2",48699,"OGOU"]
[{"$f":"IF(INTRO!$E$34<>0,INTRO!$E$34,\"\")","v":"Togo"},"PLATEAUX","WAWA",124478,{"$f":"IF(INTRO!$E$48=\"\",\"\",ROUND($D44*INTRO!$E$48,0))","v":19916},{"$f":"IF(INTRO!$E$49=\"\",\"\",ROUND($D44*INTRO!$E$49,0))","v":37343},{"$f":"IF(INTRO!$E$50=\"\",\"\",ROUND($D44*INTRO!$E$50,0))","v":62239},null,1,2,3,{"$f":"IF(INTRO!$E$38=\"Endémique\", IF($H44>0, IF($H44=4,\"Inconnu\", IF($H44=99,\"Interrompu\", $D44)), 0),\"Non requis\")","v":"Non requis"},100119,{"$f":"IF(INTRO!$E$42=\"Endémique\", IF(AND($J44>1,$J44<5), IF($J44=4, \"Inconnu\", E44+F44), 0),\"Non requis\")","v":57259},{"$f":"IF(INTRO!$E$44=\"Endémique\", IF(AND($K44>0,$K44<5), IF($K44=4,\"Inconnu\", IF($K44=1, $F44*0.33, IF($K44=2, $F44*0.5+$G44*0.2, SUM(F44:G44)))), 0),\"Non requis\")","v":99582},null,1,1,0,"MDA3 (IVM)","T3 (ALB/MBD)","MDA 3","T2",48700,"WAWA"]
[{"$f":"IF(INTRO!$E$34<>0,INTRO!$E$34,\"\")","v":"Togo"},"SAVANES","CINKASSE",95811,{"$f":"IF(INTRO!$E$48=\"\",\"\",ROUND($D45*INTRO!$E$48,0))","v":15330},{"$f":"IF(INTRO!$E$49=\"\",\"\",ROUND($D45*INTRO!$E$49,0))","v":28743},{"$f":"IF(INTRO!$E$50=\"\",\"\",ROUND($D45*INTRO!$E$50,0))","v":47906},null,1,1,3,{"$f":"IF(INTRO!$E$38=\"Endémique\", IF($H45>0, IF($H45=4,\"Inconnu\", IF($H45=99,\"Interrompu\", $D45)), 0),\"Non requis\")","v":"Non requis"},64583,{"$f":"IF(INTRO!$E$42=\"Endémique\", IF(AND($J45>1,$J45<5), IF($J45=4, \"Inconnu\", E45+F45), 0),\"Non requis\")","v":0},{"$f":"IF(INTRO!$E$44=\"Endémique\", IF(AND($K45>0,$K45<5), IF($K45=4,\"Inconnu\", IF($K45=1, $F45*0.33, IF($K45=2, $F45*0.5+$G45*0.2, SUM(F45:G45)))), 0),\"Non requis\")","v":76649},null,1,1,1,"MDA3 (IVM)","T1 (PZQ+ALB/MBD)","MDA 3","T2",48701,"CINKASSE"]
[{"$f":"IF(INTRO!$E$34<>0,INTRO!$E$34,\"\")","v":"Togo"},"SAVANES","KPENDJAL",187208,{"$f":"IF(INTRO!$E$48=\"\",\"\",ROUND($D46*INTRO!$E$48,0))","v":29953},{"$f":"IF(INTRO!$E$49=\"\",\"\",ROUND($D46*INTRO!$E$49,0))","v":56162},{"$f":"IF(INTRO!$E$50=\"\",\"\",ROUND($D46*INTRO!$E$50,0))","v":93604},null,1,2,3,{"$f":"IF(INTRO!$E$38=\"Endémique\", IF($H46>0, IF($H46=4,\"Inconnu\", IF($H46=99,\"Interrompu\", $D46)), 0),\"Non requis\")","v":"Non requis"},194712,{"$f":"IF(INTRO!$E$42=\"Endémique\", IF(AND($J46>1,$J46<5), IF($J46=4, \"Inconnu\", E46+F46), 0),\"Non requis\")","v":86115},{"$f":"IF(INTRO!$E$44=\"Endémique\", IF(AND($K46>0,$K46<5), IF($K46=4,\"Inconnu\", IF($K46=1, $F46*0.33, IF($K46=2, $F46*0.5+$G46*0.2, SUM(F46:G46)))), 0),\"Non requis\")","v":149766},null,2,1,0,"MDA3 (IVM)","T3 (ALB/MBD)","MDA 3","T2",48702,"KPENDJAL"]
[{"$f":"IF(INTRO!$E$34<>0,INTRO!$E$34,\"\")","v":"Togo"},"SAVANES","OTI",230929,{"$f":"IF(INTRO!$E$48=\"\",\"\",ROUND($D47*INTRO!$E$48,0))","v":36949},{"$f":"IF(INTRO!$E$49=\"\",\"\",ROUND($D47*INTRO!$E$49,0))","v":69279},{"$f":"IF(INTRO!$E$50=\"\",\"\",ROUND($D47*INTRO!$E$50,0))","v":115465},null,1,2,2,{"$f":"IF(INTRO!$E$38=\"Endémique\", IF($H47>0, IF($H47=4,\"Inconnu\", IF($H47=99,\"Interrompu\", $D47)), 0),\"Non requis\")","v":"Non requis"},184948,{"$f":"IF(INTRO!$E$42=\"Endémique\", IF(AND($J47>1,$J47<5), IF($J47=4, \"Inconnu\", E47+F47), 0),\"Non requis\")","v":106228},{"$f":"IF(INTRO!$E$44=\"Endémique\", IF(AND($K47>0,$K47<5), IF($K47=4,\"Inconnu\", IF($K47=1, $F47*0.33, IF($K47=2, $F47*0.5+$G47*0.2, SUM(F47:G47)))), 0),\"Non requis\")","v":57732.5},null,2,2,0,"MDA3 (IVM)","T3 (ALB/MBD)","MDA 1","T2",48703,"OTI"]
[{"$f":"IF(INTRO!$E$34<>0,INTRO!$E$34,\"\")","v":"Togo"},"SAVANES","TANDJOARE",144060,{"$f":"IF(INTRO!$E$48=\"\",\"\",ROUND($D48*INTRO!$E$48,0))","v":23050},{"$f":"IF(INTRO!$E$49=\"\",\"\",ROUND($D48*INTRO!$E$49,0))","v":43218},{"$f":"IF(INTRO!$E$50=\"\",\"\",ROUND($D48*INTRO!$E$50,0))","v":72030},null,1,2,1,{"$f":"IF(INTRO!$E$38=\"Endémique\", IF($H48>0, IF($H48=4,\"Inconnu\", IF($H48=99,\"Interrompu\", $D48)), 0),\"Non requis\")","v":"Non requis"},146821,{"$f":"IF(INTRO!$E$42=\"Endémique\", IF(AND($J48>1,$J48<5), IF($J48=4, \"Inconnu\", E48+F48), 0),\"Non requis\")","v":66268},{"$f":"IF(INTRO!$E$44=\"Endémique\", IF(AND($K48>0,$K48<5), IF($K48=4,\"Inconnu\", IF($K48=1, $F48*0.33, IF($K48=2, $F48*0.5+$G48*0.2, SUM(F48:G48)))), 0),\"Non requis\")","v":14261.94},null,1,2,0,"MDA3 (IVM)","T3 (ALB/MBD)","MDA 1","T2",48704,"TANDJOARE"]
[{"$f":"IF(INTRO!$E$34<>0,INTRO!$E$34,\"\")","v":"Togo"},"SAVANES","TONE",348604,{"$f":"IF(INTRO!$E$48=\"\",\"\",ROUND($D49*INTRO!$E$48,0))","v":55777},{"$f":"IF(INTRO!$E$49=\"\",\"\",ROUND($D49*INTRO!$E$49,0))","v":104581},{"$f":"IF(INTRO!$E$50=\"\",\"\",ROUND($D49*INTRO!$E$50,0))","v":174302},null,1,2,2,{"$f":"IF(INTRO!$E$38=\"Endémique\", IF($H49>0, IF($H49=4,\"Inconnu\", IF($H49=99,\"Interrompu\", $D49)), 0),\"Non requis\")","v":"Non requis"},260774,{"$f":"IF(INTRO!$E$42=\"Endémique\", IF(AND($J49>1,$J49<5), IF($J49=4, \"Inconnu\", E49+F49), 0),\"Non requis\")","v":160358},{"$f":"IF(INTRO!$E$44=\"Endémique\", IF(AND($K49>0,$K49<5), IF($K49=4,\"Inconnu\", IF($K49=1, $F49*0.33, IF($K49=2, $F49*0.5+$G49*0.2, SUM(F49:G49)))), 0),\"Non requis\")","v":87150.9},null,1,1,0,"MDA3 (IVM)","T1 (PZQ+ALB/MBD)","MDA 3","T2",48705,"TONE"]
[null,null,null,null,null,null,null,null,null,null,null,null,null,null,null,null,null,null,null,null,null," "," "]

{"sheet":"MDA1","index":2,"n_rows":49,"n_cols":17,"rows_kept":49,"cut":false,"hidden":true,"merged":[[5,13,5,16],[3,0,3,2],[5,0,5,2],[5,5,5,8],[5,9,5,12],[5,3,6,3],[5,4,6,4]]}
["MDA 1 - Ivermectine (IVM) et Albendazole (ALB)"]
["Structure administrative, population nécessitant une chimioprévention par groupe d'âge, population traitée par groupe d'âge et couverture"]
[]
["TOTAL",null,null,null,null,null,{"$f":"SUM(G$9:G$1000)","v":0},{"$f":"SUM(H$9:H$1000)","v":0},{"$f":"SUM(I$9:I$1000)","v":0},null,{"$f":"SUM(K$9:K$1000)","v":0},{"$f":"SUM(L$9:L$1000)","v":0},{"$f":"SUM(M$9:M$1000)","v":0},null,{"$f":"IF(G4<>0, IF(K4/G4*100=0, \"-\", K4/G4*100), \" \")","v":" "},{"$f":"IF(H4<>0, IF(L4/H4*100=0, \"-\", L4/H4*100), \" \")","v":" "},{"$f":"IF(I4<>0, IF(M4/I4*100=0, \"-\", M4/I4*100), \" \")","v":" "}]
[]
["Structure administrative du pays",null,null,"Mise en oeuvre \nde la CP","Date","Population ciblée pour MDA 1",null,null,null,"Population traitée",null,null,null,"Couverture du Programme (%)"]
["Pays","Région/Département","District",null,null,"EAPréS","EAS","Adultes","Total","EAPréS","EAS","Adultes","Total","EAPréS","EAS","Adultes","Total"]
[]
[{"$f":"IF(COUNTRY_INFO!A9=0,\" \",COUNTRY_INFO!A9)","v":"Togo"},{"$f":"IF(COUNTRY_INFO!B9=0,\" \",COUNTRY_INFO!B9)","v":"CENTRALE"},{"$f":"IF(COUNTRY_INFO!C9=0,\" \",COUNTRY_INFO!C9)","v":"BLITTA"},{"$f":"IF(COUNTRY_INFO!$T$9:$T$1000=\"MDA1 (IVM+ALB)\", COUNTRY_INFO!$T$9:$T$1000, \" \")","v":" "},null,null,null,null,{"$f":"SUM(F9:H9)","v":0},null,null,null,{"$f":"SUM(J9:L9)","v":0},null,{"$f":"IF(G9<>0, IF(K9/G9*100=0, \"-\", K9/G9*100), \" \")","v":" "},{"$f":"IF(H9<>0, IF(L9/H9*100=0, \"-\", L9/H9*100), \" \")","v":" "},{"$f":"IF(I9<>0, IF(M9/I9*100=0, \"-\", M9/I9*100), \" \")","v":" "}]
[{"$f":"IF(COUNTRY_INFO!A10=0,\" \",COUNTRY_INFO!A10)","v":"Togo"},{"$f":"IF(COUNTRY_INFO!B10=0,\" \",COUNTRY_INFO!B10)","v":"CENTRALE"},{"$f":"IF(COUNTRY_INFO!C10=0,\" \",COUNTRY_INFO!C10)","v":"MÔ"},{"$f":"IF(COUNTRY_INFO!$T$9:$T$1000=\"MDA1 (IVM+ALB)\", COUNTRY_INFO!$T$9:$T$1000, \" \")","v":" "},null,null,null,null,{"$f":"SUM(F10:H10)","v":0},null,null,null,{"$f":"SUM(J10:L10)","v":0},null,{"$f":"IF(G10<>0, IF(K10/G10*100=0, \"-\", K10/G10*100), \" \")","v":" "},{"$f":"IF(H10<>0, IF(L10/H10*100=0, \"-\", L10/H10*100), \" \")","v":" "},{"$f":"IF(I10<>0, IF(M10/I10*100=0, \"-\", M10/I10*100), \" \")","v":" "}]
[{"$f":"IF(COUNTRY_INFO!A11=0,\" \",COUNTRY_INFO!A11)","v":"Togo"},{"$f":"IF(COUNTRY_INFO!B11=0,\" \",COUNTRY_INFO!B11)","v":"CENTRALE"},{"$f":"IF(COUNTRY_INFO!C11=0,\" \",COUNTRY_INFO!C11)","v":"SOTOUBOUA"},{"$f":"IF(COUNTRY_INFO!$T$9:$T$1000=\"MDA1 (IVM+ALB)\", COUNTRY_INFO!$T$9:$T$1000, \" \")","v":" "},null,null,null,null,0,null,null,null,0,null," "," "," "]
[{"$f":"IF(COUNTRY_INFO!A12=0,\" \",COUNTRY_INFO!A12)","v":"Togo"},{"$f":"IF(COUNTRY_INFO!B12=0,\" \",COUNTRY_INFO!B12)","v":"CENTRALE"},{"$f":"IF(COUNTRY_INFO!C12=0,\" \",COUNTRY_INFO!C12)","v":"TCHAMBA"},{"$f":"IF(COUNTRY_INFO!$T$9:$T$1000=\"MDA1 (IVM+ALB)\", COUNTRY_INFO!$T$9:$T$1000, \" \")","v":" "},null,null,null,null,0,null,null,null,0,null," "," "," "]
[{"$f":"IF(COUNTRY_INFO!A13=0,\" \",COUNTRY_INFO!A13)","v":"Togo"},{"$f":"IF(COUNTRY_INFO!B13=0,\" \",COUNTRY_INFO!B13)","v":"CENTRALE"},{"$f":"IF(COUNTRY_INFO!C13=0,\" \",COUNTRY_INFO!C13)","v":"TCHAOUDJO"},{"$f":"IF(COUNTRY_INFO!$T$9:$T$1000=\"MDA1 (IVM+ALB)\", COUNTRY_INFO!$T$9:$T$1000, \" \")","v":" "},null,null,null,null,0,null,null,null,0,null," "," "," "]
[{"$f":"IF(COUNTRY_INFO!A14=0,\" \",COUNTRY_INFO!A14)","v":"Togo"},{"$f":"IF(COUNTRY_INFO!B14=0,\" \",COUNTRY_INFO!B14)","v":"KARA"},{"$f":"IF(COUNTRY_INFO!C14=0,\" \",COUNTRY_INFO!C14)","v":"ASSOLI"},{"$f":"IF(COUNTRY_INFO!$T$9:$T$1000=\"MDA1 (IVM+ALB)\", COUNTRY_INFO!$T$9:$T$1000, \" \")","v":" "},null,null,null,null,0,null,null,null,0,null," "," "," "]
[{"$f":"IF(COUNTRY_INFO!A15=0,\" \",COUNTRY_INFO!A15)","v":"Togo"},{"$f":"IF(COUNTRY_INFO!B15=0,\" \",COUNTRY_INFO!B15)","v":"KARA"},{"$f":"IF(COUNTRY_INFO!C15=0,\" \",COUNTRY_INFO!C15)","v":"BASSAR"},{"$f":"IF(COUNTRY_INFO!$T$9:$T$1000=\"MDA1 (IVM+ALB)\", COUNTRY_INFO!$T$9:$T$1000, \" \")","v":" "},null,null,null,null,0,null,null,null,0,null," "," "," "]
[{"$f":"IF(COUNTRY_INFO!A16=0,\" \",COUNTRY_INFO!A16)","v":"Togo"},{"$f":"IF(COUNTRY_INFO!B16=0,\" \",COUNTRY_INFO!B16)","v":"KARA"},{"$f":"IF(COUNTRY_INFO!C16=0,\" \",COUNTRY_INFO!C16)","v":"BINAH"},{"$f":"IF(COUNTRY_INFO!$T$9:$T$1000=\"MDA1 (IVM+ALB)\", COUNTRY_INFO!$T$9:$T$1000, \" \")","v":" "},null,null,null,null,0,null,null,null,0,null," "," "," "]
[{"$f":"IF(COUNTRY_INFO!A17=0,\" \",COUNTRY_INFO!A17)","v":"Togo"},{"$f":"IF(COUNTRY_INFO!B17=0,\" \",COUNTRY_INFO!B17)","v":"KARA"},{"$f":"IF(COUNTRY_INFO!C17=0,\" \",COUNTRY_INFO!C17)","v":"DANKPEN"},{"$f":"IF(COUNTRY_INFO!$T$9:$T$1000=\"MDA1 (IVM+ALB)\", COUNTRY_INFO!$T$9:$T$1000, \" \")","v":" "},null,null,null,null,0,null,null,null,0,null," "," "," "]
[{"$f":"IF(COUNTRY_INFO!A18=0,\" \",COUNTRY_INFO!A18)","v":"Togo"},{"$f":"IF(COUNTRY_INFO!B18=0,\" \",COUNTRY_INFO!B18)","v":"KARA"},{"$f":"IF(COUNTRY_INFO!C18=0,\" \",COUNTRY_INFO!C18)","v":"DOULFELGOU"},{"$f":"IF(COUNTRY_INFO!$T$9:$T$1000=\"MDA1 (IVM+ALB)\", COUNTRY_INFO!$T$9:$T$1000, \" \")","v":" "},null,null,null,null,0,null,null,null,0,null," "," "," "]
[{"$f":"IF(COUNTRY_INFO!A19=0,\" \",COUNTRY_INFO!A19)","v":"Togo"},{"$f":"IF(COUNTRY_INFO!B19=0,\" \",COUNTRY_INFO!B19)","v":"KARA"},{"$f":"IF(COUNTRY_INFO!C19=0,\" \",COUNTRY_INFO!C19)","v":"KERAN"},{"$f":"IF(COUNTRY_INFO!$T$9:$T$1000=\"MDA1 (IVM+ALB)\", COUNTRY_INFO!$T$9:$T$1000, \" \")","v":" "},null,null,null,null,0,null,null,null,0,null," "," "," "]
[{"$f":"IF(COUNTRY_INFO!A20=0,\" \",COUNTRY_INFO!A20)","v":"Togo"},{"$f":"IF(COUNTRY_INFO!B20=0,\" \",COUNTRY_INFO!B20)","v":"KARA"},{"$f":"IF(COUNTRY_INFO!C20=0,\" \",COUNTRY_INFO!C20)","v":"KOZAH"},{"$f":"IF(COUNTRY_INFO!$T$9:$T$1000=\"MDA1 (IVM+ALB)\", COUNTRY_INFO!$T$9:$T$1000, \" \")","v":" "},null,null,null,null,0,null,null,null,0,null," "," "," "]
[{"$f":"IF(COUNTRY_INFO!A21=0,\" \",COUNTRY_INFO!A21)","v":"Togo"},{"$f":"IF(COUNTRY_INFO!B21=0,\" \",COUNTRY_INFO!B21)","v":"LOME-COMMUNE"},{"$f":"IF(COUNTRY_INFO!C21=0,\" \",COUNTRY_INFO!C21)","v":"DISTRICT N°1"},{"$f":"IF(COUNTRY_INFO!$T$9:$T$1000=\"MDA1 (IVM+ALB)\", COUNTRY_INFO!$T$9:$T$1000, \" \")","v":" "},null,null,null,null,0,null,null,null,0,null," "," "," "]
[{"$f":"IF(COUNTRY_INFO!A22=0,\" \",COUNTRY_INFO!A22)","v":"Togo"},{"$f":"IF(COUNTRY_INFO!B22=0,\" \",COUNTRY_INFO!B22)","v":"LOME-COMMUNE"},{"$f":"IF(COUNTRY_INFO!C22=0,\" \",COUNTRY_INFO!C22)","v":"DISTRICT N°2"},{"$f":"IF(COUNTRY_INFO!$T$9:$T$1000=\"MDA1 (IVM+ALB)\", COUNTRY_INFO!$T$9:$T$1000, \" \")","v":" "},null,null,null,null,0,null,null,null,0,null," "," "," "]
[{"$f":"IF(COUNTRY_INFO!A23=0,\" \",COUNTRY_INFO!A23)","v":"Togo"},{"$f":"IF(COUNTRY_INFO!B23=0,\" \",COUNTRY_INFO!B23)","v":"LOME-COMMUNE"},{"$f":"IF(COUNTRY_INFO!C23=0,\" \",COUNTRY_INFO!C23)","v":"DISTRICT N°3"},{"$f":"IF(COUNTRY_INFO!$T$9:$T$1000=\"MDA1 (IVM+ALB)\", COUNTRY_INFO!$T$9:$T$1000, \" \")","v":" "},null,null,null,null,0,null,null,null,0,null," "," "," "]
[{"$f":"IF(COUNTRY_INFO!A24=0,\" \",COUNTRY_INFO!A24)","v":"Togo"},{"$f":"IF(COUNTRY_INFO!B24=0,\" \",COUNTRY_INFO!B24)","v":"LOME-COMMUNE"},{"$f":"IF(COUNTRY_INFO!C24=0,\" \",COUNTRY_INFO!C24)","v":"DISTRICT N°4"},{"$f":"IF(COUNTRY_INFO!$T$9:$T$1000=\"MDA1 (IVM+ALB)\", COUNTRY_INFO!$T$9:$T$1000, \" \")","v":" "},null,null,null,null,0,null,null,null,0,null," "," "," "]
[{"$f":"IF(COUNTRY_INFO!A25=0,\" \",COUNTRY_INFO!A25)","v":"Togo"},{"$f":"IF(COUNTRY_INFO!B25=0,\" \",COUNTRY_INFO!B25)","v":"LOME-COMMUNE"},{"$f":"IF(COUNTRY_INFO!C25=0,\" \",COUNTRY_INFO!C25)","v":"DISTRICT N°5"},{"$f":"IF(COUNTRY_INFO!$T$9:$T$1000=\"MDA1 (IVM+ALB)\", COUNTRY_INFO!$T$9:$T$1000, \" \")","v":" "},null,null,null,null,0,null,null,null,0,null," "," "," "]
[{"$f":"IF(COUNTRY_INFO!A26=0,\" \",COUNTRY_INFO!A26)","v":"Togo"},{"$f":"IF(COUNTRY_INFO!B26=0,\" \",COUNTRY_INFO!B26)","v":"MARITIME"},{"$f":"IF(COUNTRY_INFO!C26=0,\" \",COUNTRY_INFO!C26)","v":"AVE"},{"$f":"IF(COUNTRY_INFO!$T$9:$T$1000=\"MDA1 (IVM+ALB)\", COUNTRY_INFO!$T$9:$T$1000, \" \")","v":" "},null,null,null,null,0,null,null,null,0,null," "," "," "]
[{"$f":"IF(COUNTRY_INFO!A27=0,\" \",COUNTRY_INFO!A27)","v":"Togo"},{"$f":"IF(COUNTRY_INFO!B27=0,\" \",COUNTRY_INFO!B27)","v":"MARITIME"},{"$f":"IF(COUNTRY_INFO!C27=0,\" \",COUNTRY_INFO!C27)","v":"BAS MONO"},{"$f":"IF(COUNTRY_INFO!$T$9:$T$1000=\"MDA1 (IVM+ALB)\", COUNTRY_INFO!$T$9:$T$1000, \" \")","v":" "},null,null,null,null,0,null,null,null,0,null," "," "," "]
[{"$f":"IF(COUNTRY_INFO!A28=0,\" \",COUNTRY_INFO!A28)","v":"Togo"},{"$f":"IF(COUNTRY_INFO!B28=0,\" \",COUNTRY_INFO!B28)","v":"MARITIME"},{"$f":"IF(COUNTRY_INFO!C28=0,\" \",COUNTRY_INFO!C28)","v":"GOLFE"},{"$f":"IF(COUNTRY_INFO!$T$9:$T$1000=\"MDA1 (IVM+ALB)\", COUNTRY_INFO!$T$9:$T$1000, \" \")","v":" "},null,null,null,null,0,null,null,null,0,null," "," "," "]
[{"$f":"IF(COUNTRY_INFO!A29=0,\" \",COUNTRY_INFO!A29)","v":"Togo"},{"$f":"IF(COUNTRY_INFO!B29=0,\" \",COUNTRY_INFO!B29)","v":"MARITIME"},{"$f":"IF(COUNTRY_INFO!C29=0,\" \",COUNTRY_INFO!C29)","v":"LACS"},{"$f":"IF(COUNTRY_INFO!$T$9:$T$1000=\"MDA1 (IVM+ALB)\", COUNTRY_INFO!$T$9:$T$1000, \" \")","v":" "},null,null,null,null,0,null,null,null,0,null," "," "," "]
[{"$f":"IF(COUNTRY_INFO!A30=0,\" \",COUNTRY_INFO!A30)","v":"Togo"},{"$f":"IF(COUNTRY_INFO!B30=0,\" \",COUNTRY_INFO!B30)","v":"MARITIME"},{"$f":"IF(COUNTRY_INFO!C30=0,\" \",COUNTRY_INFO!C30)","v":"VO"},{"$f":"IF(COUNTRY_INFO!$T$9:$T$1000=\"MDA1 (IVM+ALB)\", COUNTRY_INFO!$T$9:$T$1000, \" \")","v":" "},null,null,null,null,0,null,null,null,0,null," "," "," "]
[{"$f":"IF(COUNTRY_INFO!A31=0,\" \",COUNTRY_INFO!A31)","v":"Togo"},{"$f":"IF(COUNTRY_INFO!B31=0,\" \",COUNTRY_INFO!B31)","v":"MARITIME"},{"$f":"IF(COUNTRY_INFO!C31=0,\" \",COUNTRY_INFO!C31)","v":"YOTO"},{"$f":"IF(COUNTRY_INFO!$T$9:$T$1000=\"MDA1 (IVM+ALB)\", COUNTRY_INFO!$T$9:$T$1000, \" \")","v":" "},null,null,null,null,0,null,null,null,0,null," "," "," "]
[{"$f":"IF(COUNTRY_INFO!A32=0,\" \",COUNTRY_INFO!A32)","v":"Togo"},{"$f":"IF(COUNTRY_INFO!B32=0,\" \",COUNTRY_INFO!B32)","v":"MARITIME"},{"$f":"IF(COUNTRY_INFO!C32=0,\" \",COUNTRY_INFO!C32)","v":"ZIO"},{"$f":"IF(COUNTRY_INFO!$T$9:$T$1000=\"MDA1 (IVM+ALB)\", COUNTRY_INFO!$T$9:$T$1000, \" \")","v":" "},null,null,null,null,0,null,null,null,0,null," "," "," "]
[{"$f":"IF(COUNTRY_INFO!A33=0,\" \",COUNTRY_INFO!A33)","v":"Togo"},{"$f":"IF(COUNTRY_INFO!B33=0,\" \",COUNTRY_INFO!B33)","v":"PLATEAUX"},{"$f":"IF(COUNTRY_INFO!C33=0,\" \",COUNTRY_INFO!C33)","v":"AGOU"},{"$f":"IF(COUNTRY_INFO!$T$9:$T$1000=\"MDA1 (IVM+ALB)\", COUNTRY_INFO!$T$9:$T$1000, \" \")","v":" "},null,null,null,null,0,null,null,null,0,null," "," "," "]
[{"$f":"IF(COUNTRY_INFO!A34=0,\" \",COUNTRY_INFO!A34)","v":"Togo"},{"$f":"IF(COUNTRY_INFO!B34=0,\" \",COUNTRY_INFO!B34)","v":"PLATEAUX"},{"$f":"IF(COUNTRY_INFO!C34=0,\" \",COUNTRY_INFO!C34)","v":"AKEBOU"},{"$f":"IF(COUNTRY_INFO!$T$9:$T$1000=\"MDA1 (IVM+ALB)\", COUNTRY_INFO!$T$9:$T$1000, \" \")","v":" "},null,null,null,null,0,null,null,null,0,null," "," "," "]
[{"$f":"IF(COUNTRY_INFO!A35=0,\" \",COUNTRY_INFO!A35)","v":"Togo"},{"$f":"IF(COUNTRY_INFO!B35=0,\" \",COUNTRY_INFO!B35)","v":"PLATEAUX"},{"$f":"IF(COUNTRY_INFO!C35=0,\" \",COUNTRY_INFO!C35)","v":"AMOU"},{"$f":"IF(COUNTRY_INFO!$T$9:$T$1000=\"MDA1 (IVM+ALB)\", COUNTRY_INFO!$T$9:$T$1000, \" \")","v":" "},null,null,null,null,0,null,null,null,0,null," "," "," "]
[{"$f":"IF(COUNTRY_INFO!A36=0,\" \",COUNTRY_INFO!A36)","v":"Togo"},{"$f":"IF(COUNTRY_INFO!B36=0,\" \",COUNTRY_INFO!B36)","v":"PLATEAUX"},{"$f":"IF(COUNTRY_INFO!C36=0,\" \",COUNTRY_INFO!C36)","v":"ANIE"},{"$f":"IF(COUNTRY_INFO!$T$9:$T$1000=\"MDA1 (IVM+ALB)\", COUNTRY_INFO!$T$9:$T$1000, \" \")","v":" "},null,null,null,null,0,null,null,null,0,null," "," "," "]
[{"$f":"IF(COUNTRY_INFO!A37=0,\" \",COUNTRY_INFO!A37)","v":"Togo"},{"$f":"IF(COUNTRY_INFO!B37=0,\" \",COUNTRY_INFO!B37)","v":"PLATEAUX"},{"$f":"IF(COUNTRY_INFO!C37=0,\" \",COUNTRY_INFO!C37)","v":"DANYI"},{"$f":"IF(COUNTRY_INFO!$T$9:$T$1000=\"MDA1 (IVM+ALB)\", COUNTRY_INFO!$T$9:$T$1000, \" \")","v":" "},null,null,null,null,0,null,null,null,0,null," "," "," "]
[{"$f":"IF(COUNTRY_INFO!A38=0,\" \",COUNTRY_INFO!A38)","v":"Togo"},{"$f":"IF(COUNTRY_INFO!B38=0,\" \",COUNTRY_INFO!B38)","v":"PLATEAUX"},{"$f":"IF(COUNTRY_INFO!C38=0,\" \",COUNTRY_INFO!C38)","v":"EST MONO"},{"$f":"IF(COUNTRY_INFO!$T$9:$T$1000=\"MDA1 (IVM+ALB)\", COUNTRY_INFO!$T$9:$T$1000, \" \")","v":" "},null,null,null,null,0,null,null,null,0,null," "," "," "]
[{"$f":"IF(COUNTRY_INFO!A39=0,\" \",COUNTRY_INFO!A39)","v":"Togo"},{"$f":"IF(COUNTRY_INFO!B39=0,\" \",COUNTRY_INFO!B39)","v":"PLATEAUX"},{"$f":"IF(COUNTRY_INFO!C39=0,\" \",COUNTRY_INFO!C39)","v":"HAHO"},{"$f":"IF(COUNTRY_INFO!$T$9:$T$1000=\"MDA1 (IVM+ALB)\", COUNTRY_INFO!$T$9:$T$1000, \" \")","v":" "},null,null,null,null,0,null,null,null,0,null," "," "," "]
[{"$f":"IF(COUNTRY_INFO!A40=0,\" \",COUNTRY_INFO!A40)","v":"Togo"},{"$f":"IF(COUNTRY_INFO!B40=0,\" \",COUNTRY_INFO!B40)","v":"PLATEAUX"},{"$f":"IF(COUNTRY_INFO!C40=0,\" \",COUNTRY_INFO!C40)","v":"KLOTO"},{"$f":"IF(COUNTRY_INFO!$T$9:$T$1000=\"MDA1 (IVM+ALB)\", COUNTRY_INFO!$T$9:$T$1000, \" \")","v":" "},null,null,null,null,0,null,null,null,0,null," "," "," "]
[{"$f":"IF(COUNTRY_INFO!A41=0,\" \",COUNTRY_INFO!A41)","v":"Togo"},{"$f":"IF(COUNTRY_INFO!B41=0,\" \",COUNTRY_INFO!B41)","v":"PLATEAUX"},{"$f":"IF(COUNTRY_INFO!C41=0,\" \",COUNTRY_INFO!C41)","v":"KPELE"},{"$f":"IF(COUNTRY_INFO!$T$9:$T$1000=\"MDA1 (IVM+ALB)\", COUNTRY_INFO!$T$9:$T$1000, \" \")","v":" "},null,null,null,null,0,null,null,null,0,null," "," "," "]
[{"$f":"IF(COUNTRY_INFO!A42=0,\" \",COUNTRY_INFO!A42)","v":"Togo"},{"$f":"IF(COUNTRY_INFO!B42=0,\" \",COUNTRY_INFO!B42)","v":"PLATEAUX"},{"$f":"IF(COUNTRY_INFO!C42=0,\" \",COUNTRY_INFO!C42)","v":"MOYEN MONO"},{"$f":"IF(COUNTRY_INFO!$T$9:$T$1000=\"MDA1 (IVM+ALB)\", COUNTRY_INFO!$T$9:$T$1000, \" \")","v":" "},null,null,null,null,0,null,null,null,0,null," "," "," "]
[{"$f":"IF(COUNTRY_INFO!A43=0,\" \",COUNTRY_INFO!A43)","v":"Togo"},{"$f":"IF(COUNTRY_INFO!B43=0,\" \",COUNTRY_INFO!B43)","v":"PLATEAUX"},{"$f":"IF(COUNTRY_INFO!C43=0,\" \",COUNTRY_INFO!C43)","v":"OGOU"},{"$f":"IF(COUNTRY_INFO!$T$9:$T$1000=\"MDA1 (IVM+ALB)\", COUNTRY_INFO!$T$9:$T$1000, \" \")","v":" "},null,null,null,null,0,null,null,null,0,null," "," "," "]
[{"$f":"IF(COUNTRY_INFO!A44=0,\" \",COUNTRY_INFO!A44)","v":"Togo"},{"$f":"IF(COUNTRY_INFO!B44=0,\" \",COUNTRY_INFO!B44)","v":"PLATEAUX"},{"$f":"IF(COUNTRY_INFO!C44=0,\" \",COUNTRY_INFO!C44)","v":"WAWA"},{"$f":"IF(COUNTRY_INFO!$T$9:$T$1000=\"MDA1 (IVM+ALB)\", COUNTRY_INFO!$T$9:$T$1000, \" \")","v":" "},null,null,null,null,0,null,null,null,0,null," "," "," "]
[{"$f":"IF(COUNTRY_INFO!A45=0,\" \",COUNTRY_INFO!A45)","v":"Togo"},{"$f":"IF(COUNTRY_INFO!B45=0,\" \",COUNTRY_INFO!B45)","v":"SAVANES"},{"$f":"IF(COUNTRY_INFO!C45=0,\" \",COUNTRY_INFO!C45)","v":"CINKASSE"},{"$f":"IF(COUNTRY_INFO!$T$9:$T$1000=\"MDA1 (IVM+ALB)\", COUNTRY_INFO!$T$9:$T$1000, \" \")","v":" "},null,null,null,null,0,null,null,null,0,null," "," "," "]
[{"$f":"IF(COUNTRY_INFO!A46=0,\" \",COUNTRY_INFO!A46)","v":"Togo"},{"$f":"IF(COUNTRY_INFO!B46=0,\" \",COUNTRY_INFO!B46)","v":"SAVANES"},{"$f":"IF(COUNTRY_INFO!C46=0,\" \",COUNTRY_INFO!C46)","v":"KPENDJAL"},{"$f":"IF(COUNTRY_INFO!$T$9:$T$1000=\"MDA1 (IVM+ALB)\", COUNTRY_INFO!$T$9:$T$1000, \" \")","v":" "},null,null,null,null,0,null,null,null,0,null," "," "," "]
[{"$f":"IF(COUNTRY_INFO!A47=0,\" \",COUNTRY_INFO!A47)","v":"Togo"},{"$f":"IF(COUNTRY_INFO!B47=0,\" \",COUNTRY_INFO!B47)","v":"SAVANES"},{"$f":"IF(COUNTRY_INFO!C47=0,\" \",COUNTRY_INFO!C47)","v":"OTI"},{"$f":"IF(COUNTRY_INFO!$T$9:$T$1000=\"MDA1 (IVM+ALB)\", COUNTRY_INFO!$T$9:$T$1000, \" \")","v":" "},null,null,null,null,0,null,null,null,0,null," "," "," "]
[{"$f":"IF(COUNTRY_INFO!A48=0,\" \",COUNTRY_INFO!A48)","v":"Togo"},{"$f":"IF(COUNTRY_INFO!B48=0,\" \",COUNTRY_INFO!B48)","v":"SAVANES"},{"$f":"IF(COUNTRY_INFO!C48=0,\" \",COUNTRY_INFO!C48)","v":"TANDJOARE"},{"$f":"IF(COUNTRY_INFO!$T$9:$T$1000=\"MDA1 (IVM+ALB)\", COUNTRY_INFO!$T$9:$T$1000, \" \")","v":" "},null,null,null,null,0,null,null,null,0,null," "," "," "]
[{"$f":"IF(COUNTRY_INFO!A49=0,\" \",COUNTRY_INFO!A49)","v":"Togo"},{"$f":"IF(COUNTRY_INFO!B49=0,\" \",COUNTRY_INFO!B49)","v":"SAVANES"},{"$f":"IF(COUNTRY_INFO!C49=0,\" \",COUNTRY_INFO!C49)","v":"TONE"},{"$f":"IF(COUNTRY_INFO!$T$9:$T$1000=\"MDA1 (IVM+ALB)\", COUNTRY_INFO!$T$9:$T$1000, \" \")","v":" "},null,null,null,null,0,null,null,null,0,null," "," "," "]

{"sheet":"MDA2","index":3,"n_rows":49,"n_cols":17,"rows_kept":49,"cut":false,"hidden":true,"merged":[[5,5,5,8],[5,9,5,12],[5,13,5,16],[3,0,3,2],[5,0,5,2],[5,3,6,3],[5,4,6,4]]}
["MDA 2 - Diethylcarbamazine (DEC) + Albendazole (ALB)"]
["Structure administrative, population nécessitant une chimioprévention par groupe d'âge, population traitée par groupe d'âge et couverture"]
[]
["TOTAL",null,null,null,null,{"$f":"SUM(F$9:F$1000)","v":0},{"$f":"SUM(G$9:G$1000)","v":0},0,0,0,0,0,0,{"$f":"IF(F4<>0, IF(J4/F4*100=0, \"-\", J4/F4*100), \" \")","v":" "},{"$f":"IF(G4<>0, IF(K4/G4*100=0, \"-\", K4/G4*100), \" \")","v":" "},{"$f":"IF(H4<>0, IF(L4/H4*100=0, \"-\", L4/H4*100), \" \")","v":" "},{"$f":"IF(I4<>0, IF(M4/I4*100=0, \"-\", M4/I4*100), \" \")","v":" "}]
[]
["Structure administrative du pays",null,null,"Mise en oeuvre \nde la CP","Date","Population ciblée pour MDA 2",null,null,null,"Population traitée",null,null,null,"Couverture du Programme (%)"]
["Pays","Région/Département","District",null,null,"EAPréS","EAS","Adultes","Total","EAPréS","EAS","Adultes","Total","EAPréS","EAS","Adultes","Total"]
[]
[{"$f":"IF(COUNTRY_INFO!A9=0,\" \",COUNTRY_INFO!A9)","v":"Togo"},{"$f":"IF(COUNTRY_INFO!B9=0,\" \",COUNTRY_INFO!B9)","v":"CENTRALE"},{"$f":"IF(COUNTRY_INFO!C9=0,\" \",COUNTRY_INFO!C9)","v":"BLITTA"},{"$f":"IF(COUNTRY_INFO!$T$9:$T$1000=\"MDA2 (DEC+ALB)\", COUNTRY_INFO!$T$9:$T$1000, \" \")","v":" "},null,null,null,null,{"$f":"SUM(F9:H9)","v":0},null,null,null,{"$f":"SUM(J9:L9)","v":0},{"$f":"IF(F9<>0, IF(J9/F9*100=0, \"-\", J9/F9*100), \" \")","v":" "},{"$f":"IF(G9<>0, IF(K9/G9*100=0, \"-\", K9/G9*100), \" \")","v":" "},{"$f":"IF(H9<>0, IF(L9/H9*100=0, \"-\", L9/H9*100), \" \")","v":" "},{"$f":"IF(I9<>0, IF(M9/I9*100=0, \"-\", M9/I9*100), \" \")","v":" "}]
[{"$f":"IF(COUNTRY_INFO!A10=0,\" \",COUNTRY_INFO!A10)","v":"Togo"},{"$f":"IF(COUNTRY_INFO!B10=0,\" \",COUNTRY_INFO!B10)","v":"CENTRALE"},{"$f":"IF(COUNTRY_INFO!C10=0,\" \",COUNTRY_INFO!C10)","v":"MÔ"},{"$f":"IF(COUNTRY_INFO!$T$9:$T$1000=\"MDA2 (DEC+ALB)\", COUNTRY_INFO!$T$9:$T$1000, \" \")","v":" "},null,null,null,null,{"$f":"SUM(F10:H10)","v":0},null,null,null,{"$f":"SUM(J10:L10)","v":0},{"$f":"IF(F10<>0, IF(J10/F10*100=0, \"-\", J10/F10*100), \" \")","v":" "},{"$f":"IF(G10<>0, IF(K10/G10*100=0, \"-\", K10/G10*100), \" \")","v":" "},{"$f":"IF(H10<>0, IF(L10/H10*100=0, \"-\", L10/H10*100), \" \")","v":" "},{"$f":"IF(I10<>0, IF(M10/I10*100=0, \"-\", M10/I10*100), \" \")","v":" "}]
[{"$f":"IF(COUNTRY_INFO!A11=0,\" \",COUNTRY_INFO!A11)","v":"Togo"},{"$f":"IF(COUNTRY_INFO!B11=0,\" \",COUNTRY_INFO!B11)","v":"CENTRALE"},{"$f":"IF(COUNTRY_INFO!C11=0,\" \",COUNTRY_INFO!C11)","v":"SOTOUBOUA"},{"$f":"IF(COUNTRY_INFO!$T$9:$T$1000=\"MDA2 (DEC+ALB)\", COUNTRY_INFO!$T$9:$T$1000, \" \")","v":" "},null,null,null,null,0,null,null,null,0," "," "," "," "]
[{"$f":"IF(COUNTRY_INFO!A12=0,\" \",COUNTRY_INFO!A12)","v":"Togo"},{"$f":"IF(COUNTRY_INFO!B12=0,\" \",COUNTRY_INFO!B12)","v":"CENTRALE"},{"$f":"IF(COUNTRY_INFO!C12=0,\" \",COUNTRY_INFO!C12)","v":"TCHAMBA"},{"$f":"IF(COUNTRY_INFO!$T$9:$T$1000=\"MDA2 (DEC+ALB)\", COUNTRY_INFO!$T$9:$T$1000, \" \")","v":" "},null,null,null,null,0,null,null,null,0," "," "," "," "]
[{"$f":"IF(COUNTRY_INFO!A13=0,\" \",COUNTRY_INFO!A13)","v":"Togo"},{"$f":"IF(COUNTRY_INFO!B13=0,\" \",COUNTRY_INFO!B13)","v":"CENTRALE"},{"$f":"IF(COUNTRY_INFO!C13=0,\" \",COUNTRY_INFO!C13)","v":"TCHAOUDJO"},{"$f":"IF(COUNTRY_INFO!$T$9:$T$1000=\"MDA2 (DEC+ALB)\", COUNTRY_INFO!$T$9:$T$1000, \" \")","v":" "},null,null,null,null,0,null,null,null,0," "," "," "," "]
[{"$f":"IF(COUNTRY_INFO!A14=0,\" \",COUNTRY_INFO!A14)","v":"Togo"},{"$f":"IF(COUNTRY_INFO!B14=0,\" \",COUNTRY_INFO!B14)","v":"KARA"},{"$f":"IF(COUNTRY_INFO!C14=0,\" \",COUNTRY_INFO!C14)","v":"ASSOLI"},{"$f":"IF(COUNTRY_INFO!$T$9:$T$1000=\"MDA2 (DEC+ALB)\", COUNTRY_INFO!$T$9:$T$1000, \" \")","v":" "},null,null,null,null,0,null,null,null,0," "," "," "," "]
[{"$f":"IF(COUNTRY_INFO!A15=0,\" \",COUNTRY_INFO!A15)","v":"Togo"},{"$f":"IF(COUNTRY_INFO!B15=0,\" \",COUNTRY_INFO!B15)","v":"KARA"},{"$f":"IF(COUNTRY_INFO!C15=0,\" \",COUNTRY_INFO!C15)","v":"BASSAR"},{"$f":"IF(COUNTRY_INFO!$T$9:$T$1000=\"MDA2 (DEC+ALB)\", COUNTRY_INFO!$T$9:$T$1000, \" \")","v":" "},null,null,null,null,0,null,null,null,0," "," "," "," "]
[{"$f":"IF(COUNTRY_INFO!A16=0,\" \",COUNTRY_INFO!A16)","v":"Togo"},{"$f":"IF(COUNTRY_INFO!B16=0,\" \",COUNTRY_INFO!B16)","v":"KARA"},{"$f":"IF(COUNTRY_INFO!C16=0,\" \",COUNTRY_INFO!C16)","v":"BINAH"},{"$f":"IF(COUNTRY_INFO!$T$9:$T$1000=\"MDA2 (DEC+ALB)\", COUNTRY_INFO!$T$9:$T$1000, \" \")","v":" "},null,null,null,null,0,null,null,null,0," "," "," "," "]
[{"$f":"IF(COUNTRY_INFO!A17=0,\" \",COUNTRY_INFO!A17)","v":"Togo"},{"$f":"IF(COUNTRY_INFO!B17=0,\" \",COUNTRY_INFO!B17)","v":"KARA"},{"$f":"IF(COUNTRY_INFO!C17=0,\" \",COUNTRY_INFO!C17)","v":"DANKPEN"},{"$f":"IF(COUNTRY_INFO!$T$9:$T$1000=\"MDA2 (DEC+ALB)\", COUNTRY_INFO!$T$9:$T$1000, \" \")","v":" "},null,null,null,null,0,null,null,null,0," "," "," "," "]
[{"$f":"IF(COUNTRY_INFO!A18=0,\" \",COUNTRY_INFO!A18)","v":"Togo"},{"$f":"IF(COUNTRY_INFO!B18=0,\" \",COUNTRY_INFO!B18)","v":"KARA"},{"$f":"IF(COUNTRY_INFO!C18=0,\" \",COUNTRY_INFO!C18)","v":"DOULFELGOU"},{"$f":"IF(COUNTRY_INFO!$T$9:$T$1000=\"MDA2 (DEC+ALB)\", COUNTRY_INFO!$T$9:$T$1000, \" \")","v":" "},null,null,null,null,0,null,null,null,0," "," "," "," "]
[{"$f":"IF(COUNTRY_INFO!A19=0,\" \",COUNTRY_INFO!A19)","v":"Togo"},{"$f":"IF(COUNTRY_INFO!B19=0,\" \",COUNTRY_INFO!B19)","v":"KARA"},{"$f":"IF(COUNTRY_INFO!C19=0,\" \",COUNTRY_INFO!C19)","v":"KERAN"},{"$f":"IF(COUNTRY_INFO!$T$9:$T$1000=\"MDA2 (DEC+ALB)\", COUNTRY_INFO!$T$9:$T$1000, \" \")","v":" "},null,null,null,null,0,null,null,null,0," "," "," "," "]
[{"$f":"IF(COUNTRY_INFO!A20=0,\" \",COUNTRY_INFO!A20)","v":"Togo"},{"$f":"IF(COUNTRY_INFO!B20=0,\" \",COUNTRY_INFO!B20)","v":"KARA"},{"$f":"IF(COUNTRY_INFO!C20=0,\" \",COUNTRY_INFO!C20)","v":"KOZAH"},{"$f":"IF(COUNTRY_INFO!$T$9:$T$1000=\"MDA2 (DEC+ALB)\", COUNTRY_INFO!$T$9:$T$1000, \" \")","v":" "},null,null,null,null,0,null,null,null,0," "," "," "," "]
[{"$f":"IF(COUNTRY_INFO!A21=0,\" \",COUNTRY_INFO!A21)","v":"Togo"},{"$f":"IF(COUNTRY_INFO!B21=0,\" \",COUNTRY_INFO!B21)","v":"LOME-COMMUNE"},{"$f":"IF(COUNTRY_INFO!C21=0,\" \",COUNTRY_INFO!C21)","v":"DISTRICT N°1"},{"$f":"IF(COUNTRY_INFO!$T$9:$T$1000=\"MDA2 (DEC+ALB)\", COUNTRY_INFO!$T$9:$T$1000, \" \")","v":" "},null,null,null,null,0,null,null,null,0," "," "," "," "]
[{"$f":"IF(COUNTRY_INFO!A22=0,\" \",COUNTRY_INFO!A22)","v":"Togo"},{"$f":"IF(COUNTRY_INFO!B22=0,\" \",COUNTRY_INFO!B22)","v":"LOME-COMMUNE"},{"$f":"IF(COUNTRY_INFO!C22=0,\" \",COUNTRY_INFO!C22)","v":"DISTRICT N°2"},{"$f":"IF(COUNTRY_INFO!$T$9:$T$1000=\"MDA2 (DEC+ALB)\", COUNTRY_INFO!$T$9:$T$1000, \" \")","v":" "},null,null,null,null,0,null,null,null,0," "," "," "," "]
[{"$f":"IF(COUNTRY_INFO!A23=0,\" \",COUNTRY_INFO!A23)","v":"Togo"},{"$f":"IF(COUNTRY_INFO!B23=0,\" \",COUNTRY_INFO!B23)","v":"LOME-COMMUNE"},{"$f":"IF(COUNTRY_INFO!C23=0,\" \",COUNTRY_INFO!C23)","v":"DISTRICT N°3"},{"$f":"IF(COUNTRY_INFO!$T$9:$T$1000=\"MDA2 (DEC+ALB)\", COUNTRY_INFO!$T$9:$T$1000, \" \")","v":" "},null,null,null,null,0,null,null,null,0," "," "," "," "]
[{"$f":"IF(COUNTRY_INFO!A24=0,\" \",COUNTRY_INFO!A24)","v":"Togo"},{"$f":"IF(COUNTRY_INFO!B24=0,\" \",COUNTRY_INFO!B24)","v":"LOME-COMMUNE"},{"$f":"IF(COUNTRY_INFO!C24=0,\" \",COUNTRY_INFO!C24)","v":"DISTRICT N°4"},{"$f":"IF(COUNTRY_INFO!$T$9:$T$1000=\"MDA2 (DEC+ALB)\", COUNTRY_INFO!$T$9:$T$1000, \" \")","v":" "},null,null,null,null,0,null,null,null,0," "," "," "," "]
[{"$f":"IF(COUNTRY_INFO!A25=0,\" \",COUNTRY_INFO!A25)","v":"Togo"},{"$f":"IF(COUNTRY_INFO!B25=0,\" \",COUNTRY_INFO!B25)","v":"LOME-COMMUNE"},{"$f":"IF(COUNTRY_INFO!C25=0,\" \",COUNTRY_INFO!C25)","v":"DISTRICT N°5"},{"$f":"IF(COUNTRY_INFO!$T$9:$T$1000=\"MDA2 (DEC+ALB)\", COUNTRY_INFO!$T$9:$T$1000, \" \")","v":" "},null,null,null,null,0,null,null,null,0," "," "," "," "]
[{"$f":"IF(COUNTRY_INFO!A26=0,\" \",COUNTRY_INFO!A26)","v":"Togo"},{"$f":"IF(COUNTRY_INFO!B26=0,\" \",COUNTRY_INFO!B26)","v":"MARITIME"},{"$f":"IF(COUNTRY_INFO!C26=0,\" \",COUNTRY_INFO!C26)","v":"AVE"},{"$f":"IF(COUNTRY_INFO!$T$9:$T$1000=\"MDA2 (DEC+ALB)\", COUNTRY_INFO!$T$9:$T$1000, \" \")","v":" "},null,null,null,null,0,null,null,null,0," "," "," "," "]
[{"$f":"IF(COUNTRY_INFO!A27=0,\" \",COUNTRY_INFO!A27)","v":"Togo"},{"$f":"IF(COUNTRY_INFO!B27=0,\" \",COUNTRY_INFO!B27)","v":"MARITIME"},{"$f":"IF(COUNTRY_INFO!C27=0,\" \",COUNTRY_INFO!C27)","v":"BAS MONO"},{"$f":"IF(COUNTRY_INFO!$T$9:$T$1000=\"MDA2 (DEC+ALB)\", COUNTRY_INFO!$T$9:$T$1000, \" \")","v":" "},null,null,null,null,0,null,null,null,0," "," "," "," "]
[{"$f":"IF(COUNTRY_INFO!A28=0,\" \",COUNTRY_INFO!A28)","v":"Togo"},{"$f":"IF(COUNTRY_INFO!B28=0,\" \",COUNTRY_INFO!B28)","v":"MARITIME"},{"$f":"IF(COUNTRY_INFO!C28=0,\" \",COUNTRY_INFO!C28)","v":"GOLFE"},{"$f":"IF(COUNTRY_INFO!$T$9:$T$1000=\"MDA2 (DEC+ALB)\", COUNTRY_INFO!$T$9:$T$1000, \" \")","v":" "},null,null,null,null,0,null,null,null,0," "," "," "," "]
[{"$f":"IF(COUNTRY_INFO!A29=0,\" \",COUNTRY_INFO!A29)","v":"Togo"},{"$f":"IF(COUNTRY_INFO!B29=0,\" \",COUNTRY_INFO!B29)","v":"MARITIME"},{"$f":"IF(COUNTRY_INFO!C29=0,\" \",COUNTRY_INFO!C29)","v":"LACS"},{"$f":"IF(COUNTRY_INFO!$T$9:$T$1000=\"MDA2 (DEC+ALB)\", COUNTRY_INFO!$T$9:$T$1000, \" \")","v":" "},null,null,null,null,0,null,null,null,0," "," "," "," "]
[{"$f":"IF(COUNTRY_INFO!A30=0,\" \",COUNTRY_INFO!A30)","v":"Togo"},{"$f":"IF(COUNTRY_INFO!B30=0,\" \",COUNTRY_INFO!B30)","v":"MARITIME"},{"$f":"IF(COUNTRY_INFO!C30=0,\" \",COUNTRY_INFO!C30)","v":"VO"},{"$f":"IF(COUNTRY_INFO!$T$9:$T$1000=\"MDA2 (DEC+ALB)\", COUNTRY_INFO!$T$9:$T$1000, \" \")","v":" "},null,null,null,null,0,null,null,null,0," "," "," "," "]
[{"$f":"IF(COUNTRY_INFO!A31=0,\" \",COUNTRY_INFO!A31)","v":"Togo"},{"$f":"IF(COUNTRY_INFO!B31=0,\" \",COUNTRY_INFO!B31)","v":"MARITIME"},{"$f":"IF(COUNTRY_INFO!C31=0,\" \",COUNTRY_INFO!C31)","v":"YOTO"},{"$f":"IF(COUNTRY_INFO!$T$9:$T$1000=\"MDA2 (DEC+ALB)\", COUNTRY_INFO!$T$9:$T$1000, \" \")","v":" "},null,null,null,null,0,null,null,null,0," "," "," "," "]
[{"$f":"IF(COUNTRY_INFO!A32=0,\" \",COUNTRY_INFO!A32)","v":"Togo"},{"$f":"IF(COUNTRY_INFO!B32=0,\" \",COUNTRY_INFO!B32)","v":"MARITIME"},{"$f":"IF(COUNTRY_INFO!C32=0,\" \",COUNTRY_INFO!C32)","v":"ZIO"},{"$f":"IF(COUNTRY_INFO!$T$9:$T$1000=\"MDA2 (DEC+ALB)\", COUNTRY_INFO!$T$9:$T$1000, \" \")","v":" "},null,null,null,null,0,null,null,null,0," "," "," "," "]
[{"$f":"IF(COUNTRY_INFO!A33=0,\" \",COUNTRY_INFO!A33)","v":"Togo"},{"$f":"IF(COUNTRY_INFO!B33=0,\" \",COUNTRY_INFO!B33)","v":"PLATEAUX"},{"$f":"IF(COUNTRY_INFO!C33=0,\" \",COUNTRY_INFO!C33)","v":"AGOU"},{"$f":"IF(COUNTRY_INFO!$T$9:$T$1000=\"MDA2 (DEC+ALB)\", COUNTRY_INFO!$T$9:$T$1000, \" \")","v":" "},null,null,null,null,0,null,null,null,0," "," "," "," "]
[{"$f":"IF(COUNTRY_INFO!A34=0,\" \",COUNTRY_INFO!A34)","v":"Togo"},{"$f":"IF(COUNTRY_INFO!B34=0,\" \",COUNTRY_INFO!B34)","v":"PLATEAUX"},{"$f":"IF(COUNTRY_INFO!C34=0,\" \",COUNTRY_INFO!C34)","v":"AKEBOU"},{"$f":"IF(COUNTRY_INFO!$T$9:$T$1000=\"MDA2 (DEC+ALB)\", COUNTRY_INFO!$T$9:$T$1000, \" \")","v":" "},null,null,null,null,0,null,null,null,0," "," "," "," "]
[{"$f":"IF(COUNTRY_INFO!A35=0,\" \",COUNTRY_INFO!A35)","v":"Togo"},{"$f":"IF(COUNTRY_INFO!B35=0,\" \",COUNTRY_INFO!B35)","v":"PLATEAUX"},{"$f":"IF(COUNTRY_INFO!C35=0,\" \",COUNTRY_INFO!C35)","v":"AMOU"},{"$f":"IF(COUNTRY_INFO!$T$9:$T$1000=\"MDA2 (DEC+ALB)\", COUNTRY_INFO!$T$9:$T$1000, \" \")","v":" "},null,null,null,null,0,null,null,null,0," "," "," "," "]
[{"$f":"IF(COUNTRY_INFO!A36=0,\" \",COUNTRY_INFO!A36)","v":"Togo"},{"$f":"IF(COUNTRY_INFO!B36=0,\" \",COUNTRY_INFO!B36)","v":"PLATEAUX"},{"$f":"IF(COUNTRY_INFO!C36=0,\" \",COUNTRY_INFO!C36)","v":"ANIE"},{"$f":"IF(COUNTRY_INFO!$T$9:$T$1000=\"MDA2 (DEC+ALB)\", COUNTRY_INFO!$T$9:$T$1000, \" \")","v":" "},null,null,null,null,0,null,null,null,0," "," "," "," "]
[{"$f":"IF(COUNTRY_INFO!A37=0,\" \",COUNTRY_INFO!A37)","v":"Togo"},{"$f":"IF(COUNTRY_INFO!B37=0,\" \",COUNTRY_INFO!B37)","v":"PLATEAUX"},{"$f":"IF(COUNTRY_INFO!C37=0,\" \",COUNTRY_INFO!C37)","v":"DANYI"},{"$f":"IF(COUNTRY_INFO!$T$9:$T$1000=\"MDA2 (DEC+ALB)\", COUNTRY_INFO!$T$9:$T$1000, \" \")","v":" "},null,null,null,null,0,null,null,null,0," "," "," "," "]
[{"$f":"IF(COUNTRY_INFO!A38=0,\" \",COUNTRY_INFO!A38)","v":"Togo"},{"$f":"IF(COUNTRY_INFO!B38=0,\" \",COUNTRY_INFO!B38)","v":"PLATEAUX"},{"$f":"IF(COUNTRY_INFO!C38=0,\" \",COUNTRY_INFO!C38)","v":"EST MONO"},{"$f":"IF(COUNTRY_INFO!$T$9:$T$1000=\"MDA2 (DEC+ALB)\", COUNTRY_INFO!$T$9:$T$1000, \" \")","v":" "},null,null,null,null,0,null,null,null,0," "," "," "," "]
[{"$f":"IF(COUNTRY_INFO!A39=0,\" \",COUNTRY_INFO!A39)","v":"Togo"},{"$f":"IF(COUNTRY_INFO!B39=0,\" \",COUNTRY_INFO!B39)","v":"PLATEAUX"},{"$f":"IF(COUNTRY_INFO!C39=0,\" \",COUNTRY_INFO!C39)","v":"HAHO"},{"$f":"IF(COUNTRY_INFO!$T$9:$T$1000=\"MDA2 (DEC+ALB)\", COUNTRY_INFO!$T$9:$T$1000, \" \")","v":" "},null,null,null,null,0,null,null,null,0," "," "," "," "]
[{"$f":"IF(COUNTRY_INFO!A40=0,\" \",COUNTRY_INFO!A40)","v":"Togo"},{"$f":"IF(COUNTRY_INFO!B40=0,\" \",COUNTRY_INFO!B40)","v":"PLATEAUX"},{"$f":"IF(COUNTRY_INFO!C40=0,\" \",COUNTRY_INFO!C40)","v":"KLOTO"},{"$f":"IF(COUNTRY_INFO!$T$9:$T$1000=\"MDA2 (DEC+ALB)\", COUNTRY_INFO!$T$9:$T$1000, \" \")","v":" "},null,null,null,null,0,null,null,null,0," "," "," "," "]
[{"$f":"IF(COUNTRY_INFO!A41=0,\" \",COUNTRY_INFO!A41)","v":"Togo"},{"$f":"IF(COUNTRY_INFO!B41=0,\" \",COUNTRY_INFO!B41)","v":"PLATEAUX"},{"$f":"IF(COUNTRY_INFO!C41=0,\" \",COUNTRY_INFO!C41)","v":"KPELE"},{"$f":"IF(COUNTRY_INFO!$T$9:$T$1000=\"MDA2 (DEC+ALB)\", COUNTRY_INFO!$T$9:$T$1000, \" \")","v":" "},null,null,null,null,0,null,null,null,0," "," "," "," "]
[{"$f":"IF(COUNTRY_INFO!A42=0,\" \",COUNTRY_INFO!A42)","v":"Togo"},{"$f":"IF(COUNTRY_INFO!B42=0,\" \",COUNTRY_INFO!B42)","v":"PLATEAUX"},{"$f":"IF(COUNTRY_INFO!C42=0,\" \",COUNTRY_INFO!C42)","v":"MOYEN MONO"},{"$f":"IF(COUNTRY_INFO!$T$9:$T$1000=\"MDA2 (DEC+ALB)\", COUNTRY_INFO!$T$9:$T$1000, \" \")","v":" "},null,null,null,null,0,null,null,null,0," "," "," "," "]
[{"$f":"IF(COUNTRY_INFO!A43=0,\" \",COUNTRY_INFO!A43)","v":"Togo"},{"$f":"IF(COUNTRY_INFO!B43=0,\" \",COUNTRY_INFO!B43)","v":"PLATEAUX"},{"$f":"IF(COUNTRY_INFO!C43=0,\" \",COUNTRY_INFO!C43)","v":"OGOU"},{"$f":"IF(COUNTRY_INFO!$T$9:$T$1000=\"MDA2 (DEC+ALB)\", COUNTRY_INFO!$T$9:$T$1000, \" \")","v":" "},null,null,null,null,0,null,null,null,0," "," "," "," "]
[{"$f":"IF(COUNTRY_INFO!A44=0,\" \",COUNTRY_INFO!A44)","v":"Togo"},{"$f":"IF(COUNTRY_INFO!B44=0,\" \",COUNTRY_INFO!B44)","v":"PLATEAUX"},{"$f":"IF(COUNTRY_INFO!C44=0,\" \",COUNTRY_INFO!C44)","v":"WAWA"},{"$f":"IF(COUNTRY_INFO!$T$9:$T$1000=\"MDA2 (DEC+ALB)\", COUNTRY_INFO!$T$9:$T$1000, \" \")","v":" "},null,null,null,null,0,null,null,null,0," "," "," "," "]
[{"$f":"IF(COUNTRY_INFO!A45=0,\" \",COUNTRY_INFO!A45)","v":"Togo"},{"$f":"IF(COUNTRY_INFO!B45=0,\" \",COUNTRY_INFO!B45)","v":"SAVANES"},{"$f":"IF(COUNTRY_INFO!C45=0,\" \",COUNTRY_INFO!C45)","v":"CINKASSE"},{"$f":"IF(COUNTRY_INFO!$T$9:$T$1000=\"MDA2 (DEC+ALB)\", COUNTRY_INFO!$T$9:$T$1000, \" \")","v":" "},null,null,null,null,0,null,null,null,0," "," "," "," "]
[{"$f":"IF(COUNTRY_INFO!A46=0,\" \",COUNTRY_INFO!A46)","v":"Togo"},{"$f":"IF(COUNTRY_INFO!B46=0,\" \",COUNTRY_INFO!B46)","v":"SAVANES"},{"$f":"IF(COUNTRY_INFO!C46=0,\" \",COUNTRY_INFO!C46)","v":"KPENDJAL"},{"$f":"IF(COUNTRY_INFO!$T$9:$T$1000=\"MDA2 (DEC+ALB)\", COUNTRY_INFO!$T$9:$T$1000, \" \")","v":" "},null,null,null,null,0,null,null,null,0," "," "," "," "]
[{"$f":"IF(COUNTRY_INFO!A47=0,\" \",COUNTRY_INFO!A47)","v":"Togo"},{"$f":"IF(COUNTRY_INFO!B47=0,\" \",COUNTRY_INFO!B47)","v":"SAVANES"},{"$f":"IF(COUNTRY_INFO!C47=0,\" \",COUNTRY_INFO!C47)","v":"OTI"},{"$f":"IF(COUNTRY_INFO!$T$9:$T$1000=\"MDA2 (DEC+ALB)\", COUNTRY_INFO!$T$9:$T$1000, \" \")","v":" "},null,null,null,null,0,null,null,null,0," "," "," "," "]
[{"$f":"IF(COUNTRY_INFO!A48=0,\" \",COUNTRY_INFO!A48)","v":"Togo"},{"$f":"IF(COUNTRY_INFO!B48=0,\" \",COUNTRY_INFO!B48)","v":"SAVANES"},{"$f":"IF(COUNTRY_INFO!C48=0,\" \",COUNTRY_INFO!C48)","v":"TANDJOARE"},{"$f":"IF(COUNTRY_INFO!$T$9:$T$1000=\"MDA2 (DEC+ALB)\", COUNTRY_INFO!$T$9:$T$1000, \" \")","v":" "},null,null,null,null,0,null,null,null,0," "," "," "," "]
[{"$f":"IF(COUNTRY_INFO!A49=0,\" \",COUNTRY_INFO!A49)","v":"Togo"},{"$f":"IF(COUNTRY_INFO!B49=0,\" \",COUNTRY_INFO!B49)","v":"SAVANES"},{"$f":"IF(COUNTRY_INFO!C49=0,\" \",COUNTRY_INFO!C49)","v":"TONE"},{"$f":"IF(COUNTRY_INFO!$T$9:$T$1000=\"MDA2 (DEC+ALB)\", COUNTRY_INFO!$T$9:$T$1000, \" \")","v":" "},null,null,null,null,0,null,null,null,0," "," "," "," "]

{"sheet":"MDA3","index":4,"n_rows":49,"n_cols":20,"rows_kept":49,"cut":false,"hidden":false,"merged":[[5,5,5,7],[5,17,5,19],[3,0,3,2],[5,0,5,2],[5,3,6,3],[5,4,6,4],[5,8,5,10],[5,11,5,13],[5,14,5,16]]}
["MDA 3 - Ivermectine (IVM) "]
["Structure administrative, population nécessitant une chimioprévention par groupe d'âge, population traitée par groupe d'âge et couverture"]
[]
["TOTAL",null,null,null,null,{"$f":"SUM(F$9:F$1000)","v":1383093.75},2305156.25,3688250,1169552,1877947,3047499,559401,874287,1433688,1180275,1887748,3068023,{"$f":"IF(F4<>0, IF(O4/F4*100=0, \"-\", O4/F4*100), \" \")","v":85.335863892089748},{"$f":"IF(G4<>0, IF(P4/G4*100=0, \"-\", P4/G4*100), \" \")","v":81.892409679387242},{"$f":"IF(H4<>0, IF(Q4/H4*100=0, \"-\", Q4/H4*100), \" \")","v":83.183705009150671}]
[]
["Structure administrative du pays",null,null,"Mise en oeuvre \nde la CP","Date","Population ciblée pour MDA 3",null,null,"Population traitée - tournée 1",null,null,"Population traitée - tournée 2",null,null,"Population traitée",null,null,"Couverture du Programme (%)"]
["Pays","Région/Département","District",null,null,"EAS","Adultes","Total","EAS","Adultes","Total","EAS","Adultes","Total","EAS","Adultes","Total","EAS","Adultes","Total"]
[]
[{"$f":"IF(COUNTRY_INFO!A9=0,\" \",COUNTRY_INFO!A9)","v":"Togo"},{"$f":"IF(COUNTRY_INFO!B9=0,\" \",COUNTRY_INFO!B9)","v":"CENTRALE"},{"$f":"IF(COUNTRY_INFO!C9=0,\" \",COUNTRY_INFO!C9)","v":"BLITTA"},{"$f":"IF(COUNTRY_INFO!$T$9:$T$1000=\"MDA3 (IVM)\", COUNTRY_INFO!$T$9:$T$1000, \" \")","v":"MDA3 (IVM)"},"18-29 juin",{"$f":"H9*0.375","v":40478.625},{"$f":"H9*0.625","v":67464.375},107943,32944,53965,{"$f":"SUM(I9:J9)","v":86909},null,null,{"$f":"SUM(L9:M9)","v":0},{"$f":"MAX(I9,L9)","v":32944},{"$f":"MAX(J9,M9)","v":53965},{"$f":"SUM(O9:P9)","v":86909},{"$f":"IF(F9<>0, IF(MAX(I9,L9)/F9*100=0, \"-\", MAX(I9,L9)/F9*100), \" \")","v":81.386163685154827},{"$f":"IF(G9<>0, IF(MAX(J9,M9)/G9*100=0, \"-\", MAX(J9,M9)/G9*100), \" \")","v":79.990365285382097},{"$f":"IF(H9<>0, IF((MAX(I9,L9)+MAX(J9,M9))/H9*100=0, \"-\",(MAX(I9,L9)+MAX(J9,M9))/H9*100), \" \")","v":80.513789685296871}]
[{"$f":"IF(COUNTRY_INFO!A10=0,\" \",COUNTRY_INFO!A10)","v":"Togo"},{"$f":"IF(COUNTRY_INFO!B10=0,\" \",COUNTRY_INFO!B10)","v":"CENTRALE"},{"$f":"IF(COUNTRY_INFO!C10=0,\" \",COUNTRY_INFO!C10)","v":"MÔ"},{"$f":"IF(COUNTRY_INFO!$T$9:$T$1000=\"MDA3 (IVM)\", COUNTRY_INFO!$T$9:$T$1000, \" \")","v":"MDA3 (IVM)"},"18-29 juin",{"$f":"H10*0.375","v":16850.25},{"$f":"H10*0.625","v":28083.75},44934,14714,22341,{"$f":"SUM(I10:J10)","v":37055},14677,22631,{"$f":"SUM(L10:M10)","v":37308},{"$f":"MAX(I10,L10)","v":14714},{"$f":"MAX(J10,M10)","v":22631},{"$f":"SUM(O10:P10)","v":37345},{"$f":"IF(F10<>0, IF(MAX(I10,L10)/F10*100=0, \"-\", MAX(I10,L10)/F10*100), \" \")","v":87.322146555689088},{"$f":"IF(G10<>0, IF(MAX(J10,M10)/G10*100=0, \"-\", MAX(J10,M10)/G10*100), \" \")","v":80.583967596919919},{"$f":"IF(H10<>0, IF((MAX(I10,L10)+MAX(J10,M10))/H10*100=0, \"-\",(MAX(I10,L10)+MAX(J10,M10))/H10*100), \" \")","v":83.110784706458361}]
[{"$f":"IF(COUNTRY_INFO!A11=0,\" \",COUNTRY_INFO!A11)","v":"Togo"},{"$f":"IF(COUNTRY_INFO!B11=0,\" \",COUNTRY_INFO!B11)","v":"CENTRALE"},{"$f":"IF(COUNTRY_INFO!C11=0,\" \",COUNTRY_INFO!C11)","v":"SOTOUBOUA"},{"$f":"IF(COUNTRY_INFO!$T$9:$T$1000=\"MDA3 (IVM)\", COUNTRY_INFO!$T$9:$T$1000, \" \")","v":"MDA3 (IVM)"},"18-29 juin",24996.375,41660.625,66657,19663,37075,56738,null,null,0,19663,37075,56738,78.663406193898112,88.992903971075805,85.119342304634174]
[{"$f":"IF(COUNTRY_INFO!A12=0,\" \",COUNTRY_INFO!A12)","v":"Togo"},{"$f":"IF(COUNTRY_INFO!B12=0,\" \",COUNTRY_INFO!B12)","v":"CENTRALE"},{"$f":"IF(COUNTRY_INFO!C12=0,\" \",COUNTRY_INFO!C12)","v":"TCHAMBA"},{"$f":"IF(COUNTRY_INFO!$T$9:$T$1000=\"MDA3 (IVM)\", COUNTRY_INFO!$T$9:$T$1000, \" \")","v":"MDA3 (IVM)"},"18-29 juin",42639.75,71066.25,113706,37130,57283,94413,null,null,0,37130,57283,94413,87.078371707151192,80.605069213585907,83.032557648672892]
[{"$f":"IF(COUNTRY_INFO!A13=0,\" \",COUNTRY_INFO!A13)","v":"Togo"},{"$f":"IF(COUNTRY_INFO!B13=0,\" \",COUNTRY_INFO!B13)","v":"CENTRALE"},{"$f":"IF(COUNTRY_INFO!C13=0,\" \",COUNTRY_INFO!C13)","v":"TCHAOUDJO"},{"$f":"IF(COUNTRY_INFO!$T$9:$T$1000=\"MDA3 (IVM)\", COUNTRY_INFO!$T$9:$T$1000, \" \")","v":"MDA3 (IVM)"},"18-29 juin",37410,62350,99760,32395,47986,80381,32278,50368,82646,32395,50368,82763,86.594493450948946,80.782678428227754,82.962109061748194]
[{"$f":"IF(COUNTRY_INFO!A14=0,\" \",COUNTRY_INFO!A14)","v":"Togo"},{"$f":"IF(COUNTRY_INFO!B14=0,\" \",COUNTRY_INFO!B14)","v":"KARA"},{"$f":"IF(COUNTRY_INFO!C14=0,\" \",COUNTRY_INFO!C14)","v":"ASSOLI"},{"$f":"IF(COUNTRY_INFO!$T$9:$T$1000=\"MDA3 (IVM)\", COUNTRY_INFO!$T$9:$T$1000, \" \")","v":"MDA3 (IVM)"},"18-29 juin",16547.25,27578.75,44126,13818,22282,36100,14219,22193,36412,14219,22282,36501,85.929686201634709,80.794089652359162,82.719938358337487]
[{"$f":"IF(COUNTRY_INFO!A15=0,\" \",COUNTRY_INFO!A15)","v":"Togo"},{"$f":"IF(COUNTRY_INFO!B15=0,\" \",COUNTRY_INFO!B15)","v":"KARA"},{"$f":"IF(COUNTRY_INFO!C15=0,\" \",COUNTRY_INFO!C15)","v":"BASSAR"},{"$f":"IF(COUNTRY_INFO!$T$9:$T$1000=\"MDA3 (IVM)\", COUNTRY_INFO!$T$9:$T$1000, \" \")","v":"MDA3 (IVM)"},"18-29 juin",37035.375,61725.625,98761,30978,49610,80588,31665,49910,81575,31665,49910,81575,85.499336782738126,80.857828495053724,82.598394102935373]
[{"$f":"IF(COUNTRY_INFO!A16=0,\" \",COUNTRY_INFO!A16)","v":"Togo"},{"$f":"IF(COUNTRY_INFO!B16=0,\" \",COUNTRY_INFO!B16)","v":"KARA"},{"$f":"IF(COUNTRY_INFO!C16=0,\" \",COUNTRY_INFO!C16)","v":"BINAH"},{"$f":"IF(COUNTRY_INFO!$T$9:$T$1000=\"MDA3 (IVM)\", COUNTRY_INFO!$T$9:$T$1000, \" \")","v":"MDA3 (IVM)"},"18-29 juin",18851.625,31419.375,50271,15344,25532,40876,15429,26400,41829,15429,26400,41829,81.844403333930089,84.024586739869903,83.207017962642482]
[{"$f":"IF(COUNTRY_INFO!A17=0,\" \",COUNTRY_INFO!A17)","v":"Togo"},{"$f":"IF(COUNTRY_INFO!B17=0,\" \",COUNTRY_INFO!B17)","v":"KARA"},{"$f":"IF(COUNTRY_INFO!C17=0,\" \",COUNTRY_INFO!C17)","v":"DANKPEN"},{"$f":"IF(COUNTRY_INFO!$T$9:$T$1000=\"MDA3 (IVM)\", COUNTRY_INFO!$T$9:$T$1000, \" \")","v":"MDA3 (IVM)"},"18-29 juin",56495.25,94158.75,150654,48175,71660,119835,49261,71108,120369,49261,71660,120921,87.194941167620286,76.10551329536554,80.264048747461075]
[{"$f":"IF(COUNTRY_INFO!A18=0,\" \",COUNTRY_INFO!A18)","v":"Togo"},{"$f":"IF(COUNTRY_INFO!B18=0,\" \",COUNTRY_INFO!B18)","v":"KARA"},{"$f":"IF(COUNTRY_INFO!C18=0,\" \",COUNTRY_INFO!C18)","v":"DOULFELGOU"},{"$f":"IF(COUNTRY_INFO!$T$9:$T$1000=\"MDA3 (IVM)\", COUNTRY_INFO!$T$9:$T$1000, \" \")","v":"MDA3 (IVM)"},"18-29 juin",27777,46295,74072,22705,39949,62654,22929,39024,61953,22929,39949,62878,82.546711307916624,86.292256183173137,84.887676854951948]
[{"$f":"IF(COUNTRY_INFO!A19=0,\" \",COUNTRY_INFO!A19)","v":"Togo"},{"$f":"IF(COUNTRY_INFO!B19=0,\" \",COUNTRY_INFO!B19)","v":"KARA"},{"$f":"IF(COUNTRY_INFO!C19=0,\" \",COUNTRY_INFO!C19)","v":"KERAN"},{"$f":"IF(COUNTRY_INFO!$T$9:$T$1000=\"MDA3 (IVM)\", COUNTRY_INFO!$T$9:$T$1000, \" \")","v":"MDA3 (IVM)"},"18-29 juin",45996.75,76661.25,122658,40097,62601,102698,35643,56067,91710,40097,62601,102698,87.173550305184605,81.659247664237142,83.72711115459245]
[{"$f":"IF(COUNTRY_INFO!A20=0,\" \",COUNTRY_INFO!A20)","v":"Togo"},{"$f":"IF(COUNTRY_INFO!B20=0,\" \",COUNTRY_INFO!B20)","v":"KARA"},{"$f":"IF(COUNTRY_INFO!C20=0,\" \",COUNTRY_INFO!C20)","v":"KOZAH"},{"$f":"IF(COUNTRY_INFO!$T$9:$T$1000=\"MDA3 (IVM)\", COUNTRY_INFO!$T$9:$T$1000, \" \")","v":"MDA3 (IVM)"},"18-29 juin",59600.625,99334.375,158935,44632,88338,132970,47483,88462,135945,47483,88462,135945,79.668627636035694,89.05477081825903,85.534967124925288]
[{"$f":"IF(COUNTRY_INFO!A21=0,\" \",COUNTRY_INFO!A21)","v":"Togo"},{"$f":"IF(COUNTRY_INFO!B21=0,\" \",COUNTRY_INFO!B21)","v":"LOME-COMMUNE"},{"$f":"IF(COUNTRY_INFO!C21=0,\" \",COUNTRY_INFO!C21)","v":"DISTRICT N°1"},{"$f":"IF(COUNTRY_INFO!$T$9:$T$1000=\"MDA3 (IVM)\", COUNTRY_INFO!$T$9:$T$1000, \" \")","v":" "},null,null,null,null,0,0,0,null,null,0,0,0,0," "," "," "]
[{"$f":"IF(COUNTRY_INFO!A22=0,\" \",COUNTRY_INFO!A22)","v":"Togo"},{"$f":"IF(COUNTRY_INFO!B22=0,\" \",COUNTRY_INFO!B22)","v":"LOME-COMMUNE"},{"$f":"IF(COUNTRY_INFO!C22=0,\" \",COUNTRY_INFO!C22)","v":"DISTRICT N°2"},{"$f":"IF(COUNTRY_INFO!$T$9:$T$1000=\"MDA3 (IVM)\", COUNTRY_INFO!$T$9:$T$1000, \" \")","v":" "},null,null,null,null,0,0,0,null,null,0,0,0,0," "," "," "]
[{"$f":"IF(COUNTRY_INFO!A23=0,\" \",COUNTRY_INFO!A23)","v":"Togo"},{"$f":"IF(COUNTRY_INFO!B23=0,\" \",COUNTRY_INFO!B23)","v":"LOME-COMMUNE"},{"$f":"IF(COUNTRY_INFO!C23=0,\" \",COUNTRY_INFO!C23)","v":"DISTRICT N°3"},{"$f":"IF(COUNTRY_INFO!$T$9:$T$1000=\"MDA3 (IVM)\", COUNTRY_INFO!$T$9:$T$1000, \" \")","v":" "},null,null,null,null,0,0,0,null,null,0,0,0,0," "," "," "]
[{"$f":"IF(COUNTRY_INFO!A24=0,\" \",COUNTRY_INFO!A24)","v":"Togo"},{"$f":"IF(COUNTRY_INFO!B24=0,\" \",COUNTRY_INFO!B24)","v":"LOME-COMMUNE"},{"$f":"IF(COUNTRY_INFO!C24=0,\" \",COUNTRY_INFO!C24)","v":"DISTRICT N°4"},{"$f":"IF(COUNTRY_INFO!$T$9:$T$1000=\"MDA3 (IVM)\", COUNTRY_INFO!$T$9:$T$1000, \" \")","v":" "},null,null,null,null,0,0,0,null,null,0,0,0,0," "," "," "]
[{"$f":"IF(COUNTRY_INFO!A25=0,\" \",COUNTRY_INFO!A25)","v":"Togo"},{"$f":"IF(COUNTRY_INFO!B25=0,\" \",COUNTRY_INFO!B25)","v":"LOME-COMMUNE"},{"$f":"IF(COUNTRY_INFO!C25=0,\" \",COUNTRY_INFO!C25)","v":"DISTRICT N°5"},{"$f":"IF(COUNTRY_INFO!$T$9:$T$1000=\"MDA3 (IVM)\", COUNTRY_INFO!$T$9:$T$1000, \" \")","v":" "},null,null,null,null,0,0,0,null,null,0,0,0,0," "," "," "]
[{"$f":"IF(COUNTRY_INFO!A26=0,\" \",COUNTRY_INFO!A26)","v":"Togo"},{"$f":"IF(COUNTRY_INFO!B26=0,\" \",COUNTRY_INFO!B26)","v":"MARITIME"},{"$f":"IF(COUNTRY_INFO!C26=0,\" \",COUNTRY_INFO!C26)","v":"AVE"},{"$f":"IF(COUNTRY_INFO!$T$9:$T$1000=\"MDA3 (IVM)\", COUNTRY_INFO!$T$9:$T$1000, \" \")","v":"MDA3 (IVM)"},"18-29 juin",{"$f":"H26*0.375","v":36553.125},{"$f":"H26*0.625","v":60921.875},97475,29164,50796,79960,null,null,0,29164,50796,79960,79.785244079678549,83.37891767119774,82.031290074378049]
[{"$f":"IF(COUNTRY_INFO!A27=0,\" \",COUNTRY_INFO!A27)","v":"Togo"},{"$f":"IF(COUNTRY_INFO!B27=0,\" \",COUNTRY_INFO!B27)","v":"MARITIME"},{"$f":"IF(COUNTRY_INFO!C27=0,\" \",COUNTRY_INFO!C27)","v":"BAS MONO"},{"$f":"IF(COUNTRY_INFO!$T$9:$T$1000=\"MDA3 (IVM)\", COUNTRY_INFO!$T$9:$T$1000, \" \")","v":"MDA3 (IVM)"},"18-29 juin",7294.125,12156.875,19451,6013,10872,16885,null,null,0,6013,10872,16885,82.436207221565311,89.430877589841145,86.807876201737699]
[{"$f":"IF(COUNTRY_INFO!A28=0,\" \",COUNTRY_INFO!A28)","v":"Togo"},{"$f":"IF(COUNTRY_INFO!B28=0,\" \",COUNTRY_INFO!B28)","v":"MARITIME"},{"$f":"IF(COUNTRY_INFO!C28=0,\" \",COUNTRY_INFO!C28)","v":"GOLFE"},{"$f":"IF(COUNTRY_INFO!$T$9:$T$1000=\"MDA3 (IVM)\", COUNTRY_INFO!$T$9:$T$1000, \" \")","v":" "},null,null,null,null,0,0,0,null,null,0,0,0,0," "," "," "]
[{"$f":"IF(COUNTRY_INFO!A29=0,\" \",COUNTRY_INFO!A29)","v":"Togo"},{"$f":"IF(COUNTRY_INFO!B29=0,\" \",COUNTRY_INFO!B29)","v":"MARITIME"},{"$f":"IF(COUNTRY_INFO!C29=0,\" \",COUNTRY_INFO!C29)","v":"LACS"},{"$f":"IF(COUNTRY_INFO!$T$9:$T$1000=\"MDA3 (IVM)\", COUNTRY_INFO!$T$9:$T$1000, \" \")","v":" "},null,null,null,null,0,0,0,null,null,0,0,0,0," "," "," "]
[{"$f":"IF(COUNTRY_INFO!A30=0,\" \",COUNTRY_INFO!A30)","v":"Togo"},{"$f":"IF(COUNTRY_INFO!B30=0,\" \",COUNTRY_INFO!B30)","v":"MARITIME"},{"$f":"IF(COUNTRY_INFO!C30=0,\" \",COUNTRY_INFO!C30)","v":"VO"},{"$f":"IF(COUNTRY_INFO!$T$9:$T$1000=\"MDA3 (IVM)\", COUNTRY_INFO!$T$9:$T$1000, \" \")","v":" "},null,null,null,null,0,0,0,null,null,0,0,0,0," "," "," "]
[{"$f":"IF(COUNTRY_INFO!A31=0,\" \",COUNTRY_INFO!A31)","v":"Togo"},{"$f":"IF(COUNTRY_INFO!B31=0,\" \",COUNTRY_INFO!B31)","v":"MARITIME"},{"$f":"IF(COUNTRY_INFO!C31=0,\" \",COUNTRY_INFO!C31)","v":"YOTO"},{"$f":"IF(COUNTRY_INFO!$T$9:$T$1000=\"MDA3 (IVM)\", COUNTRY_INFO!$T$9:$T$1000, \" \")","v":"MDA3 (IVM)"},"18-29 juin",{"$f":"H31*0.375","v":62422.125},{"$f":"H31*0.625","v":104036.875},166459,54843,79172,134015,null,null,0,54843,79172,134015,87.858271406172094,76.099940525895278,80.509314605999066]
[{"$f":"IF(COUNTRY_INFO!A32=0,\" \",COUNTRY_INFO!A32)","v":"Togo"},{"$f":"IF(COUNTRY_INFO!B32=0,\" \",COUNTRY_INFO!B32)","v":"MARITIME"},{"$f":"IF(COUNTRY_INFO!C32=0,\" \",COUNTRY_INFO!C32)","v":"ZIO"},{"$f":"IF(COUNTRY_INFO!$T$9:$T$1000=\"MDA3 (IVM)\", COUNTRY_INFO!$T$9:$T$1000, \" \")","v":"MDA3 (IVM)"},"18-29 juin",94918.875,158198.125,253117,76099,133605,209704,null,null,0,76099,133605,209704,80.172673770101042,84.454224726114802,82.84864311760964]
[{"$f":"IF(COUNTRY_INFO!A33=0,\" \",COUNTRY_INFO!A33)","v":"Togo"},{"$f":"IF(COUNTRY_INFO!B33=0,\" \",COUNTRY_INFO!B33)","v":"PLATEAUX"},{"$f":"IF(COUNTRY_INFO!C33=0,\" \",COUNTRY_INFO!C33)","v":"AGOU"},{"$f":"IF(COUNTRY_INFO!$T$9:$T$1000=\"MDA3 (IVM)\", COUNTRY_INFO!$T$9:$T$1000, \" \")","v":"MDA3 (IVM)"},"18-29 juin",28746.375,47910.625,76657,23093,39564,62657,null,null,0,23093,39564,62657,80.333607280918031,82.578759930599944,81.736827686969221]
[{"$f":"IF(COUNTRY_INFO!A34=0,\" \",COUNTRY_INFO!A34)","v":"Togo"},{"$f":"IF(COUNTRY_INFO!B34=0,\" \",COUNTRY_INFO!B34)","v":"PLATEAUX"},{"$f":"IF(COUNTRY_INFO!C34=0,\" \",COUNTRY_INFO!C34)","v":"AKEBOU"},{"$f":"IF(COUNTRY_INFO!$T$9:$T$1000=\"MDA3 (IVM)\", COUNTRY_INFO!$T$9:$T$1000, \" \")","v":"MDA3 (IVM)"},"18-29 juin",25459.5,42432.5,67892,20576,34684,55260,null,null,0,20576,34684,55260,80.818554959838167,81.739232899310664,81.393978672008487]
[{"$f":"IF(COUNTRY_INFO!A35=0,\" \",COUNTRY_INFO!A35)","v":"Togo"},{"$f":"IF(COUNTRY_INFO!B35=0,\" \",COUNTRY_INFO!B35)","v":"PLATEAUX"},{"$f":"IF(COUNTRY_INFO!C35=0,\" \",COUNTRY_INFO!C35)","v":"AMOU"},{"$f":"IF(COUNTRY_INFO!$T$9:$T$1000=\"MDA3 (IVM)\", COUNTRY_INFO!$T$9:$T$1000, \" \")","v":"MDA3 (IVM)"},"18-29 juin",41327.625,68879.375,110207,33561,58739,92300,34421,59809,94230,34421,59809,94230,83.28811539496887,86.831507980436811,85.502735760886324]
[{"$f":"IF(COUNTRY_INFO!A36=0,\" \",COUNTRY_INFO!A36)","v":"Togo"},{"$f":"IF(COUNTRY_INFO!B36=0,\" \",COUNTRY_INFO!B36)","v":"PLATEAUX"},{"$f":"IF(COUNTRY_INFO!C36=0,\" \",COUNTRY_INFO!C36)","v":"ANIE"},{"$f":"IF(COUNTRY_INFO!$T$9:$T$1000=\"MDA3 (IVM)\", COUNTRY_INFO!$T$9:$T$1000, \" \")","v":"MDA3 (IVM)"},"18-29 juin",42412.5,70687.5,113100,37077,56817,93894,null,null,0,37077,56817,93894,87.419982316534046,80.377718832891247,83.018567639257284]
[{"$f":"IF(COUNTRY_INFO!A37=0,\" \",COUNTRY_INFO!A37)","v":"Togo"},{"$f":"IF(COUNTRY_INFO!B37=0,\" \",COUNTRY_INFO!B37)","v":"PLATEAUX"},{"$f":"IF(COUNTRY_INFO!C37=0,\" \",COUNTRY_INFO!C37)","v":"DANYI"},{"$f":"IF(COUNTRY_INFO!$T$9:$T$1000=\"MDA3 (IVM)\", COUNTRY_INFO!$T$9:$T$1000, \" \")","v":"MDA3 (IVM)"},"18-29 juin",13386,22310,35696,10190,19646,29836,10372,20209,30581,10372,20209,30581,77.483938443149555,90.582698341550866,85.670663379650378]
[{"$f":"IF(COUNTRY_INFO!A38=0,\" \",COUNTRY_INFO!A38)","v":"Togo"},{"$f":"IF(COUNTRY_INFO!B38=0,\" \",COUNTRY_INFO!B38)","v":"PLATEAUX"},{"$f":"IF(COUNTRY_INFO!C38=0,\" \",COUNTRY_INFO!C38)","v":"EST MONO"},{"$f":"IF(COUNTRY_INFO!$T$9:$T$1000=\"MDA3 (IVM)\", COUNTRY_INFO!$T$9:$T$1000, \" \")","v":"MDA3 (IVM)"},"18-29 juin",44647.875,74413.125,119061,37343,60383,97726,null,null,{"$f":"SUM(L38:M38)","v":0},{"$f":"MAX(I38,L38)","v":37343},{"$f":"MAX(J38,M38)","v":60383},97726,{"$f":"IF(F38<>0, IF(MAX(I38,L38)/F38*100=0, \"-\", MAX(I38,L38)/F38*100), \" \")","v":83.638918985506024},{"$f":"IF(G38<>0, IF(MAX(J38,M38)/G38*100=0, \"-\", MAX(J38,M38)/G38*100), \" \")","v":81.145631231049634},{"$f":"IF(H38<>0, IF((MAX(I38,L38)+MAX(J38,M38))/H38*100=0, \"-\",(MAX(I38,L38)+MAX(J38,M38))/H38*100), \" \")","v":82.080614138970773}]
[{"$f":"IF(COUNTRY_INFO!A39=0,\" \",COUNTRY_INFO!A39)","v":"Togo"},{"$f":"IF(COUNTRY_INFO!B39=0,\" \",COUNTRY_INFO!B39)","v":"PLATEAUX"},{"$f":"IF(COUNTRY_INFO!C39=0,\" \",COUNTRY_INFO!C39)","v":"HAHO"},{"$f":"IF(COUNTRY_INFO!$T$9:$T$1000=\"MDA3 (IVM)\", COUNTRY_INFO!$T$9:$T$1000, \" \")","v":"MDA3 (IVM)"},"18-29 juin",91113.75,151856.25,242970,78136,115927,194063,79724,118070,197794,79724,118070,197794,87.499416937619188,77.751162694982924,81.406758035971521]
[{"$f":"IF(COUNTRY_INFO!A40=0,\" \",COUNTRY_INFO!A40)","v":"Togo"},{"$f":"IF(COUNTRY_INFO!B40=0,\" \",COUNTRY_INFO!B40)","v":"PLATEAUX"},{"$f":"IF(COUNTRY_INFO!C40=0,\" \",COUNTRY_INFO!C40)","v":"KLOTO"},{"$f":"IF(COUNTRY_INFO!$T$9:$T$1000=\"MDA3 (IVM)\", COUNTRY_INFO!$T$9:$T$1000, \" \")","v":"MDA3 (IVM)"},"18-29 juin",21434.625,35724.375,57159,16796,32529,49325,null,null,0,16796,32529,49325,78.359196860220322,91.055476827796141,86.294371839955204]
[{"$f":"IF(COUNTRY_INFO!A41=0,\" \",COUNTRY_INFO!A41)","v":"Togo"},{"$f":"IF(COUNTRY_INFO!B41=0,\" \",COUNTRY_INFO!B41)","v":"PLATEAUX"},{"$f":"IF(COUNTRY_INFO!C41=0,\" \",COUNTRY_INFO!C41)","v":"KPELE"},{"$f":"IF(COUNTRY_INFO!$T$9:$T$1000=\"MDA3 (IVM)\", COUNTRY_INFO!$T$9:$T$1000, \" \")","v":"MDA3 (IVM)"},"18-29 juin",24205.5,40342.5,64548,19993,35355,55348,null,null,0,19993,35355,55348,82.596930449691186,87.637107269009107,85.747040961764881]
[{"$f":"IF(COUNTRY_INFO!A42=0,\" \",COUNTRY_INFO!A42)","v":"Togo"},{"$f":"IF(COUNTRY_INFO!B42=0,\" \",COUNTRY_INFO!B42)","v":"PLATEAUX"},{"$f":"IF(COUNTRY_INFO!C42=0,\" \",COUNTRY_INFO!C42)","v":"MOYEN MONO"},{"$f":"IF(COUNTRY_INFO!$T$9:$T$1000=\"MDA3 (IVM)\", COUNTRY_INFO!$T$9:$T$1000, \" \")","v":"MDA3 (IVM)"},"18-29 juin",20973.75,34956.25,55930,17928,28006,45934,null,null,0,17928,28006,45934,85.478276416949768,80.117289468979081,82.127659574468083]
[{"$f":"IF(COUNTRY_INFO!A43=0,\" \",COUNTRY_INFO!A43)","v":"Togo"},{"$f":"IF(COUNTRY_INFO!B43=0,\" \",COUNTRY_INFO!B43)","v":"PLATEAUX"},{"$f":"IF(COUNTRY_INFO!C43=0,\" \",COUNTRY_INFO!C43)","v":"OGOU"},{"$f":"IF(COUNTRY_INFO!$T$9:$T$1000=\"MDA3 (IVM)\", COUNTRY_INFO!$T$9:$T$1000, \" \")","v":"MDA3 (IVM)"},"18-29 juin",46535.25,77558.75,124094,40325,62306,102631,40667,64367,{"$f":"SUM(L43:M43)","v":105034},{"$f":"MAX(I43,L43)","v":40667},{"$f":"MAX(J43,M43)","v":64367},105034,{"$f":"IF(F43<>0, IF(MAX(I43,L43)/F43*100=0, \"-\", MAX(I43,L43)/F43*100), \" \")","v":87.389666972886147},{"$f":"IF(G43<>0, IF(MAX(J43,M43)/G43*100=0, \"-\", MAX(J43,M43)/G43*100), \" \")","v":82.991280803262043},{"$f":"IF(H43<>0, IF((MAX(I43,L43)+MAX(J43,M43))/H43*100=0, \"-\",(MAX(I43,L43)+MAX(J43,M43))/H43*100), \" \")","v":84.640675616871093}]
[{"$f":"IF(COUNTRY_INFO!A44=0,\" \",COUNTRY_INFO!A44)","v":"Togo"},{"$f":"IF(COUNTRY_INFO!B44=0,\" \",COUNTRY_INFO!B44)","v":"PLATEAUX"},{"$f":"IF(COUNTRY_INFO!C44=0,\" \",COUNTRY_INFO!C44)","v":"WAWA"},{"$f":"IF(COUNTRY_INFO!$T$9:$T$1000=\"MDA3 (IVM)\", COUNTRY_INFO!$T$9:$T$1000, \" \")","v":"MDA3 (IVM)"},"18-29 juin",37544.625,62574.375,100119,31571,52442,84013,null,null,0,31571,52442,84013,84.089267105477816,83.807469111757001,83.913143359402312]
[{"$f":"IF(COUNTRY_INFO!A45=0,\" \",COUNTRY_INFO!A45)","v":"Togo"},{"$f":"IF(COUNTRY_INFO!B45=0,\" \",COUNTRY_INFO!B45)","v":"SAVANES"},{"$f":"IF(COUNTRY_INFO!C45=0,\" \",COUNTRY_INFO!C45)","v":"CINKASSE"},{"$f":"IF(COUNTRY_INFO!$T$9:$T$1000=\"MDA3 (IVM)\", COUNTRY_INFO!$T$9:$T$1000, \" \")","v":"MDA3 (IVM)"},"18-29 juin",24218.625,40364.375,64583,21155,32922,54077,null,null,0,21155,32922,54077,87.3501282587265,81.562020965269497,83.732561200315871]
[{"$f":"IF(COUNTRY_INFO!A46=0,\" \",COUNTRY_INFO!A46)","v":"Togo"},{"$f":"IF(COUNTRY_INFO!B46=0,\" \",COUNTRY_INFO!B46)","v":"SAVANES"},{"$f":"IF(COUNTRY_INFO!C46=0,\" \",COUNTRY_INFO!C46)","v":"KPENDJAL"},{"$f":"IF(COUNTRY_INFO!$T$9:$T$1000=\"MDA3 (IVM)\", COUNTRY_INFO!$T$9:$T$1000, \" \")","v":"MDA3 (IVM)"},"18-29 juin",73017,121695,194712,67578,95562,163140,69666,94353,164019,69666,95562,165228,95.410657792021041,78.525822753605325,84.857635893011221]
[{"$f":"IF(COUNTRY_INFO!A47=0,\" \",COUNTRY_INFO!A47)","v":"Togo"},{"$f":"IF(COUNTRY_INFO!B47=0,\" \",COUNTRY_INFO!B47)","v":"SAVANES"},{"$f":"IF(COUNTRY_INFO!C47=0,\" \",COUNTRY_INFO!C47)","v":"OTI"},{"$f":"IF(COUNTRY_INFO!$T$9:$T$1000=\"MDA3 (IVM)\", COUNTRY_INFO!$T$9:$T$1000, \" \")","v":"MDA3 (IVM)"},"18-29 juin",69355.5,115592.5,184948,60638,92907,153545,60967,91316,152283,60967,92907,153874,87.905068812134573,80.374591777148169,83.198520665268077]
[{"$f":"IF(COUNTRY_INFO!A48=0,\" \",COUNTRY_INFO!A48)","v":"Togo"},{"$f":"IF(COUNTRY_INFO!B48=0,\" \",COUNTRY_INFO!B48)","v":"SAVANES"},{"$f":"IF(COUNTRY_INFO!C48=0,\" \",COUNTRY_INFO!C48)","v":"TANDJOARE"},{"$f":"IF(COUNTRY_INFO!$T$9:$T$1000=\"MDA3 (IVM)\", COUNTRY_INFO!$T$9:$T$1000, \" \")","v":"MDA3 (IVM)"},"18-29 juin",55057.875,91763.125,146821,47479,76228,123707,null,null,0,47479,76228,123707,86.234712109757226,83.070405459709434,84.257020453477367]
[{"$f":"IF(COUNTRY_INFO!A49=0,\" \",COUNTRY_INFO!A49)","v":"Togo"},{"$f":"IF(COUNTRY_INFO!B49=0,\" \",COUNTRY_INFO!B49)","v":"SAVANES"},{"$f":"IF(COUNTRY_INFO!C49=0,\" \",COUNTRY_INFO!C49)","v":"TONE"},{"$f":"IF(COUNTRY_INFO!$T$9:$T$1000=\"MDA3 (IVM)\", COUNTRY_INFO!$T$9:$T$1000, \" \")","v":"MDA3 (IVM)"},"18-29 juin",97790.25,162983.75,260774,87399,130863,218262,null,null,0,87399,130863,218262,89.373940653592769,80.292053655655863,83.697761279882201]

{"sheet":"T1","index":5,"n_rows":49,"n_cols":19,"rows_kept":49,"cut":false,"hidden":false,"merged":[[5,6,5,10],[5,11,5,14],[5,15,5,18],[3,0,3,2],[5,0,5,2],[5,3,6,3],[5,5,6,5],[5,4,6,4]]}
["T 1 - Praziquantel (PZQ) et Albendazole (ALB) ou Mebendazole (MBD)"]
["Structure administrative, population nécessitant une chimioprévention par groupe d'âge, population traitée par groupe d'âge et couverture"]
[]
["TOTAL",null,null,null,null,null,{"$f":"SUM(G$9:G$1000)","v":0},326577,146222.5,0,{"$f":"SUM(K$9:K$1000)","v":326577},0,119297,0,119297,{"$f":"IF(G4<>0, IF(L4/G4*100=0, \"-\", L4/G4*100), \" \")","v":" "},{"$f":"IF(OR(I4<>0,H4<>0), IF(M4/MAX(H4,I4)*100=0, \"-\", M4/MAX(H4,I4)*100), \" \")","v":36.529516775523078},{"$f":"IF(J4<>0, IF(N4/J4*100=0, \"-\", N4/J4*100), \" \")","v":" "},{"$f":"IF(K4<>0, IF(O4/K4*100=0, \"-\", O4/K4*100), \" \")","v":36.529516775523078}]
[]
["Structure administrative du pays",null,null,"Mise en oeuvre \nde la CP","Médica-ment","Date","Population ciblée pour T1",null,null,null,null,"Population traitée",null,null,null,"Couverture du Programme (%)"]
["Pays","Région/Département","District",null,null,null,"EAPréS (ALB)","EAS (ALB)","EAS (PZQ)","Adultes (PZQ)","Total","EAPréS","EAS","Adultes","Total","EAPréS","EAS","Adultes","Total"]
[]
[{"$f":"IF(COUNTRY_INFO!A9=0,\" \",COUNTRY_INFO!A9)","v":"Togo"},{"$f":"IF(COUNTRY_INFO!B9=0,\" \",COUNTRY_INFO!B9)","v":"CENTRALE"},{"$f":"IF(COUNTRY_INFO!C9=0,\" \",COUNTRY_INFO!C9)","v":"BLITTA"},{"$f":"IF(OR(COUNTRY_INFO!$T$9:$T$1000=\"T1 (PZQ+ALB/MBD)\",COUNTRY_INFO!$U$9:$U$1000=\"T1 (PZQ+ALB/MBD)\"), \"T1 (PZQ+ALB/MBD)\", \" \")","v":"T1 (PZQ+ALB/MBD)"},"PZQ+ALB","18-29 juin 2019",null,50706,35731,null,{"$f":"MAX(H9:I9)+G9+J9","v":50706},null,27328,0,{"$f":"SUM(L9:N9)","v":27328},{"$f":"IF(G9<>0, IF(L9/G9*100=0, \"-\", L9/G9*100), \" \")","v":" "},{"$f":"IF(OR(I9<>0,H9<>0), IF(M9/MAX(H9,I9)*100=0, \"-\", M9/MAX(H9,I9)*100), \" \")","v":53.895002563799153},{"$f":"IF(J9<>0, IF(N9/J9*100=0, \"-\", N9/J9*100), \" \")","v":" "},{"$f":"IF(K9<>0, IF(O9/K9*100=0, \"-\", O9/K9*100), \" \")","v":53.895002563799153}]
[{"$f":"IF(COUNTRY_INFO!A10=0,\" \",COUNTRY_INFO!A10)","v":"Togo"},{"$f":"IF(COUNTRY_INFO!B10=0,\" \",COUNTRY_INFO!B10)","v":"CENTRALE"},{"$f":"IF(COUNTRY_INFO!C10=0,\" \",COUNTRY_INFO!C10)","v":"MÔ"},{"$f":"IF(OR(COUNTRY_INFO!$T$9:$T$1000=\"T1 (PZQ+ALB/MBD)\",COUNTRY_INFO!$U$9:$U$1000=\"T1 (PZQ+ALB/MBD)\"), \"T1 (PZQ+ALB/MBD)\", \" \")","v":" "},null,null,null,null,0,0,{"$f":"MAX(H10:I10)+G10+J10","v":0},null,null,null,{"$f":"SUM(L10:N10)","v":0},{"$f":"IF(G10<>0, IF(L10/G10*100=0, \"-\", L10/G10*100), \" \")","v":" "},{"$f":"IF(OR(I10<>0,H10<>0), IF(M10/MAX(H10,I10)*100=0, \"-\", M10/MAX(H10,I10)*100), \" \")","v":" "},{"$f":"IF(J10<>0, IF(N10/J10*100=0, \"-\", N10/J10*100), \" \")","v":" "},{"$f":"IF(K10<>0, IF(O10/K10*100=0, \"-\", O10/K10*100), \" \")","v":" "}]
[{"$f":"IF(COUNTRY_INFO!A11=0,\" \",COUNTRY_INFO!A11)","v":"Togo"},{"$f":"IF(COUNTRY_INFO!B11=0,\" \",COUNTRY_INFO!B11)","v":"CENTRALE"},{"$f":"IF(COUNTRY_INFO!C11=0,\" \",COUNTRY_INFO!C11)","v":"SOTOUBOUA"},{"$f":"IF(OR(COUNTRY_INFO!$T$9:$T$1000=\"T1 (PZQ+ALB/MBD)\",COUNTRY_INFO!$U$9:$U$1000=\"T1 (PZQ+ALB/MBD)\"), \"T1 (PZQ+ALB/MBD)\", \" \")","v":" "},null,null,null,null,0,0,0,null,null,null,0," "," "," "," "]
[{"$f":"IF(COUNTRY_INFO!A12=0,\" \",COUNTRY_INFO!A12)","v":"Togo"},{"$f":"IF(COUNTRY_INFO!B12=0,\" \",COUNTRY_INFO!B12)","v":"CENTRALE"},{"$f":"IF(COUNTRY_INFO!C12=0,\" \",COUNTRY_INFO!C12)","v":"TCHAMBA"},{"$f":"IF(OR(COUNTRY_INFO!$T$9:$T$1000=\"T1 (PZQ+ALB/MBD)\",COUNTRY_INFO!$U$9:$U$1000=\"T1 (PZQ+ALB/MBD)\"), \"T1 (PZQ+ALB/MBD)\", \" \")","v":" "},null,null,null,null,0,0,0,null,null,null,0," "," "," "," "]
[{"$f":"IF(COUNTRY_INFO!A13=0,\" \",COUNTRY_INFO!A13)","v":"Togo"},{"$f":"IF(COUNTRY_INFO!B13=0,\" \",COUNTRY_INFO!B13)","v":"CENTRALE"},{"$f":"IF(COUNTRY_INFO!C13=0,\" \",COUNTRY_INFO!C13)","v":"TCHAOUDJO"},{"$f":"IF(OR(COUNTRY_INFO!$T$9:$T$1000=\"T1 (PZQ+ALB/MBD)\",COUNTRY_INFO!$U$9:$U$1000=\"T1 (PZQ+ALB/MBD)\"), \"T1 (PZQ+ALB/MBD)\", \" \")","v":" "},null,null,null,null,null,null,0,null,0,0,0," "," "," "," "]
[{"$f":"IF(COUNTRY_INFO!A14=0,\" \",COUNTRY_INFO!A14)","v":"Togo"},{"$f":"IF(COUNTRY_INFO!B14=0,\" \",COUNTRY_INFO!B14)","v":"KARA"},{"$f":"IF(COUNTRY_INFO!C14=0,\" \",COUNTRY_INFO!C14)","v":"ASSOLI"},{"$f":"IF(OR(COUNTRY_INFO!$T$9:$T$1000=\"T1 (PZQ+ALB/MBD)\",COUNTRY_INFO!$U$9:$U$1000=\"T1 (PZQ+ALB/MBD)\"), \"T1 (PZQ+ALB/MBD)\", \" \")","v":" "},null,null,null,null,null,null,0,null,0,0,0," "," "," "," "]
[{"$f":"IF(COUNTRY_INFO!A15=0,\" \",COUNTRY_INFO!A15)","v":"Togo"},{"$f":"IF(COUNTRY_INFO!B15=0,\" \",COUNTRY_INFO!B15)","v":"KARA"},{"$f":"IF(COUNTRY_INFO!C15=0,\" \",COUNTRY_INFO!C15)","v":"BASSAR"},{"$f":"IF(OR(COUNTRY_INFO!$T$9:$T$1000=\"T1 (PZQ+ALB/MBD)\",COUNTRY_INFO!$U$9:$U$1000=\"T1 (PZQ+ALB/MBD)\"), \"T1 (PZQ+ALB/MBD)\", \" \")","v":" "},null,null,null,null,null,null,0,null,0,0,0," "," "," "," "]
[{"$f":"IF(COUNTRY_INFO!A16=0,\" \",COUNTRY_INFO!A16)","v":"Togo"},{"$f":"IF(COUNTRY_INFO!B16=0,\" \",COUNTRY_INFO!B16)","v":"KARA"},{"$f":"IF(COUNTRY_INFO!C16=0,\" \",COUNTRY_INFO!C16)","v":"BINAH"},{"$f":"IF(OR(COUNTRY_INFO!$T$9:$T$1000=\"T1 (PZQ+ALB/MBD)\",COUNTRY_INFO!$U$9:$U$1000=\"T1 (PZQ+ALB/MBD)\"), \"T1 (PZQ+ALB/MBD)\", \" \")","v":" "},null,null,null,null,null,null,0,null,0,0,0," "," "," "," "]
[{"$f":"IF(COUNTRY_INFO!A17=0,\" \",COUNTRY_INFO!A17)","v":"Togo"},{"$f":"IF(COUNTRY_INFO!B17=0,\" \",COUNTRY_INFO!B17)","v":"KARA"},{"$f":"IF(COUNTRY_INFO!C17=0,\" \",COUNTRY_INFO!C17)","v":"DANKPEN"},{"$f":"IF(OR(COUNTRY_INFO!$T$9:$T$1000=\"T1 (PZQ+ALB/MBD)\",COUNTRY_INFO!$U$9:$U$1000=\"T1 (PZQ+ALB/MBD)\"), \"T1 (PZQ+ALB/MBD)\", \" \")","v":" "},null,null,null,null,null,null,0,null,0,null,0," "," "," "," "]
[{"$f":"IF(COUNTRY_INFO!A18=0,\" \",COUNTRY_INFO!A18)","v":"Togo"},{"$f":"IF(COUNTRY_INFO!B18=0,\" \",COUNTRY_INFO!B18)","v":"KARA"},{"$f":"IF(COUNTRY_INFO!C18=0,\" \",COUNTRY_INFO!C18)","v":"DOULFELGOU"},{"$f":"IF(OR(COUNTRY_INFO!$T$9:$T$1000=\"T1 (PZQ+ALB/MBD)\",COUNTRY_INFO!$U$9:$U$1000=\"T1 (PZQ+ALB/MBD)\"), \"T1 (PZQ+ALB/MBD)\", \" \")","v":" "},null,null,null,null,null,null,0,null,0,0,0," "," "," "," "]
[{"$f":"IF(COUNTRY_INFO!A19=0,\" \",COUNTRY_INFO!A19)","v":"Togo"},{"$f":"IF(COUNTRY_INFO!B19=0,\" \",COUNTRY_INFO!B19)","v":"KARA"},{"$f":"IF(COUNTRY_INFO!C19=0,\" \",COUNTRY_INFO!C19)","v":"KERAN"},{"$f":"IF(OR(COUNTRY_INFO!$T$9:$T$1000=\"T1 (PZQ+ALB/MBD)\",COUNTRY_INFO!$U$9:$U$1000=\"T1 (PZQ+ALB/MBD)\"), \"T1 (PZQ+ALB/MBD)\", \" \")","v":" "},null,null,null,null,null,null,0,null,0,0,0," "," "," "," "]
[{"$f":"IF(COUNTRY_INFO!A20=0,\" \",COUNTRY_INFO!A20)","v":"Togo"},{"$f":"IF(COUNTRY_INFO!B20=0,\" \",COUNTRY_INFO!B20)","v":"KARA"},{"$f":"IF(COUNTRY_INFO!C20=0,\" \",COUNTRY_INFO!C20)","v":"KOZAH"},{"$f":"IF(OR(COUNTRY_INFO!$T$9:$T$1000=\"T1 (PZQ+ALB/MBD)\",COUNTRY_INFO!$U$9:$U$1000=\"T1 (PZQ+ALB/MBD)\"), \"T1 (PZQ+ALB/MBD)\", \" \")","v":" "},null,null,null,null,null,null,0,null,0,0,0," "," "," "," "]
[{"$f":"IF(COUNTRY_INFO!A21=0,\" \",COUNTRY_INFO!A21)","v":"Togo"},{"$f":"IF(COUNTRY_INFO!B21=0,\" \",COUNTRY_INFO!B21)","v":"LOME-COMMUNE"},{"$f":"IF(COUNTRY_INFO!C21=0,\" \",COUNTRY_INFO!C21)","v":"DISTRICT N°1"},{"$f":"IF(OR(COUNTRY_INFO!$T$9:$T$1000=\"T1 (PZQ+ALB/MBD)\",COUNTRY_INFO!$U$9:$U$1000=\"T1 (PZQ+ALB/MBD)\"), \"T1 (PZQ+ALB/MBD)\", \" \")","v":" "},null,null,null,null,null,null,0,null,null,null,0," "," "," "," "]
[{"$f":"IF(COUNTRY_INFO!A22=0,\" \",COUNTRY_INFO!A22)","v":"Togo"},{"$f":"IF(COUNTRY_INFO!B22=0,\" \",COUNTRY_INFO!B22)","v":"LOME-COMMUNE"},{"$f":"IF(COUNTRY_INFO!C22=0,\" \",COUNTRY_INFO!C22)","v":"DISTRICT N°2"},{"$f":"IF(OR(COUNTRY_INFO!$T$9:$T$1000=\"T1 (PZQ+ALB/MBD)\",COUNTRY_INFO!$U$9:$U$1000=\"T1 (PZQ+ALB/MBD)\"), \"T1 (PZQ+ALB/MBD)\", \" \")","v":" "},null,null,null,null,null,null,0,null,null,null,0," "," "," "," "]
[{"$f":"IF(COUNTRY_INFO!A23=0,\" \",COUNTRY_INFO!A23)","v":"Togo"},{"$f":"IF(COUNTRY_INFO!B23=0,\" \",COUNTRY_INFO!B23)","v":"LOME-COMMUNE"},{"$f":"IF(COUNTRY_INFO!C23=0,\" \",COUNTRY_INFO!C23)","v":"DISTRICT N°3"},{"$f":"IF(OR(COUNTRY_INFO!$T$9:$T$1000=\"T1 (PZQ+ALB/MBD)\",COUNTRY_INFO!$U$9:$U$1000=\"T1 (PZQ+ALB/MBD)\"), \"T1 (PZQ+ALB/MBD)\", \" \")","v":" "},null,null,null,null,null,null,0,null,null,null,0," "," "," "," "]
[{"$f":"IF(COUNTRY_INFO!A24=0,\" \",COUNTRY_INFO!A24)","v":"Togo"},{"$f":"IF(COUNTRY_INFO!B24=0,\" \",COUNTRY_INFO!B24)","v":"LOME-COMMUNE"},{"$f":"IF(COUNTRY_INFO!C24=0,\" \",COUNTRY_INFO!C24)","v":"DISTRICT N°4"},{"$f":"IF(OR(COUNTRY_INFO!$T$9:$T$1000=\"T1 (PZQ+ALB/MBD)\",COUNTRY_INFO!$U$9:$U$1000=\"T1 (PZQ+ALB/MBD)\"), \"T1 (PZQ+ALB/MBD)\", \" \")","v":" "},null,null,null,null,null,null,0,null,null,null,0," "," "," "," "]
[{"$f":"IF(COUNTRY_INFO!A25=0,\" \",COUNTRY_INFO!A25)","v":"Togo"},{"$f":"IF(COUNTRY_INFO!B25=0,\" \",COUNTRY_INFO!B25)","v":"LOME-COMMUNE"},{"$f":"IF(COUNTRY_INFO!C25=0,\" \",COUNTRY_INFO!C25)","v":"DISTRICT N°5"},{"$f":"IF(OR(COUNTRY_INFO!$T$9:$T$1000=\"T1 (PZQ+ALB/MBD)\",COUNTRY_INFO!$U$9:$U$1000=\"T1 (PZQ+ALB/MBD)\"), \"T1 (PZQ+ALB/MBD)\", \" \")","v":" "},null,null,null,null,null,null,0,null,null,null,0," "," "," "," "]
[{"$f":"IF(COUNTRY_INFO!A26=0,\" \",COUNTRY_INFO!A26)","v":"Togo"},{"$f":"IF(COUNTRY_INFO!B26=0,\" \",COUNTRY_INFO!B26)","v":"MARITIME"},{"$f":"IF(COUNTRY_INFO!C26=0,\" \",COUNTRY_INFO!C26)","v":"AVE"},{"$f":"IF(OR(COUNTRY_INFO!$T$9:$T$1000=\"T1 (PZQ+ALB/MBD)\",COUNTRY_INFO!$U$9:$U$1000=\"T1 (PZQ+ALB/MBD)\"), \"T1 (PZQ+ALB/MBD)\", \" \")","v":" "},null,null,null,null,null,null,0,null,0,0,0," "," "," "," "]
[{"$f":"IF(COUNTRY_INFO!A27=0,\" \",COUNTRY_INFO!A27)","v":"Togo"},{"$f":"IF(COUNTRY_INFO!B27=0,\" \",COUNTRY_INFO!B27)","v":"MARITIME"},{"$f":"IF(COUNTRY_INFO!C27=0,\" \",COUNTRY_INFO!C27)","v":"BAS MONO"},{"$f":"IF(OR(COUNTRY_INFO!$T$9:$T$1000=\"T1 (PZQ+ALB/MBD)\",COUNTRY_INFO!$U$9:$U$1000=\"T1 (PZQ+ALB/MBD)\"), \"T1 (PZQ+ALB/MBD)\", \" \")","v":"T1 (PZQ+ALB/MBD)"},"PZQ+ALB","18-29 juin 2019",null,32572,23461,0,32572,null,18683,0,18683," ",57.359081419624211," ",57.359081419624211]
[{"$f":"IF(COUNTRY_INFO!A28=0,\" \",COUNTRY_INFO!A28)","v":"Togo"},{"$f":"IF(COUNTRY_INFO!B28=0,\" \",COUNTRY_INFO!B28)","v":"MARITIME"},{"$f":"IF(COUNTRY_INFO!C28=0,\" \",COUNTRY_INFO!C28)","v":"GOLFE"},{"$f":"IF(OR(COUNTRY_INFO!$T$9:$T$1000=\"T1 (PZQ+ALB/MBD)\",COUNTRY_INFO!$U$9:$U$1000=\"T1 (PZQ+ALB/MBD)\"), \"T1 (PZQ+ALB/MBD)\", \" \")","v":" "},null,null,null,null,null,null,0,null,0,0,0," "," "," "," "]
[{"$f":"IF(COUNTRY_INFO!A29=0,\" \",COUNTRY_INFO!A29)","v":"Togo"},{"$f":"IF(COUNTRY_INFO!B29=0,\" \",COUNTRY_INFO!B29)","v":"MARITIME"},{"$f":"IF(COUNTRY_INFO!C29=0,\" \",COUNTRY_INFO!C29)","v":"LACS"},{"$f":"IF(OR(COUNTRY_INFO!$T$9:$T$1000=\"T1 (PZQ+ALB/MBD)\",COUNTRY_INFO!$U$9:$U$1000=\"T1 (PZQ+ALB/MBD)\"), \"T1 (PZQ+ALB/MBD)\", \" \")","v":" "},null,null,null,null,null,null,0,null,0,0,0," "," "," "," "]
[{"$f":"IF(COUNTRY_INFO!A30=0,\" \",COUNTRY_INFO!A30)","v":"Togo"},{"$f":"IF(COUNTRY_INFO!B30=0,\" \",COUNTRY_INFO!B30)","v":"MARITIME"},{"$f":"IF(COUNTRY_INFO!C30=0,\" \",COUNTRY_INFO!C30)","v":"VO"},{"$f":"IF(OR(COUNTRY_INFO!$T$9:$T$1000=\"T1 (PZQ+ALB/MBD)\",COUNTRY_INFO!$U$9:$U$1000=\"T1 (PZQ+ALB/MBD)\"), \"T1 (PZQ+ALB/MBD)\", \" \")","v":" "},null,null,null,null,null,null,0,null,0,0,0," "," "," "," "]
[{"$f":"IF(COUNTRY_INFO!A31=0,\" \",COUNTRY_INFO!A31)","v":"Togo"},{"$f":"IF(COUNTRY_INFO!B31=0,\" \",COUNTRY_INFO!B31)","v":"MARITIME"},{"$f":"IF(COUNTRY_INFO!C31=0,\" \",COUNTRY_INFO!C31)","v":"YOTO"},{"$f":"IF(OR(COUNTRY_INFO!$T$9:$T$1000=\"T1 (PZQ+ALB/MBD)\",COUNTRY_INFO!$U$9:$U$1000=\"T1 (PZQ+ALB/MBD)\"), \"T1 (PZQ+ALB/MBD)\", \" \")","v":" "},null,null,null,null,null,null,0,null,0,0,0," "," "," "," "]
[{"$f":"IF(COUNTRY_INFO!A32=0,\" \",COUNTRY_INFO!A32)","v":"Togo"},{"$f":"IF(COUNTRY_INFO!B32=0,\" \",COUNTRY_INFO!B32)","v":"MARITIME"},{"$f":"IF(COUNTRY_INFO!C32=0,\" \",COUNTRY_INFO!C32)","v":"ZIO"},{"$f":"IF(OR(COUNTRY_INFO!$T$9:$T$1000=\"T1 (PZQ+ALB/MBD)\",COUNTRY_INFO!$U$9:$U$1000=\"T1 (PZQ+ALB/MBD)\"), \"T1 (PZQ+ALB/MBD)\", \" \")","v":"T1 (PZQ+ALB/MBD)"},"PZQ+ALB","18-29 juin 2019",null,109975,54987.5,null,109975,null,63985,0,63985," ",58.181404864741992," ",58.181404864741992]
[{"$f":"IF(COUNTRY_INFO!A33=0,\" \",COUNTRY_INFO!A33)","v":"Togo"},{"$f":"IF(COUNTRY_INFO!B33=0,\" \",COUNTRY_INFO!B33)","v":"PLATEAUX"},{"$f":"IF(COUNTRY_INFO!C33=0,\" \",COUNTRY_INFO!C33)","v":"AGOU"},{"$f":"IF(OR(COUNTRY_INFO!$T$9:$T$1000=\"T1 (PZQ+ALB/MBD)\",COUNTRY_INFO!$U$9:$U$1000=\"T1 (PZQ+ALB/MBD)\"), \"T1 (PZQ+ALB/MBD)\", \" \")","v":" "},null,null,null,null,null,null,0,null,0,0,0," "," "," "," "]
[{"$f":"IF(COUNTRY_INFO!A34=0,\" \",COUNTRY_INFO!A34)","v":"Togo"},{"$f":"IF(COUNTRY_INFO!B34=0,\" \",COUNTRY_INFO!B34)","v":"PLATEAUX"},{"$f":"IF(COUNTRY_INFO!C34=0,\" \",COUNTRY_INFO!C34)","v":"AKEBOU"},{"$f":"IF(OR(COUNTRY_INFO!$T$9:$T$1000=\"T1 (PZQ+ALB/MBD)\",COUNTRY_INFO!$U$9:$U$1000=\"T1 (PZQ+ALB/MBD)\"), \"T1 (PZQ+ALB/MBD)\", \" \")","v":" "},null,null,null,null,null,null,0,null,0,0,0," "," "," "," "]
[{"$f":"IF(COUNTRY_INFO!A35=0,\" \",COUNTRY_INFO!A35)","v":"Togo"},{"$f":"IF(COUNTRY_INFO!B35=0,\" \",COUNTRY_INFO!B35)","v":"PLATEAUX"},{"$f":"IF(COUNTRY_INFO!C35=0,\" \",COUNTRY_INFO!C35)","v":"AMOU"},{"$f":"IF(OR(COUNTRY_INFO!$T$9:$T$1000=\"T1 (PZQ+ALB/MBD)\",COUNTRY_INFO!$U$9:$U$1000=\"T1 (PZQ+ALB/MBD)\"), \"T1 (PZQ+ALB/MBD)\", \" \")","v":" "},null,null,null,null,null,null,0,null,0,0,0," "," "," "," "]
[{"$f":"IF(COUNTRY_INFO!A36=0,\" \",COUNTRY_INFO!A36)","v":"Togo"},{"$f":"IF(COUNTRY_INFO!B36=0,\" \",COUNTRY_INFO!B36)","v":"PLATEAUX"},{"$f":"IF(COUNTRY_INFO!C36=0,\" \",COUNTRY_INFO!C36)","v":"ANIE"},{"$f":"IF(OR(COUNTRY_INFO!$T$9:$T$1000=\"T1 (PZQ+ALB/MBD)\",COUNTRY_INFO!$U$9:$U$1000=\"T1 (PZQ+ALB/MBD)\"), \"T1 (PZQ+ALB/MBD)\", \" \")","v":" "},null,null,null,null,null,null,0,null,0,0,0," "," "," "," "]
[{"$f":"IF(COUNTRY_INFO!A37=0,\" \",COUNTRY_INFO!A37)","v":"Togo"},{"$f":"IF(COUNTRY_INFO!B37=0,\" \",COUNTRY_INFO!B37)","v":"PLATEAUX"},{"$f":"IF(COUNTRY_INFO!C37=0,\" \",COUNTRY_INFO!C37)","v":"DANYI"},{"$f":"IF(OR(COUNTRY_INFO!$T$9:$T$1000=\"T1 (PZQ+ALB/MBD)\",COUNTRY_INFO!$U$9:$U$1000=\"T1 (PZQ+ALB/MBD)\"), \"T1 (PZQ+ALB/MBD)\", \" \")","v":" "},null,null,null,null,null,null,0,null,0,0,0," "," "," "," "]
[{"$f":"IF(COUNTRY_INFO!A38=0,\" \",COUNTRY_INFO!A38)","v":"Togo"},{"$f":"IF(COUNTRY_INFO!B38=0,\" \",COUNTRY_INFO!B38)","v":"PLATEAUX"},{"$f":"IF(COUNTRY_INFO!C38=0,\" \",COUNTRY_INFO!C38)","v":"EST MONO"},{"$f":"IF(OR(COUNTRY_INFO!$T$9:$T$1000=\"T1 (PZQ+ALB/MBD)\",COUNTRY_INFO!$U$9:$U$1000=\"T1 (PZQ+ALB/MBD)\"), \"T1 (PZQ+ALB/MBD)\", \" \")","v":" "},null,null,null,null,null,null,0,null,0,0,0," "," "," "," "]
[{"$f":"IF(COUNTRY_INFO!A39=0,\" \",COUNTRY_INFO!A39)","v":"Togo"},{"$f":"IF(COUNTRY_INFO!B39=0,\" \",COUNTRY_INFO!B39)","v":"PLATEAUX"},{"$f":"IF(COUNTRY_INFO!C39=0,\" \",COUNTRY_INFO!C39)","v":"HAHO"},{"$f":"IF(OR(COUNTRY_INFO!$T$9:$T$1000=\"T1 (PZQ+ALB/MBD)\",COUNTRY_INFO!$U$9:$U$1000=\"T1 (PZQ+ALB/MBD)\"), \"T1 (PZQ+ALB/MBD)\", \" \")","v":" "},null,null,null,null,null,null,0,null,0,0,0," "," "," "," "]
[{"$f":"IF(COUNTRY_INFO!A40=0,\" \",COUNTRY_INFO!A40)","v":"Togo"},{"$f":"IF(COUNTRY_INFO!B40=0,\" \",COUNTRY_INFO!B40)","v":"PLATEAUX"},{"$f":"IF(COUNTRY_INFO!C40=0,\" \",COUNTRY_INFO!C40)","v":"KLOTO"},{"$f":"IF(OR(COUNTRY_INFO!$T$9:$T$1000=\"T1 (PZQ+ALB/MBD)\",COUNTRY_INFO!$U$9:$U$1000=\"T1 (PZQ+ALB/MBD)\"), \"T1 (PZQ+ALB/MBD)\", \" \")","v":" "},null,null,null,null,null,null,0,null,0,0,0," "," "," "," "]
[{"$f":"IF(COUNTRY_INFO!A41=0,\" \",COUNTRY_INFO!A41)","v":"Togo"},{"$f":"IF(COUNTRY_INFO!B41=0,\" \",COUNTRY_INFO!B41)","v":"PLATEAUX"},{"$f":"IF(COUNTRY_INFO!C41=0,\" \",COUNTRY_INFO!C41)","v":"KPELE"},{"$f":"IF(OR(COUNTRY_INFO!$T$9:$T$1000=\"T1 (PZQ+ALB/MBD)\",COUNTRY_INFO!$U$9:$U$1000=\"T1 (PZQ+ALB/MBD)\"), \"T1 (PZQ+ALB/MBD)\", \" \")","v":" "},null,null,null,null,null,null,0,null,0,0,0," "," "," "," "]
[{"$f":"IF(COUNTRY_INFO!A42=0,\" \",COUNTRY_INFO!A42)","v":"Togo"},{"$f":"IF(COUNTRY_INFO!B42=0,\" \",COUNTRY_INFO!B42)","v":"PLATEAUX"},{"$f":"IF(COUNTRY_INFO!C42=0,\" \",COUNTRY_INFO!C42)","v":"MOYEN MONO"},{"$f":"IF(OR(COUNTRY_INFO!$T$9:$T$1000=\"T1 (PZQ+ALB/MBD)\",COUNTRY_INFO!$U$9:$U$1000=\"T1 (PZQ+ALB/MBD)\"), \"T1 (PZQ+ALB/MBD)\", \" \")","v":" "},null,null,null,null,null,null,0,null,0,0,0," "," "," "," "]
[{"$f":"IF(COUNTRY_INFO!A43=0,\" \",COUNTRY_INFO!A43)","v":"Togo"},{"$f":"IF(COUNTRY_INFO!B43=0,\" \",COUNTRY_INFO!B43)","v":"PLATEAUX"},{"$f":"IF(COUNTRY_INFO!C43=0,\" \",COUNTRY_INFO!C43)","v":"OGOU"},{"$f":"IF(OR(COUNTRY_INFO!$T$9:$T$1000=\"T1 (PZQ+ALB/MBD)\",COUNTRY_INFO!$U$9:$U$1000=\"T1 (PZQ+ALB/MBD)\"), \"T1 (PZQ+ALB/MBD)\", \" \")","v":" "},null,null,null,null,null,null,0,null,0,0,0," "," "," "," "]
[{"$f":"IF(COUNTRY_INFO!A44=0,\" \",COUNTRY_INFO!A44)","v":"Togo"},{"$f":"IF(COUNTRY_INFO!B44=0,\" \",COUNTRY_INFO!B44)","v":"PLATEAUX"},{"$f":"IF(COUNTRY_INFO!C44=0,\" \",COUNTRY_INFO!C44)","v":"WAWA"},{"$f":"IF(OR(COUNTRY_INFO!$T$9:$T$1000=\"T1 (PZQ+ALB/MBD)\",COUNTRY_INFO!$U$9:$U$1000=\"T1 (PZQ+ALB/MBD)\"), \"T1 (PZQ+ALB/MBD)\", \" \")","v":" "},null,null,null,null,null,null,0,null,0,0,0," "," "," "," "]
[{"$f":"IF(COUNTRY_INFO!A45=0,\" \",COUNTRY_INFO!A45)","v":"Togo"},{"$f":"IF(COUNTRY_INFO!B45=0,\" \",COUNTRY_INFO!B45)","v":"SAVANES"},{"$f":"IF(COUNTRY_INFO!C45=0,\" \",COUNTRY_INFO!C45)","v":"CINKASSE"},{"$f":"IF(OR(COUNTRY_INFO!$T$9:$T$1000=\"T1 (PZQ+ALB/MBD)\",COUNTRY_INFO!$U$9:$U$1000=\"T1 (PZQ+ALB/MBD)\"), \"T1 (PZQ+ALB/MBD)\", \" \")","v":"T1 (PZQ+ALB/MBD)"},"PZQ+ALB","18-29 juin 2019",null,28743,28743,null,28743,null,3330,0,3330," ",11.585429495877257," ",11.585429495877257]
[{"$f":"IF(COUNTRY_INFO!A46=0,\" \",COUNTRY_INFO!A46)","v":"Togo"},{"$f":"IF(COUNTRY_INFO!B46=0,\" \",COUNTRY_INFO!B46)","v":"SAVANES"},{"$f":"IF(COUNTRY_INFO!C46=0,\" \",COUNTRY_INFO!C46)","v":"KPENDJAL"},{"$f":"IF(OR(COUNTRY_INFO!$T$9:$T$1000=\"T1 (PZQ+ALB/MBD)\",COUNTRY_INFO!$U$9:$U$1000=\"T1 (PZQ+ALB/MBD)\"), \"T1 (PZQ+ALB/MBD)\", \" \")","v":" "},null,null,null,null,null,null,0,null,0,0,0," "," "," "," "]
[{"$f":"IF(COUNTRY_INFO!A47=0,\" \",COUNTRY_INFO!A47)","v":"Togo"},{"$f":"IF(COUNTRY_INFO!B47=0,\" \",COUNTRY_INFO!B47)","v":"SAVANES"},{"$f":"IF(COUNTRY_INFO!C47=0,\" \",COUNTRY_INFO!C47)","v":"OTI"},{"$f":"IF(OR(COUNTRY_INFO!$T$9:$T$1000=\"T1 (PZQ+ALB/MBD)\",COUNTRY_INFO!$U$9:$U$1000=\"T1 (PZQ+ALB/MBD)\"), \"T1 (PZQ+ALB/MBD)\", \" \")","v":" "},null,null,null,null,null,null,0,null,0,0,0," "," "," "," "]
[{"$f":"IF(COUNTRY_INFO!A48=0,\" \",COUNTRY_INFO!A48)","v":"Togo"},{"$f":"IF(COUNTRY_INFO!B48=0,\" \",COUNTRY_INFO!B48)","v":"SAVANES"},{"$f":"IF(COUNTRY_INFO!C48=0,\" \",COUNTRY_INFO!C48)","v":"TANDJOARE"},{"$f":"IF(OR(COUNTRY_INFO!$T$9:$T$1000=\"T1 (PZQ+ALB/MBD)\",COUNTRY_INFO!$U$9:$U$1000=\"T1 (PZQ+ALB/MBD)\"), \"T1 (PZQ+ALB/MBD)\", \" \")","v":" "},null,null,null,null,0,null,0,null,null,null,0," "," "," "," "]
[{"$f":"IF(COUNTRY_INFO!A49=0,\" \",COUNTRY_INFO!A49)","v":"Togo"},{"$f":"IF(COUNTRY_INFO!B49=0,\" \",COUNTRY_INFO!B49)","v":"SAVANES"},{"$f":"IF(COUNTRY_INFO!C49=0,\" \",COUNTRY_INFO!C49)","v":"TONE"},{"$f":"IF(OR(COUNTRY_INFO!$T$9:$T$1000=\"T1 (PZQ+ALB/MBD)\",COUNTRY_INFO!$U$9:$U$1000=\"T1 (PZQ+ALB/MBD)\"), \"T1 (PZQ+ALB/MBD)\", \" \")","v":"T1 (PZQ+ALB/MBD)"},"PZQ+ALB","18-29 juin 2019",null,104581,3300,null,104581,null,5971,0,5971," ",5.7094500913167785," ",5.7094500913167785]

{"sheet":"T2","index":6,"n_rows":49,"n_cols":17,"rows_kept":49,"cut":false,"hidden":false,"merged":[[5,5,5,8],[5,9,5,12],[5,13,5,16],[3,0,3,2],[5,0,5,2],[5,3,6,3],[5,4,6,4]]}
["T 2 - Praziquantel (PZQ) "]
["Structure administrative, population nécessitant une chimioprévention par groupe d'âge, population traitée par groupe d'âge et couverture"]
[]
["TOTAL",null,null,null,null,{"$f":"SUM(F$9:F$1000)","v":0},294825,0,294825,0,288551,0,288551,{"$f":"IF(F4<>0, IF(J4/F4*100=0, \"-\", J4/F4*100), \" \")","v":" "},{"$f":"IF(G4<>0, IF(K4/G4*100=0, \"-\", K4/G4*100), \" \")","v":97.871957941151535},{"$f":"IF(H4<>0, IF(L4/H4*100=0, \"-\", L4/H4*100), \" \")","v":" "},{"$f":"IF(I4<>0, IF(M4/I4*100=0, \"-\", M4/I4*100), \" \")","v":97.871957941151535}]
[]
["Structure administrative du pays",null,null,"Mise en oeuvre \nde la CP","Date","Population ciblée pour T2",null,null,null,"Population traitée",null,null,null,"Couverture du Programme (%)"]
["Pays","Région/Département","District",null,null,"EAPréS","EAS","Adultes","Total","EAPréS","EAS","Adultes","Total","EAPréS","EAS","Adultes","Total"]
[]
[{"$f":"IF(COUNTRY_INFO!A9=0,\" \",COUNTRY_INFO!A9)","v":"Togo"},{"$f":"IF(COUNTRY_INFO!B9=0,\" \",COUNTRY_INFO!B9)","v":"CENTRALE"},{"$f":"IF(COUNTRY_INFO!C9=0,\" \",COUNTRY_INFO!C9)","v":"BLITTA"},"T2 (PZQ)","Janvier 2020",null,7608,null,{"$f":"SUM(F9:H9)","v":7608},null,7608,null,{"$f":"SUM(J9:L9)","v":7608},{"$f":"IF(F9<>0, IF(J9/F9*100=0, \"-\", J9/F9*100), \" \")","v":" "},{"$f":"IF(G9<>0, IF(K9/G9*100=0, \"-\", K9/G9*100), \" \")","v":100},{"$f":"IF(H9<>0, IF(L9/H9*100=0, \"-\", L9/H9*100), \" \")","v":" "},{"$f":"IF(I9<>0, IF(M9/I9*100=0, \"-\", M9/I9*100), \" \")","v":100}]
[{"$f":"IF(COUNTRY_INFO!A10=0,\" \",COUNTRY_INFO!A10)","v":"Togo"},{"$f":"IF(COUNTRY_INFO!B10=0,\" \",COUNTRY_INFO!B10)","v":"CENTRALE"},{"$f":"IF(COUNTRY_INFO!C10=0,\" \",COUNTRY_INFO!C10)","v":"MÔ"},{"$f":"IF(OR(COUNTRY_INFO!$T$9:$T$1000=\"T2 (PZQ)\",COUNTRY_INFO!$U$9:$U$1000=\"T2 (PZQ)\"), \"T2 (PZQ)\", \" \")","v":" "},null,null,null,null,{"$f":"SUM(F10:H10)","v":0},null,null,null,{"$f":"SUM(J10:L10)","v":0},{"$f":"IF(F10<>0, IF(J10/F10*100=0, \"-\", J10/F10*100), \" \")","v":" "},{"$f":"IF(G10<>0, IF(K10/G10*100=0, \"-\", K10/G10*100), \" \")","v":" "},{"$f":"IF(H10<>0, IF(L10/H10*100=0, \"-\", L10/H10*100), \" \")","v":" "},{"$f":"IF(I10<>0, IF(M10/I10*100=0, \"-\", M10/I10*100), \" \")","v":" "}]
[{"$f":"IF(COUNTRY_INFO!A11=0,\" \",COUNTRY_INFO!A11)","v":"Togo"},{"$f":"IF(COUNTRY_INFO!B11=0,\" \",COUNTRY_INFO!B11)","v":"CENTRALE"},{"$f":"IF(COUNTRY_INFO!C11=0,\" \",COUNTRY_INFO!C11)","v":"SOTOUBOUA"},{"$f":"IF(OR(COUNTRY_INFO!$T$9:$T$1000=\"T2 (PZQ)\",COUNTRY_INFO!$U$9:$U$1000=\"T2 (PZQ)\"), \"T2 (PZQ)\", \" \")","v":" "},null,null,null,null,0,null,null,null,0," "," "," "," "]
[{"$f":"IF(COUNTRY_INFO!A12=0,\" \",COUNTRY_INFO!A12)","v":"Togo"},{"$f":"IF(COUNTRY_INFO!B12=0,\" \",COUNTRY_INFO!B12)","v":"CENTRALE"},{"$f":"IF(COUNTRY_INFO!C12=0,\" \",COUNTRY_INFO!C12)","v":"TCHAMBA"},{"$f":"IF(OR(COUNTRY_INFO!$T$9:$T$1000=\"T2 (PZQ)\",COUNTRY_INFO!$U$9:$U$1000=\"T2 (PZQ)\"), \"T2 (PZQ)\", \" \")","v":" "},null,null,null,null,0,null,null,null,0," "," "," "," "]
[{"$f":"IF(COUNTRY_INFO!A13=0,\" \",COUNTRY_INFO!A13)","v":"Togo"},{"$f":"IF(COUNTRY_INFO!B13=0,\" \",COUNTRY_INFO!B13)","v":"CENTRALE"},{"$f":"IF(COUNTRY_INFO!C13=0,\" \",COUNTRY_INFO!C13)","v":"TCHAOUDJO"},"T2 (PZQ)","Janvier 2020",null,7010,null,7010,null,6929,null,6929," ",98.844507845934388," ",98.844507845934388]
[{"$f":"IF(COUNTRY_INFO!A14=0,\" \",COUNTRY_INFO!A14)","v":"Togo"},{"$f":"IF(COUNTRY_INFO!B14=0,\" \",COUNTRY_INFO!B14)","v":"KARA"},{"$f":"IF(COUNTRY_INFO!C14=0,\" \",COUNTRY_INFO!C14)","v":"ASSOLI"},"T2 (PZQ)","Janvier 2020",null,2784,null,2784,null,2780,null,2780," ",99.856321839080465," ",99.856321839080465]
[{"$f":"IF(COUNTRY_INFO!A15=0,\" \",COUNTRY_INFO!A15)","v":"Togo"},{"$f":"IF(COUNTRY_INFO!B15=0,\" \",COUNTRY_INFO!B15)","v":"KARA"},{"$f":"IF(COUNTRY_INFO!C15=0,\" \",COUNTRY_INFO!C15)","v":"BASSAR"},"T2 (PZQ)","Janvier 2020",null,703,null,703,null,703,null,703," ",100," ",100]
[{"$f":"IF(COUNTRY_INFO!A16=0,\" \",COUNTRY_INFO!A16)","v":"Togo"},{"$f":"IF(COUNTRY_INFO!B16=0,\" \",COUNTRY_INFO!B16)","v":"KARA"},{"$f":"IF(COUNTRY_INFO!C16=0,\" \",COUNTRY_INFO!C16)","v":"BINAH"},{"$f":"IF(OR(COUNTRY_INFO!$T$9:$T$1000=\"T2 (PZQ)\",COUNTRY_INFO!$U$9:$U$1000=\"T2 (PZQ)\"), \"T2 (PZQ)\", \" \")","v":" "},null,null,null,null,0,null,null,null,0," "," "," "," "]
[{"$f":"IF(COUNTRY_INFO!A17=0,\" \",COUNTRY_INFO!A17)","v":"Togo"},{"$f":"IF(COUNTRY_INFO!B17=0,\" \",COUNTRY_INFO!B17)","v":"KARA"},{"$f":"IF(COUNTRY_INFO!C17=0,\" \",COUNTRY_INFO!C17)","v":"DANKPEN"},{"$f":"IF(OR(COUNTRY_INFO!$T$9:$T$1000=\"T2 (PZQ)\",COUNTRY_INFO!$U$9:$U$1000=\"T2 (PZQ)\"), \"T2 (PZQ)\", \" \")","v":" "},null,null,null,null,0,null,null,null,0," "," "," "," "]
[{"$f":"IF(COUNTRY_INFO!A18=0,\" \",COUNTRY_INFO!A18)","v":"Togo"},{"$f":"IF(COUNTRY_INFO!B18=0,\" \",COUNTRY_INFO!B18)","v":"KARA"},{"$f":"IF(COUNTRY_INFO!C18=0,\" \",COUNTRY_INFO!C18)","v":"DOULFELGOU"},"T2 (PZQ)","Janvier 2020",null,6389,null,6389,null,6305,null,6305," ",98.685240256691188," ",98.685240256691188]
[{"$f":"IF(COUNTRY_INFO!A19=0,\" \",COUNTRY_INFO!A19)","v":"Togo"},{"$f":"IF(COUNTRY_INFO!B19=0,\" \",COUNTRY_INFO!B19)","v":"KARA"},{"$f":"IF(COUNTRY_INFO!C19=0,\" \",COUNTRY_INFO!C19)","v":"KERAN"},{"$f":"IF(OR(COUNTRY_INFO!$T$9:$T$1000=\"T2 (PZQ)\",COUNTRY_INFO!$U$9:$U$1000=\"T2 (PZQ)\"), \"T2 (PZQ)\", \" \")","v":" "},null,null,null,null,0,null,null,null,0," "," "," "," "]
[{"$f":"IF(COUNTRY_INFO!A20=0,\" \",COUNTRY_INFO!A20)","v":"Togo"},{"$f":"IF(COUNTRY_INFO!B20=0,\" \",COUNTRY_INFO!B20)","v":"KARA"},{"$f":"IF(COUNTRY_INFO!C20=0,\" \",COUNTRY_INFO!C20)","v":"KOZAH"},"T2 (PZQ)","Janvier 2020",null,8702,null,8702,null,8656,null,8656," ",99.47138588830154," ",99.47138588830154]
[{"$f":"IF(COUNTRY_INFO!A21=0,\" \",COUNTRY_INFO!A21)","v":"Togo"},{"$f":"IF(COUNTRY_INFO!B21=0,\" \",COUNTRY_INFO!B21)","v":"LOME-COMMUNE"},{"$f":"IF(COUNTRY_INFO!C21=0,\" \",COUNTRY_INFO!C21)","v":"DISTRICT N°1"},{"$f":"IF(OR(COUNTRY_INFO!$T$9:$T$1000=\"T2 (PZQ)\",COUNTRY_INFO!$U$9:$U$1000=\"T2 (PZQ)\"), \"T2 (PZQ)\", \" \")","v":" "},null,null,null,null,0,null,null,null,0," "," "," "," "]
[{"$f":"IF(COUNTRY_INFO!A22=0,\" \",COUNTRY_INFO!A22)","v":"Togo"},{"$f":"IF(COUNTRY_INFO!B22=0,\" \",COUNTRY_INFO!B22)","v":"LOME-COMMUNE"},{"$f":"IF(COUNTRY_INFO!C22=0,\" \",COUNTRY_INFO!C22)","v":"DISTRICT N°2"},{"$f":"IF(OR(COUNTRY_INFO!$T$9:$T$1000=\"T2 (PZQ)\",COUNTRY_INFO!$U$9:$U$1000=\"T2 (PZQ)\"), \"T2 (PZQ)\", \" \")","v":" "},null,null,null,null,0,null,null,null,0," "," "," "," "]
[{"$f":"IF(COUNTRY_INFO!A23=0,\" \",COUNTRY_INFO!A23)","v":"Togo"},{"$f":"IF(COUNTRY_INFO!B23=0,\" \",COUNTRY_INFO!B23)","v":"LOME-COMMUNE"},{"$f":"IF(COUNTRY_INFO!C23=0,\" \",COUNTRY_INFO!C23)","v":"DISTRICT N°3"},{"$f":"IF(OR(COUNTRY_INFO!$T$9:$T$1000=\"T2 (PZQ)\",COUNTRY_INFO!$U$9:$U$1000=\"T2 (PZQ)\"), \"T2 (PZQ)\", \" \")","v":" "},null,null,null,null,0,null,null,null,0," "," "," "," "]
[{"$f":"IF(COUNTRY_INFO!A24=0,\" \",COUNTRY_INFO!A24)","v":"Togo"},{"$f":"IF(COUNTRY_INFO!B24=0,\" \",COUNTRY_INFO!B24)","v":"LOME-COMMUNE"},{"$f":"IF(COUNTRY_INFO!C24=0,\" \",COUNTRY_INFO!C24)","v":"DISTRICT N°4"},{"$f":"IF(OR(COUNTRY_INFO!$T$9:$T$1000=\"T2 (PZQ)\",COUNTRY_INFO!$U$9:$U$1000=\"T2 (PZQ)\"), \"T2 (PZQ)\", \" \")","v":" "},null,null,null,null,0,null,null,null,0," "," "," "," "]
[{"$f":"IF(COUNTRY_INFO!A25=0,\" \",COUNTRY_INFO!A25)","v":"Togo"},{"$f":"IF(COUNTRY_INFO!B25=0,\" \",COUNTRY_INFO!B25)","v":"LOME-COMMUNE"},{"$f":"IF(COUNTRY_INFO!C25=0,\" \",COUNTRY_INFO!C25)","v":"DISTRICT N°5"},{"$f":"IF(OR(COUNTRY_INFO!$T$9:$T$1000=\"T2 (PZQ)\",COUNTRY_INFO!$U$9:$U$1000=\"T2 (PZQ)\"), \"T2 (PZQ)\", \" \")","v":" "},null,null,null,null,0,null,null,null,0," "," "," "," "]
[{"$f":"IF(COUNTRY_INFO!A26=0,\" \",COUNTRY_INFO!A26)","v":"Togo"},{"$f":"IF(COUNTRY_INFO!B26=0,\" \",COUNTRY_INFO!B26)","v":"MARITIME"},{"$f":"IF(COUNTRY_INFO!C26=0,\" \",COUNTRY_INFO!C26)","v":"AVE"},{"$f":"IF(OR(COUNTRY_INFO!$T$9:$T$1000=\"T2 (PZQ)\",COUNTRY_INFO!$U$9:$U$1000=\"T2 (PZQ)\"), \"T2 (PZQ)\", \" \")","v":" "},null,null,null,null,0,null,null,null,0," "," "," "," "]
[{"$f":"IF(COUNTRY_INFO!A27=0,\" \",COUNTRY_INFO!A27)","v":"Togo"},{"$f":"IF(COUNTRY_INFO!B27=0,\" \",COUNTRY_INFO!B27)","v":"MARITIME"},{"$f":"IF(COUNTRY_INFO!C27=0,\" \",COUNTRY_INFO!C27)","v":"BAS MONO"},{"$f":"IF(OR(COUNTRY_INFO!$T$9:$T$1000=\"T2 (PZQ)\",COUNTRY_INFO!$U$9:$U$1000=\"T2 (PZQ)\"), \"T2 (PZQ)\", \" \")","v":" "},null,null,null,null,0,null,null,null,0," "," "," "," "]
[{"$f":"IF(COUNTRY_INFO!A28=0,\" \",COUNTRY_INFO!A28)","v":"Togo"},{"$f":"IF(COUNTRY_INFO!B28=0,\" \",COUNTRY_INFO!B28)","v":"MARITIME"},{"$f":"IF(COUNTRY_INFO!C28=0,\" \",COUNTRY_INFO!C28)","v":"GOLFE"},"T2 (PZQ)","Janvier 2020",null,85572,null,85572,null,83116,null,83116," ",97.12990230449212," ",97.12990230449212]
[{"$f":"IF(COUNTRY_INFO!A29=0,\" \",COUNTRY_INFO!A29)","v":"Togo"},{"$f":"IF(COUNTRY_INFO!B29=0,\" \",COUNTRY_INFO!B29)","v":"MARITIME"},{"$f":"IF(COUNTRY_INFO!C29=0,\" \",COUNTRY_INFO!C29)","v":"LACS"},"T2 (PZQ)","Janvier 2020",null,17720,null,17720,null,16819,null,16819," ",94.915349887133189," ",94.915349887133189]
[{"$f":"IF(COUNTRY_INFO!A30=0,\" \",COUNTRY_INFO!A30)","v":"Togo"},{"$f":"IF(COUNTRY_INFO!B30=0,\" \",COUNTRY_INFO!B30)","v":"MARITIME"},{"$f":"IF(COUNTRY_INFO!C30=0,\" \",COUNTRY_INFO!C30)","v":"VO"},"T2 (PZQ)","Janvier 2020",null,15000,null,15000,null,14702,null,14702," ",98.013333333333335," ",98.013333333333335]
[{"$f":"IF(COUNTRY_INFO!A31=0,\" \",COUNTRY_INFO!A31)","v":"Togo"},{"$f":"IF(COUNTRY_INFO!B31=0,\" \",COUNTRY_INFO!B31)","v":"MARITIME"},{"$f":"IF(COUNTRY_INFO!C31=0,\" \",COUNTRY_INFO!C31)","v":"YOTO"},{"$f":"IF(OR(COUNTRY_INFO!$T$9:$T$1000=\"T2 (PZQ)\",COUNTRY_INFO!$U$9:$U$1000=\"T2 (PZQ)\"), \"T2 (PZQ)\", \" \")","v":" "},null,null,null,null,0,null,null,null,0," "," "," "," "]
[{"$f":"IF(COUNTRY_INFO!A32=0,\" \",COUNTRY_INFO!A32)","v":"Togo"},{"$f":"IF(COUNTRY_INFO!B32=0,\" \",COUNTRY_INFO!B32)","v":"MARITIME"},{"$f":"IF(COUNTRY_INFO!C32=0,\" \",COUNTRY_INFO!C32)","v":"ZIO"},"T2 (PZQ)","Janvier 2020",null,8484,null,8484,null,8397,null,8397," ",98.974540311173982," ",98.974540311173982]
[{"$f":"IF(COUNTRY_INFO!A33=0,\" \",COUNTRY_INFO!A33)","v":"Togo"},{"$f":"IF(COUNTRY_INFO!B33=0,\" \",COUNTRY_INFO!B33)","v":"PLATEAUX"},{"$f":"IF(COUNTRY_INFO!C33=0,\" \",COUNTRY_INFO!C33)","v":"AGOU"},"T2 (PZQ)","Janvier 2020",null,5083,null,5083,null,5080,null,5080," ",99.94097973637615," ",99.94097973637615]
[{"$f":"IF(COUNTRY_INFO!A34=0,\" \",COUNTRY_INFO!A34)","v":"Togo"},{"$f":"IF(COUNTRY_INFO!B34=0,\" \",COUNTRY_INFO!B34)","v":"PLATEAUX"},{"$f":"IF(COUNTRY_INFO!C34=0,\" \",COUNTRY_INFO!C34)","v":"AKEBOU"},{"$f":"IF(OR(COUNTRY_INFO!$T$9:$T$1000=\"T2 (PZQ)\",COUNTRY_INFO!$U$9:$U$1000=\"T2 (PZQ)\"), \"T2 (PZQ)\", \" \")","v":" "},null,null,null,null,0,null,null,null,0," "," "," "," "]
[{"$f":"IF(COUNTRY_INFO!A35=0,\" \",COUNTRY_INFO!A35)","v":"Togo"},{"$f":"IF(COUNTRY_INFO!B35=0,\" \",COUNTRY_INFO!B35)","v":"PLATEAUX"},{"$f":"IF(COUNTRY_INFO!C35=0,\" \",COUNTRY_INFO!C35)","v":"AMOU"},"T2 (PZQ)","Janvier 2020",null,399,null,399,null,399,null,399," ",100," ",100]
[{"$f":"IF(COUNTRY_INFO!A36=0,\" \",COUNTRY_INFO!A36)","v":"Togo"},{"$f":"IF(COUNTRY_INFO!B36=0,\" \",COUNTRY_INFO!B36)","v":"PLATEAUX"},{"$f":"IF(COUNTRY_INFO!C36=0,\" \",COUNTRY_INFO!C36)","v":"ANIE"},"T2 (PZQ)","Janvier 2020",null,27498,null,27498,null,27061,null,27061," ",98.410793512255438," ",98.410793512255438]
[{"$f":"IF(COUNTRY_INFO!A37=0,\" \",COUNTRY_INFO!A37)","v":"Togo"},{"$f":"IF(COUNTRY_INFO!B37=0,\" \",COUNTRY_INFO!B37)","v":"PLATEAUX"},{"$f":"IF(COUNTRY_INFO!C37=0,\" \",COUNTRY_INFO!C37)","v":"DANYI"},{"$f":"IF(OR(COUNTRY_INFO!$T$9:$T$1000=\"T2 (PZQ)\",COUNTRY_INFO!$U$9:$U$1000=\"T2 (PZQ)\"), \"T2 (PZQ)\", \" \")","v":" "},null,null,null,null,0,null,null,null,0," "," "," "," "]
[{"$f":"IF(COUNTRY_INFO!A38=0,\" \",COUNTRY_INFO!A38)","v":"Togo"},{"$f":"IF(COUNTRY_INFO!B38=0,\" \",COUNTRY_INFO!B38)","v":"PLATEAUX"},{"$f":"IF(COUNTRY_INFO!C38=0,\" \",COUNTRY_INFO!C38)","v":"EST MONO"},"T2 (PZQ)","Janvier 2020",null,12132,null,12132,null,10512,null,10512," ",86.646884272997042," ",86.646884272997042]
[{"$f":"IF(COUNTRY_INFO!A39=0,\" \",COUNTRY_INFO!A39)","v":"Togo"},{"$f":"IF(COUNTRY_INFO!B39=0,\" \",COUNTRY_INFO!B39)","v":"PLATEAUX"},{"$f":"IF(COUNTRY_INFO!C39=0,\" \",COUNTRY_INFO!C39)","v":"HAHO"},"T2 (PZQ)","Janvier 2020",null,11499,null,11499,null,11499,null,11499," ",100," ",100]
[{"$f":"IF(COUNTRY_INFO!A40=0,\" \",COUNTRY_INFO!A40)","v":"Togo"},{"$f":"IF(COUNTRY_INFO!B40=0,\" \",COUNTRY_INFO!B40)","v":"PLATEAUX"},{"$f":"IF(COUNTRY_INFO!C40=0,\" \",COUNTRY_INFO!C40)","v":"KLOTO"},{"$f":"IF(OR(COUNTRY_INFO!$T$9:$T$1000=\"T2 (PZQ)\",COUNTRY_INFO!$U$9:$U$1000=\"T2 (PZQ)\"), \"T2 (PZQ)\", \" \")","v":" "},null,null,null,null,0,null,null,null,0," "," "," "," "]
[{"$f":"IF(COUNTRY_INFO!A41=0,\" \",COUNTRY_INFO!A41)","v":"Togo"},{"$f":"IF(COUNTRY_INFO!B41=0,\" \",COUNTRY_INFO!B41)","v":"PLATEAUX"},{"$f":"IF(COUNTRY_INFO!C41=0,\" \",COUNTRY_INFO!C41)","v":"KPELE"},"T2 (PZQ)","Janvier 2020",null,3049,null,3049,null,3049,null,3049," ",100," ",100]
[{"$f":"IF(COUNTRY_INFO!A42=0,\" \",COUNTRY_INFO!A42)","v":"Togo"},{"$f":"IF(COUNTRY_INFO!B42=0,\" \",COUNTRY_INFO!B42)","v":"PLATEAUX"},{"$f":"IF(COUNTRY_INFO!C42=0,\" \",COUNTRY_INFO!C42)","v":"MOYEN MONO"},"T2 (PZQ)","Janvier 2020",null,4912,null,4912,null,4829,null,4829," ",98.310260586319217," ",98.310260586319217]
[{"$f":"IF(COUNTRY_INFO!A43=0,\" \",COUNTRY_INFO!A43)","v":"Togo"},{"$f":"IF(COUNTRY_INFO!B43=0,\" \",COUNTRY_INFO!B43)","v":"PLATEAUX"},{"$f":"IF(COUNTRY_INFO!C43=0,\" \",COUNTRY_INFO!C43)","v":"OGOU"},"T2 (PZQ)","Janvier 2020",null,39497,null,39497,null,39497,null,39497," ",100," ",100]
[{"$f":"IF(COUNTRY_INFO!A44=0,\" \",COUNTRY_INFO!A44)","v":"Togo"},{"$f":"IF(COUNTRY_INFO!B44=0,\" \",COUNTRY_INFO!B44)","v":"PLATEAUX"},{"$f":"IF(COUNTRY_INFO!C44=0,\" \",COUNTRY_INFO!C44)","v":"WAWA"},"T2 (PZQ)","Janvier 2020",null,5274,null,5274,null,5100,null,5100," ",96.700796359499435," ",96.700796359499435]
[{"$f":"IF(COUNTRY_INFO!A45=0,\" \",COUNTRY_INFO!A45)","v":"Togo"},{"$f":"IF(COUNTRY_INFO!B45=0,\" \",COUNTRY_INFO!B45)","v":"SAVANES"},{"$f":"IF(COUNTRY_INFO!C45=0,\" \",COUNTRY_INFO!C45)","v":"CINKASSE"},"T2 (PZQ)","Janvier 2020",null,15676,null,15676,null,15676,null,15676," ",100," ",100]
[{"$f":"IF(COUNTRY_INFO!A46=0,\" \",COUNTRY_INFO!A46)","v":"Togo"},{"$f":"IF(COUNTRY_INFO!B46=0,\" \",COUNTRY_INFO!B46)","v":"SAVANES"},{"$f":"IF(COUNTRY_INFO!C46=0,\" \",COUNTRY_INFO!C46)","v":"KPENDJAL"},"T2 (PZQ)","Janvier 2020",null,8411,null,8411,null,8411,null,8411," ",100," ",100]
[{"$f":"IF(COUNTRY_INFO!A47=0,\" \",COUNTRY_INFO!A47)","v":"Togo"},{"$f":"IF(COUNTRY_INFO!B47=0,\" \",COUNTRY_INFO!B47)","v":"SAVANES"},{"$f":"IF(COUNTRY_INFO!C47=0,\" \",COUNTRY_INFO!C47)","v":"OTI"},"T2 (PZQ)","Janvier 2020",null,1423,null,1423,null,1423,null,1423," ",100," ",100]
[{"$f":"IF(COUNTRY_INFO!A48=0,\" \",COUNTRY_INFO!A48)","v":"Togo"},{"$f":"IF(COUNTRY_INFO!B48=0,\" \",COUNTRY_INFO!B48)","v":"SAVANES"},{"$f":"IF(COUNTRY_INFO!C48=0,\" \",COUNTRY_INFO!C48)","v":"TANDJOARE"},{"$f":"IF(OR(COUNTRY_INFO!$T$9:$T$1000=\"T2 (PZQ)\",COUNTRY_INFO!$U$9:$U$1000=\"T2 (PZQ)\"), \"T2 (PZQ)\", \" \")","v":" "},null,null,null,null,0,null,null,null,0," "," "," "," "]
[{"$f":"IF(COUNTRY_INFO!A49=0,\" \",COUNTRY_INFO!A49)","v":"Togo"},{"$f":"IF(COUNTRY_INFO!B49=0,\" \",COUNTRY_INFO!B49)","v":"SAVANES"},{"$f":"IF(COUNTRY_INFO!C49=0,\" \",COUNTRY_INFO!C49)","v":"TONE"},{"$f":"IF(OR(COUNTRY_INFO!$T$9:$T$1000=\"T2 (PZQ)\",COUNTRY_INFO!$U$9:$U$1000=\"T2 (PZQ)\"), \"T2 (PZQ)\", \" \")","v":" "},null,null,null,null,0,null,null,null,0," "," "," "," "]

{"sheet":"T3_R1","index":7,"n_rows":49,"n_cols":18,"rows_kept":49,"cut":false,"hidden":false,"merged":[[5,6,5,9],[5,10,5,13],[5,14,5,17],[3,0,3,2],[5,0,5,2],[5,3,6,3],[5,5,6,5],[5,4,6,4]]}
["T 3 - Albendazole (ALB) ou Mebendazole (MBD) - Tournée 1"]
["Structure administrative, population nécessitant une chimioprévention par groupe d'âge, population traitée par groupe d'âge et couverture"]
[]
["TOTAL",null,null,null,null,null,{"$f":"SUM(G$9:G$1000)","v":0},2003560,0,2003560,0,1995921,0,1995921,{"$f":"IF(G4<>0, IF(K4/G4*100=0, \"-\", K4/G4*100), \" \")","v":" "},{"$f":"IF(H4<>0, IF(L4/H4*100=0, \"-\", L4/H4*100), \" \")","v":99.61872866297989},{"$f":"IF(I4<>0, IF(M4/I4*100=0, \"-\", M4/I4*100), \" \")","v":" "},{"$f":"IF(J4<>0, IF(N4/J4*100=0, \"-\", N4/J4*100), \" \")","v":99.61872866297989}]
[]
["Structure administrative du pays",null,null,"Mise en oeuvre \nde la CP","Médica-ment","Date","Population ciblée pour T3",null,null,null,"Population traitée",null,null,null,"Couverture du Programme (%)"]
["Pays","Région/Département","District",null,null,null,"EAPréS","EAS","Adultes","Total","EAPréS","EAS","Adultes","Total","EAPréS","EAS","Adultes","Total"]
[]
[{"$f":"IF(COUNTRY_INFO!A9=0,\" \",COUNTRY_INFO!A9)","v":"Togo"},{"$f":"IF(COUNTRY_INFO!B9=0,\" \",COUNTRY_INFO!B9)","v":"CENTRALE"},{"$f":"IF(COUNTRY_INFO!C9=0,\" \",COUNTRY_INFO!C9)","v":"BLITTA"},"T3 (ALB/MBD)","ALB","Juin 2019",null,48971,null,{"$f":"SUM(G9:I9)","v":48971},null,48907,null,{"$f":"SUM(K9:M9)","v":48907},{"$f":"IF(G9<>0, IF(K9/G9*100=0, \"-\", K9/G9*100), \" \")","v":" "},{"$f":"IF(H9<>0, IF(L9/H9*100=0, \"-\", L9/H9*100), \" \")","v":99.869310408200775},{"$f":"IF(I9<>0, IF(M9/I9*100=0, \"-\", M9/I9*100), \" \")","v":" "},{"$f":"IF(J9<>0, IF(N9/J9*100=0, \"-\", N9/J9*100), \" \")","v":99.869310408200775}]
[{"$f":"IF(COUNTRY_INFO!A10=0,\" \",COUNTRY_INFO!A10)","v":"Togo"},{"$f":"IF(COUNTRY_INFO!B10=0,\" \",COUNTRY_INFO!B10)","v":"CENTRALE"},{"$f":"IF(COUNTRY_INFO!C10=0,\" \",COUNTRY_INFO!C10)","v":"MÔ"},{"$f":"IF(OR(COUNTRY_INFO!$T$9:$T$1000=\"T3 (ALB/MBD)\",COUNTRY_INFO!$U$9:$U$1000=\"T3 (ALB/MBD)\"), \"T3 (ALB/MBD)\", \" \")","v":"T3 (ALB/MBD)"},"ALB","Juin 2019",null,14768,null,{"$f":"SUM(G10:I10)","v":14768},null,14714,null,{"$f":"SUM(K10:M10)","v":14714},{"$f":"IF(G10<>0, IF(K10/G10*100=0, \"-\", K10/G10*100), \" \")","v":" "},{"$f":"IF(H10<>0, IF(L10/H10*100=0, \"-\", L10/H10*100), \" \")","v":99.634344528710727},{"$f":"IF(I10<>0, IF(M10/I10*100=0, \"-\", M10/I10*100), \" \")","v":" "},{"$f":"IF(J10<>0, IF(N10/J10*100=0, \"-\", N10/J10*100), \" \")","v":99.634344528710727}]
[{"$f":"IF(COUNTRY_INFO!A11=0,\" \",COUNTRY_INFO!A11)","v":"Togo"},{"$f":"IF(COUNTRY_INFO!B11=0,\" \",COUNTRY_INFO!B11)","v":"CENTRALE"},{"$f":"IF(COUNTRY_INFO!C11=0,\" \",COUNTRY_INFO!C11)","v":"SOTOUBOUA"},{"$f":"IF(OR(COUNTRY_INFO!$T$9:$T$1000=\"T3 (ALB/MBD)\",COUNTRY_INFO!$U$9:$U$1000=\"T3 (ALB/MBD)\"), \"T3 (ALB/MBD)\", \" \")","v":"T3 (ALB/MBD)"},"ALB","Juin 2019",null,38436,null,38436,null,38436,null,38436," ",100," ",100]
[{"$f":"IF(COUNTRY_INFO!A12=0,\" \",COUNTRY_INFO!A12)","v":"Togo"},{"$f":"IF(COUNTRY_INFO!B12=0,\" \",COUNTRY_INFO!B12)","v":"CENTRALE"},{"$f":"IF(COUNTRY_INFO!C12=0,\" \",COUNTRY_INFO!C12)","v":"TCHAMBA"},{"$f":"IF(OR(COUNTRY_INFO!$T$9:$T$1000=\"T3 (ALB/MBD)\",COUNTRY_INFO!$U$9:$U$1000=\"T3 (ALB/MBD)\"), \"T3 (ALB/MBD)\", \" \")","v":"T3 (ALB/MBD)"},"ALB","Juin 2019",null,51613,null,51613,null,51592,null,51592," ",99.959312576288923," ",99.959312576288923]
[{"$f":"IF(COUNTRY_INFO!A13=0,\" \",COUNTRY_INFO!A13)","v":"Togo"},{"$f":"IF(COUNTRY_INFO!B13=0,\" \",COUNTRY_INFO!B13)","v":"CENTRALE"},{"$f":"IF(COUNTRY_INFO!C13=0,\" \",COUNTRY_INFO!C13)","v":"TCHAOUDJO"},{"$f":"IF(OR(COUNTRY_INFO!$T$9:$T$1000=\"T3 (ALB/MBD)\",COUNTRY_INFO!$U$9:$U$1000=\"T3 (ALB/MBD)\"), \"T3 (ALB/MBD)\", \" \")","v":"T3 (ALB/MBD)"},"ALB","Juin 2019",null,73708,null,73708,null,73650,null,73650," ",99.921311119552826," ",99.921311119552826]
[{"$f":"IF(COUNTRY_INFO!A14=0,\" \",COUNTRY_INFO!A14)","v":"Togo"},{"$f":"IF(COUNTRY_INFO!B14=0,\" \",COUNTRY_INFO!B14)","v":"KARA"},{"$f":"IF(COUNTRY_INFO!C14=0,\" \",COUNTRY_INFO!C14)","v":"ASSOLI"},{"$f":"IF(OR(COUNTRY_INFO!$T$9:$T$1000=\"T3 (ALB/MBD)\",COUNTRY_INFO!$U$9:$U$1000=\"T3 (ALB/MBD)\"), \"T3 (ALB/MBD)\", \" \")","v":"T3 (ALB/MBD)"},"ALB","Juin 2019",null,19304,null,19304,null,19250,null,19250," ",99.720265230004145," ",99.720265230004145]
[{"$f":"IF(COUNTRY_INFO!A15=0,\" \",COUNTRY_INFO!A15)","v":"Togo"},{"$f":"IF(COUNTRY_INFO!B15=0,\" \",COUNTRY_INFO!B15)","v":"KARA"},{"$f":"IF(COUNTRY_INFO!C15=0,\" \",COUNTRY_INFO!C15)","v":"BASSAR"},{"$f":"IF(OR(COUNTRY_INFO!$T$9:$T$1000=\"T3 (ALB/MBD)\",COUNTRY_INFO!$U$9:$U$1000=\"T3 (ALB/MBD)\"), \"T3 (ALB/MBD)\", \" \")","v":"T3 (ALB/MBD)"},"ALB","Juin 2019",null,44588,null,44588,null,44587,null,44587," ",99.99775724410155," ",99.99775724410155]
[{"$f":"IF(COUNTRY_INFO!A16=0,\" \",COUNTRY_INFO!A16)","v":"Togo"},{"$f":"IF(COUNTRY_INFO!B16=0,\" \",COUNTRY_INFO!B16)","v":"KARA"},{"$f":"IF(COUNTRY_INFO!C16=0,\" \",COUNTRY_INFO!C16)","v":"BINAH"},{"$f":"IF(OR(COUNTRY_INFO!$T$9:$T$1000=\"T3 (ALB/MBD)\",COUNTRY_INFO!$U$9:$U$1000=\"T3 (ALB/MBD)\"), \"T3 (ALB/MBD)\", \" \")","v":"T3 (ALB/MBD)"},"ALB","Juin 2019",null,23278,null,23278,null,23236,null,23236," ",99.819572128189705," ",99.819572128189705]
[{"$f":"IF(COUNTRY_INFO!A17=0,\" \",COUNTRY_INFO!A17)","v":"Togo"},{"$f":"IF(COUNTRY_INFO!B17=0,\" \",COUNTRY_INFO!B17)","v":"KARA"},{"$f":"IF(COUNTRY_INFO!C17=0,\" \",COUNTRY_INFO!C17)","v":"DANKPEN"},{"$f":"IF(OR(COUNTRY_INFO!$T$9:$T$1000=\"T3 (ALB/MBD)\",COUNTRY_INFO!$U$9:$U$1000=\"T3 (ALB/MBD)\"), \"T3 (ALB/MBD)\", \" \")","v":"T3 (ALB/MBD)"},"ALB","Juin 2019",null,51064,null,51064,null,50083,null,50083," ",98.078881403728658," ",98.078881403728658]
[{"$f":"IF(COUNTRY_INFO!A18=0,\" \",COUNTRY_INFO!A18)","v":"Togo"},{"$f":"IF(COUNTRY_INFO!B18=0,\" \",COUNTRY_INFO!B18)","v":"KARA"},{"$f":"IF(COUNTRY_INFO!C18=0,\" \",COUNTRY_INFO!C18)","v":"DOULFELGOU"},{"$f":"IF(OR(COUNTRY_INFO!$T$9:$T$1000=\"T3 (ALB/MBD)\",COUNTRY_INFO!$U$9:$U$1000=\"T3 (ALB/MBD)\"), \"T3 (ALB/MBD)\", \" \")","v":"T3 (ALB/MBD)"},"ALB","Juin 2019",null,27946,null,27946,null,27937,null,27937," ",99.967795033278463," ",99.967795033278463]
[{"$f":"IF(COUNTRY_INFO!A19=0,\" \",COUNTRY_INFO!A19)","v":"Togo"},{"$f":"IF(COUNTRY_INFO!B19=0,\" \",COUNTRY_INFO!B19)","v":"KARA"},{"$f":"IF(COUNTRY_INFO!C19=0,\" \",COUNTRY_INFO!C19)","v":"KERAN"},{"$f":"IF(OR(COUNTRY_INFO!$T$9:$T$1000=\"T3 (ALB/MBD)\",COUNTRY_INFO!$U$9:$U$1000=\"T3 (ALB/MBD)\"), \"T3 (ALB/MBD)\", \" \")","v":"T3 (ALB/MBD)"},"ALB","Juin 2019",null,42513,null,42513,null,42513,null,42513," ",100," ",100]
[{"$f":"IF(COUNTRY_INFO!A20=0,\" \",COUNTRY_INFO!A20)","v":"Togo"},{"$f":"IF(COUNTRY_INFO!B20=0,\" \",COUNTRY_INFO!B20)","v":"KARA"},{"$f":"IF(COUNTRY_INFO!C20=0,\" \",COUNTRY_INFO!C20)","v":"KOZAH"},{"$f":"IF(OR(COUNTRY_INFO!$T$9:$T$1000=\"T3 (ALB/MBD)\",COUNTRY_INFO!$U$9:$U$1000=\"T3 (ALB/MBD)\"), \"T3 (ALB/MBD)\", \" \")","v":"T3 (ALB/MBD)"},"ALB","Juin 2019",null,81238,null,81238,null,80876,null,80876," ",99.554395726138011," ",99.554395726138011]
[{"$f":"IF(COUNTRY_INFO!A21=0,\" \",COUNTRY_INFO!A21)","v":"Togo"},{"$f":"IF(COUNTRY_INFO!B21=0,\" \",COUNTRY_INFO!B21)","v":"LOME-COMMUNE"},{"$f":"IF(COUNTRY_INFO!C21=0,\" \",COUNTRY_INFO!C21)","v":"DISTRICT N°1"},{"$f":"IF(OR(COUNTRY_INFO!$T$9:$T$1000=\"T3 (ALB/MBD)\",COUNTRY_INFO!$U$9:$U$1000=\"T3 (ALB/MBD)\"), \"T3 (ALB/MBD)\", \" \")","v":" "},null,null,null,0,null,0,null,null,null,0," "," "," "," "]
[{"$f":"IF(COUNTRY_INFO!A22=0,\" \",COUNTRY_INFO!A22)","v":"Togo"},{"$f":"IF(COUNTRY_INFO!B22=0,\" \",COUNTRY_INFO!B22)","v":"LOME-COMMUNE"},{"$f":"IF(COUNTRY_INFO!C22=0,\" \",COUNTRY_INFO!C22)","v":"DISTRICT N°2"},{"$f":"IF(OR(COUNTRY_INFO!$T$9:$T$1000=\"T3 (ALB/MBD)\",COUNTRY_INFO!$U$9:$U$1000=\"T3 (ALB/MBD)\"), \"T3 (ALB/MBD)\", \" \")","v":" "},null,null,null,0,null,0,null,null,null,0," "," "," "," "]
[{"$f":"IF(COUNTRY_INFO!A23=0,\" \",COUNTRY_INFO!A23)","v":"Togo"},{"$f":"IF(COUNTRY_INFO!B23=0,\" \",COUNTRY_INFO!B23)","v":"LOME-COMMUNE"},{"$f":"IF(COUNTRY_INFO!C23=0,\" \",COUNTRY_INFO!C23)","v":"DISTRICT N°3"},{"$f":"IF(OR(COUNTRY_INFO!$T$9:$T$1000=\"T3 (ALB/MBD)\",COUNTRY_INFO!$U$9:$U$1000=\"T3 (ALB/MBD)\"), \"T3 (ALB/MBD)\", \" \")","v":" "},null,null,null,0,null,0,null,null,null,0," "," "," "," "]
[{"$f":"IF(COUNTRY_INFO!A24=0,\" \",COUNTRY_INFO!A24)","v":"Togo"},{"$f":"IF(COUNTRY_INFO!B24=0,\" \",COUNTRY_INFO!B24)","v":"LOME-COMMUNE"},{"$f":"IF(COUNTRY_INFO!C24=0,\" \",COUNTRY_INFO!C24)","v":"DISTRICT N°4"},{"$f":"IF(OR(COUNTRY_INFO!$T$9:$T$1000=\"T3 (ALB/MBD)\",COUNTRY_INFO!$U$9:$U$1000=\"T3 (ALB/MBD)\"), \"T3 (ALB/MBD)\", \" \")","v":" "},null,null,null,0,null,0,null,null,null,0," "," "," "," "]
[{"$f":"IF(COUNTRY_INFO!A25=0,\" \",COUNTRY_INFO!A25)","v":"Togo"},{"$f":"IF(COUNTRY_INFO!B25=0,\" \",COUNTRY_INFO!B25)","v":"LOME-COMMUNE"},{"$f":"IF(COUNTRY_INFO!C25=0,\" \",COUNTRY_INFO!C25)","v":"DISTRICT N°5"},{"$f":"IF(OR(COUNTRY_INFO!$T$9:$T$1000=\"T3 (ALB/MBD)\",COUNTRY_INFO!$U$9:$U$1000=\"T3 (ALB/MBD)\"), \"T3 (ALB/MBD)\", \" \")","v":" "},null,null,null,0,null,0,null,null,null,0," "," "," "," "]
[{"$f":"IF(COUNTRY_INFO!A26=0,\" \",COUNTRY_INFO!A26)","v":"Togo"},{"$f":"IF(COUNTRY_INFO!B26=0,\" \",COUNTRY_INFO!B26)","v":"MARITIME"},{"$f":"IF(COUNTRY_INFO!C26=0,\" \",COUNTRY_INFO!C26)","v":"AVE"},{"$f":"IF(OR(COUNTRY_INFO!$T$9:$T$1000=\"T3 (ALB/MBD)\",COUNTRY_INFO!$U$9:$U$1000=\"T3 (ALB/MBD)\"), \"T3 (ALB/MBD)\", \" \")","v":"T3 (ALB/MBD)"},"ALB","Juin 2019",null,41430,null,41430,null,41330,null,41330," ",99.758629012792667," ",99.758629012792667]
[{"$f":"IF(COUNTRY_INFO!A27=0,\" \",COUNTRY_INFO!A27)","v":"Togo"},{"$f":"IF(COUNTRY_INFO!B27=0,\" \",COUNTRY_INFO!B27)","v":"MARITIME"},{"$f":"IF(COUNTRY_INFO!C27=0,\" \",COUNTRY_INFO!C27)","v":"BAS MONO"},"T3 (ALB/MBD)","ALB","Juin 2019",null,33728,null,33728,null,33712,null,33712," ",99.952561669829223," ",99.952561669829223]
[{"$f":"IF(COUNTRY_INFO!A28=0,\" \",COUNTRY_INFO!A28)","v":"Togo"},{"$f":"IF(COUNTRY_INFO!B28=0,\" \",COUNTRY_INFO!B28)","v":"MARITIME"},{"$f":"IF(COUNTRY_INFO!C28=0,\" \",COUNTRY_INFO!C28)","v":"GOLFE"},{"$f":"IF(OR(COUNTRY_INFO!$T$9:$T$1000=\"T3 (ALB/MBD)\",COUNTRY_INFO!$U$9:$U$1000=\"T3 (ALB/MBD)\"), \"T3 (ALB/MBD)\", \" \")","v":"T3 (ALB/MBD)"},"ALB","Juin 2019",null,228959,null,228959,null,227485,null,227485," ",99.356216615201859," ",99.356216615201859]
[{"$f":"IF(COUNTRY_INFO!A29=0,\" \",COUNTRY_INFO!A29)","v":"Togo"},{"$f":"IF(COUNTRY_INFO!B29=0,\" \",COUNTRY_INFO!B29)","v":"MARITIME"},{"$f":"IF(COUNTRY_INFO!C29=0,\" \",COUNTRY_INFO!C29)","v":"LACS"},{"$f":"IF(OR(COUNTRY_INFO!$T$9:$T$1000=\"T3 (ALB/MBD)\",COUNTRY_INFO!$U$9:$U$1000=\"T3 (ALB/MBD)\"), \"T3 (ALB/MBD)\", \" \")","v":"T3 (ALB/MBD)"},"ALB","Juin 2019",null,61111,null,61111,null,60772,null,60772," ",99.445271718675855," ",99.445271718675855]
[{"$f":"IF(COUNTRY_INFO!A30=0,\" \",COUNTRY_INFO!A30)","v":"Togo"},{"$f":"IF(COUNTRY_INFO!B30=0,\" \",COUNTRY_INFO!B30)","v":"MARITIME"},{"$f":"IF(COUNTRY_INFO!C30=0,\" \",COUNTRY_INFO!C30)","v":"VO"},{"$f":"IF(OR(COUNTRY_INFO!$T$9:$T$1000=\"T3 (ALB/MBD)\",COUNTRY_INFO!$U$9:$U$1000=\"T3 (ALB/MBD)\"), \"T3 (ALB/MBD)\", \" \")","v":"T3 (ALB/MBD)"},"ALB","Juin 2019",null,74057,null,74057,null,73828,null,73828," ",99.690778724495999," ",99.690778724495999]
[{"$f":"IF(COUNTRY_INFO!A31=0,\" \",COUNTRY_INFO!A31)","v":"Togo"},{"$f":"IF(COUNTRY_INFO!B31=0,\" \",COUNTRY_INFO!B31)","v":"MARITIME"},{"$f":"IF(COUNTRY_INFO!C31=0,\" \",COUNTRY_INFO!C31)","v":"YOTO"},{"$f":"IF(OR(COUNTRY_INFO!$T$9:$T$1000=\"T3 (ALB/MBD)\",COUNTRY_INFO!$U$9:$U$1000=\"T3 (ALB/MBD)\"), \"T3 (ALB/MBD)\", \" \")","v":"T3 (ALB/MBD)"},"ALB","Juin 2019",null,87394,null,87394,null,86783,null,86783," ",99.300867336430414," ",99.300867336430414]
[{"$f":"IF(COUNTRY_INFO!A32=0,\" \",COUNTRY_INFO!A32)","v":"Togo"},{"$f":"IF(COUNTRY_INFO!B32=0,\" \",COUNTRY_INFO!B32)","v":"MARITIME"},{"$f":"IF(COUNTRY_INFO!C32=0,\" \",COUNTRY_INFO!C32)","v":"ZIO"},"T3 (ALB/MBD)","ALB","Juin 2019",null,132604,null,132604,null,132017,null,132017," ",99.557328587372922," ",99.557328587372922]
[{"$f":"IF(COUNTRY_INFO!A33=0,\" \",COUNTRY_INFO!A33)","v":"Togo"},{"$f":"IF(COUNTRY_INFO!B33=0,\" \",COUNTRY_INFO!B33)","v":"PLATEAUX"},{"$f":"IF(COUNTRY_INFO!C33=0,\" \",COUNTRY_INFO!C33)","v":"AGOU"},{"$f":"IF(OR(COUNTRY_INFO!$T$9:$T$1000=\"T3 (ALB/MBD)\",COUNTRY_INFO!$U$9:$U$1000=\"T3 (ALB/MBD)\"), \"T3 (ALB/MBD)\", \" \")","v":"T3 (ALB/MBD)"},"ALB","Juin 2019",null,31357,null,31357,null,31354,null,31354," ",99.990432758235798," ",99.990432758235798]
[{"$f":"IF(COUNTRY_INFO!A34=0,\" \",COUNTRY_INFO!A34)","v":"Togo"},{"$f":"IF(COUNTRY_INFO!B34=0,\" \",COUNTRY_INFO!B34)","v":"PLATEAUX"},{"$f":"IF(COUNTRY_INFO!C34=0,\" \",COUNTRY_INFO!C34)","v":"AKEBOU"},{"$f":"IF(OR(COUNTRY_INFO!$T$9:$T$1000=\"T3 (ALB/MBD)\",COUNTRY_INFO!$U$9:$U$1000=\"T3 (ALB/MBD)\"), \"T3 (ALB/MBD)\", \" \")","v":"T3 (ALB/MBD)"},"ALB","Juin 2019",null,21568,null,21568,null,21568,null,21568," ",100," ",100]
[{"$f":"IF(COUNTRY_INFO!A35=0,\" \",COUNTRY_INFO!A35)","v":"Togo"},{"$f":"IF(COUNTRY_INFO!B35=0,\" \",COUNTRY_INFO!B35)","v":"PLATEAUX"},{"$f":"IF(COUNTRY_INFO!C35=0,\" \",COUNTRY_INFO!C35)","v":"AMOU"},{"$f":"IF(OR(COUNTRY_INFO!$T$9:$T$1000=\"T3 (ALB/MBD)\",COUNTRY_INFO!$U$9:$U$1000=\"T3 (ALB/MBD)\"), \"T3 (ALB/MBD)\", \" \")","v":"T3 (ALB/MBD)"},"ALB","Juin 2019",null,36974,null,36974,null,36901,null,36901," ",99.802563963866504," ",99.802563963866504]
[{"$f":"IF(COUNTRY_INFO!A36=0,\" \",COUNTRY_INFO!A36)","v":"Togo"},{"$f":"IF(COUNTRY_INFO!B36=0,\" \",COUNTRY_INFO!B36)","v":"PLATEAUX"},{"$f":"IF(COUNTRY_INFO!C36=0,\" \",COUNTRY_INFO!C36)","v":"ANIE"},{"$f":"IF(OR(COUNTRY_INFO!$T$9:$T$1000=\"T3 (ALB/MBD)\",COUNTRY_INFO!$U$9:$U$1000=\"T3 (ALB/MBD)\"), \"T3 (ALB/MBD)\", \" \")","v":"T3 (ALB/MBD)"},"ALB","Juin 2019",null,50731,null,50731,null,50675,null,50675," ",99.889613845577657," ",99.889613845577657]
[{"$f":"IF(COUNTRY_INFO!A37=0,\" \",COUNTRY_INFO!A37)","v":"Togo"},{"$f":"IF(COUNTRY_INFO!B37=0,\" \",COUNTRY_INFO!B37)","v":"PLATEAUX"},{"$f":"IF(COUNTRY_INFO!C37=0,\" \",COUNTRY_INFO!C37)","v":"DANYI"},{"$f":"IF(OR(COUNTRY_INFO!$T$9:$T$1000=\"T3 (ALB/MBD)\",COUNTRY_INFO!$U$9:$U$1000=\"T3 (ALB/MBD)\"), \"T3 (ALB/MBD)\", \" \")","v":"T3 (ALB/MBD)"},"ALB","Juin 2019",null,12740,null,12740,null,12740,null,12740," ",100," ",100]
[{"$f":"IF(COUNTRY_INFO!A38=0,\" \",COUNTRY_INFO!A38)","v":"Togo"},{"$f":"IF(COUNTRY_INFO!B38=0,\" \",COUNTRY_INFO!B38)","v":"PLATEAUX"},{"$f":"IF(COUNTRY_INFO!C38=0,\" \",COUNTRY_INFO!C38)","v":"EST MONO"},{"$f":"IF(OR(COUNTRY_INFO!$T$9:$T$1000=\"T3 (ALB/MBD)\",COUNTRY_INFO!$U$9:$U$1000=\"T3 (ALB/MBD)\"), \"T3 (ALB/MBD)\", \" \")","v":"T3 (ALB/MBD)"},"ALB","Juin 2019",null,45155,null,45155,null,44727,null,44727," ",99.052153692835788," ",99.052153692835788]
[{"$f":"IF(COUNTRY_INFO!A39=0,\" \",COUNTRY_INFO!A39)","v":"Togo"},{"$f":"IF(COUNTRY_INFO!B39=0,\" \",COUNTRY_INFO!B39)","v":"PLATEAUX"},{"$f":"IF(COUNTRY_INFO!C39=0,\" \",COUNTRY_INFO!C39)","v":"HAHO"},{"$f":"IF(OR(COUNTRY_INFO!$T$9:$T$1000=\"T3 (ALB/MBD)\",COUNTRY_INFO!$U$9:$U$1000=\"T3 (ALB/MBD)\"), \"T3 (ALB/MBD)\", \" \")","v":"T3 (ALB/MBD)"},"ALB","Juin 2019",null,96901,null,96901,null,96901,null,96901," ",100," ",100]
[{"$f":"IF(COUNTRY_INFO!A40=0,\" \",COUNTRY_INFO!A40)","v":"Togo"},{"$f":"IF(COUNTRY_INFO!B40=0,\" \",COUNTRY_INFO!B40)","v":"PLATEAUX"},{"$f":"IF(COUNTRY_INFO!C40=0,\" \",COUNTRY_INFO!C40)","v":"KLOTO"},{"$f":"IF(OR(COUNTRY_INFO!$T$9:$T$1000=\"T3 (ALB/MBD)\",COUNTRY_INFO!$U$9:$U$1000=\"T3 (ALB/MBD)\"), \"T3 (ALB/MBD)\", \" \")","v":"T3 (ALB/MBD)"},"ALB","Juin 2019",null,41335,null,41335,null,41323,null,41323," ",99.970968912543839," ",99.970968912543839]
[{"$f":"IF(COUNTRY_INFO!A41=0,\" \",COUNTRY_INFO!A41)","v":"Togo"},{"$f":"IF(COUNTRY_INFO!B41=0,\" \",COUNTRY_INFO!B41)","v":"PLATEAUX"},{"$f":"IF(COUNTRY_INFO!C41=0,\" \",COUNTRY_INFO!C41)","v":"KPELE"},{"$f":"IF(OR(COUNTRY_INFO!$T$9:$T$1000=\"T3 (ALB/MBD)\",COUNTRY_INFO!$U$9:$U$1000=\"T3 (ALB/MBD)\"), \"T3 (ALB/MBD)\", \" \")","v":"T3 (ALB/MBD)"},"ALB","Juin 2019",null,24339,null,24339,null,24336,null,24336," ",99.987674103291013," ",99.987674103291013]
[{"$f":"IF(COUNTRY_INFO!A42=0,\" \",COUNTRY_INFO!A42)","v":"Togo"},{"$f":"IF(COUNTRY_INFO!B42=0,\" \",COUNTRY_INFO!B42)","v":"PLATEAUX"},{"$f":"IF(COUNTRY_INFO!C42=0,\" \",COUNTRY_INFO!C42)","v":"MOYEN MONO"},{"$f":"IF(OR(COUNTRY_INFO!$T$9:$T$1000=\"T3 (ALB/MBD)\",COUNTRY_INFO!$U$9:$U$1000=\"T3 (ALB/MBD)\"), \"T3 (ALB/MBD)\", \" \")","v":"T3 (ALB/MBD)"},"ALB","Juin 2019",null,28362,null,28362,null,26398,null,26398," ",93.075241520344122," ",93.075241520344122]
[{"$f":"IF(COUNTRY_INFO!A43=0,\" \",COUNTRY_INFO!A43)","v":"Togo"},{"$f":"IF(COUNTRY_INFO!B43=0,\" \",COUNTRY_INFO!B43)","v":"PLATEAUX"},{"$f":"IF(COUNTRY_INFO!C43=0,\" \",COUNTRY_INFO!C43)","v":"OGOU"},{"$f":"IF(OR(COUNTRY_INFO!$T$9:$T$1000=\"T3 (ALB/MBD)\",COUNTRY_INFO!$U$9:$U$1000=\"T3 (ALB/MBD)\"), \"T3 (ALB/MBD)\", \" \")","v":"T3 (ALB/MBD)"},"ALB","Juin 2019",null,70205,null,70205,null,70205,null,70205," ",100," ",100]
[{"$f":"IF(COUNTRY_INFO!A44=0,\" \",COUNTRY_INFO!A44)","v":"Togo"},{"$f":"IF(COUNTRY_INFO!B44=0,\" \",COUNTRY_INFO!B44)","v":"PLATEAUX"},{"$f":"IF(COUNTRY_INFO!C44=0,\" \",COUNTRY_INFO!C44)","v":"WAWA"},{"$f":"IF(OR(COUNTRY_INFO!$T$9:$T$1000=\"T3 (ALB/MBD)\",COUNTRY_INFO!$U$9:$U$1000=\"T3 (ALB/MBD)\"), \"T3 (ALB/MBD)\", \" \")","v":"T3 (ALB/MBD)"},"ALB","Juin 2019",null,39146,null,39146,null,39133,null,39133," ",99.966790987584943," ",99.966790987584943]
[{"$f":"IF(COUNTRY_INFO!A45=0,\" \",COUNTRY_INFO!A45)","v":"Togo"},{"$f":"IF(COUNTRY_INFO!B45=0,\" \",COUNTRY_INFO!B45)","v":"SAVANES"},{"$f":"IF(COUNTRY_INFO!C45=0,\" \",COUNTRY_INFO!C45)","v":"CINKASSE"},"T3 (ALB/MBD)","ALB","Juin 2019",null,30578,null,30578,null,30578,null,30578," ",100," ",100]
[{"$f":"IF(COUNTRY_INFO!A46=0,\" \",COUNTRY_INFO!A46)","v":"Togo"},{"$f":"IF(COUNTRY_INFO!B46=0,\" \",COUNTRY_INFO!B46)","v":"SAVANES"},{"$f":"IF(COUNTRY_INFO!C46=0,\" \",COUNTRY_INFO!C46)","v":"KPENDJAL"},{"$f":"IF(OR(COUNTRY_INFO!$T$9:$T$1000=\"T3 (ALB/MBD)\",COUNTRY_INFO!$U$9:$U$1000=\"T3 (ALB/MBD)\"), \"T3 (ALB/MBD)\", \" \")","v":"T3 (ALB/MBD)"},"ALB","Juin 2019",null,67578,null,67578,null,67578,null,67578," ",100," ",100]
[{"$f":"IF(COUNTRY_INFO!A47=0,\" \",COUNTRY_INFO!A47)","v":"Togo"},{"$f":"IF(COUNTRY_INFO!B47=0,\" \",COUNTRY_INFO!B47)","v":"SAVANES"},{"$f":"IF(COUNTRY_INFO!C47=0,\" \",COUNTRY_INFO!C47)","v":"OTI"},{"$f":"IF(OR(COUNTRY_INFO!$T$9:$T$1000=\"T3 (ALB/MBD)\",COUNTRY_INFO!$U$9:$U$1000=\"T3 (ALB/MBD)\"), \"T3 (ALB/MBD)\", \" \")","v":"T3 (ALB/MBD)"},"ALB","Juin 2019",null,76003,null,76003,null,76003,null,76003," ",100," ",100]
[{"$f":"IF(COUNTRY_INFO!A48=0,\" \",COUNTRY_INFO!A48)","v":"Togo"},{"$f":"IF(COUNTRY_INFO!B48=0,\" \",COUNTRY_INFO!B48)","v":"SAVANES"},{"$f":"IF(COUNTRY_INFO!C48=0,\" \",COUNTRY_INFO!C48)","v":"TANDJOARE"},{"$f":"IF(OR(COUNTRY_INFO!$T$9:$T$1000=\"T3 (ALB/MBD)\",COUNTRY_INFO!$U$9:$U$1000=\"T3 (ALB/MBD)\"), \"T3 (ALB/MBD)\", \" \")","v":"T3 (ALB/MBD)"},"ALB","Juin 2019",null,47633,null,47633,null,47556,null,47556," ",99.838347364222273," ",99.838347364222273]
[{"$f":"IF(COUNTRY_INFO!A49=0,\" \",COUNTRY_INFO!A49)","v":"Togo"},{"$f":"IF(COUNTRY_INFO!B49=0,\" \",COUNTRY_INFO!B49)","v":"SAVANES"},{"$f":"IF(COUNTRY_INFO!C49=0,\" \",COUNTRY_INFO!C49)","v":"TONE"},"T3 (ALB/MBD)","ALB","Juin 2019",null,106245,null,106245,null,106237,null,106237," ",99.992470233893357," ",99.992470233893357]

{"sheet":"T3_R2","index":8,"n_rows":49,"n_cols":18,"rows_kept":49,"cut":false,"hidden":false,"merged":[[5,6,5,9],[5,10,5,13],[5,14,5,17],[3,0,3,2],[5,0,5,2],[5,3,6,3],[5,5,6,5],[5,4,6,4]]}
["T 3 - Albendazole (ALB) ou Mebendazole (MBD) - Tournée 2"]
["Structure administrative, population nécessitant une chimioprévention par groupe d'âge, population traitée par groupe d'âge et couverture"]
[]
["TOTAL",null,null,null,null,null,{"$f":"SUM(G$9:G$1000)","v":0},425234,0,425234,0,423250,0,423250,{"$f":"IF(G4<>0, IF(K4/G4*100=0, \"-\", K4/G4*100), \" \")","v":" "},{"$f":"IF(H4<>0, IF(L4/H4*100=0, \"-\", L4/H4*100), \" \")","v":99.533433356693024},{"$f":"IF(I4<>0, IF(M4/I4*100=0, \"-\", M4/I4*100), \" \")","v":" "},{"$f":"IF(J4<>0, IF(N4/J4*100=0, \"-\", N4/J4*100), \" \")","v":99.533433356693024}]
[]
["Structure administrative du pays",null,null,"Mise en oeuvre \nde la CP","Médica-ment","Date","Population ciblée pour T3",null,null,null,"Population traitée",null,null,null,"Couverture du Programme (%)"]
["Pays","Région/Département","District",null,null,null,"EAPréS","EAS","Adultes","Total","EAPréS","EAS","Adultes","Total","EAPréS","EAS","Adultes","Total"]
[]
[{"$f":"IF(COUNTRY_INFO!A9=0,\" \",COUNTRY_INFO!A9)","v":"Togo"},{"$f":"IF(COUNTRY_INFO!B9=0,\" \",COUNTRY_INFO!B9)","v":"CENTRALE"},{"$f":"IF(COUNTRY_INFO!C9=0,\" \",COUNTRY_INFO!C9)","v":"BLITTA"},{"$f":"IF(AND(COUNTRY_INFO!$T$9:$T$1000=\"T3 (ALB/MBD)\",COUNTRY_INFO!$U$9:$U$1000=\"T3 (ALB/MBD)\"), \"T3 (ALB/MBD)\", \" \")","v":" "},null,null,null,null,null,{"$f":"SUM(G9:I9)","v":0},null,null,null,{"$f":"SUM(K9:M9)","v":0},{"$f":"IF(G9<>0, IF(K9/G9*100=0, \"-\", K9/G9*100), \" \")","v":" "},{"$f":"IF(H9<>0, IF(L9/H9*100=0, \"-\", L9/H9*100), \" \")","v":" "},{"$f":"IF(I9<>0, IF(M9/I9*100=0, \"-\", M9/I9*100), \" \")","v":" "},{"$f":"IF(J9<>0, IF(N9/J9*100=0, \"-\", N9/J9*100), \" \")","v":" "}]
[{"$f":"IF(COUNTRY_INFO!A10=0,\" \",COUNTRY_INFO!A10)","v":"Togo"},{"$f":"IF(COUNTRY_INFO!B10=0,\" \",COUNTRY_INFO!B10)","v":"CENTRALE"},{"$f":"IF(COUNTRY_INFO!C10=0,\" \",COUNTRY_INFO!C10)","v":"MÔ"},{"$f":"IF(AND(COUNTRY_INFO!$T$9:$T$1000=\"T3 (ALB/MBD)\",COUNTRY_INFO!$U$9:$U$1000=\"T3 (ALB/MBD)\"), \"T3 (ALB/MBD)\", \" \")","v":" "},null,null,null,null,null,{"$f":"SUM(G10:I10)","v":0},null,null,null,{"$f":"SUM(K10:M10)","v":0},{"$f":"IF(G10<>0, IF(K10/G10*100=0, \"-\", K10/G10*100), \" \")","v":" "},{"$f":"IF(H10<>0, IF(L10/H10*100=0, \"-\", L10/H10*100), \" \")","v":" "},{"$f":"IF(I10<>0, IF(M10/I10*100=0, \"-\", M10/I10*100), \" \")","v":" "},{"$f":"IF(J10<>0, IF(N10/J10*100=0, \"-\", N10/J10*100), \" \")","v":" "}]
[{"$f":"IF(COUNTRY_INFO!A11=0,\" \",COUNTRY_INFO!A11)","v":"Togo"},{"$f":"IF(COUNTRY_INFO!B11=0,\" \",COUNTRY_INFO!B11)","v":"CENTRALE"},{"$f":"IF(COUNTRY_INFO!C11=0,\" \",COUNTRY_INFO!C11)","v":"SOTOUBOUA"},{"$f":"IF(AND(COUNTRY_INFO!$T$9:$T$1000=\"T3 (ALB/MBD)\",COUNTRY_INFO!$U$9:$U$1000=\"T3 (ALB/MBD)\"), \"T3 (ALB/MBD)\", \" \")","v":" "},null,null,null,null,null,0,null,null,null,0," "," "," "," "]
[{"$f":"IF(COUNTRY_INFO!A12=0,\" \",COUNTRY_INFO!A12)","v":"Togo"},{"$f":"IF(COUNTRY_INFO!B12=0,\" \",COUNTRY_INFO!B12)","v":"CENTRALE"},{"$f":"IF(COUNTRY_INFO!C12=0,\" \",COUNTRY_INFO!C12)","v":"TCHAMBA"},{"$f":"IF(AND(COUNTRY_INFO!$T$9:$T$1000=\"T3 (ALB/MBD)\",COUNTRY_INFO!$U$9:$U$1000=\"T3 (ALB/MBD)\"), \"T3 (ALB/MBD)\", \" \")","v":" "},null,null,null,null,null,0,null,null,null,0," "," "," "," "]
[{"$f":"IF(COUNTRY_INFO!A13=0,\" \",COUNTRY_INFO!A13)","v":"Togo"},{"$f":"IF(COUNTRY_INFO!B13=0,\" \",COUNTRY_INFO!B13)","v":"CENTRALE"},{"$f":"IF(COUNTRY_INFO!C13=0,\" \",COUNTRY_INFO!C13)","v":"TCHAOUDJO"},{"$f":"IF(AND(COUNTRY_INFO!$T$9:$T$1000=\"T3 (ALB/MBD)\",COUNTRY_INFO!$U$9:$U$1000=\"T3 (ALB/MBD)\"), \"T3 (ALB/MBD)\", \" \")","v":" "},null,null,null,null,null,0,null,null,null,0," "," "," "," "]
[{"$f":"IF(COUNTRY_INFO!A14=0,\" \",COUNTRY_INFO!A14)","v":"Togo"},{"$f":"IF(COUNTRY_INFO!B14=0,\" \",COUNTRY_INFO!B14)","v":"KARA"},{"$f":"IF(COUNTRY_INFO!C14=0,\" \",COUNTRY_INFO!C14)","v":"ASSOLI"},{"$f":"IF(AND(COUNTRY_INFO!$T$9:$T$1000=\"T3 (ALB/MBD)\",COUNTRY_INFO!$U$9:$U$1000=\"T3 (ALB/MBD)\"), \"T3 (ALB/MBD)\", \" \")","v":" "},null,null,null,null,null,0,null,null,null,0," "," "," "," "]
[{"$f":"IF(COUNTRY_INFO!A15=0,\" \",COUNTRY_INFO!A15)","v":"Togo"},{"$f":"IF(COUNTRY_INFO!B15=0,\" \",COUNTRY_INFO!B15)","v":"KARA"},{"$f":"IF(COUNTRY_INFO!C15=0,\" \",COUNTRY_INFO!C15)","v":"BASSAR"},{"$f":"IF(AND(COUNTRY_INFO!$T$9:$T$1000=\"T3 (ALB/MBD)\",COUNTRY_INFO!$U$9:$U$1000=\"T3 (ALB/MBD)\"), \"T3 (ALB/MBD)\", \" \")","v":" "},null,null,null,null,null,0,null,null,null,0," "," "," "," "]
[{"$f":"IF(COUNTRY_INFO!A16=0,\" \",COUNTRY_INFO!A16)","v":"Togo"},{"$f":"IF(COUNTRY_INFO!B16=0,\" \",COUNTRY_INFO!B16)","v":"KARA"},{"$f":"IF(COUNTRY_INFO!C16=0,\" \",COUNTRY_INFO!C16)","v":"BINAH"},{"$f":"IF(AND(COUNTRY_INFO!$T$9:$T$1000=\"T3 (ALB/MBD)\",COUNTRY_INFO!$U$9:$U$1000=\"T3 (ALB/MBD)\"), \"T3 (ALB/MBD)\", \" \")","v":" "},null,null,null,null,null,0,null,null,null,0," "," "," "," "]
[{"$f":"IF(COUNTRY_INFO!A17=0,\" \",COUNTRY_INFO!A17)","v":"Togo"},{"$f":"IF(COUNTRY_INFO!B17=0,\" \",COUNTRY_INFO!B17)","v":"KARA"},{"$f":"IF(COUNTRY_INFO!C17=0,\" \",COUNTRY_INFO!C17)","v":"DANKPEN"},{"$f":"IF(AND(COUNTRY_INFO!$T$9:$T$1000=\"T3 (ALB/MBD)\",COUNTRY_INFO!$U$9:$U$1000=\"T3 (ALB/MBD)\"), \"T3 (ALB/MBD)\", \" \")","v":" "},null,null,null,null,null,0,null,null,null,0," "," "," "," "]
[{"$f":"IF(COUNTRY_INFO!A18=0,\" \",COUNTRY_INFO!A18)","v":"Togo"},{"$f":"IF(COUNTRY_INFO!B18=0,\" \",COUNTRY_INFO!B18)","v":"KARA"},{"$f":"IF(COUNTRY_INFO!C18=0,\" \",COUNTRY_INFO!C18)","v":"DOULFELGOU"},{"$f":"IF(AND(COUNTRY_INFO!$T$9:$T$1000=\"T3 (ALB/MBD)\",COUNTRY_INFO!$U$9:$U$1000=\"T3 (ALB/MBD)\"), \"T3 (ALB/MBD)\", \" \")","v":" "},null,null,null,null,null,0,null,null,null,0," "," "," "," "]
[{"$f":"IF(COUNTRY_INFO!A19=0,\" \",COUNTRY_INFO!A19)","v":"Togo"},{"$f":"IF(COUNTRY_INFO!B19=0,\" \",COUNTRY_INFO!B19)","v":"KARA"},{"$f":"IF(COUNTRY_INFO!C19=0,\" \",COUNTRY_INFO!C19)","v":"KERAN"},{"$f":"IF(AND(COUNTRY_INFO!$T$9:$T$1000=\"T3 (ALB/MBD)\",COUNTRY_INFO!$U$9:$U$1000=\"T3 (ALB/MBD)\"), \"T3 (ALB/MBD)\", \" \")","v":" "},null,null,null,null,null,0,null,null,null,0," "," "," "," "]
[{"$f":"IF(COUNTRY_INFO!A20=0,\" \",COUNTRY_INFO!A20)","v":"Togo"},{"$f":"IF(COUNTRY_INFO!B20=0,\" \",COUNTRY_INFO!B20)","v":"KARA"},{"$f":"IF(COUNTRY_INFO!C20=0,\" \",COUNTRY_INFO!C20)","v":"KOZAH"},{"$f":"IF(AND(COUNTRY_INFO!$T$9:$T$1000=\"T3 (ALB/MBD)\",COUNTRY_INFO!$U$9:$U$1000=\"T3 (ALB/MBD)\"), \"T3 (ALB/MBD)\", \" \")","v":" "},null,null,null,null,null,0,null,null,null,0," "," "," "," "]
[{"$f":"IF(COUNTRY_INFO!A21=0,\" \",COUNTRY_INFO!A21)","v":"Togo"},{"$f":"IF(COUNTRY_INFO!B21=0,\" \",COUNTRY_INFO!B21)","v":"LOME-COMMUNE"},{"$f":"IF(COUNTRY_INFO!C21=0,\" \",COUNTRY_INFO!C21)","v":"DISTRICT N°1"},{"$f":"IF(AND(COUNTRY_INFO!$T$9:$T$1000=\"T3 (ALB/MBD)\",COUNTRY_INFO!$U$9:$U$1000=\"T3 (ALB/MBD)\"), \"T3 (ALB/MBD)\", \" \")","v":" "},null,null,null,null,null,0,null,null,null,0," "," "," "," "]
[{"$f":"IF(COUNTRY_INFO!A22=0,\" \",COUNTRY_INFO!A22)","v":"Togo"},{"$f":"IF(COUNTRY_INFO!B22=0,\" \",COUNTRY_INFO!B22)","v":"LOME-COMMUNE"},{"$f":"IF(COUNTRY_INFO!C22=0,\" \",COUNTRY_INFO!C22)","v":"DISTRICT N°2"},{"$f":"IF(AND(COUNTRY_INFO!$T$9:$T$1000=\"T3 (ALB/MBD)\",COUNTRY_INFO!$U$9:$U$1000=\"T3 (ALB/MBD)\"), \"T3 (ALB/MBD)\", \" \")","v":" "},null,null,null,null,null,0,null,null,null,0," "," "," "," "]
[{"$f":"IF(COUNTRY_INFO!A23=0,\" \",COUNTRY_INFO!A23)","v":"Togo"},{"$f":"IF(COUNTRY_INFO!B23=0,\" \",COUNTRY_INFO!B23)","v":"LOME-COMMUNE"},{"$f":"IF(COUNTRY_INFO!C23=0,\" \",COUNTRY_INFO!C23)","v":"DISTRICT N°3"},{"$f":"IF(AND(COUNTRY_INFO!$T$9:$T$1000=\"T3 (ALB/MBD)\",COUNTRY_INFO!$U$9:$U$1000=\"T3 (ALB/MBD)\"), \"T3 (ALB/MBD)\", \" \")","v":" "},null,null,null,null,null,0,null,null,null,0," "," "," "," "]
[{"$f":"IF(COUNTRY_INFO!A24=0,\" \",COUNTRY_INFO!A24)","v":"Togo"},{"$f":"IF(COUNTRY_INFO!B24=0,\" \",COUNTRY_INFO!B24)","v":"LOME-COMMUNE"},{"$f":"IF(COUNTRY_INFO!C24=0,\" \",COUNTRY_INFO!C24)","v":"DISTRICT N°4"},{"$f":"IF(AND(COUNTRY_INFO!$T$9:$T$1000=\"T3 (ALB/MBD)\",COUNTRY_INFO!$U$9:$U$1000=\"T3 (ALB/MBD)\"), \"T3 (ALB/MBD)\", \" \")","v":" "},null,null,null,null,null,0,null,null,null,0," "," "," "," "]
[{"$f":"IF(COUNTRY_INFO!A25=0,\" \",COUNTRY_INFO!A25)","v":"Togo"},{"$f":"IF(COUNTRY_INFO!B25=0,\" \",COUNTRY_INFO!B25)","v":"LOME-COMMUNE"},{"$f":"IF(COUNTRY_INFO!C25=0,\" \",COUNTRY_INFO!C25)","v":"DISTRICT N°5"},{"$f":"IF(AND(COUNTRY_INFO!$T$9:$T$1000=\"T3 (ALB/MBD)\",COUNTRY_INFO!$U$9:$U$1000=\"T3 (ALB/MBD)\"), \"T3 (ALB/MBD)\", \" \")","v":" "},null,null,null,null,null,0,null,null,null,0," "," "," "," "]
[{"$f":"IF(COUNTRY_INFO!A26=0,\" \",COUNTRY_INFO!A26)","v":"Togo"},{"$f":"IF(COUNTRY_INFO!B26=0,\" \",COUNTRY_INFO!B26)","v":"MARITIME"},{"$f":"IF(COUNTRY_INFO!C26=0,\" \",COUNTRY_INFO!C26)","v":"AVE"},{"$f":"IF(AND(COUNTRY_INFO!$T$9:$T$1000=\"T3 (ALB/MBD)\",COUNTRY_INFO!$U$9:$U$1000=\"T3 (ALB/MBD)\"), \"T3 (ALB/MBD)\", \" \")","v":" "},null,null,null,null,null,0,null,null,null,0," "," "," "," "]
[{"$f":"IF(COUNTRY_INFO!A27=0,\" \",COUNTRY_INFO!A27)","v":"Togo"},{"$f":"IF(COUNTRY_INFO!B27=0,\" \",COUNTRY_INFO!B27)","v":"MARITIME"},{"$f":"IF(COUNTRY_INFO!C27=0,\" \",COUNTRY_INFO!C27)","v":"BAS MONO"},{"$f":"IF(AND(COUNTRY_INFO!$T$9:$T$1000=\"T3 (ALB/MBD)\",COUNTRY_INFO!$U$9:$U$1000=\"T3 (ALB/MBD)\"), \"T3 (ALB/MBD)\", \" \")","v":" "},null,null,null,null,null,0,null,null,null,0," "," "," "," "]
[{"$f":"IF(COUNTRY_INFO!A28=0,\" \",COUNTRY_INFO!A28)","v":"Togo"},{"$f":"IF(COUNTRY_INFO!B28=0,\" \",COUNTRY_INFO!B28)","v":"MARITIME"},{"$f":"IF(COUNTRY_INFO!C28=0,\" \",COUNTRY_INFO!C28)","v":"GOLFE"},{"$f":"IF(AND(COUNTRY_INFO!$T$9:$T$1000=\"T3 (ALB/MBD)\",COUNTRY_INFO!$U$9:$U$1000=\"T3 (ALB/MBD)\"), \"T3 (ALB/MBD)\", \" \")","v":" "},null,null,null,null,null,0,null,null,null,0," "," "," "," "]
[{"$f":"IF(COUNTRY_INFO!A29=0,\" \",COUNTRY_INFO!A29)","v":"Togo"},{"$f":"IF(COUNTRY_INFO!B29=0,\" \",COUNTRY_INFO!B29)","v":"MARITIME"},{"$f":"IF(COUNTRY_INFO!C29=0,\" \",COUNTRY_INFO!C29)","v":"LACS"},{"$f":"IF(AND(COUNTRY_INFO!$T$9:$T$1000=\"T3 (ALB/MBD)\",COUNTRY_INFO!$U$9:$U$1000=\"T3 (ALB/MBD)\"), \"T3 (ALB/MBD)\", \" \")","v":" "},null,null,null,null,null,0,null,null,null,0," "," "," "," "]
[{"$f":"IF(COUNTRY_INFO!A30=0,\" \",COUNTRY_INFO!A30)","v":"Togo"},{"$f":"IF(COUNTRY_INFO!B30=0,\" \",COUNTRY_INFO!B30)","v":"MARITIME"},{"$f":"IF(COUNTRY_INFO!C30=0,\" \",COUNTRY_INFO!C30)","v":"VO"},{"$f":"IF(AND(COUNTRY_INFO!$T$9:$T$1000=\"T3 (ALB/MBD)\",COUNTRY_INFO!$U$9:$U$1000=\"T3 (ALB/MBD)\"), \"T3 (ALB/MBD)\", \" \")","v":" "},null,null,null,null,null,0,null,null,null,0," "," "," "," "]
[{"$f":"IF(COUNTRY_INFO!A31=0,\" \",COUNTRY_INFO!A31)","v":"Togo"},{"$f":"IF(COUNTRY_INFO!B31=0,\" \",COUNTRY_INFO!B31)","v":"MARITIME"},{"$f":"IF(COUNTRY_INFO!C31=0,\" \",COUNTRY_INFO!C31)","v":"YOTO"},"T3 (ALB/MBD)","ALB","Janvier 2020",null,87400,null,87400,null,86516,null,86516," ",98.988558352402748," ",98.988558352402748]
[{"$f":"IF(COUNTRY_INFO!A32=0,\" \",COUNTRY_INFO!A32)","v":"Togo"},{"$f":"IF(COUNTRY_INFO!B32=0,\" \",COUNTRY_INFO!B32)","v":"MARITIME"},{"$f":"IF(COUNTRY_INFO!C32=0,\" \",COUNTRY_INFO!C32)","v":"ZIO"},{"$f":"IF(AND(COUNTRY_INFO!$T$9:$T$1000=\"T3 (ALB/MBD)\",COUNTRY_INFO!$U$9:$U$1000=\"T3 (ALB/MBD)\"), \"T3 (ALB/MBD)\", \" \")","v":" "},null,null,null,null,null,0,null,null,null,0," "," "," "," "]
[{"$f":"IF(COUNTRY_INFO!A33=0,\" \",COUNTRY_INFO!A33)","v":"Togo"},{"$f":"IF(COUNTRY_INFO!B33=0,\" \",COUNTRY_INFO!B33)","v":"PLATEAUX"},{"$f":"IF(COUNTRY_INFO!C33=0,\" \",COUNTRY_INFO!C33)","v":"AGOU"},{"$f":"IF(AND(COUNTRY_INFO!$T$9:$T$1000=\"T3 (ALB/MBD)\",COUNTRY_INFO!$U$9:$U$1000=\"T3 (ALB/MBD)\"), \"T3 (ALB/MBD)\", \" \")","v":" "},null,null,null,null,null,0,null,null,null,0," "," "," "," "]
[{"$f":"IF(COUNTRY_INFO!A34=0,\" \",COUNTRY_INFO!A34)","v":"Togo"},{"$f":"IF(COUNTRY_INFO!B34=0,\" \",COUNTRY_INFO!B34)","v":"PLATEAUX"},{"$f":"IF(COUNTRY_INFO!C34=0,\" \",COUNTRY_INFO!C34)","v":"AKEBOU"},{"$f":"IF(AND(COUNTRY_INFO!$T$9:$T$1000=\"T3 (ALB/MBD)\",COUNTRY_INFO!$U$9:$U$1000=\"T3 (ALB/MBD)\"), \"T3 (ALB/MBD)\", \" \")","v":" "},null,null,null,null,null,0,null,null,null,0," "," "," "," "]
[{"$f":"IF(COUNTRY_INFO!A35=0,\" \",COUNTRY_INFO!A35)","v":"Togo"},{"$f":"IF(COUNTRY_INFO!B35=0,\" \",COUNTRY_INFO!B35)","v":"PLATEAUX"},{"$f":"IF(COUNTRY_INFO!C35=0,\" \",COUNTRY_INFO!C35)","v":"AMOU"},{"$f":"IF(AND(COUNTRY_INFO!$T$9:$T$1000=\"T3 (ALB/MBD)\",COUNTRY_INFO!$U$9:$U$1000=\"T3 (ALB/MBD)\"), \"T3 (ALB/MBD)\", \" \")","v":" "},null,null,null,null,null,0,null,null,null,0," "," "," "," "]
[{"$f":"IF(COUNTRY_INFO!A36=0,\" \",COUNTRY_INFO!A36)","v":"Togo"},{"$f":"IF(COUNTRY_INFO!B36=0,\" \",COUNTRY_INFO!B36)","v":"PLATEAUX"},{"$f":"IF(COUNTRY_INFO!C36=0,\" \",COUNTRY_INFO!C36)","v":"ANIE"},{"$f":"IF(AND(COUNTRY_INFO!$T$9:$T$1000=\"T3 (ALB/MBD)\",COUNTRY_INFO!$U$9:$U$1000=\"T3 (ALB/MBD)\"), \"T3 (ALB/MBD)\", \" \")","v":" "},null,null,null,null,null,0,null,null,null,0," "," "," "," "]
[{"$f":"IF(COUNTRY_INFO!A37=0,\" \",COUNTRY_INFO!A37)","v":"Togo"},{"$f":"IF(COUNTRY_INFO!B37=0,\" \",COUNTRY_INFO!B37)","v":"PLATEAUX"},{"$f":"IF(COUNTRY_INFO!C37=0,\" \",COUNTRY_INFO!C37)","v":"DANYI"},{"$f":"IF(AND(COUNTRY_INFO!$T$9:$T$1000=\"T3 (ALB/MBD)\",COUNTRY_INFO!$U$9:$U$1000=\"T3 (ALB/MBD)\"), \"T3 (ALB/MBD)\", \" \")","v":" "},null,null,null,null,null,0,null,null,null,0," "," "," "," "]
[{"$f":"IF(COUNTRY_INFO!A38=0,\" \",COUNTRY_INFO!A38)","v":"Togo"},{"$f":"IF(COUNTRY_INFO!B38=0,\" \",COUNTRY_INFO!B38)","v":"PLATEAUX"},{"$f":"IF(COUNTRY_INFO!C38=0,\" \",COUNTRY_INFO!C38)","v":"EST MONO"},"T3 (ALB/MBD)","ALB","Janvier 2020",null,46485,null,46485,null,45293,null,45293," ",97.435731956545126," ",97.435731956545126]
[{"$f":"IF(COUNTRY_INFO!A39=0,\" \",COUNTRY_INFO!A39)","v":"Togo"},{"$f":"IF(COUNTRY_INFO!B39=0,\" \",COUNTRY_INFO!B39)","v":"PLATEAUX"},{"$f":"IF(COUNTRY_INFO!C39=0,\" \",COUNTRY_INFO!C39)","v":"HAHO"},"T3 (ALB/MBD)","ALB","Janvier 2020",null,96901,null,96901,null,98570,null,98570," ",101.72237644606351," ",101.72237644606351]
[{"$f":"IF(COUNTRY_INFO!A40=0,\" \",COUNTRY_INFO!A40)","v":"Togo"},{"$f":"IF(COUNTRY_INFO!B40=0,\" \",COUNTRY_INFO!B40)","v":"PLATEAUX"},{"$f":"IF(COUNTRY_INFO!C40=0,\" \",COUNTRY_INFO!C40)","v":"KLOTO"},{"$f":"IF(AND(COUNTRY_INFO!$T$9:$T$1000=\"T3 (ALB/MBD)\",COUNTRY_INFO!$U$9:$U$1000=\"T3 (ALB/MBD)\"), \"T3 (ALB/MBD)\", \" \")","v":" "},null,null,null,null,null,0,null,null,null,0," "," "," "," "]
[{"$f":"IF(COUNTRY_INFO!A41=0,\" \",COUNTRY_INFO!A41)","v":"Togo"},{"$f":"IF(COUNTRY_INFO!B41=0,\" \",COUNTRY_INFO!B41)","v":"PLATEAUX"},{"$f":"IF(COUNTRY_INFO!C41=0,\" \",COUNTRY_INFO!C41)","v":"KPELE"},{"$f":"IF(AND(COUNTRY_INFO!$T$9:$T$1000=\"T3 (ALB/MBD)\",COUNTRY_INFO!$U$9:$U$1000=\"T3 (ALB/MBD)\"), \"T3 (ALB/MBD)\", \" \")","v":" "},null,null,null,null,null,0,null,null,null,0," "," "," "," "]
[{"$f":"IF(COUNTRY_INFO!A42=0,\" \",COUNTRY_INFO!A42)","v":"Togo"},{"$f":"IF(COUNTRY_INFO!B42=0,\" \",COUNTRY_INFO!B42)","v":"PLATEAUX"},{"$f":"IF(COUNTRY_INFO!C42=0,\" \",COUNTRY_INFO!C42)","v":"MOYEN MONO"},{"$f":"IF(AND(COUNTRY_INFO!$T$9:$T$1000=\"T3 (ALB/MBD)\",COUNTRY_INFO!$U$9:$U$1000=\"T3 (ALB/MBD)\"), \"T3 (ALB/MBD)\", \" \")","v":" "},null,null,null,null,null,0,null,null,null,0," "," "," "," "]
[{"$f":"IF(COUNTRY_INFO!A43=0,\" \",COUNTRY_INFO!A43)","v":"Togo"},{"$f":"IF(COUNTRY_INFO!B43=0,\" \",COUNTRY_INFO!B43)","v":"PLATEAUX"},{"$f":"IF(COUNTRY_INFO!C43=0,\" \",COUNTRY_INFO!C43)","v":"OGOU"},"T3 (ALB/MBD)","ALB","Janvier 2020",null,70205,null,70205,null,69437,null,69437," ",98.906060821878782," ",98.906060821878782]
[{"$f":"IF(COUNTRY_INFO!A44=0,\" \",COUNTRY_INFO!A44)","v":"Togo"},{"$f":"IF(COUNTRY_INFO!B44=0,\" \",COUNTRY_INFO!B44)","v":"PLATEAUX"},{"$f":"IF(COUNTRY_INFO!C44=0,\" \",COUNTRY_INFO!C44)","v":"WAWA"},{"$f":"IF(AND(COUNTRY_INFO!$T$9:$T$1000=\"T3 (ALB/MBD)\",COUNTRY_INFO!$U$9:$U$1000=\"T3 (ALB/MBD)\"), \"T3 (ALB/MBD)\", \" \")","v":" "},null,null,null,null,null,0,null,null,null,0," "," "," "," "]
[{"$f":"IF(COUNTRY_INFO!A45=0,\" \",COUNTRY_INFO!A45)","v":"Togo"},{"$f":"IF(COUNTRY_INFO!B45=0,\" \",COUNTRY_INFO!B45)","v":"SAVANES"},{"$f":"IF(COUNTRY_INFO!C45=0,\" \",COUNTRY_INFO!C45)","v":"CINKASSE"},{"$f":"IF(AND(COUNTRY_INFO!$T$9:$T$1000=\"T3 (ALB/MBD)\",COUNTRY_INFO!$U$9:$U$1000=\"T3 (ALB/MBD)\"), \"T3 (ALB/MBD)\", \" \")","v":" "},null,null,null,null,null,0,null,null,null,0," "," "," "," "]
[{"$f":"IF(COUNTRY_INFO!A46=0,\" \",COUNTRY_INFO!A46)","v":"Togo"},{"$f":"IF(COUNTRY_INFO!B46=0,\" \",COUNTRY_INFO!B46)","v":"SAVANES"},{"$f":"IF(COUNTRY_INFO!C46=0,\" \",COUNTRY_INFO!C46)","v":"KPENDJAL"},{"$f":"IF(AND(COUNTRY_INFO!$T$9:$T$1000=\"T3 (ALB/MBD)\",COUNTRY_INFO!$U$9:$U$1000=\"T3 (ALB/MBD)\"), \"T3 (ALB/MBD)\", \" \")","v":" "},null,null,null,null,null,0,null,null,null,0," "," "," "," "]
[{"$f":"IF(COUNTRY_INFO!A47=0,\" \",COUNTRY_INFO!A47)","v":"Togo"},{"$f":"IF(COUNTRY_INFO!B47=0,\" \",COUNTRY_INFO!B47)","v":"SAVANES"},{"$f":"IF(COUNTRY_INFO!C47=0,\" \",COUNTRY_INFO!C47)","v":"OTI"},"T3 (ALB/MBD)","ALB","Janvier 2020",null,76610,null,76610,null,76609,null,76609," ",99.998694687377636," ",99.998694687377636]
[{"$f":"IF(COUNTRY_INFO!A48=0,\" \",COUNTRY_INFO!A48)","v":"Togo"},{"$f":"IF(COUNTRY_INFO!B48=0,\" \",COUNTRY_INFO!B48)","v":"SAVANES"},{"$f":"IF(COUNTRY_INFO!C48=0,\" \",COUNTRY_INFO!C48)","v":"TANDJOARE"},"T3 (ALB/MBD)","ALB","Janvier 2020",null,47633,null,47633,null,46825,null,46825," ",98.30369701677408," ",98.30369701677408]
[{"$f":"IF(COUNTRY_INFO!A49=0,\" \",COUNTRY_INFO!A49)","v":"Togo"},{"$f":"IF(COUNTRY_INFO!B49=0,\" \",COUNTRY_INFO!B49)","v":"SAVANES"},{"$f":"IF(COUNTRY_INFO!C49=0,\" \",COUNTRY_INFO!C49)","v":"TONE"},{"$f":"IF(AND(COUNTRY_INFO!$T$9:$T$1000=\"T3 (ALB/MBD)\",COUNTRY_INFO!$U$9:$U$1000=\"T3 (ALB/MBD)\"), \"T3 (ALB/MBD)\", \" \")","v":" "},null,null,null,null,null,0,null,null,null,0," "," "," "," "]

{"sheet":"DISTRICT","index":9,"n_rows":49,"n_cols":56,"rows_kept":49,"cut":false,"hidden":false,"merged":[[5,26,5,34],[5,3,6,3],[5,9,6,9],[5,15,6,15],[5,25,6,25],[3,0,3,2],[5,0,5,2],[5,4,5,8],[5,10,5,14],[5,16,5,24]]}
["Nombre d'individus traités"]
["Structure administrative, population traitée par groupe d'âge et sexe"]
[]
["TOTAL",null,null,{"$f":"SUM(D$9:D$1000)","v":0},{"$f":"SUM(E$9:E$1000)","v":0},{"$f":"SUM(F$9:F$1000)","v":0},{"$f":"SUM(G$9:G$1000)","v":0},{"$f":"SUM(H$9:H$1000)","v":0},{"$f":"IF(D4>0, IF(H4/D4*100<>0, H4/D4*100, \"-\"),0)","v":0},{"$f":"SUM(J$9:J$1000)","v":3688250},{"$f":"SUM(K$9:K$1000)","v":0},{"$f":"SUM(L$9:L$1000)","v":0},{"$f":"SUM(M$9:M$1000)","v":3068023},{"$f":"SUM(N$9:N$1000)","v":3068023},{"$f":"IF(J4>0, IF(N4/J4*100<>0, N4/J4*100, \"-\"),0)","v":83.183705009150671},{"$f":"SUM(P$9:P$1000)","v":2393570},{"$f":"SUM(Q$9:Q$1000)","v":0},{"$f":"SUM(R$9:R$1000)","v":0},{"$f":"SUM(S$9:S$1000)","v":1998762},{"$f":"SUM(T$9:T$1000)","v":0},null,{"$f":"SUM(V$9:V$1000)","v":1527892},null,{"$f":"SUM(X$9:X$1000)","v":1527892},{"$f":"IF(P4>0, IF(X4/P4*100<>0, X4/P4*100, \"-\"),0)","v":63.833186411928622},{"$f":"SUM(Z$9:Z$1000)","v":2464416.6100000003},0,0,388513,369606.26,null,0,null,369606.26,{"$f":"IF(Z4>0, IF(AH4/Z4*100<>0, AH4/Z4*100, \"-\"),0)","v":14.997718263228228}]
[]
["Structure administrative du pays",null,null,"Population nécessitant la CP pour FL","Population traitée pour la filariose lymphatique",null,null,null,null,"Population nécessitant la CP pour ONCHO","Population traitée pour l'onchocercose",null,null,null,null,"Population nécessitant la CP pour STH","Population traitée pour les géohelminthiases",null,null,null,null,null,null,null,null,"Population nécessitant la CP pour SCH","Population traitée pour la schistosomiase",null,null,null,null,null,null,null,null,null,null,null,null,null,null,{"$f":"SUM(AP9:AP1000)","v":147525.0031080636},{"$f":"SUM(AQ9:AQ1000)","v":881393.0838768892},{"$f":"SUM(AR9:AR1000)","v":1833038.6401091437},{"$f":"SUM(AS9:AS1000)","v":2228149.9570483072},{"$f":"SUM(AT9:AT1000)","v":5090106.6841424033},{"$f":"COUNTIF(AU9:AU1000,\"Y\")","v":24},{"$f":"SUM(AV9:AV1000)","v":0},2000850,1887748,{"$f":"SUM(AY9:AY1000)","v":3888598},0,1724952,1887748,3612700,{"$f":"IF(AT6<>0,BC6/AT6,0)","v":0.7097493675829859}]
["Pays","Région/Département","District",null,"Masculine","Féminine","Total traité","Total traité ayant besoin de CP","(%)",null,"Masculine","Féminine","Total traité","Total traité ayant besoin de CP","(%)",null,"Masculine","Féminine","Total traité","EAPréS traité ayant besoin de CP","EAPréS (%)","EAS traité ayant besoin de CP","EAS (%)","Total traité ayant besoin de CP","(%)",null,"Masculine","Féminine","Total traité","EAS traité ayant besoin de CP","EAS (%)","Adultes traité ayant besoin de CP","Adultes (%)","Total traité ayant besoin de CP","(%)",null,"LF","ONCHO","STH","SCH-SAC","SCH_Adults","<1","PreSAC","SAC","Adults","Total","Dis","PreSAC","SAC","Adults","Total","PreSAC","SAC","Adults","Total","Coverage"]
[]
[{"$f":"IF(COUNTRY_INFO!A9=0,\" \",COUNTRY_INFO!A9)","v":"Togo"},{"$f":"IF(COUNTRY_INFO!B9=0,\" \",COUNTRY_INFO!B9)","v":"CENTRALE"},{"$f":"IF(COUNTRY_INFO!C9=0,\" \",COUNTRY_INFO!C9)","v":"BLITTA"},{"$f":"COUNTRY_INFO!L9","v":"Non requis"},null,null,{"$f":"MAX('MDA1'!M9,'MDA2'!M9)","v":0},{"$f":"IF(AND(COUNTRY_INFO!H9>0,COUNTRY_INFO!H9<4),IF(D9>MAX('MDA1'!M9,'MDA2'!M9),MAX('MDA1'!M9,'MDA2'!M9),D9),0)","v":0},{"$f":"IF(AND(COUNTRY_INFO!H9>0,COUNTRY_INFO!H9<4), IF(G9/D9*100<>0, IF(G9/D9*100>100,100,G9/D9*100), \"-\"),0)","v":0},{"$f":"COUNTRY_INFO!M9","v":107943},null,null,{"$f":"MAX('MDA1'!M9,MAX('MDA3'!I9,'MDA3'!L9)+MAX('MDA3'!J9,'MDA3'!M9))","v":86909},{"$f":"IF(AND(COUNTRY_INFO!I9>0,COUNTRY_INFO!I9<4),IF(J9>MAX('MDA1'!M9,MAX('MDA3'!I9,'MDA3'!L9)+MAX('MDA3'!J9,'MDA3'!M9)),MAX('MDA1'!M9,MAX('MDA3'!I9,'MDA3'!L9)+MAX('MDA3'!J9,'MDA3'!M9)),J9),0)","v":86909},{"$f":"IF(AND(COUNTRY_INFO!I9>0,COUNTRY_INFO!I9<4), IF(M9/J9*100<>0, IF(M9/J9*100>100,100,M9/J9*100), \"-\"),0)","v":80.513789685296871},{"$f":"COUNTRY_INFO!N9","v":77749},null,null,{"$f":"SUM(MAX('MDA2'!J9, 'T1'!L9, MAX(T3_R1!K9, T3_R2!K9)), MAX('MDA1'!K9, 'MDA2'!K9, 'T1'!M9, MAX(T3_R1!L9, T3_R2!L9)), MAX('MDA1'!L9, 'MDA2'!L9, 'T1'!N9, MAX(T3_R1!M9, T3_R2!M9)))","v":48907},{"$f":"IF(AND(COUNTRY_INFO!J9>1,COUNTRY_INFO!J9<4),IF(COUNTRY_INFO!E9>MAX('MDA2'!J9,'T1'!L9,MAX(T3_R1!K9,T3_R2!K9)),MAX('MDA2'!J9,'T1'!L9,MAX(T3_R1!K9,T3_R2!K9)),COUNTRY_INFO!E9),0)","v":0},{"$f":"IF(AND(COUNTRY_INFO!J9>1,COUNTRY_INFO!J9<4), IF(T9/COUNTRY_INFO!E9*100<>0, IF(T9/COUNTRY_INFO!E9*100>100,100,T9/COUNTRY_INFO!E9*100), \"-\"),0)","v":"-"},{"$f":"IF(AND(COUNTRY_INFO!J9>1,COUNTRY_INFO!J9<4),IF(COUNTRY_INFO!F9>MAX('MDA1'!K9,'MDA2'!K9,'T1'!M9,MAX(T3_R1!L9,T3_R2!L9)),MAX('MDA1'!K9,'MDA2'!K9,'T1'!M9,MAX(T3_R1!L9,T3_R2!L9)),COUNTRY_INFO!F9),0)","v":48907},{"$f":"IF(AND(COUNTRY_INFO!J9>1,COUNTRY_INFO!J9<4), IF(V9/COUNTRY_INFO!F9*100<>0, IF(V9/COUNTRY_INFO!F9*100>100,100,V9/COUNTRY_INFO!F9*100), \"-\"),0)","v":96.452096398848269},{"$f":"SUM(T9,V9)","v":48907},{"$f":"IF(AND(COUNTRY_INFO!J9>1,COUNTRY_INFO!J9<4), IF(S9/P9*100<>0, IF(X9/P9*100>100,100,X9/P9*100), \"-\"),0)","v":62.90370294151694},{"$f":"COUNTRY_INFO!O9","v":42255},null,null,{"$f":"MAX('T1'!L9,'T2'!J9)+MAX('T1'!M9,'T2'!K9)+MAX('T1'!N9,'T2'!L9)","v":27328},{"$f":"IF(COUNTRY_INFO!K9=1,IF(COUNTRY_INFO!F9*0.33>MAX('T1'!M9,'T2'!K9),MAX('T1'!M9,'T2'!K9),COUNTRY_INFO!F9*0.33),IF(COUNTRY_INFO!K9=2,IF(COUNTRY_INFO!F9*0.5>MAX('T1'!M9,'T2'!K9),MAX('T1'!M9,'T2'!K9),COUNTRY_INFO!F9*0.5),IF(COUNTRY_INFO!K9=3,IF(COUNTRY_INFO!F9>MAX('T1'!M9,'T2'!K9),MAX('T1'!M9,'T2'!K9),COUNTRY_INFO!F9),0)))","v":25353},{"$f":"IF(AND(COUNTRY_INFO!K9>0,COUNTRY_INFO!K9<4),IF(Z9>0,IF(COUNTRY_INFO!K9=1, AD9/(COUNTRY_INFO!F9*0.33)*100, IF(COUNTRY_INFO!K9=2, AD9/(COUNTRY_INFO!F9*0.5)*100, IF(COUNTRY_INFO!K9=3, AD9/COUNTRY_INFO!F9*100))),\"-\"),0)","v":100},{"$f":"IF(COUNTRY_INFO!K9=2,IF(COUNTRY_INFO!G9*0.2>MAX('T1'!N9,'T2'!L9),MAX('T1'!N9,'T2'!L9),COUNTRY_INFO!G9*0.2),IF(COUNTRY_INFO!K9=3,IF(COUNTRY_INFO!G9>MAX('T1'!N9,'T2'!L9),MAX('T1'!N9,'T2'!L9),COUNTRY_INFO!G9),0))","v":0},{"$f":"IF(AND(COUNTRY_INFO!K9>0,COUNTRY_INFO!K9<4),IF(Z9>0,IF(COUNTRY_INFO!K9=1, 0, IF(COUNTRY_INFO!K9=2, AF9/(COUNTRY_INFO!G9*0.2)*100, IF(COUNTRY_INFO!K9=3, AF9/COUNTRY_INFO!G9*100))),\"-\"),0)","v":0},{"$f":"SUM(AD9,AF9)","v":25353},{"$f":"IF(AND(COUNTRY_INFO!K9>0,COUNTRY_INFO!K9<4), IF(AC9/Z9*100<>0, IF(AH9/Z9*100>100,100,AH9/Z9*100), \"-\"),0)","v":60},null,{"$f":"IF(AND(D9<>0, D9<>\"Inconnu\",D9<>\"Interrompu\",D9<>\"Non requis\"),D9/COUNTRY_INFO!D9, 0)","v":0},{"$f":"IF(AND(J9<>0,J9<>\"Inconnu\",J9<>\"Interrompu\",J9<>\"Non requis\"),J9/COUNTRY_INFO!D9, 0)","v":0.63864039758608449},{"$f":"IF(AND(P9<>0,P9<>\"Inconnu\",P9<>\"Non requis\"),P9/(COUNTRY_INFO!E9+COUNTRY_INFO!F9), 0)","v":1},{"$f":"IF(AND(Z9<>0,Z9<>\"Inconnu\",Z9<>\"Non requis\"),IF(COUNTRY_INFO!K9=1,1,IF(COUNTRY_INFO!K9=2,0.5*COUNTRY_INFO!F9/(0.5*COUNTRY_INFO!F9+0.2*COUNTRY_INFO!G9),IF(COUNTRY_INFO!K9=3,COUNTRY_INFO!F9/(COUNTRY_INFO!F9+COUNTRY_INFO!G9)))),0)","v":0.6},{"$f":"IF(AND(Z9<>0,Z9<>\"Inconnu\",Z9<>\"Non requis\"),IF(COUNTRY_INFO!K9=1,0,IF(COUNTRY_INFO!K9=2,0.2*COUNTRY_INFO!G9/(0.5*COUNTRY_INFO!F9+0.2*COUNTRY_INFO!G9),IF(COUNTRY_INFO!K9=3,COUNTRY_INFO!G9/(COUNTRY_INFO!F9+COUNTRY_INFO!G9)))),0)","v":0.4},{"$f":"MAX(COUNTRY_INFO!D9*AK9*PROFILE!$G$7,COUNTRY_INFO!D9*AL9*PROFILE!$G$7)","v":4317.5737573357846},{"$f":"MAX(COUNTRY_INFO!D9*AK9*PROFILE!$G$8,COUNTRY_INFO!D9*AL9*PROFILE!$G$8,COUNTRY_INFO!D9*AM9*PROFILE!$G$8)","v":27043.238165104278},{"$f":"MAX(COUNTRY_INFO!D9*AK9*PROFILE!$G$9,COUNTRY_INFO!D9*AL9*PROFILE!$G$9,COUNTRY_INFO!D9*AM9*PROFILE!$G$9,IF(AND(DISTRICT!Z9<>\"Inconnu\",Z9<>\"Non requis\"),COUNTRY_INFO!O9*DISTRICT!AN9,0))","v":50705.980029887294},{"$f":"MAX(COUNTRY_INFO!D9*AK9*PROFILE!$G$10,COUNTRY_INFO!D9*AL9*PROFILE!$G$10,IF(AND(DISTRICT!Z9<>\"Inconnu\",Z9<>\"Non requis\"),COUNTRY_INFO!O9*DISTRICT!AO9,0))","v":53971.634622607562},{"$f":"SUM(AP9:AS9)","v":136038.42657493491},{"$f":"IF(COUNTIFS(AK9:AN9,\">0\")=0,0, IF(COUNTIFS(AK9:AN9,\">0\")<=IF(AND(OR(D9>=0,D9=\"Non requis\",D9=\"Inconnu\",D9=\"Interrompu\"),D9>0,H9>0),1,0)+IF(AND(OR(J9>=0,J9=\"Non requis\",J9=\"Inconnu\",J9=\"Interrompu\"),J9>0,N9>0),1,0)+IF(AND(OR(P9>=0,P9=\"Non requis\",P9=\"Inconnu\"),P9>0,X9>0),1,0)+IF(AND(OR(Z9>=0,Z9=\"Non requis\",Z9=\"Inconnu\"),Z9>0,AH9>0),1,0),\"Y\",0))","v":"Y"},{"$f":"MAX('MDA2'!J9,'T1'!L9,'T2'!J9,T3_R1!K9,T3_R2!K9)","v":0},{"$f":"MAX('MDA1'!K9,'MDA2'!K9,'MDA3'!I9,'MDA3'!L9,'T1'!M9,'T2'!K9,T3_R1!L9,T3_R2!L9)","v":48907},{"$f":"MAX('MDA1'!L9,'MDA2'!L9,'MDA3'!J9,'MDA3'!M9,'T1'!N9,'T2'!L9,T3_R1!M9,T3_R2!M9)","v":53965},{"$f":"SUM(AV9:AX9)","v":102872},{"$f":"MAX('MDA2'!J9,T9)","v":0},{"$f":"MAX('MDA1'!K9,'MDA2'!K9,'MDA3'!I9,'MDA3'!L9,V9,AD9)","v":48907},{"$f":"MAX('MDA1'!L9,'MDA2'!L9,'MDA3'!J9,'MDA3'!M9,AF9)","v":53965},{"$f":"IF(AT9<SUM(AZ9:BB9), AT9,SUM(AZ9:BB9))","v":102872},{"$f":"IF(AT9<>0,BC9/AT9*100,0)","v":75.619810218353535}]
[{"$f":"IF(COUNTRY_INFO!A10=0,\" \",COUNTRY_INFO!A10)","v":"Togo"},{"$f":"IF(COUNTRY_INFO!B10=0,\" \",COUNTRY_INFO!B10)","v":"CENTRALE"},{"$f":"IF(COUNTRY_INFO!C10=0,\" \",COUNTRY_INFO!C10)","v":"MÔ"},{"$f":"COUNTRY_INFO!L10","v":"Non requis"},null,null,{"$f":"MAX('MDA1'!M10,'MDA2'!M10)","v":0},{"$f":"IF(AND(COUNTRY_INFO!H10>0,COUNTRY_INFO!H10<4),IF(D10>MAX('MDA1'!M10,'MDA2'!M10),MAX('MDA1'!M10,'MDA2'!M10),D10),0)","v":0},{"$f":"IF(AND(COUNTRY_INFO!H10>0,COUNTRY_INFO!H10<4), IF(G10/D10*100<>0, IF(G10/D10*100>100,100,G10/D10*100), \"-\"),0)","v":0},{"$f":"COUNTRY_INFO!M10","v":44934},null,null,{"$f":"MAX('MDA1'!M10,MAX('MDA3'!I10,'MDA3'!L10)+MAX('MDA3'!J10,'MDA3'!M10))","v":37345},{"$f":"IF(AND(COUNTRY_INFO!I10>0,COUNTRY_INFO!I10<4),IF(J10>MAX('MDA1'!M10,MAX('MDA3'!I10,'MDA3'!L10)+MAX('MDA3'!J10,'MDA3'!M10)),MAX('MDA1'!M10,MAX('MDA3'!I10,'MDA3'!L10)+MAX('MDA3'!J10,'MDA3'!M10)),J10),0)","v":37345},{"$f":"IF(AND(COUNTRY_INFO!I10>0,COUNTRY_INFO!I10<4), IF(M10/J10*100<>0, IF(M10/J10*100>100,100,M10/J10*100), \"-\"),0)","v":83.110784706458361},{"$f":"COUNTRY_INFO!N10","v":20924},null,null,{"$f":"SUM(MAX('MDA2'!J10, 'T1'!L10, MAX(T3_R1!K10, T3_R2!K10)), MAX('MDA1'!K10, 'MDA2'!K10, 'T1'!M10, MAX(T3_R1!L10, T3_R2!L10)), MAX('MDA1'!L10, 'MDA2'!L10, 'T1'!N10, MAX(T3_R1!M10, T3_R2!M10)))","v":14714},{"$f":"IF(AND(COUNTRY_INFO!J10>1,COUNTRY_INFO!J10<4),IF(COUNTRY_INFO!E10>MAX('MDA2'!J10,'T1'!L10,MAX(T3_R1!K10,T3_R2!K10)),MAX('MDA2'!J10,'T1'!L10,MAX(T3_R1!K10,T3_R2!K10)),COUNTRY_INFO!E10),0)","v":0},{"$f":"IF(AND(COUNTRY_INFO!J10>1,COUNTRY_INFO!J10<4), IF(T10/COUNTRY_INFO!E10*100<>0, IF(T10/COUNTRY_INFO!E10*100>100,100,T10/COUNTRY_INFO!E10*100), \"-\"),0)","v":"-"},{"$f":"IF(AND(COUNTRY_INFO!J10>1,COUNTRY_INFO!J10<4),IF(COUNTRY_INFO!F10>MAX('MDA1'!K10,'MDA2'!K10,'T1'!M10,MAX(T3_R1!L10,T3_R2!L10)),MAX('MDA1'!K10,'MDA2'!K10,'T1'!M10,MAX(T3_R1!L10,T3_R2!L10)),COUNTRY_INFO!F10),0)","v":13646},{"$f":"IF(AND(COUNTRY_INFO!J10>1,COUNTRY_INFO!J10<4), IF(V10/COUNTRY_INFO!F10*100<>0, IF(V10/COUNTRY_INFO!F10*100>100,100,V10/COUNTRY_INFO!F10*100), \"-\"),0)","v":100},{"$f":"SUM(T10,V10)","v":13646},{"$f":"IF(AND(COUNTRY_INFO!J10>1,COUNTRY_INFO!J10<4), IF(S10/P10*100<>0, IF(X10/P10*100>100,100,X10/P10*100), \"-\"),0)","v":65.216975721659338},{"$f":"COUNTRY_INFO!O10","v":4503.18},null,null,{"$f":"MAX('T1'!L10,'T2'!J10)+MAX('T1'!M10,'T2'!K10)+MAX('T1'!N10,'T2'!L10)","v":0},{"$f":"IF(COUNTRY_INFO!K10=1,IF(COUNTRY_INFO!F10*0.33>MAX('T1'!M10,'T2'!K10),MAX('T1'!M10,'T2'!K10),COUNTRY_INFO!F10*0.33),IF(COUNTRY_INFO!K10=2,IF(COUNTRY_INFO!F10*0.5>MAX('T1'!M10,'T2'!K10),MAX('T1'!M10,'T2'!K10),COUNTRY_INFO!F10*0.5),IF(COUNTRY_INFO!K10=3,IF(COUNTRY_INFO!F10>MAX('T1'!M10,'T2'!K10),MAX('T1'!M10,'T2'!K10),COUNTRY_INFO!F10),0)))","v":0},{"$f":"IF(AND(COUNTRY_INFO!K10>0,COUNTRY_INFO!K10<4),IF(Z10>0,IF(COUNTRY_INFO!K10=1, AD10/(COUNTRY_INFO!F10*0.33)*100, IF(COUNTRY_INFO!K10=2, AD10/(COUNTRY_INFO!F10*0.5)*100, IF(COUNTRY_INFO!K10=3, AD10/COUNTRY_INFO!F10*100))),\"-\"),0)","v":0},{"$f":"IF(COUNTRY_INFO!K10=2,IF(COUNTRY_INFO!G10*0.2>MAX('T1'!N10,'T2'!L10),MAX('T1'!N10,'T2'!L10),COUNTRY_INFO!G10*0.2),IF(COUNTRY_INFO!K10=3,IF(COUNTRY_INFO!G10>MAX('T1'!N10,'T2'!L10),MAX('T1'!N10,'T2'!L10),COUNTRY_INFO!G10),0))","v":0},{"$f":"IF(AND(COUNTRY_INFO!K10>0,COUNTRY_INFO!K10<4),IF(Z10>0,IF(COUNTRY_INFO!K10=1, 0, IF(COUNTRY_INFO!K10=2, AF10/(COUNTRY_INFO!G10*0.2)*100, IF(COUNTRY_INFO!K10=3, AF10/COUNTRY_INFO!G10*100))),\"-\"),0)","v":0},{"$f":"SUM(AD10,AF10)","v":0},{"$f":"IF(AND(COUNTRY_INFO!K10>0,COUNTRY_INFO!K10<4), IF(AC10/Z10*100<>0, IF(AH10/Z10*100>100,100,AH10/Z10*100), \"-\"),0)","v":"-"},null,{"$f":"IF(AND(D10<>0, D10<>\"Inconnu\",D10<>\"Interrompu\",D10<>\"Non requis\"),D10/COUNTRY_INFO!D10, 0)","v":0},{"$f":"IF(AND(J10<>0,J10<>\"Inconnu\",J10<>\"Interrompu\",J10<>\"Non requis\"),J10/COUNTRY_INFO!D10, 0)","v":0.98782096377066475},{"$f":"IF(AND(P10<>0,P10<>\"Inconnu\",P10<>\"Non requis\"),P10/(COUNTRY_INFO!E10+COUNTRY_INFO!F10), 0)","v":1},{"$f":"IF(AND(Z10<>0,Z10<>\"Inconnu\",Z10<>\"Non requis\"),IF(COUNTRY_INFO!K10=1,1,IF(COUNTRY_INFO!K10=2,0.5*COUNTRY_INFO!F10/(0.5*COUNTRY_INFO!F10+0.2*COUNTRY_INFO!G10),IF(COUNTRY_INFO!K10=3,COUNTRY_INFO!F10/(COUNTRY_INFO!F10+COUNTRY_INFO!G10)))),0)","v":1},{"$f":"IF(AND(Z10<>0,Z10<>\"Inconnu\",Z10<>\"Non requis\"),IF(COUNTRY_INFO!K10=1,0,IF(COUNTRY_INFO!K10=2,0.2*COUNTRY_INFO!G10/(0.5*COUNTRY_INFO!F10+0.2*COUNTRY_INFO!G10),IF(COUNTRY_INFO!K10=3,COUNTRY_INFO!G10/(COUNTRY_INFO!F10+COUNTRY_INFO!G10)))),0)","v":0},{"$f":"MAX(COUNTRY_INFO!D10*AK10*PROFILE!$G$7,COUNTRY_INFO!D10*AL10*PROFILE!$G$7)","v":1797.2991227974594},{"$f":"MAX(COUNTRY_INFO!D10*AK10*PROFILE!$G$8,COUNTRY_INFO!D10*AL10*PROFILE!$G$8,COUNTRY_INFO!D10*AM10*PROFILE!$G$8)","v":7278.0902712948964},{"$f":"MAX(COUNTRY_INFO!D10*AK10*PROFILE!$G$9,COUNTRY_INFO!D10*AL10*PROFILE!$G$9,COUNTRY_INFO!D10*AM10*PROFILE!$G$9,IF(AND(DISTRICT!Z10<>\"Inconnu\",Z10<>\"Non requis\"),COUNTRY_INFO!O10*DISTRICT!AN10,0))","v":13646.394625485227},{"$f":"MAX(COUNTRY_INFO!D10*AK10*PROFILE!$G$10,COUNTRY_INFO!D10*AL10*PROFILE!$G$10,IF(AND(DISTRICT!Z10<>\"Inconnu\",Z10<>\"Non requis\"),COUNTRY_INFO!O10*DISTRICT!AO10,0))","v":22467.056040060481},{"$f":"SUM(AP10:AS10)","v":45188.840059638067},0,{"$f":"MAX('MDA2'!J10,'T1'!L10,'T2'!J10,T3_R1!K10,T3_R2!K10)","v":0},{"$f":"MAX('MDA1'!K10,'MDA2'!K10,'MDA3'!I10,'MDA3'!L10,'T1'!M10,'T2'!K10,T3_R1!L10,T3_R2!L10)","v":14714},{"$f":"MAX('MDA1'!L10,'MDA2'!L10,'MDA3'!J10,'MDA3'!M10,'T1'!N10,'T2'!L10,T3_R1!M10,T3_R2!M10)","v":22631},{"$f":"SUM(AV10:AX10)","v":37345},{"$f":"MAX('MDA2'!J10,T10)","v":0},{"$f":"MAX('MDA1'!K10,'MDA2'!K10,'MDA3'!I10,'MDA3'!L10,V10,AD10)","v":14714},{"$f":"MAX('MDA1'!L10,'MDA2'!L10,'MDA3'!J10,'MDA3'!M10,AF10)","v":22631},37345,82.642085857291008]
[{"$f":"IF(COUNTRY_INFO!A11=0,\" \",COUNTRY_INFO!A11)","v":"Togo"},{"$f":"IF(COUNTRY_INFO!B11=0,\" \",COUNTRY_INFO!B11)","v":"CENTRALE"},{"$f":"IF(COUNTRY_INFO!C11=0,\" \",COUNTRY_INFO!C11)","v":"SOTOUBOUA"},{"$f":"COUNTRY_INFO!L11","v":"Non requis"},null,null,{"$f":"MAX('MDA1'!M11,'MDA2'!M11)","v":0},{"$f":"IF(AND(COUNTRY_INFO!H11>0,COUNTRY_INFO!H11<4),IF(D11>MAX('MDA1'!M11,'MDA2'!M11),MAX('MDA1'!M11,'MDA2'!M11),D11),0)","v":0},{"$f":"IF(AND(COUNTRY_INFO!H11>0,COUNTRY_INFO!H11<4), IF(G11/D11*100<>0, IF(G11/D11*100>100,100,G11/D11*100), \"-\"),0)","v":0},{"$f":"COUNTRY_INFO!M11","v":66657},null,null,{"$f":"MAX('MDA1'!M11,MAX('MDA3'!I11,'MDA3'!L11)+MAX('MDA3'!J11,'MDA3'!M11))","v":56738},{"$f":"IF(AND(COUNTRY_INFO!I11>0,COUNTRY_INFO!I11<4),IF(J11>MAX('MDA1'!M11,MAX('MDA3'!I11,'MDA3'!L11)+MAX('MDA3'!J11,'MDA3'!M11)),MAX('MDA1'!M11,MAX('MDA3'!I11,'MDA3'!L11)+MAX('MDA3'!J11,'MDA3'!M11)),J11),0)","v":56738},{"$f":"IF(AND(COUNTRY_INFO!I11>0,COUNTRY_INFO!I11<4), IF(M11/J11*100<>0, IF(M11/J11*100>100,100,M11/J11*100), \"-\"),0)","v":85.119342304634174},{"$f":"COUNTRY_INFO!N11","v":68922},null,null,{"$f":"SUM(MAX('MDA2'!J11, 'T1'!L11, MAX(T3_R1!K11, T3_R2!K11)), MAX('MDA1'!K11, 'MDA2'!K11, 'T1'!M11, MAX(T3_R1!L11, T3_R2!L11)), MAX('MDA1'!L11, 'MDA2'!L11, 'T1'!N11, MAX(T3_R1!M11, T3_R2!M11)))","v":38436},{"$f":"IF(AND(COUNTRY_INFO!J11>1,COUNTRY_INFO!J11<4),IF(COUNTRY_INFO!E11>MAX('MDA2'!J11,'T1'!L11,MAX(T3_R1!K11,T3_R2!K11)),MAX('MDA2'!J11,'T1'!L11,MAX(T3_R1!K11,T3_R2!K11)),COUNTRY_INFO!E11),0)","v":0},{"$f":"IF(AND(COUNTRY_INFO!J11>1,COUNTRY_INFO!J11<4), IF(T11/COUNTRY_INFO!E11*100<>0, IF(T11/COUNTRY_INFO!E11*100>100,100,T11/COUNTRY_INFO!E11*100), \"-\"),0)","v":"-"},{"$f":"IF(AND(COUNTRY_INFO!J11>1,COUNTRY_INFO!J11<4),IF(COUNTRY_INFO!F11>MAX('MDA1'!K11,'MDA2'!K11,'T1'!M11,MAX(T3_R1!L11,T3_R2!L11)),MAX('MDA1'!K11,'MDA2'!K11,'T1'!M11,MAX(T3_R1!L11,T3_R2!L11)),COUNTRY_INFO!F11),0)","v":38436},{"$f":"IF(AND(COUNTRY_INFO!J11>1,COUNTRY_INFO!J11<4), IF(V11/COUNTRY_INFO!F11*100<>0, IF(V11/COUNTRY_INFO!F11*100>100,100,V11/COUNTRY_INFO!F11*100), \"-\"),0)","v":85.51024494427017},38436,{"$f":"IF(AND(COUNTRY_INFO!J11>1,COUNTRY_INFO!J11<4), IF(S11/P11*100<>0, IF(X11/P11*100>100,100,X11/P11*100), \"-\"),0)","v":55.767389222599462},{"$f":"COUNTRY_INFO!O11","v":37457.5},null,null,{"$f":"MAX('T1'!L11,'T2'!J11)+MAX('T1'!M11,'T2'!K11)+MAX('T1'!N11,'T2'!L11)","v":0},{"$f":"IF(COUNTRY_INFO!K11=1,IF(COUNTRY_INFO!F11*0.33>MAX('T1'!M11,'T2'!K11),MAX('T1'!M11,'T2'!K11),COUNTRY_INFO!F11*0.33),IF(COUNTRY_INFO!K11=2,IF(COUNTRY_INFO!F11*0.5>MAX('T1'!M11,'T2'!K11),MAX('T1'!M11,'T2'!K11),COUNTRY_INFO!F11*0.5),IF(COUNTRY_INFO!K11=3,IF(COUNTRY_INFO!F11>MAX('T1'!M11,'T2'!K11),MAX('T1'!M11,'T2'!K11),COUNTRY_INFO!F11),0)))","v":0},{"$f":"IF(AND(COUNTRY_INFO!K11>0,COUNTRY_INFO!K11<4),IF(Z11>0,IF(COUNTRY_INFO!K11=1, AD11/(COUNTRY_INFO!F11*0.33)*100, IF(COUNTRY_INFO!K11=2, AD11/(COUNTRY_INFO!F11*0.5)*100, IF(COUNTRY_INFO!K11=3, AD11/COUNTRY_INFO!F11*100))),\"-\"),0)","v":0},{"$f":"IF(COUNTRY_INFO!K11=2,IF(COUNTRY_INFO!G11*0.2>MAX('T1'!N11,'T2'!L11),MAX('T1'!N11,'T2'!L11),COUNTRY_INFO!G11*0.2),IF(COUNTRY_INFO!K11=3,IF(COUNTRY_INFO!G11>MAX('T1'!N11,'T2'!L11),MAX('T1'!N11,'T2'!L11),COUNTRY_INFO!G11),0))","v":0},{"$f":"IF(AND(COUNTRY_INFO!K11>0,COUNTRY_INFO!K11<4),IF(Z11>0,IF(COUNTRY_INFO!K11=1, 0, IF(COUNTRY_INFO!K11=2, AF11/(COUNTRY_INFO!G11*0.2)*100, IF(COUNTRY_INFO!K11=3, AF11/COUNTRY_INFO!G11*100))),\"-\"),0)","v":0},0,{"$f":"IF(AND(COUNTRY_INFO!K11>0,COUNTRY_INFO!K11<4), IF(AC11/Z11*100<>0, IF(AH11/Z11*100>100,100,AH11/Z11*100), \"-\"),0)","v":"-"},null,{"$f":"IF(AND(D11<>0, D11<>\"Inconnu\",D11<>\"Interrompu\",D11<>\"Non requis\"),D11/COUNTRY_INFO!D11, 0)","v":0},{"$f":"IF(AND(J11<>0,J11<>\"Inconnu\",J11<>\"Interrompu\",J11<>\"Non requis\"),J11/COUNTRY_INFO!D11, 0)","v":0.44488717137536793},{"$f":"IF(AND(P11<>0,P11<>\"Inconnu\",P11<>\"Non requis\"),P11/(COUNTRY_INFO!E11+COUNTRY_INFO!F11), 0)","v":1},{"$f":"IF(AND(Z11<>0,Z11<>\"Inconnu\",Z11<>\"Non requis\"),IF(COUNTRY_INFO!K11=1,1,IF(COUNTRY_INFO!K11=2,0.5*COUNTRY_INFO!F11/(0.5*COUNTRY_INFO!F11+0.2*COUNTRY_INFO!G11),IF(COUNTRY_INFO!K11=3,COUNTRY_INFO!F11/(COUNTRY_INFO!F11+COUNTRY_INFO!G11)))),0)","v":0.6},{"$f":"IF(AND(Z11<>0,Z11<>\"Inconnu\",Z11<>\"Non requis\"),IF(COUNTRY_INFO!K11=1,0,IF(COUNTRY_INFO!K11=2,0.2*COUNTRY_INFO!G11/(0.5*COUNTRY_INFO!F11+0.2*COUNTRY_INFO!G11),IF(COUNTRY_INFO!K11=3,COUNTRY_INFO!G11/(COUNTRY_INFO!F11+COUNTRY_INFO!G11)))),0)","v":0.4},{"$f":"MAX(COUNTRY_INFO!D11*AK11*PROFILE!$G$7,COUNTRY_INFO!D11*AL11*PROFILE!$G$7)","v":2666.1896921776438},{"$f":"MAX(COUNTRY_INFO!D11*AK11*PROFILE!$G$8,COUNTRY_INFO!D11*AL11*PROFILE!$G$8,COUNTRY_INFO!D11*AM11*PROFILE!$G$8)","v":23972.673831732391},{"$f":"MAX(COUNTRY_INFO!D11*AK11*PROFILE!$G$9,COUNTRY_INFO!D11*AL11*PROFILE!$G$9,COUNTRY_INFO!D11*AM11*PROFILE!$G$9,IF(AND(DISTRICT!Z11<>\"Inconnu\",Z11<>\"Non requis\"),COUNTRY_INFO!O11*DISTRICT!AN11,0))","v":44948.682297349325},{"$f":"MAX(COUNTRY_INFO!D11*AK11*PROFILE!$G$10,COUNTRY_INFO!D11*AL11*PROFILE!$G$10,IF(AND(DISTRICT!Z11<>\"Inconnu\",Z11<>\"Non requis\"),COUNTRY_INFO!O11*DISTRICT!AO11,0))","v":33328.583132200816},104916.12895346017,0,{"$f":"MAX('MDA2'!J11,'T1'!L11,'T2'!J11,T3_R1!K11,T3_R2!K11)","v":0},{"$f":"MAX('MDA1'!K11,'MDA2'!K11,'MDA3'!I11,'MDA3'!L11,'T1'!M11,'T2'!K11,T3_R1!L11,T3_R2!L11)","v":38436},{"$f":"MAX('MDA1'!L11,'MDA2'!L11,'MDA3'!J11,'MDA3'!M11,'T1'!N11,'T2'!L11,T3_R1!M11,T3_R2!M11)","v":37075},75511,{"$f":"MAX('MDA2'!J11,T11)","v":0},{"$f":"MAX('MDA1'!K11,'MDA2'!K11,'MDA3'!I11,'MDA3'!L11,V11,AD11)","v":38436},{"$f":"MAX('MDA1'!L11,'MDA2'!L11,'MDA3'!J11,'MDA3'!M11,AF11)","v":37075},75511,71.972727885810571]
[{"$f":"IF(COUNTRY_INFO!A12=0,\" \",COUNTRY_INFO!A12)","v":"Togo"},{"$f":"IF(COUNTRY_INFO!B12=0,\" \",COUNTRY_INFO!B12)","v":"CENTRALE"},{"$f":"IF(COUNTRY_INFO!C12=0,\" \",COUNTRY_INFO!C12)","v":"TCHAMBA"},{"$f":"COUNTRY_INFO!L12","v":"Non requis"},null,null,{"$f":"MAX('MDA1'!M12,'MDA2'!M12)","v":0},{"$f":"IF(AND(COUNTRY_INFO!H12>0,COUNTRY_INFO!H12<4),IF(D12>MAX('MDA1'!M12,'MDA2'!M12),MAX('MDA1'!M12,'MDA2'!M12),D12),0)","v":0},{"$f":"IF(AND(COUNTRY_INFO!H12>0,COUNTRY_INFO!H12<4), IF(G12/D12*100<>0, IF(G12/D12*100>100,100,G12/D12*100), \"-\"),0)","v":0},{"$f":"COUNTRY_INFO!M12","v":113706},null,null,{"$f":"MAX('MDA1'!M12,MAX('MDA3'!I12,'MDA3'!L12)+MAX('MDA3'!J12,'MDA3'!M12))","v":94413},{"$f":"IF(AND(COUNTRY_INFO!I12>0,COUNTRY_INFO!I12<4),IF(J12>MAX('MDA1'!M12,MAX('MDA3'!I12,'MDA3'!L12)+MAX('MDA3'!J12,'MDA3'!M12)),MAX('MDA1'!M12,MAX('MDA3'!I12,'MDA3'!L12)+MAX('MDA3'!J12,'MDA3'!M12)),J12),0)","v":94413},{"$f":"IF(AND(COUNTRY_INFO!I12>0,COUNTRY_INFO!I12<4), IF(M12/J12*100<>0, IF(M12/J12*100>100,100,M12/J12*100), \"-\"),0)","v":83.032557648672892},{"$f":"COUNTRY_INFO!N12","v":73933},null,null,{"$f":"SUM(MAX('MDA2'!J12, 'T1'!L12, MAX(T3_R1!K12, T3_R2!K12)), MAX('MDA1'!K12, 'MDA2'!K12, 'T1'!M12, MAX(T3_R1!L12, T3_R2!L12)), MAX('MDA1'!L12, 'MDA2'!L12, 'T1'!N12, MAX(T3_R1!M12, T3_R2!M12)))","v":51592},{"$f":"IF(AND(COUNTRY_INFO!J12>1,COUNTRY_INFO!J12<4),IF(COUNTRY_INFO!E12>MAX('MDA2'!J12,'T1'!L12,MAX(T3_R1!K12,T3_R2!K12)),MAX('MDA2'!J12,'T1'!L12,MAX(T3_R1!K12,T3_R2!K12)),COUNTRY_INFO!E12),0)","v":0},{"$f":"IF(AND(COUNTRY_INFO!J12>1,COUNTRY_INFO!J12<4), IF(T12/COUNTRY_INFO!E12*100<>0, IF(T12/COUNTRY_INFO!E12*100>100,100,T12/COUNTRY_INFO!E12*100), \"-\"),0)","v":"-"},{"$f":"IF(AND(COUNTRY_INFO!J12>1,COUNTRY_INFO!J12<4),IF(COUNTRY_INFO!F12>MAX('MDA1'!K12,'MDA2'!K12,'T1'!M12,MAX(T3_R1!L12,T3_R2!L12)),MAX('MDA1'!K12,'MDA2'!K12,'T1'!M12,MAX(T3_R1!L12,T3_R2!L12)),COUNTRY_INFO!F12),0)","v":48217},{"$f":"IF(AND(COUNTRY_INFO!J12>1,COUNTRY_INFO!J12<4), IF(V12/COUNTRY_INFO!F12*100<>0, IF(V12/COUNTRY_INFO!F12*100>100,100,V12/COUNTRY_INFO!F12*100), \"-\"),0)","v":100},48217,{"$f":"IF(AND(COUNTRY_INFO!J12>1,COUNTRY_INFO!J12<4), IF(S12/P12*100<>0, IF(X12/P12*100>100,100,X12/P12*100), \"-\"),0)","v":65.217156073742444},{"$f":"COUNTRY_INFO!O12","v":15911.61},null,null,{"$f":"MAX('T1'!L12,'T2'!J12)+MAX('T1'!M12,'T2'!K12)+MAX('T1'!N12,'T2'!L12)","v":0},{"$f":"IF(COUNTRY_INFO!K12=1,IF(COUNTRY_INFO!F12*0.33>MAX('T1'!M12,'T2'!K12),MAX('T1'!M12,'T2'!K12),COUNTRY_INFO!F12*0.33),IF(COUNTRY_INFO!K12=2,IF(COUNTRY_INFO!F12*0.5>MAX('T1'!M12,'T2'!K12),MAX('T1'!M12,'T2'!K12),COUNTRY_INFO!F12*0.5),IF(COUNTRY_INFO!K12=3,IF(COUNTRY_INFO!F12>MAX('T1'!M12,'T2'!K12),MAX('T1'!M12,'T2'!K12),COUNTRY_INFO!F12),0)))","v":0},{"$f":"IF(AND(COUNTRY_INFO!K12>0,COUNTRY_INFO!K12<4),IF(Z12>0,IF(COUNTRY_INFO!K12=1, AD12/(COUNTRY_INFO!F12*0.33)*100, IF(COUNTRY_INFO!K12=2, AD12/(COUNTRY_INFO!F12*0.5)*100, IF(COUNTRY_INFO!K12=3, AD12/COUNTRY_INFO!F12*100))),\"-\"),0)","v":0},{"$f":"IF(COUNTRY_INFO!K12=2,IF(COUNTRY_INFO!G12*0.2>MAX('T1'!N12,'T2'!L12),MAX('T1'!N12,'T2'!L12),COUNTRY_INFO!G12*0.2),IF(COUNTRY_INFO!K12=3,IF(COUNTRY_INFO!G12>MAX('T1'!N12,'T2'!L12),MAX('T1'!N12,'T2'!L12),COUNTRY_INFO!G12),0))","v":0},{"$f":"IF(AND(COUNTRY_INFO!K12>0,COUNTRY_INFO!K12<4),IF(Z12>0,IF(COUNTRY_INFO!K12=1, 0, IF(COUNTRY_INFO!K12=2, AF12/(COUNTRY_INFO!G12*0.2)*100, IF(COUNTRY_INFO!K12=3, AF12/COUNTRY_INFO!G12*100))),\"-\"),0)","v":0},0,{"$f":"IF(AND(COUNTRY_INFO!K12>0,COUNTRY_INFO!K12<4), IF(AC12/Z12*100<>0, IF(AH12/Z12*100>100,100,AH12/Z12*100), \"-\"),0)","v":"-"},null,{"$f":"IF(AND(D12<>0, D12<>\"Inconnu\",D12<>\"Interrompu\",D12<>\"Non requis\"),D12/COUNTRY_INFO!D12, 0)","v":0},{"$f":"IF(AND(J12<>0,J12<>\"Inconnu\",J12<>\"Interrompu\",J12<>\"Non requis\"),J12/COUNTRY_INFO!D12, 0)","v":0.70746123789850923},{"$f":"IF(AND(P12<>0,P12<>\"Inconnu\",P12<>\"Non requis\"),P12/(COUNTRY_INFO!E12+COUNTRY_INFO!F12), 0)","v":1},{"$f":"IF(AND(Z12<>0,Z12<>\"Inconnu\",Z12<>\"Non requis\"),IF(COUNTRY_INFO!K12=1,1,IF(COUNTRY_INFO!K12=2,0.5*COUNTRY_INFO!F12/(0.5*COUNTRY_INFO!F12+0.2*COUNTRY_INFO!G12),IF(COUNTRY_INFO!K12=3,COUNTRY_INFO!F12/(COUNTRY_INFO!F12+COUNTRY_INFO!G12)))),0)","v":1},{"$f":"IF(AND(Z12<>0,Z12<>\"Inconnu\",Z12<>\"Non requis\"),IF(COUNTRY_INFO!K12=1,0,IF(COUNTRY_INFO!K12=2,0.2*COUNTRY_INFO!G12/(0.5*COUNTRY_INFO!F12+0.2*COUNTRY_INFO!G12),IF(COUNTRY_INFO!K12=3,COUNTRY_INFO!G12/(COUNTRY_INFO!F12+COUNTRY_INFO!G12)))),0)","v":0},{"$f":"MAX(COUNTRY_INFO!D12*AK12*PROFILE!$G$7,COUNTRY_INFO!D12*AL12*PROFILE!$G$7)","v":4548.0859495439518},{"$f":"MAX(COUNTRY_INFO!D12*AK12*PROFILE!$G$8,COUNTRY_INFO!D12*AL12*PROFILE!$G$8,COUNTRY_INFO!D12*AM12*PROFILE!$G$8)","v":25715.876291848421},{"$f":"MAX(COUNTRY_INFO!D12*AK12*PROFILE!$G$9,COUNTRY_INFO!D12*AL12*PROFILE!$G$9,COUNTRY_INFO!D12*AM12*PROFILE!$G$9,IF(AND(DISTRICT!Z12<>\"Inconnu\",Z12<>\"Non requis\"),COUNTRY_INFO!O12*DISTRICT!AN12,0))","v":48217.181010079315},{"$f":"MAX(COUNTRY_INFO!D12*AK12*PROFILE!$G$10,COUNTRY_INFO!D12*AL12*PROFILE!$G$10,IF(AND(DISTRICT!Z12<>\"Inconnu\",Z12<>\"Non requis\"),COUNTRY_INFO!O12*DISTRICT!AO12,0))","v":56853.141810012836},135334.28506148452,0,{"$f":"MAX('MDA2'!J12,'T1'!L12,'T2'!J12,T3_R1!K12,T3_R2!K12)","v":0},{"$f":"MAX('MDA1'!K12,'MDA2'!K12,'MDA3'!I12,'MDA3'!L12,'T1'!M12,'T2'!K12,T3_R1!L12,T3_R2!L12)","v":51592},{"$f":"MAX('MDA1'!L12,'MDA2'!L12,'MDA3'!J12,'MDA3'!M12,'T1'!N12,'T2'!L12,T3_R1!M12,T3_R2!M12)","v":57283},108875,{"$f":"MAX('MDA2'!J12,T12)","v":0},{"$f":"MAX('MDA1'!K12,'MDA2'!K12,'MDA3'!I12,'MDA3'!L12,V12,AD12)","v":48217},{"$f":"MAX('MDA1'!L12,'MDA2'!L12,'MDA3'!J12,'MDA3'!M12,AF12)","v":57283},105500,77.955116807296591]
[{"$f":"IF(COUNTRY_INFO!A13=0,\" \",COUNTRY_INFO!A13)","v":"Togo"},{"$f":"IF(COUNTRY_INFO!B13=0,\" \",COUNTRY_INFO!B13)","v":"CENTRALE"},{"$f":"IF(COUNTRY_INFO!C13=0,\" \",COUNTRY_INFO!C13)","v":"TCHAOUDJO"},{"$f":"COUNTRY_INFO!L13","v":"Non requis"},null,null,{"$f":"MAX('MDA1'!M13,'MDA2'!M13)","v":0},{"$f":"IF(AND(COUNTRY_INFO!H13>0,COUNTRY_INFO!H13<4),IF(D13>MAX('MDA1'!M13,'MDA2'!M13),MAX('MDA1'!M13,'MDA2'!M13),D13),0)","v":0},{"$f":"IF(AND(COUNTRY_INFO!H13>0,COUNTRY_INFO!H13<4), IF(G13/D13*100<>0, IF(G13/D13*100>100,100,G13/D13*100), \"-\"),0)","v":0},{"$f":"COUNTRY_INFO!M13","v":99760},null,null,{"$f":"MAX('MDA1'!M13,MAX('MDA3'!I13,'MDA3'!L13)+MAX('MDA3'!J13,'MDA3'!M13))","v":82763},{"$f":"IF(AND(COUNTRY_INFO!I13>0,COUNTRY_INFO!I13<4),IF(J13>MAX('MDA1'!M13,MAX('MDA3'!I13,'MDA3'!L13)+MAX('MDA3'!J13,'MDA3'!M13)),MAX('MDA1'!M13,MAX('MDA3'!I13,'MDA3'!L13)+MAX('MDA3'!J13,'MDA3'!M13)),J13),0)","v":82763},{"$f":"IF(AND(COUNTRY_INFO!I13>0,COUNTRY_INFO!I13<4), IF(M13/J13*100<>0, IF(M13/J13*100>100,100,M13/J13*100), \"-\"),0)","v":82.962109061748194},{"$f":"COUNTRY_INFO!N13","v":108089},null,null,{"$f":"SUM(MAX('MDA2'!J13, 'T1'!L13, MAX(T3_R1!K13, T3_R2!K13)), MAX('MDA1'!K13, 'MDA2'!K13, 'T1'!M13, MAX(T3_R1!L13, T3_R2!L13)), MAX('MDA1'!L13, 'MDA2'!L13, 'T1'!N13, MAX(T3_R1!M13, T3_R2!M13)))","v":73650},{"$f":"IF(AND(COUNTRY_INFO!J13>1,COUNTRY_INFO!J13<4),IF(COUNTRY_INFO!E13>MAX('MDA2'!J13,'T1'!L13,MAX(T3_R1!K13,T3_R2!K13)),MAX('MDA2'!J13,'T1'!L13,MAX(T3_R1!K13,T3_R2!K13)),COUNTRY_INFO!E13),0)","v":0},{"$f":"IF(AND(COUNTRY_INFO!J13>1,COUNTRY_INFO!J13<4), IF(T13/COUNTRY_INFO!E13*100<>0, IF(T13/COUNTRY_INFO!E13*100>100,100,T13/COUNTRY_INFO!E13*100), \"-\"),0)","v":"-"},{"$f":"IF(AND(COUNTRY_INFO!J13>1,COUNTRY_INFO!J13<4),IF(COUNTRY_INFO!F13>MAX('MDA1'!K13,'MDA2'!K13,'T1'!M13,MAX(T3_R1!L13,T3_R2!L13)),MAX('MDA1'!K13,'MDA2'!K13,'T1'!M13,MAX(T3_R1!L13,T3_R2!L13)),COUNTRY_INFO!F13),0)","v":70493},{"$f":"IF(AND(COUNTRY_INFO!J13>1,COUNTRY_INFO!J13<4), IF(V13/COUNTRY_INFO!F13*100<>0, IF(V13/COUNTRY_INFO!F13*100>100,100,V13/COUNTRY_INFO!F13*100), \"-\"),0)","v":100},70493,{"$f":"IF(AND(COUNTRY_INFO!J13>1,COUNTRY_INFO!J13<4), IF(S13/P13*100<>0, IF(X13/P13*100>100,100,X13/P13*100), \"-\"),0)","v":65.217552202351769},{"$f":"COUNTRY_INFO!O13","v":58744.3},null,null,{"$f":"MAX('T1'!L13,'T2'!J13)+MAX('T1'!M13,'T2'!K13)+MAX('T1'!N13,'T2'!L13)","v":6929},{"$f":"IF(COUNTRY_INFO!K13=1,IF(COUNTRY_INFO!F13*0.33>MAX('T1'!M13,'T2'!K13),MAX('T1'!M13,'T2'!K13),COUNTRY_INFO!F13*0.33),IF(COUNTRY_INFO!K13=2,IF(COUNTRY_INFO!F13*0.5>MAX('T1'!M13,'T2'!K13),MAX('T1'!M13,'T2'!K13),COUNTRY_INFO!F13*0.5),IF(COUNTRY_INFO!K13=3,IF(COUNTRY_INFO!F13>MAX('T1'!M13,'T2'!K13),MAX('T1'!M13,'T2'!K13),COUNTRY_INFO!F13),0)))","v":6929},{"$f":"IF(AND(COUNTRY_INFO!K13>0,COUNTRY_INFO!K13<4),IF(Z13>0,IF(COUNTRY_INFO!K13=1, AD13/(COUNTRY_INFO!F13*0.33)*100, IF(COUNTRY_INFO!K13=2, AD13/(COUNTRY_INFO!F13*0.5)*100, IF(COUNTRY_INFO!K13=3, AD13/COUNTRY_INFO!F13*100))),\"-\"),0)","v":19.658689515271018},{"$f":"IF(COUNTRY_INFO!K13=2,IF(COUNTRY_INFO!G13*0.2>MAX('T1'!N13,'T2'!L13),MAX('T1'!N13,'T2'!L13),COUNTRY_INFO!G13*0.2),IF(COUNTRY_INFO!K13=3,IF(COUNTRY_INFO!G13>MAX('T1'!N13,'T2'!L13),MAX('T1'!N13,'T2'!L13),COUNTRY_INFO!G13),0))","v":0},{"$f":"IF(AND(COUNTRY_INFO!K13>0,COUNTRY_INFO!K13<4),IF(Z13>0,IF(COUNTRY_INFO!K13=1, 0, IF(COUNTRY_INFO!K13=2, AF13/(COUNTRY_INFO!G13*0.2)*100, IF(COUNTRY_INFO!K13=3, AF13/COUNTRY_INFO!G13*100))),\"-\"),0)","v":0},6929,{"$f":"IF(AND(COUNTRY_INFO!K13>0,COUNTRY_INFO!K13<4), IF(AC13/Z13*100<>0, IF(AH13/Z13*100>100,100,AH13/Z13*100), \"-\"),0)","v":11.79518693728583},null,{"$f":"IF(AND(D13<>0, D13<>\"Inconnu\",D13<>\"Interrompu\",D13<>\"Non requis\"),D13/COUNTRY_INFO!D13, 0)","v":0},{"$f":"IF(AND(J13<>0,J13<>\"Inconnu\",J13<>\"Interrompu\",J13<>\"Non requis\"),J13/COUNTRY_INFO!D13, 0)","v":0.42455219021436141},{"$f":"IF(AND(P13<>0,P13<>\"Inconnu\",P13<>\"Non requis\"),P13/(COUNTRY_INFO!E13+COUNTRY_INFO!F13), 0)","v":1},{"$f":"IF(AND(Z13<>0,Z13<>\"Inconnu\",Z13<>\"Non requis\"),IF(COUNTRY_INFO!K13=1,1,IF(COUNTRY_INFO!K13=2,0.5*COUNTRY_INFO!F13/(0.5*COUNTRY_INFO!F13+0.2*COUNTRY_INFO!G13),IF(COUNTRY_INFO!K13=3,COUNTRY_INFO!F13/(COUNTRY_INFO!F13+COUNTRY_INFO!G13)))),0)","v":0.59999863816574539},{"$f":"IF(AND(Z13<>0,Z13<>\"Inconnu\",Z13<>\"Non requis\"),IF(COUNTRY_INFO!K13=1,0,IF(COUNTRY_INFO!K13=2,0.2*COUNTRY_INFO!G13/(0.5*COUNTRY_INFO!F13+0.2*COUNTRY_INFO!G13),IF(COUNTRY_INFO!K13=3,COUNTRY_INFO!G13/(COUNTRY_INFO!F13+COUNTRY_INFO!G13)))),0)","v":0.40000136183425461},{"$f":"MAX(COUNTRY_INFO!D13*AK13*PROFILE!$G$7,COUNTRY_INFO!D13*AL13*PROFILE!$G$7)","v":3990.264843776974},{"$f":"MAX(COUNTRY_INFO!D13*AK13*PROFILE!$G$8,COUNTRY_INFO!D13*AL13*PROFILE!$G$8,COUNTRY_INFO!D13*AM13*PROFILE!$G$8)","v":37596.373058346398},{"$f":"MAX(COUNTRY_INFO!D13*AK13*PROFILE!$G$9,COUNTRY_INFO!D13*AL13*PROFILE!$G$9,COUNTRY_INFO!D13*AM13*PROFILE!$G$9,IF(AND(DISTRICT!Z13<>\"Inconnu\",Z13<>\"Non requis\"),COUNTRY_INFO!O13*DISTRICT!AN13,0))","v":70493.072236911772},{"$f":"MAX(COUNTRY_INFO!D13*AK13*PROFILE!$G$10,COUNTRY_INFO!D13*AL13*PROFILE!$G$10,IF(AND(DISTRICT!Z13<>\"Inconnu\",Z13<>\"Non requis\"),COUNTRY_INFO!O13*DISTRICT!AO13,0))","v":49880.124417065774},161959.83455610092,"Y",{"$f":"MAX('MDA2'!J13,'T1'!L13,'T2'!J13,T3_R1!K13,T3_R2!K13)","v":0},{"$f":"MAX('MDA1'!K13,'MDA2'!K13,'MDA3'!I13,'MDA3'!L13,'T1'!M13,'T2'!K13,T3_R1!L13,T3_R2!L13)","v":73650},{"$f":"MAX('MDA1'!L13,'MDA2'!L13,'MDA3'!J13,'MDA3'!M13,'T1'!N13,'T2'!L13,T3_R1!M13,T3_R2!M13)","v":50368},124018,{"$f":"MAX('MDA2'!J13,T13)","v":0},{"$f":"MAX('MDA1'!K13,'MDA2'!K13,'MDA3'!I13,'MDA3'!L13,V13,AD13)","v":70493},{"$f":"MAX('MDA1'!L13,'MDA2'!L13,'MDA3'!J13,'MDA3'!M13,AF13)","v":50368},120861,74.62405745921852]
[{"$f":"IF(COUNTRY_INFO!A14=0,\" \",COUNTRY_INFO!A14)","v":"Togo"},{"$f":"IF(COUNTRY_INFO!B14=0,\" \",COUNTRY_INFO!B14)","v":"KARA"},{"$f":"IF(COUNTRY_INFO!C14=0,\" \",COUNTRY_INFO!C14)","v":"ASSOLI"},{"$f":"COUNTRY_INFO!L14","v":"Non requis"},null,null,{"$f":"MAX('MDA1'!M14,'MDA2'!M14)","v":0},{"$f":"IF(AND(COUNTRY_INFO!H14>0,COUNTRY_INFO!H14<4),IF(D14>MAX('MDA1'!M14,'MDA2'!M14),MAX('MDA1'!M14,'MDA2'!M14),D14),0)","v":0},{"$f":"IF(AND(COUNTRY_INFO!H14>0,COUNTRY_INFO!H14<4), IF(G14/D14*100<>0, IF(G14/D14*100>100,100,G14/D14*100), \"-\"),0)","v":0},{"$f":"COUNTRY_INFO!M14","v":44126},null,null,{"$f":"MAX('MDA1'!M14,MAX('MDA3'!I14,'MDA3'!L14)+MAX('MDA3'!J14,'MDA3'!M14))","v":36501},{"$f":"IF(AND(COUNTRY_INFO!I14>0,COUNTRY_INFO!I14<4),IF(J14>MAX('MDA1'!M14,MAX('MDA3'!I14,'MDA3'!L14)+MAX('MDA3'!J14,'MDA3'!M14)),MAX('MDA1'!M14,MAX('MDA3'!I14,'MDA3'!L14)+MAX('MDA3'!J14,'MDA3'!M14)),J14),0)","v":36501},{"$f":"IF(AND(COUNTRY_INFO!I14>0,COUNTRY_INFO!I14<4), IF(M14/J14*100<>0, IF(M14/J14*100>100,100,M14/J14*100), \"-\"),0)","v":82.719938358337487},{"$f":"COUNTRY_INFO!N14","v":29092},null,null,{"$f":"SUM(MAX('MDA2'!J14, 'T1'!L14, MAX(T3_R1!K14, T3_R2!K14)), MAX('MDA1'!K14, 'MDA2'!K14, 'T1'!M14, MAX(T3_R1!L14, T3_R2!L14)), MAX('MDA1'!L14, 'MDA2'!L14, 'T1'!N14, MAX(T3_R1!M14, T3_R2!M14)))","v":19250},{"$f":"IF(AND(COUNTRY_INFO!J14>1,COUNTRY_INFO!J14<4),IF(COUNTRY_INFO!E14>MAX('MDA2'!J14,'T1'!L14,MAX(T3_R1!K14,T3_R2!K14)),MAX('MDA2'!J14,'T1'!L14,MAX(T3_R1!K14,T3_R2!K14)),COUNTRY_INFO!E14),0)","v":0},{"$f":"IF(AND(COUNTRY_INFO!J14>1,COUNTRY_INFO!J14<4), IF(T14/COUNTRY_INFO!E14*100<>0, IF(T14/COUNTRY_INFO!E14*100>100,100,T14/COUNTRY_INFO!E14*100), \"-\"),0)","v":"-"},{"$f":"IF(AND(COUNTRY_INFO!J14>1,COUNTRY_INFO!J14<4),IF(COUNTRY_INFO!F14>MAX('MDA1'!K14,'MDA2'!K14,'T1'!M14,MAX(T3_R1!L14,T3_R2!L14)),MAX('MDA1'!K14,'MDA2'!K14,'T1'!M14,MAX(T3_R1!L14,T3_R2!L14)),COUNTRY_INFO!F14),0)","v":18973},{"$f":"IF(AND(COUNTRY_INFO!J14>1,COUNTRY_INFO!J14<4), IF(V14/COUNTRY_INFO!F14*100<>0, IF(V14/COUNTRY_INFO!F14*100>100,100,V14/COUNTRY_INFO!F14*100), \"-\"),0)","v":100},18973,{"$f":"IF(AND(COUNTRY_INFO!J14>1,COUNTRY_INFO!J14<4), IF(S14/P14*100<>0, IF(X14/P14*100>100,100,X14/P14*100), \"-\"),0)","v":65.217241853430494},{"$f":"COUNTRY_INFO!O14","v":15810.7},null,null,{"$f":"MAX('T1'!L14,'T2'!J14)+MAX('T1'!M14,'T2'!K14)+MAX('T1'!N14,'T2'!L14)","v":2780},{"$f":"IF(COUNTRY_INFO!K14=1,IF(COUNTRY_INFO!F14*0.33>MAX('T1'!M14,'T2'!K14),MAX('T1'!M14,'T2'!K14),COUNTRY_INFO!F14*0.33),IF(COUNTRY_INFO!K14=2,IF(COUNTRY_INFO!F14*0.5>MAX('T1'!M14,'T2'!K14),MAX('T1'!M14,'T2'!K14),COUNTRY_INFO!F14*0.5),IF(COUNTRY_INFO!K14=3,IF(COUNTRY_INFO!F14>MAX('T1'!M14,'T2'!K14),MAX('T1'!M14,'T2'!K14),COUNTRY_INFO!F14),0)))","v":2780},{"$f":"IF(AND(COUNTRY_INFO!K14>0,COUNTRY_INFO!K14<4),IF(Z14>0,IF(COUNTRY_INFO!K14=1, AD14/(COUNTRY_INFO!F14*0.33)*100, IF(COUNTRY_INFO!K14=2, AD14/(COUNTRY_INFO!F14*0.5)*100, IF(COUNTRY_INFO!K14=3, AD14/COUNTRY_INFO!F14*100))),\"-\"),0)","v":29.304801560111738},{"$f":"IF(COUNTRY_INFO!K14=2,IF(COUNTRY_INFO!G14*0.2>MAX('T1'!N14,'T2'!L14),MAX('T1'!N14,'T2'!L14),COUNTRY_INFO!G14*0.2),IF(COUNTRY_INFO!K14=3,IF(COUNTRY_INFO!G14>MAX('T1'!N14,'T2'!L14),MAX('T1'!N14,'T2'!L14),COUNTRY_INFO!G14),0))","v":0},{"$f":"IF(AND(COUNTRY_INFO!K14>0,COUNTRY_INFO!K14<4),IF(Z14>0,IF(COUNTRY_INFO!K14=1, 0, IF(COUNTRY_INFO!K14=2, AF14/(COUNTRY_INFO!G14*0.2)*100, IF(COUNTRY_INFO!K14=3, AF14/COUNTRY_INFO!G14*100))),\"-\"),0)","v":0},2780,{"$f":"IF(AND(COUNTRY_INFO!K14>0,COUNTRY_INFO!K14<4), IF(AC14/Z14*100<>0, IF(AH14/Z14*100>100,100,AH14/Z14*100), \"-\"),0)","v":17.583029214392784},null,{"$f":"IF(AND(D14<>0, D14<>\"Inconnu\",D14<>\"Interrompu\",D14<>\"Non requis\"),D14/COUNTRY_INFO!D14, 0)","v":0},{"$f":"IF(AND(J14<>0,J14<>\"Inconnu\",J14<>\"Interrompu\",J14<>\"Non requis\"),J14/COUNTRY_INFO!D14, 0)","v":0.69773251952816162},{"$f":"IF(AND(P14<>0,P14<>\"Inconnu\",P14<>\"Non requis\"),P14/(COUNTRY_INFO!E14+COUNTRY_INFO!F14), 0)","v":1},{"$f":"IF(AND(Z14<>0,Z14<>\"Inconnu\",Z14<>\"Non requis\"),IF(COUNTRY_INFO!K14=1,1,IF(COUNTRY_INFO!K14=2,0.5*COUNTRY_INFO!F14/(0.5*COUNTRY_INFO!F14+0.2*COUNTRY_INFO!G14),IF(COUNTRY_INFO!K14=3,COUNTRY_INFO!F14/(COUNTRY_INFO!F14+COUNTRY_INFO!G14)))),0)","v":0.60000505986452213},{"$f":"IF(AND(Z14<>0,Z14<>\"Inconnu\",Z14<>\"Non requis\"),IF(COUNTRY_INFO!K14=1,0,IF(COUNTRY_INFO!K14=2,0.2*COUNTRY_INFO!G14/(0.5*COUNTRY_INFO!F14+0.2*COUNTRY_INFO!G14),IF(COUNTRY_INFO!K14=3,COUNTRY_INFO!G14/(COUNTRY_INFO!F14+COUNTRY_INFO!G14)))),0)","v":0.39999494013547793},{"$f":"MAX(COUNTRY_INFO!D14*AK14*PROFILE!$G$7,COUNTRY_INFO!D14*AL14*PROFILE!$G$7)","v":1764.9802174869963},{"$f":"MAX(COUNTRY_INFO!D14*AK14*PROFILE!$G$8,COUNTRY_INFO!D14*AL14*PROFILE!$G$8,COUNTRY_INFO!D14*AM14*PROFILE!$G$8)","v":10118.734280188881},{"$f":"MAX(COUNTRY_INFO!D14*AK14*PROFILE!$G$9,COUNTRY_INFO!D14*AL14*PROFILE!$G$9,COUNTRY_INFO!D14*AM14*PROFILE!$G$9,IF(AND(DISTRICT!Z14<>\"Inconnu\",Z14<>\"Non requis\"),COUNTRY_INFO!O14*DISTRICT!AN14,0))","v":18972.592527808141},{"$f":"MAX(COUNTRY_INFO!D14*AK14*PROFILE!$G$10,COUNTRY_INFO!D14*AL14*PROFILE!$G$10,IF(AND(DISTRICT!Z14<>\"Inconnu\",Z14<>\"Non requis\"),COUNTRY_INFO!O14*DISTRICT!AO14,0))","v":22063.055032352087},52919.362057836108,"Y",{"$f":"MAX('MDA2'!J14,'T1'!L14,'T2'!J14,T3_R1!K14,T3_R2!K14)","v":0},{"$f":"MAX('MDA1'!K14,'MDA2'!K14,'MDA3'!I14,'MDA3'!L14,'T1'!M14,'T2'!K14,T3_R1!L14,T3_R2!L14)","v":19250},{"$f":"MAX('MDA1'!L14,'MDA2'!L14,'MDA3'!J14,'MDA3'!M14,'T1'!N14,'T2'!L14,T3_R1!M14,T3_R2!M14)","v":22282},41532,{"$f":"MAX('MDA2'!J14,T14)","v":0},{"$f":"MAX('MDA1'!K14,'MDA2'!K14,'MDA3'!I14,'MDA3'!L14,V14,AD14)","v":18973},{"$f":"MAX('MDA1'!L14,'MDA2'!L14,'MDA3'!J14,'MDA3'!M14,AF14)","v":22282},41255,77.958233802803576]
[{"$f":"IF(COUNTRY_INFO!A15=0,\" \",COUNTRY_INFO!A15)","v":"Togo"},{"$f":"IF(COUNTRY_INFO!B15=0,\" \",COUNTRY_INFO!B15)","v":"KARA"},{"$f":"IF(COUNTRY_INFO!C15=0,\" \",COUNTRY_INFO!C15)","v":"BASSAR"},{"$f":"COUNTRY_INFO!L15","v":"Non requis"},null,null,{"$f":"MAX('MDA1'!M15,'MDA2'!M15)","v":0},{"$f":"IF(AND(COUNTRY_INFO!H15>0,COUNTRY_INFO!H15<4),IF(D15>MAX('MDA1'!M15,'MDA2'!M15),MAX('MDA1'!M15,'MDA2'!M15),D15),0)","v":0},{"$f":"IF(AND(COUNTRY_INFO!H15>0,COUNTRY_INFO!H15<4), IF(G15/D15*100<>0, IF(G15/D15*100>100,100,G15/D15*100), \"-\"),0)","v":0},{"$f":"COUNTRY_INFO!M15","v":98761},null,null,{"$f":"MAX('MDA1'!M15,MAX('MDA3'!I15,'MDA3'!L15)+MAX('MDA3'!J15,'MDA3'!M15))","v":81575},{"$f":"IF(AND(COUNTRY_INFO!I15>0,COUNTRY_INFO!I15<4),IF(J15>MAX('MDA1'!M15,MAX('MDA3'!I15,'MDA3'!L15)+MAX('MDA3'!J15,'MDA3'!M15)),MAX('MDA1'!M15,MAX('MDA3'!I15,'MDA3'!L15)+MAX('MDA3'!J15,'MDA3'!M15)),J15),0)","v":81575},{"$f":"IF(AND(COUNTRY_INFO!I15>0,COUNTRY_INFO!I15<4), IF(M15/J15*100<>0, IF(M15/J15*100>100,100,M15/J15*100), \"-\"),0)","v":82.598394102935373},{"$f":"COUNTRY_INFO!N15","v":67332},null,null,{"$f":"SUM(MAX('MDA2'!J15, 'T1'!L15, MAX(T3_R1!K15, T3_R2!K15)), MAX('MDA1'!K15, 'MDA2'!K15, 'T1'!M15, MAX(T3_R1!L15, T3_R2!L15)), MAX('MDA1'!L15, 'MDA2'!L15, 'T1'!N15, MAX(T3_R1!M15, T3_R2!M15)))","v":44587},{"$f":"IF(AND(COUNTRY_INFO!J15>1,COUNTRY_INFO!J15<4),IF(COUNTRY_INFO!E15>MAX('MDA2'!J15,'T1'!L15,MAX(T3_R1!K15,T3_R2!K15)),MAX('MDA2'!J15,'T1'!L15,MAX(T3_R1!K15,T3_R2!K15)),COUNTRY_INFO!E15),0)","v":0},{"$f":"IF(AND(COUNTRY_INFO!J15>1,COUNTRY_INFO!J15<4), IF(T15/COUNTRY_INFO!E15*100<>0, IF(T15/COUNTRY_INFO!E15*100>100,100,T15/COUNTRY_INFO!E15*100), \"-\"),0)","v":"-"},{"$f":"IF(AND(COUNTRY_INFO!J15>1,COUNTRY_INFO!J15<4),IF(COUNTRY_INFO!F15>MAX('MDA1'!K15,'MDA2'!K15,'T1'!M15,MAX(T3_R1!L15,T3_R2!L15)),MAX('MDA1'!K15,'MDA2'!K15,'T1'!M15,MAX(T3_R1!L15,T3_R2!L15)),COUNTRY_INFO!F15),0)","v":43912},{"$f":"IF(AND(COUNTRY_INFO!J15>1,COUNTRY_INFO!J15<4), IF(V15/COUNTRY_INFO!F15*100<>0, IF(V15/COUNTRY_INFO!F15*100>100,100,V15/COUNTRY_INFO!F15*100), \"-\"),0)","v":100},43912,{"$f":"IF(AND(COUNTRY_INFO!J15>1,COUNTRY_INFO!J15<4), IF(S15/P15*100<>0, IF(X15/P15*100>100,100,X15/P15*100), \"-\"),0)","v":65.217133012534902},{"$f":"COUNTRY_INFO!O15","v":117099},null,null,{"$f":"MAX('T1'!L15,'T2'!J15)+MAX('T1'!M15,'T2'!K15)+MAX('T1'!N15,'T2'!L15)","v":703},{"$f":"IF(COUNTRY_INFO!K15=1,IF(COUNTRY_INFO!F15*0.33>MAX('T1'!M15,'T2'!K15),MAX('T1'!M15,'T2'!K15),COUNTRY_INFO!F15*0.33),IF(COUNTRY_INFO!K15=2,IF(COUNTRY_INFO!F15*0.5>MAX('T1'!M15,'T2'!K15),MAX('T1'!M15,'T2'!K15),COUNTRY_INFO!F15*0.5),IF(COUNTRY_INFO!K15=3,IF(COUNTRY_INFO!F15>MAX('T1'!M15,'T2'!K15),MAX('T1'!M15,'T2'!K15),COUNTRY_INFO!F15),0)))","v":703},{"$f":"IF(AND(COUNTRY_INFO!K15>0,COUNTRY_INFO!K15<4),IF(Z15>0,IF(COUNTRY_INFO!K15=1, AD15/(COUNTRY_INFO!F15*0.33)*100, IF(COUNTRY_INFO!K15=2, AD15/(COUNTRY_INFO!F15*0.5)*100, IF(COUNTRY_INFO!K15=3, AD15/COUNTRY_INFO!F15*100))),\"-\"),0)","v":1.6009291309892513},{"$f":"IF(COUNTRY_INFO!K15=2,IF(COUNTRY_INFO!G15*0.2>MAX('T1'!N15,'T2'!L15),MAX('T1'!N15,'T2'!L15),COUNTRY_INFO!G15*0.2),IF(COUNTRY_INFO!K15=3,IF(COUNTRY_INFO!G15>MAX('T1'!N15,'T2'!L15),MAX('T1'!N15,'T2'!L15),COUNTRY_INFO!G15),0))","v":0},{"$f":"IF(AND(COUNTRY_INFO!K15>0,COUNTRY_INFO!K15<4),IF(Z15>0,IF(COUNTRY_INFO!K15=1, 0, IF(COUNTRY_INFO!K15=2, AF15/(COUNTRY_INFO!G15*0.2)*100, IF(COUNTRY_INFO!K15=3, AF15/COUNTRY_INFO!G15*100))),\"-\"),0)","v":0},703,{"$f":"IF(AND(COUNTRY_INFO!K15>0,COUNTRY_INFO!K15<4), IF(AC15/Z15*100<>0, IF(AH15/Z15*100>100,100,AH15/Z15*100), \"-\"),0)","v":0.60034671517263172},null,{"$f":"IF(AND(D15<>0, D15<>\"Inconnu\",D15<>\"Interrompu\",D15<>\"Non requis\"),D15/COUNTRY_INFO!D15, 0)","v":0},{"$f":"IF(AND(J15<>0,J15<>\"Inconnu\",J15<>\"Interrompu\",J15<>\"Non requis\"),J15/COUNTRY_INFO!D15, 0)","v":0.67471682129339905},{"$f":"IF(AND(P15<>0,P15<>\"Inconnu\",P15<>\"Non requis\"),P15/(COUNTRY_INFO!E15+COUNTRY_INFO!F15), 0)","v":1},{"$f":"IF(AND(Z15<>0,Z15<>\"Inconnu\",Z15<>\"Non requis\"),IF(COUNTRY_INFO!K15=1,1,IF(COUNTRY_INFO!K15=2,0.5*COUNTRY_INFO!F15/(0.5*COUNTRY_INFO!F15+0.2*COUNTRY_INFO!G15),IF(COUNTRY_INFO!K15=3,COUNTRY_INFO!F15/(COUNTRY_INFO!F15+COUNTRY_INFO!G15)))),0)","v":0.37499893252717786},{"$f":"IF(AND(Z15<>0,Z15<>\"Inconnu\",Z15<>\"Non requis\"),IF(COUNTRY_INFO!K15=1,0,IF(COUNTRY_INFO!K15=2,0.2*COUNTRY_INFO!G15/(0.5*COUNTRY_INFO!F15+0.2*COUNTRY_INFO!G15),IF(COUNTRY_INFO!K15=3,COUNTRY_INFO!G15/(COUNTRY_INFO!F15+COUNTRY_INFO!G15)))),0)","v":0.62500106747282214},{"$f":"MAX(COUNTRY_INFO!D15*AK15*PROFILE!$G$7,COUNTRY_INFO!D15*AL15*PROFILE!$G$7)","v":3950.3061972359428},{"$f":"MAX(COUNTRY_INFO!D15*AK15*PROFILE!$G$8,COUNTRY_INFO!D15*AL15*PROFILE!$G$8,COUNTRY_INFO!D15*AM15*PROFILE!$G$8)","v":23419.873051585455},{"$f":"MAX(COUNTRY_INFO!D15*AK15*PROFILE!$G$9,COUNTRY_INFO!D15*AL15*PROFILE!$G$9,COUNTRY_INFO!D15*AM15*PROFILE!$G$9,IF(AND(DISTRICT!Z15<>\"Inconnu\",Z15<>\"Non requis\"),COUNTRY_INFO!O15*DISTRICT!AN15,0))","v":43912.182705565749},{"$f":"MAX(COUNTRY_INFO!D15*AK15*PROFILE!$G$10,COUNTRY_INFO!D15*AL15*PROFILE!$G$10,IF(AND(DISTRICT!Z15<>\"Inconnu\",Z15<>\"Non requis\"),COUNTRY_INFO!O15*DISTRICT!AO15,0))","v":73187},144469.36195438716,"Y",{"$f":"MAX('MDA2'!J15,'T1'!L15,'T2'!J15,T3_R1!K15,T3_R2!K15)","v":0},{"$f":"MAX('MDA1'!K15,'MDA2'!K15,'MDA3'!I15,'MDA3'!L15,'T1'!M15,'T2'!K15,T3_R1!L15,T3_R2!L15)","v":44587},{"$f":"MAX('MDA1'!L15,'MDA2'!L15,'MDA3'!J15,'MDA3'!M15,'T1'!N15,'T2'!L15,T3_R1!M15,T3_R2!M15)","v":49910},94497,{"$f":"MAX('MDA2'!J15,T15)","v":0},{"$f":"MAX('MDA1'!K15,'MDA2'!K15,'MDA3'!I15,'MDA3'!L15,V15,AD15)","v":43912},{"$f":"MAX('MDA1'!L15,'MDA2'!L15,'MDA3'!J15,'MDA3'!M15,AF15)","v":49910},93822,64.942489349141113]
[{"$f":"IF(COUNTRY_INFO!A16=0,\" \",COUNTRY_INFO!A16)","v":"Togo"},{"$f":"IF(COUNTRY_INFO!B16=0,\" \",COUNTRY_INFO!B16)","v":"KARA"},{"$f":"IF(COUNTRY_INFO!C16=0,\" \",COUNTRY_INFO!C16)","v":"BINAH"},{"$f":"COUNTRY_INFO!L16","v":"Non requis"},null,null,{"$f":"MAX('MDA1'!M16,'MDA2'!M16)","v":0},{"$f":"IF(AND(COUNTRY_INFO!H16>0,COUNTRY_INFO!H16<4),IF(D16>MAX('MDA1'!M16,'MDA2'!M16),MAX('MDA1'!M16,'MDA2'!M16),D16),0)","v":0},{"$f":"IF(AND(COUNTRY_INFO!H16>0,COUNTRY_INFO!H16<4), IF(G16/D16*100<>0, IF(G16/D16*100>100,100,G16/D16*100), \"-\"),0)","v":0},{"$f":"COUNTRY_INFO!M16","v":50271},null,null,{"$f":"MAX('MDA1'!M16,MAX('MDA3'!I16,'MDA3'!L16)+MAX('MDA3'!J16,'MDA3'!M16))","v":41829},{"$f":"IF(AND(COUNTRY_INFO!I16>0,COUNTRY_INFO!I16<4),IF(J16>MAX('MDA1'!M16,MAX('MDA3'!I16,'MDA3'!L16)+MAX('MDA3'!J16,'MDA3'!M16)),MAX('MDA1'!M16,MAX('MDA3'!I16,'MDA3'!L16)+MAX('MDA3'!J16,'MDA3'!M16)),J16),0)","v":41829},{"$f":"IF(AND(COUNTRY_INFO!I16>0,COUNTRY_INFO!I16<4), IF(M16/J16*100<>0, IF(M16/J16*100>100,100,M16/J16*100), \"-\"),0)","v":83.207017962642482},{"$f":"COUNTRY_INFO!N16","v":39858},null,null,{"$f":"SUM(MAX('MDA2'!J16, 'T1'!L16, MAX(T3_R1!K16, T3_R2!K16)), MAX('MDA1'!K16, 'MDA2'!K16, 'T1'!M16, MAX(T3_R1!L16, T3_R2!L16)), MAX('MDA1'!L16, 'MDA2'!L16, 'T1'!N16, MAX(T3_R1!M16, T3_R2!M16)))","v":23236},{"$f":"IF(AND(COUNTRY_INFO!J16>1,COUNTRY_INFO!J16<4),IF(COUNTRY_INFO!E16>MAX('MDA2'!J16,'T1'!L16,MAX(T3_R1!K16,T3_R2!K16)),MAX('MDA2'!J16,'T1'!L16,MAX(T3_R1!K16,T3_R2!K16)),COUNTRY_INFO!E16),0)","v":0},{"$f":"IF(AND(COUNTRY_INFO!J16>1,COUNTRY_INFO!J16<4), IF(T16/COUNTRY_INFO!E16*100<>0, IF(T16/COUNTRY_INFO!E16*100>100,100,T16/COUNTRY_INFO!E16*100), \"-\"),0)","v":"-"},{"$f":"IF(AND(COUNTRY_INFO!J16>1,COUNTRY_INFO!J16<4),IF(COUNTRY_INFO!F16>MAX('MDA1'!K16,'MDA2'!K16,'T1'!M16,MAX(T3_R1!L16,T3_R2!L16)),MAX('MDA1'!K16,'MDA2'!K16,'T1'!M16,MAX(T3_R1!L16,T3_R2!L16)),COUNTRY_INFO!F16),0)","v":23236},{"$f":"IF(AND(COUNTRY_INFO!J16>1,COUNTRY_INFO!J16<4), IF(V16/COUNTRY_INFO!F16*100<>0, IF(V16/COUNTRY_INFO!F16*100>100,100,V16/COUNTRY_INFO!F16*100), \"-\"),0)","v":89.389859198276525},23236,{"$f":"IF(AND(COUNTRY_INFO!J16>1,COUNTRY_INFO!J16<4), IF(S16/P16*100<>0, IF(X16/P16*100>100,100,X16/P16*100), \"-\"),0)","v":58.296954187365145},{"$f":"COUNTRY_INFO!O16","v":21661.800000000003},null,null,{"$f":"MAX('T1'!L16,'T2'!J16)+MAX('T1'!M16,'T2'!K16)+MAX('T1'!N16,'T2'!L16)","v":0},{"$f":"IF(COUNTRY_INFO!K16=1,IF(COUNTRY_INFO!F16*0.33>MAX('T1'!M16,'T2'!K16),MAX('T1'!M16,'T2'!K16),COUNTRY_INFO!F16*0.33),IF(COUNTRY_INFO!K16=2,IF(COUNTRY_INFO!F16*0.5>MAX('T1'!M16,'T2'!K16),MAX('T1'!M16,'T2'!K16),COUNTRY_INFO!F16*0.5),IF(COUNTRY_INFO!K16=3,IF(COUNTRY_INFO!F16>MAX('T1'!M16,'T2'!K16),MAX('T1'!M16,'T2'!K16),COUNTRY_INFO!F16),0)))","v":0},{"$f":"IF(AND(COUNTRY_INFO!K16>0,COUNTRY_INFO!K16<4),IF(Z16>0,IF(COUNTRY_INFO!K16=1, AD16/(COUNTRY_INFO!F16*0.33)*100, IF(COUNTRY_INFO!K16=2, AD16/(COUNTRY_INFO!F16*0.5)*100, IF(COUNTRY_INFO!K16=3, AD16/COUNTRY_INFO!F16*100))),\"-\"),0)","v":0},{"$f":"IF(COUNTRY_INFO!K16=2,IF(COUNTRY_INFO!G16*0.2>MAX('T1'!N16,'T2'!L16),MAX('T1'!N16,'T2'!L16),COUNTRY_INFO!G16*0.2),IF(COUNTRY_INFO!K16=3,IF(COUNTRY_INFO!G16>MAX('T1'!N16,'T2'!L16),MAX('T1'!N16,'T2'!L16),COUNTRY_INFO!G16),0))","v":0},{"$f":"IF(AND(COUNTRY_INFO!K16>0,COUNTRY_INFO!K16<4),IF(Z16>0,IF(COUNTRY_INFO!K16=1, 0, IF(COUNTRY_INFO!K16=2, AF16/(COUNTRY_INFO!G16*0.2)*100, IF(COUNTRY_INFO!K16=3, AF16/COUNTRY_INFO!G16*100))),\"-\"),0)","v":0},0,{"$f":"IF(AND(COUNTRY_INFO!K16>0,COUNTRY_INFO!K16<4), IF(AC16/Z16*100<>0, IF(AH16/Z16*100>100,100,AH16/Z16*100), \"-\"),0)","v":"-"},null,{"$f":"IF(AND(D16<>0, D16<>\"Inconnu\",D16<>\"Interrompu\",D16<>\"Non requis\"),D16/COUNTRY_INFO!D16, 0)","v":0},{"$f":"IF(AND(J16<>0,J16<>\"Inconnu\",J16<>\"Interrompu\",J16<>\"Non requis\"),J16/COUNTRY_INFO!D16, 0)","v":0.58018165660669152},{"$f":"IF(AND(P16<>0,P16<>\"Inconnu\",P16<>\"Non requis\"),P16/(COUNTRY_INFO!E16+COUNTRY_INFO!F16), 0)","v":1},{"$f":"IF(AND(Z16<>0,Z16<>\"Inconnu\",Z16<>\"Non requis\"),IF(COUNTRY_INFO!K16=1,1,IF(COUNTRY_INFO!K16=2,0.5*COUNTRY_INFO!F16/(0.5*COUNTRY_INFO!F16+0.2*COUNTRY_INFO!G16),IF(COUNTRY_INFO!K16=3,COUNTRY_INFO!F16/(COUNTRY_INFO!F16+COUNTRY_INFO!G16)))),0)","v":0.59999630686277217},{"$f":"IF(AND(Z16<>0,Z16<>\"Inconnu\",Z16<>\"Non requis\"),IF(COUNTRY_INFO!K16=1,0,IF(COUNTRY_INFO!K16=2,0.2*COUNTRY_INFO!G16/(0.5*COUNTRY_INFO!F16+0.2*COUNTRY_INFO!G16),IF(COUNTRY_INFO!K16=3,COUNTRY_INFO!G16/(COUNTRY_INFO!F16+COUNTRY_INFO!G16)))),0)","v":0.40000369313722772},{"$f":"MAX(COUNTRY_INFO!D16*AK16*PROFILE!$G$7,COUNTRY_INFO!D16*AL16*PROFILE!$G$7)","v":2010.7718921562978},{"$f":"MAX(COUNTRY_INFO!D16*AK16*PROFILE!$G$8,COUNTRY_INFO!D16*AL16*PROFILE!$G$8,COUNTRY_INFO!D16*AM16*PROFILE!$G$8)","v":13863.539565091647},{"$f":"MAX(COUNTRY_INFO!D16*AK16*PROFILE!$G$9,COUNTRY_INFO!D16*AL16*PROFILE!$G$9,COUNTRY_INFO!D16*AM16*PROFILE!$G$9,IF(AND(DISTRICT!Z16<>\"Inconnu\",Z16<>\"Non requis\"),COUNTRY_INFO!O16*DISTRICT!AN16,0))","v":25994.089762452044},{"$f":"MAX(COUNTRY_INFO!D16*AK16*PROFILE!$G$10,COUNTRY_INFO!D16*AL16*PROFILE!$G$10,IF(AND(DISTRICT!Z16<>\"Inconnu\",Z16<>\"Non requis\"),COUNTRY_INFO!O16*DISTRICT!AO16,0))","v":25135.562696173951},67003.963915873945,0,{"$f":"MAX('MDA2'!J16,'T1'!L16,'T2'!J16,T3_R1!K16,T3_R2!K16)","v":0},{"$f":"MAX('MDA1'!K16,'MDA2'!K16,'MDA3'!I16,'MDA3'!L16,'T1'!M16,'T2'!K16,T3_R1!L16,T3_R2!L16)","v":23236},{"$f":"MAX('MDA1'!L16,'MDA2'!L16,'MDA3'!J16,'MDA3'!M16,'T1'!N16,'T2'!L16,T3_R1!M16,T3_R2!M16)","v":26400},49636,{"$f":"MAX('MDA2'!J16,T16)","v":0},{"$f":"MAX('MDA1'!K16,'MDA2'!K16,'MDA3'!I16,'MDA3'!L16,V16,AD16)","v":23236},{"$f":"MAX('MDA1'!L16,'MDA2'!L16,'MDA3'!J16,'MDA3'!M16,AF16)","v":26400},49636,74.079199347548908]
[{"$f":"IF(COUNTRY_INFO!A17=0,\" \",COUNTRY_INFO!A17)","v":"Togo"},{"$f":"IF(COUNTRY_INFO!B17=0,\" \",COUNTRY_INFO!B17)","v":"KARA"},{"$f":"IF(COUNTRY_INFO!C17=0,\" \",COUNTRY_INFO!C17)","v":"DANKPEN"},{"$f":"COUNTRY_INFO!L17","v":"Non requis"},null,null,{"$f":"MAX('MDA1'!M17,'MDA2'!M17)","v":0},{"$f":"IF(AND(COUNTRY_INFO!H17>0,COUNTRY_INFO!H17<4),IF(D17>MAX('MDA1'!M17,'MDA2'!M17),MAX('MDA1'!M17,'MDA2'!M17),D17),0)","v":0},{"$f":"IF(AND(COUNTRY_INFO!H17>0,COUNTRY_INFO!H17<4), IF(G17/D17*100<>0, IF(G17/D17*100>100,100,G17/D17*100), \"-\"),0)","v":0},{"$f":"COUNTRY_INFO!M17","v":150654},null,null,{"$f":"MAX('MDA1'!M17,MAX('MDA3'!I17,'MDA3'!L17)+MAX('MDA3'!J17,'MDA3'!M17))","v":120921},{"$f":"IF(AND(COUNTRY_INFO!I17>0,COUNTRY_INFO!I17<4),IF(J17>MAX('MDA1'!M17,MAX('MDA3'!I17,'MDA3'!L17)+MAX('MDA3'!J17,'MDA3'!M17)),MAX('MDA1'!M17,MAX('MDA3'!I17,'MDA3'!L17)+MAX('MDA3'!J17,'MDA3'!M17)),J17),0)","v":120921},{"$f":"IF(AND(COUNTRY_INFO!I17>0,COUNTRY_INFO!I17<4), IF(M17/J17*100<>0, IF(M17/J17*100>100,100,M17/J17*100), \"-\"),0)","v":80.264048747461075},{"$f":"COUNTRY_INFO!N17","v":72856},null,null,{"$f":"SUM(MAX('MDA2'!J17, 'T1'!L17, MAX(T3_R1!K17, T3_R2!K17)), MAX('MDA1'!K17, 'MDA2'!K17, 'T1'!M17, MAX(T3_R1!L17, T3_R2!L17)), MAX('MDA1'!L17, 'MDA2'!L17, 'T1'!N17, MAX(T3_R1!M17, T3_R2!M17)))","v":50083},{"$f":"IF(AND(COUNTRY_INFO!J17>1,COUNTRY_INFO!J17<4),IF(COUNTRY_INFO!E17>MAX('MDA2'!J17,'T1'!L17,MAX(T3_R1!K17,T3_R2!K17)),MAX('MDA2'!J17,'T1'!L17,MAX(T3_R1!K17,T3_R2!K17)),COUNTRY_INFO!E17),0)","v":0},{"$f":"IF(AND(COUNTRY_INFO!J17>1,COUNTRY_INFO!J17<4), IF(T17/COUNTRY_INFO!E17*100<>0, IF(T17/COUNTRY_INFO!E17*100>100,100,T17/COUNTRY_INFO!E17*100), \"-\"),0)","v":"-"},{"$f":"IF(AND(COUNTRY_INFO!J17>1,COUNTRY_INFO!J17<4),IF(COUNTRY_INFO!F17>MAX('MDA1'!K17,'MDA2'!K17,'T1'!M17,MAX(T3_R1!L17,T3_R2!L17)),MAX('MDA1'!K17,'MDA2'!K17,'T1'!M17,MAX(T3_R1!L17,T3_R2!L17)),COUNTRY_INFO!F17),0)","v":47515},{"$f":"IF(AND(COUNTRY_INFO!J17>1,COUNTRY_INFO!J17<4), IF(V17/COUNTRY_INFO!F17*100<>0, IF(V17/COUNTRY_INFO!F17*100>100,100,V17/COUNTRY_INFO!F17*100), \"-\"),0)","v":100},47515,{"$f":"IF(AND(COUNTRY_INFO!J17>1,COUNTRY_INFO!J17<4), IF(S17/P17*100<>0, IF(X17/P17*100>100,100,X17/P17*100), \"-\"),0)","v":65.217689689250022},{"$f":"COUNTRY_INFO!O17","v":15679.95},null,null,{"$f":"MAX('T1'!L17,'T2'!J17)+MAX('T1'!M17,'T2'!K17)+MAX('T1'!N17,'T2'!L17)","v":0},{"$f":"IF(COUNTRY_INFO!K17=1,IF(COUNTRY_INFO!F17*0.33>MAX('T1'!M17,'T2'!K17),MAX('T1'!M17,'T2'!K17),COUNTRY_INFO!F17*0.33),IF(COUNTRY_INFO!K17=2,IF(COUNTRY_INFO!F17*0.5>MAX('T1'!M17,'T2'!K17),MAX('T1'!M17,'T2'!K17),COUNTRY_INFO!F17*0.5),IF(COUNTRY_INFO!K17=3,IF(COUNTRY_INFO!F17>MAX('T1'!M17,'T2'!K17),MAX('T1'!M17,'T2'!K17),COUNTRY_INFO!F17),0)))","v":0},{"$f":"IF(AND(COUNTRY_INFO!K17>0,COUNTRY_INFO!K17<4),IF(Z17>0,IF(COUNTRY_INFO!K17=1, AD17/(COUNTRY_INFO!F17*0.33)*100, IF(COUNTRY_INFO!K17=2, AD17/(COUNTRY_INFO!F17*0.5)*100, IF(COUNTRY_INFO!K17=3, AD17/COUNTRY_INFO!F17*100))),\"-\"),0)","v":0},{"$f":"IF(COUNTRY_INFO!K17=2,IF(COUNTRY_INFO!G17*0.2>MAX('T1'!N17,'T2'!L17),MAX('T1'!N17,'T2'!L17),COUNTRY_INFO!G17*0.2),IF(COUNTRY_INFO!K17=3,IF(COUNTRY_INFO!G17>MAX('T1'!N17,'T2'!L17),MAX('T1'!N17,'T2'!L17),COUNTRY_INFO!G17),0))","v":0},{"$f":"IF(AND(COUNTRY_INFO!K17>0,COUNTRY_INFO!K17<4),IF(Z17>0,IF(COUNTRY_INFO!K17=1, 0, IF(COUNTRY_INFO!K17=2, AF17/(COUNTRY_INFO!G17*0.2)*100, IF(COUNTRY_INFO!K17=3, AF17/COUNTRY_INFO!G17*100))),\"-\"),0)","v":0},0,{"$f":"IF(AND(COUNTRY_INFO!K17>0,COUNTRY_INFO!K17<4), IF(AC17/Z17*100<>0, IF(AH17/Z17*100>100,100,AH17/Z17*100), \"-\"),0)","v":"-"},null,{"$f":"IF(AND(D17<>0, D17<>\"Inconnu\",D17<>\"Interrompu\",D17<>\"Non requis\"),D17/COUNTRY_INFO!D17, 0)","v":0},{"$f":"IF(AND(J17<>0,J17<>\"Inconnu\",J17<>\"Interrompu\",J17<>\"Non requis\"),J17/COUNTRY_INFO!D17, 0)","v":0.95120057076832742},{"$f":"IF(AND(P17<>0,P17<>\"Inconnu\",P17<>\"Non requis\"),P17/(COUNTRY_INFO!E17+COUNTRY_INFO!F17), 0)","v":1},{"$f":"IF(AND(Z17<>0,Z17<>\"Inconnu\",Z17<>\"Non requis\"),IF(COUNTRY_INFO!K17=1,1,IF(COUNTRY_INFO!K17=2,0.5*COUNTRY_INFO!F17/(0.5*COUNTRY_INFO!F17+0.2*COUNTRY_INFO!G17),IF(COUNTRY_INFO!K17=3,COUNTRY_INFO!F17/(COUNTRY_INFO!F17+COUNTRY_INFO!G17)))),0)","v":1},{"$f":"IF(AND(Z17<>0,Z17<>\"Inconnu\",Z17<>\"Non requis\"),IF(COUNTRY_INFO!K17=1,0,IF(COUNTRY_INFO!K17=2,0.2*COUNTRY_INFO!G17/(0.5*COUNTRY_INFO!F17+0.2*COUNTRY_INFO!G17),IF(COUNTRY_INFO!K17=3,COUNTRY_INFO!G17/(COUNTRY_INFO!F17+COUNTRY_INFO!G17)))),0)","v":0},{"$f":"MAX(COUNTRY_INFO!D17*AK17*PROFILE!$G$7,COUNTRY_INFO!D17*AL17*PROFILE!$G$7)","v":6025.9558918842849},{"$f":"MAX(COUNTRY_INFO!D17*AK17*PROFILE!$G$8,COUNTRY_INFO!D17*AL17*PROFILE!$G$8,COUNTRY_INFO!D17*AM17*PROFILE!$G$8)","v":25341.315763245242},{"$f":"MAX(COUNTRY_INFO!D17*AK17*PROFILE!$G$9,COUNTRY_INFO!D17*AL17*PROFILE!$G$9,COUNTRY_INFO!D17*AM17*PROFILE!$G$9,IF(AND(DISTRICT!Z17<>\"Inconnu\",Z17<>\"Non requis\"),COUNTRY_INFO!O17*DISTRICT!AN17,0))","v":47514.881286673997},{"$f":"MAX(COUNTRY_INFO!D17*AK17*PROFILE!$G$10,COUNTRY_INFO!D17*AL17*PROFILE!$G$10,IF(AND(DISTRICT!Z17<>\"Inconnu\",Z17<>\"Non requis\"),COUNTRY_INFO!O17*DISTRICT!AO17,0))","v":75327.187890222805},154209.34083202633,0,{"$f":"MAX('MDA2'!J17,'T1'!L17,'T2'!J17,T3_R1!K17,T3_R2!K17)","v":0},{"$f":"MAX('MDA1'!K17,'MDA2'!K17,'MDA3'!I17,'MDA3'!L17,'T1'!M17,'T2'!K17,T3_R1!L17,T3_R2!L17)","v":50083},{"$f":"MAX('MDA1'!L17,'MDA2'!L17,'MDA3'!J17,'MDA3'!M17,'T1'!N17,'T2'!L17,T3_R1!M17,T3_R2!M17)","v":71660},121743,{"$f":"MAX('MDA2'!J17,T17)","v":0},{"$f":"MAX('MDA1'!K17,'MDA2'!K17,'MDA3'!I17,'MDA3'!L17,V17,AD17)","v":49261},{"$f":"MAX('MDA1'!L17,'MDA2'!L17,'MDA3'!J17,'MDA3'!M17,AF17)","v":71660},120921,78.413537952745742]
[{"$f":"IF(COUNTRY_INFO!A18=0,\" \",COUNTRY_INFO!A18)","v":"Togo"},{"$f":"IF(COUNTRY_INFO!B18=0,\" \",COUNTRY_INFO!B18)","v":"KARA"},{"$f":"IF(COUNTRY_INFO!C18=0,\" \",COUNTRY_INFO!C18)","v":"DOULFELGOU"},{"$f":"COUNTRY_INFO!L18","v":"Non requis"},null,null,{"$f":"MAX('MDA1'!M18,'MDA2'!M18)","v":0},{"$f":"IF(AND(COUNTRY_INFO!H18>0,COUNTRY_INFO!H18<4),IF(D18>MAX('MDA1'!M18,'MDA2'!M18),MAX('MDA1'!M18,'MDA2'!M18),D18),0)","v":0},{"$f":"IF(AND(COUNTRY_INFO!H18>0,COUNTRY_INFO!H18<4), IF(G18/D18*100<>0, IF(G18/D18*100>100,100,G18/D18*100), \"-\"),0)","v":0},{"$f":"COUNTRY_INFO!M18","v":74072},null,null,{"$f":"MAX('MDA1'!M18,MAX('MDA3'!I18,'MDA3'!L18)+MAX('MDA3'!J18,'MDA3'!M18))","v":62878},{"$f":"IF(AND(COUNTRY_INFO!I18>0,COUNTRY_INFO!I18<4),IF(J18>MAX('MDA1'!M18,MAX('MDA3'!I18,'MDA3'!L18)+MAX('MDA3'!J18,'MDA3'!M18)),MAX('MDA1'!M18,MAX('MDA3'!I18,'MDA3'!L18)+MAX('MDA3'!J18,'MDA3'!M18)),J18),0)","v":62878},{"$f":"IF(AND(COUNTRY_INFO!I18>0,COUNTRY_INFO!I18<4), IF(M18/J18*100<>0, IF(M18/J18*100>100,100,M18/J18*100), \"-\"),0)","v":84.887676854951948},{"$f":"COUNTRY_INFO!N18","v":44650},null,null,{"$f":"SUM(MAX('MDA2'!J18, 'T1'!L18, MAX(T3_R1!K18, T3_R2!K18)), MAX('MDA1'!K18, 'MDA2'!K18, 'T1'!M18, MAX(T3_R1!L18, T3_R2!L18)), MAX('MDA1'!L18, 'MDA2'!L18, 'T1'!N18, MAX(T3_R1!M18, T3_R2!M18)))","v":27937},{"$f":"IF(AND(COUNTRY_INFO!J18>1,COUNTRY_INFO!J18<4),IF(COUNTRY_INFO!E18>MAX('MDA2'!J18,'T1'!L18,MAX(T3_R1!K18,T3_R2!K18)),MAX('MDA2'!J18,'T1'!L18,MAX(T3_R1!K18,T3_R2!K18)),COUNTRY_INFO!E18),0)","v":0},{"$f":"IF(AND(COUNTRY_INFO!J18>1,COUNTRY_INFO!J18<4), IF(T18/COUNTRY_INFO!E18*100<>0, IF(T18/COUNTRY_INFO!E18*100>100,100,T18/COUNTRY_INFO!E18*100), \"-\"),0)","v":"-"},{"$f":"IF(AND(COUNTRY_INFO!J18>1,COUNTRY_INFO!J18<4),IF(COUNTRY_INFO!F18>MAX('MDA1'!K18,'MDA2'!K18,'T1'!M18,MAX(T3_R1!L18,T3_R2!L18)),MAX('MDA1'!K18,'MDA2'!K18,'T1'!M18,MAX(T3_R1!L18,T3_R2!L18)),COUNTRY_INFO!F18),0)","v":27937},{"$f":"IF(AND(COUNTRY_INFO!J18>1,COUNTRY_INFO!J18<4), IF(V18/COUNTRY_INFO!F18*100<>0, IF(V18/COUNTRY_INFO!F18*100>100,100,V18/COUNTRY_INFO!F18*100), \"-\"),0)","v":95.9375},27937,{"$f":"IF(AND(COUNTRY_INFO!J18>1,COUNTRY_INFO!J18<4), IF(S18/P18*100<>0, IF(X18/P18*100>100,100,X18/P18*100), \"-\"),0)","v":62.568868980963046},{"$f":"COUNTRY_INFO!O18","v":24266.6},null,null,{"$f":"MAX('T1'!L18,'T2'!J18)+MAX('T1'!M18,'T2'!K18)+MAX('T1'!N18,'T2'!L18)","v":6305},{"$f":"IF(COUNTRY_INFO!K18=1,IF(COUNTRY_INFO!F18*0.33>MAX('T1'!M18,'T2'!K18),MAX('T1'!M18,'T2'!K18),COUNTRY_INFO!F18*0.33),IF(COUNTRY_INFO!K18=2,IF(COUNTRY_INFO!F18*0.5>MAX('T1'!M18,'T2'!K18),MAX('T1'!M18,'T2'!K18),COUNTRY_INFO!F18*0.5),IF(COUNTRY_INFO!K18=3,IF(COUNTRY_INFO!F18>MAX('T1'!M18,'T2'!K18),MAX('T1'!M18,'T2'!K18),COUNTRY_INFO!F18),0)))","v":6305},{"$f":"IF(AND(COUNTRY_INFO!K18>0,COUNTRY_INFO!K18<4),IF(Z18>0,IF(COUNTRY_INFO!K18=1, AD18/(COUNTRY_INFO!F18*0.33)*100, IF(COUNTRY_INFO!K18=2, AD18/(COUNTRY_INFO!F18*0.5)*100, IF(COUNTRY_INFO!K18=3, AD18/COUNTRY_INFO!F18*100))),\"-\"),0)","v":43.303571428571431},{"$f":"IF(COUNTRY_INFO!K18=2,IF(COUNTRY_INFO!G18*0.2>MAX('T1'!N18,'T2'!L18),MAX('T1'!N18,'T2'!L18),COUNTRY_INFO!G18*0.2),IF(COUNTRY_INFO!K18=3,IF(COUNTRY_INFO!G18>MAX('T1'!N18,'T2'!L18),MAX('T1'!N18,'T2'!L18),COUNTRY_INFO!G18),0))","v":0},{"$f":"IF(AND(COUNTRY_INFO!K18>0,COUNTRY_INFO!K18<4),IF(Z18>0,IF(COUNTRY_INFO!K18=1, 0, IF(COUNTRY_INFO!K18=2, AF18/(COUNTRY_INFO!G18*0.2)*100, IF(COUNTRY_INFO!K18=3, AF18/COUNTRY_INFO!G18*100))),\"-\"),0)","v":0},6305,{"$f":"IF(AND(COUNTRY_INFO!K18>0,COUNTRY_INFO!K18<4), IF(AC18/Z18*100<>0, IF(AH18/Z18*100>100,100,AH18/Z18*100), \"-\"),0)","v":25.982214236852304},null,{"$f":"IF(AND(D18<>0, D18<>\"Inconnu\",D18<>\"Interrompu\",D18<>\"Non requis\"),D18/COUNTRY_INFO!D18, 0)","v":0},{"$f":"IF(AND(J18<>0,J18<>\"Inconnu\",J18<>\"Interrompu\",J18<>\"Non requis\"),J18/COUNTRY_INFO!D18, 0)","v":0.76311749858342348},{"$f":"IF(AND(P18<>0,P18<>\"Inconnu\",P18<>\"Non requis\"),P18/(COUNTRY_INFO!E18+COUNTRY_INFO!F18), 0)","v":1},{"$f":"IF(AND(Z18<>0,Z18<>\"Inconnu\",Z18<>\"Non requis\"),IF(COUNTRY_INFO!K18=1,1,IF(COUNTRY_INFO!K18=2,0.5*COUNTRY_INFO!F18/(0.5*COUNTRY_INFO!F18+0.2*COUNTRY_INFO!G18),IF(COUNTRY_INFO!K18=3,COUNTRY_INFO!F18/(COUNTRY_INFO!F18+COUNTRY_INFO!G18)))),0)","v":0.60000164835617686},{"$f":"IF(AND(Z18<>0,Z18<>\"Inconnu\",Z18<>\"Non requis\"),IF(COUNTRY_INFO!K18=1,0,IF(COUNTRY_INFO!K18=2,0.2*COUNTRY_INFO!G18/(0.5*COUNTRY_INFO!F18+0.2*COUNTRY_INFO!G18),IF(COUNTRY_INFO!K18=3,COUNTRY_INFO!G18/(COUNTRY_INFO!F18+COUNTRY_INFO!G18)))),0)","v":0.39999835164382325},{"$f":"MAX(COUNTRY_INFO!D18*AK18*PROFILE!$G$7,COUNTRY_INFO!D18*AL18*PROFILE!$G$7)","v":2962.7796462334404},{"$f":"MAX(COUNTRY_INFO!D18*AK18*PROFILE!$G$8,COUNTRY_INFO!D18*AL18*PROFILE!$G$8,COUNTRY_INFO!D18*AM18*PROFILE!$G$8)","v":15530.42191749998},{"$f":"MAX(COUNTRY_INFO!D18*AK18*PROFILE!$G$9,COUNTRY_INFO!D18*AL18*PROFILE!$G$9,COUNTRY_INFO!D18*AM18*PROFILE!$G$9,IF(AND(DISTRICT!Z18<>\"Inconnu\",Z18<>\"Non requis\"),COUNTRY_INFO!O18*DISTRICT!AN18,0))","v":29119.488531540705},{"$f":"MAX(COUNTRY_INFO!D18*AK18*PROFILE!$G$10,COUNTRY_INFO!D18*AL18*PROFILE!$G$10,IF(AND(DISTRICT!Z18<>\"Inconnu\",Z18<>\"Non requis\"),COUNTRY_INFO!O18*DISTRICT!AO18,0))","v":37036.092379920767},84648.782475194894,"Y",{"$f":"MAX('MDA2'!J18,'T1'!L18,'T2'!J18,T3_R1!K18,T3_R2!K18)","v":0},{"$f":"MAX('MDA1'!K18,'MDA2'!K18,'MDA3'!I18,'MDA3'!L18,'T1'!M18,'T2'!K18,T3_R1!L18,T3_R2!L18)","v":27937},{"$f":"MAX('MDA1'!L18,'MDA2'!L18,'MDA3'!J18,'MDA3'!M18,'T1'!N18,'T2'!L18,T3_R1!M18,T3_R2!M18)","v":39949},67886,{"$f":"MAX('MDA2'!J18,T18)","v":0},{"$f":"MAX('MDA1'!K18,'MDA2'!K18,'MDA3'!I18,'MDA3'!L18,V18,AD18)","v":27937},{"$f":"MAX('MDA1'!L18,'MDA2'!L18,'MDA3'!J18,'MDA3'!M18,AF18)","v":39949},67886,80.197255075574205]
[{"$f":"IF(COUNTRY_INFO!A19=0,\" \",COUNTRY_INFO!A19)","v":"Togo"},{"$f":"IF(COUNTRY_INFO!B19=0,\" \",COUNTRY_INFO!B19)","v":"KARA"},{"$f":"IF(COUNTRY_INFO!C19=0,\" \",COUNTRY_INFO!C19)","v":"KERAN"},{"$f":"COUNTRY_INFO!L19","v":"Non requis"},null,null,{"$f":"MAX('MDA1'!M19,'MDA2'!M19)","v":0},{"$f":"IF(AND(COUNTRY_INFO!H19>0,COUNTRY_INFO!H19<4),IF(D19>MAX('MDA1'!M19,'MDA2'!M19),MAX('MDA1'!M19,'MDA2'!M19),D19),0)","v":0},{"$f":"IF(AND(COUNTRY_INFO!H19>0,COUNTRY_INFO!H19<4), IF(G19/D19*100<>0, IF(G19/D19*100>100,100,G19/D19*100), \"-\"),0)","v":0},{"$f":"COUNTRY_INFO!M19","v":122658},null,null,{"$f":"MAX('MDA1'!M19,MAX('MDA3'!I19,'MDA3'!L19)+MAX('MDA3'!J19,'MDA3'!M19))","v":102698},{"$f":"IF(AND(COUNTRY_INFO!I19>0,COUNTRY_INFO!I19<4),IF(J19>MAX('MDA1'!M19,MAX('MDA3'!I19,'MDA3'!L19)+MAX('MDA3'!J19,'MDA3'!M19)),MAX('MDA1'!M19,MAX('MDA3'!I19,'MDA3'!L19)+MAX('MDA3'!J19,'MDA3'!M19)),J19),0)","v":102698},{"$f":"IF(AND(COUNTRY_INFO!I19>0,COUNTRY_INFO!I19<4), IF(M19/J19*100<>0, IF(M19/J19*100>100,100,M19/J19*100), \"-\"),0)","v":83.72711115459245},{"$f":"COUNTRY_INFO!N19","v":52782},null,null,{"$f":"SUM(MAX('MDA2'!J19, 'T1'!L19, MAX(T3_R1!K19, T3_R2!K19)), MAX('MDA1'!K19, 'MDA2'!K19, 'T1'!M19, MAX(T3_R1!L19, T3_R2!L19)), MAX('MDA1'!L19, 'MDA2'!L19, 'T1'!N19, MAX(T3_R1!M19, T3_R2!M19)))","v":42513},{"$f":"IF(AND(COUNTRY_INFO!J19>1,COUNTRY_INFO!J19<4),IF(COUNTRY_INFO!E19>MAX('MDA2'!J19,'T1'!L19,MAX(T3_R1!K19,T3_R2!K19)),MAX('MDA2'!J19,'T1'!L19,MAX(T3_R1!K19,T3_R2!K19)),COUNTRY_INFO!E19),0)","v":0},{"$f":"IF(AND(COUNTRY_INFO!J19>1,COUNTRY_INFO!J19<4), IF(T19/COUNTRY_INFO!E19*100<>0, IF(T19/COUNTRY_INFO!E19*100>100,100,T19/COUNTRY_INFO!E19*100), \"-\"),0)","v":"-"},{"$f":"IF(AND(COUNTRY_INFO!J19>1,COUNTRY_INFO!J19<4),IF(COUNTRY_INFO!F19>MAX('MDA1'!K19,'MDA2'!K19,'T1'!M19,MAX(T3_R1!L19,T3_R2!L19)),MAX('MDA1'!K19,'MDA2'!K19,'T1'!M19,MAX(T3_R1!L19,T3_R2!L19)),COUNTRY_INFO!F19),0)","v":34423},{"$f":"IF(AND(COUNTRY_INFO!J19>1,COUNTRY_INFO!J19<4), IF(V19/COUNTRY_INFO!F19*100<>0, IF(V19/COUNTRY_INFO!F19*100>100,100,V19/COUNTRY_INFO!F19*100), \"-\"),0)","v":100},34423,{"$f":"IF(AND(COUNTRY_INFO!J19>1,COUNTRY_INFO!J19<4), IF(S19/P19*100<>0, IF(X19/P19*100>100,100,X19/P19*100), \"-\"),0)","v":65.217308931074996},{"$f":"COUNTRY_INFO!O19","v":28685.7},null,null,{"$f":"MAX('T1'!L19,'T2'!J19)+MAX('T1'!M19,'T2'!K19)+MAX('T1'!N19,'T2'!L19)","v":0},{"$f":"IF(COUNTRY_INFO!K19=1,IF(COUNTRY_INFO!F19*0.33>MAX('T1'!M19,'T2'!K19),MAX('T1'!M19,'T2'!K19),COUNTRY_INFO!F19*0.33),IF(COUNTRY_INFO!K19=2,IF(COUNTRY_INFO!F19*0.5>MAX('T1'!M19,'T2'!K19),MAX('T1'!M19,'T2'!K19),COUNTRY_INFO!F19*0.5),IF(COUNTRY_INFO!K19=3,IF(COUNTRY_INFO!F19>MAX('T1'!M19,'T2'!K19),MAX('T1'!M19,'T2'!K19),COUNTRY_INFO!F19),0)))","v":0},{"$f":"IF(AND(COUNTRY_INFO!K19>0,COUNTRY_INFO!K19<4),IF(Z19>0,IF(COUNTRY_INFO!K19=1, AD19/(COUNTRY_INFO!F19*0.33)*100, IF(COUNTRY_INFO!K19=2, AD19/(COUNTRY_INFO!F19*0.5)*100, IF(COUNTRY_INFO!K19=3, AD19/COUNTRY_INFO!F19*100))),\"-\"),0)","v":0},{"$f":"IF(COUNTRY_INFO!K19=2,IF(COUNTRY_INFO!G19*0.2>MAX('T1'!N19,'T2'!L19),MAX('T1'!N19,'T2'!L19),COUNTRY_INFO!G19*0.2),IF(COUNTRY_INFO!K19=3,IF(COUNTRY_INFO!G19>MAX('T1'!N19,'T2'!L19),MAX('T1'!N19,'T2'!L19),COUNTRY_INFO!G19),0))","v":0},{"$f":"IF(AND(COUNTRY_INFO!K19>0,COUNTRY_INFO!K19<4),IF(Z19>0,IF(COUNTRY_INFO!K19=1, 0, IF(COUNTRY_INFO!K19=2, AF19/(COUNTRY_INFO!G19*0.2)*100, IF(COUNTRY_INFO!K19=3, AF19/COUNTRY_INFO!G19*100))),\"-\"),0)","v":0},0,{"$f":"IF(AND(COUNTRY_INFO!K19>0,COUNTRY_INFO!K19<4), IF(AC19/Z19*100<>0, IF(AH19/Z19*100>100,100,AH19/Z19*100), \"-\"),0)","v":"-"},null,{"$f":"IF(AND(D19<>0, D19<>\"Inconnu\",D19<>\"Interrompu\",D19<>\"Non requis\"),D19/COUNTRY_INFO!D19, 0)","v":0},{"$f":"IF(AND(J19<>0,J19<>\"Inconnu\",J19<>\"Interrompu\",J19<>\"Non requis\"),J19/COUNTRY_INFO!D19, 0)","v":1.0689895591849541},{"$f":"IF(AND(P19<>0,P19<>\"Inconnu\",P19<>\"Non requis\"),P19/(COUNTRY_INFO!E19+COUNTRY_INFO!F19), 0)","v":1},{"$f":"IF(AND(Z19<>0,Z19<>\"Inconnu\",Z19<>\"Non requis\"),IF(COUNTRY_INFO!K19=1,1,IF(COUNTRY_INFO!K19=2,0.5*COUNTRY_INFO!F19/(0.5*COUNTRY_INFO!F19+0.2*COUNTRY_INFO!G19),IF(COUNTRY_INFO!K19=3,COUNTRY_INFO!F19/(COUNTRY_INFO!F19+COUNTRY_INFO!G19)))),0)","v":0.60000278884601033},{"$f":"IF(AND(Z19<>0,Z19<>\"Inconnu\",Z19<>\"Non requis\"),IF(COUNTRY_INFO!K19=1,0,IF(COUNTRY_INFO!K19=2,0.2*COUNTRY_INFO!G19/(0.5*COUNTRY_INFO!F19+0.2*COUNTRY_INFO!G19),IF(COUNTRY_INFO!K19=3,COUNTRY_INFO!G19/(COUNTRY_INFO!F19+COUNTRY_INFO!G19)))),0)","v":0.39999721115398962},{"$f":"MAX(COUNTRY_INFO!D19*AK19*PROFILE!$G$7,COUNTRY_INFO!D19*AL19*PROFILE!$G$7)","v":4906.1538212509631},{"$f":"MAX(COUNTRY_INFO!D19*AK19*PROFILE!$G$8,COUNTRY_INFO!D19*AL19*PROFILE!$G$8,COUNTRY_INFO!D19*AM19*PROFILE!$G$8)","v":19625.307696458174},{"$f":"MAX(COUNTRY_INFO!D19*AK19*PROFILE!$G$9,COUNTRY_INFO!D19*AL19*PROFILE!$G$9,COUNTRY_INFO!D19*AM19*PROFILE!$G$9,IF(AND(DISTRICT!Z19<>\"Inconnu\",Z19<>\"Non requis\"),COUNTRY_INFO!O19*DISTRICT!AN19,0))","v":36797.385507667233},{"$f":"MAX(COUNTRY_INFO!D19*AK19*PROFILE!$G$10,COUNTRY_INFO!D19*AL19*PROFILE!$G$10,IF(AND(DISTRICT!Z19<>\"Inconnu\",Z19<>\"Non requis\"),COUNTRY_INFO!O19*DISTRICT!AO19,0))","v":61329.152974623634},122658,0,{"$f":"MAX('MDA2'!J19,'T1'!L19,'T2'!J19,T3_R1!K19,T3_R2!K19)","v":0},{"$f":"MAX('MDA1'!K19,'MDA2'!K19,'MDA3'!I19,'MDA3'!L19,'T1'!M19,'T2'!K19,T3_R1!L19,T3_R2!L19)","v":42513},{"$f":"MAX('MDA1'!L19,'MDA2'!L19,'MDA3'!J19,'MDA3'!M19,'T1'!N19,'T2'!L19,T3_R1!M19,T3_R2!M19)","v":62601},105114,{"$f":"MAX('MDA2'!J19,T19)","v":0},{"$f":"MAX('MDA1'!K19,'MDA2'!K19,'MDA3'!I19,'MDA3'!L19,V19,AD19)","v":40097},{"$f":"MAX('MDA1'!L19,'MDA2'!L19,'MDA3'!J19,'MDA3'!M19,AF19)","v":62601},102698,83.72711115459245]
[{"$f":"IF(COUNTRY_INFO!A20=0,\" \",COUNTRY_INFO!A20)","v":"Togo"},{"$f":"IF(COUNTRY_INFO!B20=0,\" \",COUNTRY_INFO!B20)","v":"KARA"},{"$f":"IF(COUNTRY_INFO!C20=0,\" \",COUNTRY_INFO!C20)","v":"KOZAH"},{"$f":"COUNTRY_INFO!L20","v":"Non requis"},null,null,{"$f":"MAX('MDA1'!M20,'MDA2'!M20)","v":0},{"$f":"IF(AND(COUNTRY_INFO!H20>0,COUNTRY_INFO!H20<4),IF(D20>MAX('MDA1'!M20,'MDA2'!M20),MAX('MDA1'!M20,'MDA2'!M20),D20),0)","v":0},{"$f":"IF(AND(COUNTRY_INFO!H20>0,COUNTRY_INFO!H20<4), IF(G20/D20*100<>0, IF(G20/D20*100>100,100,G20/D20*100), \"-\"),0)","v":0},{"$f":"COUNTRY_INFO!M20","v":158935},null,null,{"$f":"MAX('MDA1'!M20,MAX('MDA3'!I20,'MDA3'!L20)+MAX('MDA3'!J20,'MDA3'!M20))","v":135945},{"$f":"IF(AND(COUNTRY_INFO!I20>0,COUNTRY_INFO!I20<4),IF(J20>MAX('MDA1'!M20,MAX('MDA3'!I20,'MDA3'!L20)+MAX('MDA3'!J20,'MDA3'!M20)),MAX('MDA1'!M20,MAX('MDA3'!I20,'MDA3'!L20)+MAX('MDA3'!J20,'MDA3'!M20)),J20),0)","v":135945},{"$f":"IF(AND(COUNTRY_INFO!I20>0,COUNTRY_INFO!I20<4), IF(M20/J20*100<>0, IF(M20/J20*100>100,100,M20/J20*100), \"-\"),0)","v":85.534967124925288},{"$f":"COUNTRY_INFO!N20","v":128953},null,null,{"$f":"SUM(MAX('MDA2'!J20, 'T1'!L20, MAX(T3_R1!K20, T3_R2!K20)), MAX('MDA1'!K20, 'MDA2'!K20, 'T1'!M20, MAX(T3_R1!L20, T3_R2!L20)), MAX('MDA1'!L20, 'MDA2'!L20, 'T1'!N20, MAX(T3_R1!M20, T3_R2!M20)))","v":80876},{"$f":"IF(AND(COUNTRY_INFO!J20>1,COUNTRY_INFO!J20<4),IF(COUNTRY_INFO!E20>MAX('MDA2'!J20,'T1'!L20,MAX(T3_R1!K20,T3_R2!K20)),MAX('MDA2'!J20,'T1'!L20,MAX(T3_R1!K20,T3_R2!K20)),COUNTRY_INFO!E20),0)","v":0},{"$f":"IF(AND(COUNTRY_INFO!J20>1,COUNTRY_INFO!J20<4), IF(T20/COUNTRY_INFO!E20*100<>0, IF(T20/COUNTRY_INFO!E20*100>100,100,T20/COUNTRY_INFO!E20*100), \"-\"),0)","v":"-"},{"$f":"IF(AND(COUNTRY_INFO!J20>1,COUNTRY_INFO!J20<4),IF(COUNTRY_INFO!F20>MAX('MDA1'!K20,'MDA2'!K20,'T1'!M20,MAX(T3_R1!L20,T3_R2!L20)),MAX('MDA1'!K20,'MDA2'!K20,'T1'!M20,MAX(T3_R1!L20,T3_R2!L20)),COUNTRY_INFO!F20),0)","v":80876},{"$f":"IF(AND(COUNTRY_INFO!J20>1,COUNTRY_INFO!J20<4), IF(V20/COUNTRY_INFO!F20*100<>0, IF(V20/COUNTRY_INFO!F20*100>100,100,V20/COUNTRY_INFO!F20*100), \"-\"),0)","v":96.166468489892992},80876,{"$f":"IF(AND(COUNTRY_INFO!J20>1,COUNTRY_INFO!J20<4), IF(S20/P20*100<>0, IF(X20/P20*100>100,100,X20/P20*100), \"-\"),0)","v":62.71742417780122},{"$f":"COUNTRY_INFO!O20","v":70083.199999999997},null,null,{"$f":"MAX('T1'!L20,'T2'!J20)+MAX('T1'!M20,'T2'!K20)+MAX('T1'!N20,'T2'!L20)","v":8656},{"$f":"IF(COUNTRY_INFO!K20=1,IF(COUNTRY_INFO!F20*0.33>MAX('T1'!M20,'T2'!K20),MAX('T1'!M20,'T2'!K20),COUNTRY_INFO!F20*0.33),IF(COUNTRY_INFO!K20=2,IF(COUNTRY_INFO!F20*0.5>MAX('T1'!M20,'T2'!K20),MAX('T1'!M20,'T2'!K20),COUNTRY_INFO!F20*0.5),IF(COUNTRY_INFO!K20=3,IF(COUNTRY_INFO!F20>MAX('T1'!M20,'T2'!K20),MAX('T1'!M20,'T2'!K20),COUNTRY_INFO!F20),0)))","v":8656},{"$f":"IF(AND(COUNTRY_INFO!K20>0,COUNTRY_INFO!K20<4),IF(Z20>0,IF(COUNTRY_INFO!K20=1, AD20/(COUNTRY_INFO!F20*0.33)*100, IF(COUNTRY_INFO!K20=2, AD20/(COUNTRY_INFO!F20*0.5)*100, IF(COUNTRY_INFO!K20=3, AD20/COUNTRY_INFO!F20*100))),\"-\"),0)","v":20.585017835909632},{"$f":"IF(COUNTRY_INFO!K20=2,IF(COUNTRY_INFO!G20*0.2>MAX('T1'!N20,'T2'!L20),MAX('T1'!N20,'T2'!L20),COUNTRY_INFO!G20*0.2),IF(COUNTRY_INFO!K20=3,IF(COUNTRY_INFO!G20>MAX('T1'!N20,'T2'!L20),MAX('T1'!N20,'T2'!L20),COUNTRY_INFO!G20),0))","v":0},{"$f":"IF(AND(COUNTRY_INFO!K20>0,COUNTRY_INFO!K20<4),IF(Z20>0,IF(COUNTRY_INFO!K20=1, 0, IF(COUNTRY_INFO!K20=2, AF20/(COUNTRY_INFO!G20*0.2)*100, IF(COUNTRY_INFO!K20=3, AF20/COUNTRY_INFO!G20*100))),\"-\"),0)","v":0},8656,{"$f":"IF(AND(COUNTRY_INFO!K20>0,COUNTRY_INFO!K20<4), IF(AC20/Z20*100<>0, IF(AH20/Z20*100>100,100,AH20/Z20*100), \"-\"),0)","v":12.351034199351627},null,{"$f":"IF(AND(D20<>0, D20<>\"Inconnu\",D20<>\"Interrompu\",D20<>\"Non requis\"),D20/COUNTRY_INFO!D20, 0)","v":0},{"$f":"IF(AND(J20<>0,J20<>\"Inconnu\",J20<>\"Interrompu\",J20<>\"Non requis\"),J20/COUNTRY_INFO!D20, 0)","v":0.56695275601786455},{"$f":"IF(AND(P20<>0,P20<>\"Inconnu\",P20<>\"Non requis\"),P20/(COUNTRY_INFO!E20+COUNTRY_INFO!F20), 0)","v":1},{"$f":"IF(AND(Z20<>0,Z20<>\"Inconnu\",Z20<>\"Non requis\"),IF(COUNTRY_INFO!K20=1,1,IF(COUNTRY_INFO!K20=2,0.5*COUNTRY_INFO!F20/(0.5*COUNTRY_INFO!F20+0.2*COUNTRY_INFO!G20),IF(COUNTRY_INFO!K20=3,COUNTRY_INFO!F20/(COUNTRY_INFO!F20+COUNTRY_INFO!G20)))),0)","v":0.60000114150038808},{"$f":"IF(AND(Z20<>0,Z20<>\"Inconnu\",Z20<>\"Non requis\"),IF(COUNTRY_INFO!K20=1,0,IF(COUNTRY_INFO!K20=2,0.2*COUNTRY_INFO!G20/(0.5*COUNTRY_INFO!F20+0.2*COUNTRY_INFO!G20),IF(COUNTRY_INFO!K20=3,COUNTRY_INFO!G20/(COUNTRY_INFO!F20+COUNTRY_INFO!G20)))),0)","v":0.39999885849961192},{"$f":"MAX(COUNTRY_INFO!D20*AK20*PROFILE!$G$7,COUNTRY_INFO!D20*AL20*PROFILE!$G$7)","v":6357.1846726713447},{"$f":"MAX(COUNTRY_INFO!D20*AK20*PROFILE!$G$8,COUNTRY_INFO!D20*AL20*PROFILE!$G$8,COUNTRY_INFO!D20*AM20*PROFILE!$G$8)","v":44853.183299609584},{"$f":"MAX(COUNTRY_INFO!D20*AK20*PROFILE!$G$9,COUNTRY_INFO!D20*AL20*PROFILE!$G$9,COUNTRY_INFO!D20*AM20*PROFILE!$G$9,IF(AND(DISTRICT!Z20<>\"Inconnu\",Z20<>\"Non requis\"),COUNTRY_INFO!O20*DISTRICT!AN20,0))","v":84099.566878111262},{"$f":"MAX(COUNTRY_INFO!D20*AK20*PROFILE!$G$10,COUNTRY_INFO!D20*AL20*PROFILE!$G$10,IF(AND(DISTRICT!Z20<>\"Inconnu\",Z20<>\"Non requis\"),COUNTRY_INFO!O20*DISTRICT!AO20,0))","v":79467.698217986661},214777.63306837884,"Y",{"$f":"MAX('MDA2'!J20,'T1'!L20,'T2'!J20,T3_R1!K20,T3_R2!K20)","v":0},{"$f":"MAX('MDA1'!K20,'MDA2'!K20,'MDA3'!I20,'MDA3'!L20,'T1'!M20,'T2'!K20,T3_R1!L20,T3_R2!L20)","v":80876},{"$f":"MAX('MDA1'!L20,'MDA2'!L20,'MDA3'!J20,'MDA3'!M20,'T1'!N20,'T2'!L20,T3_R1!M20,T3_R2!M20)","v":88462},169338,{"$f":"MAX('MDA2'!J20,T20)","v":0},{"$f":"MAX('MDA1'!K20,'MDA2'!K20,'MDA3'!I20,'MDA3'!L20,V20,AD20)","v":80876},{"$f":"MAX('MDA1'!L20,'MDA2'!L20,'MDA3'!J20,'MDA3'!M20,AF20)","v":88462},169338,78.84340542391945]
[{"$f":"IF(COUNTRY_INFO!A21=0,\" \",COUNTRY_INFO!A21)","v":"Togo"},{"$f":"IF(COUNTRY_INFO!B21=0,\" \",COUNTRY_INFO!B21)","v":"LOME-COMMUNE"},{"$f":"IF(COUNTRY_INFO!C21=0,\" \",COUNTRY_INFO!C21)","v":"DISTRICT N°1"},{"$f":"COUNTRY_INFO!L21","v":"Non requis"},null,null,{"$f":"MAX('MDA1'!M21,'MDA2'!M21)","v":0},{"$f":"IF(AND(COUNTRY_INFO!H21>0,COUNTRY_INFO!H21<4),IF(D21>MAX('MDA1'!M21,'MDA2'!M21),MAX('MDA1'!M21,'MDA2'!M21),D21),0)","v":0},{"$f":"IF(AND(COUNTRY_INFO!H21>0,COUNTRY_INFO!H21<4), IF(G21/D21*100<>0, IF(G21/D21*100>100,100,G21/D21*100), \"-\"),0)","v":0},{"$f":"COUNTRY_INFO!M21","v":0},null,null,{"$f":"MAX('MDA1'!M21,MAX('MDA3'!I21,'MDA3'!L21)+MAX('MDA3'!J21,'MDA3'!M21))","v":0},{"$f":"IF(AND(COUNTRY_INFO!I21>0,COUNTRY_INFO!I21<4),IF(J21>MAX('MDA1'!M21,MAX('MDA3'!I21,'MDA3'!L21)+MAX('MDA3'!J21,'MDA3'!M21)),MAX('MDA1'!M21,MAX('MDA3'!I21,'MDA3'!L21)+MAX('MDA3'!J21,'MDA3'!M21)),J21),0)","v":0},{"$f":"IF(AND(COUNTRY_INFO!I21>0,COUNTRY_INFO!I21<4), IF(M21/J21*100<>0, IF(M21/J21*100>100,100,M21/J21*100), \"-\"),0)","v":0},{"$f":"COUNTRY_INFO!N21","v":0},null,null,{"$f":"SUM(MAX('MDA2'!J21, 'T1'!L21, MAX(T3_R1!K21, T3_R2!K21)), MAX('MDA1'!K21, 'MDA2'!K21, 'T1'!M21, MAX(T3_R1!L21, T3_R2!L21)), MAX('MDA1'!L21, 'MDA2'!L21, 'T1'!N21, MAX(T3_R1!M21, T3_R2!M21)))","v":0},{"$f":"IF(AND(COUNTRY_INFO!J21>1,COUNTRY_INFO!J21<4),IF(COUNTRY_INFO!E21>MAX('MDA2'!J21,'T1'!L21,MAX(T3_R1!K21,T3_R2!K21)),MAX('MDA2'!J21,'T1'!L21,MAX(T3_R1!K21,T3_R2!K21)),COUNTRY_INFO!E21),0)","v":0},{"$f":"IF(AND(COUNTRY_INFO!J21>1,COUNTRY_INFO!J21<4), IF(T21/COUNTRY_INFO!E21*100<>0, IF(T21/COUNTRY_INFO!E21*100>100,100,T21/COUNTRY_INFO!E21*100), \"-\"),0)","v":0},{"$f":"IF(AND(COUNTRY_INFO!J21>1,COUNTRY_INFO!J21<4),IF(COUNTRY_INFO!F21>MAX('MDA1'!K21,'MDA2'!K21,'T1'!M21,MAX(T3_R1!L21,T3_R2!L21)),MAX('MDA1'!K21,'MDA2'!K21,'T1'!M21,MAX(T3_R1!L21,T3_R2!L21)),COUNTRY_INFO!F21),0)","v":0},{"$f":"IF(AND(COUNTRY_INFO!J21>1,COUNTRY_INFO!J21<4), IF(V21/COUNTRY_INFO!F21*100<>0, IF(V21/COUNTRY_INFO!F21*100>100,100,V21/COUNTRY_INFO!F21*100), \"-\"),0)","v":0},0,{"$f":"IF(AND(COUNTRY_INFO!J21>1,COUNTRY_INFO!J21<4), IF(S21/P21*100<>0, IF(X21/P21*100>100,100,X21/P21*100), \"-\"),0)","v":0},{"$f":"COUNTRY_INFO!O21","v":0},null,null,{"$f":"MAX('T1'!L21,'T2'!J21)+MAX('T1'!M21,'T2'!K21)+MAX('T1'!N21,'T2'!L21)","v":0},{"$f":"IF(COUNTRY_INFO!K21=1,IF(COUNTRY_INFO!F21*0.33>MAX('T1'!M21,'T2'!K21),MAX('T1'!M21,'T2'!K21),COUNTRY_INFO!F21*0.33),IF(COUNTRY_INFO!K21=2,IF(COUNTRY_INFO!F21*0.5>MAX('T1'!M21,'T2'!K21),MAX('T1'!M21,'T2'!K21),COUNTRY_INFO!F21*0.5),IF(COUNTRY_INFO!K21=3,IF(COUNTRY_INFO!F21>MAX('T1'!M21,'T2'!K21),MAX('T1'!M21,'T2'!K21),COUNTRY_INFO!F21),0)))","v":0},{"$f":"IF(AND(COUNTRY_INFO!K21>0,COUNTRY_INFO!K21<4),IF(Z21>0,IF(COUNTRY_INFO!K21=1, AD21/(COUNTRY_INFO!F21*0.33)*100, IF(COUNTRY_INFO!K21=2, AD21/(COUNTRY_INFO!F21*0.5)*100, IF(COUNTRY_INFO!K21=3, AD21/COUNTRY_INFO!F21*100))),\"-\"),0)","v":0},{"$f":"IF(COUNTRY_INFO!K21=2,IF(COUNTRY_INFO!G21*0.2>MAX('T1'!N21,'T2'!L21),MAX('T1'!N21,'T2'!L21),COUNTRY_INFO!G21*0.2),IF(COUNTRY_INFO!K21=3,IF(COUNTRY_INFO!G21>MAX('T1'!N21,'T2'!L21),MAX('T1'!N21,'T2'!L21),COUNTRY_INFO!G21),0))","v":0},{"$f":"IF(AND(COUNTRY_INFO!K21>0,COUNTRY_INFO!K21<4),IF(Z21>0,IF(COUNTRY_INFO!K21=1, 0, IF(COUNTRY_INFO!K21=2, AF21/(COUNTRY_INFO!G21*0.2)*100, IF(COUNTRY_INFO!K21=3, AF21/COUNTRY_INFO!G21*100))),\"-\"),0)","v":0},0,{"$f":"IF(AND(COUNTRY_INFO!K21>0,COUNTRY_INFO!K21<4), IF(AC21/Z21*100<>0, IF(AH21/Z21*100>100,100,AH21/Z21*100), \"-\"),0)","v":0},null,{"$f":"IF(AND(D21<>0, D21<>\"Inconnu\",D21<>\"Interrompu\",D21<>\"Non requis\"),D21/COUNTRY_INFO!D21, 0)","v":0},{"$f":"IF(AND(J21<>0,J21<>\"Inconnu\",J21<>\"Interrompu\",J21<>\"Non requis\"),J21/COUNTRY_INFO!D21, 0)","v":0},{"$f":"IF(AND(P21<>0,P21<>\"Inconnu\",P21<>\"Non requis\"),P21/(COUNTRY_INFO!E21+COUNTRY_INFO!F21), 0)","v":0},{"$f":"IF(AND(Z21<>0,Z21<>\"Inconnu\",Z21<>\"Non requis\"),IF(COUNTRY_INFO!K21=1,1,IF(COUNTRY_INFO!K21=2,0.5*COUNTRY_INFO!F21/(0.5*COUNTRY_INFO!F21+0.2*COUNTRY_INFO!G21),IF(COUNTRY_INFO!K21=3,COUNTRY_INFO!F21/(COUNTRY_INFO!F21+COUNTRY_INFO!G21)))),0)","v":0},{"$f":"IF(AND(Z21<>0,Z21<>\"Inconnu\",Z21<>\"Non requis\"),IF(COUNTRY_INFO!K21=1,0,IF(COUNTRY_INFO!K21=2,0.2*COUNTRY_INFO!G21/(0.5*COUNTRY_INFO!F21+0.2*COUNTRY_INFO!G21),IF(COUNTRY_INFO!K21=3,COUNTRY_INFO!G21/(COUNTRY_INFO!F21+COUNTRY_INFO!G21)))),0)","v":0},{"$f":"MAX(COUNTRY_INFO!D21*AK21*PROFILE!$G$7,COUNTRY_INFO!D21*AL21*PROFILE!$G$7)","v":0},{"$f":"MAX(COUNTRY_INFO!D21*AK21*PROFILE!$G$8,COUNTRY_INFO!D21*AL21*PROFILE!$G$8,COUNTRY_INFO!D21*AM21*PROFILE!$G$8)","v":0},{"$f":"MAX(COUNTRY_INFO!D21*AK21*PROFILE!$G$9,COUNTRY_INFO!D21*AL21*PROFILE!$G$9,COUNTRY_INFO!D21*AM21*PROFILE!$G$9,IF(AND(DISTRICT!Z21<>\"Inconnu\",Z21<>\"Non requis\"),COUNTRY_INFO!O21*DISTRICT!AN21,0))","v":0},{"$f":"MAX(COUNTRY_INFO!D21*AK21*PROFILE!$G$10,COUNTRY_INFO!D21*AL21*PROFILE!$G$10,IF(AND(DISTRICT!Z21<>\"Inconnu\",Z21<>\"Non requis\"),COUNTRY_INFO!O21*DISTRICT!AO21,0))","v":0},0,0,{"$f":"MAX('MDA2'!J21,'T1'!L21,'T2'!J21,T3_R1!K21,T3_R2!K21)","v":0},{"$f":"MAX('MDA1'!K21,'MDA2'!K21,'MDA3'!I21,'MDA3'!L21,'T1'!M21,'T2'!K21,T3_R1!L21,T3_R2!L21)","v":0},{"$f":"MAX('MDA1'!L21,'MDA2'!L21,'MDA3'!J21,'MDA3'!M21,'T1'!N21,'T2'!L21,T3_R1!M21,T3_R2!M21)","v":0},0,{"$f":"MAX('MDA2'!J21,T21)","v":0},{"$f":"MAX('MDA1'!K21,'MDA2'!K21,'MDA3'!I21,'MDA3'!L21,V21,AD21)","v":0},{"$f":"MAX('MDA1'!L21,'MDA2'!L21,'MDA3'!J21,'MDA3'!M21,AF21)","v":0},0,0]
[{"$f":"IF(COUNTRY_INFO!A22=0,\" \",COUNTRY_INFO!A22)","v":"Togo"},{"$f":"IF(COUNTRY_INFO!B22=0,\" \",COUNTRY_INFO!B22)","v":"LOME-COMMUNE"},{"$f":"IF(COUNTRY_INFO!C22=0,\" \",COUNTRY_INFO!C22)","v":"DISTRICT N°2"},{"$f":"COUNTRY_INFO!L22","v":"Non requis"},null,null,{"$f":"MAX('MDA1'!M22,'MDA2'!M22)","v":0},{"$f":"IF(AND(COUNTRY_INFO!H22>0,COUNTRY_INFO!H22<4),IF(D22>MAX('MDA1'!M22,'MDA2'!M22),MAX('MDA1'!M22,'MDA2'!M22),D22),0)","v":0},{"$f":"IF(AND(COUNTRY_INFO!H22>0,COUNTRY_INFO!H22<4), IF(G22/D22*100<>0, IF(G22/D22*100>100,100,G22/D22*100), \"-\"),0)","v":0},{"$f":"COUNTRY_INFO!M22","v":0},null,null,{"$f":"MAX('MDA1'!M22,MAX('MDA3'!I22,'MDA3'!L22)+MAX('MDA3'!J22,'MDA3'!M22))","v":0},{"$f":"IF(AND(COUNTRY_INFO!I22>0,COUNTRY_INFO!I22<4),IF(J22>MAX('MDA1'!M22,MAX('MDA3'!I22,'MDA3'!L22)+MAX('MDA3'!J22,'MDA3'!M22)),MAX('MDA1'!M22,MAX('MDA3'!I22,'MDA3'!L22)+MAX('MDA3'!J22,'MDA3'!M22)),J22),0)","v":0},{"$f":"IF(AND(COUNTRY_INFO!I22>0,COUNTRY_INFO!I22<4), IF(M22/J22*100<>0, IF(M22/J22*100>100,100,M22/J22*100), \"-\"),0)","v":0},{"$f":"COUNTRY_INFO!N22","v":0},null,null,{"$f":"SUM(MAX('MDA2'!J22, 'T1'!L22, MAX(T3_R1!K22, T3_R2!K22)), MAX('MDA1'!K22, 'MDA2'!K22, 'T1'!M22, MAX(T3_R1!L22, T3_R2!L22)), MAX('MDA1'!L22, 'MDA2'!L22, 'T1'!N22, MAX(T3_R1!M22, T3_R2!M22)))","v":0},{"$f":"IF(AND(COUNTRY_INFO!J22>1,COUNTRY_INFO!J22<4),IF(COUNTRY_INFO!E22>MAX('MDA2'!J22,'T1'!L22,MAX(T3_R1!K22,T3_R2!K22)),MAX('MDA2'!J22,'T1'!L22,MAX(T3_R1!K22,T3_R2!K22)),COUNTRY_INFO!E22),0)","v":0},{"$f":"IF(AND(COUNTRY_INFO!J22>1,COUNTRY_INFO!J22<4), IF(T22/COUNTRY_INFO!E22*100<>0, IF(T22/COUNTRY_INFO!E22*100>100,100,T22/COUNTRY_INFO!E22*100), \"-\"),0)","v":0},{"$f":"IF(AND(COUNTRY_INFO!J22>1,COUNTRY_INFO!J22<4),IF(COUNTRY_INFO!F22>MAX('MDA1'!K22,'MDA2'!K22,'T1'!M22,MAX(T3_R1!L22,T3_R2!L22)),MAX('MDA1'!K22,'MDA2'!K22,'T1'!M22,MAX(T3_R1!L22,T3_R2!L22)),COUNTRY_INFO!F22),0)","v":0},{"$f":"IF(AND(COUNTRY_INFO!J22>1,COUNTRY_INFO!J22<4), IF(V22/COUNTRY_INFO!F22*100<>0, IF(V22/COUNTRY_INFO!F22*100>100,100,V22/COUNTRY_INFO!F22*100), \"-\"),0)","v":0},0,{"$f":"IF(AND(COUNTRY_INFO!J22>1,COUNTRY_INFO!J22<4), IF(S22/P22*100<>0, IF(X22/P22*100>100,100,X22/P22*100), \"-\"),0)","v":0},{"$f":"COUNTRY_INFO!O22","v":0},null,null,{"$f":"MAX('T1'!L22,'T2'!J22)+MAX('T1'!M22,'T2'!K22)+MAX('T1'!N22,'T2'!L22)","v":0},{"$f":"IF(COUNTRY_INFO!K22=1,IF(COUNTRY_INFO!F22*0.33>MAX('T1'!M22,'T2'!K22),MAX('T1'!M22,'T2'!K22),COUNTRY_INFO!F22*0.33),IF(COUNTRY_INFO!K22=2,IF(COUNTRY_INFO!F22*0.5>MAX('T1'!M22,'T2'!K22),MAX('T1'!M22,'T2'!K22),COUNTRY_INFO!F22*0.5),IF(COUNTRY_INFO!K22=3,IF(COUNTRY_INFO!F22>MAX('T1'!M22,'T2'!K22),MAX('T1'!M22,'T2'!K22),COUNTRY_INFO!F22),0)))","v":0},{"$f":"IF(AND(COUNTRY_INFO!K22>0,COUNTRY_INFO!K22<4),IF(Z22>0,IF(COUNTRY_INFO!K22=1, AD22/(COUNTRY_INFO!F22*0.33)*100, IF(COUNTRY_INFO!K22=2, AD22/(COUNTRY_INFO!F22*0.5)*100, IF(COUNTRY_INFO!K22=3, AD22/COUNTRY_INFO!F22*100))),\"-\"),0)","v":0},{"$f":"IF(COUNTRY_INFO!K22=2,IF(COUNTRY_INFO!G22*0.2>MAX('T1'!N22,'T2'!L22),MAX('T1'!N22,'T2'!L22),COUNTRY_INFO!G22*0.2),IF(COUNTRY_INFO!K22=3,IF(COUNTRY_INFO!G22>MAX('T1'!N22,'T2'!L22),MAX('T1'!N22,'T2'!L22),COUNTRY_INFO!G22),0))","v":0},{"$f":"IF(AND(COUNTRY_INFO!K22>0,COUNTRY_INFO!K22<4),IF(Z22>0,IF(COUNTRY_INFO!K22=1, 0, IF(COUNTRY_INFO!K22=2, AF22/(COUNTRY_INFO!G22*0.2)*100, IF(COUNTRY_INFO!K22=3, AF22/COUNTRY_INFO!G22*100))),\"-\"),0)","v":0},0,{"$f":"IF(AND(COUNTRY_INFO!K22>0,COUNTRY_INFO!K22<4), IF(AC22/Z22*100<>0, IF(AH22/Z22*100>100,100,AH22/Z22*100), \"-\"),0)","v":0},null,{"$f":"IF(AND(D22<>0, D22<>\"Inconnu\",D22<>\"Interrompu\",D22<>\"Non requis\"),D22/COUNTRY_INFO!D22, 0)","v":0},{"$f":"IF(AND(J22<>0,J22<>\"Inconnu\",J22<>\"Interrompu\",J22<>\"Non requis\"),J22/COUNTRY_INFO!D22, 0)","v":0},{"$f":"IF(AND(P22<>0,P22<>\"Inconnu\",P22<>\"Non requis\"),P22/(COUNTRY_INFO!E22+COUNTRY_INFO!F22), 0)","v":0},{"$f":"IF(AND(Z22<>0,Z22<>\"Inconnu\",Z22<>\"Non requis\"),IF(COUNTRY_INFO!K22=1,1,IF(COUNTRY_INFO!K22=2,0.5*COUNTRY_INFO!F22/(0.5*COUNTRY_INFO!F22+0.2*COUNTRY_INFO!G22),IF(COUNTRY_INFO!K22=3,COUNTRY_INFO!F22/(COUNTRY_INFO!F22+COUNTRY_INFO!G22)))),0)","v":0},{"$f":"IF(AND(Z22<>0,Z22<>\"Inconnu\",Z22<>\"Non requis\"),IF(COUNTRY_INFO!K22=1,0,IF(COUNTRY_INFO!K22=2,0.2*COUNTRY_INFO!G22/(0.5*COUNTRY_INFO!F22+0.2*COUNTRY_INFO!G22),IF(COUNTRY_INFO!K22=3,COUNTRY_INFO!G22/(COUNTRY_INFO!F22+COUNTRY_INFO!G22)))),0)","v":0},{"$f":"MAX(COUNTRY_INFO!D22*AK22*PROFILE!$G$7,COUNTRY_INFO!D22*AL22*PROFILE!$G$7)","v":0},{"$f":"MAX(COUNTRY_INFO!D22*AK22*PROFILE!$G$8,COUNTRY_INFO!D22*AL22*PROFILE!$G$8,COUNTRY_INFO!D22*AM22*PROFILE!$G$8)","v":0},{"$f":"MAX(COUNTRY_INFO!D22*AK22*PROFILE!$G$9,COUNTRY_INFO!D22*AL22*PROFILE!$G$9,COUNTRY_INFO!D22*AM22*PROFILE!$G$9,IF(AND(DISTRICT!Z22<>\"Inconnu\",Z22<>\"Non requis\"),COUNTRY_INFO!O22*DISTRICT!AN22,0))","v":0},{"$f":"MAX(COUNTRY_INFO!D22*AK22*PROFILE!$G$10,COUNTRY_INFO!D22*AL22*PROFILE!$G$10,IF(AND(DISTRICT!Z22<>\"Inconnu\",Z22<>\"Non requis\"),COUNTRY_INFO!O22*DISTRICT!AO22,0))","v":0},0,0,{"$f":"MAX('MDA2'!J22,'T1'!L22,'T2'!J22,T3_R1!K22,T3_R2!K22)","v":0},{"$f":"MAX('MDA1'!K22,'MDA2'!K22,'MDA3'!I22,'MDA3'!L22,'T1'!M22,'T2'!K22,T3_R1!L22,T3_R2!L22)","v":0},{"$f":"MAX('MDA1'!L22,'MDA2'!L22,'MDA3'!J22,'MDA3'!M22,'T1'!N22,'T2'!L22,T3_R1!M22,T3_R2!M22)","v":0},0,{"$f":"MAX('MDA2'!J22,T22)","v":0},{"$f":"MAX('MDA1'!K22,'MDA2'!K22,'MDA3'!I22,'MDA3'!L22,V22,AD22)","v":0},{"$f":"MAX('MDA1'!L22,'MDA2'!L22,'MDA3'!J22,'MDA3'!M22,AF22)","v":0},0,0]
[{"$f":"IF(COUNTRY_INFO!A23=0,\" \",COUNTRY_INFO!A23)","v":"Togo"},{"$f":"IF(COUNTRY_INFO!B23=0,\" \",COUNTRY_INFO!B23)","v":"LOME-COMMUNE"},{"$f":"IF(COUNTRY_INFO!C23=0,\" \",COUNTRY_INFO!C23)","v":"DISTRICT N°3"},{"$f":"COUNTRY_INFO!L23","v":"Non requis"},null,null,{"$f":"MAX('MDA1'!M23,'MDA2'!M23)","v":0},{"$f":"IF(AND(COUNTRY_INFO!H23>0,COUNTRY_INFO!H23<4),IF(D23>MAX('MDA1'!M23,'MDA2'!M23),MAX('MDA1'!M23,'MDA2'!M23),D23),0)","v":0},{"$f":"IF(AND(COUNTRY_INFO!H23>0,COUNTRY_INFO!H23<4), IF(G23/D23*100<>0, IF(G23/D23*100>100,100,G23/D23*100), \"-\"),0)","v":0},{"$f":"COUNTRY_INFO!M23","v":0},null,null,{"$f":"MAX('MDA1'!M23,MAX('MDA3'!I23,'MDA3'!L23)+MAX('MDA3'!J23,'MDA3'!M23))","v":0},{"$f":"IF(AND(COUNTRY_INFO!I23>0,COUNTRY_INFO!I23<4),IF(J23>MAX('MDA1'!M23,MAX('MDA3'!I23,'MDA3'!L23)+MAX('MDA3'!J23,'MDA3'!M23)),MAX('MDA1'!M23,MAX('MDA3'!I23,'MDA3'!L23)+MAX('MDA3'!J23,'MDA3'!M23)),J23),0)","v":0},{"$f":"IF(AND(COUNTRY_INFO!I23>0,COUNTRY_INFO!I23<4), IF(M23/J23*100<>0, IF(M23/J23*100>100,100,M23/J23*100), \"-\"),0)","v":0},{"$f":"COUNTRY_INFO!N23","v":0},null,null,{"$f":"SUM(MAX('MDA2'!J23, 'T1'!L23, MAX(T3_R1!K23, T3_R2!K23)), MAX('MDA1'!K23, 'MDA2'!K23, 'T1'!M23, MAX(T3_R1!L23, T3_R2!L23)), MAX('MDA1'!L23, 'MDA2'!L23, 'T1'!N23, MAX(T3_R1!M23, T3_R2!M23)))","v":0},{"$f":"IF(AND(COUNTRY_INFO!J23>1,COUNTRY_INFO!J23<4),IF(COUNTRY_INFO!E23>MAX('MDA2'!J23,'T1'!L23,MAX(T3_R1!K23,T3_R2!K23)),MAX('MDA2'!J23,'T1'!L23,MAX(T3_R1!K23,T3_R2!K23)),COUNTRY_INFO!E23),0)","v":0},{"$f":"IF(AND(COUNTRY_INFO!J23>1,COUNTRY_INFO!J23<4), IF(T23/COUNTRY_INFO!E23*100<>0, IF(T23/COUNTRY_INFO!E23*100>100,100,T23/COUNTRY_INFO!E23*100), \"-\"),0)","v":0},{"$f":"IF(AND(COUNTRY_INFO!J23>1,COUNTRY_INFO!J23<4),IF(COUNTRY_INFO!F23>MAX('MDA1'!K23,'MDA2'!K23,'T1'!M23,MAX(T3_R1!L23,T3_R2!L23)),MAX('MDA1'!K23,'MDA2'!K23,'T1'!M23,MAX(T3_R1!L23,T3_R2!L23)),COUNTRY_INFO!F23),0)","v":0},{"$f":"IF(AND(COUNTRY_INFO!J23>1,COUNTRY_INFO!J23<4), IF(V23/COUNTRY_INFO!F23*100<>0, IF(V23/COUNTRY_INFO!F23*100>100,100,V23/COUNTRY_INFO!F23*100), \"-\"),0)","v":0},0,{"$f":"IF(AND(COUNTRY_INFO!J23>1,COUNTRY_INFO!J23<4), IF(S23/P23*100<>0, IF(X23/P23*100>100,100,X23/P23*100), \"-\"),0)","v":0},{"$f":"COUNTRY_INFO!O23","v":0},null,null,{"$f":"MAX('T1'!L23,'T2'!J23)+MAX('T1'!M23,'T2'!K23)+MAX('T1'!N23,'T2'!L23)","v":0},{"$f":"IF(COUNTRY_INFO!K23=1,IF(COUNTRY_INFO!F23*0.33>MAX('T1'!M23,'T2'!K23),MAX('T1'!M23,'T2'!K23),COUNTRY_INFO!F23*0.33),IF(COUNTRY_INFO!K23=2,IF(COUNTRY_INFO!F23*0.5>MAX('T1'!M23,'T2'!K23),MAX('T1'!M23,'T2'!K23),COUNTRY_INFO!F23*0.5),IF(COUNTRY_INFO!K23=3,IF(COUNTRY_INFO!F23>MAX('T1'!M23,'T2'!K23),MAX('T1'!M23,'T2'!K23),COUNTRY_INFO!F23),0)))","v":0},{"$f":"IF(AND(COUNTRY_INFO!K23>0,COUNTRY_INFO!K23<4),IF(Z23>0,IF(COUNTRY_INFO!K23=1, AD23/(COUNTRY_INFO!F23*0.33)*100, IF(COUNTRY_INFO!K23=2, AD23/(COUNTRY_INFO!F23*0.5)*100, IF(COUNTRY_INFO!K23=3, AD23/COUNTRY_INFO!F23*100))),\"-\"),0)","v":0},{"$f":"IF(COUNTRY_INFO!K23=2,IF(COUNTRY_INFO!G23*0.2>MAX('T1'!N23,'T2'!L23),MAX('T1'!N23,'T2'!L23),COUNTRY_INFO!G23*0.2),IF(COUNTRY_INFO!K23=3,IF(COUNTRY_INFO!G23>MAX('T1'!N23,'T2'!L23),MAX('T1'!N23,'T2'!L23),COUNTRY_INFO!G23),0))","v":0},{"$f":"IF(AND(COUNTRY_INFO!K23>0,COUNTRY_INFO!K23<4),IF(Z23>0,IF(COUNTRY_INFO!K23=1, 0, IF(COUNTRY_INFO!K23=2, AF23/(COUNTRY_INFO!G23*0.2)*100, IF(COUNTRY_INFO!K23=3, AF23/COUNTRY_INFO!G23*100))),\"-\"),0)","v":0},0,{"$f":"IF(AND(COUNTRY_INFO!K23>0,COUNTRY_INFO!K23<4), IF(AC23/Z23*100<>0, IF(AH23/Z23*100>100,100,AH23/Z23*100), \"-\"),0)","v":0},null,{"$f":"IF(AND(D23<>0, D23<>\"Inconnu\",D23<>\"Interrompu\",D23<>\"Non requis\"),D23/COUNTRY_INFO!D23, 0)","v":0},{"$f":"IF(AND(J23<>0,J23<>\"Inconnu\",J23<>\"Interrompu\",J23<>\"Non requis\"),J23/COUNTRY_INFO!D23, 0)","v":0},{"$f":"IF(AND(P23<>0,P23<>\"Inconnu\",P23<>\"Non requis\"),P23/(COUNTRY_INFO!E23+COUNTRY_INFO!F23), 0)","v":0},{"$f":"IF(AND(Z23<>0,Z23<>\"Inconnu\",Z23<>\"Non requis\"),IF(COUNTRY_INFO!K23=1,1,IF(COUNTRY_INFO!K23=2,0.5*COUNTRY_INFO!F23/(0.5*COUNTRY_INFO!F23+0.2*COUNTRY_INFO!G23),IF(COUNTRY_INFO!K23=3,COUNTRY_INFO!F23/(COUNTRY_INFO!F23+COUNTRY_INFO!G23)))),0)","v":0},{"$f":"IF(AND(Z23<>0,Z23<>\"Inconnu\",Z23<>\"Non requis\"),IF(COUNTRY_INFO!K23=1,0,IF(COUNTRY_INFO!K23=2,0.2*COUNTRY_INFO!G23/(0.5*COUNTRY_INFO!F23+0.2*COUNTRY_INFO!G23),IF(COUNTRY_INFO!K23=3,COUNTRY_INFO!G23/(COUNTRY_INFO!F23+COUNTRY_INFO!G23)))),0)","v":0},{"$f":"MAX(COUNTRY_INFO!D23*AK23*PROFILE!$G$7,COUNTRY_INFO!D23*AL23*PROFILE!$G$7)","v":0},{"$f":"MAX(COUNTRY_INFO!D23*AK23*PROFILE!$G$8,COUNTRY_INFO!D23*AL23*PROFILE!$G$8,COUNTRY_INFO!D23*AM23*PROFILE!$G$8)","v":0},{"$f":"MAX(COUNTRY_INFO!D23*AK23*PROFILE!$G$9,COUNTRY_INFO!D23*AL23*PROFILE!$G$9,COUNTRY_INFO!D23*AM23*PROFILE!$G$9,IF(AND(DISTRICT!Z23<>\"Inconnu\",Z23<>\"Non requis\"),COUNTRY_INFO!O23*DISTRICT!AN23,0))","v":0},{"$f":"MAX(COUNTRY_INFO!D23*AK23*PROFILE!$G$10,COUNTRY_INFO!D23*AL23*PROFILE!$G$10,IF(AND(DISTRICT!Z23<>\"Inconnu\",Z23<>\"Non requis\"),COUNTRY_INFO!O23*DISTRICT!AO23,0))","v":0},0,0,{"$f":"MAX('MDA2'!J23,'T1'!L23,'T2'!J23,T3_R1!K23,T3_R2!K23)","v":0},{"$f":"MAX('MDA1'!K23,'MDA2'!K23,'MDA3'!I23,'MDA3'!L23,'T1'!M23,'T2'!K23,T3_R1!L23,T3_R2!L23)","v":0},{"$f":"MAX('MDA1'!L23,'MDA2'!L23,'MDA3'!J23,'MDA3'!M23,'T1'!N23,'T2'!L23,T3_R1!M23,T3_R2!M23)","v":0},0,{"$f":"MAX('MDA2'!J23,T23)","v":0},{"$f":"MAX('MDA1'!K23,'MDA2'!K23,'MDA3'!I23,'MDA3'!L23,V23,AD23)","v":0},{"$f":"MAX('MDA1'!L23,'MDA2'!L23,'MDA3'!J23,'MDA3'!M23,AF23)","v":0},0,0]
[{"$f":"IF(COUNTRY_INFO!A24=0,\" \",COUNTRY_INFO!A24)","v":"Togo"},{"$f":"IF(COUNTRY_INFO!B24=0,\" \",COUNTRY_INFO!B24)","v":"LOME-COMMUNE"},{"$f":"IF(COUNTRY_INFO!C24=0,\" \",COUNTRY_INFO!C24)","v":"DISTRICT N°4"},{"$f":"COUNTRY_INFO!L24","v":"Non requis"},null,null,{"$f":"MAX('MDA1'!M24,'MDA2'!M24)","v":0},{"$f":"IF(AND(COUNTRY_INFO!H24>0,COUNTRY_INFO!H24<4),IF(D24>MAX('MDA1'!M24,'MDA2'!M24),MAX('MDA1'!M24,'MDA2'!M24),D24),0)","v":0},{"$f":"IF(AND(COUNTRY_INFO!H24>0,COUNTRY_INFO!H24<4), IF(G24/D24*100<>0, IF(G24/D24*100>100,100,G24/D24*100), \"-\"),0)","v":0},{"$f":"COUNTRY_INFO!M24","v":0},null,null,{"$f":"MAX('MDA1'!M24,MAX('MDA3'!I24,'MDA3'!L24)+MAX('MDA3'!J24,'MDA3'!M24))","v":0},{"$f":"IF(AND(COUNTRY_INFO!I24>0,COUNTRY_INFO!I24<4),IF(J24>MAX('MDA1'!M24,MAX('MDA3'!I24,'MDA3'!L24)+MAX('MDA3'!J24,'MDA3'!M24)),MAX('MDA1'!M24,MAX('MDA3'!I24,'MDA3'!L24)+MAX('MDA3'!J24,'MDA3'!M24)),J24),0)","v":0},{"$f":"IF(AND(COUNTRY_INFO!I24>0,COUNTRY_INFO!I24<4), IF(M24/J24*100<>0, IF(M24/J24*100>100,100,M24/J24*100), \"-\"),0)","v":0},{"$f":"COUNTRY_INFO!N24","v":0},null,null,{"$f":"SUM(MAX('MDA2'!J24, 'T1'!L24, MAX(T3_R1!K24, T3_R2!K24)), MAX('MDA1'!K24, 'MDA2'!K24, 'T1'!M24, MAX(T3_R1!L24, T3_R2!L24)), MAX('MDA1'!L24, 'MDA2'!L24, 'T1'!N24, MAX(T3_R1!M24, T3_R2!M24)))","v":0},{"$f":"IF(AND(COUNTRY_INFO!J24>1,COUNTRY_INFO!J24<4),IF(COUNTRY_INFO!E24>MAX('MDA2'!J24,'T1'!L24,MAX(T3_R1!K24,T3_R2!K24)),MAX('MDA2'!J24,'T1'!L24,MAX(T3_R1!K24,T3_R2!K24)),COUNTRY_INFO!E24),0)","v":0},{"$f":"IF(AND(COUNTRY_INFO!J24>1,COUNTRY_INFO!J24<4), IF(T24/COUNTRY_INFO!E24*100<>0, IF(T24/COUNTRY_INFO!E24*100>100,100,T24/COUNTRY_INFO!E24*100), \"-\"),0)","v":0},{"$f":"IF(AND(COUNTRY_INFO!J24>1,COUNTRY_INFO!J24<4),IF(COUNTRY_INFO!F24>MAX('MDA1'!K24,'MDA2'!K24,'T1'!M24,MAX(T3_R1!L24,T3_R2!L24)),MAX('MDA1'!K24,'MDA2'!K24,'T1'!M24,MAX(T3_R1!L24,T3_R2!L24)),COUNTRY_INFO!F24),0)","v":0},{"$f":"IF(AND(COUNTRY_INFO!J24>1,COUNTRY_INFO!J24<4), IF(V24/COUNTRY_INFO!F24*100<>0, IF(V24/COUNTRY_INFO!F24*100>100,100,V24/COUNTRY_INFO!F24*100), \"-\"),0)","v":0},0,{"$f":"IF(AND(COUNTRY_INFO!J24>1,COUNTRY_INFO!J24<4), IF(S24/P24*100<>0, IF(X24/P24*100>100,100,X24/P24*100), \"-\"),0)","v":0},{"$f":"COUNTRY_INFO!O24","v":0},null,null,{"$f":"MAX('T1'!L24,'T2'!J24)+MAX('T1'!M24,'T2'!K24)+MAX('T1'!N24,'T2'!L24)","v":0},{"$f":"IF(COUNTRY_INFO!K24=1,IF(COUNTRY_INFO!F24*0.33>MAX('T1'!M24,'T2'!K24),MAX('T1'!M24,'T2'!K24),COUNTRY_INFO!F24*0.33),IF(COUNTRY_INFO!K24=2,IF(COUNTRY_INFO!F24*0.5>MAX('T1'!M24,'T2'!K24),MAX('T1'!M24,'T2'!K24),COUNTRY_INFO!F24*0.5),IF(COUNTRY_INFO!K24=3,IF(COUNTRY_INFO!F24>MAX('T1'!M24,'T2'!K24),MAX('T1'!M24,'T2'!K24),COUNTRY_INFO!F24),0)))","v":0},{"$f":"IF(AND(COUNTRY_INFO!K24>0,COUNTRY_INFO!K24<4),IF(Z24>0,IF(COUNTRY_INFO!K24=1, AD24/(COUNTRY_INFO!F24*0.33)*100, IF(COUNTRY_INFO!K24=2, AD24/(COUNTRY_INFO!F24*0.5)*100, IF(COUNTRY_INFO!K24=3, AD24/COUNTRY_INFO!F24*100))),\"-\"),0)","v":0},{"$f":"IF(COUNTRY_INFO!K24=2,IF(COUNTRY_INFO!G24*0.2>MAX('T1'!N24,'T2'!L24),MAX('T1'!N24,'T2'!L24),COUNTRY_INFO!G24*0.2),IF(COUNTRY_INFO!K24=3,IF(COUNTRY_INFO!G24>MAX('T1'!N24,'T2'!L24),MAX('T1'!N24,'T2'!L24),COUNTRY_INFO!G24),0))","v":0},{"$f":"IF(AND(COUNTRY_INFO!K24>0,COUNTRY_INFO!K24<4),IF(Z24>0,IF(COUNTRY_INFO!K24=1, 0, IF(COUNTRY_INFO!K24=2, AF24/(COUNTRY_INFO!G24*0.2)*100, IF(COUNTRY_INFO!K24=3, AF24/COUNTRY_INFO!G24*100))),\"-\"),0)","v":0},0,{"$f":"IF(AND(COUNTRY_INFO!K24>0,COUNTRY_INFO!K24<4), IF(AC24/Z24*100<>0, IF(AH24/Z24*100>100,100,AH24/Z24*100), \"-\"),0)","v":0},null,{"$f":"IF(AND(D24<>0, D24<>\"Inconnu\",D24<>\"Interrompu\",D24<>\"Non requis\"),D24/COUNTRY_INFO!D24, 0)","v":0},{"$f":"IF(AND(J24<>0,J24<>\"Inconnu\",J24<>\"Interrompu\",J24<>\"Non requis\"),J24/COUNTRY_INFO!D24, 0)","v":0},{"$f":"IF(AND(P24<>0,P24<>\"Inconnu\",P24<>\"Non requis\"),P24/(COUNTRY_INFO!E24+COUNTRY_INFO!F24), 0)","v":0},{"$f":"IF(AND(Z24<>0,Z24<>\"Inconnu\",Z24<>\"Non requis\"),IF(COUNTRY_INFO!K24=1,1,IF(COUNTRY_INFO!K24=2,0.5*COUNTRY_INFO!F24/(0.5*COUNTRY_INFO!F24+0.2*COUNTRY_INFO!G24),IF(COUNTRY_INFO!K24=3,COUNTRY_INFO!F24/(COUNTRY_INFO!F24+COUNTRY_INFO!G24)))),0)","v":0},{"$f":"IF(AND(Z24<>0,Z24<>\"Inconnu\",Z24<>\"Non requis\"),IF(COUNTRY_INFO!K24=1,0,IF(COUNTRY_INFO!K24=2,0.2*COUNTRY_INFO!G24/(0.5*COUNTRY_INFO!F24+0.2*COUNTRY_INFO!G24),IF(COUNTRY_INFO!K24=3,COUNTRY_INFO!G24/(COUNTRY_INFO!F24+COUNTRY_INFO!G24)))),0)","v":0},{"$f":"MAX(COUNTRY_INFO!D24*AK24*PROFILE!$G$7,COUNTRY_INFO!D24*AL24*PROFILE!$G$7)","v":0},{"$f":"MAX(COUNTRY_INFO!D24*AK24*PROFILE!$G$8,COUNTRY_INFO!D24*AL24*PROFILE!$G$8,COUNTRY_INFO!D24*AM24*PROFILE!$G$8)","v":0},{"$f":"MAX(COUNTRY_INFO!D24*AK24*PROFILE!$G$9,COUNTRY_INFO!D24*AL24*PROFILE!$G$9,COUNTRY_INFO!D24*AM24*PROFILE!$G$9,IF(AND(DISTRICT!Z24<>\"Inconnu\",Z24<>\"Non requis\"),COUNTRY_INFO!O24*DISTRICT!AN24,0))","v":0},{"$f":"MAX(COUNTRY_INFO!D24*AK24*PROFILE!$G$10,COUNTRY_INFO!D24*AL24*PROFILE!$G$10,IF(AND(DISTRICT!Z24<>\"Inconnu\",Z24<>\"Non requis\"),COUNTRY_INFO!O24*DISTRICT!AO24,0))","v":0},0,0,{"$f":"MAX('MDA2'!J24,'T1'!L24,'T2'!J24,T3_R1!K24,T3_R2!K24)","v":0},{"$f":"MAX('MDA1'!K24,'MDA2'!K24,'MDA3'!I24,'MDA3'!L24,'T1'!M24,'T2'!K24,T3_R1!L24,T3_R2!L24)","v":0},{"$f":"MAX('MDA1'!L24,'MDA2'!L24,'MDA3'!J24,'MDA3'!M24,'T1'!N24,'T2'!L24,T3_R1!M24,T3_R2!M24)","v":0},0,{"$f":"MAX('MDA2'!J24,T24)","v":0},{"$f":"MAX('MDA1'!K24,'MDA2'!K24,'MDA3'!I24,'MDA3'!L24,V24,AD24)","v":0},{"$f":"MAX('MDA1'!L24,'MDA2'!L24,'MDA3'!J24,'MDA3'!M24,AF24)","v":0},0,0]
[{"$f":"IF(COUNTRY_INFO!A25=0,\" \",COUNTRY_INFO!A25)","v":"Togo"},{"$f":"IF(COUNTRY_INFO!B25=0,\" \",COUNTRY_INFO!B25)","v":"LOME-COMMUNE"},{"$f":"IF(COUNTRY_INFO!C25=0,\" \",COUNTRY_INFO!C25)","v":"DISTRICT N°5"},{"$f":"COUNTRY_INFO!L25","v":"Non requis"},null,null,{"$f":"MAX('MDA1'!M25,'MDA2'!M25)","v":0},{"$f":"IF(AND(COUNTRY_INFO!H25>0,COUNTRY_INFO!H25<4),IF(D25>MAX('MDA1'!M25,'MDA2'!M25),MAX('MDA1'!M25,'MDA2'!M25),D25),0)","v":0},{"$f":"IF(AND(COUNTRY_INFO!H25>0,COUNTRY_INFO!H25<4), IF(G25/D25*100<>0, IF(G25/D25*100>100,100,G25/D25*100), \"-\"),0)","v":0},{"$f":"COUNTRY_INFO!M25","v":0},null,null,{"$f":"MAX('MDA1'!M25,MAX('MDA3'!I25,'MDA3'!L25)+MAX('MDA3'!J25,'MDA3'!M25))","v":0},{"$f":"IF(AND(COUNTRY_INFO!I25>0,COUNTRY_INFO!I25<4),IF(J25>MAX('MDA1'!M25,MAX('MDA3'!I25,'MDA3'!L25)+MAX('MDA3'!J25,'MDA3'!M25)),MAX('MDA1'!M25,MAX('MDA3'!I25,'MDA3'!L25)+MAX('MDA3'!J25,'MDA3'!M25)),J25),0)","v":0},{"$f":"IF(AND(COUNTRY_INFO!I25>0,COUNTRY_INFO!I25<4), IF(M25/J25*100<>0, IF(M25/J25*100>100,100,M25/J25*100), \"-\"),0)","v":0},{"$f":"COUNTRY_INFO!N25","v":0},null,null,{"$f":"SUM(MAX('MDA2'!J25, 'T1'!L25, MAX(T3_R1!K25, T3_R2!K25)), MAX('MDA1'!K25, 'MDA2'!K25, 'T1'!M25, MAX(T3_R1!L25, T3_R2!L25)), MAX('MDA1'!L25, 'MDA2'!L25, 'T1'!N25, MAX(T3_R1!M25, T3_R2!M25)))","v":0},{"$f":"IF(AND(COUNTRY_INFO!J25>1,COUNTRY_INFO!J25<4),IF(COUNTRY_INFO!E25>MAX('MDA2'!J25,'T1'!L25,MAX(T3_R1!K25,T3_R2!K25)),MAX('MDA2'!J25,'T1'!L25,MAX(T3_R1!K25,T3_R2!K25)),COUNTRY_INFO!E25),0)","v":0},{"$f":"IF(AND(COUNTRY_INFO!J25>1,COUNTRY_INFO!J25<4), IF(T25/COUNTRY_INFO!E25*100<>0, IF(T25/COUNTRY_INFO!E25*100>100,100,T25/COUNTRY_INFO!E25*100), \"-\"),0)","v":0},{"$f":"IF(AND(COUNTRY_INFO!J25>1,COUNTRY_INFO!J25<4),IF(COUNTRY_INFO!F25>MAX('MDA1'!K25,'MDA2'!K25,'T1'!M25,MAX(T3_R1!L25,T3_R2!L25)),MAX('MDA1'!K25,'MDA2'!K25,'T1'!M25,MAX(T3_R1!L25,T3_R2!L25)),COUNTRY_INFO!F25),0)","v":0},{"$f":"IF(AND(COUNTRY_INFO!J25>1,COUNTRY_INFO!J25<4), IF(V25/COUNTRY_INFO!F25*100<>0, IF(V25/COUNTRY_INFO!F25*100>100,100,V25/COUNTRY_INFO!F25*100), \"-\"),0)","v":0},0,{"$f":"IF(AND(COUNTRY_INFO!J25>1,COUNTRY_INFO!J25<4), IF(S25/P25*100<>0, IF(X25/P25*100>100,100,X25/P25*100), \"-\"),0)","v":0},{"$f":"COUNTRY_INFO!O25","v":0},null,null,{"$f":"MAX('T1'!L25,'T2'!J25)+MAX('T1'!M25,'T2'!K25)+MAX('T1'!N25,'T2'!L25)","v":0},{"$f":"IF(COUNTRY_INFO!K25=1,IF(COUNTRY_INFO!F25*0.33>MAX('T1'!M25,'T2'!K25),MAX('T1'!M25,'T2'!K25),COUNTRY_INFO!F25*0.33),IF(COUNTRY_INFO!K25=2,IF(COUNTRY_INFO!F25*0.5>MAX('T1'!M25,'T2'!K25),MAX('T1'!M25,'T2'!K25),COUNTRY_INFO!F25*0.5),IF(COUNTRY_INFO!K25=3,IF(COUNTRY_INFO!F25>MAX('T1'!M25,'T2'!K25),MAX('T1'!M25,'T2'!K25),COUNTRY_INFO!F25),0)))","v":0},{"$f":"IF(AND(COUNTRY_INFO!K25>0,COUNTRY_INFO!K25<4),IF(Z25>0,IF(COUNTRY_INFO!K25=1, AD25/(COUNTRY_INFO!F25*0.33)*100, IF(COUNTRY_INFO!K25=2, AD25/(COUNTRY_INFO!F25*0.5)*100, IF(COUNTRY_INFO!K25=3, AD25/COUNTRY_INFO!F25*100))),\"-\"),0)","v":0},{"$f":"IF(COUNTRY_INFO!K25=2,IF(COUNTRY_INFO!G25*0.2>MAX('T1'!N25,'T2'!L25),MAX('T1'!N25,'T2'!L25),COUNTRY_INFO!G25*0.2),IF(COUNTRY_INFO!K25=3,IF(COUNTRY_INFO!G25>MAX('T1'!N25,'T2'!L25),MAX('T1'!N25,'T2'!L25),COUNTRY_INFO!G25),0))","v":0},{"$f":"IF(AND(COUNTRY_INFO!K25>0,COUNTRY_INFO!K25<4),IF(Z25>0,IF(COUNTRY_INFO!K25=1, 0, IF(COUNTRY_INFO!K25=2, AF25/(COUNTRY_INFO!G25*0.2)*100, IF(COUNTRY_INFO!K25=3, AF25/COUNTRY_INFO!G25*100))),\"-\"),0)","v":0},0,{"$f":"IF(AND(COUNTRY_INFO!K25>0,COUNTRY_INFO!K25<4), IF(AC25/Z25*100<>0, IF(AH25/Z25*100>100,100,AH25/Z25*100), \"-\"),0)","v":0},null,{"$f":"IF(AND(D25<>0, D25<>\"Inconnu\",D25<>\"Interrompu\",D25<>\"Non requis\"),D25/COUNTRY_INFO!D25, 0)","v":0},{"$f":"IF(AND(J25<>0,J25<>\"Inconnu\",J25<>\"Interrompu\",J25<>\"Non requis\"),J25/COUNTRY_INFO!D25, 0)","v":0},{"$f":"IF(AND(P25<>0,P25<>\"Inconnu\",P25<>\"Non requis\"),P25/(COUNTRY_INFO!E25+COUNTRY_INFO!F25), 0)","v":0},{"$f":"IF(AND(Z25<>0,Z25<>\"Inconnu\",Z25<>\"Non requis\"),IF(COUNTRY_INFO!K25=1,1,IF(COUNTRY_INFO!K25=2,0.5*COUNTRY_INFO!F25/(0.5*COUNTRY_INFO!F25+0.2*COUNTRY_INFO!G25),IF(COUNTRY_INFO!K25=3,COUNTRY_INFO!F25/(COUNTRY_INFO!F25+COUNTRY_INFO!G25)))),0)","v":0},{"$f":"IF(AND(Z25<>0,Z25<>\"Inconnu\",Z25<>\"Non requis\"),IF(COUNTRY_INFO!K25=1,0,IF(COUNTRY_INFO!K25=2,0.2*COUNTRY_INFO!G25/(0.5*COUNTRY_INFO!F25+0.2*COUNTRY_INFO!G25),IF(COUNTRY_INFO!K25=3,COUNTRY_INFO!G25/(COUNTRY_INFO!F25+COUNTRY_INFO!G25)))),0)","v":0},{"$f":"MAX(COUNTRY_INFO!D25*AK25*PROFILE!$G$7,COUNTRY_INFO!D25*AL25*PROFILE!$G$7)","v":0},{"$f":"MAX(COUNTRY_INFO!D25*AK25*PROFILE!$G$8,COUNTRY_INFO!D25*AL25*PROFILE!$G$8,COUNTRY_INFO!D25*AM25*PROFILE!$G$8)","v":0},{"$f":"MAX(COUNTRY_INFO!D25*AK25*PROFILE!$G$9,COUNTRY_INFO!D25*AL25*PROFILE!$G$9,COUNTRY_INFO!D25*AM25*PROFILE!$G$9,IF(AND(DISTRICT!Z25<>\"Inconnu\",Z25<>\"Non requis\"),COUNTRY_INFO!O25*DISTRICT!AN25,0))","v":0},{"$f":"MAX(COUNTRY_INFO!D25*AK25*PROFILE!$G$10,COUNTRY_INFO!D25*AL25*PROFILE!$G$10,IF(AND(DISTRICT!Z25<>\"Inconnu\",Z25<>\"Non requis\"),COUNTRY_INFO!O25*DISTRICT!AO25,0))","v":0},0,0,{"$f":"MAX('MDA2'!J25,'T1'!L25,'T2'!J25,T3_R1!K25,T3_R2!K25)","v":0},{"$f":"MAX('MDA1'!K25,'MDA2'!K25,'MDA3'!I25,'MDA3'!L25,'T1'!M25,'T2'!K25,T3_R1!L25,T3_R2!L25)","v":0},{"$f":"MAX('MDA1'!L25,'MDA2'!L25,'MDA3'!J25,'MDA3'!M25,'T1'!N25,'T2'!L25,T3_R1!M25,T3_R2!M25)","v":0},0,{"$f":"MAX('MDA2'!J25,T25)","v":0},{"$f":"MAX('MDA1'!K25,'MDA2'!K25,'MDA3'!I25,'MDA3'!L25,V25,AD25)","v":0},{"$f":"MAX('MDA1'!L25,'MDA2'!L25,'MDA3'!J25,'MDA3'!M25,AF25)","v":0},0,0]
[{"$f":"IF(COUNTRY_INFO!A26=0,\" \",COUNTRY_INFO!A26)","v":"Togo"},{"$f":"IF(COUNTRY_INFO!B26=0,\" \",COUNTRY_INFO!B26)","v":"MARITIME"},{"$f":"IF(COUNTRY_INFO!C26=0,\" \",COUNTRY_INFO!C26)","v":"AVE"},{"$f":"COUNTRY_INFO!L26","v":"Non requis"},null,null,{"$f":"MAX('MDA1'!M26,'MDA2'!M26)","v":0},{"$f":"IF(AND(COUNTRY_INFO!H26>0,COUNTRY_INFO!H26<4),IF(D26>MAX('MDA1'!M26,'MDA2'!M26),MAX('MDA1'!M26,'MDA2'!M26),D26),0)","v":0},{"$f":"IF(AND(COUNTRY_INFO!H26>0,COUNTRY_INFO!H26<4), IF(G26/D26*100<>0, IF(G26/D26*100>100,100,G26/D26*100), \"-\"),0)","v":0},{"$f":"COUNTRY_INFO!M26","v":97475},null,null,{"$f":"MAX('MDA1'!M26,MAX('MDA3'!I26,'MDA3'!L26)+MAX('MDA3'!J26,'MDA3'!M26))","v":79960},{"$f":"IF(AND(COUNTRY_INFO!I26>0,COUNTRY_INFO!I26<4),IF(J26>MAX('MDA1'!M26,MAX('MDA3'!I26,'MDA3'!L26)+MAX('MDA3'!J26,'MDA3'!M26)),MAX('MDA1'!M26,MAX('MDA3'!I26,'MDA3'!L26)+MAX('MDA3'!J26,'MDA3'!M26)),J26),0)","v":79960},{"$f":"IF(AND(COUNTRY_INFO!I26>0,COUNTRY_INFO!I26<4), IF(M26/J26*100<>0, IF(M26/J26*100>100,100,M26/J26*100), \"-\"),0)","v":82.031290074378049},{"$f":"COUNTRY_INFO!N26","v":0},null,null,{"$f":"SUM(MAX('MDA2'!J26, 'T1'!L26, MAX(T3_R1!K26, T3_R2!K26)), MAX('MDA1'!K26, 'MDA2'!K26, 'T1'!M26, MAX(T3_R1!L26, T3_R2!L26)), MAX('MDA1'!L26, 'MDA2'!L26, 'T1'!N26, MAX(T3_R1!M26, T3_R2!M26)))","v":41330},{"$f":"IF(AND(COUNTRY_INFO!J26>1,COUNTRY_INFO!J26<4),IF(COUNTRY_INFO!E26>MAX('MDA2'!J26,'T1'!L26,MAX(T3_R1!K26,T3_R2!K26)),MAX('MDA2'!J26,'T1'!L26,MAX(T3_R1!K26,T3_R2!K26)),COUNTRY_INFO!E26),0)","v":0},{"$f":"IF(AND(COUNTRY_INFO!J26>1,COUNTRY_INFO!J26<4), IF(T26/COUNTRY_INFO!E26*100<>0, IF(T26/COUNTRY_INFO!E26*100>100,100,T26/COUNTRY_INFO!E26*100), \"-\"),0)","v":0},{"$f":"IF(AND(COUNTRY_INFO!J26>1,COUNTRY_INFO!J26<4),IF(COUNTRY_INFO!F26>MAX('MDA1'!K26,'MDA2'!K26,'T1'!M26,MAX(T3_R1!L26,T3_R2!L26)),MAX('MDA1'!K26,'MDA2'!K26,'T1'!M26,MAX(T3_R1!L26,T3_R2!L26)),COUNTRY_INFO!F26),0)","v":0},{"$f":"IF(AND(COUNTRY_INFO!J26>1,COUNTRY_INFO!J26<4), IF(V26/COUNTRY_INFO!F26*100<>0, IF(V26/COUNTRY_INFO!F26*100>100,100,V26/COUNTRY_INFO!F26*100), \"-\"),0)","v":0},0,{"$f":"IF(AND(COUNTRY_INFO!J26>1,COUNTRY_INFO!J26<4), IF(S26/P26*100<>0, IF(X26/P26*100>100,100,X26/P26*100), \"-\"),0)","v":0},{"$f":"COUNTRY_INFO!O26","v":28916.800000000003},null,null,{"$f":"MAX('T1'!L26,'T2'!J26)+MAX('T1'!M26,'T2'!K26)+MAX('T1'!N26,'T2'!L26)","v":0},{"$f":"IF(COUNTRY_INFO!K26=1,IF(COUNTRY_INFO!F26*0.33>MAX('T1'!M26,'T2'!K26),MAX('T1'!M26,'T2'!K26),COUNTRY_INFO!F26*0.33),IF(COUNTRY_INFO!K26=2,IF(COUNTRY_INFO!F26*0.5>MAX('T1'!M26,'T2'!K26),MAX('T1'!M26,'T2'!K26),COUNTRY_INFO!F26*0.5),IF(COUNTRY_INFO!K26=3,IF(COUNTRY_INFO!F26>MAX('T1'!M26,'T2'!K26),MAX('T1'!M26,'T2'!K26),COUNTRY_INFO!F26),0)))","v":0},{"$f":"IF(AND(COUNTRY_INFO!K26>0,COUNTRY_INFO!K26<4),IF(Z26>0,IF(COUNTRY_INFO!K26=1, AD26/(COUNTRY_INFO!F26*0.33)*100, IF(COUNTRY_INFO!K26=2, AD26/(COUNTRY_INFO!F26*0.5)*100, IF(COUNTRY_INFO!K26=3, AD26/COUNTRY_INFO!F26*100))),\"-\"),0)","v":0},{"$f":"IF(COUNTRY_INFO!K26=2,IF(COUNTRY_INFO!G26*0.2>MAX('T1'!N26,'T2'!L26),MAX('T1'!N26,'T2'!L26),COUNTRY_INFO!G26*0.2),IF(COUNTRY_INFO!K26=3,IF(COUNTRY_INFO!G26>MAX('T1'!N26,'T2'!L26),MAX('T1'!N26,'T2'!L26),COUNTRY_INFO!G26),0))","v":0},{"$f":"IF(AND(COUNTRY_INFO!K26>0,COUNTRY_INFO!K26<4),IF(Z26>0,IF(COUNTRY_INFO!K26=1, 0, IF(COUNTRY_INFO!K26=2, AF26/(COUNTRY_INFO!G26*0.2)*100, IF(COUNTRY_INFO!K26=3, AF26/COUNTRY_INFO!G26*100))),\"-\"),0)","v":0},0,{"$f":"IF(AND(COUNTRY_INFO!K26>0,COUNTRY_INFO!K26<4), IF(AC26/Z26*100<>0, IF(AH26/Z26*100>100,100,AH26/Z26*100), \"-\"),0)","v":"-"},null,{"$f":"IF(AND(D26<>0, D26<>\"Inconnu\",D26<>\"Interrompu\",D26<>\"Non requis\"),D26/COUNTRY_INFO!D26, 0)","v":0},{"$f":"IF(AND(J26<>0,J26<>\"Inconnu\",J26<>\"Interrompu\",J26<>\"Non requis\"),J26/COUNTRY_INFO!D26, 0)","v":0.84272091434895002},{"$f":"IF(AND(P26<>0,P26<>\"Inconnu\",P26<>\"Non requis\"),P26/(COUNTRY_INFO!E26+COUNTRY_INFO!F26), 0)","v":0},{"$f":"IF(AND(Z26<>0,Z26<>\"Inconnu\",Z26<>\"Non requis\"),IF(COUNTRY_INFO!K26=1,1,IF(COUNTRY_INFO!K26=2,0.5*COUNTRY_INFO!F26/(0.5*COUNTRY_INFO!F26+0.2*COUNTRY_INFO!G26),IF(COUNTRY_INFO!K26=3,COUNTRY_INFO!F26/(COUNTRY_INFO!F26+COUNTRY_INFO!G26)))),0)","v":0.59999723344215117},{"$f":"IF(AND(Z26<>0,Z26<>\"Inconnu\",Z26<>\"Non requis\"),IF(COUNTRY_INFO!K26=1,0,IF(COUNTRY_INFO!K26=2,0.2*COUNTRY_INFO!G26/(0.5*COUNTRY_INFO!F26+0.2*COUNTRY_INFO!G26),IF(COUNTRY_INFO!K26=3,COUNTRY_INFO!G26/(COUNTRY_INFO!F26+COUNTRY_INFO!G26)))),0)","v":0.40000276655784872},{"$f":"MAX(COUNTRY_INFO!D26*AK26*PROFILE!$G$7,COUNTRY_INFO!D26*AL26*PROFILE!$G$7)","v":3898.8679395264689},{"$f":"MAX(COUNTRY_INFO!D26*AK26*PROFILE!$G$8,COUNTRY_INFO!D26*AL26*PROFILE!$G$8,COUNTRY_INFO!D26*AM26*PROFILE!$G$8)","v":15596.022010078921},{"$f":"MAX(COUNTRY_INFO!D26*AK26*PROFILE!$G$9,COUNTRY_INFO!D26*AL26*PROFILE!$G$9,COUNTRY_INFO!D26*AM26*PROFILE!$G$9,IF(AND(DISTRICT!Z26<>\"Inconnu\",Z26<>\"Non requis\"),COUNTRY_INFO!O26*DISTRICT!AN26,0))","v":29242.488483098237},{"$f":"MAX(COUNTRY_INFO!D26*AK26*PROFILE!$G$10,COUNTRY_INFO!D26*AL26*PROFILE!$G$10,IF(AND(DISTRICT!Z26<>\"Inconnu\",Z26<>\"Non requis\"),COUNTRY_INFO!O26*DISTRICT!AO26,0))","v":48737.621567296374},97475,0,{"$f":"MAX('MDA2'!J26,'T1'!L26,'T2'!J26,T3_R1!K26,T3_R2!K26)","v":0},{"$f":"MAX('MDA1'!K26,'MDA2'!K26,'MDA3'!I26,'MDA3'!L26,'T1'!M26,'T2'!K26,T3_R1!L26,T3_R2!L26)","v":41330},{"$f":"MAX('MDA1'!L26,'MDA2'!L26,'MDA3'!J26,'MDA3'!M26,'T1'!N26,'T2'!L26,T3_R1!M26,T3_R2!M26)","v":50796},92126,{"$f":"MAX('MDA2'!J26,T26)","v":0},{"$f":"MAX('MDA1'!K26,'MDA2'!K26,'MDA3'!I26,'MDA3'!L26,V26,AD26)","v":29164},{"$f":"MAX('MDA1'!L26,'MDA2'!L26,'MDA3'!J26,'MDA3'!M26,AF26)","v":50796},79960,82.031290074378049]
[{"$f":"IF(COUNTRY_INFO!A27=0,\" \",COUNTRY_INFO!A27)","v":"Togo"},{"$f":"IF(COUNTRY_INFO!B27=0,\" \",COUNTRY_INFO!B27)","v":"MARITIME"},{"$f":"IF(COUNTRY_INFO!C27=0,\" \",COUNTRY_INFO!C27)","v":"BAS MONO"},{"$f":"COUNTRY_INFO!L27","v":"Non requis"},null,null,{"$f":"MAX('MDA1'!M27,'MDA2'!M27)","v":0},{"$f":"IF(AND(COUNTRY_INFO!H27>0,COUNTRY_INFO!H27<4),IF(D27>MAX('MDA1'!M27,'MDA2'!M27),MAX('MDA1'!M27,'MDA2'!M27),D27),0)","v":0},{"$f":"IF(AND(COUNTRY_INFO!H27>0,COUNTRY_INFO!H27<4), IF(G27/D27*100<>0, IF(G27/D27*100>100,100,G27/D27*100), \"-\"),0)","v":0},{"$f":"COUNTRY_INFO!M27","v":19451},null,null,{"$f":"MAX('MDA1'!M27,MAX('MDA3'!I27,'MDA3'!L27)+MAX('MDA3'!J27,'MDA3'!M27))","v":16885},{"$f":"IF(AND(COUNTRY_INFO!I27>0,COUNTRY_INFO!I27<4),IF(J27>MAX('MDA1'!M27,MAX('MDA3'!I27,'MDA3'!L27)+MAX('MDA3'!J27,'MDA3'!M27)),MAX('MDA1'!M27,MAX('MDA3'!I27,'MDA3'!L27)+MAX('MDA3'!J27,'MDA3'!M27)),J27),0)","v":16885},{"$f":"IF(AND(COUNTRY_INFO!I27>0,COUNTRY_INFO!I27<4), IF(M27/J27*100<>0, IF(M27/J27*100>100,100,M27/J27*100), \"-\"),0)","v":86.807876201737699},{"$f":"COUNTRY_INFO!N27","v":49944},null,null,{"$f":"SUM(MAX('MDA2'!J27, 'T1'!L27, MAX(T3_R1!K27, T3_R2!K27)), MAX('MDA1'!K27, 'MDA2'!K27, 'T1'!M27, MAX(T3_R1!L27, T3_R2!L27)), MAX('MDA1'!L27, 'MDA2'!L27, 'T1'!N27, MAX(T3_R1!M27, T3_R2!M27)))","v":33712},{"$f":"IF(AND(COUNTRY_INFO!J27>1,COUNTRY_INFO!J27<4),IF(COUNTRY_INFO!E27>MAX('MDA2'!J27,'T1'!L27,MAX(T3_R1!K27,T3_R2!K27)),MAX('MDA2'!J27,'T1'!L27,MAX(T3_R1!K27,T3_R2!K27)),COUNTRY_INFO!E27),0)","v":0},{"$f":"IF(AND(COUNTRY_INFO!J27>1,COUNTRY_INFO!J27<4), IF(T27/COUNTRY_INFO!E27*100<>0, IF(T27/COUNTRY_INFO!E27*100>100,100,T27/COUNTRY_INFO!E27*100), \"-\"),0)","v":"-"},{"$f":"IF(AND(COUNTRY_INFO!J27>1,COUNTRY_INFO!J27<4),IF(COUNTRY_INFO!F27>MAX('MDA1'!K27,'MDA2'!K27,'T1'!M27,MAX(T3_R1!L27,T3_R2!L27)),MAX('MDA1'!K27,'MDA2'!K27,'T1'!M27,MAX(T3_R1!L27,T3_R2!L27)),COUNTRY_INFO!F27),0)","v":32572},{"$f":"IF(AND(COUNTRY_INFO!J27>1,COUNTRY_INFO!J27<4), IF(V27/COUNTRY_INFO!F27*100<>0, IF(V27/COUNTRY_INFO!F27*100>100,100,V27/COUNTRY_INFO!F27*100), \"-\"),0)","v":100},32572,{"$f":"IF(AND(COUNTRY_INFO!J27>1,COUNTRY_INFO!J27<4), IF(S27/P27*100<>0, IF(X27/P27*100>100,100,X27/P27*100), \"-\"),0)","v":65.217043088258848},{"$f":"COUNTRY_INFO!O27","v":10748.76},null,null,{"$f":"MAX('T1'!L27,'T2'!J27)+MAX('T1'!M27,'T2'!K27)+MAX('T1'!N27,'T2'!L27)","v":18683},{"$f":"IF(COUNTRY_INFO!K27=1,IF(COUNTRY_INFO!F27*0.33>MAX('T1'!M27,'T2'!K27),MAX('T1'!M27,'T2'!K27),COUNTRY_INFO!F27*0.33),IF(COUNTRY_INFO!K27=2,IF(COUNTRY_INFO!F27*0.5>MAX('T1'!M27,'T2'!K27),MAX('T1'!M27,'T2'!K27),COUNTRY_INFO!F27*0.5),IF(COUNTRY_INFO!K27=3,IF(COUNTRY_INFO!F27>MAX('T1'!M27,'T2'!K27),MAX('T1'!M27,'T2'!K27),COUNTRY_INFO!F27),0)))","v":10748.76},{"$f":"IF(AND(COUNTRY_INFO!K27>0,COUNTRY_INFO!K27<4),IF(Z27>0,IF(COUNTRY_INFO!K27=1, AD27/(COUNTRY_INFO!F27*0.33)*100, IF(COUNTRY_INFO!K27=2, AD27/(COUNTRY_INFO!F27*0.5)*100, IF(COUNTRY_INFO!K27=3, AD27/COUNTRY_INFO!F27*100))),\"-\"),0)","v":100},{"$f":"IF(COUNTRY_INFO!K27=2,IF(COUNTRY_INFO!G27*0.2>MAX('T1'!N27,'T2'!L27),MAX('T1'!N27,'T2'!L27),COUNTRY_INFO!G27*0.2),IF(COUNTRY_INFO!K27=3,IF(COUNTRY_INFO!G27>MAX('T1'!N27,'T2'!L27),MAX('T1'!N27,'T2'!L27),COUNTRY_INFO!G27),0))","v":0},{"$f":"IF(AND(COUNTRY_INFO!K27>0,COUNTRY_INFO!K27<4),IF(Z27>0,IF(COUNTRY_INFO!K27=1, 0, IF(COUNTRY_INFO!K27=2, AF27/(COUNTRY_INFO!G27*0.2)*100, IF(COUNTRY_INFO!K27=3, AF27/COUNTRY_INFO!G27*100))),\"-\"),0)","v":0},10748.76,{"$f":"IF(AND(COUNTRY_INFO!K27>0,COUNTRY_INFO!K27<4), IF(AC27/Z27*100<>0, IF(AH27/Z27*100>100,100,AH27/Z27*100), \"-\"),0)","v":100},null,{"$f":"IF(AND(D27<>0, D27<>\"Inconnu\",D27<>\"Interrompu\",D27<>\"Non requis\"),D27/COUNTRY_INFO!D27, 0)","v":0},{"$f":"IF(AND(J27<>0,J27<>\"Inconnu\",J27<>\"Interrompu\",J27<>\"Non requis\"),J27/COUNTRY_INFO!D27, 0)","v":0.17915135438829174},{"$f":"IF(AND(P27<>0,P27<>\"Inconnu\",P27<>\"Non requis\"),P27/(COUNTRY_INFO!E27+COUNTRY_INFO!F27), 0)","v":1},{"$f":"IF(AND(Z27<>0,Z27<>\"Inconnu\",Z27<>\"Non requis\"),IF(COUNTRY_INFO!K27=1,1,IF(COUNTRY_INFO!K27=2,0.5*COUNTRY_INFO!F27/(0.5*COUNTRY_INFO!F27+0.2*COUNTRY_INFO!G27),IF(COUNTRY_INFO!K27=3,COUNTRY_INFO!F27/(COUNTRY_INFO!F27+COUNTRY_INFO!G27)))),0)","v":1},{"$f":"IF(AND(Z27<>0,Z27<>\"Inconnu\",Z27<>\"Non requis\"),IF(COUNTRY_INFO!K27=1,0,IF(COUNTRY_INFO!K27=2,0.2*COUNTRY_INFO!G27/(0.5*COUNTRY_INFO!F27+0.2*COUNTRY_INFO!G27),IF(COUNTRY_INFO!K27=3,COUNTRY_INFO!G27/(COUNTRY_INFO!F27+COUNTRY_INFO!G27)))),0)","v":0},{"$f":"MAX(COUNTRY_INFO!D27*AK27*PROFILE!$G$7,COUNTRY_INFO!D27*AL27*PROFILE!$G$7)","v":778.01364751710025},{"$f":"MAX(COUNTRY_INFO!D27*AK27*PROFILE!$G$8,COUNTRY_INFO!D27*AL27*PROFILE!$G$8,COUNTRY_INFO!D27*AM27*PROFILE!$G$8)","v":17371.704516032816},{"$f":"MAX(COUNTRY_INFO!D27*AK27*PROFILE!$G$9,COUNTRY_INFO!D27*AL27*PROFILE!$G$9,COUNTRY_INFO!D27*AM27*PROFILE!$G$9,IF(AND(DISTRICT!Z27<>\"Inconnu\",Z27<>\"Non requis\"),COUNTRY_INFO!O27*DISTRICT!AN27,0))","v":32571.887171843293},{"$f":"MAX(COUNTRY_INFO!D27*AK27*PROFILE!$G$10,COUNTRY_INFO!D27*AL27*PROFILE!$G$10,IF(AND(DISTRICT!Z27<>\"Inconnu\",Z27<>\"Non requis\"),COUNTRY_INFO!O27*DISTRICT!AO27,0))","v":9725.524258584066},60447.129593977275,"Y",{"$f":"MAX('MDA2'!J27,'T1'!L27,'T2'!J27,T3_R1!K27,T3_R2!K27)","v":0},{"$f":"MAX('MDA1'!K27,'MDA2'!K27,'MDA3'!I27,'MDA3'!L27,'T1'!M27,'T2'!K27,T3_R1!L27,T3_R2!L27)","v":33712},{"$f":"MAX('MDA1'!L27,'MDA2'!L27,'MDA3'!J27,'MDA3'!M27,'T1'!N27,'T2'!L27,T3_R1!M27,T3_R2!M27)","v":10872},44584,{"$f":"MAX('MDA2'!J27,T27)","v":0},{"$f":"MAX('MDA1'!K27,'MDA2'!K27,'MDA3'!I27,'MDA3'!L27,V27,AD27)","v":32572},{"$f":"MAX('MDA1'!L27,'MDA2'!L27,'MDA3'!J27,'MDA3'!M27,AF27)","v":10872},43444,71.871071946365177]
[{"$f":"IF(COUNTRY_INFO!A28=0,\" \",COUNTRY_INFO!A28)","v":"Togo"},{"$f":"IF(COUNTRY_INFO!B28=0,\" \",COUNTRY_INFO!B28)","v":"MARITIME"},{"$f":"IF(COUNTRY_INFO!C28=0,\" \",COUNTRY_INFO!C28)","v":"GOLFE"},{"$f":"COUNTRY_INFO!L28","v":"Non requis"},null,null,{"$f":"MAX('MDA1'!M28,'MDA2'!M28)","v":0},{"$f":"IF(AND(COUNTRY_INFO!H28>0,COUNTRY_INFO!H28<4),IF(D28>MAX('MDA1'!M28,'MDA2'!M28),MAX('MDA1'!M28,'MDA2'!M28),D28),0)","v":0},{"$f":"IF(AND(COUNTRY_INFO!H28>0,COUNTRY_INFO!H28<4), IF(G28/D28*100<>0, IF(G28/D28*100>100,100,G28/D28*100), \"-\"),0)","v":0},{"$f":"COUNTRY_INFO!M28","v":0},null,null,{"$f":"MAX('MDA1'!M28,MAX('MDA3'!I28,'MDA3'!L28)+MAX('MDA3'!J28,'MDA3'!M28))","v":0},{"$f":"IF(AND(COUNTRY_INFO!I28>0,COUNTRY_INFO!I28<4),IF(J28>MAX('MDA1'!M28,MAX('MDA3'!I28,'MDA3'!L28)+MAX('MDA3'!J28,'MDA3'!M28)),MAX('MDA1'!M28,MAX('MDA3'!I28,'MDA3'!L28)+MAX('MDA3'!J28,'MDA3'!M28)),J28),0)","v":0},{"$f":"IF(AND(COUNTRY_INFO!I28>0,COUNTRY_INFO!I28<4), IF(M28/J28*100<>0, IF(M28/J28*100>100,100,M28/J28*100), \"-\"),0)","v":0},{"$f":"COUNTRY_INFO!N28","v":0},null,null,{"$f":"SUM(MAX('MDA2'!J28, 'T1'!L28, MAX(T3_R1!K28, T3_R2!K28)), MAX('MDA1'!K28, 'MDA2'!K28, 'T1'!M28, MAX(T3_R1!L28, T3_R2!L28)), MAX('MDA1'!L28, 'MDA2'!L28, 'T1'!N28, MAX(T3_R1!M28, T3_R2!M28)))","v":227485},{"$f":"IF(AND(COUNTRY_INFO!J28>1,COUNTRY_INFO!J28<4),IF(COUNTRY_INFO!E28>MAX('MDA2'!J28,'T1'!L28,MAX(T3_R1!K28,T3_R2!K28)),MAX('MDA2'!J28,'T1'!L28,MAX(T3_R1!K28,T3_R2!K28)),COUNTRY_INFO!E28),0)","v":0},{"$f":"IF(AND(COUNTRY_INFO!J28>1,COUNTRY_INFO!J28<4), IF(T28/COUNTRY_INFO!E28*100<>0, IF(T28/COUNTRY_INFO!E28*100>100,100,T28/COUNTRY_INFO!E28*100), \"-\"),0)","v":0},{"$f":"IF(AND(COUNTRY_INFO!J28>1,COUNTRY_INFO!J28<4),IF(COUNTRY_INFO!F28>MAX('MDA1'!K28,'MDA2'!K28,'T1'!M28,MAX(T3_R1!L28,T3_R2!L28)),MAX('MDA1'!K28,'MDA2'!K28,'T1'!M28,MAX(T3_R1!L28,T3_R2!L28)),COUNTRY_INFO!F28),0)","v":0},{"$f":"IF(AND(COUNTRY_INFO!J28>1,COUNTRY_INFO!J28<4), IF(V28/COUNTRY_INFO!F28*100<>0, IF(V28/COUNTRY_INFO!F28*100>100,100,V28/COUNTRY_INFO!F28*100), \"-\"),0)","v":0},0,{"$f":"IF(AND(COUNTRY_INFO!J28>1,COUNTRY_INFO!J28<4), IF(S28/P28*100<>0, IF(X28/P28*100>100,100,X28/P28*100), \"-\"),0)","v":0},{"$f":"COUNTRY_INFO!O28","v":227089.3},null,null,{"$f":"MAX('T1'!L28,'T2'!J28)+MAX('T1'!M28,'T2'!K28)+MAX('T1'!N28,'T2'!L28)","v":83116},{"$f":"IF(COUNTRY_INFO!K28=1,IF(COUNTRY_INFO!F28*0.33>MAX('T1'!M28,'T2'!K28),MAX('T1'!M28,'T2'!K28),COUNTRY_INFO!F28*0.33),IF(COUNTRY_INFO!K28=2,IF(COUNTRY_INFO!F28*0.5>MAX('T1'!M28,'T2'!K28),MAX('T1'!M28,'T2'!K28),COUNTRY_INFO!F28*0.5),IF(COUNTRY_INFO!K28=3,IF(COUNTRY_INFO!F28>MAX('T1'!M28,'T2'!K28),MAX('T1'!M28,'T2'!K28),COUNTRY_INFO!F28),0)))","v":83116},{"$f":"IF(AND(COUNTRY_INFO!K28>0,COUNTRY_INFO!K28<4),IF(Z28>0,IF(COUNTRY_INFO!K28=1, AD28/(COUNTRY_INFO!F28*0.33)*100, IF(COUNTRY_INFO!K28=2, AD28/(COUNTRY_INFO!F28*0.5)*100, IF(COUNTRY_INFO!K28=3, AD28/COUNTRY_INFO!F28*100))),\"-\"),0)","v":61.001001809127843},{"$f":"IF(COUNTRY_INFO!K28=2,IF(COUNTRY_INFO!G28*0.2>MAX('T1'!N28,'T2'!L28),MAX('T1'!N28,'T2'!L28),COUNTRY_INFO!G28*0.2),IF(COUNTRY_INFO!K28=3,IF(COUNTRY_INFO!G28>MAX('T1'!N28,'T2'!L28),MAX('T1'!N28,'T2'!L28),COUNTRY_INFO!G28),0))","v":0},{"$f":"IF(AND(COUNTRY_INFO!K28>0,COUNTRY_INFO!K28<4),IF(Z28>0,IF(COUNTRY_INFO!K28=1, 0, IF(COUNTRY_INFO!K28=2, AF28/(COUNTRY_INFO!G28*0.2)*100, IF(COUNTRY_INFO!K28=3, AF28/COUNTRY_INFO!G28*100))),\"-\"),0)","v":0},83116,{"$f":"IF(AND(COUNTRY_INFO!K28>0,COUNTRY_INFO!K28<4), IF(AC28/Z28*100<>0, IF(AH28/Z28*100>100,100,AH28/Z28*100), \"-\"),0)","v":36.600579595780161},null,{"$f":"IF(AND(D28<>0, D28<>\"Inconnu\",D28<>\"Interrompu\",D28<>\"Non requis\"),D28/COUNTRY_INFO!D28, 0)","v":0},{"$f":"IF(AND(J28<>0,J28<>\"Inconnu\",J28<>\"Interrompu\",J28<>\"Non requis\"),J28/COUNTRY_INFO!D28, 0)","v":0},{"$f":"IF(AND(P28<>0,P28<>\"Inconnu\",P28<>\"Non requis\"),P28/(COUNTRY_INFO!E28+COUNTRY_INFO!F28), 0)","v":0},{"$f":"IF(AND(Z28<>0,Z28<>\"Inconnu\",Z28<>\"Non requis\"),IF(COUNTRY_INFO!K28=1,1,IF(COUNTRY_INFO!K28=2,0.5*COUNTRY_INFO!F28/(0.5*COUNTRY_INFO!F28+0.2*COUNTRY_INFO!G28),IF(COUNTRY_INFO!K28=3,COUNTRY_INFO!F28/(COUNTRY_INFO!F28+COUNTRY_INFO!G28)))),0)","v":0.59999964771567837},{"$f":"IF(AND(Z28<>0,Z28<>\"Inconnu\",Z28<>\"Non requis\"),IF(COUNTRY_INFO!K28=1,0,IF(COUNTRY_INFO!K28=2,0.2*COUNTRY_INFO!G28/(0.5*COUNTRY_INFO!F28+0.2*COUNTRY_INFO!G28),IF(COUNTRY_INFO!K28=3,COUNTRY_INFO!G28/(COUNTRY_INFO!F28+COUNTRY_INFO!G28)))),0)","v":0.40000035228432168},{"$f":"MAX(COUNTRY_INFO!D28*AK28*PROFILE!$G$7,COUNTRY_INFO!D28*AL28*PROFILE!$G$7)","v":0},{"$f":"MAX(COUNTRY_INFO!D28*AK28*PROFILE!$G$8,COUNTRY_INFO!D28*AL28*PROFILE!$G$8,COUNTRY_INFO!D28*AM28*PROFILE!$G$8)","v":0},{"$f":"MAX(COUNTRY_INFO!D28*AK28*PROFILE!$G$9,COUNTRY_INFO!D28*AL28*PROFILE!$G$9,COUNTRY_INFO!D28*AM28*PROFILE!$G$9,IF(AND(DISTRICT!Z28<>\"Inconnu\",Z28<>\"Non requis\"),COUNTRY_INFO!O28*DISTRICT!AN28,0))","v":136253.5},{"$f":"MAX(COUNTRY_INFO!D28*AK28*PROFILE!$G$10,COUNTRY_INFO!D28*AL28*PROFILE!$G$10,IF(AND(DISTRICT!Z28<>\"Inconnu\",Z28<>\"Non requis\"),COUNTRY_INFO!O28*DISTRICT!AO28,0))","v":90835.8},227089.3,"Y",{"$f":"MAX('MDA2'!J28,'T1'!L28,'T2'!J28,T3_R1!K28,T3_R2!K28)","v":0},{"$f":"MAX('MDA1'!K28,'MDA2'!K28,'MDA3'!I28,'MDA3'!L28,'T1'!M28,'T2'!K28,T3_R1!L28,T3_R2!L28)","v":227485},{"$f":"MAX('MDA1'!L28,'MDA2'!L28,'MDA3'!J28,'MDA3'!M28,'T1'!N28,'T2'!L28,T3_R1!M28,T3_R2!M28)","v":0},227485,{"$f":"MAX('MDA2'!J28,T28)","v":0},{"$f":"MAX('MDA1'!K28,'MDA2'!K28,'MDA3'!I28,'MDA3'!L28,V28,AD28)","v":83116},{"$f":"MAX('MDA1'!L28,'MDA2'!L28,'MDA3'!J28,'MDA3'!M28,AF28)","v":0},83116,36.600579595780161]
[{"$f":"IF(COUNTRY_INFO!A29=0,\" \",COUNTRY_INFO!A29)","v":"Togo"},{"$f":"IF(COUNTRY_INFO!B29=0,\" \",COUNTRY_INFO!B29)","v":"MARITIME"},{"$f":"IF(COUNTRY_INFO!C29=0,\" \",COUNTRY_INFO!C29)","v":"LACS"},{"$f":"COUNTRY_INFO!L29","v":"Non requis"},null,null,{"$f":"MAX('MDA1'!M29,'MDA2'!M29)","v":0},{"$f":"IF(AND(COUNTRY_INFO!H29>0,COUNTRY_INFO!H29<4),IF(D29>MAX('MDA1'!M29,'MDA2'!M29),MAX('MDA1'!M29,'MDA2'!M29),D29),0)","v":0},{"$f":"IF(AND(COUNTRY_INFO!H29>0,COUNTRY_INFO!H29<4), IF(G29/D29*100<>0, IF(G29/D29*100>100,100,G29/D29*100), \"-\"),0)","v":0},{"$f":"COUNTRY_INFO!M29","v":0},null,null,{"$f":"MAX('MDA1'!M29,MAX('MDA3'!I29,'MDA3'!L29)+MAX('MDA3'!J29,'MDA3'!M29))","v":0},{"$f":"IF(AND(COUNTRY_INFO!I29>0,COUNTRY_INFO!I29<4),IF(J29>MAX('MDA1'!M29,MAX('MDA3'!I29,'MDA3'!L29)+MAX('MDA3'!J29,'MDA3'!M29)),MAX('MDA1'!M29,MAX('MDA3'!I29,'MDA3'!L29)+MAX('MDA3'!J29,'MDA3'!M29)),J29),0)","v":0},{"$f":"IF(AND(COUNTRY_INFO!I29>0,COUNTRY_INFO!I29<4), IF(M29/J29*100<>0, IF(M29/J29*100>100,100,M29/J29*100), \"-\"),0)","v":0},{"$f":"COUNTRY_INFO!N29","v":97818},null,null,{"$f":"SUM(MAX('MDA2'!J29, 'T1'!L29, MAX(T3_R1!K29, T3_R2!K29)), MAX('MDA1'!K29, 'MDA2'!K29, 'T1'!M29, MAX(T3_R1!L29, T3_R2!L29)), MAX('MDA1'!L29, 'MDA2'!L29, 'T1'!N29, MAX(T3_R1!M29, T3_R2!M29)))","v":60772},{"$f":"IF(AND(COUNTRY_INFO!J29>1,COUNTRY_INFO!J29<4),IF(COUNTRY_INFO!E29>MAX('MDA2'!J29,'T1'!L29,MAX(T3_R1!K29,T3_R2!K29)),MAX('MDA2'!J29,'T1'!L29,MAX(T3_R1!K29,T3_R2!K29)),COUNTRY_INFO!E29),0)","v":0},{"$f":"IF(AND(COUNTRY_INFO!J29>1,COUNTRY_INFO!J29<4), IF(T29/COUNTRY_INFO!E29*100<>0, IF(T29/COUNTRY_INFO!E29*100>100,100,T29/COUNTRY_INFO!E29*100), \"-\"),0)","v":"-"},{"$f":"IF(AND(COUNTRY_INFO!J29>1,COUNTRY_INFO!J29<4),IF(COUNTRY_INFO!F29>MAX('MDA1'!K29,'MDA2'!K29,'T1'!M29,MAX(T3_R1!L29,T3_R2!L29)),MAX('MDA1'!K29,'MDA2'!K29,'T1'!M29,MAX(T3_R1!L29,T3_R2!L29)),COUNTRY_INFO!F29),0)","v":60772},{"$f":"IF(AND(COUNTRY_INFO!J29>1,COUNTRY_INFO!J29<4), IF(V29/COUNTRY_INFO!F29*100<>0, IF(V29/COUNTRY_INFO!F29*100>100,100,V29/COUNTRY_INFO!F29*100), \"-\"),0)","v":95.262877386588087},60772,{"$f":"IF(AND(COUNTRY_INFO!J29>1,COUNTRY_INFO!J29<4), IF(S29/P29*100<>0, IF(X29/P29*100>100,100,X29/P29*100), \"-\"),0)","v":62.127624772536748},{"$f":"COUNTRY_INFO!O29","v":53161.8},null,null,{"$f":"MAX('T1'!L29,'T2'!J29)+MAX('T1'!M29,'T2'!K29)+MAX('T1'!N29,'T2'!L29)","v":16819},{"$f":"IF(COUNTRY_INFO!K29=1,IF(COUNTRY_INFO!F29*0.33>MAX('T1'!M29,'T2'!K29),MAX('T1'!M29,'T2'!K29),COUNTRY_INFO!F29*0.33),IF(COUNTRY_INFO!K29=2,IF(COUNTRY_INFO!F29*0.5>MAX('T1'!M29,'T2'!K29),MAX('T1'!M29,'T2'!K29),COUNTRY_INFO!F29*0.5),IF(COUNTRY_INFO!K29=3,IF(COUNTRY_INFO!F29>MAX('T1'!M29,'T2'!K29),MAX('T1'!M29,'T2'!K29),COUNTRY_INFO!F29),0)))","v":16819},{"$f":"IF(AND(COUNTRY_INFO!K29>0,COUNTRY_INFO!K29<4),IF(Z29>0,IF(COUNTRY_INFO!K29=1, AD29/(COUNTRY_INFO!F29*0.33)*100, IF(COUNTRY_INFO!K29=2, AD29/(COUNTRY_INFO!F29*0.5)*100, IF(COUNTRY_INFO!K29=3, AD29/COUNTRY_INFO!F29*100))),\"-\"),0)","v":52.729096780261465},{"$f":"IF(COUNTRY_INFO!K29=2,IF(COUNTRY_INFO!G29*0.2>MAX('T1'!N29,'T2'!L29),MAX('T1'!N29,'T2'!L29),COUNTRY_INFO!G29*0.2),IF(COUNTRY_INFO!K29=3,IF(COUNTRY_INFO!G29>MAX('T1'!N29,'T2'!L29),MAX('T1'!N29,'T2'!L29),COUNTRY_INFO!G29),0))","v":0},{"$f":"IF(AND(COUNTRY_INFO!K29>0,COUNTRY_INFO!K29<4),IF(Z29>0,IF(COUNTRY_INFO!K29=1, 0, IF(COUNTRY_INFO!K29=2, AF29/(COUNTRY_INFO!G29*0.2)*100, IF(COUNTRY_INFO!K29=3, AF29/COUNTRY_INFO!G29*100))),\"-\"),0)","v":0},16819,{"$f":"IF(AND(COUNTRY_INFO!K29>0,COUNTRY_INFO!K29<4), IF(AC29/Z29*100<>0, IF(AH29/Z29*100>100,100,AH29/Z29*100), \"-\"),0)","v":31.637378719305964},null,{"$f":"IF(AND(D29<>0, D29<>\"Inconnu\",D29<>\"Interrompu\",D29<>\"Non requis\"),D29/COUNTRY_INFO!D29, 0)","v":0},{"$f":"IF(AND(J29<>0,J29<>\"Inconnu\",J29<>\"Interrompu\",J29<>\"Non requis\"),J29/COUNTRY_INFO!D29, 0)","v":0},{"$f":"IF(AND(P29<>0,P29<>\"Inconnu\",P29<>\"Non requis\"),P29/(COUNTRY_INFO!E29+COUNTRY_INFO!F29), 0)","v":1},{"$f":"IF(AND(Z29<>0,Z29<>\"Inconnu\",Z29<>\"Non requis\"),IF(COUNTRY_INFO!K29=1,1,IF(COUNTRY_INFO!K29=2,0.5*COUNTRY_INFO!F29/(0.5*COUNTRY_INFO!F29+0.2*COUNTRY_INFO!G29),IF(COUNTRY_INFO!K29=3,COUNTRY_INFO!F29/(COUNTRY_INFO!F29+COUNTRY_INFO!G29)))),0)","v":0.59999849516005854},{"$f":"IF(AND(Z29<>0,Z29<>\"Inconnu\",Z29<>\"Non requis\"),IF(COUNTRY_INFO!K29=1,0,IF(COUNTRY_INFO!K29=2,0.2*COUNTRY_INFO!G29/(0.5*COUNTRY_INFO!F29+0.2*COUNTRY_INFO!G29),IF(COUNTRY_INFO!K29=3,COUNTRY_INFO!G29/(COUNTRY_INFO!F29+COUNTRY_INFO!G29)))),0)","v":0.40000150483994151},{"$f":"MAX(COUNTRY_INFO!D29*AK29*PROFILE!$G$7,COUNTRY_INFO!D29*AL29*PROFILE!$G$7)","v":0},{"$f":"MAX(COUNTRY_INFO!D29*AK29*PROFILE!$G$8,COUNTRY_INFO!D29*AL29*PROFILE!$G$8,COUNTRY_INFO!D29*AM29*PROFILE!$G$8)","v":34023.568016181096},{"$f":"MAX(COUNTRY_INFO!D29*AK29*PROFILE!$G$9,COUNTRY_INFO!D29*AL29*PROFILE!$G$9,COUNTRY_INFO!D29*AM29*PROFILE!$G$9,IF(AND(DISTRICT!Z29<>\"Inconnu\",Z29<>\"Non requis\"),COUNTRY_INFO!O29*DISTRICT!AN29,0))","v":63794.074875254075},{"$f":"MAX(COUNTRY_INFO!D29*AK29*PROFILE!$G$10,COUNTRY_INFO!D29*AL29*PROFILE!$G$10,IF(AND(DISTRICT!Z29<>\"Inconnu\",Z29<>\"Non requis\"),COUNTRY_INFO!O29*DISTRICT!AO29,0))","v":21264.800000000003},119082.44289143517,"Y",{"$f":"MAX('MDA2'!J29,'T1'!L29,'T2'!J29,T3_R1!K29,T3_R2!K29)","v":0},{"$f":"MAX('MDA1'!K29,'MDA2'!K29,'MDA3'!I29,'MDA3'!L29,'T1'!M29,'T2'!K29,T3_R1!L29,T3_R2!L29)","v":60772},{"$f":"MAX('MDA1'!L29,'MDA2'!L29,'MDA3'!J29,'MDA3'!M29,'T1'!N29,'T2'!L29,T3_R1!M29,T3_R2!M29)","v":0},60772,{"$f":"MAX('MDA2'!J29,T29)","v":0},{"$f":"MAX('MDA1'!K29,'MDA2'!K29,'MDA3'!I29,'MDA3'!L29,V29,AD29)","v":60772},{"$f":"MAX('MDA1'!L29,'MDA2'!L29,'MDA3'!J29,'MDA3'!M29,AF29)","v":0},60772,51.033551650770626]
[{"$f":"IF(COUNTRY_INFO!A30=0,\" \",COUNTRY_INFO!A30)","v":"Togo"},{"$f":"IF(COUNTRY_INFO!B30=0,\" \",COUNTRY_INFO!B30)","v":"MARITIME"},{"$f":"IF(COUNTRY_INFO!C30=0,\" \",COUNTRY_INFO!C30)","v":"VO"},{"$f":"COUNTRY_INFO!L30","v":"Non requis"},null,null,{"$f":"MAX('MDA1'!M30,'MDA2'!M30)","v":0},{"$f":"IF(AND(COUNTRY_INFO!H30>0,COUNTRY_INFO!H30<4),IF(D30>MAX('MDA1'!M30,'MDA2'!M30),MAX('MDA1'!M30,'MDA2'!M30),D30),0)","v":0},{"$f":"IF(AND(COUNTRY_INFO!H30>0,COUNTRY_INFO!H30<4), IF(G30/D30*100<>0, IF(G30/D30*100>100,100,G30/D30*100), \"-\"),0)","v":0},{"$f":"COUNTRY_INFO!M30","v":0},null,null,{"$f":"MAX('MDA1'!M30,MAX('MDA3'!I30,'MDA3'!L30)+MAX('MDA3'!J30,'MDA3'!M30))","v":0},{"$f":"IF(AND(COUNTRY_INFO!I30>0,COUNTRY_INFO!I30<4),IF(J30>MAX('MDA1'!M30,MAX('MDA3'!I30,'MDA3'!L30)+MAX('MDA3'!J30,'MDA3'!M30)),MAX('MDA1'!M30,MAX('MDA3'!I30,'MDA3'!L30)+MAX('MDA3'!J30,'MDA3'!M30)),J30),0)","v":0},{"$f":"IF(AND(COUNTRY_INFO!I30>0,COUNTRY_INFO!I30<4), IF(M30/J30*100<>0, IF(M30/J30*100>100,100,M30/J30*100), \"-\"),0)","v":0},{"$f":"COUNTRY_INFO!N30","v":118473},null,null,{"$f":"SUM(MAX('MDA2'!J30, 'T1'!L30, MAX(T3_R1!K30, T3_R2!K30)), MAX('MDA1'!K30, 'MDA2'!K30, 'T1'!M30, MAX(T3_R1!L30, T3_R2!L30)), MAX('MDA1'!L30, 'MDA2'!L30, 'T1'!N30, MAX(T3_R1!M30, T3_R2!M30)))","v":73828},{"$f":"IF(AND(COUNTRY_INFO!J30>1,COUNTRY_INFO!J30<4),IF(COUNTRY_INFO!E30>MAX('MDA2'!J30,'T1'!L30,MAX(T3_R1!K30,T3_R2!K30)),MAX('MDA2'!J30,'T1'!L30,MAX(T3_R1!K30,T3_R2!K30)),COUNTRY_INFO!E30),0)","v":0},{"$f":"IF(AND(COUNTRY_INFO!J30>1,COUNTRY_INFO!J30<4), IF(T30/COUNTRY_INFO!E30*100<>0, IF(T30/COUNTRY_INFO!E30*100>100,100,T30/COUNTRY_INFO!E30*100), \"-\"),0)","v":"-"},{"$f":"IF(AND(COUNTRY_INFO!J30>1,COUNTRY_INFO!J30<4),IF(COUNTRY_INFO!F30>MAX('MDA1'!K30,'MDA2'!K30,'T1'!M30,MAX(T3_R1!L30,T3_R2!L30)),MAX('MDA1'!K30,'MDA2'!K30,'T1'!M30,MAX(T3_R1!L30,T3_R2!L30)),COUNTRY_INFO!F30),0)","v":73828},{"$f":"IF(AND(COUNTRY_INFO!J30>1,COUNTRY_INFO!J30<4), IF(V30/COUNTRY_INFO!F30*100<>0, IF(V30/COUNTRY_INFO!F30*100>100,100,V30/COUNTRY_INFO!F30*100), \"-\"),0)","v":95.551672814340264},73828,{"$f":"IF(AND(COUNTRY_INFO!J30>1,COUNTRY_INFO!J30<4), IF(S30/P30*100<>0, IF(X30/P30*100>100,100,X30/P30*100), \"-\"),0)","v":62.316308357178428},{"$f":"COUNTRY_INFO!O30","v":64387.5},null,null,{"$f":"MAX('T1'!L30,'T2'!J30)+MAX('T1'!M30,'T2'!K30)+MAX('T1'!N30,'T2'!L30)","v":14702},{"$f":"IF(COUNTRY_INFO!K30=1,IF(COUNTRY_INFO!F30*0.33>MAX('T1'!M30,'T2'!K30),MAX('T1'!M30,'T2'!K30),COUNTRY_INFO!F30*0.33),IF(COUNTRY_INFO!K30=2,IF(COUNTRY_INFO!F30*0.5>MAX('T1'!M30,'T2'!K30),MAX('T1'!M30,'T2'!K30),COUNTRY_INFO!F30*0.5),IF(COUNTRY_INFO!K30=3,IF(COUNTRY_INFO!F30>MAX('T1'!M30,'T2'!K30),MAX('T1'!M30,'T2'!K30),COUNTRY_INFO!F30),0)))","v":14702},{"$f":"IF(AND(COUNTRY_INFO!K30>0,COUNTRY_INFO!K30<4),IF(Z30>0,IF(COUNTRY_INFO!K30=1, AD30/(COUNTRY_INFO!F30*0.33)*100, IF(COUNTRY_INFO!K30=2, AD30/(COUNTRY_INFO!F30*0.5)*100, IF(COUNTRY_INFO!K30=3, AD30/COUNTRY_INFO!F30*100))),\"-\"),0)","v":38.056040898207463},{"$f":"IF(COUNTRY_INFO!K30=2,IF(COUNTRY_INFO!G30*0.2>MAX('T1'!N30,'T2'!L30),MAX('T1'!N30,'T2'!L30),COUNTRY_INFO!G30*0.2),IF(COUNTRY_INFO!K30=3,IF(COUNTRY_INFO!G30>MAX('T1'!N30,'T2'!L30),MAX('T1'!N30,'T2'!L30),COUNTRY_INFO!G30),0))","v":0},{"$f":"IF(AND(COUNTRY_INFO!K30>0,COUNTRY_INFO!K30<4),IF(Z30>0,IF(COUNTRY_INFO!K30=1, 0, IF(COUNTRY_INFO!K30=2, AF30/(COUNTRY_INFO!G30*0.2)*100, IF(COUNTRY_INFO!K30=3, AF30/COUNTRY_INFO!G30*100))),\"-\"),0)","v":0},14702,{"$f":"IF(AND(COUNTRY_INFO!K30>0,COUNTRY_INFO!K30<4), IF(AC30/Z30*100<>0, IF(AH30/Z30*100>100,100,AH30/Z30*100), \"-\"),0)","v":22.833624538924479},null,{"$f":"IF(AND(D30<>0, D30<>\"Inconnu\",D30<>\"Interrompu\",D30<>\"Non requis\"),D30/COUNTRY_INFO!D30, 0)","v":0},{"$f":"IF(AND(J30<>0,J30<>\"Inconnu\",J30<>\"Interrompu\",J30<>\"Non requis\"),J30/COUNTRY_INFO!D30, 0)","v":0},{"$f":"IF(AND(P30<>0,P30<>\"Inconnu\",P30<>\"Non requis\"),P30/(COUNTRY_INFO!E30+COUNTRY_INFO!F30), 0)","v":1},{"$f":"IF(AND(Z30<>0,Z30<>\"Inconnu\",Z30<>\"Non requis\"),IF(COUNTRY_INFO!K30=1,1,IF(COUNTRY_INFO!K30=2,0.5*COUNTRY_INFO!F30/(0.5*COUNTRY_INFO!F30+0.2*COUNTRY_INFO!G30),IF(COUNTRY_INFO!K30=3,COUNTRY_INFO!F30/(COUNTRY_INFO!F30+COUNTRY_INFO!G30)))),0)","v":0.6},{"$f":"IF(AND(Z30<>0,Z30<>\"Inconnu\",Z30<>\"Non requis\"),IF(COUNTRY_INFO!K30=1,0,IF(COUNTRY_INFO!K30=2,0.2*COUNTRY_INFO!G30/(0.5*COUNTRY_INFO!F30+0.2*COUNTRY_INFO!G30),IF(COUNTRY_INFO!K30=3,COUNTRY_INFO!G30/(COUNTRY_INFO!F30+COUNTRY_INFO!G30)))),0)","v":0.4},{"$f":"MAX(COUNTRY_INFO!D30*AK30*PROFILE!$G$7,COUNTRY_INFO!D30*AL30*PROFILE!$G$7)","v":0},{"$f":"MAX(COUNTRY_INFO!D30*AK30*PROFILE!$G$8,COUNTRY_INFO!D30*AL30*PROFILE!$G$8,COUNTRY_INFO!D30*AM30*PROFILE!$G$8)","v":41208.058155381652},{"$f":"MAX(COUNTRY_INFO!D30*AK30*PROFILE!$G$9,COUNTRY_INFO!D30*AL30*PROFILE!$G$9,COUNTRY_INFO!D30*AM30*PROFILE!$G$9,IF(AND(DISTRICT!Z30<>\"Inconnu\",Z30<>\"Non requis\"),COUNTRY_INFO!O30*DISTRICT!AN30,0))","v":77264.96956985844},{"$f":"MAX(COUNTRY_INFO!D30*AK30*PROFILE!$G$10,COUNTRY_INFO!D30*AL30*PROFILE!$G$10,IF(AND(DISTRICT!Z30<>\"Inconnu\",Z30<>\"Non requis\"),COUNTRY_INFO!O30*DISTRICT!AO30,0))","v":25755},144228.0277252401,"Y",{"$f":"MAX('MDA2'!J30,'T1'!L30,'T2'!J30,T3_R1!K30,T3_R2!K30)","v":0},{"$f":"MAX('MDA1'!K30,'MDA2'!K30,'MDA3'!I30,'MDA3'!L30,'T1'!M30,'T2'!K30,T3_R1!L30,T3_R2!L30)","v":73828},{"$f":"MAX('MDA1'!L30,'MDA2'!L30,'MDA3'!J30,'MDA3'!M30,'T1'!N30,'T2'!L30,T3_R1!M30,T3_R2!M30)","v":0},73828,{"$f":"MAX('MDA2'!J30,T30)","v":0},{"$f":"MAX('MDA1'!K30,'MDA2'!K30,'MDA3'!I30,'MDA3'!L30,V30,AD30)","v":73828},{"$f":"MAX('MDA1'!L30,'MDA2'!L30,'MDA3'!J30,'MDA3'!M30,AF30)","v":0},73828,51.188386310492405]
[{"$f":"IF(COUNTRY_INFO!A31=0,\" \",COUNTRY_INFO!A31)","v":"Togo"},{"$f":"IF(COUNTRY_INFO!B31=0,\" \",COUNTRY_INFO!B31)","v":"MARITIME"},{"$f":"IF(COUNTRY_INFO!C31=0,\" \",COUNTRY_INFO!C31)","v":"YOTO"},{"$f":"COUNTRY_INFO!L31","v":"Non requis"},null,null,{"$f":"MAX('MDA1'!M31,'MDA2'!M31)","v":0},{"$f":"IF(AND(COUNTRY_INFO!H31>0,COUNTRY_INFO!H31<4),IF(D31>MAX('MDA1'!M31,'MDA2'!M31),MAX('MDA1'!M31,'MDA2'!M31),D31),0)","v":0},{"$f":"IF(AND(COUNTRY_INFO!H31>0,COUNTRY_INFO!H31<4), IF(G31/D31*100<>0, IF(G31/D31*100>100,100,G31/D31*100), \"-\"),0)","v":0},{"$f":"COUNTRY_INFO!M31","v":166459},null,null,{"$f":"MAX('MDA1'!M31,MAX('MDA3'!I31,'MDA3'!L31)+MAX('MDA3'!J31,'MDA3'!M31))","v":134015},{"$f":"IF(AND(COUNTRY_INFO!I31>0,COUNTRY_INFO!I31<4),IF(J31>MAX('MDA1'!M31,MAX('MDA3'!I31,'MDA3'!L31)+MAX('MDA3'!J31,'MDA3'!M31)),MAX('MDA1'!M31,MAX('MDA3'!I31,'MDA3'!L31)+MAX('MDA3'!J31,'MDA3'!M31)),J31),0)","v":134015},{"$f":"IF(AND(COUNTRY_INFO!I31>0,COUNTRY_INFO!I31<4), IF(M31/J31*100<>0, IF(M31/J31*100>100,100,M31/J31*100), \"-\"),0)","v":80.509314605999066},{"$f":"COUNTRY_INFO!N31","v":93323},null,null,{"$f":"SUM(MAX('MDA2'!J31, 'T1'!L31, MAX(T3_R1!K31, T3_R2!K31)), MAX('MDA1'!K31, 'MDA2'!K31, 'T1'!M31, MAX(T3_R1!L31, T3_R2!L31)), MAX('MDA1'!L31, 'MDA2'!L31, 'T1'!N31, MAX(T3_R1!M31, T3_R2!M31)))","v":86783},{"$f":"IF(AND(COUNTRY_INFO!J31>1,COUNTRY_INFO!J31<4),IF(COUNTRY_INFO!E31>MAX('MDA2'!J31,'T1'!L31,MAX(T3_R1!K31,T3_R2!K31)),MAX('MDA2'!J31,'T1'!L31,MAX(T3_R1!K31,T3_R2!K31)),COUNTRY_INFO!E31),0)","v":0},{"$f":"IF(AND(COUNTRY_INFO!J31>1,COUNTRY_INFO!J31<4), IF(T31/COUNTRY_INFO!E31*100<>0, IF(T31/COUNTRY_INFO!E31*100>100,100,T31/COUNTRY_INFO!E31*100), \"-\"),0)","v":"-"},{"$f":"IF(AND(COUNTRY_INFO!J31>1,COUNTRY_INFO!J31<4),IF(COUNTRY_INFO!F31>MAX('MDA1'!K31,'MDA2'!K31,'T1'!M31,MAX(T3_R1!L31,T3_R2!L31)),MAX('MDA1'!K31,'MDA2'!K31,'T1'!M31,MAX(T3_R1!L31,T3_R2!L31)),COUNTRY_INFO!F31),0)","v":60863},{"$f":"IF(AND(COUNTRY_INFO!J31>1,COUNTRY_INFO!J31<4), IF(V31/COUNTRY_INFO!F31*100<>0, IF(V31/COUNTRY_INFO!F31*100>100,100,V31/COUNTRY_INFO!F31*100), \"-\"),0)","v":100},60863,{"$f":"IF(AND(COUNTRY_INFO!J31>1,COUNTRY_INFO!J31<4), IF(S31/P31*100<>0, IF(X31/P31*100>100,100,X31/P31*100), \"-\"),0)","v":65.217577660383824},{"$f":"COUNTRY_INFO!O31","v":50719.100000000006},null,null,{"$f":"MAX('T1'!L31,'T2'!J31)+MAX('T1'!M31,'T2'!K31)+MAX('T1'!N31,'T2'!L31)","v":0},{"$f":"IF(COUNTRY_INFO!K31=1,IF(COUNTRY_INFO!F31*0.33>MAX('T1'!M31,'T2'!K31),MAX('T1'!M31,'T2'!K31),COUNTRY_INFO!F31*0.33),IF(COUNTRY_INFO!K31=2,IF(COUNTRY_INFO!F31*0.5>MAX('T1'!M31,'T2'!K31),MAX('T1'!M31,'T2'!K31),COUNTRY_INFO!F31*0.5),IF(COUNTRY_INFO!K31=3,IF(COUNTRY_INFO!F31>MAX('T1'!M31,'T2'!K31),MAX('T1'!M31,'T2'!K31),COUNTRY_INFO!F31),0)))","v":0},{"$f":"IF(AND(COUNTRY_INFO!K31>0,COUNTRY_INFO!K31<4),IF(Z31>0,IF(COUNTRY_INFO!K31=1, AD31/(COUNTRY_INFO!F31*0.33)*100, IF(COUNTRY_INFO!K31=2, AD31/(COUNTRY_INFO!F31*0.5)*100, IF(COUNTRY_INFO!K31=3, AD31/COUNTRY_INFO!F31*100))),\"-\"),0)","v":0},{"$f":"IF(COUNTRY_INFO!K31=2,IF(COUNTRY_INFO!G31*0.2>MAX('T1'!N31,'T2'!L31),MAX('T1'!N31,'T2'!L31),COUNTRY_INFO!G31*0.2),IF(COUNTRY_INFO!K31=3,IF(COUNTRY_INFO!G31>MAX('T1'!N31,'T2'!L31),MAX('T1'!N31,'T2'!L31),COUNTRY_INFO!G31),0))","v":0},{"$f":"IF(AND(COUNTRY_INFO!K31>0,COUNTRY_INFO!K31<4),IF(Z31>0,IF(COUNTRY_INFO!K31=1, 0, IF(COUNTRY_INFO!K31=2, AF31/(COUNTRY_INFO!G31*0.2)*100, IF(COUNTRY_INFO!K31=3, AF31/COUNTRY_INFO!G31*100))),\"-\"),0)","v":0},0,{"$f":"IF(AND(COUNTRY_INFO!K31>0,COUNTRY_INFO!K31<4), IF(AC31/Z31*100<>0, IF(AH31/Z31*100>100,100,AH31/Z31*100), \"-\"),0)","v":"-"},null,{"$f":"IF(AND(D31<>0, D31<>\"Inconnu\",D31<>\"Interrompu\",D31<>\"Non requis\"),D31/COUNTRY_INFO!D31, 0)","v":0},{"$f":"IF(AND(J31<>0,J31<>\"Inconnu\",J31<>\"Interrompu\",J31<>\"Non requis\"),J31/COUNTRY_INFO!D31, 0)","v":0.82050030807147256},{"$f":"IF(AND(P31<>0,P31<>\"Inconnu\",P31<>\"Non requis\"),P31/(COUNTRY_INFO!E31+COUNTRY_INFO!F31), 0)","v":1},{"$f":"IF(AND(Z31<>0,Z31<>\"Inconnu\",Z31<>\"Non requis\"),IF(COUNTRY_INFO!K31=1,1,IF(COUNTRY_INFO!K31=2,0.5*COUNTRY_INFO!F31/(0.5*COUNTRY_INFO!F31+0.2*COUNTRY_INFO!G31),IF(COUNTRY_INFO!K31=3,COUNTRY_INFO!F31/(COUNTRY_INFO!F31+COUNTRY_INFO!G31)))),0)","v":0.60000078865752737},{"$f":"IF(AND(Z31<>0,Z31<>\"Inconnu\",Z31<>\"Non requis\"),IF(COUNTRY_INFO!K31=1,0,IF(COUNTRY_INFO!K31=2,0.2*COUNTRY_INFO!G31/(0.5*COUNTRY_INFO!F31+0.2*COUNTRY_INFO!G31),IF(COUNTRY_INFO!K31=3,COUNTRY_INFO!G31/(COUNTRY_INFO!F31+COUNTRY_INFO!G31)))),0)","v":0.39999921134247257},{"$f":"MAX(COUNTRY_INFO!D31*AK31*PROFILE!$G$7,COUNTRY_INFO!D31*AL31*PROFILE!$G$7)","v":6658.134479052439},{"$f":"MAX(COUNTRY_INFO!D31*AK31*PROFILE!$G$8,COUNTRY_INFO!D31*AL31*PROFILE!$G$8,COUNTRY_INFO!D31*AM31*PROFILE!$G$8)","v":32460.045809641051},{"$f":"MAX(COUNTRY_INFO!D31*AK31*PROFILE!$G$9,COUNTRY_INFO!D31*AL31*PROFILE!$G$9,COUNTRY_INFO!D31*AM31*PROFILE!$G$9,IF(AND(DISTRICT!Z31<>\"Inconnu\",Z31<>\"Non requis\"),COUNTRY_INFO!O31*DISTRICT!AN31,0))","v":60862.476029838981},{"$f":"MAX(COUNTRY_INFO!D31*AK31*PROFILE!$G$10,COUNTRY_INFO!D31*AL31*PROFILE!$G$10,IF(AND(DISTRICT!Z31<>\"Inconnu\",Z31<>\"Non requis\"),COUNTRY_INFO!O31*DISTRICT!AO31,0))","v":83229.707601647475},183210.36392017995,0,{"$f":"MAX('MDA2'!J31,'T1'!L31,'T2'!J31,T3_R1!K31,T3_R2!K31)","v":0},{"$f":"MAX('MDA1'!K31,'MDA2'!K31,'MDA3'!I31,'MDA3'!L31,'T1'!M31,'T2'!K31,T3_R1!L31,T3_R2!L31)","v":86783},{"$f":"MAX('MDA1'!L31,'MDA2'!L31,'MDA3'!J31,'MDA3'!M31,'T1'!N31,'T2'!L31,T3_R1!M31,T3_R2!M31)","v":79172},165955,{"$f":"MAX('MDA2'!J31,T31)","v":0},{"$f":"MAX('MDA1'!K31,'MDA2'!K31,'MDA3'!I31,'MDA3'!L31,V31,AD31)","v":60863},{"$f":"MAX('MDA1'!L31,'MDA2'!L31,'MDA3'!J31,'MDA3'!M31,AF31)","v":79172},140035,76.433994782636674]
[{"$f":"IF(COUNTRY_INFO!A32=0,\" \",COUNTRY_INFO!A32)","v":"Togo"},{"$f":"IF(COUNTRY_INFO!B32=0,\" \",COUNTRY_INFO!B32)","v":"MARITIME"},{"$f":"IF(COUNTRY_INFO!C32=0,\" \",COUNTRY_INFO!C32)","v":"ZIO"},{"$f":"COUNTRY_INFO!L32","v":"Non requis"},null,null,{"$f":"MAX('MDA1'!M32,'MDA2'!M32)","v":0},{"$f":"IF(AND(COUNTRY_INFO!H32>0,COUNTRY_INFO!H32<4),IF(D32>MAX('MDA1'!M32,'MDA2'!M32),MAX('MDA1'!M32,'MDA2'!M32),D32),0)","v":0},{"$f":"IF(AND(COUNTRY_INFO!H32>0,COUNTRY_INFO!H32<4), IF(G32/D32*100<>0, IF(G32/D32*100>100,100,G32/D32*100), \"-\"),0)","v":0},{"$f":"COUNTRY_INFO!M32","v":253117},null,null,{"$f":"MAX('MDA1'!M32,MAX('MDA3'!I32,'MDA3'!L32)+MAX('MDA3'!J32,'MDA3'!M32))","v":209704},{"$f":"IF(AND(COUNTRY_INFO!I32>0,COUNTRY_INFO!I32<4),IF(J32>MAX('MDA1'!M32,MAX('MDA3'!I32,'MDA3'!L32)+MAX('MDA3'!J32,'MDA3'!M32)),MAX('MDA1'!M32,MAX('MDA3'!I32,'MDA3'!L32)+MAX('MDA3'!J32,'MDA3'!M32)),J32),0)","v":209704},{"$f":"IF(AND(COUNTRY_INFO!I32>0,COUNTRY_INFO!I32<4), IF(M32/J32*100<>0, IF(M32/J32*100>100,100,M32/J32*100), \"-\"),0)","v":82.84864311760964},{"$f":"COUNTRY_INFO!N32","v":168628},null,null,{"$f":"SUM(MAX('MDA2'!J32, 'T1'!L32, MAX(T3_R1!K32, T3_R2!K32)), MAX('MDA1'!K32, 'MDA2'!K32, 'T1'!M32, MAX(T3_R1!L32, T3_R2!L32)), MAX('MDA1'!L32, 'MDA2'!L32, 'T1'!N32, MAX(T3_R1!M32, T3_R2!M32)))","v":132017},{"$f":"IF(AND(COUNTRY_INFO!J32>1,COUNTRY_INFO!J32<4),IF(COUNTRY_INFO!E32>MAX('MDA2'!J32,'T1'!L32,MAX(T3_R1!K32,T3_R2!K32)),MAX('MDA2'!J32,'T1'!L32,MAX(T3_R1!K32,T3_R2!K32)),COUNTRY_INFO!E32),0)","v":0},{"$f":"IF(AND(COUNTRY_INFO!J32>1,COUNTRY_INFO!J32<4), IF(T32/COUNTRY_INFO!E32*100<>0, IF(T32/COUNTRY_INFO!E32*100>100,100,T32/COUNTRY_INFO!E32*100), \"-\"),0)","v":"-"},{"$f":"IF(AND(COUNTRY_INFO!J32>1,COUNTRY_INFO!J32<4),IF(COUNTRY_INFO!F32>MAX('MDA1'!K32,'MDA2'!K32,'T1'!M32,MAX(T3_R1!L32,T3_R2!L32)),MAX('MDA1'!K32,'MDA2'!K32,'T1'!M32,MAX(T3_R1!L32,T3_R2!L32)),COUNTRY_INFO!F32),0)","v":109975},{"$f":"IF(AND(COUNTRY_INFO!J32>1,COUNTRY_INFO!J32<4), IF(V32/COUNTRY_INFO!F32*100<>0, IF(V32/COUNTRY_INFO!F32*100>100,100,V32/COUNTRY_INFO!F32*100), \"-\"),0)","v":100},109975,{"$f":"IF(AND(COUNTRY_INFO!J32>1,COUNTRY_INFO!J32<4), IF(S32/P32*100<>0, IF(X32/P32*100>100,100,X32/P32*100), \"-\"),0)","v":65.217520222027176},{"$f":"COUNTRY_INFO!O32","v":91645.9},null,null,{"$f":"MAX('T1'!L32,'T2'!J32)+MAX('T1'!M32,'T2'!K32)+MAX('T1'!N32,'T2'!L32)","v":63985},{"$f":"IF(COUNTRY_INFO!K32=1,IF(COUNTRY_INFO!F32*0.33>MAX('T1'!M32,'T2'!K32),MAX('T1'!M32,'T2'!K32),COUNTRY_INFO!F32*0.33),IF(COUNTRY_INFO!K32=2,IF(COUNTRY_INFO!F32*0.5>MAX('T1'!M32,'T2'!K32),MAX('T1'!M32,'T2'!K32),COUNTRY_INFO!F32*0.5),IF(COUNTRY_INFO!K32=3,IF(COUNTRY_INFO!F32>MAX('T1'!M32,'T2'!K32),MAX('T1'!M32,'T2'!K32),COUNTRY_INFO!F32),0)))","v":54987.5},{"$f":"IF(AND(COUNTRY_INFO!K32>0,COUNTRY_INFO!K32<4),IF(Z32>0,IF(COUNTRY_INFO!K32=1, AD32/(COUNTRY_INFO!F32*0.33)*100, IF(COUNTRY_INFO!K32=2, AD32/(COUNTRY_INFO!F32*0.5)*100, IF(COUNTRY_INFO!K32=3, AD32/COUNTRY_INFO!F32*100))),\"-\"),0)","v":100},{"$f":"IF(COUNTRY_INFO!K32=2,IF(COUNTRY_INFO!G32*0.2>MAX('T1'!N32,'T2'!L32),MAX('T1'!N32,'T2'!L32),COUNTRY_INFO!G32*0.2),IF(COUNTRY_INFO!K32=3,IF(COUNTRY_INFO!G32>MAX('T1'!N32,'T2'!L32),MAX('T1'!N32,'T2'!L32),COUNTRY_INFO!G32),0))","v":0},{"$f":"IF(AND(COUNTRY_INFO!K32>0,COUNTRY_INFO!K32<4),IF(Z32>0,IF(COUNTRY_INFO!K32=1, 0, IF(COUNTRY_INFO!K32=2, AF32/(COUNTRY_INFO!G32*0.2)*100, IF(COUNTRY_INFO!K32=3, AF32/COUNTRY_INFO!G32*100))),\"-\"),0)","v":0},54987.5,{"$f":"IF(AND(COUNTRY_INFO!K32>0,COUNTRY_INFO!K32<4), IF(AC32/Z32*100<>0, IF(AH32/Z32*100>100,100,AH32/Z32*100), \"-\"),0)","v":59.999956353748509},null,{"$f":"IF(AND(D32<>0, D32<>\"Inconnu\",D32<>\"Interrompu\",D32<>\"Non requis\"),D32/COUNTRY_INFO!D32, 0)","v":0},{"$f":"IF(AND(J32<>0,J32<>\"Inconnu\",J32<>\"Interrompu\",J32<>\"Non requis\"),J32/COUNTRY_INFO!D32, 0)","v":0.69047476158261134},{"$f":"IF(AND(P32<>0,P32<>\"Inconnu\",P32<>\"Non requis\"),P32/(COUNTRY_INFO!E32+COUNTRY_INFO!F32), 0)","v":1},{"$f":"IF(AND(Z32<>0,Z32<>\"Inconnu\",Z32<>\"Non requis\"),IF(COUNTRY_INFO!K32=1,1,IF(COUNTRY_INFO!K32=2,0.5*COUNTRY_INFO!F32/(0.5*COUNTRY_INFO!F32+0.2*COUNTRY_INFO!G32),IF(COUNTRY_INFO!K32=3,COUNTRY_INFO!F32/(COUNTRY_INFO!F32+COUNTRY_INFO!G32)))),0)","v":0.59999956353748507},{"$f":"IF(AND(Z32<>0,Z32<>\"Inconnu\",Z32<>\"Non requis\"),IF(COUNTRY_INFO!K32=1,0,IF(COUNTRY_INFO!K32=2,0.2*COUNTRY_INFO!G32/(0.5*COUNTRY_INFO!F32+0.2*COUNTRY_INFO!G32),IF(COUNTRY_INFO!K32=3,COUNTRY_INFO!G32/(COUNTRY_INFO!F32+COUNTRY_INFO!G32)))),0)","v":0.40000043646251499},{"$f":"MAX(COUNTRY_INFO!D32*AK32*PROFILE!$G$7,COUNTRY_INFO!D32*AL32*PROFILE!$G$7)","v":10124.337073599601},{"$f":"MAX(COUNTRY_INFO!D32*AK32*PROFILE!$G$8,COUNTRY_INFO!D32*AL32*PROFILE!$G$8,COUNTRY_INFO!D32*AM32*PROFILE!$G$8)","v":58653.522775509329},{"$f":"MAX(COUNTRY_INFO!D32*AK32*PROFILE!$G$9,COUNTRY_INFO!D32*AL32*PROFILE!$G$9,COUNTRY_INFO!D32*AM32*PROFILE!$G$9,IF(AND(DISTRICT!Z32<>\"Inconnu\",Z32<>\"Non requis\"),COUNTRY_INFO!O32*DISTRICT!AN32,0))","v":109975.15668723348},{"$f":"MAX(COUNTRY_INFO!D32*AK32*PROFILE!$G$10,COUNTRY_INFO!D32*AL32*PROFILE!$G$10,IF(AND(DISTRICT!Z32<>\"Inconnu\",Z32<>\"Non requis\"),COUNTRY_INFO!O32*DISTRICT!AO32,0))","v":126558.81567837247},305311.8322147149,"Y",{"$f":"MAX('MDA2'!J32,'T1'!L32,'T2'!J32,T3_R1!K32,T3_R2!K32)","v":0},{"$f":"MAX('MDA1'!K32,'MDA2'!K32,'MDA3'!I32,'MDA3'!L32,'T1'!M32,'T2'!K32,T3_R1!L32,T3_R2!L32)","v":132017},{"$f":"MAX('MDA1'!L32,'MDA2'!L32,'MDA3'!J32,'MDA3'!M32,'T1'!N32,'T2'!L32,T3_R1!M32,T3_R2!M32)","v":133605},265622,{"$f":"MAX('MDA2'!J32,T32)","v":0},{"$f":"MAX('MDA1'!K32,'MDA2'!K32,'MDA3'!I32,'MDA3'!L32,V32,AD32)","v":109975},{"$f":"MAX('MDA1'!L32,'MDA2'!L32,'MDA3'!J32,'MDA3'!M32,AF32)","v":133605},243580,79.780727210303098]
[{"$f":"IF(COUNTRY_INFO!A33=0,\" \",COUNTRY_INFO!A33)","v":"Togo"},{"$f":"IF(COUNTRY_INFO!B33=0,\" \",COUNTRY_INFO!B33)","v":"PLATEAUX"},{"$f":"IF(COUNTRY_INFO!C33=0,\" \",COUNTRY_INFO!C33)","v":"AGOU"},{"$f":"COUNTRY_INFO!L33","v":"Non requis"},null,null,{"$f":"MAX('MDA1'!M33,'MDA2'!M33)","v":0},{"$f":"IF(AND(COUNTRY_INFO!H33>0,COUNTRY_INFO!H33<4),IF(D33>MAX('MDA1'!M33,'MDA2'!M33),MAX('MDA1'!M33,'MDA2'!M33),D33),0)","v":0},{"$f":"IF(AND(COUNTRY_INFO!H33>0,COUNTRY_INFO!H33<4), IF(G33/D33*100<>0, IF(G33/D33*100>100,100,G33/D33*100), \"-\"),0)","v":0},{"$f":"COUNTRY_INFO!M33","v":76657},null,null,{"$f":"MAX('MDA1'!M33,MAX('MDA3'!I33,'MDA3'!L33)+MAX('MDA3'!J33,'MDA3'!M33))","v":62657},{"$f":"IF(AND(COUNTRY_INFO!I33>0,COUNTRY_INFO!I33<4),IF(J33>MAX('MDA1'!M33,MAX('MDA3'!I33,'MDA3'!L33)+MAX('MDA3'!J33,'MDA3'!M33)),MAX('MDA1'!M33,MAX('MDA3'!I33,'MDA3'!L33)+MAX('MDA3'!J33,'MDA3'!M33)),J33),0)","v":62657},{"$f":"IF(AND(COUNTRY_INFO!I33>0,COUNTRY_INFO!I33<4), IF(M33/J33*100<>0, IF(M33/J33*100>100,100,M33/J33*100), \"-\"),0)","v":81.736827686969221},{"$f":"COUNTRY_INFO!N33","v":48246},null,null,{"$f":"SUM(MAX('MDA2'!J33, 'T1'!L33, MAX(T3_R1!K33, T3_R2!K33)), MAX('MDA1'!K33, 'MDA2'!K33, 'T1'!M33, MAX(T3_R1!L33, T3_R2!L33)), MAX('MDA1'!L33, 'MDA2'!L33, 'T1'!N33, MAX(T3_R1!M33, T3_R2!M33)))","v":31354},{"$f":"IF(AND(COUNTRY_INFO!J33>1,COUNTRY_INFO!J33<4),IF(COUNTRY_INFO!E33>MAX('MDA2'!J33,'T1'!L33,MAX(T3_R1!K33,T3_R2!K33)),MAX('MDA2'!J33,'T1'!L33,MAX(T3_R1!K33,T3_R2!K33)),COUNTRY_INFO!E33),0)","v":0},{"$f":"IF(AND(COUNTRY_INFO!J33>1,COUNTRY_INFO!J33<4), IF(T33/COUNTRY_INFO!E33*100<>0, IF(T33/COUNTRY_INFO!E33*100>100,100,T33/COUNTRY_INFO!E33*100), \"-\"),0)","v":"-"},{"$f":"IF(AND(COUNTRY_INFO!J33>1,COUNTRY_INFO!J33<4),IF(COUNTRY_INFO!F33>MAX('MDA1'!K33,'MDA2'!K33,'T1'!M33,MAX(T3_R1!L33,T3_R2!L33)),MAX('MDA1'!K33,'MDA2'!K33,'T1'!M33,MAX(T3_R1!L33,T3_R2!L33)),COUNTRY_INFO!F33),0)","v":31354},{"$f":"IF(AND(COUNTRY_INFO!J33>1,COUNTRY_INFO!J33<4), IF(V33/COUNTRY_INFO!F33*100<>0, IF(V33/COUNTRY_INFO!F33*100>100,100,V33/COUNTRY_INFO!F33*100), \"-\"),0)","v":99.647227077705395},31354,{"$f":"IF(AND(COUNTRY_INFO!J33>1,COUNTRY_INFO!J33<4), IF(S33/P33*100<>0, IF(X33/P33*100>100,100,X33/P33*100), \"-\"),0)","v":64.987771006922856},{"$f":"COUNTRY_INFO!O33","v":83906},null,null,{"$f":"MAX('T1'!L33,'T2'!J33)+MAX('T1'!M33,'T2'!K33)+MAX('T1'!N33,'T2'!L33)","v":5080},{"$f":"IF(COUNTRY_INFO!K33=1,IF(COUNTRY_INFO!F33*0.33>MAX('T1'!M33,'T2'!K33),MAX('T1'!M33,'T2'!K33),COUNTRY_INFO!F33*0.33),IF(COUNTRY_INFO!K33=2,IF(COUNTRY_INFO!F33*0.5>MAX('T1'!M33,'T2'!K33),MAX('T1'!M33,'T2'!K33),COUNTRY_INFO!F33*0.5),IF(COUNTRY_INFO!K33=3,IF(COUNTRY_INFO!F33>MAX('T1'!M33,'T2'!K33),MAX('T1'!M33,'T2'!K33),COUNTRY_INFO!F33),0)))","v":5080},{"$f":"IF(AND(COUNTRY_INFO!K33>0,COUNTRY_INFO!K33<4),IF(Z33>0,IF(COUNTRY_INFO!K33=1, AD33/(COUNTRY_INFO!F33*0.33)*100, IF(COUNTRY_INFO!K33=2, AD33/(COUNTRY_INFO!F33*0.5)*100, IF(COUNTRY_INFO!K33=3, AD33/COUNTRY_INFO!F33*100))),\"-\"),0)","v":16.14492293023995},{"$f":"IF(COUNTRY_INFO!K33=2,IF(COUNTRY_INFO!G33*0.2>MAX('T1'!N33,'T2'!L33),MAX('T1'!N33,'T2'!L33),COUNTRY_INFO!G33*0.2),IF(COUNTRY_INFO!K33=3,IF(COUNTRY_INFO!G33>MAX('T1'!N33,'T2'!L33),MAX('T1'!N33,'T2'!L33),COUNTRY_INFO!G33),0))","v":0},{"$f":"IF(AND(COUNTRY_INFO!K33>0,COUNTRY_INFO!K33<4),IF(Z33>0,IF(COUNTRY_INFO!K33=1, 0, IF(COUNTRY_INFO!K33=2, AF33/(COUNTRY_INFO!G33*0.2)*100, IF(COUNTRY_INFO!K33=3, AF33/COUNTRY_INFO!G33*100))),\"-\"),0)","v":0},5080,{"$f":"IF(AND(COUNTRY_INFO!K33>0,COUNTRY_INFO!K33<4), IF(AC33/Z33*100<>0, IF(AH33/Z33*100>100,100,AH33/Z33*100), \"-\"),0)","v":6.0543942030367317},null,{"$f":"IF(AND(D33<>0, D33<>\"Inconnu\",D33<>\"Interrompu\",D33<>\"Non requis\"),D33/COUNTRY_INFO!D33, 0)","v":0},{"$f":"IF(AND(J33<>0,J33<>\"Inconnu\",J33<>\"Interrompu\",J33<>\"Non requis\"),J33/COUNTRY_INFO!D33, 0)","v":0.73088804561316523},{"$f":"IF(AND(P33<>0,P33<>\"Inconnu\",P33<>\"Non requis\"),P33/(COUNTRY_INFO!E33+COUNTRY_INFO!F33), 0)","v":1},{"$f":"IF(AND(Z33<>0,Z33<>\"Inconnu\",Z33<>\"Non requis\"),IF(COUNTRY_INFO!K33=1,1,IF(COUNTRY_INFO!K33=2,0.5*COUNTRY_INFO!F33/(0.5*COUNTRY_INFO!F33+0.2*COUNTRY_INFO!G33),IF(COUNTRY_INFO!K33=3,COUNTRY_INFO!F33/(COUNTRY_INFO!F33+COUNTRY_INFO!G33)))),0)","v":0.37500297952470624},{"$f":"IF(AND(Z33<>0,Z33<>\"Inconnu\",Z33<>\"Non requis\"),IF(COUNTRY_INFO!K33=1,0,IF(COUNTRY_INFO!K33=2,0.2*COUNTRY_INFO!G33/(0.5*COUNTRY_INFO!F33+0.2*COUNTRY_INFO!G33),IF(COUNTRY_INFO!K33=3,COUNTRY_INFO!G33/(COUNTRY_INFO!F33+COUNTRY_INFO!G33)))),0)","v":0.62499702047529382},{"$f":"MAX(COUNTRY_INFO!D33*AK33*PROFILE!$G$7,COUNTRY_INFO!D33*AL33*PROFILE!$G$7)","v":3066.1761440398104},{"$f":"MAX(COUNTRY_INFO!D33*AK33*PROFILE!$G$8,COUNTRY_INFO!D33*AL33*PROFILE!$G$8,COUNTRY_INFO!D33*AM33*PROFILE!$G$8)","v":16781.143682596539},{"$f":"MAX(COUNTRY_INFO!D33*AK33*PROFILE!$G$9,COUNTRY_INFO!D33*AL33*PROFILE!$G$9,COUNTRY_INFO!D33*AM33*PROFILE!$G$9,IF(AND(DISTRICT!Z33<>\"Inconnu\",Z33<>\"Non requis\"),COUNTRY_INFO!O33*DISTRICT!AN33,0))","v":31465},{"$f":"MAX(COUNTRY_INFO!D33*AK33*PROFILE!$G$10,COUNTRY_INFO!D33*AL33*PROFILE!$G$10,IF(AND(DISTRICT!Z33<>\"Inconnu\",Z33<>\"Non requis\"),COUNTRY_INFO!O33*DISTRICT!AO33,0))","v":52441},103753.31982663635,"Y",{"$f":"MAX('MDA2'!J33,'T1'!L33,'T2'!J33,T3_R1!K33,T3_R2!K33)","v":0},{"$f":"MAX('MDA1'!K33,'MDA2'!K33,'MDA3'!I33,'MDA3'!L33,'T1'!M33,'T2'!K33,T3_R1!L33,T3_R2!L33)","v":31354},{"$f":"MAX('MDA1'!L33,'MDA2'!L33,'MDA3'!J33,'MDA3'!M33,'T1'!N33,'T2'!L33,T3_R1!M33,T3_R2!M33)","v":39564},70918,{"$f":"MAX('MDA2'!J33,T33)","v":0},{"$f":"MAX('MDA1'!K33,'MDA2'!K33,'MDA3'!I33,'MDA3'!L33,V33,AD33)","v":31354},{"$f":"MAX('MDA1'!L33,'MDA2'!L33,'MDA3'!J33,'MDA3'!M33,AF33)","v":39564},70918,68.352511629023923]
[{"$f":"IF(COUNTRY_INFO!A34=0,\" \",COUNTRY_INFO!A34)","v":"Togo"},{"$f":"IF(COUNTRY_INFO!B34=0,\" \",COUNTRY_INFO!B34)","v":"PLATEAUX"},{"$f":"IF(COUNTRY_INFO!C34=0,\" \",COUNTRY_INFO!C34)","v":"AKEBOU"},{"$f":"COUNTRY_INFO!L34","v":"Non requis"},null,null,{"$f":"MAX('MDA1'!M34,'MDA2'!M34)","v":0},{"$f":"IF(AND(COUNTRY_INFO!H34>0,COUNTRY_INFO!H34<4),IF(D34>MAX('MDA1'!M34,'MDA2'!M34),MAX('MDA1'!M34,'MDA2'!M34),D34),0)","v":0},{"$f":"IF(AND(COUNTRY_INFO!H34>0,COUNTRY_INFO!H34<4), IF(G34/D34*100<>0, IF(G34/D34*100>100,100,G34/D34*100), \"-\"),0)","v":0},{"$f":"COUNTRY_INFO!M34","v":67892},null,null,{"$f":"MAX('MDA1'!M34,MAX('MDA3'!I34,'MDA3'!L34)+MAX('MDA3'!J34,'MDA3'!M34))","v":55260},{"$f":"IF(AND(COUNTRY_INFO!I34>0,COUNTRY_INFO!I34<4),IF(J34>MAX('MDA1'!M34,MAX('MDA3'!I34,'MDA3'!L34)+MAX('MDA3'!J34,'MDA3'!M34)),MAX('MDA1'!M34,MAX('MDA3'!I34,'MDA3'!L34)+MAX('MDA3'!J34,'MDA3'!M34)),J34),0)","v":55260},{"$f":"IF(AND(COUNTRY_INFO!I34>0,COUNTRY_INFO!I34<4), IF(M34/J34*100<>0, IF(M34/J34*100>100,100,M34/J34*100), \"-\"),0)","v":81.393978672008487},{"$f":"COUNTRY_INFO!N34","v":0},null,null,{"$f":"SUM(MAX('MDA2'!J34, 'T1'!L34, MAX(T3_R1!K34, T3_R2!K34)), MAX('MDA1'!K34, 'MDA2'!K34, 'T1'!M34, MAX(T3_R1!L34, T3_R2!L34)), MAX('MDA1'!L34, 'MDA2'!L34, 'T1'!N34, MAX(T3_R1!M34, T3_R2!M34)))","v":21568},{"$f":"IF(AND(COUNTRY_INFO!J34>1,COUNTRY_INFO!J34<4),IF(COUNTRY_INFO!E34>MAX('MDA2'!J34,'T1'!L34,MAX(T3_R1!K34,T3_R2!K34)),MAX('MDA2'!J34,'T1'!L34,MAX(T3_R1!K34,T3_R2!K34)),COUNTRY_INFO!E34),0)","v":0},{"$f":"IF(AND(COUNTRY_INFO!J34>1,COUNTRY_INFO!J34<4), IF(T34/COUNTRY_INFO!E34*100<>0, IF(T34/COUNTRY_INFO!E34*100>100,100,T34/COUNTRY_INFO!E34*100), \"-\"),0)","v":0},{"$f":"IF(AND(COUNTRY_INFO!J34>1,COUNTRY_INFO!J34<4),IF(COUNTRY_INFO!F34>MAX('MDA1'!K34,'MDA2'!K34,'T1'!M34,MAX(T3_R1!L34,T3_R2!L34)),MAX('MDA1'!K34,'MDA2'!K34,'T1'!M34,MAX(T3_R1!L34,T3_R2!L34)),COUNTRY_INFO!F34),0)","v":0},{"$f":"IF(AND(COUNTRY_INFO!J34>1,COUNTRY_INFO!J34<4), IF(V34/COUNTRY_INFO!F34*100<>0, IF(V34/COUNTRY_INFO!F34*100>100,100,V34/COUNTRY_INFO!F34*100), \"-\"),0)","v":0},0,{"$f":"IF(AND(COUNTRY_INFO!J34>1,COUNTRY_INFO!J34<4), IF(S34/P34*100<>0, IF(X34/P34*100>100,100,X34/P34*100), \"-\"),0)","v":0},{"$f":"COUNTRY_INFO!O34","v":18934.3},null,null,{"$f":"MAX('T1'!L34,'T2'!J34)+MAX('T1'!M34,'T2'!K34)+MAX('T1'!N34,'T2'!L34)","v":0},{"$f":"IF(COUNTRY_INFO!K34=1,IF(COUNTRY_INFO!F34*0.33>MAX('T1'!M34,'T2'!K34),MAX('T1'!M34,'T2'!K34),COUNTRY_INFO!F34*0.33),IF(COUNTRY_INFO!K34=2,IF(COUNTRY_INFO!F34*0.5>MAX('T1'!M34,'T2'!K34),MAX('T1'!M34,'T2'!K34),COUNTRY_INFO!F34*0.5),IF(COUNTRY_INFO!K34=3,IF(COUNTRY_INFO!F34>MAX('T1'!M34,'T2'!K34),MAX('T1'!M34,'T2'!K34),COUNTRY_INFO!F34),0)))","v":0},{"$f":"IF(AND(COUNTRY_INFO!K34>0,COUNTRY_INFO!K34<4),IF(Z34>0,IF(COUNTRY_INFO!K34=1, AD34/(COUNTRY_INFO!F34*0.33)*100, IF(COUNTRY_INFO!K34=2, AD34/(COUNTRY_INFO!F34*0.5)*100, IF(COUNTRY_INFO!K34=3, AD34/COUNTRY_INFO!F34*100))),\"-\"),0)","v":0},{"$f":"IF(COUNTRY_INFO!K34=2,IF(COUNTRY_INFO!G34*0.2>MAX('T1'!N34,'T2'!L34),MAX('T1'!N34,'T2'!L34),COUNTRY_INFO!G34*0.2),IF(COUNTRY_INFO!K34=3,IF(COUNTRY_INFO!G34>MAX('T1'!N34,'T2'!L34),MAX('T1'!N34,'T2'!L34),COUNTRY_INFO!G34),0))","v":0},{"$f":"IF(AND(COUNTRY_INFO!K34>0,COUNTRY_INFO!K34<4),IF(Z34>0,IF(COUNTRY_INFO!K34=1, 0, IF(COUNTRY_INFO!K34=2, AF34/(COUNTRY_INFO!G34*0.2)*100, IF(COUNTRY_INFO!K34=3, AF34/COUNTRY_INFO!G34*100))),\"-\"),0)","v":0},0,{"$f":"IF(AND(COUNTRY_INFO!K34>0,COUNTRY_INFO!K34<4), IF(AC34/Z34*100<>0, IF(AH34/Z34*100>100,100,AH34/Z34*100), \"-\"),0)","v":"-"},null,{"$f":"IF(AND(D34<>0, D34<>\"Inconnu\",D34<>\"Interrompu\",D34<>\"Non requis\"),D34/COUNTRY_INFO!D34, 0)","v":0},{"$f":"IF(AND(J34<>0,J34<>\"Inconnu\",J34<>\"Interrompu\",J34<>\"Non requis\"),J34/COUNTRY_INFO!D34, 0)","v":0.89640603131849272},{"$f":"IF(AND(P34<>0,P34<>\"Inconnu\",P34<>\"Non requis\"),P34/(COUNTRY_INFO!E34+COUNTRY_INFO!F34), 0)","v":0},{"$f":"IF(AND(Z34<>0,Z34<>\"Inconnu\",Z34<>\"Non requis\"),IF(COUNTRY_INFO!K34=1,1,IF(COUNTRY_INFO!K34=2,0.5*COUNTRY_INFO!F34/(0.5*COUNTRY_INFO!F34+0.2*COUNTRY_INFO!G34),IF(COUNTRY_INFO!K34=3,COUNTRY_INFO!F34/(COUNTRY_INFO!F34+COUNTRY_INFO!G34)))),0)","v":0.59999577486360733},{"$f":"IF(AND(Z34<>0,Z34<>\"Inconnu\",Z34<>\"Non requis\"),IF(COUNTRY_INFO!K34=1,0,IF(COUNTRY_INFO!K34=2,0.2*COUNTRY_INFO!G34/(0.5*COUNTRY_INFO!F34+0.2*COUNTRY_INFO!G34),IF(COUNTRY_INFO!K34=3,COUNTRY_INFO!G34/(COUNTRY_INFO!F34+COUNTRY_INFO!G34)))),0)","v":0.40000422513639272},{"$f":"MAX(COUNTRY_INFO!D34*AK34*PROFILE!$G$7,COUNTRY_INFO!D34*AL34*PROFILE!$G$7)","v":2715.5880189826216},{"$f":"MAX(COUNTRY_INFO!D34*AK34*PROFILE!$G$8,COUNTRY_INFO!D34*AL34*PROFILE!$G$8,COUNTRY_INFO!D34*AM34*PROFILE!$G$8)","v":10862.735330169564},{"$f":"MAX(COUNTRY_INFO!D34*AK34*PROFILE!$G$9,COUNTRY_INFO!D34*AL34*PROFILE!$G$9,COUNTRY_INFO!D34*AM34*PROFILE!$G$9,IF(AND(DISTRICT!Z34<>\"Inconnu\",Z34<>\"Non requis\"),COUNTRY_INFO!O34*DISTRICT!AN34,0))","v":20367.591978399647},{"$f":"MAX(COUNTRY_INFO!D34*AK34*PROFILE!$G$10,COUNTRY_INFO!D34*AL34*PROFILE!$G$10,IF(AND(DISTRICT!Z34<>\"Inconnu\",Z34<>\"Non requis\"),COUNTRY_INFO!O34*DISTRICT!AO34,0))","v":33946.084672448167},67892,0,{"$f":"MAX('MDA2'!J34,'T1'!L34,'T2'!J34,T3_R1!K34,T3_R2!K34)","v":0},{"$f":"MAX('MDA1'!K34,'MDA2'!K34,'MDA3'!I34,'MDA3'!L34,'T1'!M34,'T2'!K34,T3_R1!L34,T3_R2!L34)","v":21568},{"$f":"MAX('MDA1'!L34,'MDA2'!L34,'MDA3'!J34,'MDA3'!M34,'T1'!N34,'T2'!L34,T3_R1!M34,T3_R2!M34)","v":34684},56252,{"$f":"MAX('MDA2'!J34,T34)","v":0},{"$f":"MAX('MDA1'!K34,'MDA2'!K34,'MDA3'!I34,'MDA3'!L34,V34,AD34)","v":20576},{"$f":"MAX('MDA1'!L34,'MDA2'!L34,'MDA3'!J34,'MDA3'!M34,AF34)","v":34684},55260,81.393978672008487]
[{"$f":"IF(COUNTRY_INFO!A35=0,\" \",COUNTRY_INFO!A35)","v":"Togo"},{"$f":"IF(COUNTRY_INFO!B35=0,\" \",COUNTRY_INFO!B35)","v":"PLATEAUX"},{"$f":"IF(COUNTRY_INFO!C35=0,\" \",COUNTRY_INFO!C35)","v":"AMOU"},{"$f":"COUNTRY_INFO!L35","v":"Non requis"},null,null,{"$f":"MAX('MDA1'!M35,'MDA2'!M35)","v":0},{"$f":"IF(AND(COUNTRY_INFO!H35>0,COUNTRY_INFO!H35<4),IF(D35>MAX('MDA1'!M35,'MDA2'!M35),MAX('MDA1'!M35,'MDA2'!M35),D35),0)","v":0},{"$f":"IF(AND(COUNTRY_INFO!H35>0,COUNTRY_INFO!H35<4), IF(G35/D35*100<>0, IF(G35/D35*100>100,100,G35/D35*100), \"-\"),0)","v":0},{"$f":"COUNTRY_INFO!M35","v":110207},null,null,{"$f":"MAX('MDA1'!M35,MAX('MDA3'!I35,'MDA3'!L35)+MAX('MDA3'!J35,'MDA3'!M35))","v":94230},{"$f":"IF(AND(COUNTRY_INFO!I35>0,COUNTRY_INFO!I35<4),IF(J35>MAX('MDA1'!M35,MAX('MDA3'!I35,'MDA3'!L35)+MAX('MDA3'!J35,'MDA3'!M35)),MAX('MDA1'!M35,MAX('MDA3'!I35,'MDA3'!L35)+MAX('MDA3'!J35,'MDA3'!M35)),J35),0)","v":94230},{"$f":"IF(AND(COUNTRY_INFO!I35>0,COUNTRY_INFO!I35<4), IF(M35/J35*100<>0, IF(M35/J35*100>100,100,M35/J35*100), \"-\"),0)","v":85.502735760886324},{"$f":"COUNTRY_INFO!N35","v":59527},null,null,{"$f":"SUM(MAX('MDA2'!J35, 'T1'!L35, MAX(T3_R1!K35, T3_R2!K35)), MAX('MDA1'!K35, 'MDA2'!K35, 'T1'!M35, MAX(T3_R1!L35, T3_R2!L35)), MAX('MDA1'!L35, 'MDA2'!L35, 'T1'!N35, MAX(T3_R1!M35, T3_R2!M35)))","v":36901},{"$f":"IF(AND(COUNTRY_INFO!J35>1,COUNTRY_INFO!J35<4),IF(COUNTRY_INFO!E35>MAX('MDA2'!J35,'T1'!L35,MAX(T3_R1!K35,T3_R2!K35)),MAX('MDA2'!J35,'T1'!L35,MAX(T3_R1!K35,T3_R2!K35)),COUNTRY_INFO!E35),0)","v":0},{"$f":"IF(AND(COUNTRY_INFO!J35>1,COUNTRY_INFO!J35<4), IF(T35/COUNTRY_INFO!E35*100<>0, IF(T35/COUNTRY_INFO!E35*100>100,100,T35/COUNTRY_INFO!E35*100), \"-\"),0)","v":"-"},{"$f":"IF(AND(COUNTRY_INFO!J35>1,COUNTRY_INFO!J35<4),IF(COUNTRY_INFO!F35>MAX('MDA1'!K35,'MDA2'!K35,'T1'!M35,MAX(T3_R1!L35,T3_R2!L35)),MAX('MDA1'!K35,'MDA2'!K35,'T1'!M35,MAX(T3_R1!L35,T3_R2!L35)),COUNTRY_INFO!F35),0)","v":36901},{"$f":"IF(AND(COUNTRY_INFO!J35>1,COUNTRY_INFO!J35<4), IF(V35/COUNTRY_INFO!F35*100<>0, IF(V35/COUNTRY_INFO!F35*100>100,100,V35/COUNTRY_INFO!F35*100), \"-\"),0)","v":95.051774766884762},36901,{"$f":"IF(AND(COUNTRY_INFO!J35>1,COUNTRY_INFO!J35<4), IF(S35/P35*100<>0, IF(X35/P35*100>100,100,X35/P35*100), \"-\"),0)","v":61.99035731684782},{"$f":"COUNTRY_INFO!O35","v":32351.800000000003},null,null,{"$f":"MAX('T1'!L35,'T2'!J35)+MAX('T1'!M35,'T2'!K35)+MAX('T1'!N35,'T2'!L35)","v":399},{"$f":"IF(COUNTRY_INFO!K35=1,IF(COUNTRY_INFO!F35*0.33>MAX('T1'!M35,'T2'!K35),MAX('T1'!M35,'T2'!K35),COUNTRY_INFO!F35*0.33),IF(COUNTRY_INFO!K35=2,IF(COUNTRY_INFO!F35*0.5>MAX('T1'!M35,'T2'!K35),MAX('T1'!M35,'T2'!K35),COUNTRY_INFO!F35*0.5),IF(COUNTRY_INFO!K35=3,IF(COUNTRY_INFO!F35>MAX('T1'!M35,'T2'!K35),MAX('T1'!M35,'T2'!K35),COUNTRY_INFO!F35),0)))","v":399},{"$f":"IF(AND(COUNTRY_INFO!K35>0,COUNTRY_INFO!K35<4),IF(Z35>0,IF(COUNTRY_INFO!K35=1, AD35/(COUNTRY_INFO!F35*0.33)*100, IF(COUNTRY_INFO!K35=2, AD35/(COUNTRY_INFO!F35*0.5)*100, IF(COUNTRY_INFO!K35=3, AD35/COUNTRY_INFO!F35*100))),\"-\"),0)","v":2.0555355210962856},{"$f":"IF(COUNTRY_INFO!K35=2,IF(COUNTRY_INFO!G35*0.2>MAX('T1'!N35,'T2'!L35),MAX('T1'!N35,'T2'!L35),COUNTRY_INFO!G35*0.2),IF(COUNTRY_INFO!K35=3,IF(COUNTRY_INFO!G35>MAX('T1'!N35,'T2'!L35),MAX('T1'!N35,'T2'!L35),COUNTRY_INFO!G35),0))","v":0},{"$f":"IF(AND(COUNTRY_INFO!K35>0,COUNTRY_INFO!K35<4),IF(Z35>0,IF(COUNTRY_INFO!K35=1, 0, IF(COUNTRY_INFO!K35=2, AF35/(COUNTRY_INFO!G35*0.2)*100, IF(COUNTRY_INFO!K35=3, AF35/COUNTRY_INFO!G35*100))),\"-\"),0)","v":0},399,{"$f":"IF(AND(COUNTRY_INFO!K35>0,COUNTRY_INFO!K35<4), IF(AC35/Z35*100<>0, IF(AH35/Z35*100>100,100,AH35/Z35*100), \"-\"),0)","v":1.2333162296997384},null,{"$f":"IF(AND(D35<>0, D35<>\"Inconnu\",D35<>\"Interrompu\",D35<>\"Non requis\"),D35/COUNTRY_INFO!D35, 0)","v":0},{"$f":"IF(AND(J35<>0,J35<>\"Inconnu\",J35<>\"Interrompu\",J35<>\"Non requis\"),J35/COUNTRY_INFO!D35, 0)","v":0.85163090095589888},{"$f":"IF(AND(P35<>0,P35<>\"Inconnu\",P35<>\"Non requis\"),P35/(COUNTRY_INFO!E35+COUNTRY_INFO!F35), 0)","v":1},{"$f":"IF(AND(Z35<>0,Z35<>\"Inconnu\",Z35<>\"Non requis\"),IF(COUNTRY_INFO!K35=1,1,IF(COUNTRY_INFO!K35=2,0.5*COUNTRY_INFO!F35/(0.5*COUNTRY_INFO!F35+0.2*COUNTRY_INFO!G35),IF(COUNTRY_INFO!K35=3,COUNTRY_INFO!F35/(COUNTRY_INFO!F35+COUNTRY_INFO!G35)))),0)","v":0.59999752718550425},{"$f":"IF(AND(Z35<>0,Z35<>\"Inconnu\",Z35<>\"Non requis\"),IF(COUNTRY_INFO!K35=1,0,IF(COUNTRY_INFO!K35=2,0.2*COUNTRY_INFO!G35/(0.5*COUNTRY_INFO!F35+0.2*COUNTRY_INFO!G35),IF(COUNTRY_INFO!K35=3,COUNTRY_INFO!G35/(COUNTRY_INFO!F35+COUNTRY_INFO!G35)))),0)","v":0.40000247281449564},{"$f":"MAX(COUNTRY_INFO!D35*AK35*PROFILE!$G$7,COUNTRY_INFO!D35*AL35*PROFILE!$G$7)","v":4408.1306900373793},{"$f":"MAX(COUNTRY_INFO!D35*AK35*PROFILE!$G$8,COUNTRY_INFO!D35*AL35*PROFILE!$G$8,COUNTRY_INFO!D35*AM35*PROFILE!$G$8)","v":20705.149220397878},{"$f":"MAX(COUNTRY_INFO!D35*AK35*PROFILE!$G$9,COUNTRY_INFO!D35*AL35*PROFILE!$G$9,COUNTRY_INFO!D35*AM35*PROFILE!$G$9,IF(AND(DISTRICT!Z35<>\"Inconnu\",Z35<>\"Non requis\"),COUNTRY_INFO!O35*DISTRICT!AN35,0))","v":38822.084710256924},{"$f":"MAX(COUNTRY_INFO!D35*AK35*PROFILE!$G$10,COUNTRY_INFO!D35*AL35*PROFILE!$G$10,IF(AND(DISTRICT!Z35<>\"Inconnu\",Z35<>\"Non requis\"),COUNTRY_INFO!O35*DISTRICT!AO35,0))","v":55103.637446186527},119039.00206687872,"Y",{"$f":"MAX('MDA2'!J35,'T1'!L35,'T2'!J35,T3_R1!K35,T3_R2!K35)","v":0},{"$f":"MAX('MDA1'!K35,'MDA2'!K35,'MDA3'!I35,'MDA3'!L35,'T1'!M35,'T2'!K35,T3_R1!L35,T3_R2!L35)","v":36901},{"$f":"MAX('MDA1'!L35,'MDA2'!L35,'MDA3'!J35,'MDA3'!M35,'T1'!N35,'T2'!L35,T3_R1!M35,T3_R2!M35)","v":59809},96710,{"$f":"MAX('MDA2'!J35,T35)","v":0},{"$f":"MAX('MDA1'!K35,'MDA2'!K35,'MDA3'!I35,'MDA3'!L35,V35,AD35)","v":36901},{"$f":"MAX('MDA1'!L35,'MDA2'!L35,'MDA3'!J35,'MDA3'!M35,AF35)","v":59809},96710,81.242280530599714]
[{"$f":"IF(COUNTRY_INFO!A36=0,\" \",COUNTRY_INFO!A36)","v":"Togo"},{"$f":"IF(COUNTRY_INFO!B36=0,\" \",COUNTRY_INFO!B36)","v":"PLATEAUX"},{"$f":"IF(COUNTRY_INFO!C36=0,\" \",COUNTRY_INFO!C36)","v":"ANIE"},{"$f":"COUNTRY_INFO!L36","v":"Non requis"},null,null,{"$f":"MAX('MDA1'!M36,'MDA2'!M36)","v":0},{"$f":"IF(AND(COUNTRY_INFO!H36>0,COUNTRY_INFO!H36<4),IF(D36>MAX('MDA1'!M36,'MDA2'!M36),MAX('MDA1'!M36,'MDA2'!M36),D36),0)","v":0},{"$f":"IF(AND(COUNTRY_INFO!H36>0,COUNTRY_INFO!H36<4), IF(G36/D36*100<>0, IF(G36/D36*100>100,100,G36/D36*100), \"-\"),0)","v":0},{"$f":"COUNTRY_INFO!M36","v":113100},null,null,{"$f":"MAX('MDA1'!M36,MAX('MDA3'!I36,'MDA3'!L36)+MAX('MDA3'!J36,'MDA3'!M36))","v":93894},{"$f":"IF(AND(COUNTRY_INFO!I36>0,COUNTRY_INFO!I36<4),IF(J36>MAX('MDA1'!M36,MAX('MDA3'!I36,'MDA3'!L36)+MAX('MDA3'!J36,'MDA3'!M36)),MAX('MDA1'!M36,MAX('MDA3'!I36,'MDA3'!L36)+MAX('MDA3'!J36,'MDA3'!M36)),J36),0)","v":93894},{"$f":"IF(AND(COUNTRY_INFO!I36>0,COUNTRY_INFO!I36<4), IF(M36/J36*100<>0, IF(M36/J36*100>100,100,M36/J36*100), \"-\"),0)","v":83.018567639257284},{"$f":"COUNTRY_INFO!N36","v":70135},null,null,{"$f":"SUM(MAX('MDA2'!J36, 'T1'!L36, MAX(T3_R1!K36, T3_R2!K36)), MAX('MDA1'!K36, 'MDA2'!K36, 'T1'!M36, MAX(T3_R1!L36, T3_R2!L36)), MAX('MDA1'!L36, 'MDA2'!L36, 'T1'!N36, MAX(T3_R1!M36, T3_R2!M36)))","v":50675},{"$f":"IF(AND(COUNTRY_INFO!J36>1,COUNTRY_INFO!J36<4),IF(COUNTRY_INFO!E36>MAX('MDA2'!J36,'T1'!L36,MAX(T3_R1!K36,T3_R2!K36)),MAX('MDA2'!J36,'T1'!L36,MAX(T3_R1!K36,T3_R2!K36)),COUNTRY_INFO!E36),0)","v":0},{"$f":"IF(AND(COUNTRY_INFO!J36>1,COUNTRY_INFO!J36<4), IF(T36/COUNTRY_INFO!E36*100<>0, IF(T36/COUNTRY_INFO!E36*100>100,100,T36/COUNTRY_INFO!E36*100), \"-\"),0)","v":"-"},{"$f":"IF(AND(COUNTRY_INFO!J36>1,COUNTRY_INFO!J36<4),IF(COUNTRY_INFO!F36>MAX('MDA1'!K36,'MDA2'!K36,'T1'!M36,MAX(T3_R1!L36,T3_R2!L36)),MAX('MDA1'!K36,'MDA2'!K36,'T1'!M36,MAX(T3_R1!L36,T3_R2!L36)),COUNTRY_INFO!F36),0)","v":45740},{"$f":"IF(AND(COUNTRY_INFO!J36>1,COUNTRY_INFO!J36<4), IF(V36/COUNTRY_INFO!F36*100<>0, IF(V36/COUNTRY_INFO!F36*100>100,100,V36/COUNTRY_INFO!F36*100), \"-\"),0)","v":100},45740,{"$f":"IF(AND(COUNTRY_INFO!J36>1,COUNTRY_INFO!J36<4), IF(S36/P36*100<>0, IF(X36/P36*100>100,100,X36/P36*100), \"-\"),0)","v":65.217081343123979},{"$f":"COUNTRY_INFO!O36","v":121974},null,null,{"$f":"MAX('T1'!L36,'T2'!J36)+MAX('T1'!M36,'T2'!K36)+MAX('T1'!N36,'T2'!L36)","v":27061},{"$f":"IF(COUNTRY_INFO!K36=1,IF(COUNTRY_INFO!F36*0.33>MAX('T1'!M36,'T2'!K36),MAX('T1'!M36,'T2'!K36),COUNTRY_INFO!F36*0.33),IF(COUNTRY_INFO!K36=2,IF(COUNTRY_INFO!F36*0.5>MAX('T1'!M36,'T2'!K36),MAX('T1'!M36,'T2'!K36),COUNTRY_INFO!F36*0.5),IF(COUNTRY_INFO!K36=3,IF(COUNTRY_INFO!F36>MAX('T1'!M36,'T2'!K36),MAX('T1'!M36,'T2'!K36),COUNTRY_INFO!F36),0)))","v":27061},{"$f":"IF(AND(COUNTRY_INFO!K36>0,COUNTRY_INFO!K36<4),IF(Z36>0,IF(COUNTRY_INFO!K36=1, AD36/(COUNTRY_INFO!F36*0.33)*100, IF(COUNTRY_INFO!K36=2, AD36/(COUNTRY_INFO!F36*0.5)*100, IF(COUNTRY_INFO!K36=3, AD36/COUNTRY_INFO!F36*100))),\"-\"),0)","v":59.162658504591171},{"$f":"IF(COUNTRY_INFO!K36=2,IF(COUNTRY_INFO!G36*0.2>MAX('T1'!N36,'T2'!L36),MAX('T1'!N36,'T2'!L36),COUNTRY_INFO!G36*0.2),IF(COUNTRY_INFO!K36=3,IF(COUNTRY_INFO!G36>MAX('T1'!N36,'T2'!L36),MAX('T1'!N36,'T2'!L36),COUNTRY_INFO!G36),0))","v":0},{"$f":"IF(AND(COUNTRY_INFO!K36>0,COUNTRY_INFO!K36<4),IF(Z36>0,IF(COUNTRY_INFO!K36=1, 0, IF(COUNTRY_INFO!K36=2, AF36/(COUNTRY_INFO!G36*0.2)*100, IF(COUNTRY_INFO!K36=3, AF36/COUNTRY_INFO!G36*100))),\"-\"),0)","v":0},27061,{"$f":"IF(AND(COUNTRY_INFO!K36>0,COUNTRY_INFO!K36<4), IF(AC36/Z36*100<>0, IF(AH36/Z36*100>100,100,AH36/Z36*100), \"-\"),0)","v":22.185875678423269},null,{"$f":"IF(AND(D36<>0, D36<>\"Inconnu\",D36<>\"Interrompu\",D36<>\"Non requis\"),D36/COUNTRY_INFO!D36, 0)","v":0},{"$f":"IF(AND(J36<>0,J36<>\"Inconnu\",J36<>\"Interrompu\",J36<>\"Non requis\"),J36/COUNTRY_INFO!D36, 0)","v":0.74179499960647477},{"$f":"IF(AND(P36<>0,P36<>\"Inconnu\",P36<>\"Non requis\"),P36/(COUNTRY_INFO!E36+COUNTRY_INFO!F36), 0)","v":1},{"$f":"IF(AND(Z36<>0,Z36<>\"Inconnu\",Z36<>\"Non requis\"),IF(COUNTRY_INFO!K36=1,1,IF(COUNTRY_INFO!K36=2,0.5*COUNTRY_INFO!F36/(0.5*COUNTRY_INFO!F36+0.2*COUNTRY_INFO!G36),IF(COUNTRY_INFO!K36=3,COUNTRY_INFO!F36/(COUNTRY_INFO!F36+COUNTRY_INFO!G36)))),0)","v":0.37499795038286848},{"$f":"IF(AND(Z36<>0,Z36<>\"Inconnu\",Z36<>\"Non requis\"),IF(COUNTRY_INFO!K36=1,0,IF(COUNTRY_INFO!K36=2,0.2*COUNTRY_INFO!G36/(0.5*COUNTRY_INFO!F36+0.2*COUNTRY_INFO!G36),IF(COUNTRY_INFO!K36=3,COUNTRY_INFO!G36/(COUNTRY_INFO!F36+COUNTRY_INFO!G36)))),0)","v":0.62500204961713157},{"$f":"MAX(COUNTRY_INFO!D36*AK36*PROFILE!$G$7,COUNTRY_INFO!D36*AL36*PROFILE!$G$7)","v":4523.8467705611038},{"$f":"MAX(COUNTRY_INFO!D36*AK36*PROFILE!$G$8,COUNTRY_INFO!D36*AL36*PROFILE!$G$8,COUNTRY_INFO!D36*AM36*PROFILE!$G$8)","v":24394.914427624652},{"$f":"MAX(COUNTRY_INFO!D36*AK36*PROFILE!$G$9,COUNTRY_INFO!D36*AL36*PROFILE!$G$9,COUNTRY_INFO!D36*AM36*PROFILE!$G$9,IF(AND(DISTRICT!Z36<>\"Inconnu\",Z36<>\"Non requis\"),COUNTRY_INFO!O36*DISTRICT!AN36,0))","v":45740.381985545238},{"$f":"MAX(COUNTRY_INFO!D36*AK36*PROFILE!$G$10,COUNTRY_INFO!D36*AL36*PROFILE!$G$10,IF(AND(DISTRICT!Z36<>\"Inconnu\",Z36<>\"Non requis\"),COUNTRY_INFO!O36*DISTRICT!AO36,0))","v":76234},150893.14318373101,"Y",{"$f":"MAX('MDA2'!J36,'T1'!L36,'T2'!J36,T3_R1!K36,T3_R2!K36)","v":0},{"$f":"MAX('MDA1'!K36,'MDA2'!K36,'MDA3'!I36,'MDA3'!L36,'T1'!M36,'T2'!K36,T3_R1!L36,T3_R2!L36)","v":50675},{"$f":"MAX('MDA1'!L36,'MDA2'!L36,'MDA3'!J36,'MDA3'!M36,'T1'!N36,'T2'!L36,T3_R1!M36,T3_R2!M36)","v":56817},107492,{"$f":"MAX('MDA2'!J36,T36)","v":0},{"$f":"MAX('MDA1'!K36,'MDA2'!K36,'MDA3'!I36,'MDA3'!L36,V36,AD36)","v":45740},{"$f":"MAX('MDA1'!L36,'MDA2'!L36,'MDA3'!J36,'MDA3'!M36,AF36)","v":56817},102557,67.966640389433877]
[{"$f":"IF(COUNTRY_INFO!A37=0,\" \",COUNTRY_INFO!A37)","v":"Togo"},{"$f":"IF(COUNTRY_INFO!B37=0,\" \",COUNTRY_INFO!B37)","v":"PLATEAUX"},{"$f":"IF(COUNTRY_INFO!C37=0,\" \",COUNTRY_INFO!C37)","v":"DANYI"},{"$f":"COUNTRY_INFO!L37","v":"Non requis"},null,null,{"$f":"MAX('MDA1'!M37,'MDA2'!M37)","v":0},{"$f":"IF(AND(COUNTRY_INFO!H37>0,COUNTRY_INFO!H37<4),IF(D37>MAX('MDA1'!M37,'MDA2'!M37),MAX('MDA1'!M37,'MDA2'!M37),D37),0)","v":0},{"$f":"IF(AND(COUNTRY_INFO!H37>0,COUNTRY_INFO!H37<4), IF(G37/D37*100<>0, IF(G37/D37*100>100,100,G37/D37*100), \"-\"),0)","v":0},{"$f":"COUNTRY_INFO!M37","v":35696},null,null,{"$f":"MAX('MDA1'!M37,MAX('MDA3'!I37,'MDA3'!L37)+MAX('MDA3'!J37,'MDA3'!M37))","v":30581},{"$f":"IF(AND(COUNTRY_INFO!I37>0,COUNTRY_INFO!I37<4),IF(J37>MAX('MDA1'!M37,MAX('MDA3'!I37,'MDA3'!L37)+MAX('MDA3'!J37,'MDA3'!M37)),MAX('MDA1'!M37,MAX('MDA3'!I37,'MDA3'!L37)+MAX('MDA3'!J37,'MDA3'!M37)),J37),0)","v":30581},{"$f":"IF(AND(COUNTRY_INFO!I37>0,COUNTRY_INFO!I37<4), IF(M37/J37*100<>0, IF(M37/J37*100>100,100,M37/J37*100), \"-\"),0)","v":85.670663379650378},{"$f":"COUNTRY_INFO!N37","v":22079},null,null,{"$f":"SUM(MAX('MDA2'!J37, 'T1'!L37, MAX(T3_R1!K37, T3_R2!K37)), MAX('MDA1'!K37, 'MDA2'!K37, 'T1'!M37, MAX(T3_R1!L37, T3_R2!L37)), MAX('MDA1'!L37, 'MDA2'!L37, 'T1'!N37, MAX(T3_R1!M37, T3_R2!M37)))","v":12740},{"$f":"IF(AND(COUNTRY_INFO!J37>1,COUNTRY_INFO!J37<4),IF(COUNTRY_INFO!E37>MAX('MDA2'!J37,'T1'!L37,MAX(T3_R1!K37,T3_R2!K37)),MAX('MDA2'!J37,'T1'!L37,MAX(T3_R1!K37,T3_R2!K37)),COUNTRY_INFO!E37),0)","v":0},{"$f":"IF(AND(COUNTRY_INFO!J37>1,COUNTRY_INFO!J37<4), IF(T37/COUNTRY_INFO!E37*100<>0, IF(T37/COUNTRY_INFO!E37*100>100,100,T37/COUNTRY_INFO!E37*100), \"-\"),0)","v":"-"},{"$f":"IF(AND(COUNTRY_INFO!J37>1,COUNTRY_INFO!J37<4),IF(COUNTRY_INFO!F37>MAX('MDA1'!K37,'MDA2'!K37,'T1'!M37,MAX(T3_R1!L37,T3_R2!L37)),MAX('MDA1'!K37,'MDA2'!K37,'T1'!M37,MAX(T3_R1!L37,T3_R2!L37)),COUNTRY_INFO!F37),0)","v":12740},{"$f":"IF(AND(COUNTRY_INFO!J37>1,COUNTRY_INFO!J37<4), IF(V37/COUNTRY_INFO!F37*100<>0, IF(V37/COUNTRY_INFO!F37*100>100,100,V37/COUNTRY_INFO!F37*100), \"-\"),0)","v":88.478366553232874},12740,{"$f":"IF(AND(COUNTRY_INFO!J37>1,COUNTRY_INFO!J37<4), IF(S37/P37*100<>0, IF(X37/P37*100>100,100,X37/P37*100), \"-\"),0)","v":57.701888672494228},{"$f":"COUNTRY_INFO!O37","v":4751.67},null,null,{"$f":"MAX('T1'!L37,'T2'!J37)+MAX('T1'!M37,'T2'!K37)+MAX('T1'!N37,'T2'!L37)","v":0},{"$f":"IF(COUNTRY_INFO!K37=1,IF(COUNTRY_INFO!F37*0.33>MAX('T1'!M37,'T2'!K37),MAX('T1'!M37,'T2'!K37),COUNTRY_INFO!F37*0.33),IF(COUNTRY_INFO!K37=2,IF(COUNTRY_INFO!F37*0.5>MAX('T1'!M37,'T2'!K37),MAX('T1'!M37,'T2'!K37),COUNTRY_INFO!F37*0.5),IF(COUNTRY_INFO!K37=3,IF(COUNTRY_INFO!F37>MAX('T1'!M37,'T2'!K37),MAX('T1'!M37,'T2'!K37),COUNTRY_INFO!F37),0)))","v":0},{"$f":"IF(AND(COUNTRY_INFO!K37>0,COUNTRY_INFO!K37<4),IF(Z37>0,IF(COUNTRY_INFO!K37=1, AD37/(COUNTRY_INFO!F37*0.33)*100, IF(COUNTRY_INFO!K37=2, AD37/(COUNTRY_INFO!F37*0.5)*100, IF(COUNTRY_INFO!K37=3, AD37/COUNTRY_INFO!F37*100))),\"-\"),0)","v":0},{"$f":"IF(COUNTRY_INFO!K37=2,IF(COUNTRY_INFO!G37*0.2>MAX('T1'!N37,'T2'!L37),MAX('T1'!N37,'T2'!L37),COUNTRY_INFO!G37*0.2),IF(COUNTRY_INFO!K37=3,IF(COUNTRY_INFO!G37>MAX('T1'!N37,'T2'!L37),MAX('T1'!N37,'T2'!L37),COUNTRY_INFO!G37),0))","v":0},{"$f":"IF(AND(COUNTRY_INFO!K37>0,COUNTRY_INFO!K37<4),IF(Z37>0,IF(COUNTRY_INFO!K37=1, 0, IF(COUNTRY_INFO!K37=2, AF37/(COUNTRY_INFO!G37*0.2)*100, IF(COUNTRY_INFO!K37=3, AF37/COUNTRY_INFO!G37*100))),\"-\"),0)","v":0},0,{"$f":"IF(AND(COUNTRY_INFO!K37>0,COUNTRY_INFO!K37<4), IF(AC37/Z37*100<>0, IF(AH37/Z37*100>100,100,AH37/Z37*100), \"-\"),0)","v":"-"},null,{"$f":"IF(AND(D37<>0, D37<>\"Inconnu\",D37<>\"Interrompu\",D37<>\"Non requis\"),D37/COUNTRY_INFO!D37, 0)","v":0},{"$f":"IF(AND(J37<>0,J37<>\"Inconnu\",J37<>\"Interrompu\",J37<>\"Non requis\"),J37/COUNTRY_INFO!D37, 0)","v":0.74369765406891952},{"$f":"IF(AND(P37<>0,P37<>\"Inconnu\",P37<>\"Non requis\"),P37/(COUNTRY_INFO!E37+COUNTRY_INFO!F37), 0)","v":1},{"$f":"IF(AND(Z37<>0,Z37<>\"Inconnu\",Z37<>\"Non requis\"),IF(COUNTRY_INFO!K37=1,1,IF(COUNTRY_INFO!K37=2,0.5*COUNTRY_INFO!F37/(0.5*COUNTRY_INFO!F37+0.2*COUNTRY_INFO!G37),IF(COUNTRY_INFO!K37=3,COUNTRY_INFO!F37/(COUNTRY_INFO!F37+COUNTRY_INFO!G37)))),0)","v":1},{"$f":"IF(AND(Z37<>0,Z37<>\"Inconnu\",Z37<>\"Non requis\"),IF(COUNTRY_INFO!K37=1,0,IF(COUNTRY_INFO!K37=2,0.2*COUNTRY_INFO!G37/(0.5*COUNTRY_INFO!F37+0.2*COUNTRY_INFO!G37),IF(COUNTRY_INFO!K37=3,COUNTRY_INFO!G37/(COUNTRY_INFO!F37+COUNTRY_INFO!G37)))),0)","v":0},{"$f":"MAX(COUNTRY_INFO!D37*AK37*PROFILE!$G$7,COUNTRY_INFO!D37*AL37*PROFILE!$G$7)","v":1427.7916385671899},{"$f":"MAX(COUNTRY_INFO!D37*AK37*PROFILE!$G$8,COUNTRY_INFO!D37*AL37*PROFILE!$G$8,COUNTRY_INFO!D37*AM37*PROFILE!$G$8)","v":7679.6908380586619},{"$f":"MAX(COUNTRY_INFO!D37*AK37*PROFILE!$G$9,COUNTRY_INFO!D37*AL37*PROFILE!$G$9,COUNTRY_INFO!D37*AM37*PROFILE!$G$9,IF(AND(DISTRICT!Z37<>\"Inconnu\",Z37<>\"Non requis\"),COUNTRY_INFO!O37*DISTRICT!AN37,0))","v":14399.394328922792},{"$f":"MAX(COUNTRY_INFO!D37*AK37*PROFILE!$G$10,COUNTRY_INFO!D37*AL37*PROFILE!$G$10,IF(AND(DISTRICT!Z37<>\"Inconnu\",Z37<>\"Non requis\"),COUNTRY_INFO!O37*DISTRICT!AO37,0))","v":17848.044518760824},41354.921324309471,0,{"$f":"MAX('MDA2'!J37,'T1'!L37,'T2'!J37,T3_R1!K37,T3_R2!K37)","v":0},{"$f":"MAX('MDA1'!K37,'MDA2'!K37,'MDA3'!I37,'MDA3'!L37,'T1'!M37,'T2'!K37,T3_R1!L37,T3_R2!L37)","v":12740},{"$f":"MAX('MDA1'!L37,'MDA2'!L37,'MDA3'!J37,'MDA3'!M37,'T1'!N37,'T2'!L37,T3_R1!M37,T3_R2!M37)","v":20209},32949,{"$f":"MAX('MDA2'!J37,T37)","v":0},{"$f":"MAX('MDA1'!K37,'MDA2'!K37,'MDA3'!I37,'MDA3'!L37,V37,AD37)","v":12740},{"$f":"MAX('MDA1'!L37,'MDA2'!L37,'MDA3'!J37,'MDA3'!M37,AF37)","v":20209},32949,79.673709790451824]
[{"$f":"IF(COUNTRY_INFO!A38=0,\" \",COUNTRY_INFO!A38)","v":"Togo"},{"$f":"IF(COUNTRY_INFO!B38=0,\" \",COUNTRY_INFO!B38)","v":"PLATEAUX"},{"$f":"IF(COUNTRY_INFO!C38=0,\" \",COUNTRY_INFO!C38)","v":"EST MONO"},{"$f":"COUNTRY_INFO!L38","v":"Non requis"},null,null,{"$f":"MAX('MDA1'!M38,'MDA2'!M38)","v":0},{"$f":"IF(AND(COUNTRY_INFO!H38>0,COUNTRY_INFO!H38<4),IF(D38>MAX('MDA1'!M38,'MDA2'!M38),MAX('MDA1'!M38,'MDA2'!M38),D38),0)","v":0},{"$f":"IF(AND(COUNTRY_INFO!H38>0,COUNTRY_INFO!H38<4), IF(G38/D38*100<>0, IF(G38/D38*100>100,100,G38/D38*100), \"-\"),0)","v":0},{"$f":"COUNTRY_INFO!M38","v":119061},null,null,{"$f":"MAX('MDA1'!M38,MAX('MDA3'!I38,'MDA3'!L38)+MAX('MDA3'!J38,'MDA3'!M38))","v":97726},{"$f":"IF(AND(COUNTRY_INFO!I38>0,COUNTRY_INFO!I38<4),IF(J38>MAX('MDA1'!M38,MAX('MDA3'!I38,'MDA3'!L38)+MAX('MDA3'!J38,'MDA3'!M38)),MAX('MDA1'!M38,MAX('MDA3'!I38,'MDA3'!L38)+MAX('MDA3'!J38,'MDA3'!M38)),J38),0)","v":97726},{"$f":"IF(AND(COUNTRY_INFO!I38>0,COUNTRY_INFO!I38<4), IF(M38/J38*100<>0, IF(M38/J38*100>100,100,M38/J38*100), \"-\"),0)","v":82.080614138970773},{"$f":"COUNTRY_INFO!N38","v":68209},null,null,{"$f":"SUM(MAX('MDA2'!J38, 'T1'!L38, MAX(T3_R1!K38, T3_R2!K38)), MAX('MDA1'!K38, 'MDA2'!K38, 'T1'!M38, MAX(T3_R1!L38, T3_R2!L38)), MAX('MDA1'!L38, 'MDA2'!L38, 'T1'!N38, MAX(T3_R1!M38, T3_R2!M38)))","v":45293},{"$f":"IF(AND(COUNTRY_INFO!J38>1,COUNTRY_INFO!J38<4),IF(COUNTRY_INFO!E38>MAX('MDA2'!J38,'T1'!L38,MAX(T3_R1!K38,T3_R2!K38)),MAX('MDA2'!J38,'T1'!L38,MAX(T3_R1!K38,T3_R2!K38)),COUNTRY_INFO!E38),0)","v":0},{"$f":"IF(AND(COUNTRY_INFO!J38>1,COUNTRY_INFO!J38<4), IF(T38/COUNTRY_INFO!E38*100<>0, IF(T38/COUNTRY_INFO!E38*100>100,100,T38/COUNTRY_INFO!E38*100), \"-\"),0)","v":"-"},{"$f":"IF(AND(COUNTRY_INFO!J38>1,COUNTRY_INFO!J38<4),IF(COUNTRY_INFO!F38>MAX('MDA1'!K38,'MDA2'!K38,'T1'!M38,MAX(T3_R1!L38,T3_R2!L38)),MAX('MDA1'!K38,'MDA2'!K38,'T1'!M38,MAX(T3_R1!L38,T3_R2!L38)),COUNTRY_INFO!F38),0)","v":44484},{"$f":"IF(AND(COUNTRY_INFO!J38>1,COUNTRY_INFO!J38<4), IF(V38/COUNTRY_INFO!F38*100<>0, IF(V38/COUNTRY_INFO!F38*100>100,100,V38/COUNTRY_INFO!F38*100), \"-\"),0)","v":100},44484,{"$f":"IF(AND(COUNTRY_INFO!J38>1,COUNTRY_INFO!J38<4), IF(S38/P38*100<>0, IF(X38/P38*100>100,100,X38/P38*100), \"-\"),0)","v":65.217200076236267},{"$f":"COUNTRY_INFO!O38","v":118625},null,null,{"$f":"MAX('T1'!L38,'T2'!J38)+MAX('T1'!M38,'T2'!K38)+MAX('T1'!N38,'T2'!L38)","v":10512},{"$f":"IF(COUNTRY_INFO!K38=1,IF(COUNTRY_INFO!F38*0.33>MAX('T1'!M38,'T2'!K38),MAX('T1'!M38,'T2'!K38),COUNTRY_INFO!F38*0.33),IF(COUNTRY_INFO!K38=2,IF(COUNTRY_INFO!F38*0.5>MAX('T1'!M38,'T2'!K38),MAX('T1'!M38,'T2'!K38),COUNTRY_INFO!F38*0.5),IF(COUNTRY_INFO!K38=3,IF(COUNTRY_INFO!F38>MAX('T1'!M38,'T2'!K38),MAX('T1'!M38,'T2'!K38),COUNTRY_INFO!F38),0)))","v":10512},{"$f":"IF(AND(COUNTRY_INFO!K38>0,COUNTRY_INFO!K38<4),IF(Z38>0,IF(COUNTRY_INFO!K38=1, AD38/(COUNTRY_INFO!F38*0.33)*100, IF(COUNTRY_INFO!K38=2, AD38/(COUNTRY_INFO!F38*0.5)*100, IF(COUNTRY_INFO!K38=3, AD38/COUNTRY_INFO!F38*100))),\"-\"),0)","v":23.6309684380901},{"$f":"IF(COUNTRY_INFO!K38=2,IF(COUNTRY_INFO!G38*0.2>MAX('T1'!N38,'T2'!L38),MAX('T1'!N38,'T2'!L38),COUNTRY_INFO!G38*0.2),IF(COUNTRY_INFO!K38=3,IF(COUNTRY_INFO!G38>MAX('T1'!N38,'T2'!L38),MAX('T1'!N38,'T2'!L38),COUNTRY_INFO!G38),0))","v":0},{"$f":"IF(AND(COUNTRY_INFO!K38>0,COUNTRY_INFO!K38<4),IF(Z38>0,IF(COUNTRY_INFO!K38=1, 0, IF(COUNTRY_INFO!K38=2, AF38/(COUNTRY_INFO!G38*0.2)*100, IF(COUNTRY_INFO!K38=3, AF38/COUNTRY_INFO!G38*100))),\"-\"),0)","v":0},10512,{"$f":"IF(AND(COUNTRY_INFO!K38>0,COUNTRY_INFO!K38<4), IF(AC38/Z38*100<>0, IF(AH38/Z38*100>100,100,AH38/Z38*100), \"-\"),0)","v":8.8615384615384603},null,{"$f":"IF(AND(D38<>0, D38<>\"Inconnu\",D38<>\"Interrompu\",D38<>\"Non requis\"),D38/COUNTRY_INFO!D38, 0)","v":0},{"$f":"IF(AND(J38<>0,J38<>\"Inconnu\",J38<>\"Interrompu\",J38<>\"Non requis\"),J38/COUNTRY_INFO!D38, 0)","v":0.80294171201974629},{"$f":"IF(AND(P38<>0,P38<>\"Inconnu\",P38<>\"Non requis\"),P38/(COUNTRY_INFO!E38+COUNTRY_INFO!F38), 0)","v":1},{"$f":"IF(AND(Z38<>0,Z38<>\"Inconnu\",Z38<>\"Non requis\"),IF(COUNTRY_INFO!K38=1,1,IF(COUNTRY_INFO!K38=2,0.5*COUNTRY_INFO!F38/(0.5*COUNTRY_INFO!F38+0.2*COUNTRY_INFO!G38),IF(COUNTRY_INFO!K38=3,COUNTRY_INFO!F38/(COUNTRY_INFO!F38+COUNTRY_INFO!G38)))),0)","v":0.37499683877766071},{"$f":"IF(AND(Z38<>0,Z38<>\"Inconnu\",Z38<>\"Non requis\"),IF(COUNTRY_INFO!K38=1,0,IF(COUNTRY_INFO!K38=2,0.2*COUNTRY_INFO!G38/(0.5*COUNTRY_INFO!F38+0.2*COUNTRY_INFO!G38),IF(COUNTRY_INFO!K38=3,COUNTRY_INFO!G38/(COUNTRY_INFO!F38+COUNTRY_INFO!G38)))),0)","v":0.62500316122233934},{"$f":"MAX(COUNTRY_INFO!D38*AK38*PROFILE!$G$7,COUNTRY_INFO!D38*AL38*PROFILE!$G$7)","v":4762.2786945161415},{"$f":"MAX(COUNTRY_INFO!D38*AK38*PROFILE!$G$8,COUNTRY_INFO!D38*AL38*PROFILE!$G$8,COUNTRY_INFO!D38*AM38*PROFILE!$G$8)","v":23724.993482190435},{"$f":"MAX(COUNTRY_INFO!D38*AK38*PROFILE!$G$9,COUNTRY_INFO!D38*AL38*PROFILE!$G$9,COUNTRY_INFO!D38*AM38*PROFILE!$G$9,IF(AND(DISTRICT!Z38<>\"Inconnu\",Z38<>\"Non requis\"),COUNTRY_INFO!O38*DISTRICT!AN38,0))","v":44484.282480249189},{"$f":"MAX(COUNTRY_INFO!D38*AK38*PROFILE!$G$10,COUNTRY_INFO!D38*AL38*PROFILE!$G$10,IF(AND(DISTRICT!Z38<>\"Inconnu\",Z38<>\"Non requis\"),COUNTRY_INFO!O38*DISTRICT!AO38,0))","v":74141},147112.55465695576,"Y",{"$f":"MAX('MDA2'!J38,'T1'!L38,'T2'!J38,T3_R1!K38,T3_R2!K38)","v":0},{"$f":"MAX('MDA1'!K38,'MDA2'!K38,'MDA3'!I38,'MDA3'!L38,'T1'!M38,'T2'!K38,T3_R1!L38,T3_R2!L38)","v":45293},{"$f":"MAX('MDA1'!L38,'MDA2'!L38,'MDA3'!J38,'MDA3'!M38,'T1'!N38,'T2'!L38,T3_R1!M38,T3_R2!M38)","v":60383},105676,{"$f":"MAX('MDA2'!J38,T38)","v":0},{"$f":"MAX('MDA1'!K38,'MDA2'!K38,'MDA3'!I38,'MDA3'!L38,V38,AD38)","v":44484},{"$f":"MAX('MDA1'!L38,'MDA2'!L38,'MDA3'!J38,'MDA3'!M38,AF38)","v":60383},104867,71.283515023264997]
[{"$f":"IF(COUNTRY_INFO!A39=0,\" \",COUNTRY_INFO!A39)","v":"Togo"},{"$f":"IF(COUNTRY_INFO!B39=0,\" \",COUNTRY_INFO!B39)","v":"PLATEAUX"},{"$f":"IF(COUNTRY_INFO!C39=0,\" \",COUNTRY_INFO!C39)","v":"HAHO"},{"$f":"COUNTRY_INFO!L39","v":"Non requis"},null,null,{"$f":"MAX('MDA1'!M39,'MDA2'!M39)","v":0},{"$f":"IF(AND(COUNTRY_INFO!H39>0,COUNTRY_INFO!H39<4),IF(D39>MAX('MDA1'!M39,'MDA2'!M39),MAX('MDA1'!M39,'MDA2'!M39),D39),0)","v":0},{"$f":"IF(AND(COUNTRY_INFO!H39>0,COUNTRY_INFO!H39<4), IF(G39/D39*100<>0, IF(G39/D39*100>100,100,G39/D39*100), \"-\"),0)","v":0},{"$f":"COUNTRY_INFO!M39","v":242970},null,null,{"$f":"MAX('MDA1'!M39,MAX('MDA3'!I39,'MDA3'!L39)+MAX('MDA3'!J39,'MDA3'!M39))","v":197794},{"$f":"IF(AND(COUNTRY_INFO!I39>0,COUNTRY_INFO!I39<4),IF(J39>MAX('MDA1'!M39,MAX('MDA3'!I39,'MDA3'!L39)+MAX('MDA3'!J39,'MDA3'!M39)),MAX('MDA1'!M39,MAX('MDA3'!I39,'MDA3'!L39)+MAX('MDA3'!J39,'MDA3'!M39)),J39),0)","v":197794},{"$f":"IF(AND(COUNTRY_INFO!I39>0,COUNTRY_INFO!I39<4), IF(M39/J39*100<>0, IF(M39/J39*100>100,100,M39/J39*100), \"-\"),0)","v":81.406758035971521},{"$f":"COUNTRY_INFO!N39","v":138874},null,null,{"$f":"SUM(MAX('MDA2'!J39, 'T1'!L39, MAX(T3_R1!K39, T3_R2!K39)), MAX('MDA1'!K39, 'MDA2'!K39, 'T1'!M39, MAX(T3_R1!L39, T3_R2!L39)), MAX('MDA1'!L39, 'MDA2'!L39, 'T1'!N39, MAX(T3_R1!M39, T3_R2!M39)))","v":98570},{"$f":"IF(AND(COUNTRY_INFO!J39>1,COUNTRY_INFO!J39<4),IF(COUNTRY_INFO!E39>MAX('MDA2'!J39,'T1'!L39,MAX(T3_R1!K39,T3_R2!K39)),MAX('MDA2'!J39,'T1'!L39,MAX(T3_R1!K39,T3_R2!K39)),COUNTRY_INFO!E39),0)","v":0},{"$f":"IF(AND(COUNTRY_INFO!J39>1,COUNTRY_INFO!J39<4), IF(T39/COUNTRY_INFO!E39*100<>0, IF(T39/COUNTRY_INFO!E39*100>100,100,T39/COUNTRY_INFO!E39*100), \"-\"),0)","v":"-"},{"$f":"IF(AND(COUNTRY_INFO!J39>1,COUNTRY_INFO!J39<4),IF(COUNTRY_INFO!F39>MAX('MDA1'!K39,'MDA2'!K39,'T1'!M39,MAX(T3_R1!L39,T3_R2!L39)),MAX('MDA1'!K39,'MDA2'!K39,'T1'!M39,MAX(T3_R1!L39,T3_R2!L39)),COUNTRY_INFO!F39),0)","v":90570},{"$f":"IF(AND(COUNTRY_INFO!J39>1,COUNTRY_INFO!J39<4), IF(V39/COUNTRY_INFO!F39*100<>0, IF(V39/COUNTRY_INFO!F39*100>100,100,V39/COUNTRY_INFO!F39*100), \"-\"),0)","v":100},90570,{"$f":"IF(AND(COUNTRY_INFO!J39>1,COUNTRY_INFO!J39<4), IF(S39/P39*100<>0, IF(X39/P39*100>100,100,X39/P39*100), \"-\"),0)","v":65.217391304347828},{"$f":"COUNTRY_INFO!O39","v":241520},null,null,{"$f":"MAX('T1'!L39,'T2'!J39)+MAX('T1'!M39,'T2'!K39)+MAX('T1'!N39,'T2'!L39)","v":11499},{"$f":"IF(COUNTRY_INFO!K39=1,IF(COUNTRY_INFO!F39*0.33>MAX('T1'!M39,'T2'!K39),MAX('T1'!M39,'T2'!K39),COUNTRY_INFO!F39*0.33),IF(COUNTRY_INFO!K39=2,IF(COUNTRY_INFO!F39*0.5>MAX('T1'!M39,'T2'!K39),MAX('T1'!M39,'T2'!K39),COUNTRY_INFO!F39*0.5),IF(COUNTRY_INFO!K39=3,IF(COUNTRY_INFO!F39>MAX('T1'!M39,'T2'!K39),MAX('T1'!M39,'T2'!K39),COUNTRY_INFO!F39),0)))","v":11499},{"$f":"IF(AND(COUNTRY_INFO!K39>0,COUNTRY_INFO!K39<4),IF(Z39>0,IF(COUNTRY_INFO!K39=1, AD39/(COUNTRY_INFO!F39*0.33)*100, IF(COUNTRY_INFO!K39=2, AD39/(COUNTRY_INFO!F39*0.5)*100, IF(COUNTRY_INFO!K39=3, AD39/COUNTRY_INFO!F39*100))),\"-\"),0)","v":12.696257038754554},{"$f":"IF(COUNTRY_INFO!K39=2,IF(COUNTRY_INFO!G39*0.2>MAX('T1'!N39,'T2'!L39),MAX('T1'!N39,'T2'!L39),COUNTRY_INFO!G39*0.2),IF(COUNTRY_INFO!K39=3,IF(COUNTRY_INFO!G39>MAX('T1'!N39,'T2'!L39),MAX('T1'!N39,'T2'!L39),COUNTRY_INFO!G39),0))","v":0},{"$f":"IF(AND(COUNTRY_INFO!K39>0,COUNTRY_INFO!K39<4),IF(Z39>0,IF(COUNTRY_INFO!K39=1, 0, IF(COUNTRY_INFO!K39=2, AF39/(COUNTRY_INFO!G39*0.2)*100, IF(COUNTRY_INFO!K39=3, AF39/COUNTRY_INFO!G39*100))),\"-\"),0)","v":0},11499,{"$f":"IF(AND(COUNTRY_INFO!K39>0,COUNTRY_INFO!K39<4), IF(AC39/Z39*100<>0, IF(AH39/Z39*100>100,100,AH39/Z39*100), \"-\"),0)","v":4.7610963895329581},null,{"$f":"IF(AND(D39<>0, D39<>\"Inconnu\",D39<>\"Interrompu\",D39<>\"Non requis\"),D39/COUNTRY_INFO!D39, 0)","v":0},{"$f":"IF(AND(J39<>0,J39<>\"Inconnu\",J39<>\"Interrompu\",J39<>\"Non requis\"),J39/COUNTRY_INFO!D39, 0)","v":0.80480291487247435},{"$f":"IF(AND(P39<>0,P39<>\"Inconnu\",P39<>\"Non requis\"),P39/(COUNTRY_INFO!E39+COUNTRY_INFO!F39), 0)","v":1},{"$f":"IF(AND(Z39<>0,Z39<>\"Inconnu\",Z39<>\"Non requis\"),IF(COUNTRY_INFO!K39=1,1,IF(COUNTRY_INFO!K39=2,0.5*COUNTRY_INFO!F39/(0.5*COUNTRY_INFO!F39+0.2*COUNTRY_INFO!G39),IF(COUNTRY_INFO!K39=3,COUNTRY_INFO!F39/(COUNTRY_INFO!F39+COUNTRY_INFO!G39)))),0)","v":0.375},{"$f":"IF(AND(Z39<>0,Z39<>\"Inconnu\",Z39<>\"Non requis\"),IF(COUNTRY_INFO!K39=1,0,IF(COUNTRY_INFO!K39=2,0.2*COUNTRY_INFO!G39/(0.5*COUNTRY_INFO!F39+0.2*COUNTRY_INFO!G39),IF(COUNTRY_INFO!K39=3,COUNTRY_INFO!G39/(COUNTRY_INFO!F39+COUNTRY_INFO!G39)))),0)","v":0.625},{"$f":"MAX(COUNTRY_INFO!D39*AK39*PROFILE!$G$7,COUNTRY_INFO!D39*AL39*PROFILE!$G$7)","v":9718.4708208950615},{"$f":"MAX(COUNTRY_INFO!D39*AK39*PROFILE!$G$8,COUNTRY_INFO!D39*AL39*PROFILE!$G$8,COUNTRY_INFO!D39*AM39*PROFILE!$G$8)","v":48304.06816971353},{"$f":"MAX(COUNTRY_INFO!D39*AK39*PROFILE!$G$9,COUNTRY_INFO!D39*AL39*PROFILE!$G$9,COUNTRY_INFO!D39*AM39*PROFILE!$G$9,IF(AND(DISTRICT!Z39<>\"Inconnu\",Z39<>\"Non requis\"),COUNTRY_INFO!O39*DISTRICT!AN39,0))","v":90570},{"$f":"MAX(COUNTRY_INFO!D39*AK39*PROFILE!$G$10,COUNTRY_INFO!D39*AL39*PROFILE!$G$10,IF(AND(DISTRICT!Z39<>\"Inconnu\",Z39<>\"Non requis\"),COUNTRY_INFO!O39*DISTRICT!AO39,0))","v":150950},299542.53899060859,"Y",{"$f":"MAX('MDA2'!J39,'T1'!L39,'T2'!J39,T3_R1!K39,T3_R2!K39)","v":0},{"$f":"MAX('MDA1'!K39,'MDA2'!K39,'MDA3'!I39,'MDA3'!L39,'T1'!M39,'T2'!K39,T3_R1!L39,T3_R2!L39)","v":98570},{"$f":"MAX('MDA1'!L39,'MDA2'!L39,'MDA3'!J39,'MDA3'!M39,'T1'!N39,'T2'!L39,T3_R1!M39,T3_R2!M39)","v":118070},216640,{"$f":"MAX('MDA2'!J39,T39)","v":0},{"$f":"MAX('MDA1'!K39,'MDA2'!K39,'MDA3'!I39,'MDA3'!L39,V39,AD39)","v":90570},{"$f":"MAX('MDA1'!L39,'MDA2'!L39,'MDA3'!J39,'MDA3'!M39,AF39)","v":118070},208640,69.652878253309254]
[{"$f":"IF(COUNTRY_INFO!A40=0,\" \",COUNTRY_INFO!A40)","v":"Togo"},{"$f":"IF(COUNTRY_INFO!B40=0,\" \",COUNTRY_INFO!B40)","v":"PLATEAUX"},{"$f":"IF(COUNTRY_INFO!C40=0,\" \",COUNTRY_INFO!C40)","v":"KLOTO"},{"$f":"COUNTRY_INFO!L40","v":"Non requis"},null,null,{"$f":"MAX('MDA1'!M40,'MDA2'!M40)","v":0},{"$f":"IF(AND(COUNTRY_INFO!H40>0,COUNTRY_INFO!H40<4),IF(D40>MAX('MDA1'!M40,'MDA2'!M40),MAX('MDA1'!M40,'MDA2'!M40),D40),0)","v":0},{"$f":"IF(AND(COUNTRY_INFO!H40>0,COUNTRY_INFO!H40<4), IF(G40/D40*100<>0, IF(G40/D40*100>100,100,G40/D40*100), \"-\"),0)","v":0},{"$f":"COUNTRY_INFO!M40","v":57159},null,null,{"$f":"MAX('MDA1'!M40,MAX('MDA3'!I40,'MDA3'!L40)+MAX('MDA3'!J40,'MDA3'!M40))","v":49325},{"$f":"IF(AND(COUNTRY_INFO!I40>0,COUNTRY_INFO!I40<4),IF(J40>MAX('MDA1'!M40,MAX('MDA3'!I40,'MDA3'!L40)+MAX('MDA3'!J40,'MDA3'!M40)),MAX('MDA1'!M40,MAX('MDA3'!I40,'MDA3'!L40)+MAX('MDA3'!J40,'MDA3'!M40)),J40),0)","v":49325},{"$f":"IF(AND(COUNTRY_INFO!I40>0,COUNTRY_INFO!I40<4), IF(M40/J40*100<>0, IF(M40/J40*100>100,100,M40/J40*100), \"-\"),0)","v":86.294371839955204},{"$f":"COUNTRY_INFO!N40","v":0},null,null,{"$f":"SUM(MAX('MDA2'!J40, 'T1'!L40, MAX(T3_R1!K40, T3_R2!K40)), MAX('MDA1'!K40, 'MDA2'!K40, 'T1'!M40, MAX(T3_R1!L40, T3_R2!L40)), MAX('MDA1'!L40, 'MDA2'!L40, 'T1'!N40, MAX(T3_R1!M40, T3_R2!M40)))","v":41323},{"$f":"IF(AND(COUNTRY_INFO!J40>1,COUNTRY_INFO!J40<4),IF(COUNTRY_INFO!E40>MAX('MDA2'!J40,'T1'!L40,MAX(T3_R1!K40,T3_R2!K40)),MAX('MDA2'!J40,'T1'!L40,MAX(T3_R1!K40,T3_R2!K40)),COUNTRY_INFO!E40),0)","v":0},{"$f":"IF(AND(COUNTRY_INFO!J40>1,COUNTRY_INFO!J40<4), IF(T40/COUNTRY_INFO!E40*100<>0, IF(T40/COUNTRY_INFO!E40*100>100,100,T40/COUNTRY_INFO!E40*100), \"-\"),0)","v":0},{"$f":"IF(AND(COUNTRY_INFO!J40>1,COUNTRY_INFO!J40<4),IF(COUNTRY_INFO!F40>MAX('MDA1'!K40,'MDA2'!K40,'T1'!M40,MAX(T3_R1!L40,T3_R2!L40)),MAX('MDA1'!K40,'MDA2'!K40,'T1'!M40,MAX(T3_R1!L40,T3_R2!L40)),COUNTRY_INFO!F40),0)","v":0},{"$f":"IF(AND(COUNTRY_INFO!J40>1,COUNTRY_INFO!J40<4), IF(V40/COUNTRY_INFO!F40*100<>0, IF(V40/COUNTRY_INFO!F40*100>100,100,V40/COUNTRY_INFO!F40*100), \"-\"),0)","v":0},0,{"$f":"IF(AND(COUNTRY_INFO!J40>1,COUNTRY_INFO!J40<4), IF(S40/P40*100<>0, IF(X40/P40*100>100,100,X40/P40*100), \"-\"),0)","v":0},{"$f":"COUNTRY_INFO!O40","v":138547},null,null,{"$f":"MAX('T1'!L40,'T2'!J40)+MAX('T1'!M40,'T2'!K40)+MAX('T1'!N40,'T2'!L40)","v":0},{"$f":"IF(COUNTRY_INFO!K40=1,IF(COUNTRY_INFO!F40*0.33>MAX('T1'!M40,'T2'!K40),MAX('T1'!M40,'T2'!K40),COUNTRY_INFO!F40*0.33),IF(COUNTRY_INFO!K40=2,IF(COUNTRY_INFO!F40*0.5>MAX('T1'!M40,'T2'!K40),MAX('T1'!M40,'T2'!K40),COUNTRY_INFO!F40*0.5),IF(COUNTRY_INFO!K40=3,IF(COUNTRY_INFO!F40>MAX('T1'!M40,'T2'!K40),MAX('T1'!M40,'T2'!K40),COUNTRY_INFO!F40),0)))","v":0},{"$f":"IF(AND(COUNTRY_INFO!K40>0,COUNTRY_INFO!K40<4),IF(Z40>0,IF(COUNTRY_INFO!K40=1, AD40/(COUNTRY_INFO!F40*0.33)*100, IF(COUNTRY_INFO!K40=2, AD40/(COUNTRY_INFO!F40*0.5)*100, IF(COUNTRY_INFO!K40=3, AD40/COUNTRY_INFO!F40*100))),\"-\"),0)","v":0},{"$f":"IF(COUNTRY_INFO!K40=2,IF(COUNTRY_INFO!G40*0.2>MAX('T1'!N40,'T2'!L40),MAX('T1'!N40,'T2'!L40),COUNTRY_INFO!G40*0.2),IF(COUNTRY_INFO!K40=3,IF(COUNTRY_INFO!G40>MAX('T1'!N40,'T2'!L40),MAX('T1'!N40,'T2'!L40),COUNTRY_INFO!G40),0))","v":0},{"$f":"IF(AND(COUNTRY_INFO!K40>0,COUNTRY_INFO!K40<4),IF(Z40>0,IF(COUNTRY_INFO!K40=1, 0, IF(COUNTRY_INFO!K40=2, AF40/(COUNTRY_INFO!G40*0.2)*100, IF(COUNTRY_INFO!K40=3, AF40/COUNTRY_INFO!G40*100))),\"-\"),0)","v":0},0,{"$f":"IF(AND(COUNTRY_INFO!K40>0,COUNTRY_INFO!K40<4), IF(AC40/Z40*100<>0, IF(AH40/Z40*100>100,100,AH40/Z40*100), \"-\"),0)","v":"-"},null,{"$f":"IF(AND(D40<>0, D40<>\"Inconnu\",D40<>\"Interrompu\",D40<>\"Non requis\"),D40/COUNTRY_INFO!D40, 0)","v":0},{"$f":"IF(AND(J40<>0,J40<>\"Inconnu\",J40<>\"Interrompu\",J40<>\"Non requis\"),J40/COUNTRY_INFO!D40, 0)","v":0.33004971619616247},{"$f":"IF(AND(P40<>0,P40<>\"Inconnu\",P40<>\"Non requis\"),P40/(COUNTRY_INFO!E40+COUNTRY_INFO!F40), 0)","v":0},{"$f":"IF(AND(Z40<>0,Z40<>\"Inconnu\",Z40<>\"Non requis\"),IF(COUNTRY_INFO!K40=1,1,IF(COUNTRY_INFO!K40=2,0.5*COUNTRY_INFO!F40/(0.5*COUNTRY_INFO!F40+0.2*COUNTRY_INFO!G40),IF(COUNTRY_INFO!K40=3,COUNTRY_INFO!F40/(COUNTRY_INFO!F40+COUNTRY_INFO!G40)))),0)","v":0.37499909777909302},{"$f":"IF(AND(Z40<>0,Z40<>\"Inconnu\",Z40<>\"Non requis\"),IF(COUNTRY_INFO!K40=1,0,IF(COUNTRY_INFO!K40=2,0.2*COUNTRY_INFO!G40/(0.5*COUNTRY_INFO!F40+0.2*COUNTRY_INFO!G40),IF(COUNTRY_INFO!K40=3,COUNTRY_INFO!G40/(COUNTRY_INFO!F40+COUNTRY_INFO!G40)))),0)","v":0.62500090222090698},{"$f":"MAX(COUNTRY_INFO!D40*AK40*PROFILE!$G$7,COUNTRY_INFO!D40*AL40*PROFILE!$G$7)","v":2286.2825601989584},{"$f":"MAX(COUNTRY_INFO!D40*AK40*PROFILE!$G$8,COUNTRY_INFO!D40*AL40*PROFILE!$G$8,COUNTRY_INFO!D40*AM40*PROFILE!$G$8)","v":9145.452906633509},{"$f":"MAX(COUNTRY_INFO!D40*AK40*PROFILE!$G$9,COUNTRY_INFO!D40*AL40*PROFILE!$G$9,COUNTRY_INFO!D40*AM40*PROFILE!$G$9,IF(AND(DISTRICT!Z40<>\"Inconnu\",Z40<>\"Non requis\"),COUNTRY_INFO!O40*DISTRICT!AN40,0))","v":51955},{"$f":"MAX(COUNTRY_INFO!D40*AK40*PROFILE!$G$10,COUNTRY_INFO!D40*AL40*PROFILE!$G$10,IF(AND(DISTRICT!Z40<>\"Inconnu\",Z40<>\"Non requis\"),COUNTRY_INFO!O40*DISTRICT!AO40,0))","v":86592},149978.73546683247,0,{"$f":"MAX('MDA2'!J40,'T1'!L40,'T2'!J40,T3_R1!K40,T3_R2!K40)","v":0},{"$f":"MAX('MDA1'!K40,'MDA2'!K40,'MDA3'!I40,'MDA3'!L40,'T1'!M40,'T2'!K40,T3_R1!L40,T3_R2!L40)","v":41323},{"$f":"MAX('MDA1'!L40,'MDA2'!L40,'MDA3'!J40,'MDA3'!M40,'T1'!N40,'T2'!L40,T3_R1!M40,T3_R2!M40)","v":32529},73852,{"$f":"MAX('MDA2'!J40,T40)","v":0},{"$f":"MAX('MDA1'!K40,'MDA2'!K40,'MDA3'!I40,'MDA3'!L40,V40,AD40)","v":16796},{"$f":"MAX('MDA1'!L40,'MDA2'!L40,'MDA3'!J40,'MDA3'!M40,AF40)","v":32529},49325,32.887995652495775]
[{"$f":"IF(COUNTRY_INFO!A41=0,\" \",COUNTRY_INFO!A41)","v":"Togo"},{"$f":"IF(COUNTRY_INFO!B41=0,\" \",COUNTRY_INFO!B41)","v":"PLATEAUX"},{"$f":"IF(COUNTRY_INFO!C41=0,\" \",COUNTRY_INFO!C41)","v":"KPELE"},{"$f":"COUNTRY_INFO!L41","v":"Non requis"},null,null,{"$f":"MAX('MDA1'!M41,'MDA2'!M41)","v":0},{"$f":"IF(AND(COUNTRY_INFO!H41>0,COUNTRY_INFO!H41<4),IF(D41>MAX('MDA1'!M41,'MDA2'!M41),MAX('MDA1'!M41,'MDA2'!M41),D41),0)","v":0},{"$f":"IF(AND(COUNTRY_INFO!H41>0,COUNTRY_INFO!H41<4), IF(G41/D41*100<>0, IF(G41/D41*100>100,100,G41/D41*100), \"-\"),0)","v":0},{"$f":"COUNTRY_INFO!M41","v":64548},null,null,{"$f":"MAX('MDA1'!M41,MAX('MDA3'!I41,'MDA3'!L41)+MAX('MDA3'!J41,'MDA3'!M41))","v":55348},{"$f":"IF(AND(COUNTRY_INFO!I41>0,COUNTRY_INFO!I41<4),IF(J41>MAX('MDA1'!M41,MAX('MDA3'!I41,'MDA3'!L41)+MAX('MDA3'!J41,'MDA3'!M41)),MAX('MDA1'!M41,MAX('MDA3'!I41,'MDA3'!L41)+MAX('MDA3'!J41,'MDA3'!M41)),J41),0)","v":55348},{"$f":"IF(AND(COUNTRY_INFO!I41>0,COUNTRY_INFO!I41<4), IF(M41/J41*100<>0, IF(M41/J41*100>100,100,M41/J41*100), \"-\"),0)","v":85.747040961764881},{"$f":"COUNTRY_INFO!N41","v":42857},null,null,{"$f":"SUM(MAX('MDA2'!J41, 'T1'!L41, MAX(T3_R1!K41, T3_R2!K41)), MAX('MDA1'!K41, 'MDA2'!K41, 'T1'!M41, MAX(T3_R1!L41, T3_R2!L41)), MAX('MDA1'!L41, 'MDA2'!L41, 'T1'!N41, MAX(T3_R1!M41, T3_R2!M41)))","v":24336},{"$f":"IF(AND(COUNTRY_INFO!J41>1,COUNTRY_INFO!J41<4),IF(COUNTRY_INFO!E41>MAX('MDA2'!J41,'T1'!L41,MAX(T3_R1!K41,T3_R2!K41)),MAX('MDA2'!J41,'T1'!L41,MAX(T3_R1!K41,T3_R2!K41)),COUNTRY_INFO!E41),0)","v":0},{"$f":"IF(AND(COUNTRY_INFO!J41>1,COUNTRY_INFO!J41<4), IF(T41/COUNTRY_INFO!E41*100<>0, IF(T41/COUNTRY_INFO!E41*100>100,100,T41/COUNTRY_INFO!E41*100), \"-\"),0)","v":"-"},{"$f":"IF(AND(COUNTRY_INFO!J41>1,COUNTRY_INFO!J41<4),IF(COUNTRY_INFO!F41>MAX('MDA1'!K41,'MDA2'!K41,'T1'!M41,MAX(T3_R1!L41,T3_R2!L41)),MAX('MDA1'!K41,'MDA2'!K41,'T1'!M41,MAX(T3_R1!L41,T3_R2!L41)),COUNTRY_INFO!F41),0)","v":24336},{"$f":"IF(AND(COUNTRY_INFO!J41>1,COUNTRY_INFO!J41<4), IF(V41/COUNTRY_INFO!F41*100<>0, IF(V41/COUNTRY_INFO!F41*100>100,100,V41/COUNTRY_INFO!F41*100), \"-\"),0)","v":87.069767441860463},24336,{"$f":"IF(AND(COUNTRY_INFO!J41>1,COUNTRY_INFO!J41<4), IF(S41/P41*100<>0, IF(X41/P41*100>100,100,X41/P41*100), \"-\"),0)","v":56.78418928063094},{"$f":"COUNTRY_INFO!O41","v":23291.800000000003},null,null,{"$f":"MAX('T1'!L41,'T2'!J41)+MAX('T1'!M41,'T2'!K41)+MAX('T1'!N41,'T2'!L41)","v":3049},{"$f":"IF(COUNTRY_INFO!K41=1,IF(COUNTRY_INFO!F41*0.33>MAX('T1'!M41,'T2'!K41),MAX('T1'!M41,'T2'!K41),COUNTRY_INFO!F41*0.33),IF(COUNTRY_INFO!K41=2,IF(COUNTRY_INFO!F41*0.5>MAX('T1'!M41,'T2'!K41),MAX('T1'!M41,'T2'!K41),COUNTRY_INFO!F41*0.5),IF(COUNTRY_INFO!K41=3,IF(COUNTRY_INFO!F41>MAX('T1'!M41,'T2'!K41),MAX('T1'!M41,'T2'!K41),COUNTRY_INFO!F41),0)))","v":3049},{"$f":"IF(AND(COUNTRY_INFO!K41>0,COUNTRY_INFO!K41<4),IF(Z41>0,IF(COUNTRY_INFO!K41=1, AD41/(COUNTRY_INFO!F41*0.33)*100, IF(COUNTRY_INFO!K41=2, AD41/(COUNTRY_INFO!F41*0.5)*100, IF(COUNTRY_INFO!K41=3, AD41/COUNTRY_INFO!F41*100))),\"-\"),0)","v":21.817531305903398},{"$f":"IF(COUNTRY_INFO!K41=2,IF(COUNTRY_INFO!G41*0.2>MAX('T1'!N41,'T2'!L41),MAX('T1'!N41,'T2'!L41),COUNTRY_INFO!G41*0.2),IF(COUNTRY_INFO!K41=3,IF(COUNTRY_INFO!G41>MAX('T1'!N41,'T2'!L41),MAX('T1'!N41,'T2'!L41),COUNTRY_INFO!G41),0))","v":0},{"$f":"IF(AND(COUNTRY_INFO!K41>0,COUNTRY_INFO!K41<4),IF(Z41>0,IF(COUNTRY_INFO!K41=1, 0, IF(COUNTRY_INFO!K41=2, AF41/(COUNTRY_INFO!G41*0.2)*100, IF(COUNTRY_INFO!K41=3, AF41/COUNTRY_INFO!G41*100))),\"-\"),0)","v":0},3049,{"$f":"IF(AND(COUNTRY_INFO!K41>0,COUNTRY_INFO!K41<4), IF(AC41/Z41*100<>0, IF(AH41/Z41*100>100,100,AH41/Z41*100), \"-\"),0)","v":13.090443847190855},null,{"$f":"IF(AND(D41<>0, D41<>\"Inconnu\",D41<>\"Interrompu\",D41<>\"Non requis\"),D41/COUNTRY_INFO!D41, 0)","v":0},{"$f":"IF(AND(J41<>0,J41<>\"Inconnu\",J41<>\"Interrompu\",J41<>\"Non requis\"),J41/COUNTRY_INFO!D41, 0)","v":0.69282041924715831},{"$f":"IF(AND(P41<>0,P41<>\"Inconnu\",P41<>\"Non requis\"),P41/(COUNTRY_INFO!E41+COUNTRY_INFO!F41), 0)","v":1},{"$f":"IF(AND(Z41<>0,Z41<>\"Inconnu\",Z41<>\"Non requis\"),IF(COUNTRY_INFO!K41=1,1,IF(COUNTRY_INFO!K41=2,0.5*COUNTRY_INFO!F41/(0.5*COUNTRY_INFO!F41+0.2*COUNTRY_INFO!G41),IF(COUNTRY_INFO!K41=3,COUNTRY_INFO!F41/(COUNTRY_INFO!F41+COUNTRY_INFO!G41)))),0)","v":0.59999656531483181},{"$f":"IF(AND(Z41<>0,Z41<>\"Inconnu\",Z41<>\"Non requis\"),IF(COUNTRY_INFO!K41=1,0,IF(COUNTRY_INFO!K41=2,0.2*COUNTRY_INFO!G41/(0.5*COUNTRY_INFO!F41+0.2*COUNTRY_INFO!G41),IF(COUNTRY_INFO!K41=3,COUNTRY_INFO!G41/(COUNTRY_INFO!F41+COUNTRY_INFO!G41)))),0)","v":0.40000343468516819},{"$f":"MAX(COUNTRY_INFO!D41*AK41*PROFILE!$G$7,COUNTRY_INFO!D41*AL41*PROFILE!$G$7)","v":2581.8325494799128},{"$f":"MAX(COUNTRY_INFO!D41*AK41*PROFILE!$G$8,COUNTRY_INFO!D41*AL41*PROFILE!$G$8,COUNTRY_INFO!D41*AM41*PROFILE!$G$8)","v":14906.741037322625},{"$f":"MAX(COUNTRY_INFO!D41*AK41*PROFILE!$G$9,COUNTRY_INFO!D41*AL41*PROFILE!$G$9,COUNTRY_INFO!D41*AM41*PROFILE!$G$9,IF(AND(DISTRICT!Z41<>\"Inconnu\",Z41<>\"Non requis\"),COUNTRY_INFO!O41*DISTRICT!AN41,0))","v":27950.088992098623},{"$f":"MAX(COUNTRY_INFO!D41*AK41*PROFILE!$G$10,COUNTRY_INFO!D41*AL41*PROFILE!$G$10,IF(AND(DISTRICT!Z41<>\"Inconnu\",Z41<>\"Non requis\"),COUNTRY_INFO!O41*DISTRICT!AO41,0))","v":32274.080501932251},77712.743080833403,"Y",{"$f":"MAX('MDA2'!J41,'T1'!L41,'T2'!J41,T3_R1!K41,T3_R2!K41)","v":0},{"$f":"MAX('MDA1'!K41,'MDA2'!K41,'MDA3'!I41,'MDA3'!L41,'T1'!M41,'T2'!K41,T3_R1!L41,T3_R2!L41)","v":24336},{"$f":"MAX('MDA1'!L41,'MDA2'!L41,'MDA3'!J41,'MDA3'!M41,'T1'!N41,'T2'!L41,T3_R1!M41,T3_R2!M41)","v":35355},59691,{"$f":"MAX('MDA2'!J41,T41)","v":0},{"$f":"MAX('MDA1'!K41,'MDA2'!K41,'MDA3'!I41,'MDA3'!L41,V41,AD41)","v":24336},{"$f":"MAX('MDA1'!L41,'MDA2'!L41,'MDA3'!J41,'MDA3'!M41,AF41)","v":35355},59691,76.809796738112851]
[{"$f":"IF(COUNTRY_INFO!A42=0,\" \",COUNTRY_INFO!A42)","v":"Togo"},{"$f":"IF(COUNTRY_INFO!B42=0,\" \",COUNTRY_INFO!B42)","v":"PLATEAUX"},{"$f":"IF(COUNTRY_INFO!C42=0,\" \",COUNTRY_INFO!C42)","v":"MOYEN MONO"},{"$f":"COUNTRY_INFO!L42","v":"Non requis"},null,null,{"$f":"MAX('MDA1'!M42,'MDA2'!M42)","v":0},{"$f":"IF(AND(COUNTRY_INFO!H42>0,COUNTRY_INFO!H42<4),IF(D42>MAX('MDA1'!M42,'MDA2'!M42),MAX('MDA1'!M42,'MDA2'!M42),D42),0)","v":0},{"$f":"IF(AND(COUNTRY_INFO!H42>0,COUNTRY_INFO!H42<4), IF(G42/D42*100<>0, IF(G42/D42*100>100,100,G42/D42*100), \"-\"),0)","v":0},{"$f":"COUNTRY_INFO!M42","v":55930},null,null,{"$f":"MAX('MDA1'!M42,MAX('MDA3'!I42,'MDA3'!L42)+MAX('MDA3'!J42,'MDA3'!M42))","v":45934},{"$f":"IF(AND(COUNTRY_INFO!I42>0,COUNTRY_INFO!I42<4),IF(J42>MAX('MDA1'!M42,MAX('MDA3'!I42,'MDA3'!L42)+MAX('MDA3'!J42,'MDA3'!M42)),MAX('MDA1'!M42,MAX('MDA3'!I42,'MDA3'!L42)+MAX('MDA3'!J42,'MDA3'!M42)),J42),0)","v":45934},{"$f":"IF(AND(COUNTRY_INFO!I42>0,COUNTRY_INFO!I42<4), IF(M42/J42*100<>0, IF(M42/J42*100>100,100,M42/J42*100), \"-\"),0)","v":82.127659574468083},{"$f":"COUNTRY_INFO!N42","v":43019},null,null,{"$f":"SUM(MAX('MDA2'!J42, 'T1'!L42, MAX(T3_R1!K42, T3_R2!K42)), MAX('MDA1'!K42, 'MDA2'!K42, 'T1'!M42, MAX(T3_R1!L42, T3_R2!L42)), MAX('MDA1'!L42, 'MDA2'!L42, 'T1'!N42, MAX(T3_R1!M42, T3_R2!M42)))","v":26398},{"$f":"IF(AND(COUNTRY_INFO!J42>1,COUNTRY_INFO!J42<4),IF(COUNTRY_INFO!E42>MAX('MDA2'!J42,'T1'!L42,MAX(T3_R1!K42,T3_R2!K42)),MAX('MDA2'!J42,'T1'!L42,MAX(T3_R1!K42,T3_R2!K42)),COUNTRY_INFO!E42),0)","v":0},{"$f":"IF(AND(COUNTRY_INFO!J42>1,COUNTRY_INFO!J42<4), IF(T42/COUNTRY_INFO!E42*100<>0, IF(T42/COUNTRY_INFO!E42*100>100,100,T42/COUNTRY_INFO!E42*100), \"-\"),0)","v":"-"},{"$f":"IF(AND(COUNTRY_INFO!J42>1,COUNTRY_INFO!J42<4),IF(COUNTRY_INFO!F42>MAX('MDA1'!K42,'MDA2'!K42,'T1'!M42,MAX(T3_R1!L42,T3_R2!L42)),MAX('MDA1'!K42,'MDA2'!K42,'T1'!M42,MAX(T3_R1!L42,T3_R2!L42)),COUNTRY_INFO!F42),0)","v":26398},{"$f":"IF(AND(COUNTRY_INFO!J42>1,COUNTRY_INFO!J42<4), IF(V42/COUNTRY_INFO!F42*100<>0, IF(V42/COUNTRY_INFO!F42*100>100,100,V42/COUNTRY_INFO!F42*100), \"-\"),0)","v":94.090390647276877},26398,{"$f":"IF(AND(COUNTRY_INFO!J42>1,COUNTRY_INFO!J42<4), IF(S42/P42*100<>0, IF(X42/P42*100>100,100,X42/P42*100), \"-\"),0)","v":61.363583532857582},{"$f":"COUNTRY_INFO!O42","v":23380},null,null,{"$f":"MAX('T1'!L42,'T2'!J42)+MAX('T1'!M42,'T2'!K42)+MAX('T1'!N42,'T2'!L42)","v":4829},{"$f":"IF(COUNTRY_INFO!K42=1,IF(COUNTRY_INFO!F42*0.33>MAX('T1'!M42,'T2'!K42),MAX('T1'!M42,'T2'!K42),COUNTRY_INFO!F42*0.33),IF(COUNTRY_INFO!K42=2,IF(COUNTRY_INFO!F42*0.5>MAX('T1'!M42,'T2'!K42),MAX('T1'!M42,'T2'!K42),COUNTRY_INFO!F42*0.5),IF(COUNTRY_INFO!K42=3,IF(COUNTRY_INFO!F42>MAX('T1'!M42,'T2'!K42),MAX('T1'!M42,'T2'!K42),COUNTRY_INFO!F42),0)))","v":4829},{"$f":"IF(AND(COUNTRY_INFO!K42>0,COUNTRY_INFO!K42<4),IF(Z42>0,IF(COUNTRY_INFO!K42=1, AD42/(COUNTRY_INFO!F42*0.33)*100, IF(COUNTRY_INFO!K42=2, AD42/(COUNTRY_INFO!F42*0.5)*100, IF(COUNTRY_INFO!K42=3, AD42/COUNTRY_INFO!F42*100))),\"-\"),0)","v":34.424009124607927},{"$f":"IF(COUNTRY_INFO!K42=2,IF(COUNTRY_INFO!G42*0.2>MAX('T1'!N42,'T2'!L42),MAX('T1'!N42,'T2'!L42),COUNTRY_INFO!G42*0.2),IF(COUNTRY_INFO!K42=3,IF(COUNTRY_INFO!G42>MAX('T1'!N42,'T2'!L42),MAX('T1'!N42,'T2'!L42),COUNTRY_INFO!G42),0))","v":0},{"$f":"IF(AND(COUNTRY_INFO!K42>0,COUNTRY_INFO!K42<4),IF(Z42>0,IF(COUNTRY_INFO!K42=1, 0, IF(COUNTRY_INFO!K42=2, AF42/(COUNTRY_INFO!G42*0.2)*100, IF(COUNTRY_INFO!K42=3, AF42/COUNTRY_INFO!G42*100))),\"-\"),0)","v":0},4829,{"$f":"IF(AND(COUNTRY_INFO!K42>0,COUNTRY_INFO!K42<4), IF(AC42/Z42*100<>0, IF(AH42/Z42*100>100,100,AH42/Z42*100), \"-\"),0)","v":20.654405474764754},null,{"$f":"IF(AND(D42<>0, D42<>\"Inconnu\",D42<>\"Interrompu\",D42<>\"Non requis\"),D42/COUNTRY_INFO!D42, 0)","v":0},{"$f":"IF(AND(J42<>0,J42<>\"Inconnu\",J42<>\"Interrompu\",J42<>\"Non requis\"),J42/COUNTRY_INFO!D42, 0)","v":0.59806028721436288},{"$f":"IF(AND(P42<>0,P42<>\"Inconnu\",P42<>\"Non requis\"),P42/(COUNTRY_INFO!E42+COUNTRY_INFO!F42), 0)","v":1},{"$f":"IF(AND(Z42<>0,Z42<>\"Inconnu\",Z42<>\"Non requis\"),IF(COUNTRY_INFO!K42=1,1,IF(COUNTRY_INFO!K42=2,0.5*COUNTRY_INFO!F42/(0.5*COUNTRY_INFO!F42+0.2*COUNTRY_INFO!G42),IF(COUNTRY_INFO!K42=3,COUNTRY_INFO!F42/(COUNTRY_INFO!F42+COUNTRY_INFO!G42)))),0)","v":0.6},{"$f":"IF(AND(Z42<>0,Z42<>\"Inconnu\",Z42<>\"Non requis\"),IF(COUNTRY_INFO!K42=1,0,IF(COUNTRY_INFO!K42=2,0.2*COUNTRY_INFO!G42/(0.5*COUNTRY_INFO!F42+0.2*COUNTRY_INFO!G42),IF(COUNTRY_INFO!K42=3,COUNTRY_INFO!G42/(COUNTRY_INFO!F42+COUNTRY_INFO!G42)))),0)","v":0.4},{"$f":"MAX(COUNTRY_INFO!D42*AK42*PROFILE!$G$7,COUNTRY_INFO!D42*AL42*PROFILE!$G$7)","v":2237.1242252650977},{"$f":"MAX(COUNTRY_INFO!D42*AK42*PROFILE!$G$8,COUNTRY_INFO!D42*AL42*PROFILE!$G$8,COUNTRY_INFO!D42*AM42*PROFILE!$G$8)","v":14963.061116805035},{"$f":"MAX(COUNTRY_INFO!D42*AK42*PROFILE!$G$9,COUNTRY_INFO!D42*AL42*PROFILE!$G$9,COUNTRY_INFO!D42*AM42*PROFILE!$G$9,IF(AND(DISTRICT!Z42<>\"Inconnu\",Z42<>\"Non requis\"),COUNTRY_INFO!O42*DISTRICT!AN42,0))","v":28055.688950508993},{"$f":"MAX(COUNTRY_INFO!D42*AK42*PROFILE!$G$10,COUNTRY_INFO!D42*AL42*PROFILE!$G$10,IF(AND(DISTRICT!Z42<>\"Inconnu\",Z42<>\"Non requis\"),COUNTRY_INFO!O42*DISTRICT!AO42,0))","v":27965.069753874184},73220.944046453311,"Y",{"$f":"MAX('MDA2'!J42,'T1'!L42,'T2'!J42,T3_R1!K42,T3_R2!K42)","v":0},{"$f":"MAX('MDA1'!K42,'MDA2'!K42,'MDA3'!I42,'MDA3'!L42,'T1'!M42,'T2'!K42,T3_R1!L42,T3_R2!L42)","v":26398},{"$f":"MAX('MDA1'!L42,'MDA2'!L42,'MDA3'!J42,'MDA3'!M42,'T1'!N42,'T2'!L42,T3_R1!M42,T3_R2!M42)","v":28006},54404,{"$f":"MAX('MDA2'!J42,T42)","v":0},{"$f":"MAX('MDA1'!K42,'MDA2'!K42,'MDA3'!I42,'MDA3'!L42,V42,AD42)","v":26398},{"$f":"MAX('MDA1'!L42,'MDA2'!L42,'MDA3'!J42,'MDA3'!M42,AF42)","v":28006},54404,74.301145264508833]
[{"$f":"IF(COUNTRY_INFO!A43=0,\" \",COUNTRY_INFO!A43)","v":"Togo"},{"$f":"IF(COUNTRY_INFO!B43=0,\" \",COUNTRY_INFO!B43)","v":"PLATEAUX"},{"$f":"IF(COUNTRY_INFO!C43=0,\" \",COUNTRY_INFO!C43)","v":"OGOU"},{"$f":"COUNTRY_INFO!L43","v":"Non requis"},null,null,{"$f":"MAX('MDA1'!M43,'MDA2'!M43)","v":0},{"$f":"IF(AND(COUNTRY_INFO!H43>0,COUNTRY_INFO!H43<4),IF(D43>MAX('MDA1'!M43,'MDA2'!M43),MAX('MDA1'!M43,'MDA2'!M43),D43),0)","v":0},{"$f":"IF(AND(COUNTRY_INFO!H43>0,COUNTRY_INFO!H43<4), IF(G43/D43*100<>0, IF(G43/D43*100>100,100,G43/D43*100), \"-\"),0)","v":0},{"$f":"COUNTRY_INFO!M43","v":124094},null,null,{"$f":"MAX('MDA1'!M43,MAX('MDA3'!I43,'MDA3'!L43)+MAX('MDA3'!J43,'MDA3'!M43))","v":105034},{"$f":"IF(AND(COUNTRY_INFO!I43>0,COUNTRY_INFO!I43<4),IF(J43>MAX('MDA1'!M43,MAX('MDA3'!I43,'MDA3'!L43)+MAX('MDA3'!J43,'MDA3'!M43)),MAX('MDA1'!M43,MAX('MDA3'!I43,'MDA3'!L43)+MAX('MDA3'!J43,'MDA3'!M43)),J43),0)","v":105034},{"$f":"IF(AND(COUNTRY_INFO!I43>0,COUNTRY_INFO!I43<4), IF(M43/J43*100<>0, IF(M43/J43*100>100,100,M43/J43*100), \"-\"),0)","v":84.640675616871093},{"$f":"COUNTRY_INFO!N43","v":111070},null,null,{"$f":"SUM(MAX('MDA2'!J43, 'T1'!L43, MAX(T3_R1!K43, T3_R2!K43)), MAX('MDA1'!K43, 'MDA2'!K43, 'T1'!M43, MAX(T3_R1!L43, T3_R2!L43)), MAX('MDA1'!L43, 'MDA2'!L43, 'T1'!N43, MAX(T3_R1!M43, T3_R2!M43)))","v":70205},{"$f":"IF(AND(COUNTRY_INFO!J43>1,COUNTRY_INFO!J43<4),IF(COUNTRY_INFO!E43>MAX('MDA2'!J43,'T1'!L43,MAX(T3_R1!K43,T3_R2!K43)),MAX('MDA2'!J43,'T1'!L43,MAX(T3_R1!K43,T3_R2!K43)),COUNTRY_INFO!E43),0)","v":0},{"$f":"IF(AND(COUNTRY_INFO!J43>1,COUNTRY_INFO!J43<4), IF(T43/COUNTRY_INFO!E43*100<>0, IF(T43/COUNTRY_INFO!E43*100>100,100,T43/COUNTRY_INFO!E43*100), \"-\"),0)","v":"-"},{"$f":"IF(AND(COUNTRY_INFO!J43>1,COUNTRY_INFO!J43<4),IF(COUNTRY_INFO!F43>MAX('MDA1'!K43,'MDA2'!K43,'T1'!M43,MAX(T3_R1!L43,T3_R2!L43)),MAX('MDA1'!K43,'MDA2'!K43,'T1'!M43,MAX(T3_R1!L43,T3_R2!L43)),COUNTRY_INFO!F43),0)","v":70205},{"$f":"IF(AND(COUNTRY_INFO!J43>1,COUNTRY_INFO!J43<4), IF(V43/COUNTRY_INFO!F43*100<>0, IF(V43/COUNTRY_INFO!F43*100>100,100,V43/COUNTRY_INFO!F43*100), \"-\"),0)","v":96.918701768433252},70205,{"$f":"IF(AND(COUNTRY_INFO!J43>1,COUNTRY_INFO!J43<4), IF(S43/P43*100<>0, IF(X43/P43*100>100,100,X43/P43*100), \"-\"),0)","v":63.207886918159716},{"$f":"COUNTRY_INFO!O43","v":193165},null,null,{"$f":"MAX('T1'!L43,'T2'!J43)+MAX('T1'!M43,'T2'!K43)+MAX('T1'!N43,'T2'!L43)","v":39497},{"$f":"IF(COUNTRY_INFO!K43=1,IF(COUNTRY_INFO!F43*0.33>MAX('T1'!M43,'T2'!K43),MAX('T1'!M43,'T2'!K43),COUNTRY_INFO!F43*0.33),IF(COUNTRY_INFO!K43=2,IF(COUNTRY_INFO!F43*0.5>MAX('T1'!M43,'T2'!K43),MAX('T1'!M43,'T2'!K43),COUNTRY_INFO!F43*0.5),IF(COUNTRY_INFO!K43=3,IF(COUNTRY_INFO!F43>MAX('T1'!M43,'T2'!K43),MAX('T1'!M43,'T2'!K43),COUNTRY_INFO!F43),0)))","v":39497},{"$f":"IF(AND(COUNTRY_INFO!K43>0,COUNTRY_INFO!K43<4),IF(Z43>0,IF(COUNTRY_INFO!K43=1, AD43/(COUNTRY_INFO!F43*0.33)*100, IF(COUNTRY_INFO!K43=2, AD43/(COUNTRY_INFO!F43*0.5)*100, IF(COUNTRY_INFO!K43=3, AD43/COUNTRY_INFO!F43*100))),\"-\"),0)","v":54.526001905103747},{"$f":"IF(COUNTRY_INFO!K43=2,IF(COUNTRY_INFO!G43*0.2>MAX('T1'!N43,'T2'!L43),MAX('T1'!N43,'T2'!L43),COUNTRY_INFO!G43*0.2),IF(COUNTRY_INFO!K43=3,IF(COUNTRY_INFO!G43>MAX('T1'!N43,'T2'!L43),MAX('T1'!N43,'T2'!L43),COUNTRY_INFO!G43),0))","v":0},{"$f":"IF(AND(COUNTRY_INFO!K43>0,COUNTRY_INFO!K43<4),IF(Z43>0,IF(COUNTRY_INFO!K43=1, 0, IF(COUNTRY_INFO!K43=2, AF43/(COUNTRY_INFO!G43*0.2)*100, IF(COUNTRY_INFO!K43=3, AF43/COUNTRY_INFO!G43*100))),\"-\"),0)","v":0},39497,{"$f":"IF(AND(COUNTRY_INFO!K43>0,COUNTRY_INFO!K43<4), IF(AC43/Z43*100<>0, IF(AH43/Z43*100>100,100,AH43/Z43*100), \"-\"),0)","v":20.447285999016383},null,{"$f":"IF(AND(D43<>0, D43<>\"Inconnu\",D43<>\"Interrompu\",D43<>\"Non requis\"),D43/COUNTRY_INFO!D43, 0)","v":0},{"$f":"IF(AND(J43<>0,J43<>\"Inconnu\",J43<>\"Interrompu\",J43<>\"Non requis\"),J43/COUNTRY_INFO!D43, 0)","v":0.51394042806971041},{"$f":"IF(AND(P43<>0,P43<>\"Inconnu\",P43<>\"Non requis\"),P43/(COUNTRY_INFO!E43+COUNTRY_INFO!F43), 0)","v":1},{"$f":"IF(AND(Z43<>0,Z43<>\"Inconnu\",Z43<>\"Non requis\"),IF(COUNTRY_INFO!K43=1,1,IF(COUNTRY_INFO!K43=2,0.5*COUNTRY_INFO!F43/(0.5*COUNTRY_INFO!F43+0.2*COUNTRY_INFO!G43),IF(COUNTRY_INFO!K43=3,COUNTRY_INFO!F43/(COUNTRY_INFO!F43+COUNTRY_INFO!G43)))),0)","v":0.37500064711516062},{"$f":"IF(AND(Z43<>0,Z43<>\"Inconnu\",Z43<>\"Non requis\"),IF(COUNTRY_INFO!K43=1,0,IF(COUNTRY_INFO!K43=2,0.2*COUNTRY_INFO!G43/(0.5*COUNTRY_INFO!F43+0.2*COUNTRY_INFO!G43),IF(COUNTRY_INFO!K43=3,COUNTRY_INFO!G43/(COUNTRY_INFO!F43+COUNTRY_INFO!G43)))),0)","v":0.62499935288483943},{"$f":"MAX(COUNTRY_INFO!D43*AK43*PROFILE!$G$7,COUNTRY_INFO!D43*AL43*PROFILE!$G$7)","v":4963.5918757383697},{"$f":"MAX(COUNTRY_INFO!D43*AK43*PROFILE!$G$8,COUNTRY_INFO!D43*AL43*PROFILE!$G$8,COUNTRY_INFO!D43*AM43*PROFILE!$G$8)","v":38633.014521319477},{"$f":"MAX(COUNTRY_INFO!D43*AK43*PROFILE!$G$9,COUNTRY_INFO!D43*AL43*PROFILE!$G$9,COUNTRY_INFO!D43*AM43*PROFILE!$G$9,IF(AND(DISTRICT!Z43<>\"Inconnu\",Z43<>\"Non requis\"),COUNTRY_INFO!O43*DISTRICT!AN43,0))","v":72437},{"$f":"MAX(COUNTRY_INFO!D43*AK43*PROFILE!$G$10,COUNTRY_INFO!D43*AL43*PROFILE!$G$10,IF(AND(DISTRICT!Z43<>\"Inconnu\",Z43<>\"Non requis\"),COUNTRY_INFO!O43*DISTRICT!AO43,0))","v":120728.00000000001},236761.60639705788,"Y",{"$f":"MAX('MDA2'!J43,'T1'!L43,'T2'!J43,T3_R1!K43,T3_R2!K43)","v":0},{"$f":"MAX('MDA1'!K43,'MDA2'!K43,'MDA3'!I43,'MDA3'!L43,'T1'!M43,'T2'!K43,T3_R1!L43,T3_R2!L43)","v":70205},{"$f":"MAX('MDA1'!L43,'MDA2'!L43,'MDA3'!J43,'MDA3'!M43,'T1'!N43,'T2'!L43,T3_R1!M43,T3_R2!M43)","v":64367},134572,{"$f":"MAX('MDA2'!J43,T43)","v":0},{"$f":"MAX('MDA1'!K43,'MDA2'!K43,'MDA3'!I43,'MDA3'!L43,V43,AD43)","v":70205},{"$f":"MAX('MDA1'!L43,'MDA2'!L43,'MDA3'!J43,'MDA3'!M43,AF43)","v":64367},134572,56.838607427894296]
[{"$f":"IF(COUNTRY_INFO!A44=0,\" \",COUNTRY_INFO!A44)","v":"Togo"},{"$f":"IF(COUNTRY_INFO!B44=0,\" \",COUNTRY_INFO!B44)","v":"PLATEAUX"},{"$f":"IF(COUNTRY_INFO!C44=0,\" \",COUNTRY_INFO!C44)","v":"WAWA"},{"$f":"COUNTRY_INFO!L44","v":"Non requis"},null,null,{"$f":"MAX('MDA1'!M44,'MDA2'!M44)","v":0},{"$f":"IF(AND(COUNTRY_INFO!H44>0,COUNTRY_INFO!H44<4),IF(D44>MAX('MDA1'!M44,'MDA2'!M44),MAX('MDA1'!M44,'MDA2'!M44),D44),0)","v":0},{"$f":"IF(AND(COUNTRY_INFO!H44>0,COUNTRY_INFO!H44<4), IF(G44/D44*100<>0, IF(G44/D44*100>100,100,G44/D44*100), \"-\"),0)","v":0},{"$f":"COUNTRY_INFO!M44","v":100119},null,null,{"$f":"MAX('MDA1'!M44,MAX('MDA3'!I44,'MDA3'!L44)+MAX('MDA3'!J44,'MDA3'!M44))","v":84013},{"$f":"IF(AND(COUNTRY_INFO!I44>0,COUNTRY_INFO!I44<4),IF(J44>MAX('MDA1'!M44,MAX('MDA3'!I44,'MDA3'!L44)+MAX('MDA3'!J44,'MDA3'!M44)),MAX('MDA1'!M44,MAX('MDA3'!I44,'MDA3'!L44)+MAX('MDA3'!J44,'MDA3'!M44)),J44),0)","v":84013},{"$f":"IF(AND(COUNTRY_INFO!I44>0,COUNTRY_INFO!I44<4), IF(M44/J44*100<>0, IF(M44/J44*100>100,100,M44/J44*100), \"-\"),0)","v":83.913143359402312},{"$f":"COUNTRY_INFO!N44","v":57259},null,null,{"$f":"SUM(MAX('MDA2'!J44, 'T1'!L44, MAX(T3_R1!K44, T3_R2!K44)), MAX('MDA1'!K44, 'MDA2'!K44, 'T1'!M44, MAX(T3_R1!L44, T3_R2!L44)), MAX('MDA1'!L44, 'MDA2'!L44, 'T1'!N44, MAX(T3_R1!M44, T3_R2!M44)))","v":39133},{"$f":"IF(AND(COUNTRY_INFO!J44>1,COUNTRY_INFO!J44<4),IF(COUNTRY_INFO!E44>MAX('MDA2'!J44,'T1'!L44,MAX(T3_R1!K44,T3_R2!K44)),MAX('MDA2'!J44,'T1'!L44,MAX(T3_R1!K44,T3_R2!K44)),COUNTRY_INFO!E44),0)","v":0},{"$f":"IF(AND(COUNTRY_INFO!J44>1,COUNTRY_INFO!J44<4), IF(T44/COUNTRY_INFO!E44*100<>0, IF(T44/COUNTRY_INFO!E44*100>100,100,T44/COUNTRY_INFO!E44*100), \"-\"),0)","v":"-"},{"$f":"IF(AND(COUNTRY_INFO!J44>1,COUNTRY_INFO!J44<4),IF(COUNTRY_INFO!F44>MAX('MDA1'!K44,'MDA2'!K44,'T1'!M44,MAX(T3_R1!L44,T3_R2!L44)),MAX('MDA1'!K44,'MDA2'!K44,'T1'!M44,MAX(T3_R1!L44,T3_R2!L44)),COUNTRY_INFO!F44),0)","v":37343},{"$f":"IF(AND(COUNTRY_INFO!J44>1,COUNTRY_INFO!J44<4), IF(V44/COUNTRY_INFO!F44*100<>0, IF(V44/COUNTRY_INFO!F44*100>100,100,V44/COUNTRY_INFO!F44*100), \"-\"),0)","v":100},37343,{"$f":"IF(AND(COUNTRY_INFO!J44>1,COUNTRY_INFO!J44<4), IF(S44/P44*100<>0, IF(X44/P44*100>100,100,X44/P44*100), \"-\"),0)","v":65.217695034841682},{"$f":"COUNTRY_INFO!O44","v":99582},null,null,{"$f":"MAX('T1'!L44,'T2'!J44)+MAX('T1'!M44,'T2'!K44)+MAX('T1'!N44,'T2'!L44)","v":5100},{"$f":"IF(COUNTRY_INFO!K44=1,IF(COUNTRY_INFO!F44*0.33>MAX('T1'!M44,'T2'!K44),MAX('T1'!M44,'T2'!K44),COUNTRY_INFO!F44*0.33),IF(COUNTRY_INFO!K44=2,IF(COUNTRY_INFO!F44*0.5>MAX('T1'!M44,'T2'!K44),MAX('T1'!M44,'T2'!K44),COUNTRY_INFO!F44*0.5),IF(COUNTRY_INFO!K44=3,IF(COUNTRY_INFO!F44>MAX('T1'!M44,'T2'!K44),MAX('T1'!M44,'T2'!K44),COUNTRY_INFO!F44),0)))","v":5100},{"$f":"IF(AND(COUNTRY_INFO!K44>0,COUNTRY_INFO!K44<4),IF(Z44>0,IF(COUNTRY_INFO!K44=1, AD44/(COUNTRY_INFO!F44*0.33)*100, IF(COUNTRY_INFO!K44=2, AD44/(COUNTRY_INFO!F44*0.5)*100, IF(COUNTRY_INFO!K44=3, AD44/COUNTRY_INFO!F44*100))),\"-\"),0)","v":13.657178052111508},{"$f":"IF(COUNTRY_INFO!K44=2,IF(COUNTRY_INFO!G44*0.2>MAX('T1'!N44,'T2'!L44),MAX('T1'!N44,'T2'!L44),COUNTRY_INFO!G44*0.2),IF(COUNTRY_INFO!K44=3,IF(COUNTRY_INFO!G44>MAX('T1'!N44,'T2'!L44),MAX('T1'!N44,'T2'!L44),COUNTRY_INFO!G44),0))","v":0},{"$f":"IF(AND(COUNTRY_INFO!K44>0,COUNTRY_INFO!K44<4),IF(Z44>0,IF(COUNTRY_INFO!K44=1, 0, IF(COUNTRY_INFO!K44=2, AF44/(COUNTRY_INFO!G44*0.2)*100, IF(COUNTRY_INFO!K44=3, AF44/COUNTRY_INFO!G44*100))),\"-\"),0)","v":0},5100,{"$f":"IF(AND(COUNTRY_INFO!K44>0,COUNTRY_INFO!K44<4), IF(AC44/Z44*100<>0, IF(AH44/Z44*100>100,100,AH44/Z44*100), \"-\"),0)","v":5.1214074832801115},null,{"$f":"IF(AND(D44<>0, D44<>\"Inconnu\",D44<>\"Interrompu\",D44<>\"Non requis\"),D44/COUNTRY_INFO!D44, 0)","v":0},{"$f":"IF(AND(J44<>0,J44<>\"Inconnu\",J44<>\"Interrompu\",J44<>\"Non requis\"),J44/COUNTRY_INFO!D44, 0)","v":0.80431080190877102},{"$f":"IF(AND(P44<>0,P44<>\"Inconnu\",P44<>\"Non requis\"),P44/(COUNTRY_INFO!E44+COUNTRY_INFO!F44), 0)","v":1},{"$f":"IF(AND(Z44<>0,Z44<>\"Inconnu\",Z44<>\"Non requis\"),IF(COUNTRY_INFO!K44=1,1,IF(COUNTRY_INFO!K44=2,0.5*COUNTRY_INFO!F44/(0.5*COUNTRY_INFO!F44+0.2*COUNTRY_INFO!G44),IF(COUNTRY_INFO!K44=3,COUNTRY_INFO!F44/(COUNTRY_INFO!F44+COUNTRY_INFO!G44)))),0)","v":0.37499748950613565},{"$f":"IF(AND(Z44<>0,Z44<>\"Inconnu\",Z44<>\"Non requis\"),IF(COUNTRY_INFO!K44=1,0,IF(COUNTRY_INFO!K44=2,0.2*COUNTRY_INFO!G44/(0.5*COUNTRY_INFO!F44+0.2*COUNTRY_INFO!G44),IF(COUNTRY_INFO!K44=3,COUNTRY_INFO!G44/(COUNTRY_INFO!F44+COUNTRY_INFO!G44)))),0)","v":0.62500251049386435},{"$f":"MAX(COUNTRY_INFO!D44*AK44*PROFILE!$G$7,COUNTRY_INFO!D44*AL44*PROFILE!$G$7)","v":4004.6243573988259},{"$f":"MAX(COUNTRY_INFO!D44*AK44*PROFILE!$G$8,COUNTRY_INFO!D44*AL44*PROFILE!$G$8,COUNTRY_INFO!D44*AM44*PROFILE!$G$8)","v":19916.508107418354},{"$f":"MAX(COUNTRY_INFO!D44*AK44*PROFILE!$G$9,COUNTRY_INFO!D44*AL44*PROFILE!$G$9,COUNTRY_INFO!D44*AM44*PROFILE!$G$9,IF(AND(DISTRICT!Z44<>\"Inconnu\",Z44<>\"Non requis\"),COUNTRY_INFO!O44*DISTRICT!AN44,0))","v":37343.38529262993},{"$f":"MAX(COUNTRY_INFO!D44*AK44*PROFILE!$G$10,COUNTRY_INFO!D44*AL44*PROFILE!$G$10,IF(AND(DISTRICT!Z44<>\"Inconnu\",Z44<>\"Non requis\"),COUNTRY_INFO!O44*DISTRICT!AO44,0))","v":62239},123503.51775744712,"Y",{"$f":"MAX('MDA2'!J44,'T1'!L44,'T2'!J44,T3_R1!K44,T3_R2!K44)","v":0},{"$f":"MAX('MDA1'!K44,'MDA2'!K44,'MDA3'!I44,'MDA3'!L44,'T1'!M44,'T2'!K44,T3_R1!L44,T3_R2!L44)","v":39133},{"$f":"MAX('MDA1'!L44,'MDA2'!L44,'MDA3'!J44,'MDA3'!M44,'T1'!N44,'T2'!L44,T3_R1!M44,T3_R2!M44)","v":52442},91575,{"$f":"MAX('MDA2'!J44,T44)","v":0},{"$f":"MAX('MDA1'!K44,'MDA2'!K44,'MDA3'!I44,'MDA3'!L44,V44,AD44)","v":37343},{"$f":"MAX('MDA1'!L44,'MDA2'!L44,'MDA3'!J44,'MDA3'!M44,AF44)","v":52442},89785,72.698334128694128]
[{"$f":"IF(COUNTRY_INFO!A45=0,\" \",COUNTRY_INFO!A45)","v":"Togo"},{"$f":"IF(COUNTRY_INFO!B45=0,\" \",COUNTRY_INFO!B45)","v":"SAVANES"},{"$f":"IF(COUNTRY_INFO!C45=0,\" \",COUNTRY_INFO!C45)","v":"CINKASSE"},{"$f":"COUNTRY_INFO!L45","v":"Non requis"},null,null,{"$f":"MAX('MDA1'!M45,'MDA2'!M45)","v":0},{"$f":"IF(AND(COUNTRY_INFO!H45>0,COUNTRY_INFO!H45<4),IF(D45>MAX('MDA1'!M45,'MDA2'!M45),MAX('MDA1'!M45,'MDA2'!M45),D45),0)","v":0},{"$f":"IF(AND(COUNTRY_INFO!H45>0,COUNTRY_INFO!H45<4), IF(G45/D45*100<>0, IF(G45/D45*100>100,100,G45/D45*100), \"-\"),0)","v":0},{"$f":"COUNTRY_INFO!M45","v":64583},null,null,{"$f":"MAX('MDA1'!M45,MAX('MDA3'!I45,'MDA3'!L45)+MAX('MDA3'!J45,'MDA3'!M45))","v":54077},{"$f":"IF(AND(COUNTRY_INFO!I45>0,COUNTRY_INFO!I45<4),IF(J45>MAX('MDA1'!M45,MAX('MDA3'!I45,'MDA3'!L45)+MAX('MDA3'!J45,'MDA3'!M45)),MAX('MDA1'!M45,MAX('MDA3'!I45,'MDA3'!L45)+MAX('MDA3'!J45,'MDA3'!M45)),J45),0)","v":54077},{"$f":"IF(AND(COUNTRY_INFO!I45>0,COUNTRY_INFO!I45<4), IF(M45/J45*100<>0, IF(M45/J45*100>100,100,M45/J45*100), \"-\"),0)","v":83.732561200315871},{"$f":"COUNTRY_INFO!N45","v":0},null,null,{"$f":"SUM(MAX('MDA2'!J45, 'T1'!L45, MAX(T3_R1!K45, T3_R2!K45)), MAX('MDA1'!K45, 'MDA2'!K45, 'T1'!M45, MAX(T3_R1!L45, T3_R2!L45)), MAX('MDA1'!L45, 'MDA2'!L45, 'T1'!N45, MAX(T3_R1!M45, T3_R2!M45)))","v":30578},{"$f":"IF(AND(COUNTRY_INFO!J45>1,COUNTRY_INFO!J45<4),IF(COUNTRY_INFO!E45>MAX('MDA2'!J45,'T1'!L45,MAX(T3_R1!K45,T3_R2!K45)),MAX('MDA2'!J45,'T1'!L45,MAX(T3_R1!K45,T3_R2!K45)),COUNTRY_INFO!E45),0)","v":0},{"$f":"IF(AND(COUNTRY_INFO!J45>1,COUNTRY_INFO!J45<4), IF(T45/COUNTRY_INFO!E45*100<>0, IF(T45/COUNTRY_INFO!E45*100>100,100,T45/COUNTRY_INFO!E45*100), \"-\"),0)","v":0},{"$f":"IF(AND(COUNTRY_INFO!J45>1,COUNTRY_INFO!J45<4),IF(COUNTRY_INFO!F45>MAX('MDA1'!K45,'MDA2'!K45,'T1'!M45,MAX(T3_R1!L45,T3_R2!L45)),MAX('MDA1'!K45,'MDA2'!K45,'T1'!M45,MAX(T3_R1!L45,T3_R2!L45)),COUNTRY_INFO!F45),0)","v":0},{"$f":"IF(AND(COUNTRY_INFO!J45>1,COUNTRY_INFO!J45<4), IF(V45/COUNTRY_INFO!F45*100<>0, IF(V45/COUNTRY_INFO!F45*100>100,100,V45/COUNTRY_INFO!F45*100), \"-\"),0)","v":0},0,{"$f":"IF(AND(COUNTRY_INFO!J45>1,COUNTRY_INFO!J45<4), IF(S45/P45*100<>0, IF(X45/P45*100>100,100,X45/P45*100), \"-\"),0)","v":0},{"$f":"COUNTRY_INFO!O45","v":76649},null,null,{"$f":"MAX('T1'!L45,'T2'!J45)+MAX('T1'!M45,'T2'!K45)+MAX('T1'!N45,'T2'!L45)","v":15676},{"$f":"IF(COUNTRY_INFO!K45=1,IF(COUNTRY_INFO!F45*0.33>MAX('T1'!M45,'T2'!K45),MAX('T1'!M45,'T2'!K45),COUNTRY_INFO!F45*0.33),IF(COUNTRY_INFO!K45=2,IF(COUNTRY_INFO!F45*0.5>MAX('T1'!M45,'T2'!K45),MAX('T1'!M45,'T2'!K45),COUNTRY_INFO!F45*0.5),IF(COUNTRY_INFO!K45=3,IF(COUNTRY_INFO!F45>MAX('T1'!M45,'T2'!K45),MAX('T1'!M45,'T2'!K45),COUNTRY_INFO!F45),0)))","v":15676},{"$f":"IF(AND(COUNTRY_INFO!K45>0,COUNTRY_INFO!K45<4),IF(Z45>0,IF(COUNTRY_INFO!K45=1, AD45/(COUNTRY_INFO!F45*0.33)*100, IF(COUNTRY_INFO!K45=2, AD45/(COUNTRY_INFO!F45*0.5)*100, IF(COUNTRY_INFO!K45=3, AD45/COUNTRY_INFO!F45*100))),\"-\"),0)","v":54.538496329541111},{"$f":"IF(COUNTRY_INFO!K45=2,IF(COUNTRY_INFO!G45*0.2>MAX('T1'!N45,'T2'!L45),MAX('T1'!N45,'T2'!L45),COUNTRY_INFO!G45*0.2),IF(COUNTRY_INFO!K45=3,IF(COUNTRY_INFO!G45>MAX('T1'!N45,'T2'!L45),MAX('T1'!N45,'T2'!L45),COUNTRY_INFO!G45),0))","v":0},{"$f":"IF(AND(COUNTRY_INFO!K45>0,COUNTRY_INFO!K45<4),IF(Z45>0,IF(COUNTRY_INFO!K45=1, 0, IF(COUNTRY_INFO!K45=2, AF45/(COUNTRY_INFO!G45*0.2)*100, IF(COUNTRY_INFO!K45=3, AF45/COUNTRY_INFO!G45*100))),\"-\"),0)","v":0},15676,{"$f":"IF(AND(COUNTRY_INFO!K45>0,COUNTRY_INFO!K45<4), IF(AC45/Z45*100<>0, IF(AH45/Z45*100>100,100,AH45/Z45*100), \"-\"),0)","v":20.451669297707735},null,{"$f":"IF(AND(D45<>0, D45<>\"Inconnu\",D45<>\"Interrompu\",D45<>\"Non requis\"),D45/COUNTRY_INFO!D45, 0)","v":0},{"$f":"IF(AND(J45<>0,J45<>\"Inconnu\",J45<>\"Interrompu\",J45<>\"Non requis\"),J45/COUNTRY_INFO!D45, 0)","v":0.67406665205456573},{"$f":"IF(AND(P45<>0,P45<>\"Inconnu\",P45<>\"Non requis\"),P45/(COUNTRY_INFO!E45+COUNTRY_INFO!F45), 0)","v":0},{"$f":"IF(AND(Z45<>0,Z45<>\"Inconnu\",Z45<>\"Non requis\"),IF(COUNTRY_INFO!K45=1,1,IF(COUNTRY_INFO!K45=2,0.5*COUNTRY_INFO!F45/(0.5*COUNTRY_INFO!F45+0.2*COUNTRY_INFO!G45),IF(COUNTRY_INFO!K45=3,COUNTRY_INFO!F45/(COUNTRY_INFO!F45+COUNTRY_INFO!G45)))),0)","v":0.37499510756826571},{"$f":"IF(AND(Z45<>0,Z45<>\"Inconnu\",Z45<>\"Non requis\"),IF(COUNTRY_INFO!K45=1,0,IF(COUNTRY_INFO!K45=2,0.2*COUNTRY_INFO!G45/(0.5*COUNTRY_INFO!F45+0.2*COUNTRY_INFO!G45),IF(COUNTRY_INFO!K45=3,COUNTRY_INFO!G45/(COUNTRY_INFO!F45+COUNTRY_INFO!G45)))),0)","v":0.62500489243173429},{"$f":"MAX(COUNTRY_INFO!D45*AK45*PROFILE!$G$7,COUNTRY_INFO!D45*AL45*PROFILE!$G$7)","v":2583.2325020614303},{"$f":"MAX(COUNTRY_INFO!D45*AK45*PROFILE!$G$8,COUNTRY_INFO!D45*AL45*PROFILE!$G$8,COUNTRY_INFO!D45*AM45*PROFILE!$G$8)","v":10333.294582989762},{"$f":"MAX(COUNTRY_INFO!D45*AK45*PROFILE!$G$9,COUNTRY_INFO!D45*AL45*PROFILE!$G$9,COUNTRY_INFO!D45*AM45*PROFILE!$G$9,IF(AND(DISTRICT!Z45<>\"Inconnu\",Z45<>\"Non requis\"),COUNTRY_INFO!O45*DISTRICT!AN45,0))","v":28742.999999999996},{"$f":"MAX(COUNTRY_INFO!D45*AK45*PROFILE!$G$10,COUNTRY_INFO!D45*AL45*PROFILE!$G$10,IF(AND(DISTRICT!Z45<>\"Inconnu\",Z45<>\"Non requis\"),COUNTRY_INFO!O45*DISTRICT!AO45,0))","v":47906},89565.527085051188,"Y",{"$f":"MAX('MDA2'!J45,'T1'!L45,'T2'!J45,T3_R1!K45,T3_R2!K45)","v":0},{"$f":"MAX('MDA1'!K45,'MDA2'!K45,'MDA3'!I45,'MDA3'!L45,'T1'!M45,'T2'!K45,T3_R1!L45,T3_R2!L45)","v":30578},{"$f":"MAX('MDA1'!L45,'MDA2'!L45,'MDA3'!J45,'MDA3'!M45,'T1'!N45,'T2'!L45,T3_R1!M45,T3_R2!M45)","v":32922},63500,{"$f":"MAX('MDA2'!J45,T45)","v":0},{"$f":"MAX('MDA1'!K45,'MDA2'!K45,'MDA3'!I45,'MDA3'!L45,V45,AD45)","v":21155},{"$f":"MAX('MDA1'!L45,'MDA2'!L45,'MDA3'!J45,'MDA3'!M45,AF45)","v":32922},54077,60.377024241311751]
[{"$f":"IF(COUNTRY_INFO!A46=0,\" \",COUNTRY_INFO!A46)","v":"Togo"},{"$f":"IF(COUNTRY_INFO!B46=0,\" \",COUNTRY_INFO!B46)","v":"SAVANES"},{"$f":"IF(COUNTRY_INFO!C46=0,\" \",COUNTRY_INFO!C46)","v":"KPENDJAL"},{"$f":"COUNTRY_INFO!L46","v":"Non requis"},null,null,{"$f":"MAX('MDA1'!M46,'MDA2'!M46)","v":0},{"$f":"IF(AND(COUNTRY_INFO!H46>0,COUNTRY_INFO!H46<4),IF(D46>MAX('MDA1'!M46,'MDA2'!M46),MAX('MDA1'!M46,'MDA2'!M46),D46),0)","v":0},{"$f":"IF(AND(COUNTRY_INFO!H46>0,COUNTRY_INFO!H46<4), IF(G46/D46*100<>0, IF(G46/D46*100>100,100,G46/D46*100), \"-\"),0)","v":0},{"$f":"COUNTRY_INFO!M46","v":194712},null,null,{"$f":"MAX('MDA1'!M46,MAX('MDA3'!I46,'MDA3'!L46)+MAX('MDA3'!J46,'MDA3'!M46))","v":165228},{"$f":"IF(AND(COUNTRY_INFO!I46>0,COUNTRY_INFO!I46<4),IF(J46>MAX('MDA1'!M46,MAX('MDA3'!I46,'MDA3'!L46)+MAX('MDA3'!J46,'MDA3'!M46)),MAX('MDA1'!M46,MAX('MDA3'!I46,'MDA3'!L46)+MAX('MDA3'!J46,'MDA3'!M46)),J46),0)","v":165228},{"$f":"IF(AND(COUNTRY_INFO!I46>0,COUNTRY_INFO!I46<4), IF(M46/J46*100<>0, IF(M46/J46*100>100,100,M46/J46*100), \"-\"),0)","v":84.857635893011221},{"$f":"COUNTRY_INFO!N46","v":86115},null,null,{"$f":"SUM(MAX('MDA2'!J46, 'T1'!L46, MAX(T3_R1!K46, T3_R2!K46)), MAX('MDA1'!K46, 'MDA2'!K46, 'T1'!M46, MAX(T3_R1!L46, T3_R2!L46)), MAX('MDA1'!L46, 'MDA2'!L46, 'T1'!N46, MAX(T3_R1!M46, T3_R2!M46)))","v":67578},{"$f":"IF(AND(COUNTRY_INFO!J46>1,COUNTRY_INFO!J46<4),IF(COUNTRY_INFO!E46>MAX('MDA2'!J46,'T1'!L46,MAX(T3_R1!K46,T3_R2!K46)),MAX('MDA2'!J46,'T1'!L46,MAX(T3_R1!K46,T3_R2!K46)),COUNTRY_INFO!E46),0)","v":0},{"$f":"IF(AND(COUNTRY_INFO!J46>1,COUNTRY_INFO!J46<4), IF(T46/COUNTRY_INFO!E46*100<>0, IF(T46/COUNTRY_INFO!E46*100>100,100,T46/COUNTRY_INFO!E46*100), \"-\"),0)","v":"-"},{"$f":"IF(AND(COUNTRY_INFO!J46>1,COUNTRY_INFO!J46<4),IF(COUNTRY_INFO!F46>MAX('MDA1'!K46,'MDA2'!K46,'T1'!M46,MAX(T3_R1!L46,T3_R2!L46)),MAX('MDA1'!K46,'MDA2'!K46,'T1'!M46,MAX(T3_R1!L46,T3_R2!L46)),COUNTRY_INFO!F46),0)","v":56162},{"$f":"IF(AND(COUNTRY_INFO!J46>1,COUNTRY_INFO!J46<4), IF(V46/COUNTRY_INFO!F46*100<>0, IF(V46/COUNTRY_INFO!F46*100>100,100,V46/COUNTRY_INFO!F46*100), \"-\"),0)","v":100},56162,{"$f":"IF(AND(COUNTRY_INFO!J46>1,COUNTRY_INFO!J46<4), IF(S46/P46*100<>0, IF(X46/P46*100>100,100,X46/P46*100), \"-\"),0)","v":65.217441792951277},{"$f":"COUNTRY_INFO!O46","v":149766},null,null,{"$f":"MAX('T1'!L46,'T2'!J46)+MAX('T1'!M46,'T2'!K46)+MAX('T1'!N46,'T2'!L46)","v":8411},{"$f":"IF(COUNTRY_INFO!K46=1,IF(COUNTRY_INFO!F46*0.33>MAX('T1'!M46,'T2'!K46),MAX('T1'!M46,'T2'!K46),COUNTRY_INFO!F46*0.33),IF(COUNTRY_INFO!K46=2,IF(COUNTRY_INFO!F46*0.5>MAX('T1'!M46,'T2'!K46),MAX('T1'!M46,'T2'!K46),COUNTRY_INFO!F46*0.5),IF(COUNTRY_INFO!K46=3,IF(COUNTRY_INFO!F46>MAX('T1'!M46,'T2'!K46),MAX('T1'!M46,'T2'!K46),COUNTRY_INFO!F46),0)))","v":8411},{"$f":"IF(AND(COUNTRY_INFO!K46>0,COUNTRY_INFO!K46<4),IF(Z46>0,IF(COUNTRY_INFO!K46=1, AD46/(COUNTRY_INFO!F46*0.33)*100, IF(COUNTRY_INFO!K46=2, AD46/(COUNTRY_INFO!F46*0.5)*100, IF(COUNTRY_INFO!K46=3, AD46/COUNTRY_INFO!F46*100))),\"-\"),0)","v":14.976318507175671},{"$f":"IF(COUNTRY_INFO!K46=2,IF(COUNTRY_INFO!G46*0.2>MAX('T1'!N46,'T2'!L46),MAX('T1'!N46,'T2'!L46),COUNTRY_INFO!G46*0.2),IF(COUNTRY_INFO!K46=3,IF(COUNTRY_INFO!G46>MAX('T1'!N46,'T2'!L46),MAX('T1'!N46,'T2'!L46),COUNTRY_INFO!G46),0))","v":0},{"$f":"IF(AND(COUNTRY_INFO!K46>0,COUNTRY_INFO!K46<4),IF(Z46>0,IF(COUNTRY_INFO!K46=1, 0, IF(COUNTRY_INFO!K46=2, AF46/(COUNTRY_INFO!G46*0.2)*100, IF(COUNTRY_INFO!K46=3, AF46/COUNTRY_INFO!G46*100))),\"-\"),0)","v":0},8411,{"$f":"IF(AND(COUNTRY_INFO!K46>0,COUNTRY_INFO!K46<4), IF(AC46/Z46*100<>0, IF(AH46/Z46*100>100,100,AH46/Z46*100), \"-\"),0)","v":5.6160944406607642},null,{"$f":"IF(AND(D46<>0, D46<>\"Inconnu\",D46<>\"Interrompu\",D46<>\"Non requis\"),D46/COUNTRY_INFO!D46, 0)","v":0},{"$f":"IF(AND(J46<>0,J46<>\"Inconnu\",J46<>\"Interrompu\",J46<>\"Non requis\"),J46/COUNTRY_INFO!D46, 0)","v":1.0400837571043973},{"$f":"IF(AND(P46<>0,P46<>\"Inconnu\",P46<>\"Non requis\"),P46/(COUNTRY_INFO!E46+COUNTRY_INFO!F46), 0)","v":1},{"$f":"IF(AND(Z46<>0,Z46<>\"Inconnu\",Z46<>\"Non requis\"),IF(COUNTRY_INFO!K46=1,1,IF(COUNTRY_INFO!K46=2,0.5*COUNTRY_INFO!F46/(0.5*COUNTRY_INFO!F46+0.2*COUNTRY_INFO!G46),IF(COUNTRY_INFO!K46=3,COUNTRY_INFO!F46/(COUNTRY_INFO!F46+COUNTRY_INFO!G46)))),0)","v":0.37499833072927102},{"$f":"IF(AND(Z46<>0,Z46<>\"Inconnu\",Z46<>\"Non requis\"),IF(COUNTRY_INFO!K46=1,0,IF(COUNTRY_INFO!K46=2,0.2*COUNTRY_INFO!G46/(0.5*COUNTRY_INFO!F46+0.2*COUNTRY_INFO!G46),IF(COUNTRY_INFO!K46=3,COUNTRY_INFO!G46/(COUNTRY_INFO!F46+COUNTRY_INFO!G46)))),0)","v":0.62500166927072898},{"$f":"MAX(COUNTRY_INFO!D46*AK46*PROFILE!$G$7,COUNTRY_INFO!D46*AL46*PROFILE!$G$7)","v":7788.2162014986179},{"$f":"MAX(COUNTRY_INFO!D46*AK46*PROFILE!$G$8,COUNTRY_INFO!D46*AL46*PROFILE!$G$8,COUNTRY_INFO!D46*AM46*PROFILE!$G$8)","v":31153.963966416897},{"$f":"MAX(COUNTRY_INFO!D46*AK46*PROFILE!$G$9,COUNTRY_INFO!D46*AL46*PROFILE!$G$9,COUNTRY_INFO!D46*AM46*PROFILE!$G$9,IF(AND(DISTRICT!Z46<>\"Inconnu\",Z46<>\"Non requis\"),COUNTRY_INFO!O46*DISTRICT!AN46,0))","v":58413.576994316732},{"$f":"MAX(COUNTRY_INFO!D46*AK46*PROFILE!$G$10,COUNTRY_INFO!D46*AL46*PROFILE!$G$10,IF(AND(DISTRICT!Z46<>\"Inconnu\",Z46<>\"Non requis\"),COUNTRY_INFO!O46*DISTRICT!AO46,0))","v":97356.242837767757},194712,"Y",{"$f":"MAX('MDA2'!J46,'T1'!L46,'T2'!J46,T3_R1!K46,T3_R2!K46)","v":0},{"$f":"MAX('MDA1'!K46,'MDA2'!K46,'MDA3'!I46,'MDA3'!L46,'T1'!M46,'T2'!K46,T3_R1!L46,T3_R2!L46)","v":69666},{"$f":"MAX('MDA1'!L46,'MDA2'!L46,'MDA3'!J46,'MDA3'!M46,'T1'!N46,'T2'!L46,T3_R1!M46,T3_R2!M46)","v":95562},165228,{"$f":"MAX('MDA2'!J46,T46)","v":0},{"$f":"MAX('MDA1'!K46,'MDA2'!K46,'MDA3'!I46,'MDA3'!L46,V46,AD46)","v":69666},{"$f":"MAX('MDA1'!L46,'MDA2'!L46,'MDA3'!J46,'MDA3'!M46,AF46)","v":95562},165228,84.857635893011221]
[{"$f":"IF(COUNTRY_INFO!A47=0,\" \",COUNTRY_INFO!A47)","v":"Togo"},{"$f":"IF(COUNTRY_INFO!B47=0,\" \",COUNTRY_INFO!B47)","v":"SAVANES"},{"$f":"IF(COUNTRY_INFO!C47=0,\" \",COUNTRY_INFO!C47)","v":"OTI"},{"$f":"COUNTRY_INFO!L47","v":"Non requis"},null,null,{"$f":"MAX('MDA1'!M47,'MDA2'!M47)","v":0},{"$f":"IF(AND(COUNTRY_INFO!H47>0,COUNTRY_INFO!H47<4),IF(D47>MAX('MDA1'!M47,'MDA2'!M47),MAX('MDA1'!M47,'MDA2'!M47),D47),0)","v":0},{"$f":"IF(AND(COUNTRY_INFO!H47>0,COUNTRY_INFO!H47<4), IF(G47/D47*100<>0, IF(G47/D47*100>100,100,G47/D47*100), \"-\"),0)","v":0},{"$f":"COUNTRY_INFO!M47","v":184948},null,null,{"$f":"MAX('MDA1'!M47,MAX('MDA3'!I47,'MDA3'!L47)+MAX('MDA3'!J47,'MDA3'!M47))","v":153874},{"$f":"IF(AND(COUNTRY_INFO!I47>0,COUNTRY_INFO!I47<4),IF(J47>MAX('MDA1'!M47,MAX('MDA3'!I47,'MDA3'!L47)+MAX('MDA3'!J47,'MDA3'!M47)),MAX('MDA1'!M47,MAX('MDA3'!I47,'MDA3'!L47)+MAX('MDA3'!J47,'MDA3'!M47)),J47),0)","v":153874},{"$f":"IF(AND(COUNTRY_INFO!I47>0,COUNTRY_INFO!I47<4), IF(M47/J47*100<>0, IF(M47/J47*100>100,100,M47/J47*100), \"-\"),0)","v":83.198520665268077},{"$f":"COUNTRY_INFO!N47","v":106228},null,null,{"$f":"SUM(MAX('MDA2'!J47, 'T1'!L47, MAX(T3_R1!K47, T3_R2!K47)), MAX('MDA1'!K47, 'MDA2'!K47, 'T1'!M47, MAX(T3_R1!L47, T3_R2!L47)), MAX('MDA1'!L47, 'MDA2'!L47, 'T1'!N47, MAX(T3_R1!M47, T3_R2!M47)))","v":76609},{"$f":"IF(AND(COUNTRY_INFO!J47>1,COUNTRY_INFO!J47<4),IF(COUNTRY_INFO!E47>MAX('MDA2'!J47,'T1'!L47,MAX(T3_R1!K47,T3_R2!K47)),MAX('MDA2'!J47,'T1'!L47,MAX(T3_R1!K47,T3_R2!K47)),COUNTRY_INFO!E47),0)","v":0},{"$f":"IF(AND(COUNTRY_INFO!J47>1,COUNTRY_INFO!J47<4), IF(T47/COUNTRY_INFO!E47*100<>0, IF(T47/COUNTRY_INFO!E47*100>100,100,T47/COUNTRY_INFO!E47*100), \"-\"),0)","v":"-"},{"$f":"IF(AND(COUNTRY_INFO!J47>1,COUNTRY_INFO!J47<4),IF(COUNTRY_INFO!F47>MAX('MDA1'!K47,'MDA2'!K47,'T1'!M47,MAX(T3_R1!L47,T3_R2!L47)),MAX('MDA1'!K47,'MDA2'!K47,'T1'!M47,MAX(T3_R1!L47,T3_R2!L47)),COUNTRY_INFO!F47),0)","v":69279},{"$f":"IF(AND(COUNTRY_INFO!J47>1,COUNTRY_INFO!J47<4), IF(V47/COUNTRY_INFO!F47*100<>0, IF(V47/COUNTRY_INFO!F47*100>100,100,V47/COUNTRY_INFO!F47*100), \"-\"),0)","v":100},69279,{"$f":"IF(AND(COUNTRY_INFO!J47>1,COUNTRY_INFO!J47<4), IF(S47/P47*100<>0, IF(X47/P47*100>100,100,X47/P47*100), \"-\"),0)","v":65.217268516775235},{"$f":"COUNTRY_INFO!O47","v":57732.5},null,null,{"$f":"MAX('T1'!L47,'T2'!J47)+MAX('T1'!M47,'T2'!K47)+MAX('T1'!N47,'T2'!L47)","v":1423},{"$f":"IF(COUNTRY_INFO!K47=1,IF(COUNTRY_INFO!F47*0.33>MAX('T1'!M47,'T2'!K47),MAX('T1'!M47,'T2'!K47),COUNTRY_INFO!F47*0.33),IF(COUNTRY_INFO!K47=2,IF(COUNTRY_INFO!F47*0.5>MAX('T1'!M47,'T2'!K47),MAX('T1'!M47,'T2'!K47),COUNTRY_INFO!F47*0.5),IF(COUNTRY_INFO!K47=3,IF(COUNTRY_INFO!F47>MAX('T1'!M47,'T2'!K47),MAX('T1'!M47,'T2'!K47),COUNTRY_INFO!F47),0)))","v":1423},{"$f":"IF(AND(COUNTRY_INFO!K47>0,COUNTRY_INFO!K47<4),IF(Z47>0,IF(COUNTRY_INFO!K47=1, AD47/(COUNTRY_INFO!F47*0.33)*100, IF(COUNTRY_INFO!K47=2, AD47/(COUNTRY_INFO!F47*0.5)*100, IF(COUNTRY_INFO!K47=3, AD47/COUNTRY_INFO!F47*100))),\"-\"),0)","v":4.1080269634376947},{"$f":"IF(COUNTRY_INFO!K47=2,IF(COUNTRY_INFO!G47*0.2>MAX('T1'!N47,'T2'!L47),MAX('T1'!N47,'T2'!L47),COUNTRY_INFO!G47*0.2),IF(COUNTRY_INFO!K47=3,IF(COUNTRY_INFO!G47>MAX('T1'!N47,'T2'!L47),MAX('T1'!N47,'T2'!L47),COUNTRY_INFO!G47),0))","v":0},{"$f":"IF(AND(COUNTRY_INFO!K47>0,COUNTRY_INFO!K47<4),IF(Z47>0,IF(COUNTRY_INFO!K47=1, 0, IF(COUNTRY_INFO!K47=2, AF47/(COUNTRY_INFO!G47*0.2)*100, IF(COUNTRY_INFO!K47=3, AF47/COUNTRY_INFO!G47*100))),\"-\"),0)","v":0},1423,{"$f":"IF(AND(COUNTRY_INFO!K47>0,COUNTRY_INFO!K47<4), IF(AC47/Z47*100<>0, IF(AH47/Z47*100>100,100,AH47/Z47*100), \"-\"),0)","v":2.4648161780626161},null,{"$f":"IF(AND(D47<>0, D47<>\"Inconnu\",D47<>\"Interrompu\",D47<>\"Non requis\"),D47/COUNTRY_INFO!D47, 0)","v":0},{"$f":"IF(AND(J47<>0,J47<>\"Inconnu\",J47<>\"Interrompu\",J47<>\"Non requis\"),J47/COUNTRY_INFO!D47, 0)","v":0.80088685266900217},{"$f":"IF(AND(P47<>0,P47<>\"Inconnu\",P47<>\"Non requis\"),P47/(COUNTRY_INFO!E47+COUNTRY_INFO!F47), 0)","v":1},{"$f":"IF(AND(Z47<>0,Z47<>\"Inconnu\",Z47<>\"Non requis\"),IF(COUNTRY_INFO!K47=1,1,IF(COUNTRY_INFO!K47=2,0.5*COUNTRY_INFO!F47/(0.5*COUNTRY_INFO!F47+0.2*COUNTRY_INFO!G47),IF(COUNTRY_INFO!K47=3,COUNTRY_INFO!F47/(COUNTRY_INFO!F47+COUNTRY_INFO!G47)))),0)","v":0.6},{"$f":"IF(AND(Z47<>0,Z47<>\"Inconnu\",Z47<>\"Non requis\"),IF(COUNTRY_INFO!K47=1,0,IF(COUNTRY_INFO!K47=2,0.2*COUNTRY_INFO!G47/(0.5*COUNTRY_INFO!F47+0.2*COUNTRY_INFO!G47),IF(COUNTRY_INFO!K47=3,COUNTRY_INFO!G47/(COUNTRY_INFO!F47+COUNTRY_INFO!G47)))),0)","v":0.4},{"$f":"MAX(COUNTRY_INFO!D47*AK47*PROFILE!$G$7,COUNTRY_INFO!D47*AL47*PROFILE!$G$7)","v":7397.6694299003984},{"$f":"MAX(COUNTRY_INFO!D47*AK47*PROFILE!$G$8,COUNTRY_INFO!D47*AL47*PROFILE!$G$8,COUNTRY_INFO!D47*AM47*PROFILE!$G$8)","v":36948.692144298693},{"$f":"MAX(COUNTRY_INFO!D47*AK47*PROFILE!$G$9,COUNTRY_INFO!D47*AL47*PROFILE!$G$9,COUNTRY_INFO!D47*AM47*PROFILE!$G$9,IF(AND(DISTRICT!Z47<>\"Inconnu\",Z47<>\"Non requis\"),COUNTRY_INFO!O47*DISTRICT!AN47,0))","v":69278.672715192544},{"$f":"MAX(COUNTRY_INFO!D47*AK47*PROFILE!$G$10,COUNTRY_INFO!D47*AL47*PROFILE!$G$10,IF(AND(DISTRICT!Z47<>\"Inconnu\",Z47<>\"Non requis\"),COUNTRY_INFO!O47*DISTRICT!AO47,0))","v":92474.230660459914},206099.26494985155,"Y",{"$f":"MAX('MDA2'!J47,'T1'!L47,'T2'!J47,T3_R1!K47,T3_R2!K47)","v":0},{"$f":"MAX('MDA1'!K47,'MDA2'!K47,'MDA3'!I47,'MDA3'!L47,'T1'!M47,'T2'!K47,T3_R1!L47,T3_R2!L47)","v":76609},{"$f":"MAX('MDA1'!L47,'MDA2'!L47,'MDA3'!J47,'MDA3'!M47,'T1'!N47,'T2'!L47,T3_R1!M47,T3_R2!M47)","v":92907},169516,{"$f":"MAX('MDA2'!J47,T47)","v":0},{"$f":"MAX('MDA1'!K47,'MDA2'!K47,'MDA3'!I47,'MDA3'!L47,V47,AD47)","v":69279},{"$f":"MAX('MDA1'!L47,'MDA2'!L47,'MDA3'!J47,'MDA3'!M47,AF47)","v":92907},162186,78.693148197041552]
[{"$f":"IF(COUNTRY_INFO!A48=0,\" \",COUNTRY_INFO!A48)","v":"Togo"},{"$f":"IF(COUNTRY_INFO!B48=0,\" \",COUNTRY_INFO!B48)","v":"SAVANES"},{"$f":"IF(COUNTRY_INFO!C48=0,\" \",COUNTRY_INFO!C48)","v":"TANDJOARE"},{"$f":"COUNTRY_INFO!L48","v":"Non requis"},null,null,{"$f":"MAX('MDA1'!M48,'MDA2'!M48)","v":0},{"$f":"IF(AND(COUNTRY_INFO!H48>0,COUNTRY_INFO!H48<4),IF(D48>MAX('MDA1'!M48,'MDA2'!M48),MAX('MDA1'!M48,'MDA2'!M48),D48),0)","v":0},{"$f":"IF(AND(COUNTRY_INFO!H48>0,COUNTRY_INFO!H48<4), IF(G48/D48*100<>0, IF(G48/D48*100>100,100,G48/D48*100), \"-\"),0)","v":0},{"$f":"COUNTRY_INFO!M48","v":146821},null,null,{"$f":"MAX('MDA1'!M48,MAX('MDA3'!I48,'MDA3'!L48)+MAX('MDA3'!J48,'MDA3'!M48))","v":123707},{"$f":"IF(AND(COUNTRY_INFO!I48>0,COUNTRY_INFO!I48<4),IF(J48>MAX('MDA1'!M48,MAX('MDA3'!I48,'MDA3'!L48)+MAX('MDA3'!J48,'MDA3'!M48)),MAX('MDA1'!M48,MAX('MDA3'!I48,'MDA3'!L48)+MAX('MDA3'!J48,'MDA3'!M48)),J48),0)","v":123707},{"$f":"IF(AND(COUNTRY_INFO!I48>0,COUNTRY_INFO!I48<4), IF(M48/J48*100<>0, IF(M48/J48*100>100,100,M48/J48*100), \"-\"),0)","v":84.257020453477367},{"$f":"COUNTRY_INFO!N48","v":66268},null,null,{"$f":"SUM(MAX('MDA2'!J48, 'T1'!L48, MAX(T3_R1!K48, T3_R2!K48)), MAX('MDA1'!K48, 'MDA2'!K48, 'T1'!M48, MAX(T3_R1!L48, T3_R2!L48)), MAX('MDA1'!L48, 'MDA2'!L48, 'T1'!N48, MAX(T3_R1!M48, T3_R2!M48)))","v":47556},{"$f":"IF(AND(COUNTRY_INFO!J48>1,COUNTRY_INFO!J48<4),IF(COUNTRY_INFO!E48>MAX('MDA2'!J48,'T1'!L48,MAX(T3_R1!K48,T3_R2!K48)),MAX('MDA2'!J48,'T1'!L48,MAX(T3_R1!K48,T3_R2!K48)),COUNTRY_INFO!E48),0)","v":0},{"$f":"IF(AND(COUNTRY_INFO!J48>1,COUNTRY_INFO!J48<4), IF(T48/COUNTRY_INFO!E48*100<>0, IF(T48/COUNTRY_INFO!E48*100>100,100,T48/COUNTRY_INFO!E48*100), \"-\"),0)","v":"-"},{"$f":"IF(AND(COUNTRY_INFO!J48>1,COUNTRY_INFO!J48<4),IF(COUNTRY_INFO!F48>MAX('MDA1'!K48,'MDA2'!K48,'T1'!M48,MAX(T3_R1!L48,T3_R2!L48)),MAX('MDA1'!K48,'MDA2'!K48,'T1'!M48,MAX(T3_R1!L48,T3_R2!L48)),COUNTRY_INFO!F48),0)","v":43218},{"$f":"IF(AND(COUNTRY_INFO!J48>1,COUNTRY_INFO!J48<4), IF(V48/COUNTRY_INFO!F48*100<>0, IF(V48/COUNTRY_INFO!F48*100>100,100,V48/COUNTRY_INFO!F48*100), \"-\"),0)","v":100},43218,{"$f":"IF(AND(COUNTRY_INFO!J48>1,COUNTRY_INFO!J48<4), IF(S48/P48*100<>0, IF(X48/P48*100>100,100,X48/P48*100), \"-\"),0)","v":65.216997645922618},{"$f":"COUNTRY_INFO!O48","v":14261.94},null,null,{"$f":"MAX('T1'!L48,'T2'!J48)+MAX('T1'!M48,'T2'!K48)+MAX('T1'!N48,'T2'!L48)","v":0},{"$f":"IF(COUNTRY_INFO!K48=1,IF(COUNTRY_INFO!F48*0.33>MAX('T1'!M48,'T2'!K48),MAX('T1'!M48,'T2'!K48),COUNTRY_INFO!F48*0.33),IF(COUNTRY_INFO!K48=2,IF(COUNTRY_INFO!F48*0.5>MAX('T1'!M48,'T2'!K48),MAX('T1'!M48,'T2'!K48),COUNTRY_INFO!F48*0.5),IF(COUNTRY_INFO!K48=3,IF(COUNTRY_INFO!F48>MAX('T1'!M48,'T2'!K48),MAX('T1'!M48,'T2'!K48),COUNTRY_INFO!F48),0)))","v":0},{"$f":"IF(AND(COUNTRY_INFO!K48>0,COUNTRY_INFO!K48<4),IF(Z48>0,IF(COUNTRY_INFO!K48=1, AD48/(COUNTRY_INFO!F48*0.33)*100, IF(COUNTRY_INFO!K48=2, AD48/(COUNTRY_INFO!F48*0.5)*100, IF(COUNTRY_INFO!K48=3, AD48/COUNTRY_INFO!F48*100))),\"-\"),0)","v":0},{"$f":"IF(COUNTRY_INFO!K48=2,IF(COUNTRY_INFO!G48*0.2>MAX('T1'!N48,'T2'!L48),MAX('T1'!N48,'T2'!L48),COUNTRY_INFO!G48*0.2),IF(COUNTRY_INFO!K48=3,IF(COUNTRY_INFO!G48>MAX('T1'!N48,'T2'!L48),MAX('T1'!N48,'T2'!L48),COUNTRY_INFO!G48),0))","v":0},{"$f":"IF(AND(COUNTRY_INFO!K48>0,COUNTRY_INFO!K48<4),IF(Z48>0,IF(COUNTRY_INFO!K48=1, 0, IF(COUNTRY_INFO!K48=2, AF48/(COUNTRY_INFO!G48*0.2)*100, IF(COUNTRY_INFO!K48=3, AF48/COUNTRY_INFO!G48*100))),\"-\"),0)","v":0},0,{"$f":"IF(AND(COUNTRY_INFO!K48>0,COUNTRY_INFO!K48<4), IF(AC48/Z48*100<>0, IF(AH48/Z48*100>100,100,AH48/Z48*100), \"-\"),0)","v":"-"},null,{"$f":"IF(AND(D48<>0, D48<>\"Inconnu\",D48<>\"Interrompu\",D48<>\"Non requis\"),D48/COUNTRY_INFO!D48, 0)","v":0},{"$f":"IF(AND(J48<>0,J48<>\"Inconnu\",J48<>\"Interrompu\",J48<>\"Non requis\"),J48/COUNTRY_INFO!D48, 0)","v":1.019165625433847},{"$f":"IF(AND(P48<>0,P48<>\"Inconnu\",P48<>\"Non requis\"),P48/(COUNTRY_INFO!E48+COUNTRY_INFO!F48), 0)","v":1},{"$f":"IF(AND(Z48<>0,Z48<>\"Inconnu\",Z48<>\"Non requis\"),IF(COUNTRY_INFO!K48=1,1,IF(COUNTRY_INFO!K48=2,0.5*COUNTRY_INFO!F48/(0.5*COUNTRY_INFO!F48+0.2*COUNTRY_INFO!G48),IF(COUNTRY_INFO!K48=3,COUNTRY_INFO!F48/(COUNTRY_INFO!F48+COUNTRY_INFO!G48)))),0)","v":1},{"$f":"IF(AND(Z48<>0,Z48<>\"Inconnu\",Z48<>\"Non requis\"),IF(COUNTRY_INFO!K48=1,0,IF(COUNTRY_INFO!K48=2,0.2*COUNTRY_INFO!G48/(0.5*COUNTRY_INFO!F48+0.2*COUNTRY_INFO!G48),IF(COUNTRY_INFO!K48=3,COUNTRY_INFO!G48/(COUNTRY_INFO!F48+COUNTRY_INFO!G48)))),0)","v":0},{"$f":"MAX(COUNTRY_INFO!D48*AK48*PROFILE!$G$7,COUNTRY_INFO!D48*AL48*PROFILE!$G$7)","v":5872.6410848855157},{"$f":"MAX(COUNTRY_INFO!D48*AK48*PROFILE!$G$8,COUNTRY_INFO!D48*AL48*PROFILE!$G$8,COUNTRY_INFO!D48*AM48*PROFILE!$G$8)","v":23491.393152519082},{"$f":"MAX(COUNTRY_INFO!D48*AK48*PROFILE!$G$9,COUNTRY_INFO!D48*AL48*PROFILE!$G$9,COUNTRY_INFO!D48*AM48*PROFILE!$G$9,IF(AND(DISTRICT!Z48<>\"Inconnu\",Z48<>\"Non requis\"),COUNTRY_INFO!O48*DISTRICT!AN48,0))","v":44046.282652751637},{"$f":"MAX(COUNTRY_INFO!D48*AK48*PROFILE!$G$10,COUNTRY_INFO!D48*AL48*PROFILE!$G$10,IF(AND(DISTRICT!Z48<>\"Inconnu\",Z48<>\"Non requis\"),COUNTRY_INFO!O48*DISTRICT!AO48,0))","v":73410.683109843769},146821,0,{"$f":"MAX('MDA2'!J48,'T1'!L48,'T2'!J48,T3_R1!K48,T3_R2!K48)","v":0},{"$f":"MAX('MDA1'!K48,'MDA2'!K48,'MDA3'!I48,'MDA3'!L48,'T1'!M48,'T2'!K48,T3_R1!L48,T3_R2!L48)","v":47556},{"$f":"MAX('MDA1'!L48,'MDA2'!L48,'MDA3'!J48,'MDA3'!M48,'T1'!N48,'T2'!L48,T3_R1!M48,T3_R2!M48)","v":76228},123784,{"$f":"MAX('MDA2'!J48,T48)","v":0},{"$f":"MAX('MDA1'!K48,'MDA2'!K48,'MDA3'!I48,'MDA3'!L48,V48,AD48)","v":47479},{"$f":"MAX('MDA1'!L48,'MDA2'!L48,'MDA3'!J48,'MDA3'!M48,AF48)","v":76228},123707,84.257020453477367]
[{"$f":"IF(COUNTRY_INFO!A49=0,\" \",COUNTRY_INFO!A49)","v":"Togo"},{"$f":"IF(COUNTRY_INFO!B49=0,\" \",COUNTRY_INFO!B49)","v":"SAVANES"},{"$f":"IF(COUNTRY_INFO!C49=0,\" \",COUNTRY_INFO!C49)","v":"TONE"},{"$f":"COUNTRY_INFO!L49","v":"Non requis"},null,null,{"$f":"MAX('MDA1'!M49,'MDA2'!M49)","v":0},{"$f":"IF(AND(COUNTRY_INFO!H49>0,COUNTRY_INFO!H49<4),IF(D49>MAX('MDA1'!M49,'MDA2'!M49),MAX('MDA1'!M49,'MDA2'!M49),D49),0)","v":0},{"$f":"IF(AND(COUNTRY_INFO!H49>0,COUNTRY_INFO!H49<4), IF(G49/D49*100<>0, IF(G49/D49*100>100,100,G49/D49*100), \"-\"),0)","v":0},{"$f":"COUNTRY_INFO!M49","v":260774},null,null,{"$f":"MAX('MDA1'!M49,MAX('MDA3'!I49,'MDA3'!L49)+MAX('MDA3'!J49,'MDA3'!M49))","v":218262},{"$f":"IF(AND(COUNTRY_INFO!I49>0,COUNTRY_INFO!I49<4),IF(J49>MAX('MDA1'!M49,MAX('MDA3'!I49,'MDA3'!L49)+MAX('MDA3'!J49,'MDA3'!M49)),MAX('MDA1'!M49,MAX('MDA3'!I49,'MDA3'!L49)+MAX('MDA3'!J49,'MDA3'!M49)),J49),0)","v":218262},{"$f":"IF(AND(COUNTRY_INFO!I49>0,COUNTRY_INFO!I49<4), IF(M49/J49*100<>0, IF(M49/J49*100>100,100,M49/J49*100), \"-\"),0)","v":83.697761279882201},{"$f":"COUNTRY_INFO!N49","v":160358},null,null,{"$f":"SUM(MAX('MDA2'!J49, 'T1'!L49, MAX(T3_R1!K49, T3_R2!K49)), MAX('MDA1'!K49, 'MDA2'!K49, 'T1'!M49, MAX(T3_R1!L49, T3_R2!L49)), MAX('MDA1'!L49, 'MDA2'!L49, 'T1'!N49, MAX(T3_R1!M49, T3_R2!M49)))","v":106237},{"$f":"IF(AND(COUNTRY_INFO!J49>1,COUNTRY_INFO!J49<4),IF(COUNTRY_INFO!E49>MAX('MDA2'!J49,'T1'!L49,MAX(T3_R1!K49,T3_R2!K49)),MAX('MDA2'!J49,'T1'!L49,MAX(T3_R1!K49,T3_R2!K49)),COUNTRY_INFO!E49),0)","v":0},{"$f":"IF(AND(COUNTRY_INFO!J49>1,COUNTRY_INFO!J49<4), IF(T49/COUNTRY_INFO!E49*100<>0, IF(T49/COUNTRY_INFO!E49*100>100,100,T49/COUNTRY_INFO!E49*100), \"-\"),0)","v":"-"},{"$f":"IF(AND(COUNTRY_INFO!J49>1,COUNTRY_INFO!J49<4),IF(COUNTRY_INFO!F49>MAX('MDA1'!K49,'MDA2'!K49,'T1'!M49,MAX(T3_R1!L49,T3_R2!L49)),MAX('MDA1'!K49,'MDA2'!K49,'T1'!M49,MAX(T3_R1!L49,T3_R2!L49)),COUNTRY_INFO!F49),0)","v":104581},{"$f":"IF(AND(COUNTRY_INFO!J49>1,COUNTRY_INFO!J49<4), IF(V49/COUNTRY_INFO!F49*100<>0, IF(V49/COUNTRY_INFO!F49*100>100,100,V49/COUNTRY_INFO!F49*100), \"-\"),0)","v":100},104581,{"$f":"IF(AND(COUNTRY_INFO!J49>1,COUNTRY_INFO!J49<4), IF(S49/P49*100<>0, IF(X49/P49*100>100,100,X49/P49*100), \"-\"),0)","v":65.217201511617745},{"$f":"COUNTRY_INFO!O49","v":87150.9},null,null,{"$f":"MAX('T1'!L49,'T2'!J49)+MAX('T1'!M49,'T2'!K49)+MAX('T1'!N49,'T2'!L49)","v":5971},{"$f":"IF(COUNTRY_INFO!K49=1,IF(COUNTRY_INFO!F49*0.33>MAX('T1'!M49,'T2'!K49),MAX('T1'!M49,'T2'!K49),COUNTRY_INFO!F49*0.33),IF(COUNTRY_INFO!K49=2,IF(COUNTRY_INFO!F49*0.5>MAX('T1'!M49,'T2'!K49),MAX('T1'!M49,'T2'!K49),COUNTRY_INFO!F49*0.5),IF(COUNTRY_INFO!K49=3,IF(COUNTRY_INFO!F49>MAX('T1'!M49,'T2'!K49),MAX('T1'!M49,'T2'!K49),COUNTRY_INFO!F49),0)))","v":5971},{"$f":"IF(AND(COUNTRY_INFO!K49>0,COUNTRY_INFO!K49<4),IF(Z49>0,IF(COUNTRY_INFO!K49=1, AD49/(COUNTRY_INFO!F49*0.33)*100, IF(COUNTRY_INFO!K49=2, AD49/(COUNTRY_INFO!F49*0.5)*100, IF(COUNTRY_INFO!K49=3, AD49/COUNTRY_INFO!F49*100))),\"-\"),0)","v":11.418900182633557},{"$f":"IF(COUNTRY_INFO!K49=2,IF(COUNTRY_INFO!G49*0.2>MAX('T1'!N49,'T2'!L49),MAX('T1'!N49,'T2'!L49),COUNTRY_INFO!G49*0.2),IF(COUNTRY_INFO!K49=3,IF(COUNTRY_INFO!G49>MAX('T1'!N49,'T2'!L49),MAX('T1'!N49,'T2'!L49),COUNTRY_INFO!G49),0))","v":0},{"$f":"IF(AND(COUNTRY_INFO!K49>0,COUNTRY_INFO!K49<4),IF(Z49>0,IF(COUNTRY_INFO!K49=1, 0, IF(COUNTRY_INFO!K49=2, AF49/(COUNTRY_INFO!G49*0.2)*100, IF(COUNTRY_INFO!K49=3, AF49/COUNTRY_INFO!G49*100))),\"-\"),0)","v":0},5971,{"$f":"IF(AND(COUNTRY_INFO!K49>0,COUNTRY_INFO!K49<4), IF(AC49/Z49*100<>0, IF(AH49/Z49*100>100,100,AH49/Z49*100), \"-\"),0)","v":6.8513348686014721},null,{"$f":"IF(AND(D49<>0, D49<>\"Inconnu\",D49<>\"Interrompu\",D49<>\"Non requis\"),D49/COUNTRY_INFO!D49, 0)","v":0},{"$f":"IF(AND(J49<>0,J49<>\"Inconnu\",J49<>\"Interrompu\",J49<>\"Non requis\"),J49/COUNTRY_INFO!D49, 0)","v":0.7480522311849549},{"$f":"IF(AND(P49<>0,P49<>\"Inconnu\",P49<>\"Non requis\"),P49/(COUNTRY_INFO!E49+COUNTRY_INFO!F49), 0)","v":1},{"$f":"IF(AND(Z49<>0,Z49<>\"Inconnu\",Z49<>\"Non requis\"),IF(COUNTRY_INFO!K49=1,1,IF(COUNTRY_INFO!K49=2,0.5*COUNTRY_INFO!F49/(0.5*COUNTRY_INFO!F49+0.2*COUNTRY_INFO!G49),IF(COUNTRY_INFO!K49=3,COUNTRY_INFO!F49/(COUNTRY_INFO!F49+COUNTRY_INFO!G49)))),0)","v":0.59999954102596764},{"$f":"IF(AND(Z49<>0,Z49<>\"Inconnu\",Z49<>\"Non requis\"),IF(COUNTRY_INFO!K49=1,0,IF(COUNTRY_INFO!K49=2,0.2*COUNTRY_INFO!G49/(0.5*COUNTRY_INFO!F49+0.2*COUNTRY_INFO!G49),IF(COUNTRY_INFO!K49=3,COUNTRY_INFO!G49/(COUNTRY_INFO!F49+COUNTRY_INFO!G49)))),0)","v":0.40000045897403241},{"$f":"MAX(COUNTRY_INFO!D49*AK49*PROFILE!$G$7,COUNTRY_INFO!D49*AL49*PROFILE!$G$7)","v":10430.606699790464},{"$f":"MAX(COUNTRY_INFO!D49*AK49*PROFILE!$G$8,COUNTRY_INFO!D49*AL49*PROFILE!$G$8,COUNTRY_INFO!D49*AM49*PROFILE!$G$8)","v":55776.718715584022},{"$f":"MAX(COUNTRY_INFO!D49*AK49*PROFILE!$G$9,COUNTRY_INFO!D49*AL49*PROFILE!$G$9,COUNTRY_INFO!D49*AM49*PROFILE!$G$9,IF(AND(DISTRICT!Z49<>\"Inconnu\",Z49<>\"Non requis\"),COUNTRY_INFO!O49*DISTRICT!AN49,0))","v":104581.158811613},{"$f":"MAX(COUNTRY_INFO!D49*AK49*PROFILE!$G$10,COUNTRY_INFO!D49*AL49*PROFILE!$G$10,IF(AND(DISTRICT!Z49<>\"Inconnu\",Z49<>\"Non requis\"),COUNTRY_INFO!O49*DISTRICT!AO49,0))","v":130387.32522790608},301175.80945489358,"Y",{"$f":"MAX('MDA2'!J49,'T1'!L49,'T2'!J49,T3_R1!K49,T3_R2!K49)","v":0},{"$f":"MAX('MDA1'!K49,'MDA2'!K49,'MDA3'!I49,'MDA3'!L49,'T1'!M49,'T2'!K49,T3_R1!L49,T3_R2!L49)","v":106237},{"$f":"MAX('MDA1'!L49,'MDA2'!L49,'MDA3'!J49,'MDA3'!M49,'T1'!N49,'T2'!L49,T3_R1!M49,T3_R2!M49)","v":130863},237100,{"$f":"MAX('MDA2'!J49,T49)","v":0},{"$f":"MAX('MDA1'!K49,'MDA2'!K49,'MDA3'!I49,'MDA3'!L49,V49,AD49)","v":104581},{"$f":"MAX('MDA1'!L49,'MDA2'!L49,'MDA3'!J49,'MDA3'!M49,AF49)","v":130863},235444,78.174937232222135]

{"sheet":"SUMMARY","index":10,"n_rows":71,"n_cols":8,"rows_kept":71,"cut":false,"hidden":false,"merged":[[15,1,15,3],[0,1,0,5],[1,1,1,7],[5,1,11,7],[3,3,3,5],[32,1,32,2],[33,1,33,2],[34,1,34,2],[35,1,35,2],[23,1,23,5],[31,1,31,2],[24,1,24,5],[25,1,25,5],[26,1,26,5],[27,1,27,5],[70,1,70,2],[36,1,36,2],[37,1,37,2],[38,1,38,2],[67,1,67,7],[54,1,60,7],[69,1,69,2],[49,1,49,7],[50,3,50,4],[63,1,63,3],[63,4,63,7],[64,4,65,7],[65,1,65,3],[62,1,62,7]]}
[]
[null,"Formulaire de Rapport Commun v.3.1"]
[]
[null,"Pays",null,{"$f":"IF(INTRO!$E$34<>0,INTRO!$E$34,\" \")","v":"Togo"},null,null,"Année",{"$f":"IF(INTRO!$E$36<>0,INTRO!$E$36,\" \")","v":2019}]
[]
[null,"Les autorités nationales sont priées de compléter ce formulaire de rapport commun et de le soumettre à l'Organisation mondiale de la Santé avant le 15 août de l'année en cours pour rapporter les données des activités de chimioprévention mises en oeuvre l'année précédente. "]
[]
[]
[]
[]
[]
[]
[]
[null,"Nombre de personnes ayant reçu un traitement (au moins une fois) pour les maladies"]
[]
[null,null,null,null,"EAPréS","EAS","Adultes","Total"]
[null,"Filariose lymphatique",null,null,"Non admissible",0,0,{"$f":"SUM(E17:G17)","v":0}]
[null,"Onchocercose",null,null,"Non admissible",1180275,1887748,{"$f":"SUM(E18:G18)","v":3068023}]
[null,"Géohelminthiases",null,null,0,1998762,0,{"$f":"SUM(E19:G19)","v":1998762}]
[null,"Schistosomiase",null,null,"Non ciblé",407848,0,{"$f":"SUM(E20:G20)","v":407848}]
[]
[null,"Couverture des interventions de CP contre les maladies (%) "]
[]
[null,null,null,null,null,null,"Géographique","National"]
[null,"Filariose lymphatique",null,null,null,null,0,0]
[null,"Onchocercose",null,null,null,null,100,83.183705009150671]
[null,"Géohelminthiases",null,null,null,null,100,63.833186411928622]
[null,"Schistosomiase",null,null,null,null,66.666666666666671,14.997718263228228]
[]
[null,"Nombre de personnes traitées et couverture du programme en pourcentage, par intervention de CP"]
[]
[null,null,null,"EAPréS","EAS","Adultes","Total","Couverture"]
[null,"MDA 1 (IVM+ALB)",null,"Non admissible",{"$f":"'MDA1'!$K$4","v":0},{"$f":"'MDA1'!$L$4","v":0},{"$f":"'MDA1'!$M$4","v":0},{"$f":"'MDA1'!$Q$4","v":" "}]
[null,"MDA 2 (DEC+ALB)",null,{"$f":"'MDA2'!$J$4","v":0},{"$f":"'MDA2'!$K$4","v":0},{"$f":"'MDA2'!$L$4","v":0},{"$f":"'MDA2'!$M$4","v":0},{"$f":"'MDA2'!$Q$4","v":" "}]
[null,"MDA 3 (IVM)",null,"Non admissible",{"$f":"'MDA3'!$O$4","v":1180275},{"$f":"'MDA3'!$P$4","v":1887748},{"$f":"'MDA3'!$Q$4","v":3068023},{"$f":"'MDA3'!$T$4","v":83.183705009150671}]
[null,"T 1 (PZQ+ALB/MBD)",null,{"$f":"IF('T1'!$L$4<>0,'T1'!$L$4,\"Non ciblé\")","v":"Non ciblé"},{"$f":"'T1'!$M$4","v":119297},{"$f":"IF('T1'!$N$4<>0,'T1'!$N$4,\"Non ciblé\")","v":"Non ciblé"},{"$f":"'T1'!$O$4","v":119297},{"$f":"'T1'!$S$4","v":36.529516775523078}]
[null,"T 2 (PZQ)",null,{"$f":"IF('T2'!$J$4<>0,'T2'!$J$4,\"Non ciblé\")","v":"Non ciblé"},{"$f":"'T2'!$K$4","v":288551},{"$f":"'T2'!$L$4","v":0},{"$f":"'T2'!$M$4","v":288551},{"$f":"'T2'!$Q$4","v":97.871957941151535}]
[null,"T 3 (ALB/MBD) - tournée 1",null,{"$f":"T3_R1!$K$4","v":0},{"$f":"T3_R1!$L$4","v":1995921},{"$f":"IF(T3_R1!$M$4<>0,T3_R1!$M$4,\"Non ciblé\")","v":"Non ciblé"},{"$f":"T3_R1!$N$4","v":1995921},{"$f":"T3_R1!$R$4","v":99.61872866297989}]
[null,"T 3 (ALB/MBD) - tournée 2",null,{"$f":"T3_R2!$K$4","v":0},{"$f":"T3_R2!$L$4","v":423250},{"$f":"IF(T3_R2!$M$4<>0,T3_R2!$M$4,\"Non ciblé\")","v":"Non ciblé"},{"$f":"T3_R2!$N$4","v":423250},{"$f":"T3_R2!$R$4","v":99.533433356693024}]
[]
[null,"Inventaire des médicaments pour la chimiothérapie préventive dans le pays"]
[]
[null,null,"IVM","DEC","ALB (FL)","ALB (STH)","MBD","PZQ"]
[null,"Disponible"]
[null,"Distribué"]
[null,"Gaspillé"]
[null,"Reçus"]
[null,"Restant",{"$f":"C44-C45-C46+C47","v":0},0,0,0,0,0]
[]
[null,"Veuillez indiquer le médicament qui a été utilisé pour traiter les EAPréS, et les mécanismes de distribution"]
[null,"Médicament",null,"Mécanismes de distribution",null,null,"Source"]
[]
[null,"Remarques supplémentaires évenuelles concernant le rapport"]
[]
[null,"FEUILLE T1: En raison du manque de PZQ (retard de livraison de la dotation 2019), seuls 04 districts ont partiellement bénéficié du traitement grâce au petit stock restant de l'année dernière et qui s'expirait en octobre 2019.                                                                                                                    FEUILLE T2: Faute de ressources suffisantes pour rattraper les districts ayant ratté la première tournée pour PZQ, seuls les districts plannifiés ont été couverts à la seconde tournée de traitement au PZQ.                                                                                                                                                   Les données de traitement des géohelminthises à l'ALB au 1er et 2ème tours ne sont pas renseignées dans T1/T2 mais plutôt dans T3_R1 et T3_R2"]
[]
[]
[]
[]
[]
[]
[]
[null,"         J’ai pris connaissance et accepté la politique de la communication de données de l’OMS"]
[null,"Nom et signature du Coordonnateur MTN \nou du Représentant du Ministère de la Santé :",null,null,"                                               Dr Kwamy TOGBEY"]
[null,null,null,null,"                                                31 Août 2020"]
[null,"Date:"]
[]
[null,"Veuillez envoyer le rapport national (signé et sous format électronique) au représentant de l'OMS du pays en mettant en copie :"]
[]
[null,"Siège de l'OMS ",null,"PC_JointForms@who.int"]
[null,"Bureau régional de l'OMS",null,"Conseiller régional MTN"]

{"sheet":"PROFILE","index":11,"n_rows":124,"n_cols":8,"rows_kept":124,"cut":false,"hidden":true,"merged":[[16,1,16,6],[18,1,18,6],[14,1,14,6],[15,1,15,6],[7,4,7,5],[8,4,8,5],[9,4,9,5],[7,1,7,3],[8,1,8,3],[9,1,9,3],[17,1,17,6],[63,1,63,3],[25,1,25,3],[0,1,0,5],[1,1,1,7],[3,3,3,5],[5,3,5,5],[4,1,4,7],[5,1,5,2],[11,1,11,6],[6,1,6,3],[6,4,6,5],[12,1,12,6],[47,1,47,3],[51,1,51,3],[13,1,13,6],[27,1,27,3],[28,1,28,3],[59,1,59,3],[30,1,30,3],[34,1,34,3],[42,1,42,3],[81,1,81,3],[19,1,19,6],[43,1,43,3],[77,1,77,3],[80,1,80,3],[78,1,78,3],[23,1,23,3],[20,1,20,6],[79,1,79,3],[55,1,55,3],[65,1,65,3],[29,1,29,3],[21,1,21,6],[69,1,69,3],[73,1,73,3],[26,1,26,3],[123,1,124,7],[85,6,85,7],[87,6,87,7],[89,6,89,7],[86,6,86,7],[88,6,88,7]]}
[]
[null,"Formulaire de Rapport Commun v.3.1 - CP"]
[]
[null,"Pays",null,{"$f":"IF(INTRO!$E$34<>0,INTRO!$E$34,\" \")","v":"Togo"},null,null,"Année",{"$f":"IF(INTRO!$E$36<>0,INTRO!$E$36,\" \")","v":2019}]
[null,"!!! ATTENTION !!!\nAvant d’analyser les données dans le profil du pays, merci de vous assurer que le rapport dans l’onglet SUMMARY est bien mis à jour"]
[null,"Population totale ",null,null,null,null,1,{"$f":"COUNTRY_INFO!D4","v":7617283}]
[null,"Population — autres groupes d’âge",null,null,null,null,{"$f":"IF($H$6<>0,H7/$H$6,0)","v":3.9998645186216659E-2},{"$f":"H6-SUM(H8:H10)","v":304681}]
[null,"Population — EAPréS",null,null,{"$f":"INTRO!B48","v":"1-4 ans"},null,{"$f":"IF($H$6<>0,H8/$H$6,0)","v":0.16000022580229722},{"$f":"COUNTRY_INFO!E4","v":1218767}]
[null,"Population — EAS",null,null,{"$f":"INTRO!B49","v":"5-14 ans"},null,{"$f":"IF($H$6<>0,H9/$H$6,0)","v":0.29999988184763515},{"$f":"COUNTRY_INFO!F4","v":2285184}]
[null,"Population — Adults",null,null,{"$f":"INTRO!B50","v":"15 ans et plus"},null,{"$f":"IF($H$6<>0,H10/$H$6,0)","v":0.50000124716385097},{"$f":"COUNTRY_INFO!G4","v":3808651}]
[]
[null,"Nombre total d’individus nécessitant une CP pour au moins une des maladies (FL, Oncho, STH, SCH)",null,null,null,null,null,{"$f":"DISTRICT!AT6","v":5090106.6841424033}]
[null,"Proportion du nombre d’individus nécessitant un CP pour au moins une maladie parmi la population totale",null,null,null,null,null,{"$f":"IF(H6<>0,H12/H6,0)","v":0.66823126883199735}]
[null,"Nombre d’UMOs nécessitant une CP pour au moins une des maladies (FL, Oncho, STH, SCH)",null,null,null,null,null,{"$f":"COUNTIF(DISTRICT!AT9:AT1000,\">0\")","v":36}]
[null,"Nombre d’UMOs ayant reçu une CP pour au moins une des maladies (FL, Oncho, STH, SCH)",null,null,null,null,null,{"$f":"COUNTIF(DISTRICT!AY9:AY1000,\">0\")","v":36}]
[null,"Proportion d’UMOs nécessitant une CP pour au moins une maladie et l’ayant reçue",null,null,null,null,null,{"$f":"IF(H14<>0,H15/H14,0)","v":1}]
[null,"Nombre total d’individus ayant été traités pour au moins une maladie (FL, Oncho, STH, SCH)",null,null,null,null,null,{"$f":"DISTRICT!AY6","v":3888598}]
[null,"Nombre total d’individus nécessitant un traitement ayant reçu une CP pour au moins une maladie (FL, Oncho, STH, SCH)",null,null,null,null,null,{"$f":"DISTRICT!BC6","v":3612700}]
[null,"Couverture CP pour au moins une maladie (FL, Oncho, STH, SCH)",null,null,null,null,null,{"$f":"DISTRICT!BD6","v":0.7097493675829859}]
[null,"Nombre d’UMOs ayant été traitées pour toutes les maladies nécessitant une CP dans ces unités",null,null,null,null,null,{"$f":"DISTRICT!AU6","v":24}]
[null,"Population nécessitant une CP dans des UMOs qui ont été traitées pour toutes les maladies requérant une CP",null,null,null,null,null,{"$f":"SUMIF(DISTRICT!AU9:AU1000,\"Y\",DISTRICT!AT9:AT1000)","v":3774064.1046085991}]
[null,"Population ayant reçu une CP dans des UMOs qui ont été traitées pour toutes les maladies nécessitant une CP",null,null,null,null,null,{"$f":"SUMIF(DISTRICT!AU9:AU1000,\"Y\",DISTRICT!AY9:AY1000)","v":2845456}]
[]
[null,null,null,null,"FL","ONCHO","STH","SCH"]
[]
[null,"Maladies nécessitant une CP dans la pays",null,null,{"$f":"IF(INTRO!E38=\"Endémique\",\"Yes\",\"No\")","v":"No"},{"$f":"IF(INTRO!E40=\"Endémique\",\"Yes\",\"No\")","v":"Yes"},{"$f":"IF(INTRO!E42=\"Endémique\",\"Yes\",\"No\")","v":"Yes"},{"$f":"IF(INTRO!E44=\"Endémique\",\"Yes\",\"No\")","v":"Yes"}]
[null,"Nombre d’UMOs dans le pays",null,null,{"$f":"IF(E26=\"Yes\",INTRO!$E$46,\"-\")","v":"-"},{"$f":"IF(F26=\"Yes\",INTRO!$E$46,\"-\")","v":41},{"$f":"IF(G26=\"Yes\",INTRO!$E$46,\"-\")","v":41},{"$f":"IF(H26=\"Yes\",INTRO!$E$46,\"-\")","v":41}]
[null,"Nombre d’UMOs dont le statut d’endémicité est connu",null,null,{"$f":"IF(E26=\"Yes\",E27-E29,\"-\")","v":"-"},{"$f":"IF(F26=\"Yes\",F27-F29,\"-\")","v":41},{"$f":"IF(G26=\"Yes\",G27-G29,\"-\")","v":41},{"$f":"IF(H26=\"Yes\",H27-H29,\"-\")","v":41}]
[null,"Nombre d’UMOs dont le statut d’endémicité est inconnu",null,null,{"$f":"IF(E26=\"Yes\",E27-(992-COUNTIF(COUNTRY_INFO!H$9:H$1000,\"\"))+COUNTIF(COUNTRY_INFO!H$9:H$1000,\"=4\"),\"-\")","v":"-"},{"$f":"IF(F26=\"Yes\",F27-(992-COUNTIF(COUNTRY_INFO!I$9:I$1000,\"\"))+COUNTIF(COUNTRY_INFO!I$9:I$1000,\"=4\"),\"-\")","v":0},{"$f":"IF(G26=\"Yes\",G27-(992-COUNTIF(COUNTRY_INFO!J$9:J$1000,\"\"))+COUNTIF(COUNTRY_INFO!J$9:J$1000,\"=4\")+COUNTIF(COUNTRY_INFO!J$9:J$1000,\"=5\"),\"-\")","v":0},{"$f":"IF(H26=\"Yes\",H27-(992-COUNTIF(COUNTRY_INFO!K$9:K$1000,\"\"))+COUNTIF(COUNTRY_INFO!K$9:K$1000,\"=4\")+COUNTIF(COUNTRY_INFO!K$9:K$1000,\"=5\"),\"-\")","v":0}]
[null,"Nombre d’UMOs non-endémiques",null,null,{"$f":"IF(E26=\"Yes\",COUNTIF(COUNTRY_INFO!H$9:H$1000,\"=0\"),\"-\")","v":"-"},{"$f":"IF(F26=\"Yes\",COUNTIF(COUNTRY_INFO!I$9:I$1000,\"=0\"),\"-\")","v":8},{"$f":"IF(G26=\"Yes\",COUNTIF(COUNTRY_INFO!J$9:J$1000,\"=0\"),\"-\")","v":5},{"$f":"IF(H26=\"Yes\",COUNTIF(COUNTRY_INFO!K$9:K$1000,\"=0\"),\"-\")","v":5}]
[null,"Nombre d’UMOs nécessitant une CP (total)",null,null,{"$f":"COUNTIF(COUNTRY_INFO!H$9:H$1000,\"=1\")","v":0},{"$f":"COUNTIF(COUNTRY_INFO!I$9:I$1000,\"=1\")","v":33},{"$f":"SUM(G33:G34)","v":31},{"$f":"SUM(H32:H34)","v":36}]
[null,null,null,"prevalence basse",null,null,{"$f":"COUNTIF(COUNTRY_INFO!J$9:J$1000,\"=1\")","v":5},{"$f":"COUNTIF(COUNTRY_INFO!K$9:K$1000,\"=1\")","v":6}]
[null,null,null,"prevalence modérée",null,null,{"$f":"COUNTIF(COUNTRY_INFO!J$9:J$1000,\"=2\")","v":16},{"$f":"COUNTIF(COUNTRY_INFO!K$9:K$1000,\"=2\")","v":20}]
[null,null,null,"prevalence haute",null,null,{"$f":"COUNTIF(COUNTRY_INFO!J$9:J$1000,\"=3\")","v":15},{"$f":"COUNTIF(COUNTRY_INFO!K$9:K$1000,\"=3\")","v":10}]
[null,"Population nécessitant une CP dans le pays (total) ",null,null,{"$f":"COUNTRY_INFO!L4","v":0},{"$f":"COUNTRY_INFO!M4","v":3688250},{"$f":"COUNTRY_INFO!N4","v":2393570},{"$f":"COUNTRY_INFO!O4","v":2464416.6100000003}]
[null,null,"EAPréS","prevalence modérée",null,null,{"$f":"SUMIF(COUNTRY_INFO!J$9:J$1000,\"=2\",COUNTRY_INFO!E$9:E$1000)","v":400923}]
[null,null,null,"prevalence haute",null,null,{"$f":"SUMIF(COUNTRY_INFO!J$9:J$1000,\"=3\",COUNTRY_INFO!E$9:E$1000)","v":431624}]
[null,null,"EAS","prevalence basse",null,null,null,{"$f":"SUMIF(COUNTRY_INFO!K$9:K$1000,\"=1\",COUNTRY_INFO!F$9:F$1000)*0.33","v":65857.11}]
[null,null,null,"prevalence modérée",null,null,{"$f":"SUMIF(COUNTRY_INFO!J$9:J$1000,\"=2\",COUNTRY_INFO!F$9:F$1000)","v":751729},{"$f":"SUMIF(COUNTRY_INFO!K$9:K$1000,\"=2\",COUNTRY_INFO!F$9:F$1000)*0.5","v":634635.5}]
[null,null,null,"prevalence haute",null,null,{"$f":"SUMIF(COUNTRY_INFO!J$9:J$1000,\"=3\",COUNTRY_INFO!F$9:F$1000)","v":809294},{"$f":"SUMIF(COUNTRY_INFO!K$9:K$1000,\"=3\",COUNTRY_INFO!F$9:F$1000)","v":502811}]
[null,null,"Adults","prevalence modérée",null,null,null,{"$f":"SUMIF(COUNTRY_INFO!K$9:K$1000,\"=2\",COUNTRY_INFO!G$9:G$1000)*0.2","v":423091}]
[null,null,null,"prevalence haute",null,null,null,{"$f":"SUMIF(COUNTRY_INFO!K$9:K$1000,\"=3\",COUNTRY_INFO!G$9:G$1000)","v":838022}]
[null,"Nombre d’UMOs où une CP a été mise en oeuvre (total)",null,null,{"$f":"COUNTIF(DISTRICT!G$9:G$1000,\">0\")","v":0},{"$f":"COUNTIF(DISTRICT!M$9:M$1000,\">0\")","v":33},{"$f":"COUNTIF(DISTRICT!S$9:S$1000,\">0\")","v":36},{"$f":"COUNTIF(DISTRICT!AC$9:AC$1000,\">0\")","v":24}]
[null,"Nombre d’UMOs nécessitant une CP et  où elle a été mise en oeuvre",null,null,{"$f":"COUNTIF(DISTRICT!H$9:H$1000,\">0\")","v":0},{"$f":"COUNTIF(DISTRICT!N$9:N$1000,\">0\")","v":33},{"$f":"COUNTIF(DISTRICT!X$9:X$1000,\">0\")","v":31},{"$f":"COUNTIF(DISTRICT!AH$9:AH$1000,\">0\")","v":24}]
[null,null,"EAPréS",null,null,null,{"$f":"COUNTIF(DISTRICT!T$9:T$1000,\">0\")","v":0}]
[null,null,"EAS",null,null,null,{"$f":"COUNTIF(DISTRICT!V$9:V$1000,\">0\")","v":31},{"$f":"COUNTIF(DISTRICT!AD$9:AD$1000,\">0\")","v":24}]
[null,null,"Adults",null,null,null,null,{"$f":"COUNTIF(DISTRICT!AF$9:AF$1000,\">0\")","v":0}]
[null,"Nombre d’individus traités (total)",null,null,{"$f":"DISTRICT!G4","v":0},{"$f":"DISTRICT!M4","v":3068023},{"$f":"DISTRICT!S4","v":1998762},{"$f":"DISTRICT!AC4","v":388513}]
[null,null,"EAPréS",null,{"$f":"SUMMARY!$E17","v":"Non admissible"},{"$f":"SUMMARY!$E18","v":"Non admissible"},{"$f":"SUMMARY!$E19","v":0},{"$f":"SUMMARY!$E20","v":"Non ciblé"}]
[null,null,"EAS",null,{"$f":"SUMMARY!$F17","v":0},{"$f":"SUMMARY!$F18","v":1180275},{"$f":"SUMMARY!$F19","v":1998762},{"$f":"SUMMARY!$F20","v":407848}]
[null,null,"Adults",null,{"$f":"SUMMARY!$G17","v":0},{"$f":"SUMMARY!$G18","v":1887748},{"$f":"SUMMARY!$G19","v":0},{"$f":"SUMMARY!$G20","v":0}]
[null,"Nombre d’individus nécessitant CP et traités (total)",null,null,{"$f":"DISTRICT!H4","v":0},{"$f":"DISTRICT!N4","v":3068023},{"$f":"DISTRICT!X4","v":1527892},{"$f":"DISTRICT!AH4","v":369606.26}]
[null,null,"EAPréS",null,null,null,{"$f":"DISTRICT!T4","v":0}]
[null,null,"EAS",null,null,null,{"$f":"DISTRICT!V4","v":1527892},{"$f":"DISTRICT!AD4","v":369606.26}]
[null,null,"Adults",null,null,null,null,{"$f":"DISTRICT!AF4","v":0}]
[null,"Couverture géographique (tous âges)",null,null,{"$f":"IF(E31<>0,E44/E31,0)","v":0},{"$f":"IF(F31<>0,F44/F31,0)","v":1},{"$f":"IF(G31<>0,G44/G31,0)","v":1},{"$f":"IF(H31<>0,H44/H31,0)","v":0.66666666666666663}]
[null,null,"EAPréS",null,null,null,{"$f":"IF(G31<>0,G45/G31,0)","v":0}]
[null,null,"EAS",null,null,null,{"$f":"IF(G31<>0,G46/G31,0)","v":1},{"$f":"IF(H31<>0,H46/H31,0)","v":0.66666666666666663}]
[null,null,"Adults",null,null,null,null,{"$f":"IF(SUM(H33:H34)<>0,H47/SUM(H33:H34),0)","v":0}]
[null,"Couverture nationale (total)",null,null,{"$f":"IF(E35<>0,E52/E35,0)","v":0},{"$f":"IF(F35<>0,F52/F35,0)","v":0.83183705009150677},{"$f":"IF(G35<>0,G52/G35,0)","v":0.63833186411928622},{"$f":"IF(H35<>0,H52/H35,0)","v":0.14997718263228227}]
[null,null,"EAPréS",null,null,null,{"$f":"IF(SUM(G36:G37)<>0,G53/SUM(G36:G37),0)","v":0}]
[null,null,"EAS",null,null,null,{"$f":"IF(SUM(G39:G40)<>0,G54/SUM(G39:G40),0)","v":0.97877609746941585},{"$f":"IF(SUM(H38:H40)<>0,H54/SUM(H38:H40),0)","v":0.3071596037179678}]
[null,null,"Adults",null,null,null,null,{"$f":"IF(SUM(H41:H42)<>0,H55/SUM(H41:H42),0)","v":0}]
[null,null,null,null,"FL","ONCHO","STH","SCH"]
[]
[null,"Nombre d’UMOs ayant réalisé une couverture efficace (tous âges)",null,null,{"$f":"COUNTIF(DISTRICT!I$9:I$1000,\">=65\")","v":0},{"$f":"COUNTIF(DISTRICT!O$9:O$1000,\">=65\")","v":33},{"$f":"COUNTIF(DISTRICT!Y$9:Y$1000,\">=75\")","v":0},{"$f":"COUNTIF(DISTRICT!AI$9:AI$1000,\">=75\")","v":1}]
[null,null,"EAPréS",null,null,null,{"$f":"COUNTIF(DISTRICT!U$9:U$1000,\">=75\")","v":0}]
[null,null,"EAS",null,null,null,{"$f":"COUNTIF(DISTRICT!W$9:W$1000,\">=75\")","v":31},{"$f":"COUNTIF(DISTRICT!AE$9:AE$1000,\">=75\")","v":3}]
[null,null,"Adults",null,null,null,null,{"$f":"COUNTIF(DISTRICT!AG$9:AG$1000,\">=75\")","v":0}]
[null,"Nombre d’individus nécessitant un traitement dans des UMOs ayant réalisé une couverture efficace (total)",null,null,{"$f":"SUMIF(DISTRICT!I9:I1000,\">=65\",DISTRICT!H9:H1000)","v":0},{"$f":"SUMIF(DISTRICT!O9:O1000,\">=65\",DISTRICT!N9:N1000)","v":3068023},{"$f":"SUMIF(DISTRICT!Y9:Y1000,\">=75\",DISTRICT!X9:X1000)","v":0},{"$f":"SUMIF(DISTRICT!AI9:AI1000,\">=75\",DISTRICT!AH9:AH1000)","v":10748.76}]
[null,null,"EAPréS",null,null,null,{"$f":"SUMIF(DISTRICT!U9:U1000,\">=75\",DISTRICT!T9:T1000)","v":0}]
[null,null,"EAS",null,null,null,{"$f":"SUMIF(DISTRICT!W9:W1000,\">=75\",DISTRICT!V9:V1000)","v":1527892},{"$f":"SUMIF(DISTRICT!AE9:AE1000,\">=75\",DISTRICT!AD9:AD1000)","v":91089.260000000009}]
[null,null,"Adults",null,null,null,null,{"$f":"SUMIF(DISTRICT!AG9:AG1000,\">=75\",DISTRICT!AF9:AF1000)","v":0}]
[null,"Proportion d’UMOs nécessitant une CP and ayant réalisé une couverture efficace (total)",null,null,{"$f":"IF(E44<>0,E66/E44,0)","v":0},{"$f":"IF(F44<>0,F66/F44,0)","v":1},{"$f":"IF(G44<>0,G66/G44,0)","v":0},{"$f":"IF(H44<>0,H66/H44,0)","v":4.1666666666666664E-2}]
[null,null,"EAPréS",null,null,null,{"$f":"IF(G45<>0,G67/G45,0)","v":0}]
[null,null,"EAS",null,null,null,{"$f":"IF(G46<>0,G68/G46,0)","v":1},{"$f":"IF(H46<>0,H68/H46,0)","v":0.125}]
[null,null,"Adults",null,null,null,null,{"$f":"IF(H47<>0,H69/H47,0)","v":0}]
[null,"Nombre d’UMOs où la CP a été stoppée (càd sous surveillance)",null,null,{"$f":"COUNTIF(COUNTRY_INFO!H$9:H$1000,\"=99\")","v":0},{"$f":"COUNTIF(COUNTRY_INFO!I$9:I$1000,\"=99\")","v":0}]
[null,"Nombre d’individus dans les UMOs ne nécessitant plus de CP (stoppée)",null,null,{"$f":"SUMIF(COUNTRY_INFO!H$9:H$1000,\"=99\",COUNTRY_INFO!D$9:D$1000)","v":0},{"$f":"SUMIF(COUNTRY_INFO!I$9:I$1000,\"=99\",COUNTRY_INFO!D$9:D$1000)","v":0}]
[null,"Nombre d’individus nécessitant une CP vivants dans des UMOs ciblées pour la CP",null,null,{"$f":"SUMIF(DISTRICT!H$9:H$1000,\">0\",DISTRICT!D$9:D$1000)","v":0},{"$f":"SUMIF(DISTRICT!N$9:N$1000,\">0\",DISTRICT!J$9:J$1000)","v":3688250},{"$f":"SUMIF(DISTRICT!X$9:X$1000,\">0\",DISTRICT!P$9:P$1000)","v":2393570},{"$f":"SUMIF(DISTRICT!AH$9:AH$1000,\">0\",DISTRICT!Z$9:Z$1000)","v":2084386.06}]
[null,"Nombre d’individus nécessitant une CP vivant dans des UMOs non ciblées pour la CP",null,null,{"$f":"SUMIF(DISTRICT!H$9:H$1000,\"=0\",DISTRICT!D$9:D$1000)","v":0},{"$f":"SUMIF(DISTRICT!N$9:N$1000,\"=0\",DISTRICT!J$9:J$1000)","v":0},{"$f":"SUMIF(DISTRICT!X$9:X$1000,\"=0\",DISTRICT!P$9:P$1000)","v":0},{"$f":"SUMIF(DISTRICT!AH$9:AH$1000,\"=0\",DISTRICT!Z$9:Z$1000)","v":380030.55}]
[null,null,null,null,{"$f":"E35-E52","v":0},{"$f":"F35-F52","v":620227},{"$f":"G35-G52","v":865678},{"$f":"H35-H52","v":2094810.3500000003}]
[null,"Nombre d’UMOs nécessitant et recevant la CP",null,null,{"$f":"E31-E44","v":0},{"$f":"F31-F44","v":0},{"$f":"G31-G44","v":0},{"$f":"H31-H44","v":12}]
[null,null,null,null,{"$f":"E27-E31-E29","v":{"$error":"#VALUE!"}},{"$f":"F27-F31-F29","v":8},{"$f":"G27-G31-G29","v":10},{"$f":"H27-H31-H29","v":5}]
[]
[null,null,null,null,null,null,"Nécessitant et recevant une CP"]
[null,null,null,null,null,null,"Nécessitant mais ne recevant pas de CP"]
[null,null,null,null,null,null,"Ne nécessitant pas de CP"]
[null,null,null,null,null,null,"Statut inconnu"]
[]
[]
[]
[]
[]
[]
[]
[]
[]
[]
[]
[]
[]
[]
[]
[]
[]
[]
[]
[]
[]
[]
[]
[]
[]
[]
[]
[]
[]
[]
[]
[]
[]
[]
[null,"Cliquer ici pour accéder au portail des données de la CP"]

{"sheet":"DATA_POLICY","index":12,"n_rows":39,"n_cols":8,"rows_kept":39,"cut":false,"hidden":true,"merged":[[55,1,55,2],[0,1,0,5],[1,1,1,7],[3,3,3,5],[6,1,6,7],[8,1,12,7],[13,1,16,7],[17,1,21,7],[22,1,25,7],[26,2,36,7],[38,1,45,7]]}
[]
[null,"Formulaire de Rapport Commun v.3.1"]
[]
[null,"Pays",null,{"$f":"IF(INTRO!$E$34<>0,INTRO!$E$34,\" \")","v":"Togo"},null,null,"Année",{"$f":"IF(INTRO!$E$36<>0,INTRO!$E$36,\" \")","v":2019}]
[]
[]
[null,"Déclaration de principe sur la communication de données par l’OMS"]
[]
[null,"Les données sont le fondement de toutes les mesures rationnelles de santé publique et les avantages de la communication de données, y compris pour la science et la santé publique, sont largement reconnus. L’OMS souhaite promouvoir autant que possible la communication de données sanitaires, y compris, mais pas uniquement, de données épidémiologiques et de surveillance."]
[]
[]
[]
[]
[null,{"$f":"\"À cet égard, et sans préjudice des instruments juridiquement contraignants régissant la communication et la publication d’informations, le Ministère de la santé de \" & D4 & \", en fournissant des données à l’OMS :\"","v":"À cet égard, et sans préjudice des instruments juridiquement contraignants régissant la communication et la publication d’informations, le Ministère de la santé de Togo, en fournissant des données à l’OMS :"}]
[]
[]
[]
[null,"confirme que toutes les données à fournir à l’OMS, ont été collectées conformément à la législation nationale applicable, y compris aux lois de protection des données visant à préserver l’anonymat des personnes identifiables ;"]
[]
[]
[]
[]
[null,{"$f":"\"convient que l’OMS aura le droit, toujours sous réserve des mesures visant à garantir l’utilisation éthique et sécurisée des données et toujours sous réserve d’une reconnaissance appropriée de la part de \"&D4&\":\"","v":"convient que l’OMS aura le droit, toujours sous réserve des mesures visant à garantir l’utilisation éthique et sécurisée des données et toujours sous réserve d’une reconnaissance appropriée de la part de Togo:"}]
[]
[]
[]
[null,null,"de publier les données, dépourvues de tout élément d’identification personnelle (ci-après dénommées « les données ») et de les mettre à la disposition de toute partie intéressée, sur demande (dans la mesure où elles n’ont pas, ou pas encore, été publiées par l’OMS), selon des modalités autorisant leur utilisation non commerciale et sans but lucratif à des fins de santé publique (pour autant que l’OMS garde la maîtrise de la publication des données) ;\nd’utiliser, de compiler, d’agréger, d’évaluer et d’analyser les données et de publier et de diffuser les résultats obtenus grâce à ces données en rapport avec des travaux de l’OMS et conformément aux politiques et pratiques de l’Organisation."]
[]
[]
[]
[]
[]
[]
[]
[]
[]
[]
[]
[null,{"$f":"CONCATENATE(\"Sauf lorsque des instruments juridiquement contraignants (RSI, Règlement de Nomenclature de l’OMS, de 1967, etc.) disposent que les données doivent être communiquées et publiées, le Ministère de la santé de \", D4,\" peut, pour certaines données, décider de ne pas appliquer (tout ou partie des) (les) dispositions qui précèdent,\" & \" en informant l’OMS par écrit à l’adresse suivante, à condition que cette notification précise clairement les données, \" & \"dont il s’agit et indique clairement lesquelles des dispositions qui précèdent ne seront pas appliquées, et pour quels motifs.\")","v":"Sauf lorsque des instruments juridiquement contraignants (RSI, Règlement de Nomenclature de l’OMS, de 1967, etc.) disposent que les données doivent être communiquées et publiées, le Ministère de la santé de Togo peut, pour certaines données, décider de ne pas appliquer (tout ou partie des) (les) dispositions qui précèdent, en informant l’OMS par écrit à l’adresse suivante, à condition que cette notification précise clairement les données, dont il s’agit et indique clairement lesquelles des dispositions qui précèdent ne seront pas appliquées, et pour quels motifs."}]