{"text_format":"1","workbook":"xlsx","n_sheets":15,"sheets":["INTRO","COUNTRY_INFO","MDA1","MDA2","MDA3","MDA5","T1","T2","T3_R1","T3_R2","T3_R3","DISTRICT","SUMMARY","PROFILE","DATA_POLICY"],"not_rendered":{"charts":8,"images":5,"macros":1,"external_links":0,"defined_names":16,"comments":13,"pivot_tables":0},"unopened":[],"bounds":{"document_bytes":16777216,"sheet_cells":100000,"rows_first":2000,"rows_last":500,"rows_between":2000,"halvings":0,"cell_chars":16384,"cell_head_chars":4096},"cells_cut":0,"cells_raw":0,"read":"whole","date_system":"1900"}

{"sheet":"INTRO","index":0,"n_rows":51,"n_cols":5,"rows_kept":51,"cut":false,"hidden":false,"merged":[[0,1,0,4],[1,1,1,4],[2,1,2,4],[3,1,3,4],[4,1,4,4],[5,1,5,4],[7,2,7,4],[8,2,8,4],[9,2,9,4],[10,2,10,4],[11,2,11,4],[12,1,12,4],[13,1,13,4],[14,1,14,4],[15,1,15,4],[16,1,16,4],[17,1,17,4],[18,1,18,4],[19,2,19,4],[20,1,20,4],[21,2,21,4],[22,1,22,4],[25,1,25,4],[28,1,28,4],[29,2,29,4],[30,1,30,4],[31,1,31,4],[33,1,33,2],[35,1,35,2],[37,1,37,2],[39,1,39,2],[41,1,41,2],[43,1,43,2],[45,1,45,2],[46,1,46,4],[23,2,24,4],[26,2,27,4]]}
[]
[null,"PC Joint Reporting Form v.4.2"]
[]
[null,"The purpose of this template Joint Reporting Form (JRF) - available as an Excel file - is to provide national health authorities and data managers with a standardized tool to address these reporting challenges, facilitate  integration and thereby further contribute to improving overall programme management. This template aims to standardize national reporting of programme implementation outcomes, improve availability and coordination of preventive chemotherapy data across the World Health Organization regions. \nNational authorities are requested to complete this form for submission to the World Health Organization within 3 months after the last round was implemented and no later than 31 March of the next implementation year."]
[]
[null,"Structure of the application (worksheets):"]
[]
[null,"INTRO","This worksheet includes guides on how to complete the joint reporting form and information about status of PC for endemic diseases in the country"]
[null,"COUNTRY_INFO","This worksheet includes information about administrative structure of the country, population by age group, status of endemicity for each disease, population requiring PC, planned interventions and interventions implemented"]
[null,"MDA1, MDA2, MDA3, MDA4, MDA5, T1, T2 and T3","These worksheets include information about endemic districts targeted for treatment with specified PC medicines, treatment plan, and number of people who received treatment by age group. Depending on co-endemicity of the diseases in a country the tool will generate respective worksheets to fill in."]
[null,"DISTRICT","This worksheet includes summary of people treated by disease at the level of implementation. If data by gender is available, it requires to enter."]
[null,"SUMMARY","This worksheet includes summary of people treated by disease and by PC intervention. Before generating the report (run macros) please select the disease for which you need the report. Follow the same rule to generate various reports.\nThis worksheet should be printed and submitted as a Joint Report (see the instruction for submission in the SUMMARY worksheet)."]
[]
[null,"Instruction for data entry"]
[]
[null,"Most of the cells in the above-mentioned worksheets include formula that are calculated automatically according to the treatment policy recommended by WHO for each disease.\nSee the link https://www.who.int/publications/i/item/9789241599993"]
[]
[null,"Please enter your data into the cells according to their colour code:"]
[]
[null,null,"White - cell is not protected. Please enter the value of the requested indicator."]
[]
[null,null,"Yellow - cell is protected and includes name of indicator. No data entry required."]
[]
[null,null,"Orange - cell is not protected and includes a drop-down menu. Please select the value from the drop-down list."]
[]
[]
[null,null,"Green - cell is not protected and includes formula. Please change the value only if your data are different from those that are calculated automatically."]
[]
[]
[null,null,"Blue - cell is protected and includes formula. No data entry required."]
[]
[null,"Country data"]
[]
[null,"COUNTRY",null,null,"Zanzibar"]
[]
[null,"Year of reporting data",null,null,2022]
[]
[null,"Is country endemic for lymphatic filariasis (LF)?",null,null,"Endemic"]
[]
[null,"Is country endemic for onchocerciasis (ONCHO)?",null,null,"Endemic but PC is not required"]
[]
[null,"Is country endemic for soil-transmitted helminthiases (STH)?",null,null,"Endemic"]
[]
[null,"Is country endemic for schistosomiasis (SCH)?",null,null,"Endemic"]
[]
[null,"How many administrative units in the country?",null,null,11]
[null,"If demographical data at the second administrative level are not available by age group, please enter the proportion (%) of population by age group in the country. If data are available, please leave these cells blank."]
[null,"1-4 years age","Preschool-age children (PreSAC)",null,0.1309]
[null,"5-14 years age","School-age children (SAC)",null,0.2704]
[null,"15 years +","Adults",null,0.5639]
[null,"15-49 years","Women of reproductive age (WRA)",null,0.2408]

{"sheet":"COUNTRY_INFO","index":1,"n_rows":20,"n_cols":56,"rows_kept":20,"cut":false,"hidden":false,"merged":[[3,0,3,2],[3,7,3,10],[3,21,3,24],[3,25,3,27],[5,0,5,2],[5,3,5,6],[5,7,5,10],[5,11,5,20],[5,21,5,24],[5,25,5,27],[6,13,6,16],[6,17,6,20],[6,0,7,0],[6,1,7,1],[6,2,7,2],[6,3,7,3],[6,4,7,4],[6,5,7,5],[6,6,7,6],[6,7,7,7],[6,8,7,8],[6,9,7,9],[6,10,7,10],[6,11,7,11],[6,12,7,12],[6,21,7,21],[6,22,7,22],[6,23,7,23],[6,24,7,24],[6,25,7,25],[6,26,7,26],[6,27,7,27]]}
["COUNTRY INFORMATION"]
["Administrative structure, population by age group, endemicity status, planned interventions and interventions implemented",null,null,null,null,null,null,null,null,null,null,null,null,null,null,null,null,null,null,null,null,null,null,null,null,null,1.0299]
[]
["TOTAL",null,null,{"$f":"SUBTOTAL(9,D$10:D$1010)","v":1768965},{"$f":"SUBTOTAL(9,E$10:E$1010)","v":231558},478330,997518,null,null,null,null,{"$f":"SUBTOTAL(9,L$10:L$1010)","v":1768965},0,231558,478330,425967,1135855,139778,384981,802847,1327606]
[]
["Country administrative structure",null,null,"Population",null,null,null,"Endemicity",null,null,null,"Population requiring PC",null,null,null,null,null,null,null,null,null,"Number of treatment\nrounds implemented in the year",null,null,null,"PC implemented"]
["Country","Province/State","District","Total","PreSAC","SAC","Adults","LF","Oncho","STH","SCH","LF","ONCHO","STH",null,null,null,"SCH",null,null,null,"LF","Oncho","STH","SCH","ROUND 1","ROUND 2","ROUND 3"]
[null,null,null,null,null,null,null,null,null,null,null,null,null,"PreSAC","SAC","WRA","TOTAL","PreSAC","SAC","Adults","TOTAL",null,null,null,null,null,null,null,null,null,null,null,null,"IU_ID","IU_Name"]
[null,null,null,null,null,null,null,null,null,null,null,null,null,null,null,null,null,null,null,null,null,null,null,null,null,null,null,null,"x","x","x","x","x","x","x","x","x","x","x","x","x","x","x","x","x","x","x","x","x","x","x","x","x","x","x","x"]
[{"$f":"IF(INTRO!$E$34<>0,INTRO!$E$34,\"\")","v":"Zanzibar"},"Kaskazini Unguja","Kaskazini A",136337,{"$f":"IF(INTRO!$E$48=\"\",\"\",ROUND($D10*INTRO!$E$48,0))","v":17847},{"$f":"IF(INTRO!$E$49=\"\",\"\",ROUND($D10*INTRO!$E$49,0))","v":36866},{"$f":"IF(INTRO!$E$50=\"\",\"\",ROUND($D10*INTRO!$E$50,0))","v":76880},1,0,3,3,{"$f":"IF(INTRO!$E$38=\"Endemic\",IF($H10>0,IF($H10=4,\"Unknown\",IF($H10=99,\"Stopped\",$D10)),0),\"Not required\")","v":136337},{"$f":"IF(INTRO!$E$40=\"Endemic\",IF($I10>0,IF($I10=4,\"Unknown\",IF($I10=99,\"Stopped\",$D10)),0),\"Not required\")","v":"Not required"},{"$f":"IF(INTRO!$E$42=\"Endemic\",IF($J10>1,IF($J10=4,\"Unknown\",IF($J10=99,\"Surveillance\",E10)),0),\"Not required\")","v":17847},{"$f":"IF(INTRO!$E$42=\"Endemic\",IF($J10>1,IF($J10=4,\"Unknown\",IF($J10=99,\"Surveillance\",F10)),0),\"Not required\")","v":36866},{"$f":"IF(INTRO!$E$42=\"Endemic\",IF($J10>1,IF($J10=4,\"Unknown\",IF($J10=99,\"Surveillance\",ROUND(D10*INTRO!$E$51,0))),0),\"Not required\")","v":32830},{"$f":"IF(INTRO!$E$42=\"Endemic\",IF($J10>1,IF($J10=4,\"Unknown\",IF($J10=99,\"Surveillance\",SUM($N10:$P10))),0),\"Not required\")","v":87543},{"$f":"IF(INTRO!$E$44=\"Endemic\",IF($K10>1,IF($K10=4,\"Unknown\",IF($K10=99,\"Surveillance\",ROUND(E10*0.75,0))),0),\"Not required\")","v":13385},{"$f":"IF(INTRO!$E$44=\"Endemic\",IF($K10>1,IF($K10=4,\"Unknown\",IF($K10=99,\"Surveillance\",F10)),0),\"Not required\")","v":36866},{"$f":"IF(INTRO!$E$44=\"Endemic\",IF($K10>1,IF($K10=4,\"Unknown\",IF($K10=99,\"Surveillance\",G10)),0),\"Not required\")","v":76880},{"$f":"IF(INTRO!$E$44=\"Endemic\",IF($K10>1,IF($K10=4,\"Unknown\",IF($K10=99,\"Surveillance\",SUM($R10:$T10))),0),\"Not required\")","v":127131},1,0,1,1,"MDA1 (IVM+ALB)","T2 (PZQ)",null,null,null,null,null,null,51894,"Kaskazini A"]
[{"$f":"IF(INTRO!$E$34<>0,INTRO!$E$34,\"\")","v":"Zanzibar"},"Kaskazini Unguja","Kaskazini B",108269,{"$f":"IF(INTRO!$E$48=\"\",\"\",ROUND($D11*INTRO!$E$48,0))","v":14172},{"$f":"IF(INTRO!$E$49=\"\",\"\",ROUND($D11*INTRO!$E$49,0))","v":29276},{"$f":"IF(INTRO!$E$50=\"\",\"\",ROUND($D11*INTRO!$E$50,0))","v":61053},1,0,3,3,{"$f":"IF(INTRO!$E$38=\"Endemic\",IF($H11>0,IF($H11=4,\"Unknown\",IF($H11=99,\"Stopped\",$D11)),0),\"Not required\")","v":108269},{"$f":"IF(INTRO!$E$40=\"Endemic\",IF($I11>0,IF($I11=4,\"Unknown\",IF($I11=99,\"Stopped\",$D11)),0),\"Not required\")","v":"Not required"},{"$f":"IF(INTRO!$E$42=\"Endemic\",IF($J11>1,IF($J11=4,\"Unknown\",IF($J11=99,\"Surveillance\",E11)),0),\"Not required\")","v":14172},{"$f":"IF(INTRO!$E$42=\"Endemic\",IF($J11>1,IF($J11=4,\"Unknown\",IF($J11=99,\"Surveillance\",F11)),0),\"Not required\")","v":29276},{"$f":"IF(INTRO!$E$42=\"Endemic\",IF($J11>1,IF($J11=4,\"Unknown\",IF($J11=99,\"Surveillance\",ROUND(D11*INTRO!$E$51,0))),0),\"Not required\")","v":26071},{"$f":"IF(INTRO!$E$42=\"Endemic\",IF($J11>1,IF($J11=4,\"Unknown\",IF($J11=99,\"Surveillance\",SUM($N11:$P11))),0),\"Not required\")","v":69519},{"$f":"IF(INTRO!$E$44=\"Endemic\",IF($K11>1,IF($K11=4,\"Unknown\",IF($K11=99,\"Surveillance\",ROUND(E11*0.75,0))),0),\"Not required\")","v":10629},{"$f":"IF(INTRO!$E$44=\"Endemic\",IF($K11>1,IF($K11=4,\"Unknown\",IF($K11=99,\"Surveillance\",F11)),0),\"Not required\")","v":29276},{"$f":"IF(INTRO!$E$44=\"Endemic\",IF($K11>1,IF($K11=4,\"Unknown\",IF($K11=99,\"Surveillance\",G11)),0),\"Not required\")","v":61053},{"$f":"IF(INTRO!$E$44=\"Endemic\",IF($K11>1,IF($K11=4,\"Unknown\",IF($K11=99,\"Surveillance\",SUM($R11:$T11))),0),\"Not required\")","v":100958},1,0,1,1,"MDA1 (IVM+ALB)","T2 (PZQ)",null,null,null,null,null,null,51895,"Kaskazini B"]
[{"$f":"IF(INTRO!$E$34<>0,INTRO!$E$34,\"\")","v":"Zanzibar"},"Kusini Unguja","Kusini",50318,{"$f":"IF(INTRO!$E$48=\"\",\"\",ROUND($D12*INTRO!$E$48,0))","v":6587},{"$f":"IF(INTRO!$E$49=\"\",\"\",ROUND($D12*INTRO!$E$49,0))","v":13606},{"$f":"IF(INTRO!$E$50=\"\",\"\",ROUND($D12*INTRO!$E$50,0))","v":28374},1,0,2,0,{"$f":"IF(INTRO!$E$38=\"Endemic\",IF($H12>0,IF($H12=4,\"Unknown\",IF($H12=99,\"Stopped\",$D12)),0),\"Not required\")","v":50318},{"$f":"IF(INTRO!$E$40=\"Endemic\",IF($I12>0,IF($I12=4,\"Unknown\",IF($I12=99,\"Stopped\",$D12)),0),\"Not required\")","v":"Not required"},{"$f":"IF(INTRO!$E$42=\"Endemic\",IF($J12>1,IF($J12=4,\"Unknown\",IF($J12=99,\"Surveillance\",E12)),0),\"Not required\")","v":6587},{"$f":"IF(INTRO!$E$42=\"Endemic\",IF($J12>1,IF($J12=4,\"Unknown\",IF($J12=99,\"Surveillance\",F12)),0),\"Not required\")","v":13606},{"$f":"IF(INTRO!$E$42=\"Endemic\",IF($J12>1,IF($J12=4,\"Unknown\",IF($J12=99,\"Surveillance\",ROUND(D12*INTRO!$E$51,0))),0),\"Not required\")","v":12117},{"$f":"IF(INTRO!$E$42=\"Endemic\",IF($J12>1,IF($J12=4,\"Unknown\",IF($J12=99,\"Surveillance\",SUM($N12:$P12))),0),\"Not required\")","v":32310},{"$f":"IF(INTRO!$E$44=\"Endemic\",IF($K12>1,IF($K12=4,\"Unknown\",IF($K12=99,\"Surveillance\",ROUND(E12*0.75,0))),0),\"Not required\")","v":0},{"$f":"IF(INTRO!$E$44=\"Endemic\",IF($K12>1,IF($K12=4,\"Unknown\",IF($K12=99,\"Surveillance\",F12)),0),\"Not required\")","v":0},{"$f":"IF(INTRO!$E$44=\"Endemic\",IF($K12>1,IF($K12=4,\"Unknown\",IF($K12=99,\"Surveillance\",G12)),0),\"Not required\")","v":0},{"$f":"IF(INTRO!$E$44=\"Endemic\",IF($K12>1,IF($K12=4,\"Unknown\",IF($K12=99,\"Surveillance\",SUM($R12:$T12))),0),\"Not required\")","v":0},1,0,1,0,"MDA1 (IVM+ALB)",null,null,null,null,null,null,null,51899,"Kusini"]
[{"$f":"IF(INTRO!$E$34<>0,INTRO!$E$34,\"\")","v":"Zanzibar"},"Kusini Unguja","Kati",94714,{"$f":"IF(INTRO!$E$48=\"\",\"\",ROUND($D13*INTRO!$E$48,0))","v":12398},{"$f":"IF(INTRO!$E$49=\"\",\"\",ROUND($D13*INTRO!$E$49,0))","v":25611},{"$f":"IF(INTRO!$E$50=\"\",\"\",ROUND($D13*INTRO!$E$50,0))","v":53409},1,0,3,2,{"$f":"IF(INTRO!$E$38=\"Endemic\",IF($H13>0,IF($H13=4,\"Unknown\",IF($H13=99,\"Stopped\",$D13)),0),\"Not required\")","v":94714},{"$f":"IF(INTRO!$E$40=\"Endemic\",IF($I13>0,IF($I13=4,\"Unknown\",IF($I13=99,\"Stopped\",$D13)),0),\"Not required\")","v":"Not required"},{"$f":"IF(INTRO!$E$42=\"Endemic\",IF($J13>1,IF($J13=4,\"Unknown\",IF($J13=99,\"Surveillance\",E13)),0),\"Not required\")","v":12398},{"$f":"IF(INTRO!$E$42=\"Endemic\",IF($J13>1,IF($J13=4,\"Unknown\",IF($J13=99,\"Surveillance\",F13)),0),\"Not required\")","v":25611},{"$f":"IF(INTRO!$E$42=\"Endemic\",IF($J13>1,IF($J13=4,\"Unknown\",IF($J13=99,\"Surveillance\",ROUND(D13*INTRO!$E$51,0))),0),\"Not required\")","v":22807},{"$f":"IF(INTRO!$E$42=\"Endemic\",IF($J13>1,IF($J13=4,\"Unknown\",IF($J13=99,\"Surveillance\",SUM($N13:$P13))),0),\"Not required\")","v":60816},{"$f":"IF(INTRO!$E$44=\"Endemic\",IF($K13>1,IF($K13=4,\"Unknown\",IF($K13=99,\"Surveillance\",ROUND(E13*0.75,0))),0),\"Not required\")","v":9299},{"$f":"IF(INTRO!$E$44=\"Endemic\",IF($K13>1,IF($K13=4,\"Unknown\",IF($K13=99,\"Surveillance\",F13)),0),\"Not required\")","v":25611},{"$f":"IF(INTRO!$E$44=\"Endemic\",IF($K13>1,IF($K13=4,\"Unknown\",IF($K13=99,\"Surveillance\",G13)),0),\"Not required\")","v":53409},{"$f":"IF(INTRO!$E$44=\"Endemic\",IF($K13>1,IF($K13=4,\"Unknown\",IF($K13=99,\"Surveillance\",SUM($R13:$T13))),0),\"Not required\")","v":88319},1,0,1,1,"MDA1 (IVM+ALB)","T2 (PZQ)",null,null,null,null,null,null,51898,"Kati"]
[{"$f":"IF(INTRO!$E$34<>0,INTRO!$E$34,\"\")","v":"Zanzibar"},"Mjini Magharibi","Mjini",294906,{"$f":"IF(INTRO!$E$48=\"\",\"\",ROUND($D14*INTRO!$E$48,0))","v":38603},{"$f":"IF(INTRO!$E$49=\"\",\"\",ROUND($D14*INTRO!$E$49,0))","v":79743},{"$f":"IF(INTRO!$E$50=\"\",\"\",ROUND($D14*INTRO!$E$50,0))","v":166297},1,0,2,1,{"$f":"IF(INTRO!$E$38=\"Endemic\",IF($H14>0,IF($H14=4,\"Unknown\",IF($H14=99,\"Stopped\",$D14)),0),\"Not required\")","v":294906},{"$f":"IF(INTRO!$E$40=\"Endemic\",IF($I14>0,IF($I14=4,\"Unknown\",IF($I14=99,\"Stopped\",$D14)),0),\"Not required\")","v":"Not required"},{"$f":"IF(INTRO!$E$42=\"Endemic\",IF($J14>1,IF($J14=4,\"Unknown\",IF($J14=99,\"Surveillance\",E14)),0),\"Not required\")","v":38603},{"$f":"IF(INTRO!$E$42=\"Endemic\",IF($J14>1,IF($J14=4,\"Unknown\",IF($J14=99,\"Surveillance\",F14)),0),\"Not required\")","v":79743},{"$f":"IF(INTRO!$E$42=\"Endemic\",IF($J14>1,IF($J14=4,\"Unknown\",IF($J14=99,\"Surveillance\",ROUND(D14*INTRO!$E$51,0))),0),\"Not required\")","v":71013},{"$f":"IF(INTRO!$E$42=\"Endemic\",IF($J14>1,IF($J14=4,\"Unknown\",IF($J14=99,\"Surveillance\",SUM($N14:$P14))),0),\"Not required\")","v":189359},{"$f":"IF(INTRO!$E$44=\"Endemic\",IF($K14>1,IF($K14=4,\"Unknown\",IF($K14=99,\"Surveillance\",ROUND(E14*0.75,0))),0),\"Not required\")","v":0},{"$f":"IF(INTRO!$E$44=\"Endemic\",IF($K14>1,IF($K14=4,\"Unknown\",IF($K14=99,\"Surveillance\",F14)),0),\"Not required\")","v":0},{"$f":"IF(INTRO!$E$44=\"Endemic\",IF($K14>1,IF($K14=4,\"Unknown\",IF($K14=99,\"Surveillance\",G14)),0),\"Not required\")","v":0},{"$f":"IF(INTRO!$E$44=\"Endemic\",IF($K14>1,IF($K14=4,\"Unknown\",IF($K14=99,\"Surveillance\",SUM($R14:$T14))),0),\"Not required\")","v":0},1,0,1,1,"MDA1 (IVM+ALB)","T2 (PZQ)",null,null,null,null,null,null,51901,"Mjini"]
[{"$f":"IF(INTRO!$E$34<>0,INTRO!$E$34,\"\")","v":"Zanzibar"},"Mjini Magharibi","Magharibi A",208144,{"$f":"IF(INTRO!$E$48=\"\",\"\",ROUND($D15*INTRO!$E$48,0))","v":27246},{"$f":"IF(INTRO!$E$49=\"\",\"\",ROUND($D15*INTRO!$E$49,0))","v":56282},{"$f":"IF(INTRO!$E$50=\"\",\"\",ROUND($D15*INTRO!$E$50,0))","v":117372},1,0,2,3,{"$f":"IF(INTRO!$E$38=\"Endemic\",IF($H15>0,IF($H15=4,\"Unknown\",IF($H15=99,\"Stopped\",$D15)),0),\"Not required\")","v":208144},{"$f":"IF(INTRO!$E$40=\"Endemic\",IF($I15>0,IF($I15=4,\"Unknown\",IF($I15=99,\"Stopped\",$D15)),0),\"Not required\")","v":"Not required"},{"$f":"IF(INTRO!$E$42=\"Endemic\",IF($J15>1,IF($J15=4,\"Unknown\",IF($J15=99,\"Surveillance\",E15)),0),\"Not required\")","v":27246},{"$f":"IF(INTRO!$E$42=\"Endemic\",IF($J15>1,IF($J15=4,\"Unknown\",IF($J15=99,\"Surveillance\",F15)),0),\"Not required\")","v":56282},{"$f":"IF(INTRO!$E$42=\"Endemic\",IF($J15>1,IF($J15=4,\"Unknown\",IF($J15=99,\"Surveillance\",ROUND(D15*INTRO!$E$51,0))),0),\"Not required\")","v":50121},{"$f":"IF(INTRO!$E$42=\"Endemic\",IF($J15>1,IF($J15=4,\"Unknown\",IF($J15=99,\"Surveillance\",SUM($N15:$P15))),0),\"Not required\")","v":133649},{"$f":"IF(INTRO!$E$44=\"Endemic\",IF($K15>1,IF($K15=4,\"Unknown\",IF($K15=99,\"Surveillance\",ROUND(E15*0.75,0))),0),\"Not required\")","v":20435},{"$f":"IF(INTRO!$E$44=\"Endemic\",IF($K15>1,IF($K15=4,\"Unknown\",IF($K15=99,\"Surveillance\",F15)),0),\"Not required\")","v":56282},{"$f":"IF(INTRO!$E$44=\"Endemic\",IF($K15>1,IF($K15=4,\"Unknown\",IF($K15=99,\"Surveillance\",G15)),0),\"Not required\")","v":117372},{"$f":"IF(INTRO!$E$44=\"Endemic\",IF($K15>1,IF($K15=4,\"Unknown\",IF($K15=99,\"Surveillance\",SUM($R15:$T15))),0),\"Not required\")","v":194089},1,0,1,1,"MDA1 (IVM+ALB)","T2 (PZQ)",null,null,null,null,null,null,51900,"Magharibi A"]
[{"$f":"IF(INTRO!$E$34<>0,INTRO!$E$34,\"\")","v":"Zanzibar"},"Mjini Magharibi","Magharibi B",269409,{"$f":"IF(INTRO!$E$48=\"\",\"\",ROUND($D16*INTRO!$E$48,0))","v":35266},{"$f":"IF(INTRO!$E$49=\"\",\"\",ROUND($D16*INTRO!$E$49,0))","v":72848},{"$f":"IF(INTRO!$E$50=\"\",\"\",ROUND($D16*INTRO!$E$50,0))","v":151920},1,0,2,3,{"$f":"IF(INTRO!$E$38=\"Endemic\",IF($H16>0,IF($H16=4,\"Unknown\",IF($H16=99,\"Stopped\",$D16)),0),\"Not required\")","v":269409},{"$f":"IF(INTRO!$E$40=\"Endemic\",IF($I16>0,IF($I16=4,\"Unknown\",IF($I16=99,\"Stopped\",$D16)),0),\"Not required\")","v":"Not required"},{"$f":"IF(INTRO!$E$42=\"Endemic\",IF($J16>1,IF($J16=4,\"Unknown\",IF($J16=99,\"Surveillance\",E16)),0),\"Not required\")","v":35266},{"$f":"IF(INTRO!$E$42=\"Endemic\",IF($J16>1,IF($J16=4,\"Unknown\",IF($J16=99,\"Surveillance\",F16)),0),\"Not required\")","v":72848},{"$f":"IF(INTRO!$E$42=\"Endemic\",IF($J16>1,IF($J16=4,\"Unknown\",IF($J16=99,\"Surveillance\",ROUND(D16*INTRO!$E$51,0))),0),\"Not required\")","v":64874},{"$f":"IF(INTRO!$E$42=\"Endemic\",IF($J16>1,IF($J16=4,\"Unknown\",IF($J16=99,\"Surveillance\",SUM($N16:$P16))),0),\"Not required\")","v":172988},{"$f":"IF(INTRO!$E$44=\"Endemic\",IF($K16>1,IF($K16=4,\"Unknown\",IF($K16=99,\"Surveillance\",ROUND(E16*0.75,0))),0),\"Not required\")","v":26450},{"$f":"IF(INTRO!$E$44=\"Endemic\",IF($K16>1,IF($K16=4,\"Unknown\",IF($K16=99,\"Surveillance\",F16)),0),\"Not required\")","v":72848},{"$f":"IF(INTRO!$E$44=\"Endemic\",IF($K16>1,IF($K16=4,\"Unknown\",IF($K16=99,\"Surveillance\",G16)),0),\"Not required\")","v":151920},{"$f":"IF(INTRO!$E$44=\"Endemic\",IF($K16>1,IF($K16=4,\"Unknown\",IF($K16=99,\"Surveillance\",SUM($R16:$T16))),0),\"Not required\")","v":251218},1,0,1,1,"MDA1 (IVM+ALB)","T2 (PZQ)",null,null,null,null,null,null,51902,"Magharibi B"]
[{"$f":"IF(INTRO!$E$34<>0,INTRO!$E$34,\"\")","v":"Zanzibar"},"Kusini Pemba","Chake chake",145946,{"$f":"IF(INTRO!$E$48=\"\",\"\",ROUND($D17*INTRO!$E$48,0))","v":19104},{"$f":"IF(INTRO!$E$49=\"\",\"\",ROUND($D17*INTRO!$E$49,0))","v":39464},{"$f":"IF(INTRO!$E$50=\"\",\"\",ROUND($D17*INTRO!$E$50,0))","v":82299},1,0,3,2,{"$f":"IF(INTRO!$E$38=\"Endemic\",IF($H17>0,IF($H17=4,\"Unknown\",IF($H17=99,\"Stopped\",$D17)),0),\"Not required\")","v":145946},{"$f":"IF(INTRO!$E$40=\"Endemic\",IF($I17>0,IF($I17=4,\"Unknown\",IF($I17=99,\"Stopped\",$D17)),0),\"Not required\")","v":"Not required"},{"$f":"IF(INTRO!$E$42=\"Endemic\",IF($J17>1,IF($J17=4,\"Unknown\",IF($J17=99,\"Surveillance\",E17)),0),\"Not required\")","v":19104},{"$f":"IF(INTRO!$E$42=\"Endemic\",IF($J17>1,IF($J17=4,\"Unknown\",IF($J17=99,\"Surveillance\",F17)),0),\"Not required\")","v":39464},{"$f":"IF(INTRO!$E$42=\"Endemic\",IF($J17>1,IF($J17=4,\"Unknown\",IF($J17=99,\"Surveillance\",ROUND(D17*INTRO!$E$51,0))),0),\"Not required\")","v":35144},{"$f":"IF(INTRO!$E$42=\"Endemic\",IF($J17>1,IF($J17=4,\"Unknown\",IF($J17=99,\"Surveillance\",SUM($N17:$P17))),0),\"Not required\")","v":93712},{"$f":"IF(INTRO!$E$44=\"Endemic\",IF($K17>1,IF($K17=4,\"Unknown\",IF($K17=99,\"Surveillance\",ROUND(E17*0.75,0))),0),\"Not required\")","v":14328},{"$f":"IF(INTRO!$E$44=\"Endemic\",IF($K17>1,IF($K17=4,\"Unknown\",IF($K17=99,\"Surveillance\",F17)),0),\"Not required\")","v":39464},{"$f":"IF(INTRO!$E$44=\"Endemic\",IF($K17>1,IF($K17=4,\"Unknown\",IF($K17=99,\"Surveillance\",G17)),0),\"Not required\")","v":82299},{"$f":"IF(INTRO!$E$44=\"Endemic\",IF($K17>1,IF($K17=4,\"Unknown\",IF($K17=99,\"Surveillance\",SUM($R17:$T17))),0),\"Not required\")","v":136091},1,0,1,1,"MDA1 (IVM+ALB)","T2 (PZQ)",null,null,null,null,null,null,51896,"Chake Chake"]
[{"$f":"IF(INTRO!$E$34<>0,INTRO!$E$34,\"\")","v":"Zanzibar"},"Kusini Pemba","Mkoani",145594,{"$f":"IF(INTRO!$E$48=\"\",\"\",ROUND($D18*INTRO!$E$48,0))","v":19058},{"$f":"IF(INTRO!$E$49=\"\",\"\",ROUND($D18*INTRO!$E$49,0))","v":39369},{"$f":"IF(INTRO!$E$50=\"\",\"\",ROUND($D18*INTRO!$E$50,0))","v":82100},1,0,3,2,{"$f":"IF(INTRO!$E$38=\"Endemic\",IF($H18>0,IF($H18=4,\"Unknown\",IF($H18=99,\"Stopped\",$D18)),0),\"Not required\")","v":145594},{"$f":"IF(INTRO!$E$40=\"Endemic\",IF($I18>0,IF($I18=4,\"Unknown\",IF($I18=99,\"Stopped\",$D18)),0),\"Not required\")","v":"Not required"},{"$f":"IF(INTRO!$E$42=\"Endemic\",IF($J18>1,IF($J18=4,\"Unknown\",IF($J18=99,\"Surveillance\",E18)),0),\"Not required\")","v":19058},{"$f":"IF(INTRO!$E$42=\"Endemic\",IF($J18>1,IF($J18=4,\"Unknown\",IF($J18=99,\"Surveillance\",F18)),0),\"Not required\")","v":39369},{"$f":"IF(INTRO!$E$42=\"Endemic\",IF($J18>1,IF($J18=4,\"Unknown\",IF($J18=99,\"Surveillance\",ROUND(D18*INTRO!$E$51,0))),0),\"Not required\")","v":35059},{"$f":"IF(INTRO!$E$42=\"Endemic\",IF($J18>1,IF($J18=4,\"Unknown\",IF($J18=99,\"Surveillance\",SUM($N18:$P18))),0),\"Not required\")","v":93486},{"$f":"IF(INTRO!$E$44=\"Endemic\",IF($K18>1,IF($K18=4,\"Unknown\",IF($K18=99,\"Surveillance\",ROUND(E18*0.75,0))),0),\"Not required\")","v":14294},{"$f":"IF(INTRO!$E$44=\"Endemic\",IF($K18>1,IF($K18=4,\"Unknown\",IF($K18=99,\"Surveillance\",F18)),0),\"Not required\")","v":39369},{"$f":"IF(INTRO!$E$44=\"Endemic\",IF($K18>1,IF($K18=4,\"Unknown\",IF($K18=99,\"Surveillance\",G18)),0),\"Not required\")","v":82100},{"$f":"IF(INTRO!$E$44=\"Endemic\",IF($K18>1,IF($K18=4,\"Unknown\",IF($K18=99,\"Surveillance\",SUM($R18:$T18))),0),\"Not required\")","v":135763},1,0,1,1,"MDA1 (IVM+ALB)","T2 (PZQ)",null,null,null,null,null,null,51897,"Mkoani"]
[{"$f":"IF(INTRO!$E$34<>0,INTRO!$E$34,\"\")","v":"Zanzibar"},"Kaskazini Pemba","Wete",159785,{"$f":"IF(INTRO!$E$48=\"\",\"\",ROUND($D19*INTRO!$E$48,0))","v":20916},{"$f":"IF(INTRO!$E$49=\"\",\"\",ROUND($D19*INTRO!$E$49,0))","v":43206},{"$f":"IF(INTRO!$E$50=\"\",\"\",ROUND($D19*INTRO!$E$50,0))","v":90103},1,0,3,3,{"$f":"IF(INTRO!$E$38=\"Endemic\",IF($H19>0,IF($H19=4,\"Unknown\",IF($H19=99,\"Stopped\",$D19)),0),\"Not required\")","v":159785},{"$f":"IF(INTRO!$E$40=\"Endemic\",IF($I19>0,IF($I19=4,\"Unknown\",IF($I19=99,\"Stopped\",$D19)),0),\"Not required\")","v":"Not required"},{"$f":"IF(INTRO!$E$42=\"Endemic\",IF($J19>1,IF($J19=4,\"Unknown\",IF($J19=99,\"Surveillance\",E19)),0),\"Not required\")","v":20916},{"$f":"IF(INTRO!$E$42=\"Endemic\",IF($J19>1,IF($J19=4,\"Unknown\",IF($J19=99,\"Surveillance\",F19)),0),\"Not required\")","v":43206},{"$f":"IF(INTRO!$E$42=\"Endemic\",IF($J19>1,IF($J19=4,\"Unknown\",IF($J19=99,\"Surveillance\",ROUND(D19*INTRO!$E$51,0))),0),\"Not required\")","v":38476},{"$f":"IF(INTRO!$E$42=\"Endemic\",IF($J19>1,IF($J19=4,\"Unknown\",IF($J19=99,\"Surveillance\",SUM($N19:$P19))),0),\"Not required\")","v":102598},{"$f":"IF(INTRO!$E$44=\"Endemic\",IF($K19>1,IF($K19=4,\"Unknown\",IF($K19=99,\"Surveillance\",ROUND(E19*0.75,0))),0),\"Not required\")","v":15687},{"$f":"IF(INTRO!$E$44=\"Endemic\",IF($K19>1,IF($K19=4,\"Unknown\",IF($K19=99,\"Surveillance\",F19)),0),\"Not required\")","v":43206},{"$f":"IF(INTRO!$E$44=\"Endemic\",IF($K19>1,IF($K19=4,\"Unknown\",IF($K19=99,\"Surveillance\",G19)),0),\"Not required\")","v":90103},{"$f":"IF(INTRO!$E$44=\"Endemic\",IF($K19>1,IF($K19=4,\"Unknown\",IF($K19=99,\"Surveillance\",SUM($R19:$T19))),0),\"Not required\")","v":148996},1,0,1,1,"MDA1 (IVM+ALB)","T2 (PZQ)",null,null,null,null,null,null,51893,"Wete"]
[{"$f":"IF(INTRO!$E$34<>0,INTRO!$E$34,\"\")","v":"Zanzibar"},"Kaskazini Pemba","Micheweni",155543,{"$f":"IF(INTRO!$E$48=\"\",\"\",ROUND($D20*INTRO!$E$48,0))","v":20361},{"$f":"IF(INTRO!$E$49=\"\",\"\",ROUND($D20*INTRO!$E$49,0))","v":42059},{"$f":"IF(INTRO!$E$50=\"\",\"\",ROUND($D20*INTRO!$E$50,0))","v":87711},1,0,3,3,{"$f":"IF(INTRO!$E$38=\"Endemic\",IF($H20>0,IF($H20=4,\"Unknown\",IF($H20=99,\"Stopped\",$D20)),0),\"Not required\")","v":155543},{"$f":"IF(INTRO!$E$40=\"Endemic\",IF($I20>0,IF($I20=4,\"Unknown\",IF($I20=99,\"Stopped\",$D20)),0),\"Not required\")","v":"Not required"},{"$f":"IF(INTRO!$E$42=\"Endemic\",IF($J20>1,IF($J20=4,\"Unknown\",IF($J20=99,\"Surveillance\",E20)),0),\"Not required\")","v":20361},{"$f":"IF(INTRO!$E$42=\"Endemic\",IF($J20>1,IF($J20=4,\"Unknown\",IF($J20=99,\"Surveillance\",F20)),0),\"Not required\")","v":42059},{"$f":"IF(INTRO!$E$42=\"Endemic\",IF($J20>1,IF($J20=4,\"Unknown\",IF($J20=99,\"Surveillance\",ROUND(D20*INTRO!$E$51,0))),0),\"Not required\")","v":37455},{"$f":"IF(INTRO!$E$42=\"Endemic\",IF($J20>1,IF($J20=4,\"Unknown\",IF($J20=99,\"Surveillance\",SUM($N20:$P20))),0),\"Not required\")","v":99875},{"$f":"IF(INTRO!$E$44=\"Endemic\",IF($K20>1,IF($K20=4,\"Unknown\",IF($K20=99,\"Surveillance\",ROUND(E20*0.75,0))),0),\"Not required\")","v":15271},{"$f":"IF(INTRO!$E$44=\"Endemic\",IF($K20>1,IF($K20=4,\"Unknown\",IF($K20=99,\"Surveillance\",F20)),0),\"Not required\")","v":42059},{"$f":"IF(INTRO!$E$44=\"Endemic\",IF($K20>1,IF($K20=4,\"Unknown\",IF($K20=99,\"Surveillance\",G20)),0),\"Not required\")","v":87711},{"$f":"IF(INTRO!$E$44=\"Endemic\",IF($K20>1,IF($K20=4,\"Unknown\",IF($K20=99,\"Surveillance\",SUM($R20:$T20))),0),\"Not required\")","v":145041},1,0,1,1,"MDA1 (IVM+ALB)","T2 (PZQ)",null,null,null,null,null,null,51892,"Micheweni"]

{"sheet":"MDA1","index":2,"n_rows":20,"n_cols":20,"rows_kept":20,"cut":false,"hidden":false,"merged":[[3,0,3,2],[5,0,5,2],[5,5,5,8],[5,9,5,12],[5,13,5,16],[7,0,7,16],[5,3,6,3],[5,4,6,4]]}
["MDA 1 - Ivermectin (IVM) and Albendazole (ALB)"]
["Administrative structure, population requiring PC by age group, population treated by age group and coverage"]
[]
["TOTAL",null,null,null,null,null,{"$f":"SUBTOTAL(9,G$10:G$1010)","v":464440},968559,1432999,null,{"$f":"SUBTOTAL(9,K$10:K$1010)","v":476239},807977,1284216,null,{"$f":"IF(G4<>0,IF(K4/G4*100=0,\"-\",K4/G4*100),\" \")","v":102.540478856257},{"$f":"IF(H4<>0,IF(L4/H4*100=0,\"-\",L4/H4*100),\" \")","v":83.4205247176476},{"$f":"IF(I4<>0,IF(M4/I4*100=0,\"-\",M4/I4*100),\" \")","v":89.6173688886036}]
[]
["Country administrative structure",null,null,"PC implemented","Date","Population targeted for MDA 1",null,null,null,"Population treated",null,null,null,"Programme coverage (%)"]
["Country","Province/State","District",null,null,"PreSAC","SAC","Adults","Total","PreSAC","SAC","Adults","Total","PreSAC","SAC","Adults","Total"]
[]
[]
[{"$f":"IF(COUNTRY_INFO!A10=0,\" \",COUNTRY_INFO!A10)","v":"Zanzibar"},{"$f":"IF(COUNTRY_INFO!B10=0,\" \",COUNTRY_INFO!B10)","v":"Kaskazini Unguja"},{"$f":"IF(COUNTRY_INFO!C10=0,\" \",COUNTRY_INFO!C10)","v":"Kaskazini A"},{"$f":"IF(COUNTRY_INFO!$Z10=\"MDA1 (IVM+ALB)\",COUNTRY_INFO!$Z10,\" \")","v":"MDA1 (IVM+ALB)"},"March 2022",null,35795,74649,{"$f":"SUM(F10:H10)","v":110444},null,46676,73869,{"$f":"SUM(J10:L10)","v":120545},null,{"$f":"IF(G10<>0,IF(K10/G10*100=0,\"-\",K10/G10*100),\" \")","v":130.398100293337},{"$f":"IF(H10<>0,IF(L10/H10*100=0,\"-\",L10/H10*100),\" \")","v":98.9551099143994},109.145811451958,null,{"$f":"COUNTRY_INFO!F10","v":36866},{"$f":"COUNTRY_INFO!G10","v":76880}]
[{"$f":"IF(COUNTRY_INFO!A11=0,\" \",COUNTRY_INFO!A11)","v":"Zanzibar"},{"$f":"IF(COUNTRY_INFO!B11=0,\" \",COUNTRY_INFO!B11)","v":"Kaskazini Unguja"},{"$f":"IF(COUNTRY_INFO!C11=0,\" \",COUNTRY_INFO!C11)","v":"Kaskazini B"},{"$f":"IF(COUNTRY_INFO!$Z11=\"MDA1 (IVM+ALB)\",COUNTRY_INFO!$Z11,\" \")","v":"MDA1 (IVM+ALB)"},"March 2022",null,28426,59281,{"$f":"SUM(F11:H11)","v":87707},null,22057,44668,{"$f":"SUM(J11:L11)","v":66725},null,{"$f":"IF(G11<>0,IF(K11/G11*100=0,\"-\",K11/G11*100),\" \")","v":77.5944557799198},{"$f":"IF(H11<>0,IF(L11/H11*100=0,\"-\",L11/H11*100),\" \")","v":75.3496061132572},{"$f":"IF(I11<>0,IF(M11/I11*100=0,\"-\",M11/I11*100),\" \")","v":76.0771660186758},null,{"$f":"COUNTRY_INFO!F11","v":29276},{"$f":"COUNTRY_INFO!G11","v":61053}]
[{"$f":"IF(COUNTRY_INFO!A12=0,\" \",COUNTRY_INFO!A12)","v":"Zanzibar"},{"$f":"IF(COUNTRY_INFO!B12=0,\" \",COUNTRY_INFO!B12)","v":"Kusini Unguja"},{"$f":"IF(COUNTRY_INFO!C12=0,\" \",COUNTRY_INFO!C12)","v":"Kusini"},{"$f":"IF(COUNTRY_INFO!$Z12=\"MDA1 (IVM+ALB)\",COUNTRY_INFO!$Z12,\" \")","v":"MDA1 (IVM+ALB)"},"March 2022",null,13211,27550,40761,null,13876,23863,37739,null,105.033684051169,86.6170598911071,92.5860503913054,null,{"$f":"COUNTRY_INFO!F12","v":13606},{"$f":"COUNTRY_INFO!G12","v":28374}]
[{"$f":"IF(COUNTRY_INFO!A13=0,\" \",COUNTRY_INFO!A13)","v":"Zanzibar"},{"$f":"IF(COUNTRY_INFO!B13=0,\" \",COUNTRY_INFO!B13)","v":"Kusini Unguja"},{"$f":"IF(COUNTRY_INFO!C13=0,\" \",COUNTRY_INFO!C13)","v":"Kati"},{"$f":"IF(COUNTRY_INFO!$Z13=\"MDA1 (IVM+ALB)\",COUNTRY_INFO!$Z13,\" \")","v":"MDA1 (IVM+ALB)"},"March 2022",null,24867,51858,76725,null,33243,44828,78071,null,133.683194595247,86.4437502410428,101.754317367221,null,{"$f":"COUNTRY_INFO!F13","v":25611},{"$f":"COUNTRY_INFO!G13","v":53409}]
[{"$f":"IF(COUNTRY_INFO!A14=0,\" \",COUNTRY_INFO!A14)","v":"Zanzibar"},{"$f":"IF(COUNTRY_INFO!B14=0,\" \",COUNTRY_INFO!B14)","v":"Mjini Magharibi"},{"$f":"IF(COUNTRY_INFO!C14=0,\" \",COUNTRY_INFO!C14)","v":"Mjini"},{"$f":"IF(COUNTRY_INFO!$Z14=\"MDA1 (IVM+ALB)\",COUNTRY_INFO!$Z14,\" \")","v":"MDA1 (IVM+ALB)"},"March 2022",null,77427,161469,238896,null,48753,120719,169472,null,62.9664070673021,74.7629575955756,70.9396557497823,null,{"$f":"COUNTRY_INFO!F14","v":79743},{"$f":"COUNTRY_INFO!G14","v":166297}]
[{"$f":"IF(COUNTRY_INFO!A15=0,\" \",COUNTRY_INFO!A15)","v":"Zanzibar"},{"$f":"IF(COUNTRY_INFO!B15=0,\" \",COUNTRY_INFO!B15)","v":"Mjini Magharibi"},{"$f":"IF(COUNTRY_INFO!C15=0,\" \",COUNTRY_INFO!C15)","v":"Magharibi A"},{"$f":"IF(COUNTRY_INFO!$Z15=\"MDA1 (IVM+ALB)\",COUNTRY_INFO!$Z15,\" \")","v":"MDA1 (IVM+ALB)"},"March 2022",null,54648,113965,168613,null,95355,132352,227707,null,174.489459815547,116.133900759005,135.047119735726,null,{"$f":"COUNTRY_INFO!F15","v":56282},{"$f":"COUNTRY_INFO!G15","v":117372}]
[{"$f":"IF(COUNTRY_INFO!A16=0,\" \",COUNTRY_INFO!A16)","v":"Zanzibar"},{"$f":"IF(COUNTRY_INFO!B16=0,\" \",COUNTRY_INFO!B16)","v":"Mjini Magharibi"},{"$f":"IF(COUNTRY_INFO!C16=0,\" \",COUNTRY_INFO!C16)","v":"Magharibi B"},{"$f":"IF(COUNTRY_INFO!$Z16=\"MDA1 (IVM+ALB)\",COUNTRY_INFO!$Z16,\" \")","v":"MDA1 (IVM+ALB)"},"March 2022",null,70733,147509,218242,null,82499,133269,215768,null,116.634385647435,90.3463517480289,98.8663960190981,null,{"$f":"COUNTRY_INFO!F16","v":72848},{"$f":"COUNTRY_INFO!G16","v":151920}]
[{"$f":"IF(COUNTRY_INFO!A17=0,\" \",COUNTRY_INFO!A17)","v":"Zanzibar"},{"$f":"IF(COUNTRY_INFO!B17=0,\" \",COUNTRY_INFO!B17)","v":"Kusini Pemba"},{"$f":"IF(COUNTRY_INFO!C17=0,\" \",COUNTRY_INFO!C17)","v":"Chake chake"},{"$f":"IF(COUNTRY_INFO!$Z17=\"MDA1 (IVM+ALB)\",COUNTRY_INFO!$Z17,\" \")","v":"MDA1 (IVM+ALB)"},"March 2022",null,38318,79910,118228,null,28996,59507,88503,null,75.6720079336082,74.4675259667126,74.8579016814968,null,{"$f":"COUNTRY_INFO!F17","v":39464},{"$f":"COUNTRY_INFO!G17","v":82299}]
[{"$f":"IF(COUNTRY_INFO!A18=0,\" \",COUNTRY_INFO!A18)","v":"Zanzibar"},{"$f":"IF(COUNTRY_INFO!B18=0,\" \",COUNTRY_INFO!B18)","v":"Kusini Pemba"},{"$f":"IF(COUNTRY_INFO!C18=0,\" \",COUNTRY_INFO!C18)","v":"Mkoani"},{"$f":"IF(COUNTRY_INFO!$Z18=\"MDA1 (IVM+ALB)\",COUNTRY_INFO!$Z18,\" \")","v":"MDA1 (IVM+ALB)"},"March 2022",null,38226,79717,117943,null,35547,56168,91715,null,92.9916810547795,70.4592495954439,77.762139338494,null,{"$f":"COUNTRY_INFO!F18","v":39369},{"$f":"COUNTRY_INFO!G18","v":82100}]
[{"$f":"IF(COUNTRY_INFO!A19=0,\" \",COUNTRY_INFO!A19)","v":"Zanzibar"},{"$f":"IF(COUNTRY_INFO!B19=0,\" \",COUNTRY_INFO!B19)","v":"Kaskazini Pemba"},{"$f":"IF(COUNTRY_INFO!C19=0,\" \",COUNTRY_INFO!C19)","v":"Wete"},{"$f":"IF(COUNTRY_INFO!$Z19=\"MDA1 (IVM+ALB)\",COUNTRY_INFO!$Z19,\" \")","v":"MDA1 (IVM+ALB)"},"March 2022",null,40838,85164,126002,null,36500,62091,98591,null,89.3775405259807,72.9075665774271,78.245583403438,null,{"$f":"COUNTRY_INFO!F19","v":43206},{"$f":"COUNTRY_INFO!G19","v":90103}]
[{"$f":"IF(COUNTRY_INFO!A20=0,\" \",COUNTRY_INFO!A20)","v":"Zanzibar"},{"$f":"IF(COUNTRY_INFO!B20=0,\" \",COUNTRY_INFO!B20)","v":"Kaskazini Pemba"},{"$f":"IF(COUNTRY_INFO!C20=0,\" \",COUNTRY_INFO!C20)","v":"Micheweni"},{"$f":"IF(COUNTRY_INFO!$Z20=\"MDA1 (IVM+ALB)\",COUNTRY_INFO!$Z20,\" \")","v":"MDA1 (IVM+ALB)"},"March 2022",null,41951,87487,129438,null,32737,56643,89380,null,78.0362804223976,64.7444763221964,69.0523648387645,null,{"$f":"COUNTRY_INFO!F20","v":42059},{"$f":"COUNTRY_INFO!G20","v":87711}]

{"sheet":"MDA2","index":3,"n_rows":20,"n_cols":17,"rows_kept":20,"cut":false,"hidden":true,"merged":[[3,0,3,2],[5,0,5,2],[5,5,5,8],[5,9,5,12],[5,13,5,16],[7,0,7,16],[5,3,6,3],[5,4,6,4]]}
["MDA 2 - Diethylcarbamazine citrate (DEC) + Albendazole (ALB)"]
["Administrative structure, population requiring PC by age group, population treated by age group and coverage"]
[]
["TOTAL",null,null,null,null,{"$f":"SUBTOTAL(9,F$10:F$1010)","v":0},0,0,0,0,0,0,0,{"$f":"IF(F4<>0,IF(J4/F4*100=0,\"-\",J4/F4*100),\" \")","v":" "},{"$f":"IF(G4<>0,IF(K4/G4*100=0,\"-\",K4/G4*100),\" \")","v":" "},{"$f":"IF(H4<>0,IF(L4/H4*100=0,\"-\",L4/H4*100),\" \")","v":" "},{"$f":"IF(I4<>0,IF(M4/I4*100=0,\"-\",M4/I4*100),\" \")","v":" "}]
[]
["Country administrative structure",null,null,"PC implemented","Date","Population targeted for MDA 2",null,null,null,"Population treated",null,null,null,"Programme coverage (%)"]
["Country","Province/State","District",null,null,"PreSAC","SAC","Adults","Total","PreSAC","SAC","Adults","Total","PreSAC","SAC","Adults","Total"]
[]
[]
[{"$f":"IF(COUNTRY_INFO!A10=0,\" \",COUNTRY_INFO!A10)","v":"Zanzibar"},{"$f":"IF(COUNTRY_INFO!B10=0,\" \",COUNTRY_INFO!B10)","v":"Kaskazini Unguja"},{"$f":"IF(COUNTRY_INFO!C10=0,\" \",COUNTRY_INFO!C10)","v":"Kaskazini A"},{"$f":"IF(COUNTRY_INFO!$Z10=\"MDA2 (DEC+ALB)\",COUNTRY_INFO!$Z10,\" \")","v":" "},null,null,null,null,{"$f":"SUM(F10:H10)","v":0},null,null,null,{"$f":"SUM(J10:L10)","v":0},{"$f":"IF(F10<>0,IF(J10/F10*100=0,\"-\",J10/F10*100),\" \")","v":" "},{"$f":"IF(G10<>0,IF(K10/G10*100=0,\"-\",K10/G10*100),\" \")","v":" "}," "," "]
[{"$f":"IF(COUNTRY_INFO!A11=0,\" \",COUNTRY_INFO!A11)","v":"Zanzibar"},{"$f":"IF(COUNTRY_INFO!B11=0,\" \",COUNTRY_INFO!B11)","v":"Kaskazini Unguja"},{"$f":"IF(COUNTRY_INFO!C11=0,\" \",COUNTRY_INFO!C11)","v":"Kaskazini B"},{"$f":"IF(COUNTRY_INFO!$Z11=\"MDA2 (DEC+ALB)\",COUNTRY_INFO!$Z11,\" \")","v":" "},null,null,null,null,{"$f":"SUM(F11:H11)","v":0},null,null,null,{"$f":"SUM(J11:L11)","v":0},{"$f":"IF(F11<>0,IF(J11/F11*100=0,\"-\",J11/F11*100),\" \")","v":" "},{"$f":"IF(G11<>0,IF(K11/G11*100=0,\"-\",K11/G11*100),\" \")","v":" "},{"$f":"IF(H11<>0,IF(L11/H11*100=0,\"-\",L11/H11*100),\" \")","v":" "},{"$f":"IF(I11<>0,IF(M11/I11*100=0,\"-\",M11/I11*100),\" \")","v":" "}]
[{"$f":"IF(COUNTRY_INFO!A12=0,\" \",COUNTRY_INFO!A12)","v":"Zanzibar"},{"$f":"IF(COUNTRY_INFO!B12=0,\" \",COUNTRY_INFO!B12)","v":"Kusini Unguja"},{"$f":"IF(COUNTRY_INFO!C12=0,\" \",COUNTRY_INFO!C12)","v":"Kusini"},{"$f":"IF(COUNTRY_INFO!$Z12=\"MDA2 (DEC+ALB)\",COUNTRY_INFO!$Z12,\" \")","v":" "},null,null,null,null,0,null,null,null,0," "," "," "," "]
[{"$f":"IF(COUNTRY_INFO!A13=0,\" \",COUNTRY_INFO!A13)","v":"Zanzibar"},{"$f":"IF(COUNTRY_INFO!B13=0,\" \",COUNTRY_INFO!B13)","v":"Kusini Unguja"},{"$f":"IF(COUNTRY_INFO!C13=0,\" \",COUNTRY_INFO!C13)","v":"Kati"},{"$f":"IF(COUNTRY_INFO!$Z13=\"MDA2 (DEC+ALB)\",COUNTRY_INFO!$Z13,\" \")","v":" "},null,null,null,null,0,null,null,null,0," "," "," "," "]
[{"$f":"IF(COUNTRY_INFO!A14=0,\" \",COUNTRY_INFO!A14)","v":"Zanzibar"},{"$f":"IF(COUNTRY_INFO!B14=0,\" \",COUNTRY_INFO!B14)","v":"Mjini Magharibi"},{"$f":"IF(COUNTRY_INFO!C14=0,\" \",COUNTRY_INFO!C14)","v":"Mjini"},{"$f":"IF(COUNTRY_INFO!$Z14=\"MDA2 (DEC+ALB)\",COUNTRY_INFO!$Z14,\" \")","v":" "},null,null,null,null,0,null,null,null,0," "," "," "," "]
[{"$f":"IF(COUNTRY_INFO!A15=0,\" \",COUNTRY_INFO!A15)","v":"Zanzibar"},{"$f":"IF(COUNTRY_INFO!B15=0,\" \",COUNTRY_INFO!B15)","v":"Mjini Magharibi"},{"$f":"IF(COUNTRY_INFO!C15=0,\" \",COUNTRY_INFO!C15)","v":"Magharibi A"},{"$f":"IF(COUNTRY_INFO!$Z15=\"MDA2 (DEC+ALB)\",COUNTRY_INFO!$Z15,\" \")","v":" "},null,null,null,null,0,null,null,null,0," "," "," "," "]
[{"$f":"IF(COUNTRY_INFO!A16=0,\" \",COUNTRY_INFO!A16)","v":"Zanzibar"},{"$f":"IF(COUNTRY_INFO!B16=0,\" \",COUNTRY_INFO!B16)","v":"Mjini Magharibi"},{"$f":"IF(COUNTRY_INFO!C16=0,\" \",COUNTRY_INFO!C16)","v":"Magharibi B"},{"$f":"IF(COUNTRY_INFO!$Z16=\"MDA2 (DEC+ALB)\",COUNTRY_INFO!$Z16,\" \")","v":" "},null,null,null,null,0,null,null,null,0," "," "," "," "]
[{"$f":"IF(COUNTRY_INFO!A17=0,\" \",COUNTRY_INFO!A17)","v":"Zanzibar"},{"$f":"IF(COUNTRY_INFO!B17=0,\" \",COUNTRY_INFO!B17)","v":"Kusini Pemba"},{"$f":"IF(COUNTRY_INFO!C17=0,\" \",COUNTRY_INFO!C17)","v":"Chake chake"},{"$f":"IF(COUNTRY_INFO!$Z17=\"MDA2 (DEC+ALB)\",COUNTRY_INFO!$Z17,\" \")","v":" "},null,null,null,null,0,null,null,null,0," "," "," "," "]
[{"$f":"IF(COUNTRY_INFO!A18=0,\" \",COUNTRY_INFO!A18)","v":"Zanzibar"},{"$f":"IF(COUNTRY_INFO!B18=0,\" \",COUNTRY_INFO!B18)","v":"Kusini Pemba"},{"$f":"IF(COUNTRY_INFO!C18=0,\" \",COUNTRY_INFO!C18)","v":"Mkoani"},{"$f":"IF(COUNTRY_INFO!$Z18=\"MDA2 (DEC+ALB)\",COUNTRY_INFO!$Z18,\" \")","v":" "},null,null,null,null,0,null,null,null,0," "," "," "," "]
[{"$f":"IF(COUNTRY_INFO!A19=0,\" \",COUNTRY_INFO!A19)","v":"Zanzibar"},{"$f":"IF(COUNTRY_INFO!B19=0,\" \",COUNTRY_INFO!B19)","v":"Kaskazini Pemba"},{"$f":"IF(COUNTRY_INFO!C19=0,\" \",COUNTRY_INFO!C19)","v":"Wete"},{"$f":"IF(COUNTRY_INFO!$Z19=\"MDA2 (DEC+ALB)\",COUNTRY_INFO!$Z19,\" \")","v":" "},null,null,null,null,0,null,null,null,0," "," "," "," "]
[{"$f":"IF(COUNTRY_INFO!A20=0,\" \",COUNTRY_INFO!A20)","v":"Zanzibar"},{"$f":"IF(COUNTRY_INFO!B20=0,\" \",COUNTRY_INFO!B20)","v":"Kaskazini Pemba"},{"$f":"IF(COUNTRY_INFO!C20=0,\" \",COUNTRY_INFO!C20)","v":"Micheweni"},{"$f":"IF(COUNTRY_INFO!$Z20=\"MDA2 (DEC+ALB)\",COUNTRY_INFO!$Z20,\" \")","v":" "},null,null,null,null,0,null,null,null,0," "," "," "," "]

{"sheet":"MDA3","index":4,"n_rows":20,"n_cols":20,"rows_kept":20,"cut":false,"hidden":true,"merged":[[3,0,3,2],[5,0,5,2],[5,5,5,7],[5,8,5,10],[5,11,5,13],[5,14,5,16],[5,17,5,19],[5,3,6,3],[5,4,6,4]]}
["MDA 3 - Ivermectin (IVM) "]
["Administrative structure, population requiring PC by age group, population treated by age group and coverage"]
[]
["TOTAL",null,null,null,null,{"$f":"SUBTOTAL(9,F$10:F$1010)","v":0},0,0,0,0,0,0,0,0,0,0,0,{"$f":"IF(F4<>0,IF(O4/F4*100=0,\"-\",O4/F4*100),\" \")","v":" "},{"$f":"IF(G4<>0,IF(P4/G4*100=0,\"-\",P4/G4*100),\" \")","v":" "},{"$f":"IF(H4<>0,IF(Q4/H4*100=0,\"-\",Q4/H4*100),\" \")","v":" "}]
[]
["Country administrative structure",null,null,"PC implemented","Date","Population targeted for MDA 3",null,null,"Population treated - 1st round",null,null,"Population treated - 2nd round",null,null,"Population treated",null,null,"Programme coverage (%)"]
["Country","Province/State","District",null,null,"SAC","Adults","Total","SAC","Adults","Total","SAC","Adults","Total","SAC","Adults","Total","SAC","Adults","Total"]
[]
[]
[{"$f":"IF(COUNTRY_INFO!A10=0,\" \",COUNTRY_INFO!A10)","v":"Zanzibar"},{"$f":"IF(COUNTRY_INFO!B10=0,\" \",COUNTRY_INFO!B10)","v":"Kaskazini Unguja"},{"$f":"IF(COUNTRY_INFO!C10=0,\" \",COUNTRY_INFO!C10)","v":"Kaskazini A"},{"$f":"IF(COUNTRY_INFO!$Z10=\"MDA3 (IVM)\",COUNTRY_INFO!$Z10,\" \")","v":" "},null,null,null,{"$f":"SUM(F10:G10)","v":0},null,null,{"$f":"SUM(I10:J10)","v":0},null,null,{"$f":"SUM(L10:M10)","v":0},{"$f":"MAX(I10,L10)","v":0},0,{"$f":"SUM(O10:P10)","v":0},{"$f":"IF(F10<>0,IF(MAX(I10,L10)/F10*100=0,\"-\",MAX(I10,L10)/F10*100),\" \")","v":" "}," ",{"$f":"IF(H10<>0,IF((MAX(I10,L10)+MAX(J10,M10))/H10*100=0,\"-\",(MAX(I10,L10)+MAX(J10,M10))/H10*100),\" \")","v":" "}]
[{"$f":"IF(COUNTRY_INFO!A11=0,\" \",COUNTRY_INFO!A11)","v":"Zanzibar"},{"$f":"IF(COUNTRY_INFO!B11=0,\" \",COUNTRY_INFO!B11)","v":"Kaskazini Unguja"},{"$f":"IF(COUNTRY_INFO!C11=0,\" \",COUNTRY_INFO!C11)","v":"Kaskazini B"},{"$f":"IF(COUNTRY_INFO!$Z11=\"MDA3 (IVM)\",COUNTRY_INFO!$Z11,\" \")","v":" "},null,null,null,{"$f":"SUM(F11:G11)","v":0},null,null,{"$f":"SUM(I11:J11)","v":0},null,null,{"$f":"SUM(L11:M11)","v":0},{"$f":"MAX(I11,L11)","v":0},{"$f":"MAX(J11,M11)","v":0},{"$f":"SUM(O11:P11)","v":0},{"$f":"IF(F11<>0,IF(MAX(I11,L11)/F11*100=0,\"-\",MAX(I11,L11)/F11*100),\" \")","v":" "},{"$f":"IF(G11<>0,IF(MAX(J11,M11)/G11*100=0,\"-\",MAX(J11,M11)/G11*100),\" \")","v":" "},{"$f":"IF(H11<>0,IF((MAX(I11,L11)+MAX(J11,M11))/H11*100=0,\"-\",(MAX(I11,L11)+MAX(J11,M11))/H11*100),\" \")","v":" "}]
[{"$f":"IF(COUNTRY_INFO!A12=0,\" \",COUNTRY_INFO!A12)","v":"Zanzibar"},{"$f":"IF(COUNTRY_INFO!B12=0,\" \",COUNTRY_INFO!B12)","v":"Kusini Unguja"},{"$f":"IF(COUNTRY_INFO!C12=0,\" \",COUNTRY_INFO!C12)","v":"Kusini"},{"$f":"IF(COUNTRY_INFO!$Z12=\"MDA3 (IVM)\",COUNTRY_INFO!$Z12,\" \")","v":" "},null,null,null,0,null,null,0,null,null,0,0,0,0," "," "," "]
[{"$f":"IF(COUNTRY_INFO!A13=0,\" \",COUNTRY_INFO!A13)","v":"Zanzibar"},{"$f":"IF(COUNTRY_INFO!B13=0,\" \",COUNTRY_INFO!B13)","v":"Kusini Unguja"},{"$f":"IF(COUNTRY_INFO!C13=0,\" \",COUNTRY_INFO!C13)","v":"Kati"},{"$f":"IF(COUNTRY_INFO!$Z13=\"MDA3 (IVM)\",COUNTRY_INFO!$Z13,\" \")","v":" "},null,null,null,0,null,null,0,null,null,0,0,0,0," "," "," "]
[{"$f":"IF(COUNTRY_INFO!A14=0,\" \",COUNTRY_INFO!A14)","v":"Zanzibar"},{"$f":"IF(COUNTRY_INFO!B14=0,\" \",COUNTRY_INFO!B14)","v":"Mjini Magharibi"},{"$f":"IF(COUNTRY_INFO!C14=0,\" \",COUNTRY_INFO!C14)","v":"Mjini"},{"$f":"IF(COUNTRY_INFO!$Z14=\"MDA3 (IVM)\",COUNTRY_INFO!$Z14,\" \")","v":" "},null,null,null,0,null,null,0,null,null,0,0,0,0," "," "," "]
[{"$f":"IF(COUNTRY_INFO!A15=0,\" \",COUNTRY_INFO!A15)","v":"Zanzibar"},{"$f":"IF(COUNTRY_INFO!B15=0,\" \",COUNTRY_INFO!B15)","v":"Mjini Magharibi"},{"$f":"IF(COUNTRY_INFO!C15=0,\" \",COUNTRY_INFO!C15)","v":"Magharibi A"},{"$f":"IF(COUNTRY_INFO!$Z15=\"MDA3 (IVM)\",COUNTRY_INFO!$Z15,\" \")","v":" "},null,null,null,0,null,null,0,null,null,0,0,0,0," "," "," "]
[{"$f":"IF(COUNTRY_INFO!A16=0,\" \",COUNTRY_INFO!A16)","v":"Zanzibar"},{"$f":"IF(COUNTRY_INFO!B16=0,\" \",COUNTRY_INFO!B16)","v":"Mjini Magharibi"},{"$f":"IF(COUNTRY_INFO!C16=0,\" \",COUNTRY_INFO!C16)","v":"Magharibi B"},{"$f":"IF(COUNTRY_INFO!$Z16=\"MDA3 (IVM)\",COUNTRY_INFO!$Z16,\" \")","v":" "},null,null,null,0,null,null,0,null,null,0,0,0,0," "," "," "]
[{"$f":"IF(COUNTRY_INFO!A17=0,\" \",COUNTRY_INFO!A17)","v":"Zanzibar"},{"$f":"IF(COUNTRY_INFO!B17=0,\" \",COUNTRY_INFO!B17)","v":"Kusini Pemba"},{"$f":"IF(COUNTRY_INFO!C17=0,\" \",COUNTRY_INFO!C17)","v":"Chake chake"},{"$f":"IF(COUNTRY_INFO!$Z17=\"MDA3 (IVM)\",COUNTRY_INFO!$Z17,\" \")","v":" "},null,null,null,0,null,null,0,null,null,0,0,0,0," "," "," "]
[{"$f":"IF(COUNTRY_INFO!A18=0,\" \",COUNTRY_INFO!A18)","v":"Zanzibar"},{"$f":"IF(COUNTRY_INFO!B18=0,\" \",COUNTRY_INFO!B18)","v":"Kusini Pemba"},{"$f":"IF(COUNTRY_INFO!C18=0,\" \",COUNTRY_INFO!C18)","v":"Mkoani"},{"$f":"IF(COUNTRY_INFO!$Z18=\"MDA3 (IVM)\",COUNTRY_INFO!$Z18,\" \")","v":" "},null,null,null,0,null,null,0,null,null,0,0,0,0," "," "," "]
[{"$f":"IF(COUNTRY_INFO!A19=0,\" \",COUNTRY_INFO!A19)","v":"Zanzibar"},{"$f":"IF(COUNTRY_INFO!B19=0,\" \",COUNTRY_INFO!B19)","v":"Kaskazini Pemba"},{"$f":"IF(COUNTRY_INFO!C19=0,\" \",COUNTRY_INFO!C19)","v":"Wete"},{"$f":"IF(COUNTRY_INFO!$Z19=\"MDA3 (IVM)\",COUNTRY_INFO!$Z19,\" \")","v":" "},null,null,null,0,null,null,0,null,null,0,0,0,0," "," "," "]
[{"$f":"IF(COUNTRY_INFO!A20=0,\" \",COUNTRY_INFO!A20)","v":"Zanzibar"},{"$f":"IF(COUNTRY_INFO!B20=0,\" \",COUNTRY_INFO!B20)","v":"Kaskazini Pemba"},{"$f":"IF(COUNTRY_INFO!C20=0,\" \",COUNTRY_INFO!C20)","v":"Micheweni"},{"$f":"IF(COUNTRY_INFO!$Z20=\"MDA3 (IVM)\",COUNTRY_INFO!$Z20,\" \")","v":" "},null,null,null,0,null,null,0,null,null,0,0,0,0," "," "," "]

{"sheet":"MDA5","index":5,"n_rows":20,"n_cols":17,"rows_kept":20,"cut":false,"hidden":true,"merged":[[3,0,3,2],[5,0,5,2],[5,5,5,8],[5,9,5,12],[5,13,5,16],[5,3,6,3],[5,4,6,4]]}
["MDA 5 - Ivermectin (IVM) + Diethylcarbamazine citrate (DEC) + Albendazole (ALB)"]
["Administrative structure, population requiring PC by age group, population treated by age group and coverage"]
[]
["TOTAL",null,null,null,null,{"$f":"SUBTOTAL(9,F$10:F$1010)","v":0},0,0,0,0,0,0,0,{"$f":"IF(F4<>0,IF(J4/F4*100=0,\"-\",J4/F4*100),\" \")","v":" "},{"$f":"IF(G4<>0,IF(K4/G4*100=0,\"-\",K4/G4*100),\" \")","v":" "},{"$f":"IF(H4<>0,IF(L4/H4*100=0,\"-\",L4/H4*100),\" \")","v":" "},{"$f":"IF(I4<>0,IF(M4/I4*100=0,\"-\",M4/I4*100),\" \")","v":" "}]
[]
["Country administrative structure",null,null,"PC implemented","Date","Population targeted for MDA 5",null,null,null,"Population treated",null,null,null,"Programme coverage (%)"]
["Country","Province/State","District",null,null,"PreSAC","SAC","Adults","Total","PreSAC","SAC","Adults","Total","PreSAC","SAC","Adults","Total"]
[]
[]
[{"$f":"IF(COUNTRY_INFO!A10=0,\" \",COUNTRY_INFO!A10)","v":"Zanzibar"},{"$f":"IF(COUNTRY_INFO!B10=0,\" \",COUNTRY_INFO!B10)","v":"Kaskazini Unguja"},{"$f":"IF(COUNTRY_INFO!C10=0,\" \",COUNTRY_INFO!C10)","v":"Kaskazini A"},{"$f":"IF(COUNTRY_INFO!$Z10=\"MDA5 (IDA)\",COUNTRY_INFO!$Z10,\" \")","v":" "},null,null,null,null,{"$f":"SUM(F10:H10)","v":0},null,null,null,{"$f":"SUM(J10:L10)","v":0},{"$f":"IF(F10<>0,IF(J10/F10*100=0,\"-\",J10/F10*100),\" \")","v":" "},{"$f":"IF(G10<>0,IF(K10/G10*100=0,\"-\",K10/G10*100),\" \")","v":" "}," "," "]
[{"$f":"IF(COUNTRY_INFO!A11=0,\" \",COUNTRY_INFO!A11)","v":"Zanzibar"},{"$f":"IF(COUNTRY_INFO!B11=0,\" \",COUNTRY_INFO!B11)","v":"Kaskazini Unguja"},{"$f":"IF(COUNTRY_INFO!C11=0,\" \",COUNTRY_INFO!C11)","v":"Kaskazini B"},{"$f":"IF(COUNTRY_INFO!$Z11=\"MDA5 (IDA)\",COUNTRY_INFO!$Z11,\" \")","v":" "},null,null,null,null,{"$f":"SUM(F11:H11)","v":0},null,null,null,{"$f":"SUM(J11:L11)","v":0},{"$f":"IF(F11<>0,IF(J11/F11*100=0,\"-\",J11/F11*100),\" \")","v":" "},{"$f":"IF(G11<>0,IF(K11/G11*100=0,\"-\",K11/G11*100),\" \")","v":" "},{"$f":"IF(H11<>0,IF(L11/H11*100=0,\"-\",L11/H11*100),\" \")","v":" "},{"$f":"IF(I11<>0,IF(M11/I11*100=0,\"-\",M11/I11*100),\" \")","v":" "}]
[{"$f":"IF(COUNTRY_INFO!A12=0,\" \",COUNTRY_INFO!A12)","v":"Zanzibar"},{"$f":"IF(COUNTRY_INFO!B12=0,\" \",COUNTRY_INFO!B12)","v":"Kusini Unguja"},{"$f":"IF(COUNTRY_INFO!C12=0,\" \",COUNTRY_INFO!C12)","v":"Kusini"},{"$f":"IF(COUNTRY_INFO!$Z12=\"MDA5 (IDA)\",COUNTRY_INFO!$Z12,\" \")","v":" "},null,null,null,null,0,null,null,null,0," "," "," "," "]
[{"$f":"IF(COUNTRY_INFO!A13=0,\" \",COUNTRY_INFO!A13)","v":"Zanzibar"},{"$f":"IF(COUNTRY_INFO!B13=0,\" \",COUNTRY_INFO!B13)","v":"Kusini Unguja"},{"$f":"IF(COUNTRY_INFO!C13=0,\" \",COUNTRY_INFO!C13)","v":"Kati"},{"$f":"IF(COUNTRY_INFO!$Z13=\"MDA5 (IDA)\",COUNTRY_INFO!$Z13,\" \")","v":" "},null,null,null,null,0,null,null,null,0," "," "," "," "]
[{"$f":"IF(COUNTRY_INFO!A14=0,\" \",COUNTRY_INFO!A14)","v":"Zanzibar"},{"$f":"IF(COUNTRY_INFO!B14=0,\" \",COUNTRY_INFO!B14)","v":"Mjini Magharibi"},{"$f":"IF(COUNTRY_INFO!C14=0,\" \",COUNTRY_INFO!C14)","v":"Mjini"},{"$f":"IF(COUNTRY_INFO!$Z14=\"MDA5 (IDA)\",COUNTRY_INFO!$Z14,\" \")","v":" "},null,null,null,null,0,null,null,null,0," "," "," "," "]
[{"$f":"IF(COUNTRY_INFO!A15=0,\" \",COUNTRY_INFO!A15)","v":"Zanzibar"},{"$f":"IF(COUNTRY_INFO!B15=0,\" \",COUNTRY_INFO!B15)","v":"Mjini Magharibi"},{"$f":"IF(COUNTRY_INFO!C15=0,\" \",COUNTRY_INFO!C15)","v":"Magharibi A"},{"$f":"IF(COUNTRY_INFO!$Z15=\"MDA5 (IDA)\",COUNTRY_INFO!$Z15,\" \")","v":" "},null,null,null,null,0,null,null,null,0," "," "," "," "]
[{"$f":"IF(COUNTRY_INFO!A16=0,\" \",COUNTRY_INFO!A16)","v":"Zanzibar"},{"$f":"IF(COUNTRY_INFO!B16=0,\" \",COUNTRY_INFO!B16)","v":"Mjini Magharibi"},{"$f":"IF(COUNTRY_INFO!C16=0,\" \",COUNTRY_INFO!C16)","v":"Magharibi B"},{"$f":"IF(COUNTRY_INFO!$Z16=\"MDA5 (IDA)\",COUNTRY_INFO!$Z16,\" \")","v":" "},null,null,null,null,0,null,null,null,0," "," "," "," "]
[{"$f":"IF(COUNTRY_INFO!A17=0,\" \",COUNTRY_INFO!A17)","v":"Zanzibar"},{"$f":"IF(COUNTRY_INFO!B17=0,\" \",COUNTRY_INFO!B17)","v":"Kusini Pemba"},{"$f":"IF(COUNTRY_INFO!C17=0,\" \",COUNTRY_INFO!C17)","v":"Chake chake"},{"$f":"IF(COUNTRY_INFO!$Z17=\"MDA5 (IDA)\",COUNTRY_INFO!$Z17,\" \")","v":" "},null,null,null,null,0,null,null,null,0," "," "," "," "]
[{"$f":"IF(COUNTRY_INFO!A18=0,\" \",COUNTRY_INFO!A18)","v":"Zanzibar"},{"$f":"IF(COUNTRY_INFO!B18=0,\" \",COUNTRY_INFO!B18)","v":"Kusini Pemba"},{"$f":"IF(COUNTRY_INFO!C18=0,\" \",COUNTRY_INFO!C18)","v":"Mkoani"},{"$f":"IF(COUNTRY_INFO!$Z18=\"MDA5 (IDA)\",COUNTRY_INFO!$Z18,\" \")","v":" "},null,null,null,null,0,null,null,null,0," "," "," "," "]
[{"$f":"IF(COUNTRY_INFO!A19=0,\" \",COUNTRY_INFO!A19)","v":"Zanzibar"},{"$f":"IF(COUNTRY_INFO!B19=0,\" \",COUNTRY_INFO!B19)","v":"Kaskazini Pemba"},{"$f":"IF(COUNTRY_INFO!C19=0,\" \",COUNTRY_INFO!C19)","v":"Wete"},{"$f":"IF(COUNTRY_INFO!$Z19=\"MDA5 (IDA)\",COUNTRY_INFO!$Z19,\" \")","v":" "},null,null,null,null,0,null,null,null,0," "," "," "," "]
[{"$f":"IF(COUNTRY_INFO!A20=0,\" \",COUNTRY_INFO!A20)","v":"Zanzibar"},{"$f":"IF(COUNTRY_INFO!B20=0,\" \",COUNTRY_INFO!B20)","v":"Kaskazini Pemba"},{"$f":"IF(COUNTRY_INFO!C20=0,\" \",COUNTRY_INFO!C20)","v":"Micheweni"},{"$f":"IF(COUNTRY_INFO!$Z20=\"MDA5 (IDA)\",COUNTRY_INFO!$Z20,\" \")","v":" "},null,null,null,null,0,null,null,null,0," "," "," "," "]

{"sheet":"T1","index":6,"n_rows":20,"n_cols":18,"rows_kept":20,"cut":false,"hidden":false,"merged":[[3,0,3,2],[5,0,5,2],[5,6,5,9],[5,10,5,13],[5,14,5,17],[5,3,6,3],[5,4,6,4],[5,5,6,5]]}
["T 1 - Praziquantel (PZQ) and Albendazole (ALB) or Mebendazole (MBD)"]
["Administrative structure, population requiring PC by age group, population treated by age group and coverage"]
[]
["TOTAL",null,null,null,null,null,{"$f":"SUBTOTAL(9,G$10:G$1010)","v":0},0,0,0,0,0,0,0,{"$f":"IF(G4<>0,IF(K4/G4*100=0,\"-\",K4/G4*100),\" \")","v":" "},{"$f":"IF(H4<>0,IF(L4/H4*100=0,\"-\",L4/H4*100),\" \")","v":" "},{"$f":"IF(I4<>0,IF(M4/I4*100=0,\"-\",M4/I4*100),\" \")","v":" "},{"$f":"IF(J4<>0,IF(N4/J4*100=0,\"-\",N4/J4*100),\" \")","v":" "}]
[]
["Country administrative structure",null,null,"PC implemented","Medicine","Date","Population targeted for T1",null,null,null,"Population treated",null,null,null,"Programme coverage (%)"]
["Country","Province/State","District",null,null,null,"PreSAC","SAC","Adults","Total","PreSAC","SAC","Adults","Total","PreSAC","SAC","Adults","Total"]
[]
[]
[{"$f":"IF(COUNTRY_INFO!A10=0,\" \",COUNTRY_INFO!A10)","v":"Zanzibar"},{"$f":"IF(COUNTRY_INFO!B10=0,\" \",COUNTRY_INFO!B10)","v":"Kaskazini Unguja"},{"$f":"IF(COUNTRY_INFO!C10=0,\" \",COUNTRY_INFO!C10)","v":"Kaskazini A"},{"$f":"IF(OR(COUNTRY_INFO!$Z10=\"T1 (PZQ+ALB/MBD)\",COUNTRY_INFO!$AA10=\"T1 (PZQ+ALB/MBD)\"),\"T1 (PZQ+ALB/MBD)\",\" \")","v":" "},null,null,null,null,null,{"$f":"SUM(G10:I10)","v":0},null,null,null,{"$f":"SUM(K10:M10)","v":0},{"$f":"IF(G10<>0,IF(K10/G10*100=0,\"-\",K10/G10*100),\" \")","v":" "},{"$f":"IF(H10<>0,IF(L10/H10*100=0,\"-\",L10/H10*100),\" \")","v":" "},{"$f":"IF(I10<>0,IF(M10/I10*100=0,\"-\",M10/I10*100),\" \")","v":" "}," "]
[{"$f":"IF(COUNTRY_INFO!A11=0,\" \",COUNTRY_INFO!A11)","v":"Zanzibar"},{"$f":"IF(COUNTRY_INFO!B11=0,\" \",COUNTRY_INFO!B11)","v":"Kaskazini Unguja"},{"$f":"IF(COUNTRY_INFO!C11=0,\" \",COUNTRY_INFO!C11)","v":"Kaskazini B"},{"$f":"IF(OR(COUNTRY_INFO!$Z11=\"T1 (PZQ+ALB/MBD)\",COUNTRY_INFO!$AA11=\"T1 (PZQ+ALB/MBD)\"),\"T1 (PZQ+ALB/MBD)\",\" \")","v":" "},null,null,null,null,null,{"$f":"SUM(G11:I11)","v":0},null,null,null,{"$f":"SUM(K11:M11)","v":0},{"$f":"IF(G11<>0,IF(K11/G11*100=0,\"-\",K11/G11*100),\" \")","v":" "},{"$f":"IF(H11<>0,IF(L11/H11*100=0,\"-\",L11/H11*100),\" \")","v":" "},{"$f":"IF(I11<>0,IF(M11/I11*100=0,\"-\",M11/I11*100),\" \")","v":" "},{"$f":"IF(J11<>0,IF(N11/J11*100=0,\"-\",N11/J11*100),\" \")","v":" "}]
[{"$f":"IF(COUNTRY_INFO!A12=0,\" \",COUNTRY_INFO!A12)","v":"Zanzibar"},{"$f":"IF(COUNTRY_INFO!B12=0,\" \",COUNTRY_INFO!B12)","v":"Kusini Unguja"},{"$f":"IF(COUNTRY_INFO!C12=0,\" \",COUNTRY_INFO!C12)","v":"Kusini"},{"$f":"IF(OR(COUNTRY_INFO!$Z12=\"T1 (PZQ+ALB/MBD)\",COUNTRY_INFO!$AA12=\"T1 (PZQ+ALB/MBD)\"),\"T1 (PZQ+ALB/MBD)\",\" \")","v":" "},null,null,null,null,null,0,null,null,null,0," "," "," "," "]
[{"$f":"IF(COUNTRY_INFO!A13=0,\" \",COUNTRY_INFO!A13)","v":"Zanzibar"},{"$f":"IF(COUNTRY_INFO!B13=0,\" \",COUNTRY_INFO!B13)","v":"Kusini Unguja"},{"$f":"IF(COUNTRY_INFO!C13=0,\" \",COUNTRY_INFO!C13)","v":"Kati"},{"$f":"IF(OR(COUNTRY_INFO!$Z13=\"T1 (PZQ+ALB/MBD)\",COUNTRY_INFO!$AA13=\"T1 (PZQ+ALB/MBD)\"),\"T1 (PZQ+ALB/MBD)\",\" \")","v":" "},null,null,null,null,null,0,null,null,null,0," "," "," "," "]
[{"$f":"IF(COUNTRY_INFO!A14=0,\" \",COUNTRY_INFO!A14)","v":"Zanzibar"},{"$f":"IF(COUNTRY_INFO!B14=0,\" \",COUNTRY_INFO!B14)","v":"Mjini Magharibi"},{"$f":"IF(COUNTRY_INFO!C14=0,\" \",COUNTRY_INFO!C14)","v":"Mjini"},{"$f":"IF(OR(COUNTRY_INFO!$Z14=\"T1 (PZQ+ALB/MBD)\",COUNTRY_INFO!$AA14=\"T1 (PZQ+ALB/MBD)\"),\"T1 (PZQ+ALB/MBD)\",\" \")","v":" "},null,null,null,null,null,0,null,null,null,0," "," "," "," "]
[{"$f":"IF(COUNTRY_INFO!A15=0,\" \",COUNTRY_INFO!A15)","v":"Zanzibar"},{"$f":"IF(COUNTRY_INFO!B15=0,\" \",COUNTRY_INFO!B15)","v":"Mjini Magharibi"},{"$f":"IF(COUNTRY_INFO!C15=0,\" \",COUNTRY_INFO!C15)","v":"Magharibi A"},{"$f":"IF(OR(COUNTRY_INFO!$Z15=\"T1 (PZQ+ALB/MBD)\",COUNTRY_INFO!$AA15=\"T1 (PZQ+ALB/MBD)\"),\"T1 (PZQ+ALB/MBD)\",\" \")","v":" "},null,null,null,null,null,0,null,null,null,0," "," "," "," "]
[{"$f":"IF(COUNTRY_INFO!A16=0,\" \",COUNTRY_INFO!A16)","v":"Zanzibar"},{"$f":"IF(COUNTRY_INFO!B16=0,\" \",COUNTRY_INFO!B16)","v":"Mjini Magharibi"},{"$f":"IF(COUNTRY_INFO!C16=0,\" \",COUNTRY_INFO!C16)","v":"Magharibi B"},{"$f":"IF(OR(COUNTRY_INFO!$Z16=\"T1 (PZQ+ALB/MBD)\",COUNTRY_INFO!$AA16=\"T1 (PZQ+ALB/MBD)\"),\"T1 (PZQ+ALB/MBD)\",\" \")","v":" "},null,null,null,null,null,0,null,null,null,0," "," "," "," "]
[{"$f":"IF(COUNTRY_INFO!A17=0,\" \",COUNTRY_INFO!A17)","v":"Zanzibar"},{"$f":"IF(COUNTRY_INFO!B17=0,\" \",COUNTRY_INFO!B17)","v":"Kusini Pemba"},{"$f":"IF(COUNTRY_INFO!C17=0,\" \",COUNTRY_INFO!C17)","v":"Chake chake"},{"$f":"IF(OR(COUNTRY_INFO!$Z17=\"T1 (PZQ+ALB/MBD)\",COUNTRY_INFO!$AA17=\"T1 (PZQ+ALB/MBD)\"),\"T1 (PZQ+ALB/MBD)\",\" \")","v":" "},null,null,null,null,null,0,null,null,null,0," "," "," "," "]
[{"$f":"IF(COUNTRY_INFO!A18=0,\" \",COUNTRY_INFO!A18)","v":"Zanzibar"},{"$f":"IF(COUNTRY_INFO!B18=0,\" \",COUNTRY_INFO!B18)","v":"Kusini Pemba"},{"$f":"IF(COUNTRY_INFO!C18=0,\" \",COUNTRY_INFO!C18)","v":"Mkoani"},{"$f":"IF(OR(COUNTRY_INFO!$Z18=\"T1 (PZQ+ALB/MBD)\",COUNTRY_INFO!$AA18=\"T1 (PZQ+ALB/MBD)\"),\"T1 (PZQ+ALB/MBD)\",\" \")","v":" "},null,null,null,null,null,0,null,null,null,0," "," "," "," "]
[{"$f":"IF(COUNTRY_INFO!A19=0,\" \",COUNTRY_INFO!A19)","v":"Zanzibar"},{"$f":"IF(COUNTRY_INFO!B19=0,\" \",COUNTRY_INFO!B19)","v":"Kaskazini Pemba"},{"$f":"IF(COUNTRY_INFO!C19=0,\" \",COUNTRY_INFO!C19)","v":"Wete"},{"$f":"IF(OR(COUNTRY_INFO!$Z19=\"T1 (PZQ+ALB/MBD)\",COUNTRY_INFO!$AA19=\"T1 (PZQ+ALB/MBD)\"),\"T1 (PZQ+ALB/MBD)\",\" \")","v":" "},null,null,null,null,null,0,null,null,null,0," "," "," "," "]
[{"$f":"IF(COUNTRY_INFO!A20=0,\" \",COUNTRY_INFO!A20)","v":"Zanzibar"},{"$f":"IF(COUNTRY_INFO!B20=0,\" \",COUNTRY_INFO!B20)","v":"Kaskazini Pemba"},{"$f":"IF(COUNTRY_INFO!C20=0,\" \",COUNTRY_INFO!C20)","v":"Micheweni"},{"$f":"IF(OR(COUNTRY_INFO!$Z20=\"T1 (PZQ+ALB/MBD)\",COUNTRY_INFO!$AA20=\"T1 (PZQ+ALB/MBD)\"),\"T1 (PZQ+ALB/MBD)\",\" \")","v":" "},null,null,null,null,null,0,null,null,null,0," "," "," "," "]

{"sheet":"T2","index":7,"n_rows":20,"n_cols":27,"rows_kept":20,"cut":false,"hidden":false,"merged":[[3,0,3,2],[5,0,5,2],[5,5,5,8],[5,9,5,12],[5,13,5,16],[5,17,5,20],[5,21,5,24],[5,3,6,3],[5,4,6,4]]}
["T 2 - Praziquantel (PZQ) "]
["Administrative structure, population requiring PC by age group, population treated by age group and coverage"]
[]
["TOTAL",null,null,null,null,{"$f":"SUBTOTAL(9,F$10:F$1010)","v":224971},{"$f":"SUBTOTAL(9,G$10:G$1010)","v":451973},942560,1619504,{"$f":"SUBTOTAL(9,J$10:J$1010)","v":92354},408263,684472,1185089,0,0,0,0,92354,408263,684472,1185089,{"$f":"IF(F4<>0,IF(R4/F4*100=0,\"-\",R4/F4*100),\" \")","v":41.0515133061595},{"$f":"IF(G4<>0,IF(S4/G4*100=0,\"-\",S4/G4*100),\" \")","v":90.3290683293029},{"$f":"IF(H4<>0,IF(T4/H4*100=0,\"-\",T4/H4*100),\" \")","v":72.6184009506026},{"$f":"IF(I4<>0,IF(U4/I4*100=0,\"-\",U4/I4*100),\" \")","v":73.1760464932473}]
[]
["Country administrative structure",null,null,"PC implemented","Date","Population targeted for T2",null,null,null,"Population treated",null,null,null,"Population treated in HOT SPOTS",null,null,null,"Total population treated",null,null,null,"Programme coverage (%)"]
["Country","Province/State","District",null,null,"PreSAC","SAC","Adults","Total","PreSAC","SAC","Adults","Total","PreSAC","SAC","Adults","Total","PreSAC","SAC","Adults","Total","PreSAC","SAC","Adults","Total"]
[]
[]
[{"$f":"IF(COUNTRY_INFO!A10=0,\" \",COUNTRY_INFO!A10)","v":"Zanzibar"},{"$f":"IF(COUNTRY_INFO!B10=0,\" \",COUNTRY_INFO!B10)","v":"Kaskazini Unguja"},{"$f":"IF(COUNTRY_INFO!C10=0,\" \",COUNTRY_INFO!C10)","v":"Kaskazini A"},{"$f":"IF(OR(COUNTRY_INFO!$Z10=\"T2 (PZQ)\",COUNTRY_INFO!$AA10=\"T2 (PZQ)\"),\"T2 (PZQ)\",\" \")","v":"T2 (PZQ)"},"March 2022",17847,35795,74649,{"$f":"SUM(F10:H10)","v":128291},10718,46821,73886,{"$f":"SUM(J10:L10)","v":131425},null,null,null,{"$f":"SUM(N10:P10)","v":0},{"$f":"MAX(J10,N10)","v":10718},{"$f":"MAX(K10,O10)","v":46821},{"$f":"MAX(L10,P10)","v":73886},{"$f":"SUM(R10:T10)","v":131425},{"$f":"IF(F10<>0,IF(R10/F10*100=0,\"-\",R10/F10*100),\" \")","v":60.0549111895557},{"$f":"IF(G10<>0,IF(S10/G10*100=0,\"-\",S10/G10*100),\" \")","v":130.803184802347},{"$f":"IF(H10<>0,IF(T10/H10*100=0,\"-\",T10/H10*100),\" \")","v":98.9778831598548},{"$f":"IF(I10<>0,IF(U10/I10*100=0,\"-\",U10/I10*100),\" \")","v":102.44288375646},10661,{"$f":"Z10=R10","v":false}]
[{"$f":"IF(COUNTRY_INFO!A11=0,\" \",COUNTRY_INFO!A11)","v":"Zanzibar"},{"$f":"IF(COUNTRY_INFO!B11=0,\" \",COUNTRY_INFO!B11)","v":"Kaskazini Unguja"},{"$f":"IF(COUNTRY_INFO!C11=0,\" \",COUNTRY_INFO!C11)","v":"Kaskazini B"},{"$f":"IF(OR(COUNTRY_INFO!$Z11=\"T2 (PZQ)\",COUNTRY_INFO!$AA11=\"T2 (PZQ)\"),\"T2 (PZQ)\",\" \")","v":"T2 (PZQ)"},"March 2022",14172,28426,59281,{"$f":"SUM(F11:H11)","v":101879},6736,25898,47766,{"$f":"SUM(J11:L11)","v":80400},null,null,null,{"$f":"SUM(N11:P11)","v":0},{"$f":"MAX(J11,N11)","v":6736},{"$f":"MAX(K11,O11)","v":25898},{"$f":"MAX(L11,P11)","v":47766},{"$f":"SUM(R11:T11)","v":80400},{"$f":"IF(F11<>0,IF(R11/F11*100=0,\"-\",R11/F11*100),\" \")","v":47.5303415184872},{"$f":"IF(G11<>0,IF(S11/G11*100=0,\"-\",S11/G11*100),\" \")","v":91.1067332723563},{"$f":"IF(H11<>0,IF(T11/H11*100=0,\"-\",T11/H11*100),\" \")","v":80.5755638400162},{"$f":"IF(I11<>0,IF(U11/I11*100=0,\"-\",U11/I11*100),\" \")","v":78.9171468114135},5994,{"$f":"Z11=R11","v":false}]
[{"$f":"IF(COUNTRY_INFO!A12=0,\" \",COUNTRY_INFO!A12)","v":"Zanzibar"},{"$f":"IF(COUNTRY_INFO!B12=0,\" \",COUNTRY_INFO!B12)","v":"Kusini Unguja"},{"$f":"IF(COUNTRY_INFO!C12=0,\" \",COUNTRY_INFO!C12)","v":"Kusini"},{"$f":"IF(OR(COUNTRY_INFO!$Z12=\"T2 (PZQ)\",COUNTRY_INFO!$AA12=\"T2 (PZQ)\"),\"T2 (PZQ)\",\" \")","v":" "},null,null,null,null,0,0,null,null,0,null,null,null,0,0,0,0,0," "," "," "," ",2845,false]
[{"$f":"IF(COUNTRY_INFO!A13=0,\" \",COUNTRY_INFO!A13)","v":"Zanzibar"},{"$f":"IF(COUNTRY_INFO!B13=0,\" \",COUNTRY_INFO!B13)","v":"Kusini Unguja"},{"$f":"IF(COUNTRY_INFO!C13=0,\" \",COUNTRY_INFO!C13)","v":"Kati"},{"$f":"IF(OR(COUNTRY_INFO!$Z13=\"T2 (PZQ)\",COUNTRY_INFO!$AA13=\"T2 (PZQ)\"),\"T2 (PZQ)\",\" \")","v":"T2 (PZQ)"},"March 2022",12398,25611,53409,91418,7169,33284,43923,84376,null,null,null,0,7169,33284,43923,84376,57.8238425552508,129.959782905783,82.2389484918272,92.2969218315868,7161,false]
[{"$f":"IF(COUNTRY_INFO!A14=0,\" \",COUNTRY_INFO!A14)","v":"Zanzibar"},{"$f":"IF(COUNTRY_INFO!B14=0,\" \",COUNTRY_INFO!B14)","v":"Mjini Magharibi"},{"$f":"IF(COUNTRY_INFO!C14=0,\" \",COUNTRY_INFO!C14)","v":"Mjini"},{"$f":"IF(OR(COUNTRY_INFO!$Z14=\"T2 (PZQ)\",COUNTRY_INFO!$AA14=\"T2 (PZQ)\"),\"T2 (PZQ)\",\" \")","v":"T2 (PZQ)"},"March 2022",38603,77427,161469,277499,8179,35263,97367,140809,null,null,null,0,8179,35263,97367,140809,21.1874724762324,45.5435442416728,60.3007388415114,50.74216483663,11150,false]
[{"$f":"IF(COUNTRY_INFO!A15=0,\" \",COUNTRY_INFO!A15)","v":"Zanzibar"},{"$f":"IF(COUNTRY_INFO!B15=0,\" \",COUNTRY_INFO!B15)","v":"Mjini Magharibi"},{"$f":"IF(COUNTRY_INFO!C15=0,\" \",COUNTRY_INFO!C15)","v":"Magharibi A"},{"$f":"IF(OR(COUNTRY_INFO!$Z15=\"T2 (PZQ)\",COUNTRY_INFO!$AA15=\"T2 (PZQ)\"),\"T2 (PZQ)\",\" \")","v":"T2 (PZQ)"},"March 2022",27246,54648,113965,195859,10960,66495,65145,142600,null,null,null,0,10960,66495,65145,142600,40.2260882331351,121.678743961353,57.1622866669591,72.8074788495806,7847,false]
[{"$f":"IF(COUNTRY_INFO!A16=0,\" \",COUNTRY_INFO!A16)","v":"Zanzibar"},{"$f":"IF(COUNTRY_INFO!B16=0,\" \",COUNTRY_INFO!B16)","v":"Mjini Magharibi"},{"$f":"IF(COUNTRY_INFO!C16=0,\" \",COUNTRY_INFO!C16)","v":"Magharibi B"},{"$f":"IF(OR(COUNTRY_INFO!$Z16=\"T2 (PZQ)\",COUNTRY_INFO!$AA16=\"T2 (PZQ)\"),\"T2 (PZQ)\",\" \")","v":"T2 (PZQ)"},"March 2022",35266,70733,147509,253508,17186,82499,133269,232954,null,null,null,0,17186,82499,133269,232954,48.7324902172064,116.634385647435,90.3463517480289,91.8921690834214,17186,true]
[{"$f":"IF(COUNTRY_INFO!A17=0,\" \",COUNTRY_INFO!A17)","v":"Zanzibar"},{"$f":"IF(COUNTRY_INFO!B17=0,\" \",COUNTRY_INFO!B17)","v":"Kusini Pemba"},{"$f":"IF(COUNTRY_INFO!C17=0,\" \",COUNTRY_INFO!C17)","v":"Chake chake"},{"$f":"IF(OR(COUNTRY_INFO!$Z17=\"T2 (PZQ)\",COUNTRY_INFO!$AA17=\"T2 (PZQ)\"),\"T2 (PZQ)\",\" \")","v":"T2 (PZQ)"},"March 2022",19104,38318,79910,137332,8948,28996,59507,97451,null,null,null,0,8948,28996,59507,97451,46.8383584589615,75.6720079336082,74.4675259667126,70.9601549529607,8948,true]
[{"$f":"IF(COUNTRY_INFO!A18=0,\" \",COUNTRY_INFO!A18)","v":"Zanzibar"},{"$f":"IF(COUNTRY_INFO!B18=0,\" \",COUNTRY_INFO!B18)","v":"Kusini Pemba"},{"$f":"IF(COUNTRY_INFO!C18=0,\" \",COUNTRY_INFO!C18)","v":"Mkoani"},{"$f":"IF(OR(COUNTRY_INFO!$Z18=\"T2 (PZQ)\",COUNTRY_INFO!$AA18=\"T2 (PZQ)\"),\"T2 (PZQ)\",\" \")","v":"T2 (PZQ)"},"March 2022",19058,38226,79717,137001,8843,35547,56168,100558,null,null,null,0,8843,35547,56168,100558,46.4004617483471,92.9916810547795,70.4592495954439,73.3994642374873,8558,false]
[{"$f":"IF(COUNTRY_INFO!A19=0,\" \",COUNTRY_INFO!A19)","v":"Zanzibar"},{"$f":"IF(COUNTRY_INFO!B19=0,\" \",COUNTRY_INFO!B19)","v":"Kaskazini Pemba"},{"$f":"IF(COUNTRY_INFO!C19=0,\" \",COUNTRY_INFO!C19)","v":"Wete"},{"$f":"IF(OR(COUNTRY_INFO!$Z19=\"T2 (PZQ)\",COUNTRY_INFO!$AA19=\"T2 (PZQ)\"),\"T2 (PZQ)\",\" \")","v":"T2 (PZQ)"},"March 2022",20916,40838,85164,146918,8552,36500,62091,107143,null,null,null,0,8552,36500,62091,107143,40.8873589596481,89.3775405259807,72.9075665774271,72.9270749669884,8552,true]
[{"$f":"IF(COUNTRY_INFO!A20=0,\" \",COUNTRY_INFO!A20)","v":"Zanzibar"},{"$f":"IF(COUNTRY_INFO!B20=0,\" \",COUNTRY_INFO!B20)","v":"Kaskazini Pemba"},{"$f":"IF(COUNTRY_INFO!C20=0,\" \",COUNTRY_INFO!C20)","v":"Micheweni"},{"$f":"IF(OR(COUNTRY_INFO!$Z20=\"T2 (PZQ)\",COUNTRY_INFO!$AA20=\"T2 (PZQ)\"),\"T2 (PZQ)\",\" \")","v":"T2 (PZQ)"},"March 2022",20361,41951,87487,149799,5063,16960,45350,67373,null,null,null,0,5063,16960,45350,67373,24.8661657089534,40.4281185192248,51.8362728176758,44.9756006381885,10086,false]

{"sheet":"T3_R1","index":8,"n_rows":20,"n_cols":17,"rows_kept":20,"cut":false,"hidden":false,"merged":[[0,5,0,7],[1,9,1,10],[1,11,1,12],[3,0,3,2],[5,0,5,2],[5,5,5,8],[5,9,5,12],[5,13,5,16],[5,3,6,3],[5,4,6,4]]}
["T 3 - Albendazole (ALB) or Mebendazole (MBD) - Round 1",null,null,null,null,"Select medicine used for treatment \nof STH for each age group"]
["Administrative structure, population requiring PC by age group, population treated by age group and coverage",null,null,null,null,"ALB",null,null,null,"Select the category of Adults"]
[]
["TOTAL",null,null,null,null,{"$f":"SUBTOTAL(9,F$10:F$1010)","v":231558},0,0,231558,98988,0,0,98988,{"$f":"IF(F4<>0,IF(J4/F4*100=0,\"-\",J4/F4*100),\" \")","v":42.7486849946882},{"$f":"IF(G4<>0,IF(K4/G4*100=0,\"-\",K4/G4*100),\" \")","v":" "},{"$f":"IF(H4<>0,IF(L4/H4*100=0,\"-\",L4/H4*100),\" \")","v":" "},{"$f":"IF(I4<>0,IF(M4/I4*100=0,\"-\",M4/I4*100),\" \")","v":42.7486849946882}]
[]
["Country administrative structure",null,null,"PC implemented","Date","Population targeted for T3",null,null,null,"Population treated",null,null,null,"Programme coverage (%)"]
["Country","Province/State","District",null,null,"PreSAC","SAC","Adults","Total","PreSAC","SAC","Adults","Total","PreSAC","SAC","Adults","Total"]
[]
[]
[{"$f":"IF(COUNTRY_INFO!A10=0,\" \",COUNTRY_INFO!A10)","v":"Zanzibar"},{"$f":"IF(COUNTRY_INFO!B10=0,\" \",COUNTRY_INFO!B10)","v":"Kaskazini Unguja"},{"$f":"IF(COUNTRY_INFO!C10=0,\" \",COUNTRY_INFO!C10)","v":"Kaskazini A"},"T3 (ALB/MBD)","March 2022",17847,null,null,{"$f":"SUM(F10:H10)","v":17847},10661,null,null,{"$f":"SUM(J10:L10)","v":10661},{"$f":"IF(F10<>0,IF(J10/F10*100=0,\"-\",J10/F10*100),\" \")","v":59.7355297809156}," "," ",59.7355297809156]
[{"$f":"IF(COUNTRY_INFO!A11=0,\" \",COUNTRY_INFO!A11)","v":"Zanzibar"},{"$f":"IF(COUNTRY_INFO!B11=0,\" \",COUNTRY_INFO!B11)","v":"Kaskazini Unguja"},{"$f":"IF(COUNTRY_INFO!C11=0,\" \",COUNTRY_INFO!C11)","v":"Kaskazini B"},"T3 (ALB/MBD)","March 2022",14172,null,null,{"$f":"SUM(F11:H11)","v":14172},5994,null,null,{"$f":"SUM(J11:L11)","v":5994},{"$f":"IF(F11<>0,IF(J11/F11*100=0,\"-\",J11/F11*100),\" \")","v":42.2946655376799},{"$f":"IF(G11<>0,IF(K11/G11*100=0,\"-\",K11/G11*100),\" \")","v":" "},{"$f":"IF(H11<>0,IF(L11/H11*100=0,\"-\",L11/H11*100),\" \")","v":" "},{"$f":"IF(I11<>0,IF(M11/I11*100=0,\"-\",M11/I11*100),\" \")","v":42.2946655376799}]
[{"$f":"IF(COUNTRY_INFO!A12=0,\" \",COUNTRY_INFO!A12)","v":"Zanzibar"},{"$f":"IF(COUNTRY_INFO!B12=0,\" \",COUNTRY_INFO!B12)","v":"Kusini Unguja"},{"$f":"IF(COUNTRY_INFO!C12=0,\" \",COUNTRY_INFO!C12)","v":"Kusini"},"T3 (ALB/MBD)","March 2022",6587,null,null,6587,2845,null,null,2845,43.1911340519205," "," ",43.1911340519205]
[{"$f":"IF(COUNTRY_INFO!A13=0,\" \",COUNTRY_INFO!A13)","v":"Zanzibar"},{"$f":"IF(COUNTRY_INFO!B13=0,\" \",COUNTRY_INFO!B13)","v":"Kusini Unguja"},{"$f":"IF(COUNTRY_INFO!C13=0,\" \",COUNTRY_INFO!C13)","v":"Kati"},"T3 (ALB/MBD)","March 2022",12398,null,null,12398,7161,null,null,7161,57.7593160187127," "," ",57.7593160187127]
[{"$f":"IF(COUNTRY_INFO!A14=0,\" \",COUNTRY_INFO!A14)","v":"Zanzibar"},{"$f":"IF(COUNTRY_INFO!B14=0,\" \",COUNTRY_INFO!B14)","v":"Mjini Magharibi"},{"$f":"IF(COUNTRY_INFO!C14=0,\" \",COUNTRY_INFO!C14)","v":"Mjini"},"T3 (ALB/MBD)","March 2022",38603,null,null,38603,11150,null,null,11150,28.8837655104526," "," ",28.8837655104526]
[{"$f":"IF(COUNTRY_INFO!A15=0,\" \",COUNTRY_INFO!A15)","v":"Zanzibar"},{"$f":"IF(COUNTRY_INFO!B15=0,\" \",COUNTRY_INFO!B15)","v":"Mjini Magharibi"},{"$f":"IF(COUNTRY_INFO!C15=0,\" \",COUNTRY_INFO!C15)","v":"Magharibi A"},"T3 (ALB/MBD)","March 2022",27246,null,null,27246,7847,null,null,7847,28.8005578800558," "," ",28.8005578800558]
[{"$f":"IF(COUNTRY_INFO!A16=0,\" \",COUNTRY_INFO!A16)","v":"Zanzibar"},{"$f":"IF(COUNTRY_INFO!B16=0,\" \",COUNTRY_INFO!B16)","v":"Mjini Magharibi"},{"$f":"IF(COUNTRY_INFO!C16=0,\" \",COUNTRY_INFO!C16)","v":"Magharibi B"},"T3 (ALB/MBD)","March 2022",35266,null,null,35266,17186,null,null,17186,48.7324902172064," "," ",48.7324902172064]
[{"$f":"IF(COUNTRY_INFO!A17=0,\" \",COUNTRY_INFO!A17)","v":"Zanzibar"},{"$f":"IF(COUNTRY_INFO!B17=0,\" \",COUNTRY_INFO!B17)","v":"Kusini Pemba"},{"$f":"IF(COUNTRY_INFO!C17=0,\" \",COUNTRY_INFO!C17)","v":"Chake chake"},"T3 (ALB/MBD)","March 2022",19104,null,null,19104,8948,null,null,8948,46.8383584589615," "," ",46.8383584589615]
[{"$f":"IF(COUNTRY_INFO!A18=0,\" \",COUNTRY_INFO!A18)","v":"Zanzibar"},{"$f":"IF(COUNTRY_INFO!B18=0,\" \",COUNTRY_INFO!B18)","v":"Kusini Pemba"},{"$f":"IF(COUNTRY_INFO!C18=0,\" \",COUNTRY_INFO!C18)","v":"Mkoani"},"T3 (ALB/MBD)","March 2022",19058,null,null,19058,8558,null,null,8558,44.9050267604156," "," ",44.9050267604156]
[{"$f":"IF(COUNTRY_INFO!A19=0,\" \",COUNTRY_INFO!A19)","v":"Zanzibar"},{"$f":"IF(COUNTRY_INFO!B19=0,\" \",COUNTRY_INFO!B19)","v":"Kaskazini Pemba"},{"$f":"IF(COUNTRY_INFO!C19=0,\" \",COUNTRY_INFO!C19)","v":"Wete"},"T3 (ALB/MBD)","March 2022",20916,null,null,20916,8552,null,null,8552,40.8873589596481," "," ",40.8873589596481]
[{"$f":"IF(COUNTRY_INFO!A20=0,\" \",COUNTRY_INFO!A20)","v":"Zanzibar"},{"$f":"IF(COUNTRY_INFO!B20=0,\" \",COUNTRY_INFO!B20)","v":"Kaskazini Pemba"},{"$f":"IF(COUNTRY_INFO!C20=0,\" \",COUNTRY_INFO!C20)","v":"Micheweni"},"T3 (ALB/MBD)","March 2022",20361,null,null,20361,10086,null,null,10086,49.5358774127007," "," ",49.5358774127007]

{"sheet":"T3_R2","index":9,"n_rows":20,"n_cols":17,"rows_kept":20,"cut":false,"hidden":false,"merged":[[0,5,0,7],[1,9,1,10],[1,11,1,12],[3,0,3,2],[5,0,5,2],[5,5,5,8],[5,9,5,12],[5,13,5,16],[5,3,6,3],[5,4,6,4]]}
["T 3 - Albendazole (ALB) or Mebendazole (MBD) - Round 2",null,null,null,null,"Select medicine used for treatment \nof STH for each age group"]
["Administrative structure, population requiring PC by age group, population treated by age group and coverage",null,null,null,null,null,null,null,null,"Select the category of Adults"]
[]
["TOTAL",null,null,null,null,{"$f":"SUBTOTAL(9,F$10:F$1010)","v":0},0,0,0,0,0,0,0,{"$f":"IF(F4<>0,IF(J4/F4*100=0,\"-\",J4/F4*100),\" \")","v":" "},{"$f":"IF(G4<>0,IF(K4/G4*100=0,\"-\",K4/G4*100),\" \")","v":" "},{"$f":"IF(H4<>0,IF(L4/H4*100=0,\"-\",L4/H4*100),\" \")","v":" "},{"$f":"IF(I4<>0,IF(M4/I4*100=0,\"-\",M4/I4*100),\" \")","v":" "}]
[]
["Country administrative structure",null,null,"PC implemented","Date","Population targeted for T3",null,null,null,"Population treated",null,null,null,"Programme coverage (%)"]
["Country","Province/State","District",null,null,"PreSAC","SAC","Adults","Total","PreSAC","SAC","Adults","Total","PreSAC","SAC","Adults","Total"]
[]
[]
[{"$f":"IF(COUNTRY_INFO!A10=0,\" \",COUNTRY_INFO!A10)","v":"Zanzibar"},{"$f":"IF(COUNTRY_INFO!B10=0,\" \",COUNTRY_INFO!B10)","v":"Kaskazini Unguja"},{"$f":"IF(COUNTRY_INFO!C10=0,\" \",COUNTRY_INFO!C10)","v":"Kaskazini A"},{"$f":"IF(AND(COUNTRY_INFO!$Z10=\"T3 (ALB/MBD)\",COUNTRY_INFO!$AA10=\"T3 (ALB/MBD)\"),\"T3 (ALB/MBD)\",\" \")","v":" "},null,null,null,null,{"$f":"SUM(F10:H10)","v":0},null,null,null,{"$f":"SUM(J10:L10)","v":0},{"$f":"IF(F10<>0,IF(J10/F10*100=0,\"-\",J10/F10*100),\" \")","v":" "}," "," "," "]
[{"$f":"IF(COUNTRY_INFO!A11=0,\" \",COUNTRY_INFO!A11)","v":"Zanzibar"},{"$f":"IF(COUNTRY_INFO!B11=0,\" \",COUNTRY_INFO!B11)","v":"Kaskazini Unguja"},{"$f":"IF(COUNTRY_INFO!C11=0,\" \",COUNTRY_INFO!C11)","v":"Kaskazini B"},{"$f":"IF(AND(COUNTRY_INFO!$Z11=\"T3 (ALB/MBD)\",COUNTRY_INFO!$AA11=\"T3 (ALB/MBD)\"),\"T3 (ALB/MBD)\",\" \")","v":" "},null,null,null,null,{"$f":"SUM(F11:H11)","v":0},null,null,null,{"$f":"SUM(J11:L11)","v":0},{"$f":"IF(F11<>0,IF(J11/F11*100=0,\"-\",J11/F11*100),\" \")","v":" "},{"$f":"IF(G11<>0,IF(K11/G11*100=0,\"-\",K11/G11*100),\" \")","v":" "},{"$f":"IF(H11<>0,IF(L11/H11*100=0,\"-\",L11/H11*100),\" \")","v":" "},{"$f":"IF(I11<>0,IF(M11/I11*100=0,\"-\",M11/I11*100),\" \")","v":" "}]
[{"$f":"IF(COUNTRY_INFO!A12=0,\" \",COUNTRY_INFO!A12)","v":"Zanzibar"},{"$f":"IF(COUNTRY_INFO!B12=0,\" \",COUNTRY_INFO!B12)","v":"Kusini Unguja"},{"$f":"IF(COUNTRY_INFO!C12=0,\" \",COUNTRY_INFO!C12)","v":"Kusini"},{"$f":"IF(AND(COUNTRY_INFO!$Z12=\"T3 (ALB/MBD)\",COUNTRY_INFO!$AA12=\"T3 (ALB/MBD)\"),\"T3 (ALB/MBD)\",\" \")","v":" "},null,null,null,null,0,null,null,null,0," "," "," "," "]
[{"$f":"IF(COUNTRY_INFO!A13=0,\" \",COUNTRY_INFO!A13)","v":"Zanzibar"},{"$f":"IF(COUNTRY_INFO!B13=0,\" \",COUNTRY_INFO!B13)","v":"Kusini Unguja"},{"$f":"IF(COUNTRY_INFO!C13=0,\" \",COUNTRY_INFO!C13)","v":"Kati"},{"$f":"IF(AND(COUNTRY_INFO!$Z13=\"T3 (ALB/MBD)\",COUNTRY_INFO!$AA13=\"T3 (ALB/MBD)\"),\"T3 (ALB/MBD)\",\" \")","v":" "},null,null,null,null,0,null,null,null,0," "," "," "," "]
[{"$f":"IF(COUNTRY_INFO!A14=0,\" \",COUNTRY_INFO!A14)","v":"Zanzibar"},{"$f":"IF(COUNTRY_INFO!B14=0,\" \",COUNTRY_INFO!B14)","v":"Mjini Magharibi"},{"$f":"IF(COUNTRY_INFO!C14=0,\" \",COUNTRY_INFO!C14)","v":"Mjini"},{"$f":"IF(AND(COUNTRY_INFO!$Z14=\"T3 (ALB/MBD)\",COUNTRY_INFO!$AA14=\"T3 (ALB/MBD)\"),\"T3 (ALB/MBD)\",\" \")","v":" "},null,null,null,null,0,null,null,null,0," "," "," "," "]
[{"$f":"IF(COUNTRY_INFO!A15=0,\" \",COUNTRY_INFO!A15)","v":"Zanzibar"},{"$f":"IF(COUNTRY_INFO!B15=0,\" \",COUNTRY_INFO!B15)","v":"Mjini Magharibi"},{"$f":"IF(COUNTRY_INFO!C15=0,\" \",COUNTRY_INFO!C15)","v":"Magharibi A"},{"$f":"IF(AND(COUNTRY_INFO!$Z15=\"T3 (ALB/MBD)\",COUNTRY_INFO!$AA15=\"T3 (ALB/MBD)\"),\"T3 (ALB/MBD)\",\" \")","v":" "},null,null,null,null,0,null,null,null,0," "," "," "," "]
[{"$f":"IF(COUNTRY_INFO!A16=0,\" \",COUNTRY_INFO!A16)","v":"Zanzibar"},{"$f":"IF(COUNTRY_INFO!B16=0,\" \",COUNTRY_INFO!B16)","v":"Mjini Magharibi"},{"$f":"IF(COUNTRY_INFO!C16=0,\" \",COUNTRY_INFO!C16)","v":"Magharibi B"},{"$f":"IF(AND(COUNTRY_INFO!$Z16=\"T3 (ALB/MBD)\",COUNTRY_INFO!$AA16=\"T3 (ALB/MBD)\"),\"T3 (ALB/MBD)\",\" \")","v":" "},null,null,null,null,0,null,null,null,0," "," "," "," "]
[{"$f":"IF(COUNTRY_INFO!A17=0,\" \",COUNTRY_INFO!A17)","v":"Zanzibar"},{"$f":"IF(COUNTRY_INFO!B17=0,\" \",COUNTRY_INFO!B17)","v":"Kusini Pemba"},{"$f":"IF(COUNTRY_INFO!C17=0,\" \",COUNTRY_INFO!C17)","v":"Chake chake"},{"$f":"IF(AND(COUNTRY_INFO!$Z17=\"T3 (ALB/MBD)\",COUNTRY_INFO!$AA17=\"T3 (ALB/MBD)\"),\"T3 (ALB/MBD)\",\" \")","v":" "},null,null,null,null,0,null,null,null,0," "," "," "," "]
[{"$f":"IF(COUNTRY_INFO!A18=0,\" \",COUNTRY_INFO!A18)","v":"Zanzibar"},{"$f":"IF(COUNTRY_INFO!B18=0,\" \",COUNTRY_INFO!B18)","v":"Kusini Pemba"},{"$f":"IF(COUNTRY_INFO!C18=0,\" \",COUNTRY_INFO!C18)","v":"Mkoani"},{"$f":"IF(AND(COUNTRY_INFO!$Z18=\"T3 (ALB/MBD)\",COUNTRY_INFO!$AA18=\"T3 (ALB/MBD)\"),\"T3 (ALB/MBD)\",\" \")","v":" "},null,null,null,null,0,null,null,null,0," "," "," "," "]
[{"$f":"IF(COUNTRY_INFO!A19=0,\" \",COUNTRY_INFO!A19)","v":"Zanzibar"},{"$f":"IF(COUNTRY_INFO!B19=0,\" \",COUNTRY_INFO!B19)","v":"Kaskazini Pemba"},{"$f":"IF(COUNTRY_INFO!C19=0,\" \",COUNTRY_INFO!C19)","v":"Wete"},{"$f":"IF(AND(COUNTRY_INFO!$Z19=\"T3 (ALB/MBD)\",COUNTRY_INFO!$AA19=\"T3 (ALB/MBD)\"),\"T3 (ALB/MBD)\",\" \")","v":" "},null,null,null,null,0,null,null,null,0," "," "," "," "]
[{"$f":"IF(COUNTRY_INFO!A20=0,\" \",COUNTRY_INFO!A20)","v":"Zanzibar"},{"$f":"IF(COUNTRY_INFO!B20=0,\" \",COUNTRY_INFO!B20)","v":"Kaskazini Pemba"},{"$f":"IF(COUNTRY_INFO!C20=0,\" \",COUNTRY_INFO!C20)","v":"Micheweni"},{"$f":"IF(AND(COUNTRY_INFO!$Z20=\"T3 (ALB/MBD)\",COUNTRY_INFO!$AA20=\"T3 (ALB/MBD)\"),\"T3 (ALB/MBD)\",\" \")","v":" "},null,null,null,null,0,null,null,null,0," "," "," "," "]

{"sheet":"T3_R3","index":10,"n_rows":20,"n_cols":17,"rows_kept":20,"cut":false,"hidden":false,"merged":[[0,5,0,7],[1,9,1,10],[1,11,1,12],[3,0,3,2],[5,0,5,2],[5,5,5,8],[5,9,5,12],[5,13,5,16],[5,3,6,3],[5,4,6,4]]}
["T 3 - Albendazole (ALB) or Mebendazole (MBD) - Round 3",null,null,null,null,"Select medicine used for treatment \nof STH for each age group"]
["Administrative structure, population requiring PC by age group, population treated by age group and coverage",null,null,null,null,null,null,null,null,"Select the category of Adults"]
[]
["TOTAL",null,null,null,null,{"$f":"SUBTOTAL(9,F$10:F$1010)","v":0},0,0,0,0,0,0,0,{"$f":"IF(F4<>0,IF(J4/F4*100=0,\"-\",J4/F4*100),\" \")","v":" "},{"$f":"IF(G4<>0,IF(K4/G4*100=0,\"-\",K4/G4*100),\" \")","v":" "},{"$f":"IF(H4<>0,IF(L4/H4*100=0,\"-\",L4/H4*100),\" \")","v":" "},{"$f":"IF(I4<>0,IF(M4/I4*100=0,\"-\",M4/I4*100),\" \")","v":" "}]
[]
["Country administrative structure",null,null,"PC implemented","Date","Population targeted for T3",null,null,null,"Population treated",null,null,null,"Programme coverage (%)"]
["Country","Province/State","District",null,null,"PreSAC","SAC","Adults","Total","PreSAC","SAC","Adults","Total","PreSAC","SAC","Adults","Total"]
[]
[]
[{"$f":"IF(COUNTRY_INFO!A10=0,\" \",COUNTRY_INFO!A10)","v":"Zanzibar"},{"$f":"IF(COUNTRY_INFO!B10=0,\" \",COUNTRY_INFO!B10)","v":"Kaskazini Unguja"},{"$f":"IF(COUNTRY_INFO!C10=0,\" \",COUNTRY_INFO!C10)","v":"Kaskazini A"},{"$f":"IF(COUNTRY_INFO!$AB10=\"T3 (ALB/MBD)\",\"T3 (ALB/MBD)\",\" \")","v":" "},null,null,null,null,{"$f":"SUM(F10:H10)","v":0},null,null,null,{"$f":"SUM(J10:L10)","v":0},{"$f":"IF(F10<>0,IF(J10/F10*100=0,\"-\",J10/F10*100),\" \")","v":" "}," "," "," "]
[{"$f":"IF(COUNTRY_INFO!A11=0,\" \",COUNTRY_INFO!A11)","v":"Zanzibar"},{"$f":"IF(COUNTRY_INFO!B11=0,\" \",COUNTRY_INFO!B11)","v":"Kaskazini Unguja"},{"$f":"IF(COUNTRY_INFO!C11=0,\" \",COUNTRY_INFO!C11)","v":"Kaskazini B"},{"$f":"IF(COUNTRY_INFO!$AB11=\"T3 (ALB/MBD)\",\"T3 (ALB/MBD)\",\" \")","v":" "},null,null,null,null,{"$f":"SUM(F11:H11)","v":0},null,null,null,{"$f":"SUM(J11:L11)","v":0},{"$f":"IF(F11<>0,IF(J11/F11*100=0,\"-\",J11/F11*100),\" \")","v":" "},{"$f":"IF(G11<>0,IF(K11/G11*100=0,\"-\",K11/G11*100),\" \")","v":" "},{"$f":"IF(H11<>0,IF(L11/H11*100=0,\"-\",L11/H11*100),\" \")","v":" "},{"$f":"IF(I11<>0,IF(M11/I11*100=0,\"-\",M11/I11*100),\" \")","v":" "}]
[{"$f":"IF(COUNTRY_INFO!A12=0,\" \",COUNTRY_INFO!A12)","v":"Zanzibar"},{"$f":"IF(COUNTRY_INFO!B12=0,\" \",COUNTRY_INFO!B12)","v":"Kusini Unguja"},{"$f":"IF(COUNTRY_INFO!C12=0,\" \",COUNTRY_INFO!C12)","v":"Kusini"},{"$f":"IF(COUNTRY_INFO!$AB12=\"T3 (ALB/MBD)\",\"T3 (ALB/MBD)\",\" \")","v":" "},null,null,null,null,0,null,null,null,0," "," "," "," "]
[{"$f":"IF(COUNTRY_INFO!A13=0,\" \",COUNTRY_INFO!A13)","v":"Zanzibar"},{"$f":"IF(COUNTRY_INFO!B13=0,\" \",COUNTRY_INFO!B13)","v":"Kusini Unguja"},{"$f":"IF(COUNTRY_INFO!C13=0,\" \",COUNTRY_INFO!C13)","v":"Kati"},{"$f":"IF(COUNTRY_INFO!$AB13=\"T3 (ALB/MBD)\",\"T3 (ALB/MBD)\",\" \")","v":" "},null,null,null,null,0,null,null,null,0," "," "," "," "]
[{"$f":"IF(COUNTRY_INFO!A14=0,\" \",COUNTRY_INFO!A14)","v":"Zanzibar"},{"$f":"IF(COUNTRY_INFO!B14=0,\" \",COUNTRY_INFO!B14)","v":"Mjini Magharibi"},{"$f":"IF(COUNTRY_INFO!C14=0,\" \",COUNTRY_INFO!C14)","v":"Mjini"},{"$f":"IF(COUNTRY_INFO!$AB14=\"T3 (ALB/MBD)\",\"T3 (ALB/MBD)\",\" \")","v":" "},null,null,null,null,0,null,null,null,0," "," "," "," "]
[{"$f":"IF(COUNTRY_INFO!A15=0,\" \",COUNTRY_INFO!A15)","v":"Zanzibar"},{"$f":"IF(COUNTRY_INFO!B15=0,\" \",COUNTRY_INFO!B15)","v":"Mjini Magharibi"},{"$f":"IF(COUNTRY_INFO!C15=0,\" \",COUNTRY_INFO!C15)","v":"Magharibi A"},{"$f":"IF(COUNTRY_INFO!$AB15=\"T3 (ALB/MBD)\",\"T3 (ALB/MBD)\",\" \")","v":" "},null,null,null,null,0,null,null,null,0," "," "," "," "]
[{"$f":"IF(COUNTRY_INFO!A16=0,\" \",COUNTRY_INFO!A16)","v":"Zanzibar"},{"$f":"IF(COUNTRY_INFO!B16=0,\" \",COUNTRY_INFO!B16)","v":"Mjini Magharibi"},{"$f":"IF(COUNTRY_INFO!C16=0,\" \",COUNTRY_INFO!C16)","v":"Magharibi B"},{"$f":"IF(COUNTRY_INFO!$AB16=\"T3 (ALB/MBD)\",\"T3 (ALB/MBD)\",\" \")","v":" "},null,null,null,null,0,null,null,null,0," "," "," "," "]
[{"$f":"IF(COUNTRY_INFO!A17=0,\" \",COUNTRY_INFO!A17)","v":"Zanzibar"},{"$f":"IF(COUNTRY_INFO!B17=0,\" \",COUNTRY_INFO!B17)","v":"Kusini Pemba"},{"$f":"IF(COUNTRY_INFO!C17=0,\" \",COUNTRY_INFO!C17)","v":"Chake chake"},{"$f":"IF(COUNTRY_INFO!$AB17=\"T3 (ALB/MBD)\",\"T3 (ALB/MBD)\",\" \")","v":" "},null,null,null,null,0,null,null,null,0," "," "," "," "]
[{"$f":"IF(COUNTRY_INFO!A18=0,\" \",COUNTRY_INFO!A18)","v":"Zanzibar"},{"$f":"IF(COUNTRY_INFO!B18=0,\" \",COUNTRY_INFO!B18)","v":"Kusini Pemba"},{"$f":"IF(COUNTRY_INFO!C18=0,\" \",COUNTRY_INFO!C18)","v":"Mkoani"},{"$f":"IF(COUNTRY_INFO!$AB18=\"T3 (ALB/MBD)\",\"T3 (ALB/MBD)\",\" \")","v":" "},null,null,null,null,0,null,null,null,0," "," "," "," "]
[{"$f":"IF(COUNTRY_INFO!A19=0,\" \",COUNTRY_INFO!A19)","v":"Zanzibar"},{"$f":"IF(COUNTRY_INFO!B19=0,\" \",COUNTRY_INFO!B19)","v":"Kaskazini Pemba"},{"$f":"IF(COUNTRY_INFO!C19=0,\" \",COUNTRY_INFO!C19)","v":"Wete"},{"$f":"IF(COUNTRY_INFO!$AB19=\"T3 (ALB/MBD)\",\"T3 (ALB/MBD)\",\" \")","v":" "},null,null,null,null,0,null,null,null,0," "," "," "," "]
[{"$f":"IF(COUNTRY_INFO!A20=0,\" \",COUNTRY_INFO!A20)","v":"Zanzibar"},{"$f":"IF(COUNTRY_INFO!B20=0,\" \",COUNTRY_INFO!B20)","v":"Kaskazini Pemba"},{"$f":"IF(COUNTRY_INFO!C20=0,\" \",COUNTRY_INFO!C20)","v":"Micheweni"},{"$f":"IF(COUNTRY_INFO!$AB20=\"T3 (ALB/MBD)\",\"T3 (ALB/MBD)\",\" \")","v":" "},null,null,null,null,0,null,null,null,0," "," "," "," "]

{"sheet":"DISTRICT","index":11,"n_rows":20,"n_cols":65,"rows_kept":20,"cut":false,"hidden":false,"merged":[[3,0,3,2],[5,0,5,2],[5,4,5,8],[5,10,5,14],[5,16,5,29],[5,31,5,44],[5,3,6,3],[5,9,6,9],[5,15,6,15],[5,30,6,30]]}
["Number of individuals treated"]
["Administrative structure, population treated by age group and gender"]
[]
["TOTAL",null,null,{"$f":"SUBTOTAL(9,D$10:D$1010)","v":1768965},{"$f":"SUBTOTAL(9,E$10:E$1010)","v":0},0,1284216,1264653,{"$f":"IF(D4>0,IF(H4/D4*100<>0,H4/D4*100,\"-\"),0)","v":71.491126166996},{"$f":"SUBTOTAL(9,J$10:J$1010)","v":0},0,0,1284216,0,{"$f":"IF(J4>0,IF(N4/J4*100<>0,N4/J4*100,\"-\"),0)","v":0},{"$f":"SUBTOTAL(9,P$10:P$1010)","v":1135855},0,0,98988,98988,{"$f":"IF(COUNTRY_INFO!N4>0,IF(T4/COUNTRY_INFO!N4*100<>0,T4/COUNTRY_INFO!N4*100,\"-\"),0)","v":42.7486849946882},476239,{"$f":"SUBTOTAL(9,W$10:W$1010)","v":409803},{"$f":"IF(COUNTRY_INFO!O4>0,IF(W4/COUNTRY_INFO!O4*100<>0,W4/COUNTRY_INFO!O4*100,\"-\"),0)","v":85.673698074551},{"$f":"SUBTOTAL(9,Y$10:Y$1010)","v":807977},{"$f":"SUBTOTAL(9,Z$10:Z$1010)","v":425967},{"$f":"IF(COUNTRY_INFO!P4>0,IF(Z4/COUNTRY_INFO!P4*100<>0,Z4/COUNTRY_INFO!P4*100,\"-\"),0)","v":100},{"$f":"SUBTOTAL(9,AB$10:AB$1010)","v":1383204},{"$f":"SUBTOTAL(9,AC$10:AC$1010)","v":934758},{"$f":"IF(P4>0,IF(AC4/P4*100<>0,AC4/P4*100,\"-\"),0)","v":82.2955394834728},{"$f":"SUBTOTAL(9,AE$10:AE$1010)","v":1327606},0,0,92354,84175,{"$f":"IF(COUNTRY_INFO!R4>0,IF(AI4/COUNTRY_INFO!R4*100<>0,AI4/COUNTRY_INFO!R4*100,\"-\"),0)","v":60.2204924952425},{"$f":"SUBTOTAL(9,AK$10:AK$1010)","v":408263},335508,{"$f":"IF(COUNTRY_INFO!S4>0,IF(AL4/COUNTRY_INFO!S4*100<>0,AL4/COUNTRY_INFO!S4*100,\"-\"),0)","v":87.1492359363189},{"$f":"SUBTOTAL(9,AN$10:AN$1010)","v":684472},587105,{"$f":"IF(COUNTRY_INFO!T4>0,IF(AO4/COUNTRY_INFO!T4*100<>0,AO4/COUNTRY_INFO!T4*100,\"-\"),0)","v":73.127881152947},{"$f":"SUBTOTAL(9,AQ$10:AQ$1010)","v":1185089},1006788,{"$f":"IF(AE4>0,IF(AR4/AE4*100<>0,AR4/AE4*100,\"-\"),0)","v":75.8348485921275}]
[null,null,null,null,null,null,null,null,null,null,null,null,null,null,null,1135855,0,0,98988,98988,null,null,null,null,null,425967,null,1383204]
["Country administrative structure",null,null,"Population requiring PC for LF","Population treated for lymphatic filariasis",null,null,null,null,"Population requiring PC for ONCHO","Population treated for onchocerciasis",null,null,null,null,"Population requiring PC for STH","Population treated for STH",null,null,null,null,null,null,null,null,null,null,null,null,null,"Population requiring PC for SCH","Population treated for schistosomiasis",null,null,null,null,null,null,null,null,null,null,null,null,null,null,null,null,null,null,{"$f":"SUBTOTAL(9,AY10:AY1010)","v":61559},{"$f":"SUBTOTAL(9,AZ10:AZ1010)","v":231558},478330,997518,1768965,{"$f":"COUNTIF(BD10:BD1010,\"Y\")","v":11},{"$f":"SUBTOTAL(9,BE10:BE1010)","v":103193},480266,811092,1394551,103193,413644,796112,1312949,{"$f":"IF(BC6<>0,BL6/BC6,0)","v":0.742213102011628}]
["Country","Province/State","District",null,"Male","Female","Total treated","Total in need treated","(%)",null,"Male","Female","Total treated","Total in need treated","(%)",null,"Male","Female","Total PreSAC treated","PreSAC in need treated ","PreSAC (%)","Total SAC treated","SAC in need treated","SAC (%)","Total adults treated","Adults in need treated","Adults (%)","Total treated","Total in need treated ","(%)",null,"Male","Female","Total PreSAC treated","PreSAC in need treated","PreSAC (%)","Total SAC treated","SAC in need treated","SAC (%)","Total adults treated","Adults in need treated","Adults (%)","Total treated","Total in need treated ","(%)",null,"LF","ONCHO","STH","SCH","<1","PreSAC","SAC","Adults","Total","Dis","PreSAC","SAC","Adults","Total","PreSAC","SAC","Adults","Total","Coverage"]
[]
[]
[{"$f":"IF(COUNTRY_INFO!A10=0,\" \",COUNTRY_INFO!A10)","v":"Zanzibar"},{"$f":"IF(COUNTRY_INFO!B10=0,\" \",COUNTRY_INFO!B10)","v":"Kaskazini Unguja"},{"$f":"IF(COUNTRY_INFO!C10=0,\" \",COUNTRY_INFO!C10)","v":"Kaskazini A"},{"$f":"COUNTRY_INFO!L10","v":136337},null,null,{"$f":"MAX('MDA1'!M10,'MDA2'!M10,'MDA5'!M10)","v":120545},{"$f":"IF(AND(COUNTRY_INFO!H10>0,COUNTRY_INFO!H10<4),IF(D10>G10,G10,D10),0)","v":120545},{"$f":"IF(AND(COUNTRY_INFO!H10>0,COUNTRY_INFO!H10<4),IF(G10/D10*100<>0,IF(G10/D10*100>100,100,G10/D10*100),\"-\"),0)","v":88.4169374417803},{"$f":"COUNTRY_INFO!M10","v":"Not required"},null,null,{"$f":"MAX('MDA1'!M10,MAX('MDA3'!I10,'MDA3'!L10)+MAX('MDA3'!J10,'MDA3'!M10))","v":120545},{"$f":"IF(AND(COUNTRY_INFO!I10>0,COUNTRY_INFO!I10<4),IF(J10>M10,M10,J10),0)","v":0},{"$f":"IF(AND(COUNTRY_INFO!I10>0,COUNTRY_INFO!I10<4),IF(M10/J10*100<>0,IF(M10/J10*100>100,100,M10/J10*100),\"-\"),0)","v":0},{"$f":"COUNTRY_INFO!Q10","v":87543},null,null,{"$f":"MAX('MDA2'!J10,'MDA5'!J10,'T1'!K10,MAX(T3_R1!J10,T3_R2!J10,T3_R3!J10))","v":10661},{"$f":"IF(AND(COUNTRY_INFO!J10>1,COUNTRY_INFO!J10<99,COUNTRY_INFO!J10<>4,COUNTRY_INFO!J10<>5),IF(COUNTRY_INFO!N10>S10,S10,COUNTRY_INFO!N10),0)","v":10661},{"$f":"IF(AND(COUNTRY_INFO!J10>1,COUNTRY_INFO!J10<99,COUNTRY_INFO!J10<>4,COUNTRY_INFO!J10<>5),IF(T10/COUNTRY_INFO!N10*100<>0,IF(T10/COUNTRY_INFO!N10*100>100,100,T10/COUNTRY_INFO!N10*100),\"-\"),0)","v":59.7355297809156},{"$f":"MAX('MDA1'!K10,'MDA2'!K10,'MDA5'!K10,'T1'!L10,MAX(T3_R1!K10,T3_R2!K10,T3_R3!K10))","v":46676},{"$f":"IF(AND(COUNTRY_INFO!J10>1,COUNTRY_INFO!J10<99,COUNTRY_INFO!J10<>4,COUNTRY_INFO!J10<>5),IF(COUNTRY_INFO!O10>V10,V10,COUNTRY_INFO!O10),0)","v":36866},{"$f":"IF(AND(COUNTRY_INFO!J10>1,COUNTRY_INFO!J10<99,COUNTRY_INFO!J10<>4,COUNTRY_INFO!J10<>5),IF(W10/COUNTRY_INFO!O10*100<>0,IF(W10/COUNTRY_INFO!O10*100>100,100,W10/COUNTRY_INFO!O10*100),\"-\"),0)","v":100},{"$f":"MAX('MDA1'!L10,'MDA2'!L10,'MDA5'!L10,'T1'!M10,MAX(T3_R1!L10,T3_R2!L10,T3_R3!L10))","v":73869},{"$f":"IF(AND(COUNTRY_INFO!J10>1,COUNTRY_INFO!J10<99,COUNTRY_INFO!J10<>4,COUNTRY_INFO!J10<>5),IF(COUNTRY_INFO!P10>Y10,Y10,COUNTRY_INFO!P10),0)","v":32830},{"$f":"IF(AND(COUNTRY_INFO!J10>1,COUNTRY_INFO!J10<99,COUNTRY_INFO!J10<>4,COUNTRY_INFO!J10<>5),IF(Z10/COUNTRY_INFO!P10*100<>0,IF(Z10/COUNTRY_INFO!P10*100>100,100,Z10/COUNTRY_INFO!P10*100),\"-\"),0)","v":100},{"$f":"SUM(S10,V10,Y10)","v":131206},{"$f":"SUM(T10,W10,Z10)","v":80357},{"$f":"IF(AND(COUNTRY_INFO!J10>1,COUNTRY_INFO!J10<99,COUNTRY_INFO!J10<>4,COUNTRY_INFO!J10<>5),IF(AC10/P10*100<>0,IF(AC10/P10*100>100,100,AC10/P10*100),\"-\"),0)","v":91.7914624812949},{"$f":"COUNTRY_INFO!U10","v":127131},null,null,{"$f":"MAX('T1'!K10,'T2'!R10)","v":10718},{"$f":"IF(AND(COUNTRY_INFO!K10>1,COUNTRY_INFO!K10<99,COUNTRY_INFO!K10<>4,COUNTRY_INFO!K10<>5),IF(COUNTRY_INFO!R10>AH10,AH10,COUNTRY_INFO!R10),0)","v":10718},{"$f":"IF(AND(COUNTRY_INFO!K10>1,COUNTRY_INFO!K10<99,COUNTRY_INFO!K10<>4,COUNTRY_INFO!K10<>5),IF(AI10/COUNTRY_INFO!R10*100<>0,IF(AI10/COUNTRY_INFO!R10*100>100,100,AI10/COUNTRY_INFO!R10*100),\"-\"),0)","v":80.0747104968248},{"$f":"MAX('T1'!L10,'T2'!S10)","v":46821},{"$f":"IF(AND(COUNTRY_INFO!K10>1,COUNTRY_INFO!K10<99,COUNTRY_INFO!K10<>4,COUNTRY_INFO!K10<>5),IF(COUNTRY_INFO!S10>AK10,AK10,COUNTRY_INFO!S10),0)","v":36866},{"$f":"IF(AND(COUNTRY_INFO!K10>1,COUNTRY_INFO!K10<99,COUNTRY_INFO!K10<>4,COUNTRY_INFO!K10<>5),IF(AL10/COUNTRY_INFO!S10*100<>0,IF(AL10/COUNTRY_INFO!S10*100>100,100,AL10/COUNTRY_INFO!S10*100),\"-\"),0)","v":100},{"$f":"MAX('T1'!M10,'T2'!T10)","v":73886},{"$f":"IF(AND(COUNTRY_INFO!K10>1,COUNTRY_INFO!K10<99,COUNTRY_INFO!K10<>4,COUNTRY_INFO!K10<>5),IF(COUNTRY_INFO!T10>AN10,AN10,COUNTRY_INFO!T10),0)","v":73886},{"$f":"IF(AND(COUNTRY_INFO!K10>1,COUNTRY_INFO!K10<99,COUNTRY_INFO!K10<>4,COUNTRY_INFO!K10<>5),IF(AO10/COUNTRY_INFO!T10*100<>0,IF(AO10/COUNTRY_INFO!T10*100>100,100,AO10/COUNTRY_INFO!T10*100),\"-\"),0)","v":96.1056191467222},{"$f":"SUM(AH10,AK10,AN10)","v":131425},{"$f":"SUM(AI10,AL10,AO10)","v":121470},{"$f":"IF(AND(COUNTRY_INFO!K10>1,COUNTRY_INFO!K10<99,COUNTRY_INFO!K10<>4,COUNTRY_INFO!K10<>5),IF(AH10/AE10*100<>0,IF(AR10/AE10*100>100,100,AR10/AE10*100),\"-\"),0)","v":95.5471128206338},null,{"$f":"IF(AND(D10<>0,D10<>\"Unknown\",D10<>\"Stopped\",D10<>\"Not required\"),D10/COUNTRY_INFO!D10,0)","v":1},{"$f":"IF(AND(J10<>0,J10<>\"Unknown\",J10<>\"Stopped\",J10<>\"Not required\"),J10/COUNTRY_INFO!D10,0)","v":0},{"$f":"IF(AND(P10<>0,P10<>\"Unknown\",P10<>\"Surveillance\",P10<>\"Not required\"),P10/COUNTRY_INFO!Q10,0)","v":1},{"$f":"IF(AND(AE10<>0,AE10<>\"Unknown\",AE10<>\"Surveillance\",AE10<>\"Not required\"),AE10/COUNTRY_INFO!U10,0)","v":1},{"$f":"IF(AU10>0,D10*PROFILE!$G$7,IF(AV10>0,J10*PROFILE!$G$7,0))","v":4744.4519156682},{"$f":"_xlfn.IFS(OR(AU10>0,AW10>0),COUNTRY_INFO!E10,AV10>0,J10*PROFILE!$G$8,AX10>0,COUNTRY_INFO!R10,COUNTIFS(AU10:AX10,\">0\")=0,0)","v":17847},{"$f":"_xlfn.IFS(OR(AU10>0,AW10>0),COUNTRY_INFO!F10,AV10>0,J10*PROFILE!$G$9,AX10>0,COUNTRY_INFO!S10,COUNTIFS(AU10:AX10,\">0\")=0,0)","v":36866},{"$f":"_xlfn.IFS(AU10>0,COUNTRY_INFO!G10,AND(AV10>0,AW10=0,AX10=0),J10*PROFILE!$G$10,AND(AV10>0,AW10>0,AX10=0),MAX(J10*PROFILE!$G$10,COUNTRY_INFO!P10),AND(AV10>0,AW10=0,AX10>0),MAX(J10*PROFILE!$G$10,COUNTRY_INFO!T10),AND(AV10=0,AW10>0,AX10>0),MAX(COUNTRY_INFO!P10,COUNTRY_INFO!T10),AND(AV10=0,AW10>0,AX10=0),COUNTRY_INFO!P10,AND(AV10=0,AW10=0,AX10>0),COUNTRY_INFO!T10,AND(AV10>0,AW10>0,AX10>0),MAX(J10*PROFILE!$G$10,COUNTRY_INFO!P10,COUNTRY_INFO!T10),COUNTIFS(AU10:AX10,\">0\")=0,0)","v":76880},{"$f":"SUM(AY10:BB10)","v":136337.451915668},{"$f":"IF(COUNTIFS(AU10:AX10,\">0\")=0,0,IF(COUNTIFS(AU10:AX10,\">0\")<=IF(AND(OR(D10>=0,D10=\"Not required\",D10=\"Unknown\",D10=\"Stopped\"),D10>0,H10>0),1,0)+IF(AND(OR(J10>=0,J10=\"Not required\",J10=\"Unknown\",J10=\"Stopped\"),J10>0,N10>0),1,0)+IF(AND(OR(P10>=0,P10=\"Not required\",P10=\"Surveillance\",P10=\"Unknown\"),P10>0,AC10>0),1,0)+IF(AND(OR(AE10>=0,AE10=\"Not required\",AE10=\"Surveillance\",AE10=\"Unknown\"),AE10>0,AR10>0),1,0),\"Y\",0))","v":"Y"},{"$f":"MAX('MDA2'!J10,'MDA5'!J10,S10,AH10)","v":10718},{"$f":"MAX('MDA1'!K10,'MDA2'!K10,'MDA3'!I10,'MDA3'!L10,'MDA5'!K10,V10,AK10)","v":46821},{"$f":"MAX('MDA1'!L10,'MDA2'!L10,'MDA3'!J10,'MDA3'!M10,'MDA5'!L10,Y10,AN10)","v":73886},{"$f":"SUM(BE10:BG10)","v":131425},{"$f":"_xlfn.IFS(AND(AU10=0,AW10=0,AX10=0),0,AND(AU10=0,AW10=0,AX10>0),AI10,AND(AU10=0,AW10>0,AX10=0),T10,AND(AU10=0,AW10>0,AX10>0),MAX(T10,AI10),AND(AU10>0,AW10=0,AX10=0),MIN(MAX('MDA2'!J10,'MDA5'!J10),AZ10),AND(AU10>0,AW10=0,AX10>0),MIN(MAX('MDA2'!J10,'MDA5'!J10,AI10),AZ10),AND(AU10>0,AW10>0,AX10=0),MIN(MAX('MDA2'!J10,'MDA5'!J10,T10),AZ10),AND(AU10>0,AW10>0,AX10>0),MIN(MAX('MDA2'!J10,'MDA5'!J10,AI10,T10),AZ10))","v":10718},{"$f":"_xlfn.IFS(AND(AU10=0,AV10=0,AW10=0,AX10=0),0,AND(AU10=0,AV10=0,AW10=0,AX10>0),AL10,AND(AU10=0,AV10=0,AW10>0,AX10=0),W10,AND(AU10=0,AV10=0,AW10>0,AX10>0),MAX(W10,AL10),AND(AU10=0,AV10>0,AW10=0,AX10=0),MIN(J10*PROFILE!$G$9,MAX('MDA3'!I10,'MDA3'!L10)),AND(AU10=0,AV10>0,AW10=0,AX10>0),MIN(J10*PROFILE!$G$9,MAX('MDA3'!I10,'MDA3'!L10,AL10)),AND(AU10=0,AV10>0,AW10>0,AX10=0),MIN(J10*PROFILE!$G$9,MAX('MDA3'!I10,'MDA3'!L10,W10)),AND(AU10=0,AV10>0,AW10>0,AX10>0),MIN(J10*PROFILE!$G$9,MAX('MDA3'!I10,'MDA3'!L10,W10,AL10)),AND(AU10>0,AV10=0,AW10=0,AX10=0),MIN(BA10,MAX('MDA1'!K10,'MDA2'!K10,'MDA5'!K10)),AND(AU10>0,AV10=0,AW10=0,AX10>0),MIN(BA10,MAX('MDA1'!K10,'MDA2'!K10,'MDA5'!K10,AL10)),AND(AU10>0,AV10=0,AW10>0,AX10=0),MIN(BA10,MAX('MDA1'!K10,'MDA2'!KL10,'MDA5'!K10,W10)),AND(AU10>0,AV10=0,AW10>0,AX10>0),MIN(BA10,MAX('MDA1'!K10,'MDA2'!K10,'MDA5'!K10,W10,AL10)),AND(AU10>0,AV10>0,AW10=0,AX10=0),MIN(BA10,MAX('MDA1'!K10,'MDA2'!K10,'MDA5'!K10,MAX('MDA3'!I10,'MDA3'!L10))),AND(AU10>0,AV10>0,AW10=0,AX10>0),MIN(BA10,MAX('MDA1'!K10,'MDA2'!K10,'MDA5'!K10,MAX('MDA3'!I10,'MDA3'!L10),AL10)),AND(AU10>0,AV10>0,AW10>0,AX10=0),MIN(BA10,MAX('MDA1'!K10,'MDA2'!K10,'MDA5'!K10,MAX('MDA3'!I10,'MDA3'!L10),W10)),AND(AU10>0,AV10>0,AW10>0,AX10>0),MIN(BA10,MAX('MDA1'!K10,'MDA2'!K10,'MDA5'!K10,MAX('MDA3'!I10,'MDA3'!L10),W10,AL10)))","v":36866},{"$f":"_xlfn.IFS(AND(AU10=0,AV10=0,AW10=0,AX10=0),0,AND(AU10=0,AV10=0,AW10=0,AX10>0),AO10,AND(AU10=0,AV10=0,AW10>0,AX10=0),Z10,AND(AU10=0,AV10=0,AW10>0,AX10>0),MAX(Z10,AO10),AND(AU10=0,AV10>0,AW10=0,AX10=0),MIN(J10*PROFILE!$G$10,MAX('MDA3'!J10,'MDA3'!J10)),AND(AU10=0,AV10>0,AW10=0,AX10>0),MIN(J10*PROFILE!$G$10,MAX('MDA3'!J10,'MDA3'!M10,AO10)),AND(AU10=0,AV10>0,AW10>0,AX10=0),MIN(J10*PROFILE!$G$10,MAX('MDA3'!J10,'MDA3'!M10,Z10)),AND(AU10=0,AV10>0,AW10>0,AX10>0),MIN(J10*PROFILE!$G$10,MAX('MDA3'!J10,'MDA3'!M10,Z10,AO10)),AND(AU10>0,AV10=0,AW10=0,AX10=0),MIN(BB10,MAX('MDA1'!L10,'MDA2'!L10,'MDA5'!L10)),AND(AU10>0,AV10=0,AW10=0,AX10>0),MIN(BB10,MAX('MDA1'!L10,'MDA2'!L10,'MDA5'!L10,AO10)),AND(AU10>0,AV10=0,AW10>0,AX10=0),MIN(BB10,MAX('MDA1'!L10,'MDA2'!L10,'MDA5'!L10,Z10)),AND(AU10>0,AV10=0,AW10>0,AX10>0),MIN(BB10,MAX('MDA1'!L10,'MDA2'!L10,'MDA5'!L10,Z10,AO10)),AND(AU10>0,AV10>0,AW10=0,AX10=0),MIN(BB10,MAX('MDA1'!L10,'MDA2'!L10,'MDA5'!L10,MAX('MDA3'!J10,'MDA3'!M10))),AND(AU10>0,AV10>0,AW10=0,AX10>0),MIN(BB10,MAX('MDA1'!L10,'MDA2'!L10,'MDA5'!L10,MAX('MDA3'!J10,'MDA3'!M10),AO10)),AND(AU10>0,AV10>0,AW10>0,AX10=0),MIN(BB10,MAX('MDA1'!L10,'MDA2'!L10,'MDA5'!L10,MAX('MDA3'!J10,'MDA3'!M10),Z10)),AND(AU10>0,AV10>0,AW10>0,AX10>0),MIN(BB10,MAX('MDA1'!L10,'MDA2'!L10,'MDA5'!L10,MAX('MDA3'!J10,'MDA3'!M10),Z10,AO10)))","v":73886},{"$f":"SUM(BI10:BK10)","v":121470},{"$f":"IF(BC10<>0,BL10/BC10*100,0)","v":89.09510797894}]
[{"$f":"IF(COUNTRY_INFO!A11=0,\" \",COUNTRY_INFO!A11)","v":"Zanzibar"},{"$f":"IF(COUNTRY_INFO!B11=0,\" \",COUNTRY_INFO!B11)","v":"Kaskazini Unguja"},{"$f":"IF(COUNTRY_INFO!C11=0,\" \",COUNTRY_INFO!C11)","v":"Kaskazini B"},{"$f":"COUNTRY_INFO!L11","v":108269},null,null,{"$f":"MAX('MDA1'!M11,'MDA2'!M11,'MDA5'!M11)","v":66725},{"$f":"IF(AND(COUNTRY_INFO!H11>0,COUNTRY_INFO!H11<4),IF(D11>G11,G11,D11),0)","v":66725},{"$f":"IF(AND(COUNTRY_INFO!H11>0,COUNTRY_INFO!H11<4),IF(G11/D11*100<>0,IF(G11/D11*100>100,100,G11/D11*100),\"-\"),0)","v":61.6289057809715},{"$f":"COUNTRY_INFO!M11","v":"Not required"},null,null,{"$f":"MAX('MDA1'!M11,MAX('MDA3'!I11,'MDA3'!L11)+MAX('MDA3'!J11,'MDA3'!M11))","v":66725},{"$f":"IF(AND(COUNTRY_INFO!I11>0,COUNTRY_INFO!I11<4),IF(J11>M11,M11,J11),0)","v":0},{"$f":"IF(AND(COUNTRY_INFO!I11>0,COUNTRY_INFO!I11<4),IF(M11/J11*100<>0,IF(M11/J11*100>100,100,M11/J11*100),\"-\"),0)","v":0},{"$f":"COUNTRY_INFO!Q11","v":69519},null,null,{"$f":"MAX('MDA2'!J11,'MDA5'!J11,'T1'!K11,MAX(T3_R1!J11,T3_R2!J11,T3_R3!J11))","v":5994},{"$f":"IF(AND(COUNTRY_INFO!J11>1,COUNTRY_INFO!J11<99,COUNTRY_INFO!J11<>4,COUNTRY_INFO!J11<>5),IF(COUNTRY_INFO!N11>S11,S11,COUNTRY_INFO!N11),0)","v":5994},{"$f":"IF(AND(COUNTRY_INFO!J11>1,COUNTRY_INFO!J11<99,COUNTRY_INFO!J11<>4,COUNTRY_INFO!J11<>5),IF(T11/COUNTRY_INFO!N11*100<>0,IF(T11/COUNTRY_INFO!N11*100>100,100,T11/COUNTRY_INFO!N11*100),\"-\"),0)","v":42.2946655376799},{"$f":"MAX('MDA1'!K11,'MDA2'!K11,'MDA5'!K11,'T1'!L11,MAX(T3_R1!K11,T3_R2!K11,T3_R3!K11))","v":22057},{"$f":"IF(AND(COUNTRY_INFO!J11>1,COUNTRY_INFO!J11<99,COUNTRY_INFO!J11<>4,COUNTRY_INFO!J11<>5),IF(COUNTRY_INFO!O11>V11,V11,COUNTRY_INFO!O11),0)","v":22057},{"$f":"IF(AND(COUNTRY_INFO!J11>1,COUNTRY_INFO!J11<99,COUNTRY_INFO!J11<>4,COUNTRY_INFO!J11<>5),IF(W11/COUNTRY_INFO!O11*100<>0,IF(W11/COUNTRY_INFO!O11*100>100,100,W11/COUNTRY_INFO!O11*100),\"-\"),0)","v":75.3415767181309},{"$f":"MAX('MDA1'!L11,'MDA2'!L11,'MDA5'!L11,'T1'!M11,MAX(T3_R1!L11,T3_R2!L11,T3_R3!L11))","v":44668},{"$f":"IF(AND(COUNTRY_INFO!J11>1,COUNTRY_INFO!J11<99,COUNTRY_INFO!J11<>4,COUNTRY_INFO!J11<>5),IF(COUNTRY_INFO!P11>Y11,Y11,COUNTRY_INFO!P11),0)","v":26071},{"$f":"IF(AND(COUNTRY_INFO!J11>1,COUNTRY_INFO!J11<99,COUNTRY_INFO!J11<>4,COUNTRY_INFO!J11<>5),IF(Z11/COUNTRY_INFO!P11*100<>0,IF(Z11/COUNTRY_INFO!P11*100>100,100,Z11/COUNTRY_INFO!P11*100),\"-\"),0)","v":100},{"$f":"SUM(S11,V11,Y11)","v":72719},{"$f":"SUM(T11,W11,Z11)","v":54122},{"$f":"IF(AND(COUNTRY_INFO!J11>1,COUNTRY_INFO!J11<99,COUNTRY_INFO!J11<>4,COUNTRY_INFO!J11<>5),IF(AC11/P11*100<>0,IF(AC11/P11*100>100,100,AC11/P11*100),\"-\"),0)","v":77.8520979876005},{"$f":"COUNTRY_INFO!U11","v":100958},null,null,{"$f":"MAX('T1'!K11,'T2'!R11)","v":6736},{"$f":"IF(AND(COUNTRY_INFO!K11>1,COUNTRY_INFO!K11<99,COUNTRY_INFO!K11<>4,COUNTRY_INFO!K11<>5),IF(COUNTRY_INFO!R11>AH11,AH11,COUNTRY_INFO!R11),0)","v":6736},{"$f":"IF(AND(COUNTRY_INFO!K11>1,COUNTRY_INFO!K11<99,COUNTRY_INFO!K11<>4,COUNTRY_INFO!K11<>5),IF(AI11/COUNTRY_INFO!R11*100<>0,IF(AI11/COUNTRY_INFO!R11*100>100,100,AI11/COUNTRY_INFO!R11*100),\"-\"),0)","v":63.3737886913162},{"$f":"MAX('T1'!L11,'T2'!S11)","v":25898},{"$f":"IF(AND(COUNTRY_INFO!K11>1,COUNTRY_INFO!K11<99,COUNTRY_INFO!K11<>4,COUNTRY_INFO!K11<>5),IF(COUNTRY_INFO!S11>AK11,AK11,COUNTRY_INFO!S11),0)","v":25898},{"$f":"IF(AND(COUNTRY_INFO!K11>1,COUNTRY_INFO!K11<99,COUNTRY_INFO!K11<>4,COUNTRY_INFO!K11<>5),IF(AL11/COUNTRY_INFO!S11*100<>0,IF(AL11/COUNTRY_INFO!S11*100>100,100,AL11/COUNTRY_INFO!S11*100),\"-\"),0)","v":88.4615384615385},{"$f":"MAX('T1'!M11,'T2'!T11)","v":47766},{"$f":"IF(AND(COUNTRY_INFO!K11>1,COUNTRY_INFO!K11<99,COUNTRY_INFO!K11<>4,COUNTRY_INFO!K11<>5),IF(COUNTRY_INFO!T11>AN11,AN11,COUNTRY_INFO!T11),0)","v":47766},{"$f":"IF(AND(COUNTRY_INFO!K11>1,COUNTRY_INFO!K11<99,COUNTRY_INFO!K11<>4,COUNTRY_INFO!K11<>5),IF(AO11/COUNTRY_INFO!T11*100<>0,IF(AO11/COUNTRY_INFO!T11*100>100,100,AO11/COUNTRY_INFO!T11*100),\"-\"),0)","v":78.2369416736278},{"$f":"SUM(AH11,AK11,AN11)","v":80400},{"$f":"SUM(AI11,AL11,AO11)","v":80400},{"$f":"IF(AND(COUNTRY_INFO!K11>1,COUNTRY_INFO!K11<99,COUNTRY_INFO!K11<>4,COUNTRY_INFO!K11<>5),IF(AH11/AE11*100<>0,IF(AR11/AE11*100>100,100,AR11/AE11*100),\"-\"),0)","v":79.6370768042156},null,{"$f":"IF(AND(D11<>0,D11<>\"Unknown\",D11<>\"Stopped\",D11<>\"Not required\"),D11/COUNTRY_INFO!D11,0)","v":1},{"$f":"IF(AND(J11<>0,J11<>\"Unknown\",J11<>\"Stopped\",J11<>\"Not required\"),J11/COUNTRY_INFO!D11,0)","v":0},{"$f":"IF(AND(P11<>0,P11<>\"Unknown\",P11<>\"Surveillance\",P11<>\"Not required\"),P11/COUNTRY_INFO!Q11,0)","v":1},{"$f":"IF(AND(AE11<>0,AE11<>\"Unknown\",AE11<>\"Surveillance\",AE11<>\"Not required\"),AE11/COUNTRY_INFO!U11,0)","v":1},{"$f":"IF(AU11>0,D11*PROFILE!$G$7,IF(AV11>0,J11*PROFILE!$G$7,0))","v":3767.70109696913},{"$f":"_xlfn.IFS(OR(AU11>0,AW11>0),COUNTRY_INFO!E11,AV11>0,J11*PROFILE!$G$8,AX11>0,COUNTRY_INFO!R11,COUNTIFS(AU11:AX11,\">0\")=0,0)","v":14172},{"$f":"_xlfn.IFS(OR(AU11>0,AW11>0),COUNTRY_INFO!F11,AV11>0,J11*PROFILE!$G$9,AX11>0,COUNTRY_INFO!S11,COUNTIFS(AU11:AX11,\">0\")=0,0)","v":29276},{"$f":"_xlfn.IFS(AU11>0,COUNTRY_INFO!G11,AND(AV11>0,AW11=0,AX11=0),J11*PROFILE!$G$10,AND(AV11>0,AW11>0,AX11=0),MAX(J11*PROFILE!$G$10,COUNTRY_INFO!P11),AND(AV11>0,AW11=0,AX11>0),MAX(J11*PROFILE!$G$10,COUNTRY_INFO!T11),AND(AV11=0,AW11>0,AX11>0),MAX(COUNTRY_INFO!P11,COUNTRY_INFO!T11),AND(AV11=0,AW11>0,AX11=0),COUNTRY_INFO!P11,AND(AV11=0,AW11=0,AX11>0),COUNTRY_INFO!T11,AND(AV11>0,AW11>0,AX11>0),MAX(J11*PROFILE!$G$10,COUNTRY_INFO!P11,COUNTRY_INFO!T11),COUNTIFS(AU11:AX11,\">0\")=0,0)","v":61053},{"$f":"SUM(AY11:BB11)","v":108268.701096969},{"$f":"IF(COUNTIFS(AU11:AX11,\">0\")=0,0,IF(COUNTIFS(AU11:AX11,\">0\")<=IF(AND(OR(D11>=0,D11=\"Not required\",D11=\"Unknown\",D11=\"Stopped\"),D11>0,H11>0),1,0)+IF(AND(OR(J11>=0,J11=\"Not required\",J11=\"Unknown\",J11=\"Stopped\"),J11>0,N11>0),1,0)+IF(AND(OR(P11>=0,P11=\"Not required\",P11=\"Surveillance\",P11=\"Unknown\"),P11>0,AC11>0),1,0)+IF(AND(OR(AE11>=0,AE11=\"Not required\",AE11=\"Surveillance\",AE11=\"Unknown\"),AE11>0,AR11>0),1,0),\"Y\",0))","v":"Y"},{"$f":"MAX('MDA2'!J11,'MDA5'!J11,S11,AH11)","v":6736},{"$f":"MAX('MDA1'!K11,'MDA2'!K11,'MDA3'!I11,'MDA3'!L11,'MDA5'!K11,V11,AK11)","v":25898},{"$f":"MAX('MDA1'!L11,'MDA2'!L11,'MDA3'!J11,'MDA3'!M11,'MDA5'!L11,Y11,AN11)","v":47766},{"$f":"SUM(BE11:BG11)","v":80400},{"$f":"_xlfn.IFS(AND(AU11=0,AW11=0,AX11=0),0,AND(AU11=0,AW11=0,AX11>0),AI11,AND(AU11=0,AW11>0,AX11=0),T11,AND(AU11=0,AW11>0,AX11>0),MAX(T11,AI11),AND(AU11>0,AW11=0,AX11=0),MIN(MAX('MDA2'!J11,'MDA5'!J11),AZ11),AND(AU11>0,AW11=0,AX11>0),MIN(MAX('MDA2'!J11,'MDA5'!J11,AI11),AZ11),AND(AU11>0,AW11>0,AX11=0),MIN(MAX('MDA2'!J11,'MDA5'!J11,T11),AZ11),AND(AU11>0,AW11>0,AX11>0),MIN(MAX('MDA2'!J11,'MDA5'!J11,AI11,T11),AZ11))","v":6736},{"$f":"_xlfn.IFS(AND(AU11=0,AV11=0,AW11=0,AX11=0),0,AND(AU11=0,AV11=0,AW11=0,AX11>0),AL11,AND(AU11=0,AV11=0,AW11>0,AX11=0),W11,AND(AU11=0,AV11=0,AW11>0,AX11>0),MAX(W11,AL11),AND(AU11=0,AV11>0,AW11=0,AX11=0),MIN(J11*PROFILE!$G$9,MAX('MDA3'!I11,'MDA3'!L11)),AND(AU11=0,AV11>0,AW11=0,AX11>0),MIN(J11*PROFILE!$G$9,MAX('MDA3'!I11,'MDA3'!L11,AL11)),AND(AU11=0,AV11>0,AW11>0,AX11=0),MIN(J11*PROFILE!$G$9,MAX('MDA3'!I11,'MDA3'!L11,W11)),AND(AU11=0,AV11>0,AW11>0,AX11>0),MIN(J11*PROFILE!$G$9,MAX('MDA3'!I11,'MDA3'!L11,W11,AL11)),AND(AU11>0,AV11=0,AW11=0,AX11=0),MIN(BA11,MAX('MDA1'!K11,'MDA2'!K11,'MDA5'!K11)),AND(AU11>0,AV11=0,AW11=0,AX11>0),MIN(BA11,MAX('MDA1'!K11,'MDA2'!K11,'MDA5'!K11,AL11)),AND(AU11>0,AV11=0,AW11>0,AX11=0),MIN(BA11,MAX('MDA1'!K11,'MDA2'!KL11,'MDA5'!K11,W11)),AND(AU11>0,AV11=0,AW11>0,AX11>0),MIN(BA11,MAX('MDA1'!K11,'MDA2'!K11,'MDA5'!K11,W11,AL11)),AND(AU11>0,AV11>0,AW11=0,AX11=0),MIN(BA11,MAX('MDA1'!K11,'MDA2'!K11,'MDA5'!K11,MAX('MDA3'!I11,'MDA3'!L11))),AND(AU11>0,AV11>0,AW11=0,AX11>0),MIN(BA11,MAX('MDA1'!K11,'MDA2'!K11,'MDA5'!K11,MAX('MDA3'!I11,'MDA3'!L11),AL11)),AND(AU11>0,AV11>0,AW11>0,AX11=0),MIN(BA11,MAX('MDA1'!K11,'MDA2'!K11,'MDA5'!K11,MAX('MDA3'!I11,'MDA3'!L11),W11)),AND(AU11>0,AV11>0,AW11>0,AX11>0),MIN(BA11,MAX('MDA1'!K11,'MDA2'!K11,'MDA5'!K11,MAX('MDA3'!I11,'MDA3'!L11),W11,AL11)))","v":25898},{"$f":"_xlfn.IFS(AND(AU11=0,AV11=0,AW11=0,AX11=0),0,AND(AU11=0,AV11=0,AW11=0,AX11>0),AO11,AND(AU11=0,AV11=0,AW11>0,AX11=0),Z11,AND(AU11=0,AV11=0,AW11>0,AX11>0),MAX(Z11,AO11),AND(AU11=0,AV11>0,AW11=0,AX11=0),MIN(J11*PROFILE!$G$10,MAX('MDA3'!J11,'MDA3'!J11)),AND(AU11=0,AV11>0,AW11=0,AX11>0),MIN(J11*PROFILE!$G$10,MAX('MDA3'!J11,'MDA3'!M11,AO11)),AND(AU11=0,AV11>0,AW11>0,AX11=0),MIN(J11*PROFILE!$G$10,MAX('MDA3'!J11,'MDA3'!M11,Z11)),AND(AU11=0,AV11>0,AW11>0,AX11>0),MIN(J11*PROFILE!$G$10,MAX('MDA3'!J11,'MDA3'!M11,Z11,AO11)),AND(AU11>0,AV11=0,AW11=0,AX11=0),MIN(BB11,MAX('MDA1'!L11,'MDA2'!L11,'MDA5'!L11)),AND(AU11>0,AV11=0,AW11=0,AX11>0),MIN(BB11,MAX('MDA1'!L11,'MDA2'!L11,'MDA5'!L11,AO11)),AND(AU11>0,AV11=0,AW11>0,AX11=0),MIN(BB11,MAX('MDA1'!L11,'MDA2'!L11,'MDA5'!L11,Z11)),AND(AU11>0,AV11=0,AW11>0,AX11>0),MIN(BB11,MAX('MDA1'!L11,'MDA2'!L11,'MDA5'!L11,Z11,AO11)),AND(AU11>0,AV11>0,AW11=0,AX11=0),MIN(BB11,MAX('MDA1'!L11,'MDA2'!L11,'MDA5'!L11,MAX('MDA3'!J11,'MDA3'!M11))),AND(AU11>0,AV11>0,AW11=0,AX11>0),MIN(BB11,MAX('MDA1'!L11,'MDA2'!L11,'MDA5'!L11,MAX('MDA3'!J11,'MDA3'!M11),AO11)),AND(AU11>0,AV11>0,AW11>0,AX11=0),MIN(BB11,MAX('MDA1'!L11,'MDA2'!L11,'MDA5'!L11,MAX('MDA3'!J11,'MDA3'!M11),Z11)),AND(AU11>0,AV11>0,AW11>0,AX11>0),MIN(BB11,MAX('MDA1'!L11,'MDA2'!L11,'MDA5'!L11,MAX('MDA3'!J11,'MDA3'!M11),Z11,AO11)))","v":47766},{"$f":"SUM(BI11:BK11)","v":80400},{"$f":"IF(BC11<>0,BL11/BC11*100,0)","v":74.2596883359587}]
[{"$f":"IF(COUNTRY_INFO!A12=0,\" \",COUNTRY_INFO!A12)","v":"Zanzibar"},{"$f":"IF(COUNTRY_INFO!B12=0,\" \",COUNTRY_INFO!B12)","v":"Kusini Unguja"},{"$f":"IF(COUNTRY_INFO!C12=0,\" \",COUNTRY_INFO!C12)","v":"Kusini"},{"$f":"COUNTRY_INFO!L12","v":50318},null,null,{"$f":"MAX('MDA1'!M12,'MDA2'!M12,'MDA5'!M12)","v":37739},{"$f":"IF(AND(COUNTRY_INFO!H12>0,COUNTRY_INFO!H12<4),IF(D12>G12,G12,D12),0)","v":37739},{"$f":"IF(AND(COUNTRY_INFO!H12>0,COUNTRY_INFO!H12<4),IF(G12/D12*100<>0,IF(G12/D12*100>100,100,G12/D12*100),\"-\"),0)","v":75.000993680194},{"$f":"COUNTRY_INFO!M12","v":"Not required"},null,null,{"$f":"MAX('MDA1'!M12,MAX('MDA3'!I12,'MDA3'!L12)+MAX('MDA3'!J12,'MDA3'!M12))","v":37739},{"$f":"IF(AND(COUNTRY_INFO!I12>0,COUNTRY_INFO!I12<4),IF(J12>M12,M12,J12),0)","v":0},{"$f":"IF(AND(COUNTRY_INFO!I12>0,COUNTRY_INFO!I12<4),IF(M12/J12*100<>0,IF(M12/J12*100>100,100,M12/J12*100),\"-\"),0)","v":0},{"$f":"COUNTRY_INFO!Q12","v":32310},null,null,{"$f":"MAX('MDA2'!J12,'MDA5'!J12,'T1'!K12,MAX(T3_R1!J12,T3_R2!J12,T3_R3!J12))","v":2845},{"$f":"IF(AND(COUNTRY_INFO!J12>1,COUNTRY_INFO!J12<99,COUNTRY_INFO!J12<>4,COUNTRY_INFO!J12<>5),IF(COUNTRY_INFO!N12>S12,S12,COUNTRY_INFO!N12),0)","v":2845},{"$f":"IF(AND(COUNTRY_INFO!J12>1,COUNTRY_INFO!J12<99,COUNTRY_INFO!J12<>4,COUNTRY_INFO!J12<>5),IF(T12/COUNTRY_INFO!N12*100<>0,IF(T12/COUNTRY_INFO!N12*100>100,100,T12/COUNTRY_INFO!N12*100),\"-\"),0)","v":43.1911340519205},{"$f":"MAX('MDA1'!K12,'MDA2'!K12,'MDA5'!K12,'T1'!L12,MAX(T3_R1!K12,T3_R2!K12,T3_R3!K12))","v":13876},{"$f":"IF(AND(COUNTRY_INFO!J12>1,COUNTRY_INFO!J12<99,COUNTRY_INFO!J12<>4,COUNTRY_INFO!J12<>5),IF(COUNTRY_INFO!O12>V12,V12,COUNTRY_INFO!O12),0)","v":13606},{"$f":"IF(AND(COUNTRY_INFO!J12>1,COUNTRY_INFO!J12<99,COUNTRY_INFO!J12<>4,COUNTRY_INFO!J12<>5),IF(W12/COUNTRY_INFO!O12*100<>0,IF(W12/COUNTRY_INFO!O12*100>100,100,W12/COUNTRY_INFO!O12*100),\"-\"),0)","v":100},{"$f":"MAX('MDA1'!L12,'MDA2'!L12,'MDA5'!L12,'T1'!M12,MAX(T3_R1!L12,T3_R2!L12,T3_R3!L12))","v":23863},{"$f":"IF(AND(COUNTRY_INFO!J12>1,COUNTRY_INFO!J12<99,COUNTRY_INFO!J12<>4,COUNTRY_INFO!J12<>5),IF(COUNTRY_INFO!P12>Y12,Y12,COUNTRY_INFO!P12),0)","v":12117},{"$f":"IF(AND(COUNTRY_INFO!J12>1,COUNTRY_INFO!J12<99,COUNTRY_INFO!J12<>4,COUNTRY_INFO!J12<>5),IF(Z12/COUNTRY_INFO!P12*100<>0,IF(Z12/COUNTRY_INFO!P12*100>100,100,Z12/COUNTRY_INFO!P12*100),\"-\"),0)","v":100},40584,28568,{"$f":"IF(AND(COUNTRY_INFO!J12>1,COUNTRY_INFO!J12<99,COUNTRY_INFO!J12<>4,COUNTRY_INFO!J12<>5),IF(AC12/P12*100<>0,IF(AC12/P12*100>100,100,AC12/P12*100),\"-\"),0)","v":88.4184463014547},{"$f":"COUNTRY_INFO!U12","v":0},null,null,{"$f":"MAX('T1'!K12,'T2'!R12)","v":0},{"$f":"IF(AND(COUNTRY_INFO!K12>1,COUNTRY_INFO!K12<99,COUNTRY_INFO!K12<>4,COUNTRY_INFO!K12<>5),IF(COUNTRY_INFO!R12>AH12,AH12,COUNTRY_INFO!R12),0)","v":0},{"$f":"IF(AND(COUNTRY_INFO!K12>1,COUNTRY_INFO!K12<99,COUNTRY_INFO!K12<>4,COUNTRY_INFO!K12<>5),IF(AI12/COUNTRY_INFO!R12*100<>0,IF(AI12/COUNTRY_INFO!R12*100>100,100,AI12/COUNTRY_INFO!R12*100),\"-\"),0)","v":0},{"$f":"MAX('T1'!L12,'T2'!S12)","v":0},{"$f":"IF(AND(COUNTRY_INFO!K12>1,COUNTRY_INFO!K12<99,COUNTRY_INFO!K12<>4,COUNTRY_INFO!K12<>5),IF(COUNTRY_INFO!S12>AK12,AK12,COUNTRY_INFO!S12),0)","v":0},{"$f":"IF(AND(COUNTRY_INFO!K12>1,COUNTRY_INFO!K12<99,COUNTRY_INFO!K12<>4,COUNTRY_INFO!K12<>5),IF(AL12/COUNTRY_INFO!S12*100<>0,IF(AL12/COUNTRY_INFO!S12*100>100,100,AL12/COUNTRY_INFO!S12*100),\"-\"),0)","v":0},{"$f":"MAX('T1'!M12,'T2'!T12)","v":0},{"$f":"IF(AND(COUNTRY_INFO!K12>1,COUNTRY_INFO!K12<99,COUNTRY_INFO!K12<>4,COUNTRY_INFO!K12<>5),IF(COUNTRY_INFO!T12>AN12,AN12,COUNTRY_INFO!T12),0)","v":0},{"$f":"IF(AND(COUNTRY_INFO!K12>1,COUNTRY_INFO!K12<99,COUNTRY_INFO!K12<>4,COUNTRY_INFO!K12<>5),IF(AO12/COUNTRY_INFO!T12*100<>0,IF(AO12/COUNTRY_INFO!T12*100>100,100,AO12/COUNTRY_INFO!T12*100),\"-\"),0)","v":0},0,0,{"$f":"IF(AND(COUNTRY_INFO!K12>1,COUNTRY_INFO!K12<99,COUNTRY_INFO!K12<>4,COUNTRY_INFO!K12<>5),IF(AH12/AE12*100<>0,IF(AR12/AE12*100>100,100,AR12/AE12*100),\"-\"),0)","v":0},null,{"$f":"IF(AND(D12<>0,D12<>\"Unknown\",D12<>\"Stopped\",D12<>\"Not required\"),D12/COUNTRY_INFO!D12,0)","v":1},{"$f":"IF(AND(J12<>0,J12<>\"Unknown\",J12<>\"Stopped\",J12<>\"Not required\"),J12/COUNTRY_INFO!D12,0)","v":0},{"$f":"IF(AND(P12<>0,P12<>\"Unknown\",P12<>\"Surveillance\",P12<>\"Not required\"),P12/COUNTRY_INFO!Q12,0)","v":1},{"$f":"IF(AND(AE12<>0,AE12<>\"Unknown\",AE12<>\"Surveillance\",AE12<>\"Not required\"),AE12/COUNTRY_INFO!U12,0)","v":0},{"$f":"IF(AU12>0,D12*PROFILE!$G$7,IF(AV12>0,J12*PROFILE!$G$7,0))","v":1751.03846712626},{"$f":"_xlfn.IFS(OR(AU12>0,AW12>0),COUNTRY_INFO!E12,AV12>0,J12*PROFILE!$G$8,AX12>0,COUNTRY_INFO!R12,COUNTIFS(AU12:AX12,\">0\")=0,0)","v":6587},{"$f":"_xlfn.IFS(OR(AU12>0,AW12>0),COUNTRY_INFO!F12,AV12>0,J12*PROFILE!$G$9,AX12>0,COUNTRY_INFO!S12,COUNTIFS(AU12:AX12,\">0\")=0,0)","v":13606},{"$f":"_xlfn.IFS(AU12>0,COUNTRY_INFO!G12,AND(AV12>0,AW12=0,AX12=0),J12*PROFILE!$G$10,AND(AV12>0,AW12>0,AX12=0),MAX(J12*PROFILE!$G$10,COUNTRY_INFO!P12),AND(AV12>0,AW12=0,AX12>0),MAX(J12*PROFILE!$G$10,COUNTRY_INFO!T12),AND(AV12=0,AW12>0,AX12>0),MAX(COUNTRY_INFO!P12,COUNTRY_INFO!T12),AND(AV12=0,AW12>0,AX12=0),COUNTRY_INFO!P12,AND(AV12=0,AW12=0,AX12>0),COUNTRY_INFO!T12,AND(AV12>0,AW12>0,AX12>0),MAX(J12*PROFILE!$G$10,COUNTRY_INFO!P12,COUNTRY_INFO!T12),COUNTIFS(AU12:AX12,\">0\")=0,0)","v":28374},50318.0384671263,"Y",{"$f":"MAX('MDA2'!J12,'MDA5'!J12,S12,AH12)","v":2845},{"$f":"MAX('MDA1'!K12,'MDA2'!K12,'MDA3'!I12,'MDA3'!L12,'MDA5'!K12,V12,AK12)","v":13876},{"$f":"MAX('MDA1'!L12,'MDA2'!L12,'MDA3'!J12,'MDA3'!M12,'MDA5'!L12,Y12,AN12)","v":23863},40584,{"$f":"_xlfn.IFS(AND(AU12=0,AW12=0,AX12=0),0,AND(AU12=0,AW12=0,AX12>0),AI12,AND(AU12=0,AW12>0,AX12=0),T12,AND(AU12=0,AW12>0,AX12>0),MAX(T12,AI12),AND(AU12>0,AW12=0,AX12=0),MIN(MAX('MDA2'!J12,'MDA5'!J12),AZ12),AND(AU12>0,AW12=0,AX12>0),MIN(MAX('MDA2'!J12,'MDA5'!J12,AI12),AZ12),AND(AU12>0,AW12>0,AX12=0),MIN(MAX('MDA2'!J12,'MDA5'!J12,T12),AZ12),AND(AU12>0,AW12>0,AX12>0),MIN(MAX('MDA2'!J12,'MDA5'!J12,AI12,T12),AZ12))","v":2845},{"$f":"_xlfn.IFS(AND(AU12=0,AV12=0,AW12=0,AX12=0),0,AND(AU12=0,AV12=0,AW12=0,AX12>0),AL12,AND(AU12=0,AV12=0,AW12>0,AX12=0),W12,AND(AU12=0,AV12=0,AW12>0,AX12>0),MAX(W12,AL12),AND(AU12=0,AV12>0,AW12=0,AX12=0),MIN(J12*PROFILE!$G$9,MAX('MDA3'!I12,'MDA3'!L12)),AND(AU12=0,AV12>0,AW12=0,AX12>0),MIN(J12*PROFILE!$G$9,MAX('MDA3'!I12,'MDA3'!L12,AL12)),AND(AU12=0,AV12>0,AW12>0,AX12=0),MIN(J12*PROFILE!$G$9,MAX('MDA3'!I12,'MDA3'!L12,W12)),AND(AU12=0,AV12>0,AW12>0,AX12>0),MIN(J12*PROFILE!$G$9,MAX('MDA3'!I12,'MDA3'!L12,W12,AL12)),AND(AU12>0,AV12=0,AW12=0,AX12=0),MIN(BA12,MAX('MDA1'!K12,'MDA2'!K12,'MDA5'!K12)),AND(AU12>0,AV12=0,AW12=0,AX12>0),MIN(BA12,MAX('MDA1'!K12,'MDA2'!K12,'MDA5'!K12,AL12)),AND(AU12>0,AV12=0,AW12>0,AX12=0),MIN(BA12,MAX('MDA1'!K12,'MDA2'!KL12,'MDA5'!K12,W12)),AND(AU12>0,AV12=0,AW12>0,AX12>0),MIN(BA12,MAX('MDA1'!K12,'MDA2'!K12,'MDA5'!K12,W12,AL12)),AND(AU12>0,AV12>0,AW12=0,AX12=0),MIN(BA12,MAX('MDA1'!K12,'MDA2'!K12,'MDA5'!K12,MAX('MDA3'!I12,'MDA3'!L12))),AND(AU12>0,AV12>0,AW12=0,AX12>0),MIN(BA12,MAX('MDA1'!K12,'MDA2'!K12,'MDA5'!K12,MAX('MDA3'!I12,'MDA3'!L12),AL12)),AND(AU12>0,AV12>0,AW12>0,AX12=0),MIN(BA12,MAX('MDA1'!K12,'MDA2'!K12,'MDA5'!K12,MAX('MDA3'!I12,'MDA3'!L12),W12)),AND(AU12>0,AV12>0,AW12>0,AX12>0),MIN(BA12,MAX('MDA1'!K12,'MDA2'!K12,'MDA5'!K12,MAX('MDA3'!I12,'MDA3'!L12),W12,AL12)))","v":13606},{"$f":"_xlfn.IFS(AND(AU12=0,AV12=0,AW12=0,AX12=0),0,AND(AU12=0,AV12=0,AW12=0,AX12>0),AO12,AND(AU12=0,AV12=0,AW12>0,AX12=0),Z12,AND(AU12=0,AV12=0,AW12>0,AX12>0),MAX(Z12,AO12),AND(AU12=0,AV12>0,AW12=0,AX12=0),MIN(J12*PROFILE!$G$10,MAX('MDA3'!J12,'MDA3'!J12)),AND(AU12=0,AV12>0,AW12=0,AX12>0),MIN(J12*PROFILE!$G$10,MAX('MDA3'!J12,'MDA3'!M12,AO12)),AND(AU12=0,AV12>0,AW12>0,AX12=0),MIN(J12*PROFILE!$G$10,MAX('MDA3'!J12,'MDA3'!M12,Z12)),AND(AU12=0,AV12>0,AW12>0,AX12>0),MIN(J12*PROFILE!$G$10,MAX('MDA3'!J12,'MDA3'!M12,Z12,AO12)),AND(AU12>0,AV12=0,AW12=0,AX12=0),MIN(BB12,MAX('MDA1'!L12,'MDA2'!L12,'MDA5'!L12)),AND(AU12>0,AV12=0,AW12=0,AX12>0),MIN(BB12,MAX('MDA1'!L12,'MDA2'!L12,'MDA5'!L12,AO12)),AND(AU12>0,AV12=0,AW12>0,AX12=0),MIN(BB12,MAX('MDA1'!L12,'MDA2'!L12,'MDA5'!L12,Z12)),AND(AU12>0,AV12=0,AW12>0,AX12>0),MIN(BB12,MAX('MDA1'!L12,'MDA2'!L12,'MDA5'!L12,Z12,AO12)),AND(AU12>0,AV12>0,AW12=0,AX12=0),MIN(BB12,MAX('MDA1'!L12,'MDA2'!L12,'MDA5'!L12,MAX('MDA3'!J12,'MDA3'!M12))),AND(AU12>0,AV12>0,AW12=0,AX12>0),MIN(BB12,MAX('MDA1'!L12,'MDA2'!L12,'MDA5'!L12,MAX('MDA3'!J12,'MDA3'!M12),AO12)),AND(AU12>0,AV12>0,AW12>0,AX12=0),MIN(BB12,MAX('MDA1'!L12,'MDA2'!L12,'MDA5'!L12,MAX('MDA3'!J12,'MDA3'!M12),Z12)),AND(AU12>0,AV12>0,AW12>0,AX12>0),MIN(BB12,MAX('MDA1'!L12,'MDA2'!L12,'MDA5'!L12,MAX('MDA3'!J12,'MDA3'!M12),Z12,AO12)))","v":23863},40314,80.1183854301831]
[{"$f":"IF(COUNTRY_INFO!A13=0,\" \",COUNTRY_INFO!A13)","v":"Zanzibar"},{"$f":"IF(COUNTRY_INFO!B13=0,\" \",COUNTRY_INFO!B13)","v":"Kusini Unguja"},{"$f":"IF(COUNTRY_INFO!C13=0,\" \",COUNTRY_INFO!C13)","v":"Kati"},{"$f":"COUNTRY_INFO!L13","v":94714},null,null,{"$f":"MAX('MDA1'!M13,'MDA2'!M13,'MDA5'!M13)","v":78071},{"$f":"IF(AND(COUNTRY_INFO!H13>0,COUNTRY_INFO!H13<4),IF(D13>G13,G13,D13),0)","v":78071},{"$f":"IF(AND(COUNTRY_INFO!H13>0,COUNTRY_INFO!H13<4),IF(G13/D13*100<>0,IF(G13/D13*100>100,100,G13/D13*100),\"-\"),0)","v":82.4281521211225},{"$f":"COUNTRY_INFO!M13","v":"Not required"},null,null,{"$f":"MAX('MDA1'!M13,MAX('MDA3'!I13,'MDA3'!L13)+MAX('MDA3'!J13,'MDA3'!M13))","v":78071},{"$f":"IF(AND(COUNTRY_INFO!I13>0,COUNTRY_INFO!I13<4),IF(J13>M13,M13,J13),0)","v":0},{"$f":"IF(AND(COUNTRY_INFO!I13>0,COUNTRY_INFO!I13<4),IF(M13/J13*100<>0,IF(M13/J13*100>100,100,M13/J13*100),\"-\"),0)","v":0},{"$f":"COUNTRY_INFO!Q13","v":60816},null,null,{"$f":"MAX('MDA2'!J13,'MDA5'!J13,'T1'!K13,MAX(T3_R1!J13,T3_R2!J13,T3_R3!J13))","v":7161},{"$f":"IF(AND(COUNTRY_INFO!J13>1,COUNTRY_INFO!J13<99,COUNTRY_INFO!J13<>4,COUNTRY_INFO!J13<>5),IF(COUNTRY_INFO!N13>S13,S13,COUNTRY_INFO!N13),0)","v":7161},{"$f":"IF(AND(COUNTRY_INFO!J13>1,COUNTRY_INFO!J13<99,COUNTRY_INFO!J13<>4,COUNTRY_INFO!J13<>5),IF(T13/COUNTRY_INFO!N13*100<>0,IF(T13/COUNTRY_INFO!N13*100>100,100,T13/COUNTRY_INFO!N13*100),\"-\"),0)","v":57.7593160187127},{"$f":"MAX('MDA1'!K13,'MDA2'!K13,'MDA5'!K13,'T1'!L13,MAX(T3_R1!K13,T3_R2!K13,T3_R3!K13))","v":33243},{"$f":"IF(AND(COUNTRY_INFO!J13>1,COUNTRY_INFO!J13<99,COUNTRY_INFO!J13<>4,COUNTRY_INFO!J13<>5),IF(COUNTRY_INFO!O13>V13,V13,COUNTRY_INFO!O13),0)","v":25611},{"$f":"IF(AND(COUNTRY_INFO!J13>1,COUNTRY_INFO!J13<99,COUNTRY_INFO!J13<>4,COUNTRY_INFO!J13<>5),IF(W13/COUNTRY_INFO!O13*100<>0,IF(W13/COUNTRY_INFO!O13*100>100,100,W13/COUNTRY_INFO!O13*100),\"-\"),0)","v":100},{"$f":"MAX('MDA1'!L13,'MDA2'!L13,'MDA5'!L13,'T1'!M13,MAX(T3_R1!L13,T3_R2!L13,T3_R3!L13))","v":44828},{"$f":"IF(AND(COUNTRY_INFO!J13>1,COUNTRY_INFO!J13<99,COUNTRY_INFO!J13<>4,COUNTRY_INFO!J13<>5),IF(COUNTRY_INFO!P13>Y13,Y13,COUNTRY_INFO!P13),0)","v":22807},{"$f":"IF(AND(COUNTRY_INFO!J13>1,COUNTRY_INFO!J13<99,COUNTRY_INFO!J13<>4,COUNTRY_INFO!J13<>5),IF(Z13/COUNTRY_INFO!P13*100<>0,IF(Z13/COUNTRY_INFO!P13*100>100,100,Z13/COUNTRY_INFO!P13*100),\"-\"),0)","v":100},85232,55579,{"$f":"IF(AND(COUNTRY_INFO!J13>1,COUNTRY_INFO!J13<99,COUNTRY_INFO!J13<>4,COUNTRY_INFO!J13<>5),IF(AC13/P13*100<>0,IF(AC13/P13*100>100,100,AC13/P13*100),\"-\"),0)","v":91.3887792686135},{"$f":"COUNTRY_INFO!U13","v":88319},null,null,{"$f":"MAX('T1'!K13,'T2'!R13)","v":7169},{"$f":"IF(AND(COUNTRY_INFO!K13>1,COUNTRY_INFO!K13<99,COUNTRY_INFO!K13<>4,COUNTRY_INFO!K13<>5),IF(COUNTRY_INFO!R13>AH13,AH13,COUNTRY_INFO!R13),0)","v":7169},{"$f":"IF(AND(COUNTRY_INFO!K13>1,COUNTRY_INFO!K13<99,COUNTRY_INFO!K13<>4,COUNTRY_INFO!K13<>5),IF(AI13/COUNTRY_INFO!R13*100<>0,IF(AI13/COUNTRY_INFO!R13*100>100,100,AI13/COUNTRY_INFO!R13*100),\"-\"),0)","v":77.0943112162598},{"$f":"MAX('T1'!L13,'T2'!S13)","v":33284},{"$f":"IF(AND(COUNTRY_INFO!K13>1,COUNTRY_INFO!K13<99,COUNTRY_INFO!K13<>4,COUNTRY_INFO!K13<>5),IF(COUNTRY_INFO!S13>AK13,AK13,COUNTRY_INFO!S13),0)","v":25611},{"$f":"IF(AND(COUNTRY_INFO!K13>1,COUNTRY_INFO!K13<99,COUNTRY_INFO!K13<>4,COUNTRY_INFO!K13<>5),IF(AL13/COUNTRY_INFO!S13*100<>0,IF(AL13/COUNTRY_INFO!S13*100>100,100,AL13/COUNTRY_INFO!S13*100),\"-\"),0)","v":100},{"$f":"MAX('T1'!M13,'T2'!T13)","v":43923},{"$f":"IF(AND(COUNTRY_INFO!K13>1,COUNTRY_INFO!K13<99,COUNTRY_INFO!K13<>4,COUNTRY_INFO!K13<>5),IF(COUNTRY_INFO!T13>AN13,AN13,COUNTRY_INFO!T13),0)","v":43923},{"$f":"IF(AND(COUNTRY_INFO!K13>1,COUNTRY_INFO!K13<99,COUNTRY_INFO!K13<>4,COUNTRY_INFO!K13<>5),IF(AO13/COUNTRY_INFO!T13*100<>0,IF(AO13/COUNTRY_INFO!T13*100>100,100,AO13/COUNTRY_INFO!T13*100),\"-\"),0)","v":82.2389484918272},84376,76703,{"$f":"IF(AND(COUNTRY_INFO!K13>1,COUNTRY_INFO!K13<99,COUNTRY_INFO!K13<>4,COUNTRY_INFO!K13<>5),IF(AH13/AE13*100<>0,IF(AR13/AE13*100>100,100,AR13/AE13*100),\"-\"),0)","v":86.8476771702578},null,{"$f":"IF(AND(D13<>0,D13<>\"Unknown\",D13<>\"Stopped\",D13<>\"Not required\"),D13/COUNTRY_INFO!D13,0)","v":1},{"$f":"IF(AND(J13<>0,J13<>\"Unknown\",J13<>\"Stopped\",J13<>\"Not required\"),J13/COUNTRY_INFO!D13,0)","v":0},{"$f":"IF(AND(P13<>0,P13<>\"Unknown\",P13<>\"Surveillance\",P13<>\"Not required\"),P13/COUNTRY_INFO!Q13,0)","v":1},{"$f":"IF(AND(AE13<>0,AE13<>\"Unknown\",AE13<>\"Surveillance\",AE13<>\"Not required\"),AE13/COUNTRY_INFO!U13,0)","v":1},{"$f":"IF(AU13>0,D13*PROFILE!$G$7,IF(AV13>0,J13*PROFILE!$G$7,0))","v":3295.99462171383},{"$f":"_xlfn.IFS(OR(AU13>0,AW13>0),COUNTRY_INFO!E13,AV13>0,J13*PROFILE!$G$8,AX13>0,COUNTRY_INFO!R13,COUNTIFS(AU13:AX13,\">0\")=0,0)","v":12398},{"$f":"_xlfn.IFS(OR(AU13>0,AW13>0),COUNTRY_INFO!F13,AV13>0,J13*PROFILE!$G$9,AX13>0,COUNTRY_INFO!S13,COUNTIFS(AU13:AX13,\">0\")=0,0)","v":25611},{"$f":"_xlfn.IFS(AU13>0,COUNTRY_INFO!G13,AND(AV13>0,AW13=0,AX13=0),J13*PROFILE!$G$10,AND(AV13>0,AW13>0,AX13=0),MAX(J13*PROFILE!$G$10,COUNTRY_INFO!P13),AND(AV13>0,AW13=0,AX13>0),MAX(J13*PROFILE!$G$10,COUNTRY_INFO!T13),AND(AV13=0,AW13>0,AX13>0),MAX(COUNTRY_INFO!P13,COUNTRY_INFO!T13),AND(AV13=0,AW13>0,AX13=0),COUNTRY_INFO!P13,AND(AV13=0,AW13=0,AX13>0),COUNTRY_INFO!T13,AND(AV13>0,AW13>0,AX13>0),MAX(J13*PROFILE!$G$10,COUNTRY_INFO!P13,COUNTRY_INFO!T13),COUNTIFS(AU13:AX13,\">0\")=0,0)","v":53409},94713.9946217138,"Y",{"$f":"MAX('MDA2'!J13,'MDA5'!J13,S13,AH13)","v":7169},{"$f":"MAX('MDA1'!K13,'MDA2'!K13,'MDA3'!I13,'MDA3'!L13,'MDA5'!K13,V13,AK13)","v":33284},{"$f":"MAX('MDA1'!L13,'MDA2'!L13,'MDA3'!J13,'MDA3'!M13,'MDA5'!L13,Y13,AN13)","v":44828},85281,{"$f":"_xlfn.IFS(AND(AU13=0,AW13=0,AX13=0),0,AND(AU13=0,AW13=0,AX13>0),AI13,AND(AU13=0,AW13>0,AX13=0),T13,AND(AU13=0,AW13>0,AX13>0),MAX(T13,AI13),AND(AU13>0,AW13=0,AX13=0),MIN(MAX('MDA2'!J13,'MDA5'!J13),AZ13),AND(AU13>0,AW13=0,AX13>0),MIN(MAX('MDA2'!J13,'MDA5'!J13,AI13),AZ13),AND(AU13>0,AW13>0,AX13=0),MIN(MAX('MDA2'!J13,'MDA5'!J13,T13),AZ13),AND(AU13>0,AW13>0,AX13>0),MIN(MAX('MDA2'!J13,'MDA5'!J13,AI13,T13),AZ13))","v":7169},{"$f":"_xlfn.IFS(AND(AU13=0,AV13=0,AW13=0,AX13=0),0,AND(AU13=0,AV13=0,AW13=0,AX13>0),AL13,AND(AU13=0,AV13=0,AW13>0,AX13=0),W13,AND(AU13=0,AV13=0,AW13>0,AX13>0),MAX(W13,AL13),AND(AU13=0,AV13>0,AW13=0,AX13=0),MIN(J13*PROFILE!$G$9,MAX('MDA3'!I13,'MDA3'!L13)),AND(AU13=0,AV13>0,AW13=0,AX13>0),MIN(J13*PROFILE!$G$9,MAX('MDA3'!I13,'MDA3'!L13,AL13)),AND(AU13=0,AV13>0,AW13>0,AX13=0),MIN(J13*PROFILE!$G$9,MAX('MDA3'!I13,'MDA3'!L13,W13)),AND(AU13=0,AV13>0,AW13>0,AX13>0),MIN(J13*PROFILE!$G$9,MAX('MDA3'!I13,'MDA3'!L13,W13,AL13)),AND(AU13>0,AV13=0,AW13=0,AX13=0),MIN(BA13,MAX('MDA1'!K13,'MDA2'!K13,'MDA5'!K13)),AND(AU13>0,AV13=0,AW13=0,AX13>0),MIN(BA13,MAX('MDA1'!K13,'MDA2'!K13,'MDA5'!K13,AL13)),AND(AU13>0,AV13=0,AW13>0,AX13=0),MIN(BA13,MAX('MDA1'!K13,'MDA2'!KL13,'MDA5'!K13,W13)),AND(AU13>0,AV13=0,AW13>0,AX13>0),MIN(BA13,MAX('MDA1'!K13,'MDA2'!K13,'MDA5'!K13,W13,AL13)),AND(AU13>0,AV13>0,AW13=0,AX13=0),MIN(BA13,MAX('MDA1'!K13,'MDA2'!K13,'MDA5'!K13,MAX('MDA3'!I13,'MDA3'!L13))),AND(AU13>0,AV13>0,AW13=0,AX13>0),MIN(BA13,MAX('MDA1'!K13,'MDA2'!K13,'MDA5'!K13,MAX('MDA3'!I13,'MDA3'!L13),AL13)),AND(AU13>0,AV13>0,AW13>0,AX13=0),MIN(BA13,MAX('MDA1'!K13,'MDA2'!K13,'MDA5'!K13,MAX('MDA3'!I13,'MDA3'!L13),W13)),AND(AU13>0,AV13>0,AW13>0,AX13>0),MIN(BA13,MAX('MDA1'!K13,'MDA2'!K13,'MDA5'!K13,MAX('MDA3'!I13,'MDA3'!L13),W13,AL13)))","v":25611},{"$f":"_xlfn.IFS(AND(AU13=0,AV13=0,AW13=0,AX13=0),0,AND(AU13=0,AV13=0,AW13=0,AX13>0),AO13,AND(AU13=0,AV13=0,AW13>0,AX13=0),Z13,AND(AU13=0,AV13=0,AW13>0,AX13>0),MAX(Z13,AO13),AND(AU13=0,AV13>0,AW13=0,AX13=0),MIN(J13*PROFILE!$G$10,MAX('MDA3'!J13,'MDA3'!J13)),AND(AU13=0,AV13>0,AW13=0,AX13>0),MIN(J13*PROFILE!$G$10,MAX('MDA3'!J13,'MDA3'!M13,AO13)),AND(AU13=0,AV13>0,AW13>0,AX13=0),MIN(J13*PROFILE!$G$10,MAX('MDA3'!J13,'MDA3'!M13,Z13)),AND(AU13=0,AV13>0,AW13>0,AX13>0),MIN(J13*PROFILE!$G$10,MAX('MDA3'!J13,'MDA3'!M13,Z13,AO13)),AND(AU13>0,AV13=0,AW13=0,AX13=0),MIN(BB13,MAX('MDA1'!L13,'MDA2'!L13,'MDA5'!L13)),AND(AU13>0,AV13=0,AW13=0,AX13>0),MIN(BB13,MAX('MDA1'!L13,'MDA2'!L13,'MDA5'!L13,AO13)),AND(AU13>0,AV13=0,AW13>0,AX13=0),MIN(BB13,MAX('MDA1'!L13,'MDA2'!L13,'MDA5'!L13,Z13)),AND(AU13>0,AV13=0,AW13>0,AX13>0),MIN(BB13,MAX('MDA1'!L13,'MDA2'!L13,'MDA5'!L13,Z13,AO13)),AND(AU13>0,AV13>0,AW13=0,AX13=0),MIN(BB13,MAX('MDA1'!L13,'MDA2'!L13,'MDA5'!L13,MAX('MDA3'!J13,'MDA3'!M13))),AND(AU13>0,AV13>0,AW13=0,AX13>0),MIN(BB13,MAX('MDA1'!L13,'MDA2'!L13,'MDA5'!L13,MAX('MDA3'!J13,'MDA3'!M13),AO13)),AND(AU13>0,AV13>0,AW13>0,AX13=0),MIN(BB13,MAX('MDA1'!L13,'MDA2'!L13,'MDA5'!L13,MAX('MDA3'!J13,'MDA3'!M13),Z13)),AND(AU13>0,AV13>0,AW13>0,AX13>0),MIN(BB13,MAX('MDA1'!L13,'MDA2'!L13,'MDA5'!L13,MAX('MDA3'!J13,'MDA3'!M13),Z13,AO13)))","v":44828},77608,81.9393166870061]
[{"$f":"IF(COUNTRY_INFO!A14=0,\" \",COUNTRY_INFO!A14)","v":"Zanzibar"},{"$f":"IF(COUNTRY_INFO!B14=0,\" \",COUNTRY_INFO!B14)","v":"Mjini Magharibi"},{"$f":"IF(COUNTRY_INFO!C14=0,\" \",COUNTRY_INFO!C14)","v":"Mjini"},{"$f":"COUNTRY_INFO!L14","v":294906},null,null,{"$f":"MAX('MDA1'!M14,'MDA2'!M14,'MDA5'!M14)","v":169472},{"$f":"IF(AND(COUNTRY_INFO!H14>0,COUNTRY_INFO!H14<4),IF(D14>G14,G14,D14),0)","v":169472},{"$f":"IF(AND(COUNTRY_INFO!H14>0,COUNTRY_INFO!H14<4),IF(G14/D14*100<>0,IF(G14/D14*100>100,100,G14/D14*100),\"-\"),0)","v":57.4664469356337},{"$f":"COUNTRY_INFO!M14","v":"Not required"},null,null,{"$f":"MAX('MDA1'!M14,MAX('MDA3'!I14,'MDA3'!L14)+MAX('MDA3'!J14,'MDA3'!M14))","v":169472},{"$f":"IF(AND(COUNTRY_INFO!I14>0,COUNTRY_INFO!I14<4),IF(J14>M14,M14,J14),0)","v":0},{"$f":"IF(AND(COUNTRY_INFO!I14>0,COUNTRY_INFO!I14<4),IF(M14/J14*100<>0,IF(M14/J14*100>100,100,M14/J14*100),\"-\"),0)","v":0},{"$f":"COUNTRY_INFO!Q14","v":189359},null,null,{"$f":"MAX('MDA2'!J14,'MDA5'!J14,'T1'!K14,MAX(T3_R1!J14,T3_R2!J14,T3_R3!J14))","v":11150},{"$f":"IF(AND(COUNTRY_INFO!J14>1,COUNTRY_INFO!J14<99,COUNTRY_INFO!J14<>4,COUNTRY_INFO!J14<>5),IF(COUNTRY_INFO!N14>S14,S14,COUNTRY_INFO!N14),0)","v":11150},{"$f":"IF(AND(COUNTRY_INFO!J14>1,COUNTRY_INFO!J14<99,COUNTRY_INFO!J14<>4,COUNTRY_INFO!J14<>5),IF(T14/COUNTRY_INFO!N14*100<>0,IF(T14/COUNTRY_INFO!N14*100>100,100,T14/COUNTRY_INFO!N14*100),\"-\"),0)","v":28.8837655104526},{"$f":"MAX('MDA1'!K14,'MDA2'!K14,'MDA5'!K14,'T1'!L14,MAX(T3_R1!K14,T3_R2!K14,T3_R3!K14))","v":48753},{"$f":"IF(AND(COUNTRY_INFO!J14>1,COUNTRY_INFO!J14<99,COUNTRY_INFO!J14<>4,COUNTRY_INFO!J14<>5),IF(COUNTRY_INFO!O14>V14,V14,COUNTRY_INFO!O14),0)","v":48753},{"$f":"IF(AND(COUNTRY_INFO!J14>1,COUNTRY_INFO!J14<99,COUNTRY_INFO!J14<>4,COUNTRY_INFO!J14<>5),IF(W14/COUNTRY_INFO!O14*100<>0,IF(W14/COUNTRY_INFO!O14*100>100,100,W14/COUNTRY_INFO!O14*100),\"-\"),0)","v":61.1376547157744},{"$f":"MAX('MDA1'!L14,'MDA2'!L14,'MDA5'!L14,'T1'!M14,MAX(T3_R1!L14,T3_R2!L14,T3_R3!L14))","v":120719},{"$f":"IF(AND(COUNTRY_INFO!J14>1,COUNTRY_INFO!J14<99,COUNTRY_INFO!J14<>4,COUNTRY_INFO!J14<>5),IF(COUNTRY_INFO!P14>Y14,Y14,COUNTRY_INFO!P14),0)","v":71013},{"$f":"IF(AND(COUNTRY_INFO!J14>1,COUNTRY_INFO!J14<99,COUNTRY_INFO!J14<>4,COUNTRY_INFO!J14<>5),IF(Z14/COUNTRY_INFO!P14*100<>0,IF(Z14/COUNTRY_INFO!P14*100>100,100,Z14/COUNTRY_INFO!P14*100),\"-\"),0)","v":100},180622,130916,{"$f":"IF(AND(COUNTRY_INFO!J14>1,COUNTRY_INFO!J14<99,COUNTRY_INFO!J14<>4,COUNTRY_INFO!J14<>5),IF(AC14/P14*100<>0,IF(AC14/P14*100>100,100,AC14/P14*100),\"-\"),0)","v":69.1364022834933},{"$f":"COUNTRY_INFO!U14","v":0},null,null,{"$f":"MAX('T1'!K14,'T2'!R14)","v":8179},{"$f":"IF(AND(COUNTRY_INFO!K14>1,COUNTRY_INFO!K14<99,COUNTRY_INFO!K14<>4,COUNTRY_INFO!K14<>5),IF(COUNTRY_INFO!R14>AH14,AH14,COUNTRY_INFO!R14),0)","v":0},{"$f":"IF(AND(COUNTRY_INFO!K14>1,COUNTRY_INFO!K14<99,COUNTRY_INFO!K14<>4,COUNTRY_INFO!K14<>5),IF(AI14/COUNTRY_INFO!R14*100<>0,IF(AI14/COUNTRY_INFO!R14*100>100,100,AI14/COUNTRY_INFO!R14*100),\"-\"),0)","v":0},{"$f":"MAX('T1'!L14,'T2'!S14)","v":35263},{"$f":"IF(AND(COUNTRY_INFO!K14>1,COUNTRY_INFO!K14<99,COUNTRY_INFO!K14<>4,COUNTRY_INFO!K14<>5),IF(COUNTRY_INFO!S14>AK14,AK14,COUNTRY_INFO!S14),0)","v":0},{"$f":"IF(AND(COUNTRY_INFO!K14>1,COUNTRY_INFO!K14<99,COUNTRY_INFO!K14<>4,COUNTRY_INFO!K14<>5),IF(AL14/COUNTRY_INFO!S14*100<>0,IF(AL14/COUNTRY_INFO!S14*100>100,100,AL14/COUNTRY_INFO!S14*100),\"-\"),0)","v":0},{"$f":"MAX('T1'!M14,'T2'!T14)","v":97367},{"$f":"IF(AND(COUNTRY_INFO!K14>1,COUNTRY_INFO!K14<99,COUNTRY_INFO!K14<>4,COUNTRY_INFO!K14<>5),IF(COUNTRY_INFO!T14>AN14,AN14,COUNTRY_INFO!T14),0)","v":0},{"$f":"IF(AND(COUNTRY_INFO!K14>1,COUNTRY_INFO!K14<99,COUNTRY_INFO!K14<>4,COUNTRY_INFO!K14<>5),IF(AO14/COUNTRY_INFO!T14*100<>0,IF(AO14/COUNTRY_INFO!T14*100>100,100,AO14/COUNTRY_INFO!T14*100),\"-\"),0)","v":0},140809,0,{"$f":"IF(AND(COUNTRY_INFO!K14>1,COUNTRY_INFO!K14<99,COUNTRY_INFO!K14<>4,COUNTRY_INFO!K14<>5),IF(AH14/AE14*100<>0,IF(AR14/AE14*100>100,100,AR14/AE14*100),\"-\"),0)","v":0},null,{"$f":"IF(AND(D14<>0,D14<>\"Unknown\",D14<>\"Stopped\",D14<>\"Not required\"),D14/COUNTRY_INFO!D14,0)","v":1},{"$f":"IF(AND(J14<>0,J14<>\"Unknown\",J14<>\"Stopped\",J14<>\"Not required\"),J14/COUNTRY_INFO!D14,0)","v":0},{"$f":"IF(AND(P14<>0,P14<>\"Unknown\",P14<>\"Surveillance\",P14<>\"Not required\"),P14/COUNTRY_INFO!Q14,0)","v":1},{"$f":"IF(AND(AE14<>0,AE14<>\"Unknown\",AE14<>\"Surveillance\",AE14<>\"Not required\"),AE14/COUNTRY_INFO!U14,0)","v":0},{"$f":"IF(AU14>0,D14*PROFILE!$G$7,IF(AV14>0,J14*PROFILE!$G$7,0))","v":10262.5650897559},{"$f":"_xlfn.IFS(OR(AU14>0,AW14>0),COUNTRY_INFO!E14,AV14>0,J14*PROFILE!$G$8,AX14>0,COUNTRY_INFO!R14,COUNTIFS(AU14:AX14,\">0\")=0,0)","v":38603},{"$f":"_xlfn.IFS(OR(AU14>0,AW14>0),COUNTRY_INFO!F14,AV14>0,J14*PROFILE!$G$9,AX14>0,COUNTRY_INFO!S14,COUNTIFS(AU14:AX14,\">0\")=0,0)","v":79743},{"$f":"_xlfn.IFS(AU14>0,COUNTRY_INFO!G14,AND(AV14>0,AW14=0,AX14=0),J14*PROFILE!$G$10,AND(AV14>0,AW14>0,AX14=0),MAX(J14*PROFILE!$G$10,COUNTRY_INFO!P14),AND(AV14>0,AW14=0,AX14>0),MAX(J14*PROFILE!$G$10,COUNTRY_INFO!T14),AND(AV14=0,AW14>0,AX14>0),MAX(COUNTRY_INFO!P14,COUNTRY_INFO!T14),AND(AV14=0,AW14>0,AX14=0),COUNTRY_INFO!P14,AND(AV14=0,AW14=0,AX14>0),COUNTRY_INFO!T14,AND(AV14>0,AW14>0,AX14>0),MAX(J14*PROFILE!$G$10,COUNTRY_INFO!P14,COUNTRY_INFO!T14),COUNTIFS(AU14:AX14,\">0\")=0,0)","v":166297},294905.565089756,"Y",{"$f":"MAX('MDA2'!J14,'MDA5'!J14,S14,AH14)","v":11150},{"$f":"MAX('MDA1'!K14,'MDA2'!K14,'MDA3'!I14,'MDA3'!L14,'MDA5'!K14,V14,AK14)","v":48753},{"$f":"MAX('MDA1'!L14,'MDA2'!L14,'MDA3'!J14,'MDA3'!M14,'MDA5'!L14,Y14,AN14)","v":120719},180622,{"$f":"_xlfn.IFS(AND(AU14=0,AW14=0,AX14=0),0,AND(AU14=0,AW14=0,AX14>0),AI14,AND(AU14=0,AW14>0,AX14=0),T14,AND(AU14=0,AW14>0,AX14>0),MAX(T14,AI14),AND(AU14>0,AW14=0,AX14=0),MIN(MAX('MDA2'!J14,'MDA5'!J14),AZ14),AND(AU14>0,AW14=0,AX14>0),MIN(MAX('MDA2'!J14,'MDA5'!J14,AI14),AZ14),AND(AU14>0,AW14>0,AX14=0),MIN(MAX('MDA2'!J14,'MDA5'!J14,T14),AZ14),AND(AU14>0,AW14>0,AX14>0),MIN(MAX('MDA2'!J14,'MDA5'!J14,AI14,T14),AZ14))","v":11150},{"$f":"_xlfn.IFS(AND(AU14=0,AV14=0,AW14=0,AX14=0),0,AND(AU14=0,AV14=0,AW14=0,AX14>0),AL14,AND(AU14=0,AV14=0,AW14>0,AX14=0),W14,AND(AU14=0,AV14=0,AW14>0,AX14>0),MAX(W14,AL14),AND(AU14=0,AV14>0,AW14=0,AX14=0),MIN(J14*PROFILE!$G$9,MAX('MDA3'!I14,'MDA3'!L14)),AND(AU14=0,AV14>0,AW14=0,AX14>0),MIN(J14*PROFILE!$G$9,MAX('MDA3'!I14,'MDA3'!L14,AL14)),AND(AU14=0,AV14>0,AW14>0,AX14=0),MIN(J14*PROFILE!$G$9,MAX('MDA3'!I14,'MDA3'!L14,W14)),AND(AU14=0,AV14>0,AW14>0,AX14>0),MIN(J14*PROFILE!$G$9,MAX('MDA3'!I14,'MDA3'!L14,W14,AL14)),AND(AU14>0,AV14=0,AW14=0,AX14=0),MIN(BA14,MAX('MDA1'!K14,'MDA2'!K14,'MDA5'!K14)),AND(AU14>0,AV14=0,AW14=0,AX14>0),MIN(BA14,MAX('MDA1'!K14,'MDA2'!K14,'MDA5'!K14,AL14)),AND(AU14>0,AV14=0,AW14>0,AX14=0),MIN(BA14,MAX('MDA1'!K14,'MDA2'!KL14,'MDA5'!K14,W14)),AND(AU14>0,AV14=0,AW14>0,AX14>0),MIN(BA14,MAX('MDA1'!K14,'MDA2'!K14,'MDA5'!K14,W14,AL14)),AND(AU14>0,AV14>0,AW14=0,AX14=0),MIN(BA14,MAX('MDA1'!K14,'MDA2'!K14,'MDA5'!K14,MAX('MDA3'!I14,'MDA3'!L14))),AND(AU14>0,AV14>0,AW14=0,AX14>0),MIN(BA14,MAX('MDA1'!K14,'MDA2'!K14,'MDA5'!K14,MAX('MDA3'!I14,'MDA3'!L14),AL14)),AND(AU14>0,AV14>0,AW14>0,AX14=0),MIN(BA14,MAX('MDA1'!K14,'MDA2'!K14,'MDA5'!K14,MAX('MDA3'!I14,'MDA3'!L14),W14)),AND(AU14>0,AV14>0,AW14>0,AX14>0),MIN(BA14,MAX('MDA1'!K14,'MDA2'!K14,'MDA5'!K14,MAX('MDA3'!I14,'MDA3'!L14),W14,AL14)))","v":48753},{"$f":"_xlfn.IFS(AND(AU14=0,AV14=0,AW14=0,AX14=0),0,AND(AU14=0,AV14=0,AW14=0,AX14>0),AO14,AND(AU14=0,AV14=0,AW14>0,AX14=0),Z14,AND(AU14=0,AV14=0,AW14>0,AX14>0),MAX(Z14,AO14),AND(AU14=0,AV14>0,AW14=0,AX14=0),MIN(J14*PROFILE!$G$10,MAX('MDA3'!J14,'MDA3'!J14)),AND(AU14=0,AV14>0,AW14=0,AX14>0),MIN(J14*PROFILE!$G$10,MAX('MDA3'!J14,'MDA3'!M14,AO14)),AND(AU14=0,AV14>0,AW14>0,AX14=0),MIN(J14*PROFILE!$G$10,MAX('MDA3'!J14,'MDA3'!M14,Z14)),AND(AU14=0,AV14>0,AW14>0,AX14>0),MIN(J14*PROFILE!$G$10,MAX('MDA3'!J14,'MDA3'!M14,Z14,AO14)),AND(AU14>0,AV14=0,AW14=0,AX14=0),MIN(BB14,MAX('MDA1'!L14,'MDA2'!L14,'MDA5'!L14)),AND(AU14>0,AV14=0,AW14=0,AX14>0),MIN(BB14,MAX('MDA1'!L14,'MDA2'!L14,'MDA5'!L14,AO14)),AND(AU14>0,AV14=0,AW14>0,AX14=0),MIN(BB14,MAX('MDA1'!L14,'MDA2'!L14,'MDA5'!L14,Z14)),AND(AU14>0,AV14=0,AW14>0,AX14>0),MIN(BB14,MAX('MDA1'!L14,'MDA2'!L14,'MDA5'!L14,Z14,AO14)),AND(AU14>0,AV14>0,AW14=0,AX14=0),MIN(BB14,MAX('MDA1'!L14,'MDA2'!L14,'MDA5'!L14,MAX('MDA3'!J14,'MDA3'!M14))),AND(AU14>0,AV14>0,AW14=0,AX14>0),MIN(BB14,MAX('MDA1'!L14,'MDA2'!L14,'MDA5'!L14,MAX('MDA3'!J14,'MDA3'!M14),AO14)),AND(AU14>0,AV14>0,AW14>0,AX14=0),MIN(BB14,MAX('MDA1'!L14,'MDA2'!L14,'MDA5'!L14,MAX('MDA3'!J14,'MDA3'!M14),Z14)),AND(AU14>0,AV14>0,AW14>0,AX14>0),MIN(BB14,MAX('MDA1'!L14,'MDA2'!L14,'MDA5'!L14,MAX('MDA3'!J14,'MDA3'!M14),Z14,AO14)))","v":120719},180622,61.2474030271443]
[{"$f":"IF(COUNTRY_INFO!A15=0,\" \",COUNTRY_INFO!A15)","v":"Zanzibar"},{"$f":"IF(COUNTRY_INFO!B15=0,\" \",COUNTRY_INFO!B15)","v":"Mjini Magharibi"},{"$f":"IF(COUNTRY_INFO!C15=0,\" \",COUNTRY_INFO!C15)","v":"Magharibi A"},{"$f":"COUNTRY_INFO!L15","v":208144},null,null,{"$f":"MAX('MDA1'!M15,'MDA2'!M15,'MDA5'!M15)","v":227707},{"$f":"IF(AND(COUNTRY_INFO!H15>0,COUNTRY_INFO!H15<4),IF(D15>G15,G15,D15),0)","v":208144},{"$f":"IF(AND(COUNTRY_INFO!H15>0,COUNTRY_INFO!H15<4),IF(G15/D15*100<>0,IF(G15/D15*100>100,100,G15/D15*100),\"-\"),0)","v":100},{"$f":"COUNTRY_INFO!M15","v":"Not required"},null,null,{"$f":"MAX('MDA1'!M15,MAX('MDA3'!I15,'MDA3'!L15)+MAX('MDA3'!J15,'MDA3'!M15))","v":227707},{"$f":"IF(AND(COUNTRY_INFO!I15>0,COUNTRY_INFO!I15<4),IF(J15>M15,M15,J15),0)","v":0},{"$f":"IF(AND(COUNTRY_INFO!I15>0,COUNTRY_INFO!I15<4),IF(M15/J15*100<>0,IF(M15/J15*100>100,100,M15/J15*100),\"-\"),0)","v":0},{"$f":"COUNTRY_INFO!Q15","v":133649},null,null,{"$f":"MAX('MDA2'!J15,'MDA5'!J15,'T1'!K15,MAX(T3_R1!J15,T3_R2!J15,T3_R3!J15))","v":7847},{"$f":"IF(AND(COUNTRY_INFO!J15>1,COUNTRY_INFO!J15<99,COUNTRY_INFO!J15<>4,COUNTRY_INFO!J15<>5),IF(COUNTRY_INFO!N15>S15,S15,COUNTRY_INFO!N15),0)","v":7847},{"$f":"IF(AND(COUNTRY_INFO!J15>1,COUNTRY_INFO!J15<99,COUNTRY_INFO!J15<>4,COUNTRY_INFO!J15<>5),IF(T15/COUNTRY_INFO!N15*100<>0,IF(T15/COUNTRY_INFO!N15*100>100,100,T15/COUNTRY_INFO!N15*100),\"-\"),0)","v":28.8005578800558},{"$f":"MAX('MDA1'!K15,'MDA2'!K15,'MDA5'!K15,'T1'!L15,MAX(T3_R1!K15,T3_R2!K15,T3_R3!K15))","v":95355},{"$f":"IF(AND(COUNTRY_INFO!J15>1,COUNTRY_INFO!J15<99,COUNTRY_INFO!J15<>4,COUNTRY_INFO!J15<>5),IF(COUNTRY_INFO!O15>V15,V15,COUNTRY_INFO!O15),0)","v":56282},{"$f":"IF(AND(COUNTRY_INFO!J15>1,COUNTRY_INFO!J15<99,COUNTRY_INFO!J15<>4,COUNTRY_INFO!J15<>5),IF(W15/COUNTRY_INFO!O15*100<>0,IF(W15/COUNTRY_INFO!O15*100>100,100,W15/COUNTRY_INFO!O15*100),\"-\"),0)","v":100},{"$f":"MAX('MDA1'!L15,'MDA2'!L15,'MDA5'!L15,'T1'!M15,MAX(T3_R1!L15,T3_R2!L15,T3_R3!L15))","v":132352},{"$f":"IF(AND(COUNTRY_INFO!J15>1,COUNTRY_INFO!J15<99,COUNTRY_INFO!J15<>4,COUNTRY_INFO!J15<>5),IF(COUNTRY_INFO!P15>Y15,Y15,COUNTRY_INFO!P15),0)","v":50121},{"$f":"IF(AND(COUNTRY_INFO!J15>1,COUNTRY_INFO!J15<99,COUNTRY_INFO!J15<>4,COUNTRY_INFO!J15<>5),IF(Z15/COUNTRY_INFO!P15*100<>0,IF(Z15/COUNTRY_INFO!P15*100>100,100,Z15/COUNTRY_INFO!P15*100),\"-\"),0)","v":100},235554,114250,{"$f":"IF(AND(COUNTRY_INFO!J15>1,COUNTRY_INFO!J15<99,COUNTRY_INFO!J15<>4,COUNTRY_INFO!J15<>5),IF(AC15/P15*100<>0,IF(AC15/P15*100>100,100,AC15/P15*100),\"-\"),0)","v":85.4851139926225},{"$f":"COUNTRY_INFO!U15","v":194089},null,null,{"$f":"MAX('T1'!K15,'T2'!R15)","v":10960},{"$f":"IF(AND(COUNTRY_INFO!K15>1,COUNTRY_INFO!K15<99,COUNTRY_INFO!K15<>4,COUNTRY_INFO!K15<>5),IF(COUNTRY_INFO!R15>AH15,AH15,COUNTRY_INFO!R15),0)","v":10960},{"$f":"IF(AND(COUNTRY_INFO!K15>1,COUNTRY_INFO!K15<99,COUNTRY_INFO!K15<>4,COUNTRY_INFO!K15<>5),IF(AI15/COUNTRY_INFO!R15*100<>0,IF(AI15/COUNTRY_INFO!R15*100>100,100,AI15/COUNTRY_INFO!R15*100),\"-\"),0)","v":53.6334719843406},{"$f":"MAX('T1'!L15,'T2'!S15)","v":66495},{"$f":"IF(AND(COUNTRY_INFO!K15>1,COUNTRY_INFO!K15<99,COUNTRY_INFO!K15<>4,COUNTRY_INFO!K15<>5),IF(COUNTRY_INFO!S15>AK15,AK15,COUNTRY_INFO!S15),0)","v":56282},{"$f":"IF(AND(COUNTRY_INFO!K15>1,COUNTRY_INFO!K15<99,COUNTRY_INFO!K15<>4,COUNTRY_INFO!K15<>5),IF(AL15/COUNTRY_INFO!S15*100<>0,IF(AL15/COUNTRY_INFO!S15*100>100,100,AL15/COUNTRY_INFO!S15*100),\"-\"),0)","v":100},{"$f":"MAX('T1'!M15,'T2'!T15)","v":65145},{"$f":"IF(AND(COUNTRY_INFO!K15>1,COUNTRY_INFO!K15<99,COUNTRY_INFO!K15<>4,COUNTRY_INFO!K15<>5),IF(COUNTRY_INFO!T15>AN15,AN15,COUNTRY_INFO!T15),0)","v":65145},{"$f":"IF(AND(COUNTRY_INFO!K15>1,COUNTRY_INFO!K15<99,COUNTRY_INFO!K15<>4,COUNTRY_INFO!K15<>5),IF(AO15/COUNTRY_INFO!T15*100<>0,IF(AO15/COUNTRY_INFO!T15*100>100,100,AO15/COUNTRY_INFO!T15*100),\"-\"),0)","v":55.5030160515285},142600,132387,{"$f":"IF(AND(COUNTRY_INFO!K15>1,COUNTRY_INFO!K15<99,COUNTRY_INFO!K15<>4,COUNTRY_INFO!K15<>5),IF(AH15/AE15*100<>0,IF(AR15/AE15*100>100,100,AR15/AE15*100),\"-\"),0)","v":68.2094296946246},null,{"$f":"IF(AND(D15<>0,D15<>\"Unknown\",D15<>\"Stopped\",D15<>\"Not required\"),D15/COUNTRY_INFO!D15,0)","v":1},{"$f":"IF(AND(J15<>0,J15<>\"Unknown\",J15<>\"Stopped\",J15<>\"Not required\"),J15/COUNTRY_INFO!D15,0)","v":0},{"$f":"IF(AND(P15<>0,P15<>\"Unknown\",P15<>\"Surveillance\",P15<>\"Not required\"),P15/COUNTRY_INFO!Q15,0)","v":1},{"$f":"IF(AND(AE15<>0,AE15<>\"Unknown\",AE15<>\"Surveillance\",AE15<>\"Not required\"),AE15/COUNTRY_INFO!U15,0)","v":1},{"$f":"IF(AU15>0,D15*PROFILE!$G$7,IF(AV15>0,J15*PROFILE!$G$7,0))","v":7243.29565367319},{"$f":"_xlfn.IFS(OR(AU15>0,AW15>0),COUNTRY_INFO!E15,AV15>0,J15*PROFILE!$G$8,AX15>0,COUNTRY_INFO!R15,COUNTIFS(AU15:AX15,\">0\")=0,0)","v":27246},{"$f":"_xlfn.IFS(OR(AU15>0,AW15>0),COUNTRY_INFO!F15,AV15>0,J15*PROFILE!$G$9,AX15>0,COUNTRY_INFO!S15,COUNTIFS(AU15:AX15,\">0\")=0,0)","v":56282},{"$f":"_xlfn.IFS(AU15>0,COUNTRY_INFO!G15,AND(AV15>0,AW15=0,AX15=0),J15*PROFILE!$G$10,AND(AV15>0,AW15>0,AX15=0),MAX(J15*PROFILE!$G$10,COUNTRY_INFO!P15),AND(AV15>0,AW15=0,AX15>0),MAX(J15*PROFILE!$G$10,COUNTRY_INFO!T15),AND(AV15=0,AW15>0,AX15>0),MAX(COUNTRY_INFO!P15,COUNTRY_INFO!T15),AND(AV15=0,AW15>0,AX15=0),COUNTRY_INFO!P15,AND(AV15=0,AW15=0,AX15>0),COUNTRY_INFO!T15,AND(AV15>0,AW15>0,AX15>0),MAX(J15*PROFILE!$G$10,COUNTRY_INFO!P15,COUNTRY_INFO!T15),COUNTIFS(AU15:AX15,\">0\")=0,0)","v":117372},208143.295653673,"Y",{"$f":"MAX('MDA2'!J15,'MDA5'!J15,S15,AH15)","v":10960},{"$f":"MAX('MDA1'!K15,'MDA2'!K15,'MDA3'!I15,'MDA3'!L15,'MDA5'!K15,V15,AK15)","v":95355},{"$f":"MAX('MDA1'!L15,'MDA2'!L15,'MDA3'!J15,'MDA3'!M15,'MDA5'!L15,Y15,AN15)","v":132352},238667,{"$f":"_xlfn.IFS(AND(AU15=0,AW15=0,AX15=0),0,AND(AU15=0,AW15=0,AX15>0),AI15,AND(AU15=0,AW15>0,AX15=0),T15,AND(AU15=0,AW15>0,AX15>0),MAX(T15,AI15),AND(AU15>0,AW15=0,AX15=0),MIN(MAX('MDA2'!J15,'MDA5'!J15),AZ15),AND(AU15>0,AW15=0,AX15>0),MIN(MAX('MDA2'!J15,'MDA5'!J15,AI15),AZ15),AND(AU15>0,AW15>0,AX15=0),MIN(MAX('MDA2'!J15,'MDA5'!J15,T15),AZ15),AND(AU15>0,AW15>0,AX15>0),MIN(MAX('MDA2'!J15,'MDA5'!J15,AI15,T15),AZ15))","v":10960},{"$f":"_xlfn.IFS(AND(AU15=0,AV15=0,AW15=0,AX15=0),0,AND(AU15=0,AV15=0,AW15=0,AX15>0),AL15,AND(AU15=0,AV15=0,AW15>0,AX15=0),W15,AND(AU15=0,AV15=0,AW15>0,AX15>0),MAX(W15,AL15),AND(AU15=0,AV15>0,AW15=0,AX15=0),MIN(J15*PROFILE!$G$9,MAX('MDA3'!I15,'MDA3'!L15)),AND(AU15=0,AV15>0,AW15=0,AX15>0),MIN(J15*PROFILE!$G$9,MAX('MDA3'!I15,'MDA3'!L15,AL15)),AND(AU15=0,AV15>0,AW15>0,AX15=0),MIN(J15*PROFILE!$G$9,MAX('MDA3'!I15,'MDA3'!L15,W15)),AND(AU15=0,AV15>0,AW15>0,AX15>0),MIN(J15*PROFILE!$G$9,MAX('MDA3'!I15,'MDA3'!L15,W15,AL15)),AND(AU15>0,AV15=0,AW15=0,AX15=0),MIN(BA15,MAX('MDA1'!K15,'MDA2'!K15,'MDA5'!K15)),AND(AU15>0,AV15=0,AW15=0,AX15>0),MIN(BA15,MAX('MDA1'!K15,'MDA2'!K15,'MDA5'!K15,AL15)),AND(AU15>0,AV15=0,AW15>0,AX15=0),MIN(BA15,MAX('MDA1'!K15,'MDA2'!KL15,'MDA5'!K15,W15)),AND(AU15>0,AV15=0,AW15>0,AX15>0),MIN(BA15,MAX('MDA1'!K15,'MDA2'!K15,'MDA5'!K15,W15,AL15)),AND(AU15>0,AV15>0,AW15=0,AX15=0),MIN(BA15,MAX('MDA1'!K15,'MDA2'!K15,'MDA5'!K15,MAX('MDA3'!I15,'MDA3'!L15))),AND(AU15>0,AV15>0,AW15=0,AX15>0),MIN(BA15,MAX('MDA1'!K15,'MDA2'!K15,'MDA5'!K15,MAX('MDA3'!I15,'MDA3'!L15),AL15)),AND(AU15>0,AV15>0,AW15>0,AX15=0),MIN(BA15,MAX('MDA1'!K15,'MDA2'!K15,'MDA5'!K15,MAX('MDA3'!I15,'MDA3'!L15),W15)),AND(AU15>0,AV15>0,AW15>0,AX15>0),MIN(BA15,MAX('MDA1'!K15,'MDA2'!K15,'MDA5'!K15,MAX('MDA3'!I15,'MDA3'!L15),W15,AL15)))","v":56282},{"$f":"_xlfn.IFS(AND(AU15=0,AV15=0,AW15=0,AX15=0),0,AND(AU15=0,AV15=0,AW15=0,AX15>0),AO15,AND(AU15=0,AV15=0,AW15>0,AX15=0),Z15,AND(AU15=0,AV15=0,AW15>0,AX15>0),MAX(Z15,AO15),AND(AU15=0,AV15>0,AW15=0,AX15=0),MIN(J15*PROFILE!$G$10,MAX('MDA3'!J15,'MDA3'!J15)),AND(AU15=0,AV15>0,AW15=0,AX15>0),MIN(J15*PROFILE!$G$10,MAX('MDA3'!J15,'MDA3'!M15,AO15)),AND(AU15=0,AV15>0,AW15>0,AX15=0),MIN(J15*PROFILE!$G$10,MAX('MDA3'!J15,'MDA3'!M15,Z15)),AND(AU15=0,AV15>0,AW15>0,AX15>0),MIN(J15*PROFILE!$G$10,MAX('MDA3'!J15,'MDA3'!M15,Z15,AO15)),AND(AU15>0,AV15=0,AW15=0,AX15=0),MIN(BB15,MAX('MDA1'!L15,'MDA2'!L15,'MDA5'!L15)),AND(AU15>0,AV15=0,AW15=0,AX15>0),MIN(BB15,MAX('MDA1'!L15,'MDA2'!L15,'MDA5'!L15,AO15)),AND(AU15>0,AV15=0,AW15>0,AX15=0),MIN(BB15,MAX('MDA1'!L15,'MDA2'!L15,'MDA5'!L15,Z15)),AND(AU15>0,AV15=0,AW15>0,AX15>0),MIN(BB15,MAX('MDA1'!L15,'MDA2'!L15,'MDA5'!L15,Z15,AO15)),AND(AU15>0,AV15>0,AW15=0,AX15=0),MIN(BB15,MAX('MDA1'!L15,'MDA2'!L15,'MDA5'!L15,MAX('MDA3'!J15,'MDA3'!M15))),AND(AU15>0,AV15>0,AW15=0,AX15>0),MIN(BB15,MAX('MDA1'!L15,'MDA2'!L15,'MDA5'!L15,MAX('MDA3'!J15,'MDA3'!M15),AO15)),AND(AU15>0,AV15>0,AW15>0,AX15=0),MIN(BB15,MAX('MDA1'!L15,'MDA2'!L15,'MDA5'!L15,MAX('MDA3'!J15,'MDA3'!M15),Z15)),AND(AU15>0,AV15>0,AW15>0,AX15>0),MIN(BB15,MAX('MDA1'!L15,'MDA2'!L15,'MDA5'!L15,MAX('MDA3'!J15,'MDA3'!M15),Z15,AO15)))","v":117372},184614,88.6956264530263]
[{"$f":"IF(COUNTRY_INFO!A16=0,\" \",COUNTRY_INFO!A16)","v":"Zanzibar"},{"$f":"IF(COUNTRY_INFO!B16=0,\" \",COUNTRY_INFO!B16)","v":"Mjini Magharibi"},{"$f":"IF(COUNTRY_INFO!C16=0,\" \",COUNTRY_INFO!C16)","v":"Magharibi B"},{"$f":"COUNTRY_INFO!L16","v":269409},null,null,{"$f":"MAX('MDA1'!M16,'MDA2'!M16,'MDA5'!M16)","v":215768},{"$f":"IF(AND(COUNTRY_INFO!H16>0,COUNTRY_INFO!H16<4),IF(D16>G16,G16,D16),0)","v":215768},{"$f":"IF(AND(COUNTRY_INFO!H16>0,COUNTRY_INFO!H16<4),IF(G16/D16*100<>0,IF(G16/D16*100>100,100,G16/D16*100),\"-\"),0)","v":80.0893808298906},{"$f":"COUNTRY_INFO!M16","v":"Not required"},null,null,{"$f":"MAX('MDA1'!M16,MAX('MDA3'!I16,'MDA3'!L16)+MAX('MDA3'!J16,'MDA3'!M16))","v":215768},{"$f":"IF(AND(COUNTRY_INFO!I16>0,COUNTRY_INFO!I16<4),IF(J16>M16,M16,J16),0)","v":0},{"$f":"IF(AND(COUNTRY_INFO!I16>0,COUNTRY_INFO!I16<4),IF(M16/J16*100<>0,IF(M16/J16*100>100,100,M16/J16*100),\"-\"),0)","v":0},{"$f":"COUNTRY_INFO!Q16","v":172988},null,null,{"$f":"MAX('MDA2'!J16,'MDA5'!J16,'T1'!K16,MAX(T3_R1!J16,T3_R2!J16,T3_R3!J16))","v":17186},{"$f":"IF(AND(COUNTRY_INFO!J16>1,COUNTRY_INFO!J16<99,COUNTRY_INFO!J16<>4,COUNTRY_INFO!J16<>5),IF(COUNTRY_INFO!N16>S16,S16,COUNTRY_INFO!N16),0)","v":17186},{"$f":"IF(AND(COUNTRY_INFO!J16>1,COUNTRY_INFO!J16<99,COUNTRY_INFO!J16<>4,COUNTRY_INFO!J16<>5),IF(T16/COUNTRY_INFO!N16*100<>0,IF(T16/COUNTRY_INFO!N16*100>100,100,T16/COUNTRY_INFO!N16*100),\"-\"),0)","v":48.7324902172064},{"$f":"MAX('MDA1'!K16,'MDA2'!K16,'MDA5'!K16,'T1'!L16,MAX(T3_R1!K16,T3_R2!K16,T3_R3!K16))","v":82499},{"$f":"IF(AND(COUNTRY_INFO!J16>1,COUNTRY_INFO!J16<99,COUNTRY_INFO!J16<>4,COUNTRY_INFO!J16<>5),IF(COUNTRY_INFO!O16>V16,V16,COUNTRY_INFO!O16),0)","v":72848},{"$f":"IF(AND(COUNTRY_INFO!J16>1,COUNTRY_INFO!J16<99,COUNTRY_INFO!J16<>4,COUNTRY_INFO!J16<>5),IF(W16/COUNTRY_INFO!O16*100<>0,IF(W16/COUNTRY_INFO!O16*100>100,100,W16/COUNTRY_INFO!O16*100),\"-\"),0)","v":100},{"$f":"MAX('MDA1'!L16,'MDA2'!L16,'MDA5'!L16,'T1'!M16,MAX(T3_R1!L16,T3_R2!L16,T3_R3!L16))","v":133269},{"$f":"IF(AND(COUNTRY_INFO!J16>1,COUNTRY_INFO!J16<99,COUNTRY_INFO!J16<>4,COUNTRY_INFO!J16<>5),IF(COUNTRY_INFO!P16>Y16,Y16,COUNTRY_INFO!P16),0)","v":64874},{"$f":"IF(AND(COUNTRY_INFO!J16>1,COUNTRY_INFO!J16<99,COUNTRY_INFO!J16<>4,COUNTRY_INFO!J16<>5),IF(Z16/COUNTRY_INFO!P16*100<>0,IF(Z16/COUNTRY_INFO!P16*100>100,100,Z16/COUNTRY_INFO!P16*100),\"-\"),0)","v":100},232954,154908,{"$f":"IF(AND(COUNTRY_INFO!J16>1,COUNTRY_INFO!J16<99,COUNTRY_INFO!J16<>4,COUNTRY_INFO!J16<>5),IF(AC16/P16*100<>0,IF(AC16/P16*100>100,100,AC16/P16*100),\"-\"),0)","v":89.5484079820566},{"$f":"COUNTRY_INFO!U16","v":251218},null,null,{"$f":"MAX('T1'!K16,'T2'!R16)","v":17186},{"$f":"IF(AND(COUNTRY_INFO!K16>1,COUNTRY_INFO!K16<99,COUNTRY_INFO!K16<>4,COUNTRY_INFO!K16<>5),IF(COUNTRY_INFO!R16>AH16,AH16,COUNTRY_INFO!R16),0)","v":17186},{"$f":"IF(AND(COUNTRY_INFO!K16>1,COUNTRY_INFO!K16<99,COUNTRY_INFO!K16<>4,COUNTRY_INFO!K16<>5),IF(AI16/COUNTRY_INFO!R16*100<>0,IF(AI16/COUNTRY_INFO!R16*100>100,100,AI16/COUNTRY_INFO!R16*100),\"-\"),0)","v":64.9754253308129},{"$f":"MAX('T1'!L16,'T2'!S16)","v":82499},{"$f":"IF(AND(COUNTRY_INFO!K16>1,COUNTRY_INFO!K16<99,COUNTRY_INFO!K16<>4,COUNTRY_INFO!K16<>5),IF(COUNTRY_INFO!S16>AK16,AK16,COUNTRY_INFO!S16),0)","v":72848},{"$f":"IF(AND(COUNTRY_INFO!K16>1,COUNTRY_INFO!K16<99,COUNTRY_INFO!K16<>4,COUNTRY_INFO!K16<>5),IF(AL16/COUNTRY_INFO!S16*100<>0,IF(AL16/COUNTRY_INFO!S16*100>100,100,AL16/COUNTRY_INFO!S16*100),\"-\"),0)","v":100},{"$f":"MAX('T1'!M16,'T2'!T16)","v":133269},{"$f":"IF(AND(COUNTRY_INFO!K16>1,COUNTRY_INFO!K16<99,COUNTRY_INFO!K16<>4,COUNTRY_INFO!K16<>5),IF(COUNTRY_INFO!T16>AN16,AN16,COUNTRY_INFO!T16),0)","v":133269},{"$f":"IF(AND(COUNTRY_INFO!K16>1,COUNTRY_INFO!K16<99,COUNTRY_INFO!K16<>4,COUNTRY_INFO!K16<>5),IF(AO16/COUNTRY_INFO!T16*100<>0,IF(AO16/COUNTRY_INFO!T16*100>100,100,AO16/COUNTRY_INFO!T16*100),\"-\"),0)","v":87.7231437598736},232954,223303,{"$f":"IF(AND(COUNTRY_INFO!K16>1,COUNTRY_INFO!K16<99,COUNTRY_INFO!K16<>4,COUNTRY_INFO!K16<>5),IF(AH16/AE16*100<>0,IF(AR16/AE16*100>100,100,AR16/AE16*100),\"-\"),0)","v":88.8881369965528},null,{"$f":"IF(AND(D16<>0,D16<>\"Unknown\",D16<>\"Stopped\",D16<>\"Not required\"),D16/COUNTRY_INFO!D16,0)","v":1},{"$f":"IF(AND(J16<>0,J16<>\"Unknown\",J16<>\"Stopped\",J16<>\"Not required\"),J16/COUNTRY_INFO!D16,0)","v":0},{"$f":"IF(AND(P16<>0,P16<>\"Unknown\",P16<>\"Surveillance\",P16<>\"Not required\"),P16/COUNTRY_INFO!Q16,0)","v":1},{"$f":"IF(AND(AE16<>0,AE16<>\"Unknown\",AE16<>\"Surveillance\",AE16<>\"Not required\"),AE16/COUNTRY_INFO!U16,0)","v":1},{"$f":"IF(AU16>0,D16*PROFILE!$G$7,IF(AV16>0,J16*PROFILE!$G$7,0))","v":9375.28364382563},{"$f":"_xlfn.IFS(OR(AU16>0,AW16>0),COUNTRY_INFO!E16,AV16>0,J16*PROFILE!$G$8,AX16>0,COUNTRY_INFO!R16,COUNTIFS(AU16:AX16,\">0\")=0,0)","v":35266},{"$f":"_xlfn.IFS(OR(AU16>0,AW16>0),COUNTRY_INFO!F16,AV16>0,J16*PROFILE!$G$9,AX16>0,COUNTRY_INFO!S16,COUNTIFS(AU16:AX16,\">0\")=0,0)","v":72848},{"$f":"_xlfn.IFS(AU16>0,COUNTRY_INFO!G16,AND(AV16>0,AW16=0,AX16=0),J16*PROFILE!$G$10,AND(AV16>0,AW16>0,AX16=0),MAX(J16*PROFILE!$G$10,COUNTRY_INFO!P16),AND(AV16>0,AW16=0,AX16>0),MAX(J16*PROFILE!$G$10,COUNTRY_INFO!T16),AND(AV16=0,AW16>0,AX16>0),MAX(COUNTRY_INFO!P16,COUNTRY_INFO!T16),AND(AV16=0,AW16>0,AX16=0),COUNTRY_INFO!P16,AND(AV16=0,AW16=0,AX16>0),COUNTRY_INFO!T16,AND(AV16>0,AW16>0,AX16>0),MAX(J16*PROFILE!$G$10,COUNTRY_INFO!P16,COUNTRY_INFO!T16),COUNTIFS(AU16:AX16,\">0\")=0,0)","v":151920},269409.283643826,"Y",{"$f":"MAX('MDA2'!J16,'MDA5'!J16,S16,AH16)","v":17186},{"$f":"MAX('MDA1'!K16,'MDA2'!K16,'MDA3'!I16,'MDA3'!L16,'MDA5'!K16,V16,AK16)","v":82499},{"$f":"MAX('MDA1'!L16,'MDA2'!L16,'MDA3'!J16,'MDA3'!M16,'MDA5'!L16,Y16,AN16)","v":133269},232954,{"$f":"_xlfn.IFS(AND(AU16=0,AW16=0,AX16=0),0,AND(AU16=0,AW16=0,AX16>0),AI16,AND(AU16=0,AW16>0,AX16=0),T16,AND(AU16=0,AW16>0,AX16>0),MAX(T16,AI16),AND(AU16>0,AW16=0,AX16=0),MIN(MAX('MDA2'!J16,'MDA5'!J16),AZ16),AND(AU16>0,AW16=0,AX16>0),MIN(MAX('MDA2'!J16,'MDA5'!J16,AI16),AZ16),AND(AU16>0,AW16>0,AX16=0),MIN(MAX('MDA2'!J16,'MDA5'!J16,T16),AZ16),AND(AU16>0,AW16>0,AX16>0),MIN(MAX('MDA2'!J16,'MDA5'!J16,AI16,T16),AZ16))","v":17186},{"$f":"_xlfn.IFS(AND(AU16=0,AV16=0,AW16=0,AX16=0),0,AND(AU16=0,AV16=0,AW16=0,AX16>0),AL16,AND(AU16=0,AV16=0,AW16>0,AX16=0),W16,AND(AU16=0,AV16=0,AW16>0,AX16>0),MAX(W16,AL16),AND(AU16=0,AV16>0,AW16=0,AX16=0),MIN(J16*PROFILE!$G$9,MAX('MDA3'!I16,'MDA3'!L16)),AND(AU16=0,AV16>0,AW16=0,AX16>0),MIN(J16*PROFILE!$G$9,MAX('MDA3'!I16,'MDA3'!L16,AL16)),AND(AU16=0,AV16>0,AW16>0,AX16=0),MIN(J16*PROFILE!$G$9,MAX('MDA3'!I16,'MDA3'!L16,W16)),AND(AU16=0,AV16>0,AW16>0,AX16>0),MIN(J16*PROFILE!$G$9,MAX('MDA3'!I16,'MDA3'!L16,W16,AL16)),AND(AU16>0,AV16=0,AW16=0,AX16=0),MIN(BA16,MAX('MDA1'!K16,'MDA2'!K16,'MDA5'!K16)),AND(AU16>0,AV16=0,AW16=0,AX16>0),MIN(BA16,MAX('MDA1'!K16,'MDA2'!K16,'MDA5'!K16,AL16)),AND(AU16>0,AV16=0,AW16>0,AX16=0),MIN(BA16,MAX('MDA1'!K16,'MDA2'!KL16,'MDA5'!K16,W16)),AND(AU16>0,AV16=0,AW16>0,AX16>0),MIN(BA16,MAX('MDA1'!K16,'MDA2'!K16,'MDA5'!K16,W16,AL16)),AND(AU16>0,AV16>0,AW16=0,AX16=0),MIN(BA16,MAX('MDA1'!K16,'MDA2'!K16,'MDA5'!K16,MAX('MDA3'!I16,'MDA3'!L16))),AND(AU16>0,AV16>0,AW16=0,AX16>0),MIN(BA16,MAX('MDA1'!K16,'MDA2'!K16,'MDA5'!K16,MAX('MDA3'!I16,'MDA3'!L16),AL16)),AND(AU16>0,AV16>0,AW16>0,AX16=0),MIN(BA16,MAX('MDA1'!K16,'MDA2'!K16,'MDA5'!K16,MAX('MDA3'!I16,'MDA3'!L16),W16)),AND(AU16>0,AV16>0,AW16>0,AX16>0),MIN(BA16,MAX('MDA1'!K16,'MDA2'!K16,'MDA5'!K16,MAX('MDA3'!I16,'MDA3'!L16),W16,AL16)))","v":72848},{"$f":"_xlfn.IFS(AND(AU16=0,AV16=0,AW16=0,AX16=0),0,AND(AU16=0,AV16=0,AW16=0,AX16>0),AO16,AND(AU16=0,AV16=0,AW16>0,AX16=0),Z16,AND(AU16=0,AV16=0,AW16>0,AX16>0),MAX(Z16,AO16),AND(AU16=0,AV16>0,AW16=0,AX16=0),MIN(J16*PROFILE!$G$10,MAX('MDA3'!J16,'MDA3'!J16)),AND(AU16=0,AV16>0,AW16=0,AX16>0),MIN(J16*PROFILE!$G$10,MAX('MDA3'!J16,'MDA3'!M16,AO16)),AND(AU16=0,AV16>0,AW16>0,AX16=0),MIN(J16*PROFILE!$G$10,MAX('MDA3'!J16,'MDA3'!M16,Z16)),AND(AU16=0,AV16>0,AW16>0,AX16>0),MIN(J16*PROFILE!$G$10,MAX('MDA3'!J16,'MDA3'!M16,Z16,AO16)),AND(AU16>0,AV16=0,AW16=0,AX16=0),MIN(BB16,MAX('MDA1'!L16,'MDA2'!L16,'MDA5'!L16)),AND(AU16>0,AV16=0,AW16=0,AX16>0),MIN(BB16,MAX('MDA1'!L16,'MDA2'!L16,'MDA5'!L16,AO16)),AND(AU16>0,AV16=0,AW16>0,AX16=0),MIN(BB16,MAX('MDA1'!L16,'MDA2'!L16,'MDA5'!L16,Z16)),AND(AU16>0,AV16=0,AW16>0,AX16>0),MIN(BB16,MAX('MDA1'!L16,'MDA2'!L16,'MDA5'!L16,Z16,AO16)),AND(AU16>0,AV16>0,AW16=0,AX16=0),MIN(BB16,MAX('MDA1'!L16,'MDA2'!L16,'MDA5'!L16,MAX('MDA3'!J16,'MDA3'!M16))),AND(AU16>0,AV16>0,AW16=0,AX16>0),MIN(BB16,MAX('MDA1'!L16,'MDA2'!L16,'MDA5'!L16,MAX('MDA3'!J16,'MDA3'!M16),AO16)),AND(AU16>0,AV16>0,AW16>0,AX16=0),MIN(BB16,MAX('MDA1'!L16,'MDA2'!L16,'MDA5'!L16,MAX('MDA3'!J16,'MDA3'!M16),Z16)),AND(AU16>0,AV16>0,AW16>0,AX16>0),MIN(BB16,MAX('MDA1'!L16,'MDA2'!L16,'MDA5'!L16,MAX('MDA3'!J16,'MDA3'!M16),Z16,AO16)))","v":133269},223303,82.8861563268247]
[{"$f":"IF(COUNTRY_INFO!A17=0,\" \",COUNTRY_INFO!A17)","v":"Zanzibar"},{"$f":"IF(COUNTRY_INFO!B17=0,\" \",COUNTRY_INFO!B17)","v":"Kusini Pemba"},{"$f":"IF(COUNTRY_INFO!C17=0,\" \",COUNTRY_INFO!C17)","v":"Chake chake"},{"$f":"COUNTRY_INFO!L17","v":145946},null,null,{"$f":"MAX('MDA1'!M17,'MDA2'!M17,'MDA5'!M17)","v":88503},{"$f":"IF(AND(COUNTRY_INFO!H17>0,COUNTRY_INFO!H17<4),IF(D17>G17,G17,D17),0)","v":88503},{"$f":"IF(AND(COUNTRY_INFO!H17>0,COUNTRY_INFO!H17<4),IF(G17/D17*100<>0,IF(G17/D17*100>100,100,G17/D17*100),\"-\"),0)","v":60.6409219848437},{"$f":"COUNTRY_INFO!M17","v":"Not required"},null,null,{"$f":"MAX('MDA1'!M17,MAX('MDA3'!I17,'MDA3'!L17)+MAX('MDA3'!J17,'MDA3'!M17))","v":88503},{"$f":"IF(AND(COUNTRY_INFO!I17>0,COUNTRY_INFO!I17<4),IF(J17>M17,M17,J17),0)","v":0},{"$f":"IF(AND(COUNTRY_INFO!I17>0,COUNTRY_INFO!I17<4),IF(M17/J17*100<>0,IF(M17/J17*100>100,100,M17/J17*100),\"-\"),0)","v":0},{"$f":"COUNTRY_INFO!Q17","v":93712},null,null,{"$f":"MAX('MDA2'!J17,'MDA5'!J17,'T1'!K17,MAX(T3_R1!J17,T3_R2!J17,T3_R3!J17))","v":8948},{"$f":"IF(AND(COUNTRY_INFO!J17>1,COUNTRY_INFO!J17<99,COUNTRY_INFO!J17<>4,COUNTRY_INFO!J17<>5),IF(COUNTRY_INFO!N17>S17,S17,COUNTRY_INFO!N17),0)","v":8948},{"$f":"IF(AND(COUNTRY_INFO!J17>1,COUNTRY_INFO!J17<99,COUNTRY_INFO!J17<>4,COUNTRY_INFO!J17<>5),IF(T17/COUNTRY_INFO!N17*100<>0,IF(T17/COUNTRY_INFO!N17*100>100,100,T17/COUNTRY_INFO!N17*100),\"-\"),0)","v":46.8383584589615},{"$f":"MAX('MDA1'!K17,'MDA2'!K17,'MDA5'!K17,'T1'!L17,MAX(T3_R1!K17,T3_R2!K17,T3_R3!K17))","v":28996},{"$f":"IF(AND(COUNTRY_INFO!J17>1,COUNTRY_INFO!J17<99,COUNTRY_INFO!J17<>4,COUNTRY_INFO!J17<>5),IF(COUNTRY_INFO!O17>V17,V17,COUNTRY_INFO!O17),0)","v":28996},{"$f":"IF(AND(COUNTRY_INFO!J17>1,COUNTRY_INFO!J17<99,COUNTRY_INFO!J17<>4,COUNTRY_INFO!J17<>5),IF(W17/COUNTRY_INFO!O17*100<>0,IF(W17/COUNTRY_INFO!O17*100>100,100,W17/COUNTRY_INFO!O17*100),\"-\"),0)","v":73.4745590918305},{"$f":"MAX('MDA1'!L17,'MDA2'!L17,'MDA5'!L17,'T1'!M17,MAX(T3_R1!L17,T3_R2!L17,T3_R3!L17))","v":59507},{"$f":"IF(AND(COUNTRY_INFO!J17>1,COUNTRY_INFO!J17<99,COUNTRY_INFO!J17<>4,COUNTRY_INFO!J17<>5),IF(COUNTRY_INFO!P17>Y17,Y17,COUNTRY_INFO!P17),0)","v":35144},{"$f":"IF(AND(COUNTRY_INFO!J17>1,COUNTRY_INFO!J17<99,COUNTRY_INFO!J17<>4,COUNTRY_INFO!J17<>5),IF(Z17/COUNTRY_INFO!P17*100<>0,IF(Z17/COUNTRY_INFO!P17*100>100,100,Z17/COUNTRY_INFO!P17*100),\"-\"),0)","v":100},97451,73088,{"$f":"IF(AND(COUNTRY_INFO!J17>1,COUNTRY_INFO!J17<99,COUNTRY_INFO!J17<>4,COUNTRY_INFO!J17<>5),IF(AC17/P17*100<>0,IF(AC17/P17*100>100,100,AC17/P17*100),\"-\"),0)","v":77.9921461499061},{"$f":"COUNTRY_INFO!U17","v":136091},null,null,{"$f":"MAX('T1'!K17,'T2'!R17)","v":8948},{"$f":"IF(AND(COUNTRY_INFO!K17>1,COUNTRY_INFO!K17<99,COUNTRY_INFO!K17<>4,COUNTRY_INFO!K17<>5),IF(COUNTRY_INFO!R17>AH17,AH17,COUNTRY_INFO!R17),0)","v":8948},{"$f":"IF(AND(COUNTRY_INFO!K17>1,COUNTRY_INFO!K17<99,COUNTRY_INFO!K17<>4,COUNTRY_INFO!K17<>5),IF(AI17/COUNTRY_INFO!R17*100<>0,IF(AI17/COUNTRY_INFO!R17*100>100,100,AI17/COUNTRY_INFO!R17*100),\"-\"),0)","v":62.4511446119486},{"$f":"MAX('T1'!L17,'T2'!S17)","v":28996},{"$f":"IF(AND(COUNTRY_INFO!K17>1,COUNTRY_INFO!K17<99,COUNTRY_INFO!K17<>4,COUNTRY_INFO!K17<>5),IF(COUNTRY_INFO!S17>AK17,AK17,COUNTRY_INFO!S17),0)","v":28996},{"$f":"IF(AND(COUNTRY_INFO!K17>1,COUNTRY_INFO!K17<99,COUNTRY_INFO!K17<>4,COUNTRY_INFO!K17<>5),IF(AL17/COUNTRY_INFO!S17*100<>0,IF(AL17/COUNTRY_INFO!S17*100>100,100,AL17/COUNTRY_INFO!S17*100),\"-\"),0)","v":73.4745590918305},{"$f":"MAX('T1'!M17,'T2'!T17)","v":59507},{"$f":"IF(AND(COUNTRY_INFO!K17>1,COUNTRY_INFO!K17<99,COUNTRY_INFO!K17<>4,COUNTRY_INFO!K17<>5),IF(COUNTRY_INFO!T17>AN17,AN17,COUNTRY_INFO!T17),0)","v":59507},{"$f":"IF(AND(COUNTRY_INFO!K17>1,COUNTRY_INFO!K17<99,COUNTRY_INFO!K17<>4,COUNTRY_INFO!K17<>5),IF(AO17/COUNTRY_INFO!T17*100<>0,IF(AO17/COUNTRY_INFO!T17*100>100,100,AO17/COUNTRY_INFO!T17*100),\"-\"),0)","v":72.3058603385217},97451,97451,{"$f":"IF(AND(COUNTRY_INFO!K17>1,COUNTRY_INFO!K17<99,COUNTRY_INFO!K17<>4,COUNTRY_INFO!K17<>5),IF(AH17/AE17*100<>0,IF(AR17/AE17*100>100,100,AR17/AE17*100),\"-\"),0)","v":71.6072333953017},null,{"$f":"IF(AND(D17<>0,D17<>\"Unknown\",D17<>\"Stopped\",D17<>\"Not required\"),D17/COUNTRY_INFO!D17,0)","v":1},{"$f":"IF(AND(J17<>0,J17<>\"Unknown\",J17<>\"Stopped\",J17<>\"Not required\"),J17/COUNTRY_INFO!D17,0)","v":0},{"$f":"IF(AND(P17<>0,P17<>\"Unknown\",P17<>\"Surveillance\",P17<>\"Not required\"),P17/COUNTRY_INFO!Q17,0)","v":1},{"$f":"IF(AND(AE17<>0,AE17<>\"Unknown\",AE17<>\"Surveillance\",AE17<>\"Not required\"),AE17/COUNTRY_INFO!U17,0)","v":1},{"$f":"IF(AU17>0,D17*PROFILE!$G$7,IF(AV17>0,J17*PROFILE!$G$7,0))","v":5078.83978145413},{"$f":"_xlfn.IFS(OR(AU17>0,AW17>0),COUNTRY_INFO!E17,AV17>0,J17*PROFILE!$G$8,AX17>0,COUNTRY_INFO!R17,COUNTIFS(AU17:AX17,\">0\")=0,0)","v":19104},{"$f":"_xlfn.IFS(OR(AU17>0,AW17>0),COUNTRY_INFO!F17,AV17>0,J17*PROFILE!$G$9,AX17>0,COUNTRY_INFO!S17,COUNTIFS(AU17:AX17,\">0\")=0,0)","v":39464},{"$f":"_xlfn.IFS(AU17>0,COUNTRY_INFO!G17,AND(AV17>0,AW17=0,AX17=0),J17*PROFILE!$G$10,AND(AV17>0,AW17>0,AX17=0),MAX(J17*PROFILE!$G$10,COUNTRY_INFO!P17),AND(AV17>0,AW17=0,AX17>0),MAX(J17*PROFILE!$G$10,COUNTRY_INFO!T17),AND(AV17=0,AW17>0,AX17>0),MAX(COUNTRY_INFO!P17,COUNTRY_INFO!T17),AND(AV17=0,AW17>0,AX17=0),COUNTRY_INFO!P17,AND(AV17=0,AW17=0,AX17>0),COUNTRY_INFO!T17,AND(AV17>0,AW17>0,AX17>0),MAX(J17*PROFILE!$G$10,COUNTRY_INFO!P17,COUNTRY_INFO!T17),COUNTIFS(AU17:AX17,\">0\")=0,0)","v":82299},145945.839781454,"Y",{"$f":"MAX('MDA2'!J17,'MDA5'!J17,S17,AH17)","v":8948},{"$f":"MAX('MDA1'!K17,'MDA2'!K17,'MDA3'!I17,'MDA3'!L17,'MDA5'!K17,V17,AK17)","v":28996},{"$f":"MAX('MDA1'!L17,'MDA2'!L17,'MDA3'!J17,'MDA3'!M17,'MDA5'!L17,Y17,AN17)","v":59507},97451,{"$f":"_xlfn.IFS(AND(AU17=0,AW17=0,AX17=0),0,AND(AU17=0,AW17=0,AX17>0),AI17,AND(AU17=0,AW17>0,AX17=0),T17,AND(AU17=0,AW17>0,AX17>0),MAX(T17,AI17),AND(AU17>0,AW17=0,AX17=0),MIN(MAX('MDA2'!J17,'MDA5'!J17),AZ17),AND(AU17>0,AW17=0,AX17>0),MIN(MAX('MDA2'!J17,'MDA5'!J17,AI17),AZ17),AND(AU17>0,AW17>0,AX17=0),MIN(MAX('MDA2'!J17,'MDA5'!J17,T17),AZ17),AND(AU17>0,AW17>0,AX17>0),MIN(MAX('MDA2'!J17,'MDA5'!J17,AI17,T17),AZ17))","v":8948},{"$f":"_xlfn.IFS(AND(AU17=0,AV17=0,AW17=0,AX17=0),0,AND(AU17=0,AV17=0,AW17=0,AX17>0),AL17,AND(AU17=0,AV17=0,AW17>0,AX17=0),W17,AND(AU17=0,AV17=0,AW17>0,AX17>0),MAX(W17,AL17),AND(AU17=0,AV17>0,AW17=0,AX17=0),MIN(J17*PROFILE!$G$9,MAX('MDA3'!I17,'MDA3'!L17)),AND(AU17=0,AV17>0,AW17=0,AX17>0),MIN(J17*PROFILE!$G$9,MAX('MDA3'!I17,'MDA3'!L17,AL17)),AND(AU17=0,AV17>0,AW17>0,AX17=0),MIN(J17*PROFILE!$G$9,MAX('MDA3'!I17,'MDA3'!L17,W17)),AND(AU17=0,AV17>0,AW17>0,AX17>0),MIN(J17*PROFILE!$G$9,MAX('MDA3'!I17,'MDA3'!L17,W17,AL17)),AND(AU17>0,AV17=0,AW17=0,AX17=0),MIN(BA17,MAX('MDA1'!K17,'MDA2'!K17,'MDA5'!K17)),AND(AU17>0,AV17=0,AW17=0,AX17>0),MIN(BA17,MAX('MDA1'!K17,'MDA2'!K17,'MDA5'!K17,AL17)),AND(AU17>0,AV17=0,AW17>0,AX17=0),MIN(BA17,MAX('MDA1'!K17,'MDA2'!KL17,'MDA5'!K17,W17)),AND(AU17>0,AV17=0,AW17>0,AX17>0),MIN(BA17,MAX('MDA1'!K17,'MDA2'!K17,'MDA5'!K17,W17,AL17)),AND(AU17>0,AV17>0,AW17=0,AX17=0),MIN(BA17,MAX('MDA1'!K17,'MDA2'!K17,'MDA5'!K17,MAX('MDA3'!I17,'MDA3'!L17))),AND(AU17>0,AV17>0,AW17=0,AX17>0),MIN(BA17,MAX('MDA1'!K17,'MDA2'!K17,'MDA5'!K17,MAX('MDA3'!I17,'MDA3'!L17),AL17)),AND(AU17>0,AV17>0,AW17>0,AX17=0),MIN(BA17,MAX('MDA1'!K17,'MDA2'!K17,'MDA5'!K17,MAX('MDA3'!I17,'MDA3'!L17),W17)),AND(AU17>0,AV17>0,AW17>0,AX17>0),MIN(BA17,MAX('MDA1'!K17,'MDA2'!K17,'MDA5'!K17,MAX('MDA3'!I17,'MDA3'!L17),W17,AL17)))","v":28996},{"$f":"_xlfn.IFS(AND(AU17=0,AV17=0,AW17=0,AX17=0),0,AND(AU17=0,AV17=0,AW17=0,AX17>0),AO17,AND(AU17=0,AV17=0,AW17>0,AX17=0),Z17,AND(AU17=0,AV17=0,AW17>0,AX17>0),MAX(Z17,AO17),AND(AU17=0,AV17>0,AW17=0,AX17=0),MIN(J17*PROFILE!$G$10,MAX('MDA3'!J17,'MDA3'!J17)),AND(AU17=0,AV17>0,AW17=0,AX17>0),MIN(J17*PROFILE!$G$10,MAX('MDA3'!J17,'MDA3'!M17,AO17)),AND(AU17=0,AV17>0,AW17>0,AX17=0),MIN(J17*PROFILE!$G$10,MAX('MDA3'!J17,'MDA3'!M17,Z17)),AND(AU17=0,AV17>0,AW17>0,AX17>0),MIN(J17*PROFILE!$G$10,MAX('MDA3'!J17,'MDA3'!M17,Z17,AO17)),AND(AU17>0,AV17=0,AW17=0,AX17=0),MIN(BB17,MAX('MDA1'!L17,'MDA2'!L17,'MDA5'!L17)),AND(AU17>0,AV17=0,AW17=0,AX17>0),MIN(BB17,MAX('MDA1'!L17,'MDA2'!L17,'MDA5'!L17,AO17)),AND(AU17>0,AV17=0,AW17>0,AX17=0),MIN(BB17,MAX('MDA1'!L17,'MDA2'!L17,'MDA5'!L17,Z17)),AND(AU17>0,AV17=0,AW17>0,AX17>0),MIN(BB17,MAX('MDA1'!L17,'MDA2'!L17,'MDA5'!L17,Z17,AO17)),AND(AU17>0,AV17>0,AW17=0,AX17=0),MIN(BB17,MAX('MDA1'!L17,'MDA2'!L17,'MDA5'!L17,MAX('MDA3'!J17,'MDA3'!M17))),AND(AU17>0,AV17>0,AW17=0,AX17>0),MIN(BB17,MAX('MDA1'!L17,'MDA2'!L17,'MDA5'!L17,MAX('MDA3'!J17,'MDA3'!M17),AO17)),AND(AU17>0,AV17>0,AW17>0,AX17=0),MIN(BB17,MAX('MDA1'!L17,'MDA2'!L17,'MDA5'!L17,MAX('MDA3'!J17,'MDA3'!M17),Z17)),AND(AU17>0,AV17>0,AW17>0,AX17>0),MIN(BB17,MAX('MDA1'!L17,'MDA2'!L17,'MDA5'!L17,MAX('MDA3'!J17,'MDA3'!M17),Z17,AO17)))","v":59507},97451,66.7720300530166]
[{"$f":"IF(COUNTRY_INFO!A18=0,\" \",COUNTRY_INFO!A18)","v":"Zanzibar"},{"$f":"IF(COUNTRY_INFO!B18=0,\" \",COUNTRY_INFO!B18)","v":"Kusini Pemba"},{"$f":"IF(COUNTRY_INFO!C18=0,\" \",COUNTRY_INFO!C18)","v":"Mkoani"},{"$f":"COUNTRY_INFO!L18","v":145594},null,null,{"$f":"MAX('MDA1'!M18,'MDA2'!M18,'MDA5'!M18)","v":91715},{"$f":"IF(AND(COUNTRY_INFO!H18>0,COUNTRY_INFO!H18<4),IF(D18>G18,G18,D18),0)","v":91715},{"$f":"IF(AND(COUNTRY_INFO!H18>0,COUNTRY_INFO!H18<4),IF(G18/D18*100<>0,IF(G18/D18*100>100,100,G18/D18*100),\"-\"),0)","v":62.9936673214556},{"$f":"COUNTRY_INFO!M18","v":"Not required"},null,null,{"$f":"MAX('MDA1'!M18,MAX('MDA3'!I18,'MDA3'!L18)+MAX('MDA3'!J18,'MDA3'!M18))","v":91715},{"$f":"IF(AND(COUNTRY_INFO!I18>0,COUNTRY_INFO!I18<4),IF(J18>M18,M18,J18),0)","v":0},{"$f":"IF(AND(COUNTRY_INFO!I18>0,COUNTRY_INFO!I18<4),IF(M18/J18*100<>0,IF(M18/J18*100>100,100,M18/J18*100),\"-\"),0)","v":0},{"$f":"COUNTRY_INFO!Q18","v":93486},null,null,{"$f":"MAX('MDA2'!J18,'MDA5'!J18,'T1'!K18,MAX(T3_R1!J18,T3_R2!J18,T3_R3!J18))","v":8558},{"$f":"IF(AND(COUNTRY_INFO!J18>1,COUNTRY_INFO!J18<99,COUNTRY_INFO!J18<>4,COUNTRY_INFO!J18<>5),IF(COUNTRY_INFO!N18>S18,S18,COUNTRY_INFO!N18),0)","v":8558},{"$f":"IF(AND(COUNTRY_INFO!J18>1,COUNTRY_INFO!J18<99,COUNTRY_INFO!J18<>4,COUNTRY_INFO!J18<>5),IF(T18/COUNTRY_INFO!N18*100<>0,IF(T18/COUNTRY_INFO!N18*100>100,100,T18/COUNTRY_INFO!N18*100),\"-\"),0)","v":44.9050267604156},{"$f":"MAX('MDA1'!K18,'MDA2'!K18,'MDA5'!K18,'T1'!L18,MAX(T3_R1!K18,T3_R2!K18,T3_R3!K18))","v":35547},{"$f":"IF(AND(COUNTRY_INFO!J18>1,COUNTRY_INFO!J18<99,COUNTRY_INFO!J18<>4,COUNTRY_INFO!J18<>5),IF(COUNTRY_INFO!O18>V18,V18,COUNTRY_INFO!O18),0)","v":35547},{"$f":"IF(AND(COUNTRY_INFO!J18>1,COUNTRY_INFO!J18<99,COUNTRY_INFO!J18<>4,COUNTRY_INFO!J18<>5),IF(W18/COUNTRY_INFO!O18*100<>0,IF(W18/COUNTRY_INFO!O18*100>100,100,W18/COUNTRY_INFO!O18*100),\"-\"),0)","v":90.2918539967995},{"$f":"MAX('MDA1'!L18,'MDA2'!L18,'MDA5'!L18,'T1'!M18,MAX(T3_R1!L18,T3_R2!L18,T3_R3!L18))","v":56168},{"$f":"IF(AND(COUNTRY_INFO!J18>1,COUNTRY_INFO!J18<99,COUNTRY_INFO!J18<>4,COUNTRY_INFO!J18<>5),IF(COUNTRY_INFO!P18>Y18,Y18,COUNTRY_INFO!P18),0)","v":35059},{"$f":"IF(AND(COUNTRY_INFO!J18>1,COUNTRY_INFO!J18<99,COUNTRY_INFO!J18<>4,COUNTRY_INFO!J18<>5),IF(Z18/COUNTRY_INFO!P18*100<>0,IF(Z18/COUNTRY_INFO!P18*100>100,100,Z18/COUNTRY_INFO!P18*100),\"-\"),0)","v":100},100273,79164,{"$f":"IF(AND(COUNTRY_INFO!J18>1,COUNTRY_INFO!J18<99,COUNTRY_INFO!J18<>4,COUNTRY_INFO!J18<>5),IF(AC18/P18*100<>0,IF(AC18/P18*100>100,100,AC18/P18*100),\"-\"),0)","v":84.6800590462743},{"$f":"COUNTRY_INFO!U18","v":135763},null,null,{"$f":"MAX('T1'!K18,'T2'!R18)","v":8843},{"$f":"IF(AND(COUNTRY_INFO!K18>1,COUNTRY_INFO!K18<99,COUNTRY_INFO!K18<>4,COUNTRY_INFO!K18<>5),IF(COUNTRY_INFO!R18>AH18,AH18,COUNTRY_INFO!R18),0)","v":8843},{"$f":"IF(AND(COUNTRY_INFO!K18>1,COUNTRY_INFO!K18<99,COUNTRY_INFO!K18<>4,COUNTRY_INFO!K18<>5),IF(AI18/COUNTRY_INFO!R18*100<>0,IF(AI18/COUNTRY_INFO!R18*100>100,100,AI18/COUNTRY_INFO!R18*100),\"-\"),0)","v":61.8651182314258},{"$f":"MAX('T1'!L18,'T2'!S18)","v":35547},{"$f":"IF(AND(COUNTRY_INFO!K18>1,COUNTRY_INFO!K18<99,COUNTRY_INFO!K18<>4,COUNTRY_INFO!K18<>5),IF(COUNTRY_INFO!S18>AK18,AK18,COUNTRY_INFO!S18),0)","v":35547},{"$f":"IF(AND(COUNTRY_INFO!K18>1,COUNTRY_INFO!K18<99,COUNTRY_INFO!K18<>4,COUNTRY_INFO!K18<>5),IF(AL18/COUNTRY_INFO!S18*100<>0,IF(AL18/COUNTRY_INFO!S18*100>100,100,AL18/COUNTRY_INFO!S18*100),\"-\"),0)","v":90.2918539967995},{"$f":"MAX('T1'!M18,'T2'!T18)","v":56168},{"$f":"IF(AND(COUNTRY_INFO!K18>1,COUNTRY_INFO!K18<99,COUNTRY_INFO!K18<>4,COUNTRY_INFO!K18<>5),IF(COUNTRY_INFO!T18>AN18,AN18,COUNTRY_INFO!T18),0)","v":56168},{"$f":"IF(AND(COUNTRY_INFO!K18>1,COUNTRY_INFO!K18<99,COUNTRY_INFO!K18<>4,COUNTRY_INFO!K18<>5),IF(AO18/COUNTRY_INFO!T18*100<>0,IF(AO18/COUNTRY_INFO!T18*100>100,100,AO18/COUNTRY_INFO!T18*100),\"-\"),0)","v":68.4141291108404},100558,100558,{"$f":"IF(AND(COUNTRY_INFO!K18>1,COUNTRY_INFO!K18<99,COUNTRY_INFO!K18<>4,COUNTRY_INFO!K18<>5),IF(AH18/AE18*100<>0,IF(AR18/AE18*100>100,100,AR18/AE18*100),\"-\"),0)","v":74.0687816268055},null,{"$f":"IF(AND(D18<>0,D18<>\"Unknown\",D18<>\"Stopped\",D18<>\"Not required\"),D18/COUNTRY_INFO!D18,0)","v":1},{"$f":"IF(AND(J18<>0,J18<>\"Unknown\",J18<>\"Stopped\",J18<>\"Not required\"),J18/COUNTRY_INFO!D18,0)","v":0},{"$f":"IF(AND(P18<>0,P18<>\"Unknown\",P18<>\"Surveillance\",P18<>\"Not required\"),P18/COUNTRY_INFO!Q18,0)","v":1},{"$f":"IF(AND(AE18<>0,AE18<>\"Unknown\",AE18<>\"Surveillance\",AE18<>\"Not required\"),AE18/COUNTRY_INFO!U18,0)","v":1},{"$f":"IF(AU18>0,D18*PROFILE!$G$7,IF(AV18>0,J18*PROFILE!$G$7,0))","v":5066.59037685879},{"$f":"_xlfn.IFS(OR(AU18>0,AW18>0),COUNTRY_INFO!E18,AV18>0,J18*PROFILE!$G$8,AX18>0,COUNTRY_INFO!R18,COUNTIFS(AU18:AX18,\">0\")=0,0)","v":19058},{"$f":"_xlfn.IFS(OR(AU18>0,AW18>0),COUNTRY_INFO!F18,AV18>0,J18*PROFILE!$G$9,AX18>0,COUNTRY_INFO!S18,COUNTIFS(AU18:AX18,\">0\")=0,0)","v":39369},{"$f":"_xlfn.IFS(AU18>0,COUNTRY_INFO!G18,AND(AV18>0,AW18=0,AX18=0),J18*PROFILE!$G$10,AND(AV18>0,AW18>0,AX18=0),MAX(J18*PROFILE!$G$10,COUNTRY_INFO!P18),AND(AV18>0,AW18=0,AX18>0),MAX(J18*PROFILE!$G$10,COUNTRY_INFO!T18),AND(AV18=0,AW18>0,AX18>0),MAX(COUNTRY_INFO!P18,COUNTRY_INFO!T18),AND(AV18=0,AW18>0,AX18=0),COUNTRY_INFO!P18,AND(AV18=0,AW18=0,AX18>0),COUNTRY_INFO!T18,AND(AV18>0,AW18>0,AX18>0),MAX(J18*PROFILE!$G$10,COUNTRY_INFO!P18,COUNTRY_INFO!T18),COUNTIFS(AU18:AX18,\">0\")=0,0)","v":82100},145593.590376859,"Y",{"$f":"MAX('MDA2'!J18,'MDA5'!J18,S18,AH18)","v":8843},{"$f":"MAX('MDA1'!K18,'MDA2'!K18,'MDA3'!I18,'MDA3'!L18,'MDA5'!K18,V18,AK18)","v":35547},{"$f":"MAX('MDA1'!L18,'MDA2'!L18,'MDA3'!J18,'MDA3'!M18,'MDA5'!L18,Y18,AN18)","v":56168},100558,{"$f":"_xlfn.IFS(AND(AU18=0,AW18=0,AX18=0),0,AND(AU18=0,AW18=0,AX18>0),AI18,AND(AU18=0,AW18>0,AX18=0),T18,AND(AU18=0,AW18>0,AX18>0),MAX(T18,AI18),AND(AU18>0,AW18=0,AX18=0),MIN(MAX('MDA2'!J18,'MDA5'!J18),AZ18),AND(AU18>0,AW18=0,AX18>0),MIN(MAX('MDA2'!J18,'MDA5'!J18,AI18),AZ18),AND(AU18>0,AW18>0,AX18=0),MIN(MAX('MDA2'!J18,'MDA5'!J18,T18),AZ18),AND(AU18>0,AW18>0,AX18>0),MIN(MAX('MDA2'!J18,'MDA5'!J18,AI18,T18),AZ18))","v":8843},{"$f":"_xlfn.IFS(AND(AU18=0,AV18=0,AW18=0,AX18=0),0,AND(AU18=0,AV18=0,AW18=0,AX18>0),AL18,AND(AU18=0,AV18=0,AW18>0,AX18=0),W18,AND(AU18=0,AV18=0,AW18>0,AX18>0),MAX(W18,AL18),AND(AU18=0,AV18>0,AW18=0,AX18=0),MIN(J18*PROFILE!$G$9,MAX('MDA3'!I18,'MDA3'!L18)),AND(AU18=0,AV18>0,AW18=0,AX18>0),MIN(J18*PROFILE!$G$9,MAX('MDA3'!I18,'MDA3'!L18,AL18)),AND(AU18=0,AV18>0,AW18>0,AX18=0),MIN(J18*PROFILE!$G$9,MAX('MDA3'!I18,'MDA3'!L18,W18)),AND(AU18=0,AV18>0,AW18>0,AX18>0),MIN(J18*PROFILE!$G$9,MAX('MDA3'!I18,'MDA3'!L18,W18,AL18)),AND(AU18>0,AV18=0,AW18=0,AX18=0),MIN(BA18,MAX('MDA1'!K18,'MDA2'!K18,'MDA5'!K18)),AND(AU18>0,AV18=0,AW18=0,AX18>0),MIN(BA18,MAX('MDA1'!K18,'MDA2'!K18,'MDA5'!K18,AL18)),AND(AU18>0,AV18=0,AW18>0,AX18=0),MIN(BA18,MAX('MDA1'!K18,'MDA2'!KL18,'MDA5'!K18,W18)),AND(AU18>0,AV18=0,AW18>0,AX18>0),MIN(BA18,MAX('MDA1'!K18,'MDA2'!K18,'MDA5'!K18,W18,AL18)),AND(AU18>0,AV18>0,AW18=0,AX18=0),MIN(BA18,MAX('MDA1'!K18,'MDA2'!K18,'MDA5'!K18,MAX('MDA3'!I18,'MDA3'!L18))),AND(AU18>0,AV18>0,AW18=0,AX18>0),MIN(BA18,MAX('MDA1'!K18,'MDA2'!K18,'MDA5'!K18,MAX('MDA3'!I18,'MDA3'!L18),AL18)),AND(AU18>0,AV18>0,AW18>0,AX18=0),MIN(BA18,MAX('MDA1'!K18,'MDA2'!K18,'MDA5'!K18,MAX('MDA3'!I18,'MDA3'!L18),W18)),AND(AU18>0,AV18>0,AW18>0,AX18>0),MIN(BA18,MAX('MDA1'!K18,'MDA2'!K18,'MDA5'!K18,MAX('MDA3'!I18,'MDA3'!L18),W18,AL18)))","v":35547},{"$f":"_xlfn.IFS(AND(AU18=0,AV18=0,AW18=0,AX18=0),0,AND(AU18=0,AV18=0,AW18=0,AX18>0),AO18,AND(AU18=0,AV18=0,AW18>0,AX18=0),Z18,AND(AU18=0,AV18=0,AW18>0,AX18>0),MAX(Z18,AO18),AND(AU18=0,AV18>0,AW18=0,AX18=0),MIN(J18*PROFILE!$G$10,MAX('MDA3'!J18,'MDA3'!J18)),AND(AU18=0,AV18>0,AW18=0,AX18>0),MIN(J18*PROFILE!$G$10,MAX('MDA3'!J18,'MDA3'!M18,AO18)),AND(AU18=0,AV18>0,AW18>0,AX18=0),MIN(J18*PROFILE!$G$10,MAX('MDA3'!J18,'MDA3'!M18,Z18)),AND(AU18=0,AV18>0,AW18>0,AX18>0),MIN(J18*PROFILE!$G$10,MAX('MDA3'!J18,'MDA3'!M18,Z18,AO18)),AND(AU18>0,AV18=0,AW18=0,AX18=0),MIN(BB18,MAX('MDA1'!L18,'MDA2'!L18,'MDA5'!L18)),AND(AU18>0,AV18=0,AW18=0,AX18>0),MIN(BB18,MAX('MDA1'!L18,'MDA2'!L18,'MDA5'!L18,AO18)),AND(AU18>0,AV18=0,AW18>0,AX18=0),MIN(BB18,MAX('MDA1'!L18,'MDA2'!L18,'MDA5'!L18,Z18)),AND(AU18>0,AV18=0,AW18>0,AX18>0),MIN(BB18,MAX('MDA1'!L18,'MDA2'!L18,'MDA5'!L18,Z18,AO18)),AND(AU18>0,AV18>0,AW18=0,AX18=0),MIN(BB18,MAX('MDA1'!L18,'MDA2'!L18,'MDA5'!L18,MAX('MDA3'!J18,'MDA3'!M18))),AND(AU18>0,AV18>0,AW18=0,AX18>0),MIN(BB18,MAX('MDA1'!L18,'MDA2'!L18,'MDA5'!L18,MAX('MDA3'!J18,'MDA3'!M18),AO18)),AND(AU18>0,AV18>0,AW18>0,AX18=0),MIN(BB18,MAX('MDA1'!L18,'MDA2'!L18,'MDA5'!L18,MAX('MDA3'!J18,'MDA3'!M18),Z18)),AND(AU18>0,AV18>0,AW18>0,AX18>0),MIN(BB18,MAX('MDA1'!L18,'MDA2'!L18,'MDA5'!L18,MAX('MDA3'!J18,'MDA3'!M18),Z18,AO18)))","v":56168},100558,69.0676009429486]
[{"$f":"IF(COUNTRY_INFO!A19=0,\" \",COUNTRY_INFO!A19)","v":"Zanzibar"},{"$f":"IF(COUNTRY_INFO!B19=0,\" \",COUNTRY_INFO!B19)","v":"Kaskazini Pemba"},{"$f":"IF(COUNTRY_INFO!C19=0,\" \",COUNTRY_INFO!C19)","v":"Wete"},{"$f":"COUNTRY_INFO!L19","v":159785},null,null,{"$f":"MAX('MDA1'!M19,'MDA2'!M19,'MDA5'!M19)","v":98591},{"$f":"IF(AND(COUNTRY_INFO!H19>0,COUNTRY_INFO!H19<4),IF(D19>G19,G19,D19),0)","v":98591},{"$f":"IF(AND(COUNTRY_INFO!H19>0,COUNTRY_INFO!H19<4),IF(G19/D19*100<>0,IF(G19/D19*100>100,100,G19/D19*100),\"-\"),0)","v":61.7022874487593},{"$f":"COUNTRY_INFO!M19","v":"Not required"},null,null,{"$f":"MAX('MDA1'!M19,MAX('MDA3'!I19,'MDA3'!L19)+MAX('MDA3'!J19,'MDA3'!M19))","v":98591},{"$f":"IF(AND(COUNTRY_INFO!I19>0,COUNTRY_INFO!I19<4),IF(J19>M19,M19,J19),0)","v":0},{"$f":"IF(AND(COUNTRY_INFO!I19>0,COUNTRY_INFO!I19<4),IF(M19/J19*100<>0,IF(M19/J19*100>100,100,M19/J19*100),\"-\"),0)","v":0},{"$f":"COUNTRY_INFO!Q19","v":102598},null,null,{"$f":"MAX('MDA2'!J19,'MDA5'!J19,'T1'!K19,MAX(T3_R1!J19,T3_R2!J19,T3_R3!J19))","v":8552},{"$f":"IF(AND(COUNTRY_INFO!J19>1,COUNTRY_INFO!J19<99,COUNTRY_INFO!J19<>4,COUNTRY_INFO!J19<>5),IF(COUNTRY_INFO!N19>S19,S19,COUNTRY_INFO!N19),0)","v":8552},{"$f":"IF(AND(COUNTRY_INFO!J19>1,COUNTRY_INFO!J19<99,COUNTRY_INFO!J19<>4,COUNTRY_INFO!J19<>5),IF(T19/COUNTRY_INFO!N19*100<>0,IF(T19/COUNTRY_INFO!N19*100>100,100,T19/COUNTRY_INFO!N19*100),\"-\"),0)","v":40.8873589596481},{"$f":"MAX('MDA1'!K19,'MDA2'!K19,'MDA5'!K19,'T1'!L19,MAX(T3_R1!K19,T3_R2!K19,T3_R3!K19))","v":36500},{"$f":"IF(AND(COUNTRY_INFO!J19>1,COUNTRY_INFO!J19<99,COUNTRY_INFO!J19<>4,COUNTRY_INFO!J19<>5),IF(COUNTRY_INFO!O19>V19,V19,COUNTRY_INFO!O19),0)","v":36500},{"$f":"IF(AND(COUNTRY_INFO!J19>1,COUNTRY_INFO!J19<99,COUNTRY_INFO!J19<>4,COUNTRY_INFO!J19<>5),IF(W19/COUNTRY_INFO!O19*100<>0,IF(W19/COUNTRY_INFO!O19*100>100,100,W19/COUNTRY_INFO!O19*100),\"-\"),0)","v":84.4790075452483},{"$f":"MAX('MDA1'!L19,'MDA2'!L19,'MDA5'!L19,'T1'!M19,MAX(T3_R1!L19,T3_R2!L19,T3_R3!L19))","v":62091},{"$f":"IF(AND(COUNTRY_INFO!J19>1,COUNTRY_INFO!J19<99,COUNTRY_INFO!J19<>4,COUNTRY_INFO!J19<>5),IF(COUNTRY_INFO!P19>Y19,Y19,COUNTRY_INFO!P19),0)","v":38476},{"$f":"IF(AND(COUNTRY_INFO!J19>1,COUNTRY_INFO!J19<99,COUNTRY_INFO!J19<>4,COUNTRY_INFO!J19<>5),IF(Z19/COUNTRY_INFO!P19*100<>0,IF(Z19/COUNTRY_INFO!P19*100>100,100,Z19/COUNTRY_INFO!P19*100),\"-\"),0)","v":100},107143,83528,{"$f":"IF(AND(COUNTRY_INFO!J19>1,COUNTRY_INFO!J19<99,COUNTRY_INFO!J19<>4,COUNTRY_INFO!J19<>5),IF(AC19/P19*100<>0,IF(AC19/P19*100>100,100,AC19/P19*100),\"-\"),0)","v":81.4128930388507},{"$f":"COUNTRY_INFO!U19","v":148996},null,null,{"$f":"MAX('T1'!K19,'T2'!R19)","v":8552},{"$f":"IF(AND(COUNTRY_INFO!K19>1,COUNTRY_INFO!K19<99,COUNTRY_INFO!K19<>4,COUNTRY_INFO!K19<>5),IF(COUNTRY_INFO!R19>AH19,AH19,COUNTRY_INFO!R19),0)","v":8552},{"$f":"IF(AND(COUNTRY_INFO!K19>1,COUNTRY_INFO!K19<99,COUNTRY_INFO!K19<>4,COUNTRY_INFO!K19<>5),IF(AI19/COUNTRY_INFO!R19*100<>0,IF(AI19/COUNTRY_INFO!R19*100>100,100,AI19/COUNTRY_INFO!R19*100),\"-\"),0)","v":54.5164786128641},{"$f":"MAX('T1'!L19,'T2'!S19)","v":36500},{"$f":"IF(AND(COUNTRY_INFO!K19>1,COUNTRY_INFO!K19<99,COUNTRY_INFO!K19<>4,COUNTRY_INFO!K19<>5),IF(COUNTRY_INFO!S19>AK19,AK19,COUNTRY_INFO!S19),0)","v":36500},{"$f":"IF(AND(COUNTRY_INFO!K19>1,COUNTRY_INFO!K19<99,COUNTRY_INFO!K19<>4,COUNTRY_INFO!K19<>5),IF(AL19/COUNTRY_INFO!S19*100<>0,IF(AL19/COUNTRY_INFO!S19*100>100,100,AL19/COUNTRY_INFO!S19*100),\"-\"),0)","v":84.4790075452483},{"$f":"MAX('T1'!M19,'T2'!T19)","v":62091},{"$f":"IF(AND(COUNTRY_INFO!K19>1,COUNTRY_INFO!K19<99,COUNTRY_INFO!K19<>4,COUNTRY_INFO!K19<>5),IF(COUNTRY_INFO!T19>AN19,AN19,COUNTRY_INFO!T19),0)","v":62091},{"$f":"IF(AND(COUNTRY_INFO!K19>1,COUNTRY_INFO!K19<99,COUNTRY_INFO!K19<>4,COUNTRY_INFO!K19<>5),IF(AO19/COUNTRY_INFO!T19*100<>0,IF(AO19/COUNTRY_INFO!T19*100>100,100,AO19/COUNTRY_INFO!T19*100),\"-\"),0)","v":68.9111350343496},107143,107143,{"$f":"IF(AND(COUNTRY_INFO!K19>1,COUNTRY_INFO!K19<99,COUNTRY_INFO!K19<>4,COUNTRY_INFO!K19<>5),IF(AH19/AE19*100<>0,IF(AR19/AE19*100>100,100,AR19/AE19*100),\"-\"),0)","v":71.9099841606486},null,{"$f":"IF(AND(D19<>0,D19<>\"Unknown\",D19<>\"Stopped\",D19<>\"Not required\"),D19/COUNTRY_INFO!D19,0)","v":1},{"$f":"IF(AND(J19<>0,J19<>\"Unknown\",J19<>\"Stopped\",J19<>\"Not required\"),J19/COUNTRY_INFO!D19,0)","v":0},{"$f":"IF(AND(P19<>0,P19<>\"Unknown\",P19<>\"Surveillance\",P19<>\"Not required\"),P19/COUNTRY_INFO!Q19,0)","v":1},{"$f":"IF(AND(AE19<>0,AE19<>\"Unknown\",AE19<>\"Surveillance\",AE19<>\"Not required\"),AE19/COUNTRY_INFO!U19,0)","v":1},{"$f":"IF(AU19>0,D19*PROFILE!$G$7,IF(AV19>0,J19*PROFILE!$G$7,0))","v":5560.4292990534},{"$f":"_xlfn.IFS(OR(AU19>0,AW19>0),COUNTRY_INFO!E19,AV19>0,J19*PROFILE!$G$8,AX19>0,COUNTRY_INFO!R19,COUNTIFS(AU19:AX19,\">0\")=0,0)","v":20916},{"$f":"_xlfn.IFS(OR(AU19>0,AW19>0),COUNTRY_INFO!F19,AV19>0,J19*PROFILE!$G$9,AX19>0,COUNTRY_INFO!S19,COUNTIFS(AU19:AX19,\">0\")=0,0)","v":43206},{"$f":"_xlfn.IFS(AU19>0,COUNTRY_INFO!G19,AND(AV19>0,AW19=0,AX19=0),J19*PROFILE!$G$10,AND(AV19>0,AW19>0,AX19=0),MAX(J19*PROFILE!$G$10,COUNTRY_INFO!P19),AND(AV19>0,AW19=0,AX19>0),MAX(J19*PROFILE!$G$10,COUNTRY_INFO!T19),AND(AV19=0,AW19>0,AX19>0),MAX(COUNTRY_INFO!P19,COUNTRY_INFO!T19),AND(AV19=0,AW19>0,AX19=0),COUNTRY_INFO!P19,AND(AV19=0,AW19=0,AX19>0),COUNTRY_INFO!T19,AND(AV19>0,AW19>0,AX19>0),MAX(J19*PROFILE!$G$10,COUNTRY_INFO!P19,COUNTRY_INFO!T19),COUNTIFS(AU19:AX19,\">0\")=0,0)","v":90103},159785.429299053,"Y",{"$f":"MAX('MDA2'!J19,'MDA5'!J19,S19,AH19)","v":8552},{"$f":"MAX('MDA1'!K19,'MDA2'!K19,'MDA3'!I19,'MDA3'!L19,'MDA5'!K19,V19,AK19)","v":36500},{"$f":"MAX('MDA1'!L19,'MDA2'!L19,'MDA3'!J19,'MDA3'!M19,'MDA5'!L19,Y19,AN19)","v":62091},107143,{"$f":"_xlfn.IFS(AND(AU19=0,AW19=0,AX19=0),0,AND(AU19=0,AW19=0,AX19>0),AI19,AND(AU19=0,AW19>0,AX19=0),T19,AND(AU19=0,AW19>0,AX19>0),MAX(T19,AI19),AND(AU19>0,AW19=0,AX19=0),MIN(MAX('MDA2'!J19,'MDA5'!J19),AZ19),AND(AU19>0,AW19=0,AX19>0),MIN(MAX('MDA2'!J19,'MDA5'!J19,AI19),AZ19),AND(AU19>0,AW19>0,AX19=0),MIN(MAX('MDA2'!J19,'MDA5'!J19,T19),AZ19),AND(AU19>0,AW19>0,AX19>0),MIN(MAX('MDA2'!J19,'MDA5'!J19,AI19,T19),AZ19))","v":8552},{"$f":"_xlfn.IFS(AND(AU19=0,AV19=0,AW19=0,AX19=0),0,AND(AU19=0,AV19=0,AW19=0,AX19>0),AL19,AND(AU19=0,AV19=0,AW19>0,AX19=0),W19,AND(AU19=0,AV19=0,AW19>0,AX19>0),MAX(W19,AL19),AND(AU19=0,AV19>0,AW19=0,AX19=0),MIN(J19*PROFILE!$G$9,MAX('MDA3'!I19,'MDA3'!L19)),AND(AU19=0,AV19>0,AW19=0,AX19>0),MIN(J19*PROFILE!$G$9,MAX('MDA3'!I19,'MDA3'!L19,AL19)),AND(AU19=0,AV19>0,AW19>0,AX19=0),MIN(J19*PROFILE!$G$9,MAX('MDA3'!I19,'MDA3'!L19,W19)),AND(AU19=0,AV19>0,AW19>0,AX19>0),MIN(J19*PROFILE!$G$9,MAX('MDA3'!I19,'MDA3'!L19,W19,AL19)),AND(AU19>0,AV19=0,AW19=0,AX19=0),MIN(BA19,MAX('MDA1'!K19,'MDA2'!K19,'MDA5'!K19)),AND(AU19>0,AV19=0,AW19=0,AX19>0),MIN(BA19,MAX('MDA1'!K19,'MDA2'!K19,'MDA5'!K19,AL19)),AND(AU19>0,AV19=0,AW19>0,AX19=0),MIN(BA19,MAX('MDA1'!K19,'MDA2'!KL19,'MDA5'!K19,W19)),AND(AU19>0,AV19=0,AW19>0,AX19>0),MIN(BA19,MAX('MDA1'!K19,'MDA2'!K19,'MDA5'!K19,W19,AL19)),AND(AU19>0,AV19>0,AW19=0,AX19=0),MIN(BA19,MAX('MDA1'!K19,'MDA2'!K19,'MDA5'!K19,MAX('MDA3'!I19,'MDA3'!L19))),AND(AU19>0,AV19>0,AW19=0,AX19>0),MIN(BA19,MAX('MDA1'!K19,'MDA2'!K19,'MDA5'!K19,MAX('MDA3'!I19,'MDA3'!L19),AL19)),AND(AU19>0,AV19>0,AW19>0,AX19=0),MIN(BA19,MAX('MDA1'!K19,'MDA2'!K19,'MDA5'!K19,MAX('MDA3'!I19,'MDA3'!L19),W19)),AND(AU19>0,AV19>0,AW19>0,AX19>0),MIN(BA19,MAX('MDA1'!K19,'MDA2'!K19,'MDA5'!K19,MAX('MDA3'!I19,'MDA3'!L19),W19,AL19)))","v":36500},{"$f":"_xlfn.IFS(AND(AU19=0,AV19=0,AW19=0,AX19=0),0,AND(AU19=0,AV19=0,AW19=0,AX19>0),AO19,AND(AU19=0,AV19=0,AW19>0,AX19=0),Z19,AND(AU19=0,AV19=0,AW19>0,AX19>0),MAX(Z19,AO19),AND(AU19=0,AV19>0,AW19=0,AX19=0),MIN(J19*PROFILE!$G$10,MAX('MDA3'!J19,'MDA3'!J19)),AND(AU19=0,AV19>0,AW19=0,AX19>0),MIN(J19*PROFILE!$G$10,MAX('MDA3'!J19,'MDA3'!M19,AO19)),AND(AU19=0,AV19>0,AW19>0,AX19=0),MIN(J19*PROFILE!$G$10,MAX('MDA3'!J19,'MDA3'!M19,Z19)),AND(AU19=0,AV19>0,AW19>0,AX19>0),MIN(J19*PROFILE!$G$10,MAX('MDA3'!J19,'MDA3'!M19,Z19,AO19)),AND(AU19>0,AV19=0,AW19=0,AX19=0),MIN(BB19,MAX('MDA1'!L19,'MDA2'!L19,'MDA5'!L19)),AND(AU19>0,AV19=0,AW19=0,AX19>0),MIN(BB19,MAX('MDA1'!L19,'MDA2'!L19,'MDA5'!L19,AO19)),AND(AU19>0,AV19=0,AW19>0,AX19=0),MIN(BB19,MAX('MDA1'!L19,'MDA2'!L19,'MDA5'!L19,Z19)),AND(AU19>0,AV19=0,AW19>0,AX19>0),MIN(BB19,MAX('MDA1'!L19,'MDA2'!L19,'MDA5'!L19,Z19,AO19)),AND(AU19>0,AV19>0,AW19=0,AX19=0),MIN(BB19,MAX('MDA1'!L19,'MDA2'!L19,'MDA5'!L19,MAX('MDA3'!J19,'MDA3'!M19))),AND(AU19>0,AV19>0,AW19=0,AX19>0),MIN(BB19,MAX('MDA1'!L19,'MDA2'!L19,'MDA5'!L19,MAX('MDA3'!J19,'MDA3'!M19),AO19)),AND(AU19>0,AV19>0,AW19>0,AX19=0),MIN(BB19,MAX('MDA1'!L19,'MDA2'!L19,'MDA5'!L19,MAX('MDA3'!J19,'MDA3'!M19),Z19)),AND(AU19>0,AV19>0,AW19>0,AX19>0),MIN(BB19,MAX('MDA1'!L19,'MDA2'!L19,'MDA5'!L19,MAX('MDA3'!J19,'MDA3'!M19),Z19,AO19)))","v":62091},107143,67.0542993000143]
[{"$f":"IF(COUNTRY_INFO!A20=0,\" \",COUNTRY_INFO!A20)","v":"Zanzibar"},{"$f":"IF(COUNTRY_INFO!B20=0,\" \",COUNTRY_INFO!B20)","v":"Kaskazini Pemba"},{"$f":"IF(COUNTRY_INFO!C20=0,\" \",COUNTRY_INFO!C20)","v":"Micheweni"},{"$f":"COUNTRY_INFO!L20","v":155543},null,null,{"$f":"MAX('MDA1'!M20,'MDA2'!M20,'MDA5'!M20)","v":89380},{"$f":"IF(AND(COUNTRY_INFO!H20>0,COUNTRY_INFO!H20<4),IF(D20>G20,G20,D20),0)","v":89380},{"$f":"IF(AND(COUNTRY_INFO!H20>0,COUNTRY_INFO!H20<4),IF(G20/D20*100<>0,IF(G20/D20*100>100,100,G20/D20*100),\"-\"),0)","v":57.4632095304835},{"$f":"COUNTRY_INFO!M20","v":"Not required"},null,null,{"$f":"MAX('MDA1'!M20,MAX('MDA3'!I20,'MDA3'!L20)+MAX('MDA3'!J20,'MDA3'!M20))","v":89380},{"$f":"IF(AND(COUNTRY_INFO!I20>0,COUNTRY_INFO!I20<4),IF(J20>M20,M20,J20),0)","v":0},{"$f":"IF(AND(COUNTRY_INFO!I20>0,COUNTRY_INFO!I20<4),IF(M20/J20*100<>0,IF(M20/J20*100>100,100,M20/J20*100),\"-\"),0)","v":0},{"$f":"COUNTRY_INFO!Q20","v":99875},null,null,{"$f":"MAX('MDA2'!J20,'MDA5'!J20,'T1'!K20,MAX(T3_R1!J20,T3_R2!J20,T3_R3!J20))","v":10086},{"$f":"IF(AND(COUNTRY_INFO!J20>1,COUNTRY_INFO!J20<99,COUNTRY_INFO!J20<>4,COUNTRY_INFO!J20<>5),IF(COUNTRY_INFO!N20>S20,S20,COUNTRY_INFO!N20),0)","v":10086},{"$f":"IF(AND(COUNTRY_INFO!J20>1,COUNTRY_INFO!J20<99,COUNTRY_INFO!J20<>4,COUNTRY_INFO!J20<>5),IF(T20/COUNTRY_INFO!N20*100<>0,IF(T20/COUNTRY_INFO!N20*100>100,100,T20/COUNTRY_INFO!N20*100),\"-\"),0)","v":49.5358774127007},{"$f":"MAX('MDA1'!K20,'MDA2'!K20,'MDA5'!K20,'T1'!L20,MAX(T3_R1!K20,T3_R2!K20,T3_R3!K20))","v":32737},{"$f":"IF(AND(COUNTRY_INFO!J20>1,COUNTRY_INFO!J20<99,COUNTRY_INFO!J20<>4,COUNTRY_INFO!J20<>5),IF(COUNTRY_INFO!O20>V20,V20,COUNTRY_INFO!O20),0)","v":32737},{"$f":"IF(AND(COUNTRY_INFO!J20>1,COUNTRY_INFO!J20<99,COUNTRY_INFO!J20<>4,COUNTRY_INFO!J20<>5),IF(W20/COUNTRY_INFO!O20*100<>0,IF(W20/COUNTRY_INFO!O20*100>100,100,W20/COUNTRY_INFO!O20*100),\"-\"),0)","v":77.8358971920398},{"$f":"MAX('MDA1'!L20,'MDA2'!L20,'MDA5'!L20,'T1'!M20,MAX(T3_R1!L20,T3_R2!L20,T3_R3!L20))","v":56643},{"$f":"IF(AND(COUNTRY_INFO!J20>1,COUNTRY_INFO!J20<99,COUNTRY_INFO!J20<>4,COUNTRY_INFO!J20<>5),IF(COUNTRY_INFO!P20>Y20,Y20,COUNTRY_INFO!P20),0)","v":37455},{"$f":"IF(AND(COUNTRY_INFO!J20>1,COUNTRY_INFO!J20<99,COUNTRY_INFO!J20<>4,COUNTRY_INFO!J20<>5),IF(Z20/COUNTRY_INFO!P20*100<>0,IF(Z20/COUNTRY_INFO!P20*100>100,100,Z20/COUNTRY_INFO!P20*100),\"-\"),0)","v":100},99466,80278,{"$f":"IF(AND(COUNTRY_INFO!J20>1,COUNTRY_INFO!J20<99,COUNTRY_INFO!J20<>4,COUNTRY_INFO!J20<>5),IF(AC20/P20*100<>0,IF(AC20/P20*100>100,100,AC20/P20*100),\"-\"),0)","v":80.3784730913642},{"$f":"COUNTRY_INFO!U20","v":145041},null,null,{"$f":"MAX('T1'!K20,'T2'!R20)","v":5063},{"$f":"IF(AND(COUNTRY_INFO!K20>1,COUNTRY_INFO!K20<99,COUNTRY_INFO!K20<>4,COUNTRY_INFO!K20<>5),IF(COUNTRY_INFO!R20>AH20,AH20,COUNTRY_INFO!R20),0)","v":5063},{"$f":"IF(AND(COUNTRY_INFO!K20>1,COUNTRY_INFO!K20<99,COUNTRY_INFO!K20<>4,COUNTRY_INFO!K20<>5),IF(AI20/COUNTRY_INFO!R20*100<>0,IF(AI20/COUNTRY_INFO!R20*100>100,100,AI20/COUNTRY_INFO!R20*100),\"-\"),0)","v":33.1543448366184},{"$f":"MAX('T1'!L20,'T2'!S20)","v":16960},{"$f":"IF(AND(COUNTRY_INFO!K20>1,COUNTRY_INFO!K20<99,COUNTRY_INFO!K20<>4,COUNTRY_INFO!K20<>5),IF(COUNTRY_INFO!S20>AK20,AK20,COUNTRY_INFO!S20),0)","v":16960},{"$f":"IF(AND(COUNTRY_INFO!K20>1,COUNTRY_INFO!K20<99,COUNTRY_INFO!K20<>4,COUNTRY_INFO!K20<>5),IF(AL20/COUNTRY_INFO!S20*100<>0,IF(AL20/COUNTRY_INFO!S20*100>100,100,AL20/COUNTRY_INFO!S20*100),\"-\"),0)","v":40.3243063315818},{"$f":"MAX('T1'!M20,'T2'!T20)","v":45350},{"$f":"IF(AND(COUNTRY_INFO!K20>1,COUNTRY_INFO!K20<99,COUNTRY_INFO!K20<>4,COUNTRY_INFO!K20<>5),IF(COUNTRY_INFO!T20>AN20,AN20,COUNTRY_INFO!T20),0)","v":45350},{"$f":"IF(AND(COUNTRY_INFO!K20>1,COUNTRY_INFO!K20<99,COUNTRY_INFO!K20<>4,COUNTRY_INFO!K20<>5),IF(AO20/COUNTRY_INFO!T20*100<>0,IF(AO20/COUNTRY_INFO!T20*100>100,100,AO20/COUNTRY_INFO!T20*100),\"-\"),0)","v":51.7038911881064},67373,67373,{"$f":"IF(AND(COUNTRY_INFO!K20>1,COUNTRY_INFO!K20<99,COUNTRY_INFO!K20<>4,COUNTRY_INFO!K20<>5),IF(AH20/AE20*100<>0,IF(AR20/AE20*100>100,100,AR20/AE20*100),\"-\"),0)","v":46.4510035093525},null,{"$f":"IF(AND(D20<>0,D20<>\"Unknown\",D20<>\"Stopped\",D20<>\"Not required\"),D20/COUNTRY_INFO!D20,0)","v":1},{"$f":"IF(AND(J20<>0,J20<>\"Unknown\",J20<>\"Stopped\",J20<>\"Not required\"),J20/COUNTRY_INFO!D20,0)","v":0},{"$f":"IF(AND(P20<>0,P20<>\"Unknown\",P20<>\"Surveillance\",P20<>\"Not required\"),P20/COUNTRY_INFO!Q20,0)","v":1},{"$f":"IF(AND(AE20<>0,AE20<>\"Unknown\",AE20<>\"Surveillance\",AE20<>\"Not required\"),AE20/COUNTRY_INFO!U20,0)","v":1},{"$f":"IF(AU20>0,D20*PROFILE!$G$7,IF(AV20>0,J20*PROFILE!$G$7,0))","v":5412.81005390158},{"$f":"_xlfn.IFS(OR(AU20>0,AW20>0),COUNTRY_INFO!E20,AV20>0,J20*PROFILE!$G$8,AX20>0,COUNTRY_INFO!R20,COUNTIFS(AU20:AX20,\">0\")=0,0)","v":20361},{"$f":"_xlfn.IFS(OR(AU20>0,AW20>0),COUNTRY_INFO!F20,AV20>0,J20*PROFILE!$G$9,AX20>0,COUNTRY_INFO!S20,COUNTIFS(AU20:AX20,\">0\")=0,0)","v":42059},{"$f":"_xlfn.IFS(AU20>0,COUNTRY_INFO!G20,AND(AV20>0,AW20=0,AX20=0),J20*PROFILE!$G$10,AND(AV20>0,AW20>0,AX20=0),MAX(J20*PROFILE!$G$10,COUNTRY_INFO!P20),AND(AV20>0,AW20=0,AX20>0),MAX(J20*PROFILE!$G$10,COUNTRY_INFO!T20),AND(AV20=0,AW20>0,AX20>0),MAX(COUNTRY_INFO!P20,COUNTRY_INFO!T20),AND(AV20=0,AW20>0,AX20=0),COUNTRY_INFO!P20,AND(AV20=0,AW20=0,AX20>0),COUNTRY_INFO!T20,AND(AV20>0,AW20>0,AX20>0),MAX(J20*PROFILE!$G$10,COUNTRY_INFO!P20,COUNTRY_INFO!T20),COUNTIFS(AU20:AX20,\">0\")=0,0)","v":87711},155543.810053902,"Y",{"$f":"MAX('MDA2'!J20,'MDA5'!J20,S20,AH20)","v":10086},{"$f":"MAX('MDA1'!K20,'MDA2'!K20,'MDA3'!I20,'MDA3'!L20,'MDA5'!K20,V20,AK20)","v":32737},{"$f":"MAX('MDA1'!L20,'MDA2'!L20,'MDA3'!J20,'MDA3'!M20,'MDA5'!L20,Y20,AN20)","v":56643},99466,{"$f":"_xlfn.IFS(AND(AU20=0,AW20=0,AX20=0),0,AND(AU20=0,AW20=0,AX20>0),AI20,AND(AU20=0,AW20>0,AX20=0),T20,AND(AU20=0,AW20>0,AX20>0),MAX(T20,AI20),AND(AU20>0,AW20=0,AX20=0),MIN(MAX('MDA2'!J20,'MDA5'!J20),AZ20),AND(AU20>0,AW20=0,AX20>0),MIN(MAX('MDA2'!J20,'MDA5'!J20,AI20),AZ20),AND(AU20>0,AW20>0,AX20=0),MIN(MAX('MDA2'!J20,'MDA5'!J20,T20),AZ20),AND(AU20>0,AW20>0,AX20>0),MIN(MAX('MDA2'!J20,'MDA5'!J20,AI20,T20),AZ20))","v":10086},{"$f":"_xlfn.IFS(AND(AU20=0,AV20=0,AW20=0,AX20=0),0,AND(AU20=0,AV20=0,AW20=0,AX20>0),AL20,AND(AU20=0,AV20=0,AW20>0,AX20=0),W20,AND(AU20=0,AV20=0,AW20>0,AX20>0),MAX(W20,AL20),AND(AU20=0,AV20>0,AW20=0,AX20=0),MIN(J20*PROFILE!$G$9,MAX('MDA3'!I20,'MDA3'!L20)),AND(AU20=0,AV20>0,AW20=0,AX20>0),MIN(J20*PROFILE!$G$9,MAX('MDA3'!I20,'MDA3'!L20,AL20)),AND(AU20=0,AV20>0,AW20>0,AX20=0),MIN(J20*PROFILE!$G$9,MAX('MDA3'!I20,'MDA3'!L20,W20)),AND(AU20=0,AV20>0,AW20>0,AX20>0),MIN(J20*PROFILE!$G$9,MAX('MDA3'!I20,'MDA3'!L20,W20,AL20)),AND(AU20>0,AV20=0,AW20=0,AX20=0),MIN(BA20,MAX('MDA1'!K20,'MDA2'!K20,'MDA5'!K20)),AND(AU20>0,AV20=0,AW20=0,AX20>0),MIN(BA20,MAX('MDA1'!K20,'MDA2'!K20,'MDA5'!K20,AL20)),AND(AU20>0,AV20=0,AW20>0,AX20=0),MIN(BA20,MAX('MDA1'!K20,'MDA2'!KL20,'MDA5'!K20,W20)),AND(AU20>0,AV20=0,AW20>0,AX20>0),MIN(BA20,MAX('MDA1'!K20,'MDA2'!K20,'MDA5'!K20,W20,AL20)),AND(AU20>0,AV20>0,AW20=0,AX20=0),MIN(BA20,MAX('MDA1'!K20,'MDA2'!K20,'MDA5'!K20,MAX('MDA3'!I20,'MDA3'!L20))),AND(AU20>0,AV20>0,AW20=0,AX20>0),MIN(BA20,MAX('MDA1'!K20,'MDA2'!K20,'MDA5'!K20,MAX('MDA3'!I20,'MDA3'!L20),AL20)),AND(AU20>0,AV20>0,AW20>0,AX20=0),MIN(BA20,MAX('MDA1'!K20,'MDA2'!K20,'MDA5'!K20,MAX('MDA3'!I20,'MDA3'!L20),W20)),AND(AU20>0,AV20>0,AW20>0,AX20>0),MIN(BA20,MAX('MDA1'!K20,'MDA2'!K20,'MDA5'!K20,MAX('MDA3'!I20,'MDA3'!L20),W20,AL20)))","v":32737},{"$f":"_xlfn.IFS(AND(AU20=0,AV20=0,AW20=0,AX20=0),0,AND(AU20=0,AV20=0,AW20=0,AX20>0),AO20,AND(AU20=0,AV20=0,AW20>0,AX20=0),Z20,AND(AU20=0,AV20=0,AW20>0,AX20>0),MAX(Z20,AO20),AND(AU20=0,AV20>0,AW20=0,AX20=0),MIN(J20*PROFILE!$G$10,MAX('MDA3'!J20,'MDA3'!J20)),AND(AU20=0,AV20>0,AW20=0,AX20>0),MIN(J20*PROFILE!$G$10,MAX('MDA3'!J20,'MDA3'!M20,AO20)),AND(AU20=0,AV20>0,AW20>0,AX20=0),MIN(J20*PROFILE!$G$10,MAX('MDA3'!J20,'MDA3'!M20,Z20)),AND(AU20=0,AV20>0,AW20>0,AX20>0),MIN(J20*PROFILE!$G$10,MAX('MDA3'!J20,'MDA3'!M20,Z20,AO20)),AND(AU20>0,AV20=0,AW20=0,AX20=0),MIN(BB20,MAX('MDA1'!L20,'MDA2'!L20,'MDA5'!L20)),AND(AU20>0,AV20=0,AW20=0,AX20>0),MIN(BB20,MAX('MDA1'!L20,'MDA2'!L20,'MDA5'!L20,AO20)),AND(AU20>0,AV20=0,AW20>0,AX20=0),MIN(BB20,MAX('MDA1'!L20,'MDA2'!L20,'MDA5'!L20,Z20)),AND(AU20>0,AV20=0,AW20>0,AX20>0),MIN(BB20,MAX('MDA1'!L20,'MDA2'!L20,'MDA5'!L20,Z20,AO20)),AND(AU20>0,AV20>0,AW20=0,AX20=0),MIN(BB20,MAX('MDA1'!L20,'MDA2'!L20,'MDA5'!L20,MAX('MDA3'!J20,'MDA3'!M20))),AND(AU20>0,AV20>0,AW20=0,AX20>0),MIN(BB20,MAX('MDA1'!L20,'MDA2'!L20,'MDA5'!L20,MAX('MDA3'!J20,'MDA3'!M20),AO20)),AND(AU20>0,AV20>0,AW20>0,AX20=0),MIN(BB20,MAX('MDA1'!L20,'MDA2'!L20,'MDA5'!L20,MAX('MDA3'!J20,'MDA3'!M20),Z20)),AND(AU20>0,AV20>0,AW20>0,AX20>0),MIN(BB20,MAX('MDA1'!L20,'MDA2'!L20,'MDA5'!L20,MAX('MDA3'!J20,'MDA3'!M20),Z20,AO20)))","v":56643},99466,63.9472570239416]

{"sheet":"SUMMARY","index":12,"n_rows":68,"n_cols":8,"rows_kept":68,"cut":false,"hidden":false,"merged":[[0,1,0,5],[1,1,1,7],[3,3,3,5],[11,1,11,2],[27,1,27,2],[28,1,28,2],[29,1,29,2],[30,1,30,2],[31,1,31,2],[32,1,32,2],[33,1,33,2],[34,1,34,2],[35,1,35,2],[46,1,46,7],[47,3,47,4],[58,3,58,7],[59,3,59,7],[60,1,60,3],[60,4,60,7],[62,1,62,3],[62,4,62,7],[64,1,64,7],[66,1,66,2],[67,1,67,2],[51,1,57,7],[5,1,8,7]]}
[]
[null,"PC Joint Reporting Form v.4.2"]
[]
[null,"Country",null,{"$f":"IF(INTRO!$E$34<>0,INTRO!$E$34,\" \")","v":"Zanzibar"},null,null,"Year",{"$f":"IF(INTRO!$E$36<>0,INTRO!$E$36,\" \")","v":2022}]
[]
[null,"National authorities are requested to complete the Joint Reporting Form (JRF) for submission to the World Health Organization within 3 months after the last round was implemented and no later than 31 March of the next implementation year."]
[]
[]
[]
[null,"Number of people received treatment (at least once) for the diseases (all areas) and geographical coverage (%)"]
[]
[null,null,null,"PreSAC","SAC","Adults","Total","Geographical"]
[null,"Lymphatic filariasis",null,"Not eligible",476239,807977,{"$f":"SUM(D13:F13)","v":1284216},100]
[null,"Onchocerciasis",null,"Not eligible",476239,807977,{"$f":"SUM(D14:F14)","v":1284216},0]
[null,"Soil-transmitted helminthiases",null,98988,476239,807977,{"$f":"SUM(D15:F15)","v":1383204},100]
[null,"Schistosomiasis",null,92354,408263,684472,{"$f":"SUM(D16:F16)","v":1185089},100]
[]
[null,"Number of people in need (in areas requiring PC) received treatment for the diseases and national coverage (%)"]
[]
[null,null,null,"PreSAC","SAC","Adults","Total","National"]
[null,"Lymphatic filariasis",null,null,null,null,1264653,71.491126166996]
[null,"Onchocerciasis",null,null,null,null,0,0]
[null,"Soil-transmitted helminthiases",null,98988,409803,425967,{"$f":"SUM(D23:F23)","v":934758},82.2955394834728]
[null,"Schistosomiasis",null,84175,335508,587105,{"$f":"SUM(D24:F24)","v":1006788},75.8348485921275]
[]
[null,"Number of people treated by PC intervention and programme coverage (%)"]
[]
[null,null,null,"PreSAC","SAC","Adults","Total","Programme"]
[null,"MDA 1 (IVM+ALB)",null,"Not eligible",{"$f":"'MDA1'!$K$4","v":476239},{"$f":"'MDA1'!$L$4","v":807977},{"$f":"'MDA1'!$M$4","v":1284216},{"$f":"'MDA1'!$Q$4","v":89.6173688886036}]
[null,"MDA 2 (DEC+ALB)",null,{"$f":"'MDA2'!$J$4","v":0},{"$f":"'MDA2'!$K$4","v":0},{"$f":"'MDA2'!$L$4","v":0},{"$f":"'MDA2'!$M$4","v":0},{"$f":"'MDA2'!$Q$4","v":" "}]
[null,"MDA 3 (IVM)",null,{"$f":"IF($B$31=\"MDA 3 (IVM)\",\"Not eligible\",'MDA5'!$J$4)","v":"Not eligible"},{"$f":"IF($B$31=\"MDA 3 (IVM)\",'MDA3'!$O$4,'MDA5'!$K$4)","v":0},{"$f":"IF($B$31=\"MDA 3 (IVM)\",'MDA3'!$P$4,'MDA5'!$L$4)","v":0},{"$f":"IF($B$31=\"MDA 3 (IVM)\",'MDA3'!$Q$4,'MDA5'!$M$4)","v":0},{"$f":"IF($B$31=\"MDA 3 (IVM)\",'MDA3'!$T$4,'MDA5'!$Q$4)","v":" "}]
[null,"T 1 (PZQ+ALB/MBD)",null,{"$f":"IF('T1'!$K$4<>0,'T1'!$K$4,\"Not targeted\")","v":"Not targeted"},{"$f":"'T1'!$L$4","v":0},{"$f":"IF('T1'!$M$4<>0,'T1'!$M$4,\"Not targeted\")","v":"Not targeted"},{"$f":"'T1'!$N$4","v":0},{"$f":"'T1'!$R$4","v":" "}]
[null,"T 2 (PZQ)",null,{"$f":"'T2'!$R$4","v":92354},{"$f":"'T2'!$S$4","v":408263},{"$f":"'T2'!T$4","v":684472},{"$f":"'T2'!$U$4","v":1185089},{"$f":"'T2'!$Y$4","v":73.1760464932473}]
[null,"T 3 (ALB/MBD) - round 1",null,{"$f":"T3_R1!$J$4","v":98988},{"$f":"T3_R1!$K$4","v":0},{"$f":"T3_R1!$L$4","v":0},{"$f":"T3_R1!$M$4","v":98988},{"$f":"T3_R1!$Q$4","v":42.7486849946882}]
[null,"T 3 (ALB/MBD) - round 2",null,{"$f":"T3_R2!$J$4","v":0},{"$f":"T3_R2!$K$4","v":0},{"$f":"T3_R2!$L$4","v":0},{"$f":"T3_R2!$M$4","v":0},{"$f":"T3_R2!$Q$4","v":" "}]
[null,"T 3 (ALB/MBD) - round 3",null,{"$f":"T3_R3!$J$4","v":0},{"$f":"T3_R3!$K$4","v":0},{"$f":"T3_R3!$L$4","v":0},{"$f":"T3_R3!$M$4","v":0},{"$f":"T3_R3!$Q$4","v":" "}]
[]
[null,"Inventory of PC medicines in the country"]
[]
[null,null,"IVM","DEC","ALB (LF)","ALB (STH)","MBD","PZQ"]
[null,"Available"]
[null,"Distributed"]
[null,"Wasted"]
[null,"Received"]
[null,"Remaining",{"$f":"C41-C42-C43+C44","v":0},0,0,0,0,0]
[]
[null,"Please indicate the medicine has been used to treat PreSAC for STH and delivery channels"]
[null,"PC medicine",null,"Delivery channels",null,null,"Source"]
[]
[null,"Additional information"]
[]
[null,"Normally in Zanzibar Albendazole tablets for STH and LF are co-implemented, hence at the end of MDA becomes difficult to account for which tablets are for STH and which ones are for LF. Therefore amount of Albendazole account for both  for STH and Albendazole for LF."]
[]
[]
[]
[]
[]
[]
[null,null,null,"I have read and accept WHO Data Sharing Policy"]
[null,null,null,"I confirm that all information provided in this form is complete and correct"]
[null,"Name and signature of NTD coordinator or Ministry of Health representative:",null,null,"Shaali Ame"]
[]
[null,"Date:",null,null,"25.05.2023"]
[]
[null,"Please send the national report (signed and in electronic format) to the concerned WR with copy to:"]
[]
[null,"WHO headquarters",null,"PC_JointForms@who.int"]
[null,"WHO Regional Office",null,"Regional Advisor for NTD"]

{"sheet":"PROFILE","index":13,"n_rows":122,"n_cols":8,"rows_kept":122,"cut":false,"hidden":true,"merged":[[0,1,0,5],[1,1,1,7],[3,3,3,5],[4,1,4,7],[5,1,5,2],[5,3,5,5],[6,1,6,2],[6,3,6,5],[7,1,7,2],[7,3,7,5],[8,1,8,2],[8,3,8,5],[9,1,9,2],[9,3,9,5],[11,1,11,6],[12,1,12,6],[13,1,13,6],[14,1,14,6],[15,1,15,6],[16,1,16,6],[17,1,17,6],[18,1,18,6],[19,1,19,6],[20,1,20,6],[21,1,21,6],[23,1,23,3],[26,1,26,3],[27,1,27,3],[28,1,28,3],[29,1,29,3],[30,1,30,3],[34,1,34,3],[39,1,39,3],[40,1,40,3],[41,1,41,3],[45,1,45,3],[49,1,49,3],[53,1,53,3],[57,1,57,3],[61,1,61,3],[63,1,63,3],[67,1,67,3],[71,1,71,3],[75,1,75,3],[76,1,76,3],[77,1,77,3],[78,1,78,3],[79,1,79,3],[83,6,83,7],[84,6,84,7],[85,6,85,7],[86,6,86,7],[87,6,87,7],[121,1,122,7]]}
[]
[null,"PC Joint Reporting Form v.4.2 - Country Profile"]
[]
[null,"Country",null,{"$f":"IF(INTRO!$E$34<>0,INTRO!$E$34,\" \")","v":"Zanzibar"},null,null,"Year",{"$f":"IF(INTRO!$E$36<>0,INTRO!$E$36,\" \")","v":2022}]
[null,"!!! WARNING !!!\nBefore analysing data in the country profile please be ensure that your report in the SUMMARY tab is updated"]
[null,"Total population",null,null,null,null,1,{"$f":"COUNTRY_INFO!D4","v":1768965}]
[null,"Population — other age groups",null,null,null,null,{"$f":"IF($H$6<>0,H7/$H$6,0)","v":0.034799444873132},{"$f":"H6-SUM(H8:H10)","v":61559}]
[null,"Population — Pre-SAC",null,{"$f":"INTRO!B48","v":"1-4 years age"},null,null,{"$f":"IF($H$6<>0,H8/$H$6,0)","v":0.130900272193062},{"$f":"COUNTRY_INFO!E4","v":231558}]
[null,"Population — SAC",null,{"$f":"INTRO!B49","v":"5-14 years age"},null,null,{"$f":"IF($H$6<>0,H9/$H$6,0)","v":0.270401053723505},{"$f":"COUNTRY_INFO!F4","v":478330}]
[null,"Population — Adults",null,{"$f":"INTRO!B50","v":"15 years +"},null,null,0.563899229210301,{"$f":"COUNTRY_INFO!G4","v":997518}]
[]
[null,"Total number of people requiring PC for at least one disease (LF, ONCHO, STH, SCH)",null,null,null,null,null,{"$f":"DISTRICT!BC6","v":1768965}]
[null,"Proportion of number of people requiring PC for at least one disease out of total population",null,null,null,null,null,{"$f":"IF(H6<>0,H12/H6,0)","v":1}]
[null,"Number of IUs requiring PC for at least one disease (LF, ONCHO, STH, SCH)",null,null,null,null,null,{"$f":"COUNTIF(DISTRICT!BC10:BC1010,\">0\")","v":11}]
[null,"Number of IUs received PC for at least one disease (LF, ONCHO, STH, SCH)",null,null,null,null,null,{"$f":"COUNTIF(DISTRICT!BL10:BL1010,\">0\")","v":11}]
[null,"Proportion of IUs requiring PC for at least one disease and received it",null,null,null,null,null,{"$f":"IF(H14<>0,H15/H14,0)","v":1}]
[null,"Total number of people received PC for at least one disease (LF, ONCHO, STH, SCH)",null,null,null,null,null,{"$f":"DISTRICT!BH6","v":1394551}]
[null,"Total number of people in need who received PC for at least one disease (LF, ONCHO, STH, SCH)",null,null,null,null,null,{"$f":"DISTRICT!BL6","v":1312949}]
[null,"Coverage of PC for at least one disease (LF, ONCHO, STH, SCH)",null,null,null,null,null,{"$f":"DISTRICT!BM6","v":0.742213102011628}]
[null,"Number of IUs received treatment for all diseases requiring PC in those IUs",null,null,null,null,null,{"$f":"DISTRICT!BD6","v":11}]
[null,"Population requiring PC in IUs which received treatment for all diseases in need of PC",null,null,null,null,null,{"$f":"SUMIF(DISTRICT!BD10:BD1010,\"Y\",DISTRICT!BC10:BC1010)","v":1768965}]
[null,"Population in need received PC in IUs which were treated for all diseases in need of PC",null,null,null,null,null,{"$f":"SUMIF(DISTRICT!BD10:BD1010,\"Y\",DISTRICT!BL10:BL1010)","v":1312949}]
[]
[null,null,null,null,"LF","ONCHO","STH","SCH"]
[]
[null,"Diseases requiring PC in the country",null,null,{"$f":"IF(INTRO!E38=\"Endemic\",\"Yes\",\"No\")","v":"Yes"},{"$f":"IF(INTRO!E40=\"Endemic\",\"Yes\",\"No\")","v":"No"},{"$f":"IF(INTRO!E42=\"Endemic\",\"Yes\",\"No\")","v":"Yes"},{"$f":"IF(INTRO!E44=\"Endemic\",\"Yes\",\"No\")","v":"Yes"}]
[null,"Number of implementation units (IUs) in the country",null,null,{"$f":"IF(E26=\"Yes\",INTRO!$E$46,\"-\")","v":11},{"$f":"IF(F26=\"Yes\",INTRO!$E$46,\"-\")","v":"-"},{"$f":"IF(G26=\"Yes\",INTRO!$E$46,\"-\")","v":11},{"$f":"IF(H26=\"Yes\",INTRO!$E$46,\"-\")","v":11}]
[null,"Number of IUs with endemicity status known",null,null,{"$f":"IF(E26=\"Yes\",E27-E29,\"-\")","v":11},{"$f":"IF(F26=\"Yes\",F27-F29,\"-\")","v":"-"},{"$f":"IF(G26=\"Yes\",G27-G29,\"-\")","v":11},{"$f":"IF(H26=\"Yes\",H27-H29,\"-\")","v":11}]
[null,"Number of IUs with endemicity status unknown",null,null,{"$f":"IF(E26=\"Yes\",E27-(1001-COUNTIF(COUNTRY_INFO!H$10:H$1010,\"\"))+COUNTIF(COUNTRY_INFO!H$10:H$1010,\"=4\"),\"-\")","v":0},{"$f":"IF(F26=\"Yes\",F27-(1001-COUNTIF(COUNTRY_INFO!I$10:I$1010,\"\"))+COUNTIF(COUNTRY_INFO!I$10:I$1010,\"=4\"),\"-\")","v":"-"},{"$f":"IF(G26=\"Yes\",G27-(1001-COUNTIF(COUNTRY_INFO!J$10:J$1010,\"\"))+COUNTIF(COUNTRY_INFO!J$10:J$1010,\"=4\")+COUNTIF(COUNTRY_INFO!J$10:J$1010,\"=5\"),\"-\")","v":0},{"$f":"IF(H26=\"Yes\",H27-(1001-COUNTIF(COUNTRY_INFO!K$10:K$1010,\"\"))+COUNTIF(COUNTRY_INFO!K$10:K$1010,\"=4\")+COUNTIF(COUNTRY_INFO!K$10:K$1010,\"=5\"),\"-\")","v":0}]
[null,"Number of non-endemic IUs",null,null,{"$f":"IF(E26=\"Yes\",COUNTIF(COUNTRY_INFO!H$10:H$1010,\"=0\"),\"-\")","v":0},{"$f":"IF(F26=\"Yes\",COUNTIF(COUNTRY_INFO!I$10:I$1010,\"=0\"),\"-\")","v":"-"},{"$f":"IF(G26=\"Yes\",COUNTIF(COUNTRY_INFO!J$10:J$1010,\"=0\"),\"-\")","v":0},{"$f":"IF(H26=\"Yes\",COUNTIF(COUNTRY_INFO!K$10:K$1010,\"=0\"),\"-\")","v":1}]
[null,"Number of IUs requiring PC (total)",null,null,{"$f":"COUNTIF(COUNTRY_INFO!H$10:H$1010,\"=1\")","v":11},{"$f":"COUNTIF(COUNTRY_INFO!I$10:I$1010,\"=1\")","v":0},{"$f":"SUM(G32:G33)","v":11},{"$f":"SUM(H32:H33)","v":9}]
[null,null,null,"baseline prevalence",null,null,{"$f":"COUNTIF(COUNTRY_INFO!J$10:J$1010,\"=2\")+COUNTIF(COUNTRY_INFO!J$10:J$1010,\"=3\")","v":11},{"$f":"COUNTIF(COUNTRY_INFO!K$10:K$1001,\"=2\")+COUNTIF(COUNTRY_INFO!K$10:K$1001,\"=3\")","v":9}]
[null,null,null,"impact prevalence",null,null,{"$f":"COUNTIF(COUNTRY_INFO!J$10:J$1010,\"=11\")+COUNTIF(COUNTRY_INFO!J$10:J$1010,\"=21\")+COUNTIF(COUNTRY_INFO!J$10:J$1010,\"=22\")+COUNTIF(COUNTRY_INFO!J$10:J$1010,\"=31\")","v":0},{"$f":"COUNTIF(COUNTRY_INFO!K$10:K$1001,\"=11\")+COUNTIF(COUNTRY_INFO!K$10:K$1001,\"=21\")+COUNTIF(COUNTRY_INFO!K$10:K$1001,\"=31\")","v":0}]
[null,null,null,"- low",null,null,{"$f":"COUNTIF(COUNTRY_INFO!J$10:J$1010,\"=11\")","v":0},{"$f":"COUNTIF(COUNTRY_INFO!K$10:K$1001,\"=11\")","v":0}]
[null,"Population requiring PC in the country (total)",null,null,{"$f":"COUNTRY_INFO!L4","v":1768965},{"$f":"COUNTRY_INFO!M4","v":0},{"$f":"COUNTRY_INFO!Q4","v":1135855},{"$f":"COUNTRY_INFO!U4","v":1327606}]
[null,null,"<1 year old",null,{"$f":"E35-SUM(E37:E39)","v":61559},{"$f":"F35-SUM(F37:F39)","v":0}]
[null,null,"Pre-SAC",null,{"$f":"SUMIF(COUNTRY_INFO!L$10:L$1010,\">0\",COUNTRY_INFO!E$10:E$1010)","v":231558},{"$f":"COUNTRY_INFO!$M$4*$G8","v":0},{"$f":"COUNTRY_INFO!N$4","v":231558},{"$f":"COUNTRY_INFO!R$4","v":139778}]
[null,null,"SAC",null,{"$f":"SUMIF(COUNTRY_INFO!L$10:L$1010,\">0\",COUNTRY_INFO!F$10:F$1010)","v":478330},{"$f":"COUNTRY_INFO!$M$4*$G9","v":0},{"$f":"COUNTRY_INFO!O$4","v":478330},{"$f":"COUNTRY_INFO!S$4","v":384981}]
[null,null,"Adults",null,{"$f":"SUMIF(COUNTRY_INFO!L$10:L$1010,\">0\",COUNTRY_INFO!G$10:G$1010)","v":997518},{"$f":"COUNTRY_INFO!$M$4*$G10","v":0},{"$f":"COUNTRY_INFO!P$4","v":425967},{"$f":"COUNTRY_INFO!T$4","v":802847}]
[null,"Population requiring PC in low impact prevalence areas",null,null,null,null,{"$f":"SUMIF(COUNTRY_INFO!J$10:J$1010,\"=11\",COUNTRY_INFO!Q$10:Q$1010)","v":0},{"$f":"SUMIF(COUNTRY_INFO!K$10:K$1010,\"=11\",COUNTRY_INFO!U$10:U$1010)","v":0}]
[null,"Number of IUs where PC was implemented (total)",null,null,{"$f":"COUNTIF(DISTRICT!G$10:G$1010,\">0\")","v":11},{"$f":"COUNTIF(DISTRICT!M$10:M$1010,\">0\")","v":11},{"$f":"COUNTIF(DISTRICT!AB$10:AB$1010,\">0\")","v":11},{"$f":"COUNTIF(DISTRICT!AQ$10:AQ$1010,\">0\")","v":10}]
[null,"Number of IUs in need where PC was implemented (total)",null,null,{"$f":"COUNTIF(DISTRICT!H$10:H$1010,\">0\")","v":11},{"$f":"COUNTIF(DISTRICT!N$10:N$1010,\">0\")","v":0},{"$f":"COUNTIF(DISTRICT!AC$10:AC$1010,\">0\")","v":11},{"$f":"COUNTIF(DISTRICT!AR$10:AR$1010,\">0\")","v":9}]
[null,null,"Pre-SAC",null,null,null,{"$f":"COUNTIF(DISTRICT!T$10:T$1010,\">0\")","v":11},{"$f":"COUNTIF(DISTRICT!AI$10:AI$1010,\">0\")","v":9}]
[null,null,"SAC",null,null,null,{"$f":"COUNTIF(DISTRICT!W$10:W$1010,\">0\")","v":11},{"$f":"COUNTIF(DISTRICT!AL$10:AL$1010,\">0\")","v":9}]
[null,null,"Adults",null,null,null,{"$f":"COUNTIF(DISTRICT!Z$10:Z$1010,\">0\")","v":11},{"$f":"COUNTIF(DISTRICT!AO$10:AO$1010,\">0\")","v":9}]
[null,"Number of individuals treated (total)",null,null,{"$f":"DISTRICT!G4","v":1284216},{"$f":"DISTRICT!M4","v":1284216},{"$f":"DISTRICT!AB4","v":1383204},{"$f":"DISTRICT!AQ4","v":1185089}]
[null,null,"Pre-SAC",null,{"$f":"SUMMARY!$D13","v":"Not eligible"},{"$f":"SUMMARY!$D14","v":"Not eligible"},{"$f":"SUMMARY!$D15","v":98988},{"$f":"SUMMARY!$D16","v":92354}]
[null,null,"SAC",null,{"$f":"SUMMARY!$E13","v":476239},{"$f":"SUMMARY!$E14","v":476239},{"$f":"SUMMARY!$E15","v":476239},{"$f":"SUMMARY!$E16","v":408263}]
[null,null,"Adults",null,{"$f":"SUMMARY!$F13","v":807977},{"$f":"SUMMARY!$F14","v":807977},{"$f":"SUMMARY!$F15","v":807977},{"$f":"SUMMARY!$F16","v":684472}]
[null,"Number of individuals in need treated (total)",null,null,{"$f":"DISTRICT!H4","v":1264653},{"$f":"DISTRICT!N4","v":0},{"$f":"DISTRICT!AC4","v":934758},{"$f":"DISTRICT!AR4","v":1006788}]
[null,null,"Pre-SAC",null,{"$f":"SUMMARY!$D21","v":0},{"$f":"SUMMARY!$D22","v":0},{"$f":"SUMMARY!$D23","v":98988},{"$f":"SUMMARY!$D24","v":84175}]
[null,null,"SAC",null,{"$f":"SUMMARY!$E21","v":0},{"$f":"SUMMARY!$E22","v":0},{"$f":"SUMMARY!$E23","v":409803},{"$f":"SUMMARY!$E24","v":335508}]
[null,null,"Adults",null,{"$f":"SUMMARY!$F21","v":0},{"$f":"SUMMARY!$F22","v":0},{"$f":"SUMMARY!$F23","v":425967},{"$f":"SUMMARY!$F24","v":587105}]
[null,"Geographical coverage (all ages)",null,null,{"$f":"IF(E31<>0,E42/E31,0)","v":1},{"$f":"IF(F31<>0,F42/F31,0)","v":0},{"$f":"IF(G31<>0,G42/G31,0)","v":1},{"$f":"IF(H31<>0,H42/H31,0)","v":1}]
[null,null,"Pre-SAC",null,null,null,{"$f":"IF($G$31<>0,G43/$G$31,0)","v":1},{"$f":"IF($H$31<>0,H43/$H$31,0)","v":1}]
[null,null,"SAC",null,null,null,{"$f":"IF($G$31<>0,G44/$G$31,0)","v":1},{"$f":"IF($H$31<>0,H44/$H$31,0)","v":1}]
[null,null,"Adults",null,null,null,{"$f":"IF($G$31<>0,G45/$G$31,0)","v":1},{"$f":"IF($H$31<>0,H45/$H$31,0)","v":1}]
[null,"National coverage (total)",null,null,{"$f":"IF(E35<>0,E50/E35,0)","v":0.71491126166996},{"$f":"IF(F35<>0,F50/F35,0)","v":0},{"$f":"IF(G35<>0,G50/G35,0)","v":0.822955394834728},{"$f":"IF(H35<>0,H50/H35,0)","v":0.758348485921275}]
[null,null,"Pre-SAC",null,null,null,{"$f":"IF($G37<>0,$G51/$G37,0)","v":0.427486849946882},{"$f":"IF($H37<>0,$H51/$H37,0)","v":0.602204924952425}]
[null,null,"SAC",null,null,null,{"$f":"IF($G38<>0,$G52/$G38,0)","v":0.85673698074551},{"$f":"IF($H38<>0,$H52/$H38,0)","v":0.871492359363189}]
[null,null,"Adults",null,null,null,1,{"$f":"IF($H39<>0,$H53/$H39,0)","v":0.731278811529469}]
[null,null,null,null,"LF","ONCHO","STH","SCH"]
[]
[null,"Number of IUs achieved effective coverage (all ages)",null,null,{"$f":"COUNTIF(DISTRICT!I$10:I$1010,\">=65\")","v":5},{"$f":"COUNTIF(DISTRICT!O$10:O$1010,\">=65\")","v":0},{"$f":"COUNTIF(DISTRICT!AD$10:AD$1010,\">=75\")","v":10},{"$f":"COUNTIF(DISTRICT!AS$10:AS$1010,\">=75\")","v":4}]
[null,null,"Pre-SAC",null,null,null,{"$f":"COUNTIF(DISTRICT!U$10:U$1010,\">=75\")","v":0},{"$f":"COUNTIF(DISTRICT!AJ$10:AJ$1010,\">=75\")","v":2}]
[null,null,"SAC",null,null,null,{"$f":"COUNTIF(DISTRICT!X$10:X$1010,\">=75\")","v":9},{"$f":"COUNTIF(DISTRICT!AM$10:AM$1010,\">=75\")","v":7}]
[null,null,"Adults",null,null,null,{"$f":"COUNTIF(DISTRICT!AA$10:AA$1010,\">=75\")","v":11},{"$f":"COUNTIF(DISTRICT!AP$10:AP$1010,\">=75\")","v":4}]
[null,"Number of individuals in need treated in IUs achieved effective coverage (total)",null,null,{"$f":"SUMIF(DISTRICT!I10:I1010,\">=65\",DISTRICT!H10:H1010)","v":660267},{"$f":"SUMIF(DISTRICT!O10:O1010,\">=65\",DISTRICT!N10:N1010)","v":0},{"$f":"SUMIF(DISTRICT!AD10:AD1010,\">=75\",DISTRICT!AC10:AC1010)","v":803842},{"$f":"SUMIF(DISTRICT!AS10:AS1010,\">=75\",DISTRICT!AR10:AR1010)","v":501876}]
[null,null,"Pre-SAC",null,null,null,{"$f":"SUMIF(DISTRICT!U10:U1010,\">=75\",DISTRICT!T10:T1010)","v":0},{"$f":"SUMIF(DISTRICT!AJ10:AJ1010,\">=75\",DISTRICT!AI10:AI1010)","v":17887}]
[null,null,"SAC",null,null,null,{"$f":"SUMIF(DISTRICT!X10:X1010,\">=75\",DISTRICT!W10:W1010)","v":332054},{"$f":"SUMIF(DISTRICT!AM10:AM1010,\">=75\",DISTRICT!AL10:AL1010)","v":289552}]
[null,null,"Adults",null,null,null,{"$f":"SUMIF(DISTRICT!AA10:AA1010,\">=75\",DISTRICT!Z10:Z1010)","v":425967},{"$f":"SUMIF(DISTRICT!AP10:AP1010,\">=75\",DISTRICT!AO10:AO1010)","v":298844}]
[null,"Proportion of IUs requiring PC and achieved effective coverage (total)",null,null,{"$f":"IF(E42<>0,E64/E42,0)","v":0.454545454545455},{"$f":"IF(F42<>0,F64/F42,0)","v":0},{"$f":"IF(G42<>0,G64/G42,0)","v":0.909090909090909},{"$f":"IF(H42<>0,H64/H42,0)","v":0.444444444444444}]
[null,null,"Pre-SAC",null,null,null,{"$f":"IF(G43<>0,G65/G43,0)","v":0},0.222222222222222]
[null,null,"SAC",null,null,null,0.818181818181818,0.777777777777778]
[null,null,"Adults",null,null,null,1,0.444444444444444]
[null,"Number of implementation units where PC was stopped (i.e. under surveillance)",null,null,{"$f":"COUNTIF(COUNTRY_INFO!H$10:H$1010,\"=99\")","v":0},{"$f":"COUNTIF(COUNTRY_INFO!I$10:I$1010,\"=99\")","v":0},{"$f":"COUNTIF(COUNTRY_INFO!J$10:J$1010,\"=99\")","v":0},{"$f":"COUNTIF(COUNTRY_INFO!K$10:K$1010,\"=99\")","v":0}]
[null,"Number of individuals living in IUs no longer requiring PC (stopped, surveillance)",null,null,{"$f":"SUMIF(COUNTRY_INFO!H$10:H$1010,\"=99\",COUNTRY_INFO!D$10:D$1010)","v":0},{"$f":"SUMIF(COUNTRY_INFO!I$10:I$1010,\"=99\",COUNTRY_INFO!D$10:D$1010)","v":0},{"$f":"SUMIF(COUNTRY_INFO!J$10:J$1010,\"=99\",COUNTRY_INFO!D$10:D$1010)","v":0},{"$f":"SUMIF(COUNTRY_INFO!K$10:K$1010,\"=99\",COUNTRY_INFO!D$10:D$1010)","v":0}]
[null,"Number of individuals requiring PC living in IUs targeted with PC",null,null,{"$f":"SUMIF(DISTRICT!H$10:H$1010,\">0\",DISTRICT!D$10:D$1010)","v":1768965},{"$f":"SUMIF(DISTRICT!N$10:N$1010,\">0\",DISTRICT!J$10:J$1010)","v":0},{"$f":"SUMIF(DISTRICT!AC$10:AC$1010,\">0\",DISTRICT!P$10:P$1010)","v":1135855},{"$f":"SUMIF(DISTRICT!AR$10:AR$1010,\">0\",DISTRICT!AE$10:AE$1010)","v":1327606}]
[null,"Number of individuals requiring PC living in IUs not targeted with PC",null,null,{"$f":"SUMIF(DISTRICT!H$10:H$1010,\"=0\",DISTRICT!D$10:D$1010)","v":0},{"$f":"SUMIF(DISTRICT!N$10:N$1010,\"=0\",DISTRICT!J$10:J$1010)","v":0},{"$f":"SUMIF(DISTRICT!AC$10:AC$1010,\"=0\",DISTRICT!P$10:P$1010)","v":0},{"$f":"SUMIF(DISTRICT!AR$10:AR$1010,\"=0\",DISTRICT!AE$10:AE$1010)","v":0}]
[null,null,null,null,{"$f":"E35-E50","v":504312},{"$f":"F35-F50","v":0},{"$f":"G35-G50","v":201097},{"$f":"H35-H50","v":320818}]
[null,"Number of IUs requiring and receiving PC",null,null,{"$f":"E31-E42","v":0},{"$f":"F31-F42","v":0},{"$f":"G31-G42","v":0},{"$f":"H31-H42","v":0}]
[null,null,null,null,{"$f":"E27-E31-E29","v":0},{"$error":"#VALUE!"},0,2]
[]
[null,null,null,null,null,null,"Requiring and receiving PC"]
[null,null,null,null,null,null,"Requiring and not receiving PC"]
[null,null,null,null,null,null,"Not requiring PC"]
[null,null,null,null,null,null,"Status unknown"]
[]
[]
[]
[]
[]
[]
[]
[]
[]
[]
[]
[]
[]
[]
[]
[]
[]
[]
[]
[]
[]
[]
[]
[]
[]
[]
[]
[]
[]
[]
[]
[]
[]
[]
[null,"Click here to access data Preventive Chemotherapy Data Portal"]

{"sheet":"DATA_POLICY","index":14,"n_rows":39,"n_cols":8,"rows_kept":39,"cut":false,"hidden":true,"merged":[[0,1,0,5],[1,1,1,7],[3,3,3,5],[6,1,6,7],[55,1,55,2],[8,1,12,7],[13,1,16,7],[26,2,36,7],[38,1,45,7],[17,1,21,7],[22,1,25,7]]}
[]
[null,"PC Joint Reporting Form v.4.2"]
[]
[null,"Country",null,{"$f":"IF(INTRO!$E$34<>0,INTRO!$E$34,\" \")","v":"Zanzibar"},null,null,"Year",{"$f":"IF(INTRO!$E$36<>0,INTRO!$E$36,\" \")","v":2022}]
[]
[]
[null,"WHO Data Sharing Policy statement"]
[]
[null,"Data are the basis for all sound public health actions and the benefits of data sharing are widely recognized, including scientific and public health benefits. Whenever possible, WHO wishes to promote the sharing of health data, including but not restricted to surveillance and epidemiological data.  "]
[]
[]
[]
[]
[null,{"$f":"\"In this connection, and without prejudice to information sharing and publication pursuant to legally binding instruments, by providing data to WHO, the Ministry of Health of \"&D4&\":\"","v":"In this connection, and without prejudice to information sharing and publication pursuant to legally binding instruments, by providing data to WHO, the Ministry of Health of Zanzibar:"}]
[]
[]
[]
[null,"Confirms that all data to be supplied to WHO hereunder have been collected in accordance with applicable national laws, including data protection laws aimed at protecting the confidentiality of identifiable persons;"]
[]
[]
[]
[]
[null,{"$f":"\"Agrees that WHO shall be entitled, subject always to measures to ensure the ethical and secure use of the data, and subject always to an appropriate acknowledgement of \"&D4&\":\"","v":"Agrees that WHO shall be entitled, subject always to measures to ensure the ethical and secure use of the data, and subject always to an appropriate acknowledgement of Zanzibar:"}]
[]
[]
[]
[null,null,"to publish the data, stripped of any personal identifiers and make the Data available to any interested party on request (to the extent they have not, or not yet, been published by WHO) on terms that allow non-commercial, not-for-profit use of the Data for public health purposes (provided always that publication of the Data shall remain under the control of WHO); \nto use, compile, aggregate, evaluate and analyse the Data and publish and disseminate the results thereof in conjunction with WHO’s work and in accordance with the Organization’s policies and practices."]
[]
[]
[]
[]
[]
[]
[]
[]
[]
[]
[]
[null,{"$f":"CONCATENATE(\"Except where data sharing and publication is required under legally binding instruments (IHR, WHO Nomenclature Regulations 1967, etc.), the Ministry of Health of \",D4,\" may in respect of certain data opt out of (any part of) the above,\"&\" by notifying WHO thereof in writing at the following address, provided that any such notification shall clearly identify the data in question and clearly indicate the scope of the opt-out (in reference to the  above), \"&\"and provided that specific reasons shall be given for the opt out.\")","v":"Except where data sharing and publication is required under legally binding instruments (IHR, WHO Nomenclature Regulations 1967, etc.), the Ministry of Health of Zanzibar may in respect of certain data opt out of (any part of) the above, by notifying WHO thereof in writing at the following address, provided that any such notification shall clearly identify the data in question and clearly indicate the scope of the opt-out (in reference to the  above), and provided that specific reasons shall be given for the opt out."}]