{"text_format":"1","workbook":"xlsx","n_sheets":13,"sheets":["INTRO","COUNTRY_INFO","MDA1","MDA2","MDA3","T1_R1","T1_R2","T2","T3_R1","T3_R2","DISTRICT","SUMMARY","PROFILE"],"not_rendered":{"charts":8,"images":2,"macros":1,"external_links":2,"defined_names":4,"comments":11,"pivot_tables":0},"unopened":[],"bounds":{"document_bytes":16777216,"sheet_cells":100000,"rows_first":2000,"rows_last":500,"rows_between":2000,"halvings":0,"cell_chars":16384,"cell_head_chars":4096},"cells_cut":0,"cells_raw":0,"read":"whole","date_system":"1900"}

{"sheet":"INTRO","index":0,"n_rows":50,"n_cols":5,"rows_kept":50,"cut":false,"hidden":false,"merged":[[45,1,45,2],[10,2,10,4],[41,1,41,2],[43,1,43,2],[46,1,46,4],[33,1,33,2],[35,1,35,2],[26,2,27,4],[37,1,37,2],[39,1,39,2],[28,1,28,4],[29,2,29,4],[30,1,30,4],[31,1,31,4],[20,1,20,4],[21,2,21,4],[22,1,22,4],[23,2,24,4],[25,1,25,4],[15,1,15,4],[16,1,16,4],[17,1,17,4],[18,1,18,4],[19,2,19,4],[9,2,9,4],[11,2,11,4],[12,1,12,4],[13,1,13,4],[14,1,14,4],[7,2,7,4],[8,2,8,4],[0,1,0,4],[1,1,1,4],[2,1,2,4],[3,1,3,4],[4,1,4,4],[5,1,5,4]]}
[]
[null,"PC Joint Reporting Form v.3"]
[]
[null,"The purpose of this template Joint Reporting Form (JRF) - available as an Excel file - is to provide national health authorities and data managers with a standardized tool to address these reporting challenges, facilitate  integration and thereby further contribute to improving overall programme management. This template aims to standardize national reporting of programme implementation outcomes, improve availability and coordination of preventive chemotherapy data across the World Health Organization regions. \nNational authorities are requested to complete this form for submission to the World Health Organization any time before 15 August of the current year for reporting data on PC interventions implemented during the previous year."]
[]
[null,"Structure of the application (worksheets):"]
[]
[null,"INTRO","This worksheet includes guides on how to complete the joint reporting form and information about status of PC for endemic diseases in the country"]
[null,"COUNTRY_INFO","This worksheet includes information about administrative structure of the country, population by age group, status of endemicity for each disease, population requiring PC, planned interventions and interventions implemented"]
[null,"MDA1, MDA2, MDA3, T1, T2 and T3","These worksheets include information about endemic districts targeted for treatment with specified PC medicines, treatment plan, and number of people who received treatment by age group"]
[null,"DISTRICT","This worksheet includes summary of people treated by disease at the level of implementation. If data by gender is available, it requires to enter."]
[null,"SUMMARY","This worksheet includes summary of people treated by disease and by PC intervention. Before generating the report (run macros) please select the disease for which you need the report. Follow the same rule to generate various reports.\nThis worksheet should be printed and submitted as a Joint Report (see the instruction for submission in the SUMMARY worksheet)."]
[]
[null,"Instruction for data entry"]
[]
[null,"Most of the cells in the above-mentioned worksheets include formula that are calculated automatically according to the treatment policy recommended by WHO for each disease.\nSee the link http://www.who.int/neglected_diseases/preventive_chemotherapy/pct_manual/en/index.html"]
[]
[null,"Please enter your data into the cells according to their colour code:"]
[]
[null,null,"White - cell is not protected. Please enter the value of the requested indicator."]
[]
[null,null,"Yellow - cell is protected and includes name of indicator. No data entry required."]
[]
[null,null,"Orange - cell is not protected and includes a drop-down menu. Please select the value from the drop-down list."]
[]
[]
[null,null,"Green - cell is not protected and includes formula. Please change the value only if your data are different from those that are calculated automatically."]
[]
[]
[null,null,"Blue - cell is protected and includes formula. No data entry required."]
[]
[null,"Country data"]
[]
[null,"COUNTRY",null,null,"Zanzibar"]
[]
[null,"Year of reporting data",null,null,2017]
[]
[null,"Is country endemic for lymphatic filariasis (LF)?",null,null,"Endemic"]
[]
[null,"Is country endemic for onchocerciasis (ONCHO)?",null,null,"Endemic but PC is not required"]
[]
[null,"Is country endemic for soil-transmitted helminthiases (STH)?",null,null,"Endemic"]
[]
[null,"Is country endemic for schistosomiasis (SCH)?",null,null,"Endemic"]
[]
[null,"How many administrative units in the country?",null,null,10]
[null,"If demographical data at the second administrative level are not available by age group, please enter the proportion (%) of population by age group in the country. If data are available, please leave these cells blank."]
[null,"1-4 years age","Preschool-age children (PreSAC)",null,0.128]
[null,"5-14 years age","School-age children (SAC)",null,0.32300000000000001]
[null,"15 years +","Adults",null,0.54900000000000004]

{"sheet":"COUNTRY_INFO","index":1,"n_rows":19,"n_cols":33,"rows_kept":19,"cut":false,"hidden":false,"merged":[[3,0,3,2],[3,7,3,10],[3,19,3,20],[5,0,5,2],[3,15,3,18],[5,15,5,18],[3,21,3,22],[5,21,5,22],[5,3,5,6],[5,7,5,10],[5,11,5,14],[5,19,5,20]]}
["COUNTRY INFORMATION"]
["Administrative structure, population by age group, endemicity status, planned interventions and interventions implemented"]
[]
["TOTAL",null,null,{"$f":"SUM(D$9:D$1000)","v":1313658.3999999985},{"$f":"SUM(E$9:E$1000)","v":168149},{"$f":"SUM(F$9:F$1000)","v":424313},{"$f":"SUM(G$9:G$1000)","v":721198},null,null,null,null,{"$f":"SUM(L$9:L$1000)","v":1313658.3999999985},{"$f":"SUM(M$9:M$1000)","v":0},{"$f":"SUM(N$9:N$1000)","v":592462},{"$f":"SUM(O$9:O$1000)","v":208864.46999999997}]
[]
["Country administrative structure",null,null,"Population",null,null,null,"Endemicity",null,null,null,"Population requiring PC",null,null,null,"Number of treatment\nrounds planned for the year",null,null,null,"PC implemented",null,"Click to see the recommended strategy"]
["Country","Province/State","District","Total","PreSAC","SAC","Adults","LF","Oncho","STH","SCH","LF","Oncho","STH","SCH","LF","Oncho","STH","SCH","ROUND 1","ROUND2",null,null,"IU_ID","IU_Name"]
[]
[{"$f":"IF(INTRO!$E$34<>0,INTRO!$E$34,\"\")","v":"Zanzibar"},"Kusini Pemba","Mkoani",152982.13333333301,{"$f":"IF(INTRO!$E$48=\"\",\"\",ROUND($D9*INTRO!$E$48,0))","v":19582},{"$f":"IF(INTRO!$E$49=\"\",\"\",ROUND($D9*INTRO!$E$49,0))","v":49413},{"$f":"IF(INTRO!$E$50=\"\",\"\",ROUND($D9*INTRO!$E$50,0))","v":83987},1,null,3,2,{"$f":"IF(INTRO!$E$38=\"Endemic\", IF($H9>0, IF($H9=4,\"Unknown\", IF($H9=99,\"Stopped\", $D9)), 0),\"Not required\")","v":152982.13333333301},{"$f":"IF(INTRO!$E$40=\"Endemic\", IF($I9>0, IF($I9=4,\"Unknown\",IF($I9=99,\"Stopped\", $D9)), 0),\"Not required\")","v":"Not required"},{"$f":"IF(INTRO!$E$42=\"Endemic\", IF(AND($J9>1,$J9<5), IF($J9=4, \"Unknown\", E9+F9), 0),\"Not required\")","v":68995},{"$f":"IF(INTRO!$E$44=\"Endemic\", IF(AND($K9>0,$K9<5), IF($K9=4,\"Unknown\", IF($K9=1, $F9*0.33, IF($K9=2, $F9*0.5+$G9*0.2, SUM(F9:G9)))), 0),\"Not required\")","v":41503.9},1,null,2,2,"T1 (PZQ+ALB/MBD)","T1 (PZQ+ALB/MBD)",null,null,51897,"Mkoani",null,null,"Mkoani","2 (Moderate prevalence, 10 - 49%)",null,null,null,2]
[{"$f":"IF(INTRO!$E$34<>0,INTRO!$E$34,\"\")","v":"Zanzibar"},"Kusini Pemba","Chake Chake",106918.33333333299,{"$f":"IF(INTRO!$E$48=\"\",\"\",ROUND($D10*INTRO!$E$48,0))","v":13686},{"$f":"IF(INTRO!$E$49=\"\",\"\",ROUND($D10*INTRO!$E$49,0))","v":34535},{"$f":"IF(INTRO!$E$50=\"\",\"\",ROUND($D10*INTRO!$E$50,0))","v":58698},1,null,3,2,{"$f":"IF(INTRO!$E$38=\"Endemic\", IF($H10>0, IF($H10=4,\"Unknown\", IF($H10=99,\"Stopped\", $D10)), 0),\"Not required\")","v":106918.33333333299},{"$f":"IF(INTRO!$E$40=\"Endemic\", IF($I10>0, IF($I10=4,\"Unknown\",IF($I10=99,\"Stopped\", $D10)), 0),\"Not required\")","v":"Not required"},{"$f":"IF(INTRO!$E$42=\"Endemic\", IF(AND($J10>1,$J10<5), IF($J10=4, \"Unknown\", E10+F10), 0),\"Not required\")","v":48221},{"$f":"IF(INTRO!$E$44=\"Endemic\", IF(AND($K10>0,$K10<5), IF($K10=4,\"Unknown\", IF($K10=1, $F10*0.33, IF($K10=2, $F10*0.5+$G10*0.2, SUM(F10:G10)))), 0),\"Not required\")","v":29007.1},1,null,2,2,"T1 (PZQ+ALB/MBD)","T1 (PZQ+ALB/MBD)",null,null,51896,"Chake Chake",null,null,"Chake Chake","2 (Moderate prevalence, 10 - 49%)",null,null,null,2]
[{"$f":"IF(INTRO!$E$34<>0,INTRO!$E$34,\"\")","v":"Zanzibar"},"Kaskazini Pemba","Wete",72184.666666666701,{"$f":"IF(INTRO!$E$48=\"\",\"\",ROUND($D11*INTRO!$E$48,0))","v":9240},{"$f":"IF(INTRO!$E$49=\"\",\"\",ROUND($D11*INTRO!$E$49,0))","v":23316},{"$f":"IF(INTRO!$E$50=\"\",\"\",ROUND($D11*INTRO!$E$50,0))","v":39629},1,null,3,2,{"$f":"IF(INTRO!$E$38=\"Endemic\", IF($H11>0, IF($H11=4,\"Unknown\", IF($H11=99,\"Stopped\", $D11)), 0),\"Not required\")","v":72184.666666666701},{"$f":"IF(INTRO!$E$40=\"Endemic\", IF($I11>0, IF($I11=4,\"Unknown\",IF($I11=99,\"Stopped\", $D11)), 0),\"Not required\")","v":"Not required"},{"$f":"IF(INTRO!$E$42=\"Endemic\", IF(AND($J11>1,$J11<5), IF($J11=4, \"Unknown\", E11+F11), 0),\"Not required\")","v":32556},{"$f":"IF(INTRO!$E$44=\"Endemic\", IF(AND($K11>0,$K11<5), IF($K11=4,\"Unknown\", IF($K11=1, $F11*0.33, IF($K11=2, $F11*0.5+$G11*0.2, SUM(F11:G11)))), 0),\"Not required\")","v":19583.8},1,null,2,2,"T1 (PZQ+ALB/MBD)","T1 (PZQ+ALB/MBD)",null,null,51893,"Wete",null,null,"Wete","2 (Moderate prevalence, 10 - 49%)",null,null,null,2]
[{"$f":"IF(INTRO!$E$34<>0,INTRO!$E$34,\"\")","v":"Zanzibar"},"Kaskazini Pemba","Micheweni",106147.133333333,{"$f":"IF(INTRO!$E$48=\"\",\"\",ROUND($D12*INTRO!$E$48,0))","v":13587},{"$f":"IF(INTRO!$E$49=\"\",\"\",ROUND($D12*INTRO!$E$49,0))","v":34286},{"$f":"IF(INTRO!$E$50=\"\",\"\",ROUND($D12*INTRO!$E$50,0))","v":58275},1,null,3,1,{"$f":"IF(INTRO!$E$38=\"Endemic\", IF($H12>0, IF($H12=4,\"Unknown\", IF($H12=99,\"Stopped\", $D12)), 0),\"Not required\")","v":106147.133333333},{"$f":"IF(INTRO!$E$40=\"Endemic\", IF($I12>0, IF($I12=4,\"Unknown\",IF($I12=99,\"Stopped\", $D12)), 0),\"Not required\")","v":"Not required"},{"$f":"IF(INTRO!$E$42=\"Endemic\", IF(AND($J12>1,$J12<5), IF($J12=4, \"Unknown\", E12+F12), 0),\"Not required\")","v":47873},{"$f":"IF(INTRO!$E$44=\"Endemic\", IF(AND($K12>0,$K12<5), IF($K12=4,\"Unknown\", IF($K12=1, $F12*0.33, IF($K12=2, $F12*0.5+$G12*0.2, SUM(F12:G12)))), 0),\"Not required\")","v":11314.380000000001},1,null,2,2,"T1 (PZQ+ALB/MBD)","T1 (PZQ+ALB/MBD)",null,null,51892,"Micheweni",null,null,"Micheweni","1 (Low prevalence, < 10%)",null,null,null,1]
[{"$f":"IF(INTRO!$E$34<>0,INTRO!$E$34,\"\")","v":"Zanzibar"},"Kaskazini Unguja","Kaskazini A",110542.33333333299,{"$f":"IF(INTRO!$E$48=\"\",\"\",ROUND($D13*INTRO!$E$48,0))","v":14149},{"$f":"IF(INTRO!$E$49=\"\",\"\",ROUND($D13*INTRO!$E$49,0))","v":35705},{"$f":"IF(INTRO!$E$50=\"\",\"\",ROUND($D13*INTRO!$E$50,0))","v":60688},1,null,3,2,{"$f":"IF(INTRO!$E$38=\"Endemic\", IF($H13>0, IF($H13=4,\"Unknown\", IF($H13=99,\"Stopped\", $D13)), 0),\"Not required\")","v":110542.33333333299},{"$f":"IF(INTRO!$E$40=\"Endemic\", IF($I13>0, IF($I13=4,\"Unknown\",IF($I13=99,\"Stopped\", $D13)), 0),\"Not required\")","v":"Not required"},{"$f":"IF(INTRO!$E$42=\"Endemic\", IF(AND($J13>1,$J13<5), IF($J13=4, \"Unknown\", E13+F13), 0),\"Not required\")","v":49854},{"$f":"IF(INTRO!$E$44=\"Endemic\", IF(AND($K13>0,$K13<5), IF($K13=4,\"Unknown\", IF($K13=1, $F13*0.33, IF($K13=2, $F13*0.5+$G13*0.2, SUM(F13:G13)))), 0),\"Not required\")","v":29990.1},1,null,2,2,"T1 (PZQ+ALB/MBD)","T1 (PZQ+ALB/MBD)",null,null,51894,"North A",null,null,"Kaskazini A","2 (Moderate prevalence, 10 - 49%)",null,null,null,2]
[{"$f":"IF(INTRO!$E$34<>0,INTRO!$E$34,\"\")","v":"Zanzibar"},"Kaskazini Unguja","Kaskazini B ",109599.33333333299,{"$f":"IF(INTRO!$E$48=\"\",\"\",ROUND($D14*INTRO!$E$48,0))","v":14029},{"$f":"IF(INTRO!$E$49=\"\",\"\",ROUND($D14*INTRO!$E$49,0))","v":35401},{"$f":"IF(INTRO!$E$50=\"\",\"\",ROUND($D14*INTRO!$E$50,0))","v":60170},1,null,3,1,{"$f":"IF(INTRO!$E$38=\"Endemic\", IF($H14>0, IF($H14=4,\"Unknown\", IF($H14=99,\"Stopped\", $D14)), 0),\"Not required\")","v":109599.33333333299},{"$f":"IF(INTRO!$E$40=\"Endemic\", IF($I14>0, IF($I14=4,\"Unknown\",IF($I14=99,\"Stopped\", $D14)), 0),\"Not required\")","v":"Not required"},{"$f":"IF(INTRO!$E$42=\"Endemic\", IF(AND($J14>1,$J14<5), IF($J14=4, \"Unknown\", E14+F14), 0),\"Not required\")","v":49430},{"$f":"IF(INTRO!$E$44=\"Endemic\", IF(AND($K14>0,$K14<5), IF($K14=4,\"Unknown\", IF($K14=1, $F14*0.33, IF($K14=2, $F14*0.5+$G14*0.2, SUM(F14:G14)))), 0),\"Not required\")","v":11682.33},1,null,2,2,"T1 (PZQ+ALB/MBD)","T1 (PZQ+ALB/MBD)",null,null,51895,"North B",null,null,"Kaskazini B ","1 (Low prevalence, < 10%)",null,null,null,1]
[{"$f":"IF(INTRO!$E$34<>0,INTRO!$E$34,\"\")","v":"Zanzibar"},"Kusini Unguja","Kati ",75060.800000000003,{"$f":"IF(INTRO!$E$48=\"\",\"\",ROUND($D15*INTRO!$E$48,0))","v":9608},{"$f":"IF(INTRO!$E$49=\"\",\"\",ROUND($D15*INTRO!$E$49,0))","v":24245},{"$f":"IF(INTRO!$E$50=\"\",\"\",ROUND($D15*INTRO!$E$50,0))","v":41208},1,null,3,1,{"$f":"IF(INTRO!$E$38=\"Endemic\", IF($H15>0, IF($H15=4,\"Unknown\", IF($H15=99,\"Stopped\", $D15)), 0),\"Not required\")","v":75060.800000000003},{"$f":"IF(INTRO!$E$40=\"Endemic\", IF($I15>0, IF($I15=4,\"Unknown\",IF($I15=99,\"Stopped\", $D15)), 0),\"Not required\")","v":"Not required"},{"$f":"IF(INTRO!$E$42=\"Endemic\", IF(AND($J15>1,$J15<5), IF($J15=4, \"Unknown\", E15+F15), 0),\"Not required\")","v":33853},{"$f":"IF(INTRO!$E$44=\"Endemic\", IF(AND($K15>0,$K15<5), IF($K15=4,\"Unknown\", IF($K15=1, $F15*0.33, IF($K15=2, $F15*0.5+$G15*0.2, SUM(F15:G15)))), 0),\"Not required\")","v":8000.85},1,null,2,2,"T1 (PZQ+ALB/MBD)","T1 (PZQ+ALB/MBD)",null,null,51898,"Central",null,null,"Kati ","1 (Low prevalence, < 10%)",null,null,null,1]
[{"$f":"IF(INTRO!$E$34<>0,INTRO!$E$34,\"\")","v":"Zanzibar"},"Kusini Unguja","Kusini ",38126.666666666701,{"$f":"IF(INTRO!$E$48=\"\",\"\",ROUND($D16*INTRO!$E$48,0))","v":4880},{"$f":"IF(INTRO!$E$49=\"\",\"\",ROUND($D16*INTRO!$E$49,0))","v":12315},{"$f":"IF(INTRO!$E$50=\"\",\"\",ROUND($D16*INTRO!$E$50,0))","v":20932},1,null,2,0,{"$f":"IF(INTRO!$E$38=\"Endemic\", IF($H16>0, IF($H16=4,\"Unknown\", IF($H16=99,\"Stopped\", $D16)), 0),\"Not required\")","v":38126.666666666701},{"$f":"IF(INTRO!$E$40=\"Endemic\", IF($I16>0, IF($I16=4,\"Unknown\",IF($I16=99,\"Stopped\", $D16)), 0),\"Not required\")","v":"Not required"},{"$f":"IF(INTRO!$E$42=\"Endemic\", IF(AND($J16>1,$J16<5), IF($J16=4, \"Unknown\", E16+F16), 0),\"Not required\")","v":17195},{"$f":"IF(INTRO!$E$44=\"Endemic\", IF(AND($K16>0,$K16<5), IF($K16=4,\"Unknown\", IF($K16=1, $F16*0.33, IF($K16=2, $F16*0.5+$G16*0.2, SUM(F16:G16)))), 0),\"Not required\")","v":0},1,null,2,0,"T3 (ALB/MBD)","T3 (ALB/MBD)",null,null,51899,"South",null,null,"Kusini ","1 (Low prevalence, < 10%)",null,null,null,0]
[{"$f":"IF(INTRO!$E$34<>0,INTRO!$E$34,\"\")","v":"Zanzibar"},"Mjini Magharibi","Mjini ",172688.66666666701,{"$f":"IF(INTRO!$E$48=\"\",\"\",ROUND($D17*INTRO!$E$48,0))","v":22104},{"$f":"IF(INTRO!$E$49=\"\",\"\",ROUND($D17*INTRO!$E$49,0))","v":55778},{"$f":"IF(INTRO!$E$50=\"\",\"\",ROUND($D17*INTRO!$E$50,0))","v":94806},1,null,2,1,{"$f":"IF(INTRO!$E$38=\"Endemic\", IF($H17>0, IF($H17=4,\"Unknown\", IF($H17=99,\"Stopped\", $D17)), 0),\"Not required\")","v":172688.66666666701},{"$f":"IF(INTRO!$E$40=\"Endemic\", IF($I17>0, IF($I17=4,\"Unknown\",IF($I17=99,\"Stopped\", $D17)), 0),\"Not required\")","v":"Not required"},{"$f":"IF(INTRO!$E$42=\"Endemic\", IF(AND($J17>1,$J17<5), IF($J17=4, \"Unknown\", E17+F17), 0),\"Not required\")","v":77882},{"$f":"IF(INTRO!$E$44=\"Endemic\", IF(AND($K17>0,$K17<5), IF($K17=4,\"Unknown\", IF($K17=1, $F17*0.33, IF($K17=2, $F17*0.5+$G17*0.2, SUM(F17:G17)))), 0),\"Not required\")","v":18406.740000000002},1,null,2,2,"T1 (PZQ+ALB/MBD)","T1 (PZQ+ALB/MBD)",null,null,51901,"Urban",null,null,"Mjini ","1 (Low prevalence, < 10%)",null,null,null,1]
[{"$f":"IF(INTRO!$E$34<>0,INTRO!$E$34,\"\")","v":"Zanzibar"},"Mjini Magharibi","Magharibi A ",369408.33333333302,{"$f":"IF(INTRO!$E$48=\"\",\"\",ROUND($D18*INTRO!$E$48,0))","v":47284},{"$f":"IF(INTRO!$E$49=\"\",\"\",ROUND($D18*INTRO!$E$49,0))","v":119319},{"$f":"IF(INTRO!$E$50=\"\",\"\",ROUND($D18*INTRO!$E$50,0))","v":202805},1,null,2,1,{"$f":"IF(INTRO!$E$38=\"Endemic\", IF($H18>0, IF($H18=4,\"Unknown\", IF($H18=99,\"Stopped\", $D18)), 0),\"Not required\")","v":369408.33333333302},{"$f":"IF(INTRO!$E$40=\"Endemic\", IF($I18>0, IF($I18=4,\"Unknown\",IF($I18=99,\"Stopped\", $D18)), 0),\"Not required\")","v":"Not required"},{"$f":"IF(INTRO!$E$42=\"Endemic\", IF(AND($J18>1,$J18<5), IF($J18=4, \"Unknown\", E18+F18), 0),\"Not required\")","v":166603},{"$f":"IF(INTRO!$E$44=\"Endemic\", IF(AND($K18>0,$K18<5), IF($K18=4,\"Unknown\", IF($K18=1, $F18*0.33, IF($K18=2, $F18*0.5+$G18*0.2, SUM(F18:G18)))), 0),\"Not required\")","v":39375.270000000004},1,null,2,2,"T1 (PZQ+ALB/MBD)","T1 (PZQ+ALB/MBD)",null,null,51900,"West A",null,null,"Magharibi A ","1 (Low prevalence, < 10%)",null,null,null,1]
[null,null,null,null,null,null,null,null,null,null,null,null,null,null,null,null,null,null,null,null,null,null,null,null,null,null,null,"Magharibi B","1 (Low prevalence, < 10%)"]

{"sheet":"MDA1","index":2,"n_rows":18,"n_cols":17,"rows_kept":18,"cut":false,"hidden":false,"merged":[[5,13,5,16],[3,0,3,2],[5,0,5,2],[5,5,5,8],[5,9,5,12],[5,3,6,3],[5,4,6,4]]}
["MDA 1 - Ivermectin (IVM) and Albendazole (ALB)"]
["Administrative structure, population requiring PC by age group, population treated by age group and coverage"]
[]
["TOTAL",null,null,null,null,{"$f":"SUM(F$9:F$1000)","v":149203.712},{"$f":"SUM(G$9:G$1000)","v":376506.24200000003},{"$f":"SUM(H$9:H$1000)","v":639944.04600000009},{"$f":"SUM(I$9:I$1000)","v":1165654},null,{"$f":"SUM(K$9:K$1000)","v":321850},{"$f":"SUM(L$9:L$1000)","v":606158},{"$f":"SUM(M$9:M$1000)","v":928008},null,{"$f":"IF(G4<>0, IF(K4/G4*100=0, \"-\", K4/G4*100), \" \")","v":85.48331052636307},{"$f":"IF(H4<>0, IF(L4/H4*100=0, \"-\", L4/H4*100), \" \")","v":94.720468732980436},{"$f":"IF(I4<>0, IF(M4/I4*100=0, \"-\", M4/I4*100), \" \")","v":79.612646634421537}]
[]
[null,null,null,"PC implemented","Date","Population targeted for MDA 1",null,null,null,"Population treated",null,null,null,"Programme coverage (%)"]
["Country","Province/State","District",null,null,"PreSAC","SAC","Adults","Total","PreSAC","SAC","Adults","Total","PreSAC","SAC","Adults","Total"]
[]
[{"$f":"IF(COUNTRY_INFO!A9=0,\" \",COUNTRY_INFO!A9)","v":"Zanzibar"},{"$f":"IF(COUNTRY_INFO!B9=0,\" \",COUNTRY_INFO!B9)","v":"Kusini Pemba"},{"$f":"IF(COUNTRY_INFO!C9=0,\" \",COUNTRY_INFO!C9)","v":"Mkoani"},"MDA1 (IVM+ALB)",null,{"$f":"I9*[2]INTRO!$E$48","v":15741.696},{"$f":"I9*[2]INTRO!$E$49","v":39723.186000000002},{"$f":"I9*[2]INTRO!$E$50","v":67517.118000000002},122982,null,33075,54841,{"$f":"L9+K9","v":87916},null,{"$f":"IF(G9<>0, IF(K9/G9*100=0, \"-\", K9/G9*100), \" \")","v":83.263714043480803},{"$f":"IF(H9<>0, IF(L9/H9*100=0, \"-\", L9/H9*100), \" \")","v":81.225327182952327},71.486884259485123]
[{"$f":"IF(COUNTRY_INFO!A10=0,\" \",COUNTRY_INFO!A10)","v":"Zanzibar"},{"$f":"IF(COUNTRY_INFO!B10=0,\" \",COUNTRY_INFO!B10)","v":"Kusini Pemba"},{"$f":"IF(COUNTRY_INFO!C10=0,\" \",COUNTRY_INFO!C10)","v":"Chake Chake"},"MDA1 (IVM+ALB)",null,{"$f":"I10*[2]INTRO!$E$48","v":13685.504000000001},{"$f":"I10*[2]INTRO!$E$49","v":34534.514000000003},{"$f":"I10*[2]INTRO!$E$50","v":58697.982000000004},106918,null,28331,49960,{"$f":"L10+K10","v":78291},null,{"$f":"IF(G10<>0, IF(K10/G10*100=0, \"-\", K10/G10*100), \" \")","v":82.036770518907545},{"$f":"IF(H10<>0, IF(L10/H10*100=0, \"-\", L10/H10*100), \" \")","v":85.113658592215316},{"$f":"IF(I10<>0, IF(M10/I10*100=0, \"-\", M10/I10*100), \" \")","v":73.225275444733356}]
[{"$f":"IF(COUNTRY_INFO!A11=0,\" \",COUNTRY_INFO!A11)","v":"Zanzibar"},{"$f":"IF(COUNTRY_INFO!B11=0,\" \",COUNTRY_INFO!B11)","v":"Kaskazini Pemba"},{"$f":"IF(COUNTRY_INFO!C11=0,\" \",COUNTRY_INFO!C11)","v":"Wete"},"MDA1 (IVM+ALB)",null,{"$f":"I11*[2]INTRO!$E$48","v":6679.5520000000006},{"$f":"I11*[2]INTRO!$E$49","v":16855.432000000001},{"$f":"I11*[2]INTRO!$E$50","v":28649.016000000003},52184,null,10703,33750,44453,null,63.498817473203886,117.80509320110679,85.185114211252483]
[{"$f":"IF(COUNTRY_INFO!A12=0,\" \",COUNTRY_INFO!A12)","v":"Zanzibar"},{"$f":"IF(COUNTRY_INFO!B12=0,\" \",COUNTRY_INFO!B12)","v":"Kaskazini Pemba"},{"$f":"IF(COUNTRY_INFO!C12=0,\" \",COUNTRY_INFO!C12)","v":"Micheweni"},"MDA1 (IVM+ALB)",null,{"$f":"I12*[2]INTRO!$E$48","v":12690.816000000001},{"$f":"I12*[2]INTRO!$E$49","v":32024.481},{"$f":"I12*[2]INTRO!$E$50","v":54431.703000000001},99147,null,23206,49668,72874,null,72.463313300846309,91.248293297014797,73.500963216234481]
[{"$f":"IF(COUNTRY_INFO!A13=0,\" \",COUNTRY_INFO!A13)","v":"Zanzibar"},{"$f":"IF(COUNTRY_INFO!B13=0,\" \",COUNTRY_INFO!B13)","v":"Kaskazini Unguja"},{"$f":"IF(COUNTRY_INFO!C13=0,\" \",COUNTRY_INFO!C13)","v":"Kaskazini A"},"MDA1 (IVM+ALB)",null,{"$f":"I13*[2]INTRO!$E$48","v":14149.376},{"$f":"I13*[2]INTRO!$E$49","v":35705.065999999999},{"$f":"I13*[2]INTRO!$E$50","v":60687.558000000005},110542,null,29822,57587,87409,null,83.523161671231748,94.890949476002959,79.073112482133496]
[{"$f":"IF(COUNTRY_INFO!A14=0,\" \",COUNTRY_INFO!A14)","v":"Zanzibar"},{"$f":"IF(COUNTRY_INFO!B14=0,\" \",COUNTRY_INFO!B14)","v":"Kaskazini Unguja"},{"$f":"IF(COUNTRY_INFO!C14=0,\" \",COUNTRY_INFO!C14)","v":"Kaskazini B "},"MDA1 (IVM+ALB)",null,{"$f":"I14*[2]INTRO!$E$48","v":14028.672},{"$f":"I14*[2]INTRO!$E$49","v":35400.476999999999},{"$f":"I14*[2]INTRO!$E$50","v":60169.851000000002},109599,null,33665,56406,90071,null,95.097588656785618,93.744623033884523,82.182319181744361]
[{"$f":"IF(COUNTRY_INFO!A15=0,\" \",COUNTRY_INFO!A15)","v":"Zanzibar"},{"$f":"IF(COUNTRY_INFO!B15=0,\" \",COUNTRY_INFO!B15)","v":"Kusini Unguja"},{"$f":"IF(COUNTRY_INFO!C15=0,\" \",COUNTRY_INFO!C15)","v":"Kati "},"MDA1 (IVM+ALB)",null,{"$f":"I15*[2]INTRO!$E$48","v":9607.68},{"$f":"I15*[2]INTRO!$E$49","v":24244.38},{"$f":"I15*[2]INTRO!$E$50","v":41207.94},75060,null,29357,36400,65757,null,121.08785623719807,88.332491262606183,87.605915267785775]
[{"$f":"IF(COUNTRY_INFO!A16=0,\" \",COUNTRY_INFO!A16)","v":"Zanzibar"},{"$f":"IF(COUNTRY_INFO!B16=0,\" \",COUNTRY_INFO!B16)","v":"Kusini Unguja"},{"$f":"IF(COUNTRY_INFO!C16=0,\" \",COUNTRY_INFO!C16)","v":"Kusini "},"MDA1 (IVM+ALB)",null,{"$f":"I16*[2]INTRO!$E$48","v":4880.1279999999997},{"$f":"I16*[2]INTRO!$E$49","v":12314.698},{"$f":"I16*[2]INTRO!$E$50","v":20931.174000000003},38126,null,11230,20089,31319,null,91.191842463371813,95.976460756572934,82.146042071027651]
[{"$f":"IF(COUNTRY_INFO!A17=0,\" \",COUNTRY_INFO!A17)","v":"Zanzibar"},{"$f":"IF(COUNTRY_INFO!B17=0,\" \",COUNTRY_INFO!B17)","v":"Mjini Magharibi"},{"$f":"IF(COUNTRY_INFO!C17=0,\" \",COUNTRY_INFO!C17)","v":"Mjini "},"MDA1 (IVM+ALB)",null,{"$f":"I17*[2]INTRO!$E$48","v":19288.064000000002},{"$f":"I17*[2]INTRO!$E$49","v":48672.224000000002},{"$f":"I17*[2]INTRO!$E$50","v":82727.712},150688,null,42172,94331,136503,null,86.644900385073825,114.02587805160138,90.586509874708014]
[{"$f":"IF(COUNTRY_INFO!A18=0,\" \",COUNTRY_INFO!A18)","v":"Zanzibar"},{"$f":"IF(COUNTRY_INFO!B18=0,\" \",COUNTRY_INFO!B18)","v":"Mjini Magharibi"},{"$f":"IF(COUNTRY_INFO!C18=0,\" \",COUNTRY_INFO!C18)","v":"Magharibi A "},"MDA1 (IVM+ALB)",null,{"$f":"I18*[2]INTRO!$E$48","v":38452.224000000002},{"$f":"I18*[2]INTRO!$E$49","v":97031.784},{"$f":"I18*[2]INTRO!$E$50","v":164923.99200000003},300408,null,80289,153126,233415,null,82.745051868777352,92.846406482811773,77.699328912678752]

{"sheet":"MDA2","index":3,"n_rows":18,"n_cols":17,"rows_kept":18,"cut":false,"hidden":true,"merged":[[5,5,5,8],[5,9,5,12],[5,13,5,16],[3,0,3,2],[5,0,5,2],[5,3,6,3],[5,4,6,4]]}
["MDA 2 - Diethylcarbamazine citrate (DEC) + Albendazole (ALB)"]
["Administrative structure, population requiring PC by age group, population treated by age group and coverage"]
[]
["TOTAL",null,null,null,null,{"$f":"SUM(F$9:F$1000)","v":0},{"$f":"SUM(G$9:G$1000)","v":0},0,0,0,0,0,0,{"$f":"IF(F4<>0, IF(J4/F4*100=0, \"-\", J4/F4*100), \" \")","v":" "},{"$f":"IF(G4<>0, IF(K4/G4*100=0, \"-\", K4/G4*100), \" \")","v":" "},{"$f":"IF(H4<>0, IF(L4/H4*100=0, \"-\", L4/H4*100), \" \")","v":" "},{"$f":"IF(I4<>0, IF(M4/I4*100=0, \"-\", M4/I4*100), \" \")","v":" "}]
[]
[null,null,null,"PC implemented","Date","Population targeted for MDA 2",null,null,null,"Population treated",null,null,null,"Programme coverage (%)"]
["Country","Province/State","District",null,null,"PreSAC","SAC","Adults","Total","PreSAC","SAC","Adults","Total","PreSAC","SAC","Adults","Total"]
[]
[{"$f":"IF(COUNTRY_INFO!A9=0,\" \",COUNTRY_INFO!A9)","v":"Zanzibar"},{"$f":"IF(COUNTRY_INFO!B9=0,\" \",COUNTRY_INFO!B9)","v":"Kusini Pemba"},{"$f":"IF(COUNTRY_INFO!C9=0,\" \",COUNTRY_INFO!C9)","v":"Mkoani"},{"$f":"IF(COUNTRY_INFO!$T$9:$T$1000=\"MDA2 (DEC+ALB)\", COUNTRY_INFO!$T$9:$T$1000, \" \")","v":" "},null,null,null,null,{"$f":"SUM(F9:H9)","v":0},null,null,null,{"$f":"SUM(J9:L9)","v":0},{"$f":"IF(F9<>0, IF(J9/F9*100=0, \"-\", J9/F9*100), \" \")","v":" "}," "," "," "]
[{"$f":"IF(COUNTRY_INFO!A10=0,\" \",COUNTRY_INFO!A10)","v":"Zanzibar"},{"$f":"IF(COUNTRY_INFO!B10=0,\" \",COUNTRY_INFO!B10)","v":"Kusini Pemba"},{"$f":"IF(COUNTRY_INFO!C10=0,\" \",COUNTRY_INFO!C10)","v":"Chake Chake"},{"$f":"IF(COUNTRY_INFO!$T$9:$T$1000=\"MDA2 (DEC+ALB)\", COUNTRY_INFO!$T$9:$T$1000, \" \")","v":" "},null,null,null,null,{"$f":"SUM(F10:H10)","v":0},null,null,null,{"$f":"SUM(J10:L10)","v":0},{"$f":"IF(F10<>0, IF(J10/F10*100=0, \"-\", J10/F10*100), \" \")","v":" "},{"$f":"IF(G10<>0, IF(K10/G10*100=0, \"-\", K10/G10*100), \" \")","v":" "},{"$f":"IF(H10<>0, IF(L10/H10*100=0, \"-\", L10/H10*100), \" \")","v":" "},{"$f":"IF(I10<>0, IF(M10/I10*100=0, \"-\", M10/I10*100), \" \")","v":" "}]
[{"$f":"IF(COUNTRY_INFO!A11=0,\" \",COUNTRY_INFO!A11)","v":"Zanzibar"},{"$f":"IF(COUNTRY_INFO!B11=0,\" \",COUNTRY_INFO!B11)","v":"Kaskazini Pemba"},{"$f":"IF(COUNTRY_INFO!C11=0,\" \",COUNTRY_INFO!C11)","v":"Wete"},{"$f":"IF(COUNTRY_INFO!$T$9:$T$1000=\"MDA2 (DEC+ALB)\", COUNTRY_INFO!$T$9:$T$1000, \" \")","v":" "},null,null,null,null,0,null,null,null,0," "," "," "," "]
[{"$f":"IF(COUNTRY_INFO!A12=0,\" \",COUNTRY_INFO!A12)","v":"Zanzibar"},{"$f":"IF(COUNTRY_INFO!B12=0,\" \",COUNTRY_INFO!B12)","v":"Kaskazini Pemba"},{"$f":"IF(COUNTRY_INFO!C12=0,\" \",COUNTRY_INFO!C12)","v":"Micheweni"},{"$f":"IF(COUNTRY_INFO!$T$9:$T$1000=\"MDA2 (DEC+ALB)\", COUNTRY_INFO!$T$9:$T$1000, \" \")","v":" "},null,null,null,null,0,null,null,null,0," "," "," "," "]
[{"$f":"IF(COUNTRY_INFO!A13=0,\" \",COUNTRY_INFO!A13)","v":"Zanzibar"},{"$f":"IF(COUNTRY_INFO!B13=0,\" \",COUNTRY_INFO!B13)","v":"Kaskazini Unguja"},{"$f":"IF(COUNTRY_INFO!C13=0,\" \",COUNTRY_INFO!C13)","v":"Kaskazini A"},{"$f":"IF(COUNTRY_INFO!$T$9:$T$1000=\"MDA2 (DEC+ALB)\", COUNTRY_INFO!$T$9:$T$1000, \" \")","v":" "},null,null,null,null,0,null,null,null,0," "," "," "," "]
[{"$f":"IF(COUNTRY_INFO!A14=0,\" \",COUNTRY_INFO!A14)","v":"Zanzibar"},{"$f":"IF(COUNTRY_INFO!B14=0,\" \",COUNTRY_INFO!B14)","v":"Kaskazini Unguja"},{"$f":"IF(COUNTRY_INFO!C14=0,\" \",COUNTRY_INFO!C14)","v":"Kaskazini B "},{"$f":"IF(COUNTRY_INFO!$T$9:$T$1000=\"MDA2 (DEC+ALB)\", COUNTRY_INFO!$T$9:$T$1000, \" \")","v":" "},null,null,null,null,0,null,null,null,0," "," "," "," "]
[{"$f":"IF(COUNTRY_INFO!A15=0,\" \",COUNTRY_INFO!A15)","v":"Zanzibar"},{"$f":"IF(COUNTRY_INFO!B15=0,\" \",COUNTRY_INFO!B15)","v":"Kusini Unguja"},{"$f":"IF(COUNTRY_INFO!C15=0,\" \",COUNTRY_INFO!C15)","v":"Kati "},{"$f":"IF(COUNTRY_INFO!$T$9:$T$1000=\"MDA2 (DEC+ALB)\", COUNTRY_INFO!$T$9:$T$1000, \" \")","v":" "},null,null,null,null,0,null,null,null,0," "," "," "," "]
[{"$f":"IF(COUNTRY_INFO!A16=0,\" \",COUNTRY_INFO!A16)","v":"Zanzibar"},{"$f":"IF(COUNTRY_INFO!B16=0,\" \",COUNTRY_INFO!B16)","v":"Kusini Unguja"},{"$f":"IF(COUNTRY_INFO!C16=0,\" \",COUNTRY_INFO!C16)","v":"Kusini "},{"$f":"IF(COUNTRY_INFO!$T$9:$T$1000=\"MDA2 (DEC+ALB)\", COUNTRY_INFO!$T$9:$T$1000, \" \")","v":" "},null,null,null,null,0,null,null,null,0," "," "," "," "]
[{"$f":"IF(COUNTRY_INFO!A17=0,\" \",COUNTRY_INFO!A17)","v":"Zanzibar"},{"$f":"IF(COUNTRY_INFO!B17=0,\" \",COUNTRY_INFO!B17)","v":"Mjini Magharibi"},{"$f":"IF(COUNTRY_INFO!C17=0,\" \",COUNTRY_INFO!C17)","v":"Mjini "},{"$f":"IF(COUNTRY_INFO!$T$9:$T$1000=\"MDA2 (DEC+ALB)\", COUNTRY_INFO!$T$9:$T$1000, \" \")","v":" "},null,null,null,null,0,null,null,null,0," "," "," "," "]
[{"$f":"IF(COUNTRY_INFO!A18=0,\" \",COUNTRY_INFO!A18)","v":"Zanzibar"},{"$f":"IF(COUNTRY_INFO!B18=0,\" \",COUNTRY_INFO!B18)","v":"Mjini Magharibi"},{"$f":"IF(COUNTRY_INFO!C18=0,\" \",COUNTRY_INFO!C18)","v":"Magharibi A "},{"$f":"IF(COUNTRY_INFO!$T$9:$T$1000=\"MDA2 (DEC+ALB)\", COUNTRY_INFO!$T$9:$T$1000, \" \")","v":" "},null,null,null,null,0,null,null,null,0," "," "," "," "]

{"sheet":"MDA3","index":4,"n_rows":18,"n_cols":20,"rows_kept":18,"cut":false,"hidden":true,"merged":[[5,5,5,7],[5,17,5,19],[3,0,3,2],[5,0,5,2],[5,3,6,3],[5,4,6,4],[5,8,5,10],[5,11,5,13],[5,14,5,16]]}
["MDA 3 - Ivermectin (IVM) "]
["Administrative structure, population requiring PC by age group, population treated by age group and coverage"]
[]
["TOTAL",null,null,null,null,{"$f":"SUM(F$9:F$1000)","v":0},0,0,0,0,0,0,0,0,0,0,0,{"$f":"IF(F4<>0, IF(O4/F4*100=0, \"-\", O4/F4*100), \" \")","v":" "},{"$f":"IF(G4<>0, IF(P4/G4*100=0, \"-\", P4/G4*100), \" \")","v":" "},{"$f":"IF(H4<>0, IF(Q4/H4*100=0, \"-\", Q4/H4*100), \" \")","v":" "}]
[]
[null,null,null,"PC implemented","Date","Population targeted for MDA 3",null,null,"Population treated - 1st round",null,null,"Population treated - 2nd round",null,null,"Population treated",null,null,"Programme coverage (%)"]
["Country","Province/State","District",null,null,"SAC","Adults","Total","SAC","Adults","Total","SAC","Adults","Total","SAC","Adults","Total","SAC","Adults","Total"]
[]
[{"$f":"IF(COUNTRY_INFO!A9=0,\" \",COUNTRY_INFO!A9)","v":"Zanzibar"},{"$f":"IF(COUNTRY_INFO!B9=0,\" \",COUNTRY_INFO!B9)","v":"Kusini Pemba"},{"$f":"IF(COUNTRY_INFO!C9=0,\" \",COUNTRY_INFO!C9)","v":"Mkoani"},{"$f":"IF(COUNTRY_INFO!$T$9:$T$1000=\"MDA3 (IVM)\", COUNTRY_INFO!$T$9:$T$1000, \" \")","v":" "},null,null,null,{"$f":"SUM(F9:G9)","v":0},null,null,{"$f":"SUM(I9:J9)","v":0},null,null,{"$f":"SUM(L9:M9)","v":0},{"$f":"MAX(I9,L9)","v":0},0,{"$f":"SUM(O9:P9)","v":0},{"$f":"IF(F9<>0, IF(MAX(I9,L9)/F9*100=0, \"-\", MAX(I9,L9)/F9*100), \" \")","v":" "}," ",{"$f":"IF(H9<>0, IF((MAX(I9,L9)+MAX(J9,M9))/H9*100=0, \"-\",(MAX(I9,L9)+MAX(J9,M9))/H9*100), \" \")","v":" "}]
[{"$f":"IF(COUNTRY_INFO!A10=0,\" \",COUNTRY_INFO!A10)","v":"Zanzibar"},{"$f":"IF(COUNTRY_INFO!B10=0,\" \",COUNTRY_INFO!B10)","v":"Kusini Pemba"},{"$f":"IF(COUNTRY_INFO!C10=0,\" \",COUNTRY_INFO!C10)","v":"Chake Chake"},{"$f":"IF(COUNTRY_INFO!$T$9:$T$1000=\"MDA3 (IVM)\", COUNTRY_INFO!$T$9:$T$1000, \" \")","v":" "},null,null,null,{"$f":"SUM(F10:G10)","v":0},null,null,{"$f":"SUM(I10:J10)","v":0},null,null,{"$f":"SUM(L10:M10)","v":0},{"$f":"MAX(I10,L10)","v":0},{"$f":"MAX(J10,M10)","v":0},{"$f":"SUM(O10:P10)","v":0},{"$f":"IF(F10<>0, IF(MAX(I10,L10)/F10*100=0, \"-\", MAX(I10,L10)/F10*100), \" \")","v":" "},{"$f":"IF(G10<>0, IF(MAX(J10,M10)/G10*100=0, \"-\", MAX(J10,M10)/G10*100), \" \")","v":" "},{"$f":"IF(H10<>0, IF((MAX(I10,L10)+MAX(J10,M10))/H10*100=0, \"-\",(MAX(I10,L10)+MAX(J10,M10))/H10*100), \" \")","v":" "}]
[{"$f":"IF(COUNTRY_INFO!A11=0,\" \",COUNTRY_INFO!A11)","v":"Zanzibar"},{"$f":"IF(COUNTRY_INFO!B11=0,\" \",COUNTRY_INFO!B11)","v":"Kaskazini Pemba"},{"$f":"IF(COUNTRY_INFO!C11=0,\" \",COUNTRY_INFO!C11)","v":"Wete"},{"$f":"IF(COUNTRY_INFO!$T$9:$T$1000=\"MDA3 (IVM)\", COUNTRY_INFO!$T$9:$T$1000, \" \")","v":" "},null,null,null,0,null,null,0,null,null,0,0,0,0," "," "," "]
[{"$f":"IF(COUNTRY_INFO!A12=0,\" \",COUNTRY_INFO!A12)","v":"Zanzibar"},{"$f":"IF(COUNTRY_INFO!B12=0,\" \",COUNTRY_INFO!B12)","v":"Kaskazini Pemba"},{"$f":"IF(COUNTRY_INFO!C12=0,\" \",COUNTRY_INFO!C12)","v":"Micheweni"},{"$f":"IF(COUNTRY_INFO!$T$9:$T$1000=\"MDA3 (IVM)\", COUNTRY_INFO!$T$9:$T$1000, \" \")","v":" "},null,null,null,0,null,null,0,null,null,0,0,0,0," "," "," "]
[{"$f":"IF(COUNTRY_INFO!A13=0,\" \",COUNTRY_INFO!A13)","v":"Zanzibar"},{"$f":"IF(COUNTRY_INFO!B13=0,\" \",COUNTRY_INFO!B13)","v":"Kaskazini Unguja"},{"$f":"IF(COUNTRY_INFO!C13=0,\" \",COUNTRY_INFO!C13)","v":"Kaskazini A"},{"$f":"IF(COUNTRY_INFO!$T$9:$T$1000=\"MDA3 (IVM)\", COUNTRY_INFO!$T$9:$T$1000, \" \")","v":" "},null,null,null,0,null,null,0,null,null,0,0,0,0," "," "," "]
[{"$f":"IF(COUNTRY_INFO!A14=0,\" \",COUNTRY_INFO!A14)","v":"Zanzibar"},{"$f":"IF(COUNTRY_INFO!B14=0,\" \",COUNTRY_INFO!B14)","v":"Kaskazini Unguja"},{"$f":"IF(COUNTRY_INFO!C14=0,\" \",COUNTRY_INFO!C14)","v":"Kaskazini B "},{"$f":"IF(COUNTRY_INFO!$T$9:$T$1000=\"MDA3 (IVM)\", COUNTRY_INFO!$T$9:$T$1000, \" \")","v":" "},null,null,null,0,null,null,0,null,null,0,0,0,0," "," "," "]
[{"$f":"IF(COUNTRY_INFO!A15=0,\" \",COUNTRY_INFO!A15)","v":"Zanzibar"},{"$f":"IF(COUNTRY_INFO!B15=0,\" \",COUNTRY_INFO!B15)","v":"Kusini Unguja"},{"$f":"IF(COUNTRY_INFO!C15=0,\" \",COUNTRY_INFO!C15)","v":"Kati "},{"$f":"IF(COUNTRY_INFO!$T$9:$T$1000=\"MDA3 (IVM)\", COUNTRY_INFO!$T$9:$T$1000, \" \")","v":" "},null,null,null,0,null,null,0,null,null,0,0,0,0," "," "," "]
[{"$f":"IF(COUNTRY_INFO!A16=0,\" \",COUNTRY_INFO!A16)","v":"Zanzibar"},{"$f":"IF(COUNTRY_INFO!B16=0,\" \",COUNTRY_INFO!B16)","v":"Kusini Unguja"},{"$f":"IF(COUNTRY_INFO!C16=0,\" \",COUNTRY_INFO!C16)","v":"Kusini "},{"$f":"IF(COUNTRY_INFO!$T$9:$T$1000=\"MDA3 (IVM)\", COUNTRY_INFO!$T$9:$T$1000, \" \")","v":" "},null,null,null,0,null,null,0,null,null,0,0,0,0," "," "," "]
[{"$f":"IF(COUNTRY_INFO!A17=0,\" \",COUNTRY_INFO!A17)","v":"Zanzibar"},{"$f":"IF(COUNTRY_INFO!B17=0,\" \",COUNTRY_INFO!B17)","v":"Mjini Magharibi"},{"$f":"IF(COUNTRY_INFO!C17=0,\" \",COUNTRY_INFO!C17)","v":"Mjini "},{"$f":"IF(COUNTRY_INFO!$T$9:$T$1000=\"MDA3 (IVM)\", COUNTRY_INFO!$T$9:$T$1000, \" \")","v":" "},null,null,null,0,null,null,0,null,null,0,0,0,0," "," "," "]
[{"$f":"IF(COUNTRY_INFO!A18=0,\" \",COUNTRY_INFO!A18)","v":"Zanzibar"},{"$f":"IF(COUNTRY_INFO!B18=0,\" \",COUNTRY_INFO!B18)","v":"Mjini Magharibi"},{"$f":"IF(COUNTRY_INFO!C18=0,\" \",COUNTRY_INFO!C18)","v":"Magharibi A "},{"$f":"IF(COUNTRY_INFO!$T$9:$T$1000=\"MDA3 (IVM)\", COUNTRY_INFO!$T$9:$T$1000, \" \")","v":" "},null,null,null,0,null,null,0,null,null,0,0,0,0," "," "," "]

{"sheet":"T1_R1","index":5,"n_rows":18,"n_cols":19,"rows_kept":18,"cut":false,"hidden":false,"merged":[[5,6,5,10],[5,11,5,14],[5,15,5,18],[3,0,3,2],[5,0,5,2],[5,3,6,3],[5,5,6,5],[5,4,6,4]]}
["T 1 - Praziquantel (PZQ) and Albendazole (ALB) or Mebendazole (MBD)"]
["Administrative structure, population requiring PC by age group, population treated by age group and coverage"]
[]
["TOTAL",null,null,null,null,null,{"$f":"SUM(G$9:G$1000)","v":0},411998,206002,700266,{"$f":"SUM(K$9:K$1000)","v":1112264},0,256620,508069,764689,{"$f":"IF(G4<>0, IF(L4/G4*100=0, \"-\", L4/G4*100), \" \")","v":" "},{"$f":"IF(OR(I4<>0,H4<>0), IF(M4/MAX(H4,I4)*100=0, \"-\", M4/MAX(H4,I4)*100), \" \")","v":62.286710129660825},{"$f":"IF(J4<>0, IF(N4/J4*100=0, \"-\", N4/J4*100), \" \")","v":72.553715302470778},{"$f":"IF(K4<>0, IF(O4/K4*100=0, \"-\", O4/K4*100), \" \")","v":68.750674300345963}]
[]
[null,null,null,"PC implemented","Medicine","Date","Population targeted for T1",null,null,null,null,"Population treated",null,null,null,"Programme coverage (%)"]
["Country","Province/State","District",null,null,null,"PreSAC (ALB)","SAC (ALB)","SAC (PZQ)","Adults (PZQ)","Total","PreSAC","SAC","Adults","Total","PreSAC","SAC","Adults","Total"]
[]
[{"$f":"IF(COUNTRY_INFO!A9=0,\" \",COUNTRY_INFO!A9)","v":"Zanzibar"},{"$f":"IF(COUNTRY_INFO!B9=0,\" \",COUNTRY_INFO!B9)","v":"Kusini Pemba"},{"$f":"IF(COUNTRY_INFO!C9=0,\" \",COUNTRY_INFO!C9)","v":"Mkoani"},{"$f":"IF(OR(COUNTRY_INFO!$T$9:$T$1000=\"T1 (PZQ+ALB/MBD)\",COUNTRY_INFO!$U$9:$U$1000=\"T1 (PZQ+ALB/MBD)\"), \"T1 (PZQ+ALB/MBD)\", \" \")","v":"T1 (PZQ+ALB/MBD)"},"PZQ+ALB","March",null,49413,24707,83987,{"$f":"MAX(H9:I9)+G9+J9","v":133400},null,6075,54841,{"$f":"SUM(L9:N9)","v":60916},{"$f":"IF(G9<>0, IF(L9/G9*100=0, \"-\", L9/G9*100), \" \")","v":" "},{"$f":"IF(OR(I9<>0,H9<>0), IF(M9/MAX(H9,I9)*100=0, \"-\", M9/MAX(H9,I9)*100), \" \")","v":12.294335498755387},{"$f":"IF(J9<>0, IF(N9/J9*100=0, \"-\", N9/J9*100), \" \")","v":65.297010251586556},45.664167916041983]
[{"$f":"IF(COUNTRY_INFO!A10=0,\" \",COUNTRY_INFO!A10)","v":"Zanzibar"},{"$f":"IF(COUNTRY_INFO!B10=0,\" \",COUNTRY_INFO!B10)","v":"Kusini Pemba"},{"$f":"IF(COUNTRY_INFO!C10=0,\" \",COUNTRY_INFO!C10)","v":"Chake Chake"},{"$f":"IF(OR(COUNTRY_INFO!$T$9:$T$1000=\"T1 (PZQ+ALB/MBD)\",COUNTRY_INFO!$U$9:$U$1000=\"T1 (PZQ+ALB/MBD)\"), \"T1 (PZQ+ALB/MBD)\", \" \")","v":"T1 (PZQ+ALB/MBD)"},"PZQ+ALB","March",null,34535,17268,58698,{"$f":"MAX(H10:I10)+G10+J10","v":93233},null,18331,34960,{"$f":"SUM(L10:N10)","v":53291},{"$f":"IF(G10<>0, IF(L10/G10*100=0, \"-\", L10/G10*100), \" \")","v":" "},{"$f":"IF(OR(I10<>0,H10<>0), IF(M10/MAX(H10,I10)*100=0, \"-\", M10/MAX(H10,I10)*100), \" \")","v":53.07948458085999},{"$f":"IF(J10<>0, IF(N10/J10*100=0, \"-\", N10/J10*100), \" \")","v":59.55909911751678},{"$f":"IF(K10<>0, IF(O10/K10*100=0, \"-\", O10/K10*100), \" \")","v":57.158945866806818}]
[{"$f":"IF(COUNTRY_INFO!A11=0,\" \",COUNTRY_INFO!A11)","v":"Zanzibar"},{"$f":"IF(COUNTRY_INFO!B11=0,\" \",COUNTRY_INFO!B11)","v":"Kaskazini Pemba"},{"$f":"IF(COUNTRY_INFO!C11=0,\" \",COUNTRY_INFO!C11)","v":"Wete"},{"$f":"IF(OR(COUNTRY_INFO!$T$9:$T$1000=\"T1 (PZQ+ALB/MBD)\",COUNTRY_INFO!$U$9:$U$1000=\"T1 (PZQ+ALB/MBD)\"), \"T1 (PZQ+ALB/MBD)\", \" \")","v":"T1 (PZQ+ALB/MBD)"},"PZQ+ALB","March",null,23316,11658,39629,62945,null,26703,61750,88453," ",114.52650540401442,155.82023265790204,140.52426721741202]
[{"$f":"IF(COUNTRY_INFO!A12=0,\" \",COUNTRY_INFO!A12)","v":"Zanzibar"},{"$f":"IF(COUNTRY_INFO!B12=0,\" \",COUNTRY_INFO!B12)","v":"Kaskazini Pemba"},{"$f":"IF(COUNTRY_INFO!C12=0,\" \",COUNTRY_INFO!C12)","v":"Micheweni"},{"$f":"IF(OR(COUNTRY_INFO!$T$9:$T$1000=\"T1 (PZQ+ALB/MBD)\",COUNTRY_INFO!$U$9:$U$1000=\"T1 (PZQ+ALB/MBD)\"), \"T1 (PZQ+ALB/MBD)\", \" \")","v":"T1 (PZQ+ALB/MBD)"},"PZQ+ALB","March",null,34286,17143,58275,92561,null,13206,29668,42874," ",38.517179023508135,50.910338910338915,46.31972428992772]
[{"$f":"IF(COUNTRY_INFO!A13=0,\" \",COUNTRY_INFO!A13)","v":"Zanzibar"},{"$f":"IF(COUNTRY_INFO!B13=0,\" \",COUNTRY_INFO!B13)","v":"Kaskazini Unguja"},{"$f":"IF(COUNTRY_INFO!C13=0,\" \",COUNTRY_INFO!C13)","v":"Kaskazini A"},{"$f":"IF(OR(COUNTRY_INFO!$T$9:$T$1000=\"T1 (PZQ+ALB/MBD)\",COUNTRY_INFO!$U$9:$U$1000=\"T1 (PZQ+ALB/MBD)\"), \"T1 (PZQ+ALB/MBD)\", \" \")","v":"T1 (PZQ+ALB/MBD)"},"PZQ+ALB","March",null,35705,17853,60688,96393,null,26822,42587,69409," ",75.121131494188489,70.173675191141569,72.006266015167071]
[{"$f":"IF(COUNTRY_INFO!A14=0,\" \",COUNTRY_INFO!A14)","v":"Zanzibar"},{"$f":"IF(COUNTRY_INFO!B14=0,\" \",COUNTRY_INFO!B14)","v":"Kaskazini Unguja"},{"$f":"IF(COUNTRY_INFO!C14=0,\" \",COUNTRY_INFO!C14)","v":"Kaskazini B "},{"$f":"IF(OR(COUNTRY_INFO!$T$9:$T$1000=\"T1 (PZQ+ALB/MBD)\",COUNTRY_INFO!$U$9:$U$1000=\"T1 (PZQ+ALB/MBD)\"), \"T1 (PZQ+ALB/MBD)\", \" \")","v":"T1 (PZQ+ALB/MBD)"},"PZQ+ALB","March",null,35401,17701,60170,95571,null,13665,30406,44071," ",38.600604502697664,50.533488449393381,46.113360747507087]
[{"$f":"IF(COUNTRY_INFO!A15=0,\" \",COUNTRY_INFO!A15)","v":"Zanzibar"},{"$f":"IF(COUNTRY_INFO!B15=0,\" \",COUNTRY_INFO!B15)","v":"Kusini Unguja"},{"$f":"IF(COUNTRY_INFO!C15=0,\" \",COUNTRY_INFO!C15)","v":"Kati "},{"$f":"IF(OR(COUNTRY_INFO!$T$9:$T$1000=\"T1 (PZQ+ALB/MBD)\",COUNTRY_INFO!$U$9:$U$1000=\"T1 (PZQ+ALB/MBD)\"), \"T1 (PZQ+ALB/MBD)\", \" \")","v":"T1 (PZQ+ALB/MBD)"},"PZQ+ALB","March",null,24245,12123,41208,65453,null,29357,36400,65757," ",121.08475974427716,88.332362648029502,100.46445541075275]
[{"$f":"IF(COUNTRY_INFO!A16=0,\" \",COUNTRY_INFO!A16)","v":"Zanzibar"},{"$f":"IF(COUNTRY_INFO!B16=0,\" \",COUNTRY_INFO!B16)","v":"Kusini Unguja"},{"$f":"IF(COUNTRY_INFO!C16=0,\" \",COUNTRY_INFO!C16)","v":"Kusini "},{"$f":"IF(OR(COUNTRY_INFO!$T$9:$T$1000=\"T1 (PZQ+ALB/MBD)\",COUNTRY_INFO!$U$9:$U$1000=\"T1 (PZQ+ALB/MBD)\"), \"T1 (PZQ+ALB/MBD)\", \" \")","v":" "},null,null,null,null,null,null,0,null,null,null,0," "," "," "," "]
[{"$f":"IF(COUNTRY_INFO!A17=0,\" \",COUNTRY_INFO!A17)","v":"Zanzibar"},{"$f":"IF(COUNTRY_INFO!B17=0,\" \",COUNTRY_INFO!B17)","v":"Mjini Magharibi"},{"$f":"IF(COUNTRY_INFO!C17=0,\" \",COUNTRY_INFO!C17)","v":"Mjini "},{"$f":"IF(OR(COUNTRY_INFO!$T$9:$T$1000=\"T1 (PZQ+ALB/MBD)\",COUNTRY_INFO!$U$9:$U$1000=\"T1 (PZQ+ALB/MBD)\"), \"T1 (PZQ+ALB/MBD)\", \" \")","v":"T1 (PZQ+ALB/MBD)"},"PZQ+ALB","March",null,55778,27889,94806,150584,null,42172,94331,136503," ",75.606870092151027,99.498976858004767,90.649072942676511]
[{"$f":"IF(COUNTRY_INFO!A18=0,\" \",COUNTRY_INFO!A18)","v":"Zanzibar"},{"$f":"IF(COUNTRY_INFO!B18=0,\" \",COUNTRY_INFO!B18)","v":"Mjini Magharibi"},{"$f":"IF(COUNTRY_INFO!C18=0,\" \",COUNTRY_INFO!C18)","v":"Magharibi A "},{"$f":"IF(OR(COUNTRY_INFO!$T$9:$T$1000=\"T1 (PZQ+ALB/MBD)\",COUNTRY_INFO!$U$9:$U$1000=\"T1 (PZQ+ALB/MBD)\"), \"T1 (PZQ+ALB/MBD)\", \" \")","v":"T1 (PZQ+ALB/MBD)"},"PZQ+ALB","March",null,119319,59660,202805,322124,null,80289,123126,203415," ",67.289367158625197,60.711520919109482,63.148042368777247]

{"sheet":"T1_R2","index":6,"n_rows":18,"n_cols":19,"rows_kept":18,"cut":false,"hidden":false,"merged":[[5,11,5,14],[5,15,5,18],[3,0,3,2],[5,0,5,2],[5,3,6,3],[5,4,6,4],[5,5,6,5],[5,6,5,10]]}
["T 1 - Praziquantel (PZQ) and Albendazole (ALB) or Mebendazole (MBD)"]
["Administrative structure, population requiring PC by age group, population treated by age group and coverage"]
[]
["TOTAL",null,null,null,null,null,{"$f":"SUM(G$9:G$1000)","v":0},411998,205999,700266,{"$f":"SUM(K$9:K$1000)","v":1112264},0,243761,526953,770714,{"$f":"IF(G4<>0, IF(L4/G4*100=0, \"-\", L4/G4*100), \" \")","v":" "},{"$f":"IF(OR(I4<>0,H4<>0), IF(M4/MAX(H4,I4)*100=0, \"-\", M4/MAX(H4,I4)*100), \" \")","v":59.165578473681911},{"$f":"IF(J4<>0, IF(N4/J4*100=0, \"-\", N4/J4*100), \" \")","v":75.25040484615846},{"$f":"IF(K4<>0, IF(O4/K4*100=0, \"-\", O4/K4*100), \" \")","v":69.292362244934651}]
[]
[null,null,null,"PC implemented","Medicine","Date","Population targeted for T1",null,null,null,null,"Population treated",null,null,null,"Programme coverage (%)"]
["Country","Province/State","District",null,null,null,"PreSAC (ALB)","SAC (ALB)","SAC (PZQ)","Adults (PZQ)","Total","PreSAC","SAC","Adults","Total","PreSAC","SAC","Adults","Total"]
[]
[{"$f":"IF(COUNTRY_INFO!A9=0,\" \",COUNTRY_INFO!A9)","v":"Zanzibar"},{"$f":"IF(COUNTRY_INFO!B9=0,\" \",COUNTRY_INFO!B9)","v":"Kusini Pemba"},{"$f":"IF(COUNTRY_INFO!C9=0,\" \",COUNTRY_INFO!C9)","v":"Mkoani"},{"$f":"IF(OR(COUNTRY_INFO!$T$9:$T$1000=\"T1 (PZQ+ALB/MBD)\",COUNTRY_INFO!$U$9:$U$1000=\"T1 (PZQ+ALB/MBD)\"), \"T1 (PZQ+ALB/MBD)\", \" \")","v":"T1 (PZQ+ALB/MBD)"},"PZQ+ALB","November",null,49413,24706.5,83987,{"$f":"MAX(H9:I9)+G9+J9","v":133400},null,7590,35021,{"$f":"SUM(L9:N9)","v":42611},{"$f":"IF(G9<>0, IF(L9/G9*100=0, \"-\", L9/G9*100), \" \")","v":" "},{"$f":"IF(OR(I9<>0,H9<>0), IF(M9/MAX(H9,I9)*100=0, \"-\", M9/MAX(H9,I9)*100), \" \")","v":15.360330277457349},{"$f":"IF(J9<>0, IF(N9/J9*100=0, \"-\", N9/J9*100), \" \")","v":41.698119947134678},31.942278860569719]
[{"$f":"IF(COUNTRY_INFO!A10=0,\" \",COUNTRY_INFO!A10)","v":"Zanzibar"},{"$f":"IF(COUNTRY_INFO!B10=0,\" \",COUNTRY_INFO!B10)","v":"Kusini Pemba"},{"$f":"IF(COUNTRY_INFO!C10=0,\" \",COUNTRY_INFO!C10)","v":"Chake Chake"},{"$f":"IF(OR(COUNTRY_INFO!$T$9:$T$1000=\"T1 (PZQ+ALB/MBD)\",COUNTRY_INFO!$U$9:$U$1000=\"T1 (PZQ+ALB/MBD)\"), \"T1 (PZQ+ALB/MBD)\", \" \")","v":"T1 (PZQ+ALB/MBD)"},"PZQ+ALB","November",null,34535,17267.5,58698,93233,null,21064,36488,57552," ",60.99319530910671,62.162254250570712,61.729216050111013]
[{"$f":"IF(COUNTRY_INFO!A11=0,\" \",COUNTRY_INFO!A11)","v":"Zanzibar"},{"$f":"IF(COUNTRY_INFO!B11=0,\" \",COUNTRY_INFO!B11)","v":"Kaskazini Pemba"},{"$f":"IF(COUNTRY_INFO!C11=0,\" \",COUNTRY_INFO!C11)","v":"Wete"},{"$f":"IF(OR(COUNTRY_INFO!$T$9:$T$1000=\"T1 (PZQ+ALB/MBD)\",COUNTRY_INFO!$U$9:$U$1000=\"T1 (PZQ+ALB/MBD)\"), \"T1 (PZQ+ALB/MBD)\", \" \")","v":"T1 (PZQ+ALB/MBD)"},"PZQ+ALB","November",null,23316,11658,39629,62945,null,13371,42343,55714," ",57.346886258363362,106.84852002321531,88.512193184526183]
[{"$f":"IF(COUNTRY_INFO!A12=0,\" \",COUNTRY_INFO!A12)","v":"Zanzibar"},{"$f":"IF(COUNTRY_INFO!B12=0,\" \",COUNTRY_INFO!B12)","v":"Kaskazini Pemba"},{"$f":"IF(COUNTRY_INFO!C12=0,\" \",COUNTRY_INFO!C12)","v":"Micheweni"},{"$f":"IF(OR(COUNTRY_INFO!$T$9:$T$1000=\"T1 (PZQ+ALB/MBD)\",COUNTRY_INFO!$U$9:$U$1000=\"T1 (PZQ+ALB/MBD)\"), \"T1 (PZQ+ALB/MBD)\", \" \")","v":"T1 (PZQ+ALB/MBD)"},"PZQ+ALB","November",null,34286,17143,58275,92561,null,18360,29112,47472," ",53.549553753718712,49.956241956241954,51.287259212843416]
[{"$f":"IF(COUNTRY_INFO!A13=0,\" \",COUNTRY_INFO!A13)","v":"Zanzibar"},{"$f":"IF(COUNTRY_INFO!B13=0,\" \",COUNTRY_INFO!B13)","v":"Kaskazini Unguja"},{"$f":"IF(COUNTRY_INFO!C13=0,\" \",COUNTRY_INFO!C13)","v":"Kaskazini A"},{"$f":"IF(OR(COUNTRY_INFO!$T$9:$T$1000=\"T1 (PZQ+ALB/MBD)\",COUNTRY_INFO!$U$9:$U$1000=\"T1 (PZQ+ALB/MBD)\"), \"T1 (PZQ+ALB/MBD)\", \" \")","v":"T1 (PZQ+ALB/MBD)"},"PZQ+ALB","November",null,35705,17852.5,60688,96393,null,25843,58396,84239," ",72.379218596835187,96.223306090166091,87.391200605853129]
[{"$f":"IF(COUNTRY_INFO!A14=0,\" \",COUNTRY_INFO!A14)","v":"Zanzibar"},{"$f":"IF(COUNTRY_INFO!B14=0,\" \",COUNTRY_INFO!B14)","v":"Kaskazini Unguja"},{"$f":"IF(COUNTRY_INFO!C14=0,\" \",COUNTRY_INFO!C14)","v":"Kaskazini B "},{"$f":"IF(OR(COUNTRY_INFO!$T$9:$T$1000=\"T1 (PZQ+ALB/MBD)\",COUNTRY_INFO!$U$9:$U$1000=\"T1 (PZQ+ALB/MBD)\"), \"T1 (PZQ+ALB/MBD)\", \" \")","v":"T1 (PZQ+ALB/MBD)"},"PZQ+ALB","November",null,35401,17700.5,60170,95571,null,18638,41920,60558," ",52.6482302759809,69.669270400531829,63.364409705873129]
[{"$f":"IF(COUNTRY_INFO!A15=0,\" \",COUNTRY_INFO!A15)","v":"Zanzibar"},{"$f":"IF(COUNTRY_INFO!B15=0,\" \",COUNTRY_INFO!B15)","v":"Kusini Unguja"},{"$f":"IF(COUNTRY_INFO!C15=0,\" \",COUNTRY_INFO!C15)","v":"Kati "},{"$f":"IF(OR(COUNTRY_INFO!$T$9:$T$1000=\"T1 (PZQ+ALB/MBD)\",COUNTRY_INFO!$U$9:$U$1000=\"T1 (PZQ+ALB/MBD)\"), \"T1 (PZQ+ALB/MBD)\", \" \")","v":"T1 (PZQ+ALB/MBD)"},"PZQ+ALB","November",null,24245,12122.5,41208,65453,null,24321,48624,72945," ",100.31346669416375,117.99650553290624,111.44638137289353]
[{"$f":"IF(COUNTRY_INFO!A16=0,\" \",COUNTRY_INFO!A16)","v":"Zanzibar"},{"$f":"IF(COUNTRY_INFO!B16=0,\" \",COUNTRY_INFO!B16)","v":"Kusini Unguja"},{"$f":"IF(COUNTRY_INFO!C16=0,\" \",COUNTRY_INFO!C16)","v":"Kusini "},{"$f":"IF(OR(COUNTRY_INFO!$T$9:$T$1000=\"T1 (PZQ+ALB/MBD)\",COUNTRY_INFO!$U$9:$U$1000=\"T1 (PZQ+ALB/MBD)\"), \"T1 (PZQ+ALB/MBD)\", \" \")","v":" "},null,null,null,null,null,null,0,null,null,null,0," "," "," "," "]
[{"$f":"IF(COUNTRY_INFO!A17=0,\" \",COUNTRY_INFO!A17)","v":"Zanzibar"},{"$f":"IF(COUNTRY_INFO!B17=0,\" \",COUNTRY_INFO!B17)","v":"Mjini Magharibi"},{"$f":"IF(COUNTRY_INFO!C17=0,\" \",COUNTRY_INFO!C17)","v":"Mjini "},{"$f":"IF(OR(COUNTRY_INFO!$T$9:$T$1000=\"T1 (PZQ+ALB/MBD)\",COUNTRY_INFO!$U$9:$U$1000=\"T1 (PZQ+ALB/MBD)\"), \"T1 (PZQ+ALB/MBD)\", \" \")","v":"T1 (PZQ+ALB/MBD)"},"PZQ+ALB","November",null,55778,27889,94806,150584,null,52285,116925,169210," ",93.737674351895024,123.3308018479843,112.36917600807523]
[{"$f":"IF(COUNTRY_INFO!A18=0,\" \",COUNTRY_INFO!A18)","v":"Zanzibar"},{"$f":"IF(COUNTRY_INFO!B18=0,\" \",COUNTRY_INFO!B18)","v":"Mjini Magharibi"},{"$f":"IF(COUNTRY_INFO!C18=0,\" \",COUNTRY_INFO!C18)","v":"Magharibi A "},{"$f":"IF(OR(COUNTRY_INFO!$T$9:$T$1000=\"T1 (PZQ+ALB/MBD)\",COUNTRY_INFO!$U$9:$U$1000=\"T1 (PZQ+ALB/MBD)\"), \"T1 (PZQ+ALB/MBD)\", \" \")","v":"T1 (PZQ+ALB/MBD)"},"PZQ+ALB","November",null,119319,59659.5,202805,322124,null,62289,118124,180413," ",52.20375631709954,58.245112299992606,56.007313953632767]

{"sheet":"T2","index":7,"n_rows":18,"n_cols":17,"rows_kept":18,"cut":false,"hidden":true,"merged":[[5,5,5,8],[5,9,5,12],[5,13,5,16],[3,0,3,2],[5,0,5,2],[5,3,6,3],[5,4,6,4]]}
["T 2 - Praziquantel (PZQ) "]
["Administrative structure, population requiring PC by age group, population treated by age group and coverage"]
[]
["TOTAL",null,null,null,null,{"$f":"SUM(F$9:F$1000)","v":0},0,0,0,0,0,0,0,{"$f":"IF(F4<>0, IF(J4/F4*100=0, \"-\", J4/F4*100), \" \")","v":" "},{"$f":"IF(G4<>0, IF(K4/G4*100=0, \"-\", K4/G4*100), \" \")","v":" "},{"$f":"IF(H4<>0, IF(L4/H4*100=0, \"-\", L4/H4*100), \" \")","v":" "},{"$f":"IF(I4<>0, IF(M4/I4*100=0, \"-\", M4/I4*100), \" \")","v":" "}]
[]
[null,null,null,"PC implemented","Date","Population targeted for T2",null,null,null,"Population treated",null,null,null,"Programme coverage (%)"]
["Country","Province/State","District",null,null,"PreSAC","SAC","Adults","Total","PreSAC","SAC","Adults","Total","PreSAC","SAC","Adults","Total"]
[]
[{"$f":"IF(COUNTRY_INFO!A9=0,\" \",COUNTRY_INFO!A9)","v":"Zanzibar"},{"$f":"IF(COUNTRY_INFO!B9=0,\" \",COUNTRY_INFO!B9)","v":"Kusini Pemba"},{"$f":"IF(COUNTRY_INFO!C9=0,\" \",COUNTRY_INFO!C9)","v":"Mkoani"},{"$f":"IF(COUNTRY_INFO!$U$9:$U$1000=\"T2 (PZQ)\", COUNTRY_INFO!$U$9:$U$1000, \" \")","v":" "},null,null,null,null,{"$f":"SUM(F9:H9)","v":0},null,null,null,{"$f":"SUM(J9:L9)","v":0},{"$f":"IF(F9<>0, IF(J9/F9*100=0, \"-\", J9/F9*100), \" \")","v":" "}," "," "," "]
[{"$f":"IF(COUNTRY_INFO!A10=0,\" \",COUNTRY_INFO!A10)","v":"Zanzibar"},{"$f":"IF(COUNTRY_INFO!B10=0,\" \",COUNTRY_INFO!B10)","v":"Kusini Pemba"},{"$f":"IF(COUNTRY_INFO!C10=0,\" \",COUNTRY_INFO!C10)","v":"Chake Chake"},{"$f":"IF(COUNTRY_INFO!$U$9:$U$1000=\"T2 (PZQ)\", COUNTRY_INFO!$U$9:$U$1000, \" \")","v":" "},null,null,null,null,{"$f":"SUM(F10:H10)","v":0},null,null,null,{"$f":"SUM(J10:L10)","v":0},{"$f":"IF(F10<>0, IF(J10/F10*100=0, \"-\", J10/F10*100), \" \")","v":" "},{"$f":"IF(G10<>0, IF(K10/G10*100=0, \"-\", K10/G10*100), \" \")","v":" "},{"$f":"IF(H10<>0, IF(L10/H10*100=0, \"-\", L10/H10*100), \" \")","v":" "},{"$f":"IF(I10<>0, IF(M10/I10*100=0, \"-\", M10/I10*100), \" \")","v":" "}]
[{"$f":"IF(COUNTRY_INFO!A11=0,\" \",COUNTRY_INFO!A11)","v":"Zanzibar"},{"$f":"IF(COUNTRY_INFO!B11=0,\" \",COUNTRY_INFO!B11)","v":"Kaskazini Pemba"},{"$f":"IF(COUNTRY_INFO!C11=0,\" \",COUNTRY_INFO!C11)","v":"Wete"},{"$f":"IF(COUNTRY_INFO!$U$9:$U$1000=\"T2 (PZQ)\", COUNTRY_INFO!$U$9:$U$1000, \" \")","v":" "},null,null,null,null,0,null,null,null,0," "," "," "," "]
[{"$f":"IF(COUNTRY_INFO!A12=0,\" \",COUNTRY_INFO!A12)","v":"Zanzibar"},{"$f":"IF(COUNTRY_INFO!B12=0,\" \",COUNTRY_INFO!B12)","v":"Kaskazini Pemba"},{"$f":"IF(COUNTRY_INFO!C12=0,\" \",COUNTRY_INFO!C12)","v":"Micheweni"},{"$f":"IF(COUNTRY_INFO!$U$9:$U$1000=\"T2 (PZQ)\", COUNTRY_INFO!$U$9:$U$1000, \" \")","v":" "},null,null,null,null,0,null,null,null,0," "," "," "," "]
[{"$f":"IF(COUNTRY_INFO!A13=0,\" \",COUNTRY_INFO!A13)","v":"Zanzibar"},{"$f":"IF(COUNTRY_INFO!B13=0,\" \",COUNTRY_INFO!B13)","v":"Kaskazini Unguja"},{"$f":"IF(COUNTRY_INFO!C13=0,\" \",COUNTRY_INFO!C13)","v":"Kaskazini A"},{"$f":"IF(COUNTRY_INFO!$U$9:$U$1000=\"T2 (PZQ)\", COUNTRY_INFO!$U$9:$U$1000, \" \")","v":" "},null,null,null,null,0,null,null,null,0," "," "," "," "]
[{"$f":"IF(COUNTRY_INFO!A14=0,\" \",COUNTRY_INFO!A14)","v":"Zanzibar"},{"$f":"IF(COUNTRY_INFO!B14=0,\" \",COUNTRY_INFO!B14)","v":"Kaskazini Unguja"},{"$f":"IF(COUNTRY_INFO!C14=0,\" \",COUNTRY_INFO!C14)","v":"Kaskazini B "},{"$f":"IF(COUNTRY_INFO!$U$9:$U$1000=\"T2 (PZQ)\", COUNTRY_INFO!$U$9:$U$1000, \" \")","v":" "},null,null,null,null,0,null,null,null,0," "," "," "," "]
[{"$f":"IF(COUNTRY_INFO!A15=0,\" \",COUNTRY_INFO!A15)","v":"Zanzibar"},{"$f":"IF(COUNTRY_INFO!B15=0,\" \",COUNTRY_INFO!B15)","v":"Kusini Unguja"},{"$f":"IF(COUNTRY_INFO!C15=0,\" \",COUNTRY_INFO!C15)","v":"Kati "},{"$f":"IF(COUNTRY_INFO!$U$9:$U$1000=\"T2 (PZQ)\", COUNTRY_INFO!$U$9:$U$1000, \" \")","v":" "},null,null,null,null,0,null,null,null,0," "," "," "," "]
[{"$f":"IF(COUNTRY_INFO!A16=0,\" \",COUNTRY_INFO!A16)","v":"Zanzibar"},{"$f":"IF(COUNTRY_INFO!B16=0,\" \",COUNTRY_INFO!B16)","v":"Kusini Unguja"},{"$f":"IF(COUNTRY_INFO!C16=0,\" \",COUNTRY_INFO!C16)","v":"Kusini "},{"$f":"IF(COUNTRY_INFO!$U$9:$U$1000=\"T2 (PZQ)\", COUNTRY_INFO!$U$9:$U$1000, \" \")","v":" "},null,null,null,null,0,null,null,null,0," "," "," "," "]
[{"$f":"IF(COUNTRY_INFO!A17=0,\" \",COUNTRY_INFO!A17)","v":"Zanzibar"},{"$f":"IF(COUNTRY_INFO!B17=0,\" \",COUNTRY_INFO!B17)","v":"Mjini Magharibi"},{"$f":"IF(COUNTRY_INFO!C17=0,\" \",COUNTRY_INFO!C17)","v":"Mjini "},{"$f":"IF(COUNTRY_INFO!$U$9:$U$1000=\"T2 (PZQ)\", COUNTRY_INFO!$U$9:$U$1000, \" \")","v":" "},null,null,null,null,0,null,null,null,0," "," "," "," "]
[{"$f":"IF(COUNTRY_INFO!A18=0,\" \",COUNTRY_INFO!A18)","v":"Zanzibar"},{"$f":"IF(COUNTRY_INFO!B18=0,\" \",COUNTRY_INFO!B18)","v":"Mjini Magharibi"},{"$f":"IF(COUNTRY_INFO!C18=0,\" \",COUNTRY_INFO!C18)","v":"Magharibi A "},{"$f":"IF(COUNTRY_INFO!$U$9:$U$1000=\"T2 (PZQ)\", COUNTRY_INFO!$U$9:$U$1000, \" \")","v":" "},null,null,null,null,0,null,null,null,0," "," "," "," "]

{"sheet":"T3_R1","index":8,"n_rows":18,"n_cols":18,"rows_kept":18,"cut":false,"hidden":false,"merged":[[5,6,5,9],[5,10,5,13],[5,14,5,17],[3,0,3,2],[5,0,5,2],[5,3,6,3],[5,5,6,5],[5,4,6,4]]}
["T 3 - Albendazole (ALB) or Mebendazole (MBD) - Round 1"]
["Administrative structure, population requiring PC by age group, population treated by age group and coverage"]
[]
["TOTAL",null,null,null,null,null,{"$f":"SUM(G$9:G$1000)","v":0},12315,20932,33247,0,9306,19208,28514,{"$f":"IF(G4<>0, IF(K4/G4*100=0, \"-\", K4/G4*100), \" \")","v":" "},{"$f":"IF(H4<>0, IF(L4/H4*100=0, \"-\", L4/H4*100), \" \")","v":75.566382460414133},{"$f":"IF(I4<>0, IF(M4/I4*100=0, \"-\", M4/I4*100), \" \")","v":91.76380661188611},{"$f":"IF(J4<>0, IF(N4/J4*100=0, \"-\", N4/J4*100), \" \")","v":85.764129094354374}]
[]
[null,null,null,"PC implemented","Medicine","Date","Population targeted for T3",null,null,null,"Population treated",null,null,null,"Programme coverage (%)"]
["Country","Province/State","District",null,null,null,"PreSAC","SAC","Adults","Total","PreSAC","SAC","Adults","Total","PreSAC","SAC","Adults","Total"]
[]
[{"$f":"IF(COUNTRY_INFO!A9=0,\" \",COUNTRY_INFO!A9)","v":"Zanzibar"},{"$f":"IF(COUNTRY_INFO!B9=0,\" \",COUNTRY_INFO!B9)","v":"Kusini Pemba"},{"$f":"IF(COUNTRY_INFO!C9=0,\" \",COUNTRY_INFO!C9)","v":"Mkoani"},{"$f":"IF(OR(COUNTRY_INFO!$T$9:$T$1000=\"T3 (ALB/MBD)\",COUNTRY_INFO!$U$9:$U$1000=\"T3 (ALB/MBD)\"), \"T3 (ALB/MBD)\", \" \")","v":" "},null,null,null,null,null,{"$f":"SUM(G9:I9)","v":0},null,null,null,{"$f":"SUM(K9:M9)","v":0},{"$f":"IF(G9<>0, IF(K9/G9*100=0, \"-\", K9/G9*100), \" \")","v":" "}," "," "," "]
[{"$f":"IF(COUNTRY_INFO!A10=0,\" \",COUNTRY_INFO!A10)","v":"Zanzibar"},{"$f":"IF(COUNTRY_INFO!B10=0,\" \",COUNTRY_INFO!B10)","v":"Kusini Pemba"},{"$f":"IF(COUNTRY_INFO!C10=0,\" \",COUNTRY_INFO!C10)","v":"Chake Chake"},{"$f":"IF(OR(COUNTRY_INFO!$T$9:$T$1000=\"T3 (ALB/MBD)\",COUNTRY_INFO!$U$9:$U$1000=\"T3 (ALB/MBD)\"), \"T3 (ALB/MBD)\", \" \")","v":" "},null,null,null,null,null,{"$f":"SUM(G10:I10)","v":0},null,null,null,{"$f":"SUM(K10:M10)","v":0},{"$f":"IF(G10<>0, IF(K10/G10*100=0, \"-\", K10/G10*100), \" \")","v":" "},{"$f":"IF(H10<>0, IF(L10/H10*100=0, \"-\", L10/H10*100), \" \")","v":" "},{"$f":"IF(I10<>0, IF(M10/I10*100=0, \"-\", M10/I10*100), \" \")","v":" "},{"$f":"IF(J10<>0, IF(N10/J10*100=0, \"-\", N10/J10*100), \" \")","v":" "}]
[{"$f":"IF(COUNTRY_INFO!A11=0,\" \",COUNTRY_INFO!A11)","v":"Zanzibar"},{"$f":"IF(COUNTRY_INFO!B11=0,\" \",COUNTRY_INFO!B11)","v":"Kaskazini Pemba"},{"$f":"IF(COUNTRY_INFO!C11=0,\" \",COUNTRY_INFO!C11)","v":"Wete"},{"$f":"IF(OR(COUNTRY_INFO!$T$9:$T$1000=\"T3 (ALB/MBD)\",COUNTRY_INFO!$U$9:$U$1000=\"T3 (ALB/MBD)\"), \"T3 (ALB/MBD)\", \" \")","v":" "},null,null,null,null,null,0,null,null,null,0," "," "," "," "]
[{"$f":"IF(COUNTRY_INFO!A12=0,\" \",COUNTRY_INFO!A12)","v":"Zanzibar"},{"$f":"IF(COUNTRY_INFO!B12=0,\" \",COUNTRY_INFO!B12)","v":"Kaskazini Pemba"},{"$f":"IF(COUNTRY_INFO!C12=0,\" \",COUNTRY_INFO!C12)","v":"Micheweni"},{"$f":"IF(OR(COUNTRY_INFO!$T$9:$T$1000=\"T3 (ALB/MBD)\",COUNTRY_INFO!$U$9:$U$1000=\"T3 (ALB/MBD)\"), \"T3 (ALB/MBD)\", \" \")","v":" "},null,null,null,null,null,0,null,null,null,0," "," "," "," "]
[{"$f":"IF(COUNTRY_INFO!A13=0,\" \",COUNTRY_INFO!A13)","v":"Zanzibar"},{"$f":"IF(COUNTRY_INFO!B13=0,\" \",COUNTRY_INFO!B13)","v":"Kaskazini Unguja"},{"$f":"IF(COUNTRY_INFO!C13=0,\" \",COUNTRY_INFO!C13)","v":"Kaskazini A"},{"$f":"IF(OR(COUNTRY_INFO!$T$9:$T$1000=\"T3 (ALB/MBD)\",COUNTRY_INFO!$U$9:$U$1000=\"T3 (ALB/MBD)\"), \"T3 (ALB/MBD)\", \" \")","v":" "},null,null,null,null,null,0,null,null,null,0," "," "," "," "]
[{"$f":"IF(COUNTRY_INFO!A14=0,\" \",COUNTRY_INFO!A14)","v":"Zanzibar"},{"$f":"IF(COUNTRY_INFO!B14=0,\" \",COUNTRY_INFO!B14)","v":"Kaskazini Unguja"},{"$f":"IF(COUNTRY_INFO!C14=0,\" \",COUNTRY_INFO!C14)","v":"Kaskazini B "},{"$f":"IF(OR(COUNTRY_INFO!$T$9:$T$1000=\"T3 (ALB/MBD)\",COUNTRY_INFO!$U$9:$U$1000=\"T3 (ALB/MBD)\"), \"T3 (ALB/MBD)\", \" \")","v":" "},null,null,null,null,null,0,null,null,null,0," "," "," "," "]
[{"$f":"IF(COUNTRY_INFO!A15=0,\" \",COUNTRY_INFO!A15)","v":"Zanzibar"},{"$f":"IF(COUNTRY_INFO!B15=0,\" \",COUNTRY_INFO!B15)","v":"Kusini Unguja"},{"$f":"IF(COUNTRY_INFO!C15=0,\" \",COUNTRY_INFO!C15)","v":"Kati "},{"$f":"IF(OR(COUNTRY_INFO!$T$9:$T$1000=\"T3 (ALB/MBD)\",COUNTRY_INFO!$U$9:$U$1000=\"T3 (ALB/MBD)\"), \"T3 (ALB/MBD)\", \" \")","v":" "},null,null,null,null,null,0,null,null,null,0," "," "," "," "]
[{"$f":"IF(COUNTRY_INFO!A16=0,\" \",COUNTRY_INFO!A16)","v":"Zanzibar"},{"$f":"IF(COUNTRY_INFO!B16=0,\" \",COUNTRY_INFO!B16)","v":"Kusini Unguja"},{"$f":"IF(COUNTRY_INFO!C16=0,\" \",COUNTRY_INFO!C16)","v":"Kusini "},{"$f":"IF(OR(COUNTRY_INFO!$T$9:$T$1000=\"T3 (ALB/MBD)\",COUNTRY_INFO!$U$9:$U$1000=\"T3 (ALB/MBD)\"), \"T3 (ALB/MBD)\", \" \")","v":"T3 (ALB/MBD)"},"ALB","March",null,12315,20932,33247,null,9306,19208,28514," ",75.566382460414133,91.76380661188611,85.764129094354374]
[{"$f":"IF(COUNTRY_INFO!A17=0,\" \",COUNTRY_INFO!A17)","v":"Zanzibar"},{"$f":"IF(COUNTRY_INFO!B17=0,\" \",COUNTRY_INFO!B17)","v":"Mjini Magharibi"},{"$f":"IF(COUNTRY_INFO!C17=0,\" \",COUNTRY_INFO!C17)","v":"Mjini "},{"$f":"IF(OR(COUNTRY_INFO!$T$9:$T$1000=\"T3 (ALB/MBD)\",COUNTRY_INFO!$U$9:$U$1000=\"T3 (ALB/MBD)\"), \"T3 (ALB/MBD)\", \" \")","v":" "},null,null,null,null,null,0,null,null,null,0," "," "," "," "]
[{"$f":"IF(COUNTRY_INFO!A18=0,\" \",COUNTRY_INFO!A18)","v":"Zanzibar"},{"$f":"IF(COUNTRY_INFO!B18=0,\" \",COUNTRY_INFO!B18)","v":"Mjini Magharibi"},{"$f":"IF(COUNTRY_INFO!C18=0,\" \",COUNTRY_INFO!C18)","v":"Magharibi A "},{"$f":"IF(OR(COUNTRY_INFO!$T$9:$T$1000=\"T3 (ALB/MBD)\",COUNTRY_INFO!$U$9:$U$1000=\"T3 (ALB/MBD)\"), \"T3 (ALB/MBD)\", \" \")","v":" "},null,null,null,null,null,0,null,null,null,0," "," "," "," "]

{"sheet":"T3_R2","index":9,"n_rows":18,"n_cols":18,"rows_kept":18,"cut":false,"hidden":false,"merged":[[5,6,5,9],[5,10,5,13],[5,14,5,17],[3,0,3,2],[5,0,5,2],[5,3,6,3],[5,5,6,5],[5,4,6,4]]}
["T 3 - Albendazole (ALB) or Mebendazole (MBD) - Round 2"]
["Administrative structure, population requiring PC by age group, population treated by age group and coverage"]
[]
["TOTAL",null,null,null,null,null,{"$f":"SUM(G$9:G$1000)","v":0},12315,20932,33247,0,9325,22783,32108,{"$f":"IF(G4<>0, IF(K4/G4*100=0, \"-\", K4/G4*100), \" \")","v":" "},{"$f":"IF(H4<>0, IF(L4/H4*100=0, \"-\", L4/H4*100), \" \")","v":75.7206658546488},{"$f":"IF(I4<>0, IF(M4/I4*100=0, \"-\", M4/I4*100), \" \")","v":108.84291993120581},{"$f":"IF(J4<>0, IF(N4/J4*100=0, \"-\", N4/J4*100), \" \")","v":96.574126988901256}]
[]
[null,null,null,"PC implemented","Medicine","Date","Population targeted for T3",null,null,null,"Population treated",null,null,null,"Programme coverage (%)"]
["Country","Province/State","District",null,null,null,"PreSAC","SAC","Adults","Total","PreSAC","SAC","Adults","Total","PreSAC","SAC","Adults","Total"]
[]
[{"$f":"IF(COUNTRY_INFO!A9=0,\" \",COUNTRY_INFO!A9)","v":"Zanzibar"},{"$f":"IF(COUNTRY_INFO!B9=0,\" \",COUNTRY_INFO!B9)","v":"Kusini Pemba"},{"$f":"IF(COUNTRY_INFO!C9=0,\" \",COUNTRY_INFO!C9)","v":"Mkoani"},{"$f":"IF(AND(COUNTRY_INFO!$T$9:$T$1000=\"T3 (ALB/MBD)\",COUNTRY_INFO!$U$9:$U$1000=\"T3 (ALB/MBD)\"), \"T3 (ALB/MBD)\", \" \")","v":" "},null,null,null,null,null,{"$f":"SUM(G9:I9)","v":0},null,null,null,{"$f":"SUM(K9:M9)","v":0},{"$f":"IF(G9<>0, IF(K9/G9*100=0, \"-\", K9/G9*100), \" \")","v":" "}," "," "," "]
[{"$f":"IF(COUNTRY_INFO!A10=0,\" \",COUNTRY_INFO!A10)","v":"Zanzibar"},{"$f":"IF(COUNTRY_INFO!B10=0,\" \",COUNTRY_INFO!B10)","v":"Kusini Pemba"},{"$f":"IF(COUNTRY_INFO!C10=0,\" \",COUNTRY_INFO!C10)","v":"Chake Chake"},{"$f":"IF(AND(COUNTRY_INFO!$T$9:$T$1000=\"T3 (ALB/MBD)\",COUNTRY_INFO!$U$9:$U$1000=\"T3 (ALB/MBD)\"), \"T3 (ALB/MBD)\", \" \")","v":" "},null,null,null,null,null,{"$f":"SUM(G10:I10)","v":0},null,null,null,{"$f":"SUM(K10:M10)","v":0},{"$f":"IF(G10<>0, IF(K10/G10*100=0, \"-\", K10/G10*100), \" \")","v":" "},{"$f":"IF(H10<>0, IF(L10/H10*100=0, \"-\", L10/H10*100), \" \")","v":" "},{"$f":"IF(I10<>0, IF(M10/I10*100=0, \"-\", M10/I10*100), \" \")","v":" "},{"$f":"IF(J10<>0, IF(N10/J10*100=0, \"-\", N10/J10*100), \" \")","v":" "}]
[{"$f":"IF(COUNTRY_INFO!A11=0,\" \",COUNTRY_INFO!A11)","v":"Zanzibar"},{"$f":"IF(COUNTRY_INFO!B11=0,\" \",COUNTRY_INFO!B11)","v":"Kaskazini Pemba"},{"$f":"IF(COUNTRY_INFO!C11=0,\" \",COUNTRY_INFO!C11)","v":"Wete"},{"$f":"IF(AND(COUNTRY_INFO!$T$9:$T$1000=\"T3 (ALB/MBD)\",COUNTRY_INFO!$U$9:$U$1000=\"T3 (ALB/MBD)\"), \"T3 (ALB/MBD)\", \" \")","v":" "},null,null,null,null,null,0,null,null,null,0," "," "," "," "]
[{"$f":"IF(COUNTRY_INFO!A12=0,\" \",COUNTRY_INFO!A12)","v":"Zanzibar"},{"$f":"IF(COUNTRY_INFO!B12=0,\" \",COUNTRY_INFO!B12)","v":"Kaskazini Pemba"},{"$f":"IF(COUNTRY_INFO!C12=0,\" \",COUNTRY_INFO!C12)","v":"Micheweni"},{"$f":"IF(AND(COUNTRY_INFO!$T$9:$T$1000=\"T3 (ALB/MBD)\",COUNTRY_INFO!$U$9:$U$1000=\"T3 (ALB/MBD)\"), \"T3 (ALB/MBD)\", \" \")","v":" "},null,null,null,null,null,0,null,null,null,0," "," "," "," "]
[{"$f":"IF(COUNTRY_INFO!A13=0,\" \",COUNTRY_INFO!A13)","v":"Zanzibar"},{"$f":"IF(COUNTRY_INFO!B13=0,\" \",COUNTRY_INFO!B13)","v":"Kaskazini Unguja"},{"$f":"IF(COUNTRY_INFO!C13=0,\" \",COUNTRY_INFO!C13)","v":"Kaskazini A"},{"$f":"IF(AND(COUNTRY_INFO!$T$9:$T$1000=\"T3 (ALB/MBD)\",COUNTRY_INFO!$U$9:$U$1000=\"T3 (ALB/MBD)\"), \"T3 (ALB/MBD)\", \" \")","v":" "},null,null,null,null,null,0,null,null,null,0," "," "," "," "]
[{"$f":"IF(COUNTRY_INFO!A14=0,\" \",COUNTRY_INFO!A14)","v":"Zanzibar"},{"$f":"IF(COUNTRY_INFO!B14=0,\" \",COUNTRY_INFO!B14)","v":"Kaskazini Unguja"},{"$f":"IF(COUNTRY_INFO!C14=0,\" \",COUNTRY_INFO!C14)","v":"Kaskazini B "},{"$f":"IF(AND(COUNTRY_INFO!$T$9:$T$1000=\"T3 (ALB/MBD)\",COUNTRY_INFO!$U$9:$U$1000=\"T3 (ALB/MBD)\"), \"T3 (ALB/MBD)\", \" \")","v":" "},null,null,null,null,null,0,null,null,null,0," "," "," "," "]
[{"$f":"IF(COUNTRY_INFO!A15=0,\" \",COUNTRY_INFO!A15)","v":"Zanzibar"},{"$f":"IF(COUNTRY_INFO!B15=0,\" \",COUNTRY_INFO!B15)","v":"Kusini Unguja"},{"$f":"IF(COUNTRY_INFO!C15=0,\" \",COUNTRY_INFO!C15)","v":"Kati "},{"$f":"IF(AND(COUNTRY_INFO!$T$9:$T$1000=\"T3 (ALB/MBD)\",COUNTRY_INFO!$U$9:$U$1000=\"T3 (ALB/MBD)\"), \"T3 (ALB/MBD)\", \" \")","v":" "},null,null,null,null,null,0,null,null,null,0," "," "," "," "]
[{"$f":"IF(COUNTRY_INFO!A16=0,\" \",COUNTRY_INFO!A16)","v":"Zanzibar"},{"$f":"IF(COUNTRY_INFO!B16=0,\" \",COUNTRY_INFO!B16)","v":"Kusini Unguja"},{"$f":"IF(COUNTRY_INFO!C16=0,\" \",COUNTRY_INFO!C16)","v":"Kusini "},{"$f":"IF(AND(COUNTRY_INFO!$T$9:$T$1000=\"T3 (ALB/MBD)\",COUNTRY_INFO!$U$9:$U$1000=\"T3 (ALB/MBD)\"), \"T3 (ALB/MBD)\", \" \")","v":"T3 (ALB/MBD)"},"ALB","November",null,12315,20932,33247,null,9325,22783,32108," ",75.7206658546488,108.84291993120581,96.574126988901256]
[{"$f":"IF(COUNTRY_INFO!A17=0,\" \",COUNTRY_INFO!A17)","v":"Zanzibar"},{"$f":"IF(COUNTRY_INFO!B17=0,\" \",COUNTRY_INFO!B17)","v":"Mjini Magharibi"},{"$f":"IF(COUNTRY_INFO!C17=0,\" \",COUNTRY_INFO!C17)","v":"Mjini "},{"$f":"IF(AND(COUNTRY_INFO!$T$9:$T$1000=\"T3 (ALB/MBD)\",COUNTRY_INFO!$U$9:$U$1000=\"T3 (ALB/MBD)\"), \"T3 (ALB/MBD)\", \" \")","v":" "},null,null,null,null,null,0,null,null,null,0," "," "," "," "]
[{"$f":"IF(COUNTRY_INFO!A18=0,\" \",COUNTRY_INFO!A18)","v":"Zanzibar"},{"$f":"IF(COUNTRY_INFO!B18=0,\" \",COUNTRY_INFO!B18)","v":"Mjini Magharibi"},{"$f":"IF(COUNTRY_INFO!C18=0,\" \",COUNTRY_INFO!C18)","v":"Magharibi A "},{"$f":"IF(AND(COUNTRY_INFO!$T$9:$T$1000=\"T3 (ALB/MBD)\",COUNTRY_INFO!$U$9:$U$1000=\"T3 (ALB/MBD)\"), \"T3 (ALB/MBD)\", \" \")","v":" "},null,null,null,null,null,0,null,null,null,0," "," "," "," "]

{"sheet":"DISTRICT","index":10,"n_rows":18,"n_cols":56,"rows_kept":18,"cut":false,"hidden":false,"merged":[[5,26,5,34],[5,3,6,3],[5,9,6,9],[5,15,6,15],[5,25,6,25],[3,0,3,2],[5,0,5,2],[5,4,5,8],[5,10,5,14],[5,16,5,24]]}
["Number of individuals treated"]
["Administrative structure, population treated by age group and gender"]
[]
["TOTAL",null,null,{"$f":"SUM(D$9:D$1000)","v":1313658.3999999985},{"$f":"SUM(E$9:E$1000)","v":0},{"$f":"SUM(F$9:F$1000)","v":0},{"$f":"SUM(G$9:G$1000)","v":928008},{"$f":"SUM(H$9:H$1000)","v":928008},{"$f":"IF(D4>0, IF(H4/D4*100<>0, H4/D4*100, \"-\"),0)","v":70.643022569642227},{"$f":"SUM(J$9:J$1000)","v":0},{"$f":"SUM(K$9:K$1000)","v":0},{"$f":"SUM(L$9:L$1000)","v":0},{"$f":"SUM(M$9:M$1000)","v":928008},{"$f":"SUM(N$9:N$1000)","v":0},{"$f":"IF(J4>0, IF(N4/J4*100<>0, N4/J4*100, \"-\"),0)","v":0},{"$f":"SUM(P$9:P$1000)","v":592462},{"$f":"SUM(Q$9:Q$1000)","v":0},{"$f":"SUM(R$9:R$1000)","v":0},{"$f":"SUM(S$9:S$1000)","v":974702},{"$f":"SUM(T$9:T$1000)","v":0},null,329351,null,{"$f":"SUM(X$9:X$1000)","v":329351},{"$f":"IF(P4>0, IF(X4/P4*100<>0, X4/P4*100, \"-\"),0)","v":55.590231947365396},{"$f":"SUM(Z$9:Z$1000)","v":208864.46999999997},0,0,844760,143147.57,null,48600.4,null,191747.96999999997,{"$f":"IF(Z4>0, IF(AH4/Z4*100<>0, AH4/Z4*100, \"-\"),0)","v":91.804972861109405}]
[]
[null,null,null,"Population requiring PC for LF","Population treated for lymphatic filariasis",null,null,null,null,"Population requiring PC for ONCHO","Population treated for onchocerciasis",null,null,null,null,"Population requiring PC for STH","Population treated for STH",null,null,null,null,null,null,null,null,"Population requiring PC for SCH","Population treated for schistosomiasis",null,null,null,null,null,null,null,null,null,null,null,null,null,null,{"$f":"SUM(AP9:AP1000)","v":0},168149,424312.99999999994,721197.99999999988,{"$f":"SUM(AT9:AT1000)","v":1313660},{"$f":"COUNTIF(AU9:AU1000,\"Y\")","v":10},{"$f":"SUM(AV9:AV1000)","v":0},337850,636852,{"$f":"SUM(AY9:AY1000)","v":974702},0,334463,606158,940621,{"$f":"IF(AT6<>0,BC6/AT6,0)","v":0.7160307842211836}]
["Country","Province/State","District",null,"Male","Female","Total treated","Total in need treated","(%)",null,"Male","Female","Total treated","Total in need treated","(%)",null,"Male","Female","Total treated","PreSAC in need treated ","PreSAC (%)","SAC in need treated","SAC (%)","Total in need treated ","(%)",null,"Male","Female","Total treated","SAC in need treated","SAC (%)","Adults in need treated","Adults (%)","Total in need treated ","(%)",null,"LF","ONCHO","STH","SCH-SAC","SCH_Adults","<1","PreSAC","SAC","Adults","Total","Dis","PreSAC","SAC","Adults","Total","PreSAC","SAC","Adults","Total","Coverage"]
[]
[{"$f":"IF(COUNTRY_INFO!A9=0,\" \",COUNTRY_INFO!A9)","v":"Zanzibar"},{"$f":"IF(COUNTRY_INFO!B9=0,\" \",COUNTRY_INFO!B9)","v":"Kusini Pemba"},{"$f":"IF(COUNTRY_INFO!C9=0,\" \",COUNTRY_INFO!C9)","v":"Mkoani"},{"$f":"COUNTRY_INFO!L9","v":152982.13333333301},null,null,{"$f":"MAX('MDA1'!M9,'MDA2'!M9)","v":87916},{"$f":"IF(AND(COUNTRY_INFO!H9>0,COUNTRY_INFO!H9<4),IF(D9>MAX('MDA1'!M9,'MDA2'!M9),MAX('MDA1'!M9,'MDA2'!M9),D9),0)","v":87916},{"$f":"IF(AND(COUNTRY_INFO!H9>0,COUNTRY_INFO!H9<4), IF(G9/D9*100<>0, IF(G9/D9*100>100,100,G9/D9*100), \"-\"),0)","v":57.468148786002146},{"$f":"COUNTRY_INFO!M9","v":"Not required"},null,null,{"$f":"MAX('MDA1'!M9,MAX('MDA3'!I9,'MDA3'!L9)+MAX('MDA3'!J9,'MDA3'!M9))","v":87916},{"$f":"IF(AND(COUNTRY_INFO!I9>0,COUNTRY_INFO!I9<4),IF(J9>MAX('MDA1'!M9,MAX('MDA3'!I9,'MDA3'!L9)+MAX('MDA3'!J9,'MDA3'!M9)),MAX('MDA1'!M9,MAX('MDA3'!I9,'MDA3'!L9)+MAX('MDA3'!J9,'MDA3'!M9)),J9),0)","v":0},{"$f":"IF(AND(COUNTRY_INFO!I9>0,COUNTRY_INFO!I9<4), IF(M9/J9*100<>0, IF(M9/J9*100>100,100,M9/J9*100), \"-\"),0)","v":0},{"$f":"COUNTRY_INFO!N9","v":68995},null,null,{"$f":"SUM(MAX('MDA2'!J9, T1_R1!L9, MAX(T3_R1!K9, T3_R2!K9)), MAX('MDA1'!K9, 'MDA2'!K9, T1_R1!M9, MAX(T3_R1!L9, T3_R2!L9)), MAX('MDA1'!L9, 'MDA2'!L9, T1_R1!N9, MAX(T3_R1!M9, T3_R2!M9)))","v":87916},{"$f":"IF(AND(COUNTRY_INFO!J9>1,COUNTRY_INFO!J9<4),IF(COUNTRY_INFO!E9>MAX('MDA2'!J9,T1_R1!L9,MAX(T3_R1!K9,T3_R2!K9)),MAX('MDA2'!J9,T1_R1!L9,MAX(T3_R1!K9,T3_R2!K9)),COUNTRY_INFO!E9),0)","v":0},{"$f":"IF(AND(COUNTRY_INFO!J9>1,COUNTRY_INFO!J9<4), IF(T9/COUNTRY_INFO!E9*100<>0, IF(T9/COUNTRY_INFO!E9*100>100,100,T9/COUNTRY_INFO!E9*100), \"-\"),0)","v":"-"},{"$f":"IF(AND(COUNTRY_INFO!J9>1,COUNTRY_INFO!J9<4),IF(COUNTRY_INFO!F9>MAX('MDA1'!K9,'MDA2'!K9,T1_R1!M9,MAX(T3_R1!L9,T3_R2!L9)),MAX('MDA1'!K9,'MDA2'!K9,T1_R1!M9,MAX(T3_R1!L9,T3_R2!L9)),COUNTRY_INFO!F9),0)","v":33075},{"$f":"IF(AND(COUNTRY_INFO!J9>1,COUNTRY_INFO!J9<4), IF(V9/COUNTRY_INFO!F9*100<>0, IF(V9/COUNTRY_INFO!F9*100>100,100,V9/COUNTRY_INFO!F9*100), \"-\"),0)","v":66.935826604334892},{"$f":"SUM(T9,V9)","v":33075},{"$f":"IF(AND(COUNTRY_INFO!J9>1,COUNTRY_INFO!J9<4), IF(S9/P9*100<>0, IF(X9/P9*100>100,100,X9/P9*100), \"-\"),0)","v":47.938256395390972},{"$f":"COUNTRY_INFO!O9","v":41503.9},null,null,{"$f":"MAX(SUM(T1_R1!L9:'T1_R1'!N9),SUM(T1_R2!L9:'T1_R2'!N9))","v":60916},{"$f":"IF(COUNTRY_INFO!K9=1,IF(COUNTRY_INFO!F9*0.33>MAX(T1_R1!M9,T1_R2!M9),MAX(T1_R1!M9,T1_R2!M9),COUNTRY_INFO!F9*0.33),IF(COUNTRY_INFO!K9=2,IF(COUNTRY_INFO!F9*0.5>MAX(T1_R1!M9,T1_R2!M9),MAX(T1_R1!M9,T1_R2!M9),COUNTRY_INFO!F9*0.5),IF(COUNTRY_INFO!K9=3,IF(COUNTRY_INFO!F9>MAX(T1_R1!M9,T1_R2!M9),MAX(T1_R1!M9,T1_R2!M9),COUNTRY_INFO!F9),0)))","v":7590},{"$f":"IF(AND(COUNTRY_INFO!K9>0,COUNTRY_INFO!K9<4),IF(Z9>0,IF(COUNTRY_INFO!K9=1, AD9/(COUNTRY_INFO!F9*0.33)*100, IF(COUNTRY_INFO!K9=2, AD9/(COUNTRY_INFO!F9*0.5)*100, IF(COUNTRY_INFO!K9=3, AD9/COUNTRY_INFO!F9*100))),\"-\"),0)","v":30.720660554914698},{"$f":"IF(COUNTRY_INFO!K9=2,IF(COUNTRY_INFO!G9*0.2>MAX(T1_R1!N9,T1_R2!N9),MAX(T1_R1!N9,T1_R2!N9),COUNTRY_INFO!G9*0.2),IF(COUNTRY_INFO!K9=3,IF(COUNTRY_INFO!G9>MAX(T1_R1!N9,T1_R2!N9),MAX(T1_R1!N9,T1_R2!N9),COUNTRY_INFO!G9),0))","v":16797.400000000001},{"$f":"IF(AND(COUNTRY_INFO!K9>0,COUNTRY_INFO!K9<4),IF(Z9>0,IF(COUNTRY_INFO!K9=1, 0, IF(COUNTRY_INFO!K9=2, AF9/(COUNTRY_INFO!G9*0.2)*100, IF(COUNTRY_INFO!K9=3, AF9/COUNTRY_INFO!G9*100))),\"-\"),0)","v":100},{"$f":"SUM(AD9,AF9)","v":24387.4},{"$f":"IF(AND(COUNTRY_INFO!K9>0,COUNTRY_INFO!K9<4), IF(AC9/Z9*100<>0, IF(AH9/Z9*100>100,100,AH9/Z9*100), \"-\"),0)","v":58.759297319047135},null,{"$f":"IF(AND(D9<>0, D9<>\"Unknown\",D9<>\"Stopped\",D9<>\"Not required\"),D9/COUNTRY_INFO!D9, 0)","v":1},{"$f":"IF(AND(J9<>0,J9<>\"Unknown\",J9<>\"Stopped\",J9<>\"Not required\"),J9/COUNTRY_INFO!D9, 0)","v":0},{"$f":"IF(AND(P9<>0,P9<>\"Unknown\",P9<>\"Not required\"),P9/(COUNTRY_INFO!E9+COUNTRY_INFO!F9), 0)","v":1},{"$f":"IF(AND(Z9<>0,Z9<>\"Unknown\",Z9<>\"Not required\"),IF(COUNTRY_INFO!K9=1,1,IF(COUNTRY_INFO!K9=2,0.5*COUNTRY_INFO!F9/(0.5*COUNTRY_INFO!F9+0.2*COUNTRY_INFO!G9),IF(COUNTRY_INFO!K9=3,COUNTRY_INFO!F9/(COUNTRY_INFO!F9+COUNTRY_INFO!G9)))),0)","v":0.59528140728943546},{"$f":"IF(AND(Z9<>0,Z9<>\"Unknown\",Z9<>\"Not required\"),IF(COUNTRY_INFO!K9=1,0,IF(COUNTRY_INFO!K9=2,0.2*COUNTRY_INFO!G9/(0.5*COUNTRY_INFO!F9+0.2*COUNTRY_INFO!G9),IF(COUNTRY_INFO!K9=3,COUNTRY_INFO!G9/(COUNTRY_INFO!F9+COUNTRY_INFO!G9)))),0)","v":0.4047185927105646},{"$f":"MAX(COUNTRY_INFO!D9*AK9*PROFILE!$G$7,COUNTRY_INFO!D9*AL9*PROFILE!$G$7)","v":0},{"$f":"MAX(COUNTRY_INFO!D9*AK9*PROFILE!$G$8,COUNTRY_INFO!D9*AL9*PROFILE!$G$8,COUNTRY_INFO!D9*AM9*PROFILE!$G$8)","v":19581.797473275125},{"$f":"MAX(COUNTRY_INFO!D9*AK9*PROFILE!$G$9,COUNTRY_INFO!D9*AL9*PROFILE!$G$9,COUNTRY_INFO!D9*AM9*PROFILE!$G$9,IF(AND(DISTRICT!Z9<>\"Unknown\",Z9<>\"Not required\"),COUNTRY_INFO!O9*DISTRICT!AN9,0))","v":49413.384743755756},{"$f":"MAX(COUNTRY_INFO!D9*AK9*PROFILE!$G$10,COUNTRY_INFO!D9*AL9*PROFILE!$G$10,IF(AND(DISTRICT!Z9<>\"Unknown\",Z9<>\"Not required\"),COUNTRY_INFO!O9*DISTRICT!AO9,0))","v":83987.13744435634},{"$f":"SUM(AP9:AS9)","v":152982.31966138721},{"$f":"IF(COUNTIFS(AK9:AN9,\">0\")=0,0, IF(COUNTIFS(AK9:AN9,\">0\")<=IF(AND(OR(D9>=0,D9=\"Not required\",D9=\"Unknown\",D9=\"Stopped\"),D9>0,H9>0),1,0)+IF(AND(OR(J9>=0,J9=\"Not required\",J9=\"Unknown\",J9=\"Stopped\"),J9>0,N9>0),1,0)+IF(AND(OR(P9>=0,P9=\"Not required\",P9=\"Unknown\"),P9>0,X9>0),1,0)+IF(AND(OR(Z9>=0,Z9=\"Not required\",Z9=\"Unknown\"),Z9>0,AH9>0),1,0),\"Y\",0))","v":"Y"},{"$f":"MAX('MDA2'!J9,T1_R1!L9,'T2'!J9,T3_R1!K9,T3_R2!K9)","v":0},{"$f":"MAX('MDA1'!K9,'MDA2'!K9,'MDA3'!I9,'MDA3'!L9,T1_R1!M9,'T2'!K9,T3_R1!L9,T3_R2!L9)","v":33075},{"$f":"MAX('MDA1'!L9,'MDA2'!L9,'MDA3'!J9,'MDA3'!M9,T1_R1!N9,'T2'!L9,T3_R1!M9,T3_R2!M9)","v":54841},{"$f":"SUM(AV9:AX9)","v":87916},{"$f":"MAX('MDA2'!J9,T9)","v":0},{"$f":"MAX('MDA1'!K9,'MDA2'!K9,'MDA3'!I9,'MDA3'!L9,V9,AD9)","v":33075},{"$f":"MAX('MDA1'!L9,'MDA2'!L9,'MDA3'!J9,'MDA3'!M9,AF9)","v":54841},{"$f":"IF(AT9<SUM(AZ9:BB9), AT9,SUM(AZ9:BB9))","v":87916},{"$f":"IF(AT9<>0,BC9/AT9*100,0)","v":57.468078791453983}]
[{"$f":"IF(COUNTRY_INFO!A10=0,\" \",COUNTRY_INFO!A10)","v":"Zanzibar"},{"$f":"IF(COUNTRY_INFO!B10=0,\" \",COUNTRY_INFO!B10)","v":"Kusini Pemba"},{"$f":"IF(COUNTRY_INFO!C10=0,\" \",COUNTRY_INFO!C10)","v":"Chake Chake"},{"$f":"COUNTRY_INFO!L10","v":106918.33333333299},null,null,{"$f":"MAX('MDA1'!M10,'MDA2'!M10)","v":78291},{"$f":"IF(AND(COUNTRY_INFO!H10>0,COUNTRY_INFO!H10<4),IF(D10>MAX('MDA1'!M10,'MDA2'!M10),MAX('MDA1'!M10,'MDA2'!M10),D10),0)","v":78291},{"$f":"IF(AND(COUNTRY_INFO!H10>0,COUNTRY_INFO!H10<4), IF(G10/D10*100<>0, IF(G10/D10*100>100,100,G10/D10*100), \"-\"),0)","v":73.225047154370387},{"$f":"COUNTRY_INFO!M10","v":"Not required"},null,null,{"$f":"MAX('MDA1'!M10,MAX('MDA3'!I10,'MDA3'!L10)+MAX('MDA3'!J10,'MDA3'!M10))","v":78291},{"$f":"IF(AND(COUNTRY_INFO!I10>0,COUNTRY_INFO!I10<4),IF(J10>MAX('MDA1'!M10,MAX('MDA3'!I10,'MDA3'!L10)+MAX('MDA3'!J10,'MDA3'!M10)),MAX('MDA1'!M10,MAX('MDA3'!I10,'MDA3'!L10)+MAX('MDA3'!J10,'MDA3'!M10)),J10),0)","v":0},{"$f":"IF(AND(COUNTRY_INFO!I10>0,COUNTRY_INFO!I10<4), IF(M10/J10*100<>0, IF(M10/J10*100>100,100,M10/J10*100), \"-\"),0)","v":0},{"$f":"COUNTRY_INFO!N10","v":48221},null,null,{"$f":"SUM(MAX('MDA2'!J10, T1_R1!L10, MAX(T3_R1!K10, T3_R2!K10)), MAX('MDA1'!K10, 'MDA2'!K10, T1_R1!M10, MAX(T3_R1!L10, T3_R2!L10)), MAX('MDA1'!L10, 'MDA2'!L10, T1_R1!N10, MAX(T3_R1!M10, T3_R2!M10)))","v":78291},{"$f":"IF(AND(COUNTRY_INFO!J10>1,COUNTRY_INFO!J10<4),IF(COUNTRY_INFO!E10>MAX('MDA2'!J10,T1_R1!L10,MAX(T3_R1!K10,T3_R2!K10)),MAX('MDA2'!J10,T1_R1!L10,MAX(T3_R1!K10,T3_R2!K10)),COUNTRY_INFO!E10),0)","v":0},{"$f":"IF(AND(COUNTRY_INFO!J10>1,COUNTRY_INFO!J10<4), IF(T10/COUNTRY_INFO!E10*100<>0, IF(T10/COUNTRY_INFO!E10*100>100,100,T10/COUNTRY_INFO!E10*100), \"-\"),0)","v":"-"},{"$f":"IF(AND(COUNTRY_INFO!J10>1,COUNTRY_INFO!J10<4),IF(COUNTRY_INFO!F10>MAX('MDA1'!K10,'MDA2'!K10,T1_R1!M10,MAX(T3_R1!L10,T3_R2!L10)),MAX('MDA1'!K10,'MDA2'!K10,T1_R1!M10,MAX(T3_R1!L10,T3_R2!L10)),COUNTRY_INFO!F10),0)","v":28331},{"$f":"IF(AND(COUNTRY_INFO!J10>1,COUNTRY_INFO!J10<4), IF(V10/COUNTRY_INFO!F10*100<>0, IF(V10/COUNTRY_INFO!F10*100>100,100,V10/COUNTRY_INFO!F10*100), \"-\"),0)","v":82.035616041696827},{"$f":"SUM(T10,V10)","v":28331},{"$f":"IF(AND(COUNTRY_INFO!J10>1,COUNTRY_INFO!J10<4), IF(S10/P10*100<>0, IF(X10/P10*100>100,100,X10/P10*100), \"-\"),0)","v":58.75241077538832},{"$f":"COUNTRY_INFO!O10","v":29007.1},null,null,{"$f":"MAX(SUM(T1_R1!L10:'T1_R1'!N10),SUM(T1_R2!L10:'T1_R2'!N10))","v":57552},{"$f":"IF(COUNTRY_INFO!K10=1,IF(COUNTRY_INFO!F10*0.33>MAX(T1_R1!M10,T1_R2!M10),MAX(T1_R1!M10,T1_R2!M10),COUNTRY_INFO!F10*0.33),IF(COUNTRY_INFO!K10=2,IF(COUNTRY_INFO!F10*0.5>MAX(T1_R1!M10,T1_R2!M10),MAX(T1_R1!M10,T1_R2!M10),COUNTRY_INFO!F10*0.5),IF(COUNTRY_INFO!K10=3,IF(COUNTRY_INFO!F10>MAX(T1_R1!M10,T1_R2!M10),MAX(T1_R1!M10,T1_R2!M10),COUNTRY_INFO!F10),0)))","v":17267.5},{"$f":"IF(AND(COUNTRY_INFO!K10>0,COUNTRY_INFO!K10<4),IF(Z10>0,IF(COUNTRY_INFO!K10=1, AD10/(COUNTRY_INFO!F10*0.33)*100, IF(COUNTRY_INFO!K10=2, AD10/(COUNTRY_INFO!F10*0.5)*100, IF(COUNTRY_INFO!K10=3, AD10/COUNTRY_INFO!F10*100))),\"-\"),0)","v":100},{"$f":"IF(COUNTRY_INFO!K10=2,IF(COUNTRY_INFO!G10*0.2>MAX(T1_R1!N10,T1_R2!N10),MAX(T1_R1!N10,T1_R2!N10),COUNTRY_INFO!G10*0.2),IF(COUNTRY_INFO!K10=3,IF(COUNTRY_INFO!G10>MAX(T1_R1!N10,T1_R2!N10),MAX(T1_R1!N10,T1_R2!N10),COUNTRY_INFO!G10),0))","v":11739.6},{"$f":"IF(AND(COUNTRY_INFO!K10>0,COUNTRY_INFO!K10<4),IF(Z10>0,IF(COUNTRY_INFO!K10=1, 0, IF(COUNTRY_INFO!K10=2, AF10/(COUNTRY_INFO!G10*0.2)*100, IF(COUNTRY_INFO!K10=3, AF10/COUNTRY_INFO!G10*100))),\"-\"),0)","v":100},{"$f":"SUM(AD10,AF10)","v":29007.1},{"$f":"IF(AND(COUNTRY_INFO!K10>0,COUNTRY_INFO!K10<4), IF(AC10/Z10*100<>0, IF(AH10/Z10*100>100,100,AH10/Z10*100), \"-\"),0)","v":100},null,{"$f":"IF(AND(D10<>0, D10<>\"Unknown\",D10<>\"Stopped\",D10<>\"Not required\"),D10/COUNTRY_INFO!D10, 0)","v":1},{"$f":"IF(AND(J10<>0,J10<>\"Unknown\",J10<>\"Stopped\",J10<>\"Not required\"),J10/COUNTRY_INFO!D10, 0)","v":0},{"$f":"IF(AND(P10<>0,P10<>\"Unknown\",P10<>\"Not required\"),P10/(COUNTRY_INFO!E10+COUNTRY_INFO!F10), 0)","v":1},{"$f":"IF(AND(Z10<>0,Z10<>\"Unknown\",Z10<>\"Not required\"),IF(COUNTRY_INFO!K10=1,1,IF(COUNTRY_INFO!K10=2,0.5*COUNTRY_INFO!F10/(0.5*COUNTRY_INFO!F10+0.2*COUNTRY_INFO!G10),IF(COUNTRY_INFO!K10=3,COUNTRY_INFO!F10/(COUNTRY_INFO!F10+COUNTRY_INFO!G10)))),0)","v":0.59528529222155957},{"$f":"IF(AND(Z10<>0,Z10<>\"Unknown\",Z10<>\"Not required\"),IF(COUNTRY_INFO!K10=1,0,IF(COUNTRY_INFO!K10=2,0.2*COUNTRY_INFO!G10/(0.5*COUNTRY_INFO!F10+0.2*COUNTRY_INFO!G10),IF(COUNTRY_INFO!K10=3,COUNTRY_INFO!G10/(COUNTRY_INFO!F10+COUNTRY_INFO!G10)))),0)","v":0.40471470777844049},{"$f":"MAX(COUNTRY_INFO!D10*AK10*PROFILE!$G$7,COUNTRY_INFO!D10*AL10*PROFILE!$G$7)","v":0},{"$f":"MAX(COUNTRY_INFO!D10*AK10*PROFILE!$G$8,COUNTRY_INFO!D10*AL10*PROFILE!$G$8,COUNTRY_INFO!D10*AM10*PROFILE!$G$8)","v":13685.605657959961},{"$f":"MAX(COUNTRY_INFO!D10*AK10*PROFILE!$G$9,COUNTRY_INFO!D10*AL10*PROFILE!$G$9,COUNTRY_INFO!D10*AM10*PROFILE!$G$9,IF(AND(DISTRICT!Z10<>\"Unknown\",Z10<>\"Not required\"),COUNTRY_INFO!O10*DISTRICT!AN10,0))","v":34534.730468489048},{"$f":"MAX(COUNTRY_INFO!D10*AK10*PROFILE!$G$10,COUNTRY_INFO!D10*AL10*PROFILE!$G$10,IF(AND(DISTRICT!Z10<>\"Unknown\",Z10<>\"Not required\"),COUNTRY_INFO!O10*DISTRICT!AO10,0))","v":58698.127430489672},{"$f":"SUM(AP10:AS10)","v":106918.46355693869},"Y",{"$f":"MAX('MDA2'!J10,T1_R1!L10,'T2'!J10,T3_R1!K10,T3_R2!K10)","v":0},{"$f":"MAX('MDA1'!K10,'MDA2'!K10,'MDA3'!I10,'MDA3'!L10,T1_R1!M10,'T2'!K10,T3_R1!L10,T3_R2!L10)","v":28331},{"$f":"MAX('MDA1'!L10,'MDA2'!L10,'MDA3'!J10,'MDA3'!M10,T1_R1!N10,'T2'!L10,T3_R1!M10,T3_R2!M10)","v":49960},{"$f":"SUM(AV10:AX10)","v":78291},{"$f":"MAX('MDA2'!J10,T10)","v":0},{"$f":"MAX('MDA1'!K10,'MDA2'!K10,'MDA3'!I10,'MDA3'!L10,V10,AD10)","v":28331},{"$f":"MAX('MDA1'!L10,'MDA2'!L10,'MDA3'!J10,'MDA3'!M10,AF10)","v":49960},78291,73.224957968374355]
[{"$f":"IF(COUNTRY_INFO!A11=0,\" \",COUNTRY_INFO!A11)","v":"Zanzibar"},{"$f":"IF(COUNTRY_INFO!B11=0,\" \",COUNTRY_INFO!B11)","v":"Kaskazini Pemba"},{"$f":"IF(COUNTRY_INFO!C11=0,\" \",COUNTRY_INFO!C11)","v":"Wete"},{"$f":"COUNTRY_INFO!L11","v":72184.666666666701},null,null,{"$f":"MAX('MDA1'!M11,'MDA2'!M11)","v":44453},{"$f":"IF(AND(COUNTRY_INFO!H11>0,COUNTRY_INFO!H11<4),IF(D11>MAX('MDA1'!M11,'MDA2'!M11),MAX('MDA1'!M11,'MDA2'!M11),D11),0)","v":44453},{"$f":"IF(AND(COUNTRY_INFO!H11>0,COUNTRY_INFO!H11<4), IF(G11/D11*100<>0, IF(G11/D11*100>100,100,G11/D11*100), \"-\"),0)","v":61.582330504169832},{"$f":"COUNTRY_INFO!M11","v":"Not required"},null,null,{"$f":"MAX('MDA1'!M11,MAX('MDA3'!I11,'MDA3'!L11)+MAX('MDA3'!J11,'MDA3'!M11))","v":44453},{"$f":"IF(AND(COUNTRY_INFO!I11>0,COUNTRY_INFO!I11<4),IF(J11>MAX('MDA1'!M11,MAX('MDA3'!I11,'MDA3'!L11)+MAX('MDA3'!J11,'MDA3'!M11)),MAX('MDA1'!M11,MAX('MDA3'!I11,'MDA3'!L11)+MAX('MDA3'!J11,'MDA3'!M11)),J11),0)","v":0},{"$f":"IF(AND(COUNTRY_INFO!I11>0,COUNTRY_INFO!I11<4), IF(M11/J11*100<>0, IF(M11/J11*100>100,100,M11/J11*100), \"-\"),0)","v":0},{"$f":"COUNTRY_INFO!N11","v":32556},null,null,{"$f":"SUM(MAX('MDA2'!J11, T1_R1!L11, MAX(T3_R1!K11, T3_R2!K11)), MAX('MDA1'!K11, 'MDA2'!K11, T1_R1!M11, MAX(T3_R1!L11, T3_R2!L11)), MAX('MDA1'!L11, 'MDA2'!L11, T1_R1!N11, MAX(T3_R1!M11, T3_R2!M11)))","v":88453},{"$f":"IF(AND(COUNTRY_INFO!J11>1,COUNTRY_INFO!J11<4),IF(COUNTRY_INFO!E11>MAX('MDA2'!J11,T1_R1!L11,MAX(T3_R1!K11,T3_R2!K11)),MAX('MDA2'!J11,T1_R1!L11,MAX(T3_R1!K11,T3_R2!K11)),COUNTRY_INFO!E11),0)","v":0},{"$f":"IF(AND(COUNTRY_INFO!J11>1,COUNTRY_INFO!J11<4), IF(T11/COUNTRY_INFO!E11*100<>0, IF(T11/COUNTRY_INFO!E11*100>100,100,T11/COUNTRY_INFO!E11*100), \"-\"),0)","v":"-"},{"$f":"IF(AND(COUNTRY_INFO!J11>1,COUNTRY_INFO!J11<4),IF(COUNTRY_INFO!F11>MAX('MDA1'!K11,'MDA2'!K11,T1_R1!M11,MAX(T3_R1!L11,T3_R2!L11)),MAX('MDA1'!K11,'MDA2'!K11,T1_R1!M11,MAX(T3_R1!L11,T3_R2!L11)),COUNTRY_INFO!F11),0)","v":23316},{"$f":"IF(AND(COUNTRY_INFO!J11>1,COUNTRY_INFO!J11<4), IF(V11/COUNTRY_INFO!F11*100<>0, IF(V11/COUNTRY_INFO!F11*100>100,100,V11/COUNTRY_INFO!F11*100), \"-\"),0)","v":100},23316,{"$f":"IF(AND(COUNTRY_INFO!J11>1,COUNTRY_INFO!J11<4), IF(S11/P11*100<>0, IF(X11/P11*100>100,100,X11/P11*100), \"-\"),0)","v":71.618134906008109},{"$f":"COUNTRY_INFO!O11","v":19583.8},null,null,{"$f":"MAX(SUM(T1_R1!L11:'T1_R1'!N11),SUM(T1_R2!L11:'T1_R2'!N11))","v":88453},{"$f":"IF(COUNTRY_INFO!K11=1,IF(COUNTRY_INFO!F11*0.33>MAX(T1_R1!M11,T1_R2!M11),MAX(T1_R1!M11,T1_R2!M11),COUNTRY_INFO!F11*0.33),IF(COUNTRY_INFO!K11=2,IF(COUNTRY_INFO!F11*0.5>MAX(T1_R1!M11,T1_R2!M11),MAX(T1_R1!M11,T1_R2!M11),COUNTRY_INFO!F11*0.5),IF(COUNTRY_INFO!K11=3,IF(COUNTRY_INFO!F11>MAX(T1_R1!M11,T1_R2!M11),MAX(T1_R1!M11,T1_R2!M11),COUNTRY_INFO!F11),0)))","v":11658},{"$f":"IF(AND(COUNTRY_INFO!K11>0,COUNTRY_INFO!K11<4),IF(Z11>0,IF(COUNTRY_INFO!K11=1, AD11/(COUNTRY_INFO!F11*0.33)*100, IF(COUNTRY_INFO!K11=2, AD11/(COUNTRY_INFO!F11*0.5)*100, IF(COUNTRY_INFO!K11=3, AD11/COUNTRY_INFO!F11*100))),\"-\"),0)","v":100},{"$f":"IF(COUNTRY_INFO!K11=2,IF(COUNTRY_INFO!G11*0.2>MAX(T1_R1!N11,T1_R2!N11),MAX(T1_R1!N11,T1_R2!N11),COUNTRY_INFO!G11*0.2),IF(COUNTRY_INFO!K11=3,IF(COUNTRY_INFO!G11>MAX(T1_R1!N11,T1_R2!N11),MAX(T1_R1!N11,T1_R2!N11),COUNTRY_INFO!G11),0))","v":7925.8},{"$f":"IF(AND(COUNTRY_INFO!K11>0,COUNTRY_INFO!K11<4),IF(Z11>0,IF(COUNTRY_INFO!K11=1, 0, IF(COUNTRY_INFO!K11=2, AF11/(COUNTRY_INFO!G11*0.2)*100, IF(COUNTRY_INFO!K11=3, AF11/COUNTRY_INFO!G11*100))),\"-\"),0)","v":100},19583.8,{"$f":"IF(AND(COUNTRY_INFO!K11>0,COUNTRY_INFO!K11<4), IF(AC11/Z11*100<>0, IF(AH11/Z11*100>100,100,AH11/Z11*100), \"-\"),0)","v":100},null,{"$f":"IF(AND(D11<>0, D11<>\"Unknown\",D11<>\"Stopped\",D11<>\"Not required\"),D11/COUNTRY_INFO!D11, 0)","v":1},{"$f":"IF(AND(J11<>0,J11<>\"Unknown\",J11<>\"Stopped\",J11<>\"Not required\"),J11/COUNTRY_INFO!D11, 0)","v":0},{"$f":"IF(AND(P11<>0,P11<>\"Unknown\",P11<>\"Not required\"),P11/(COUNTRY_INFO!E11+COUNTRY_INFO!F11), 0)","v":1},{"$f":"IF(AND(Z11<>0,Z11<>\"Unknown\",Z11<>\"Not required\"),IF(COUNTRY_INFO!K11=1,1,IF(COUNTRY_INFO!K11=2,0.5*COUNTRY_INFO!F11/(0.5*COUNTRY_INFO!F11+0.2*COUNTRY_INFO!G11),IF(COUNTRY_INFO!K11=3,COUNTRY_INFO!F11/(COUNTRY_INFO!F11+COUNTRY_INFO!G11)))),0)","v":0.59528794207457181},{"$f":"IF(AND(Z11<>0,Z11<>\"Unknown\",Z11<>\"Not required\"),IF(COUNTRY_INFO!K11=1,0,IF(COUNTRY_INFO!K11=2,0.2*COUNTRY_INFO!G11/(0.5*COUNTRY_INFO!F11+0.2*COUNTRY_INFO!G11),IF(COUNTRY_INFO!K11=3,COUNTRY_INFO!G11/(COUNTRY_INFO!F11+COUNTRY_INFO!G11)))),0)","v":0.40471205792542819},{"$f":"MAX(COUNTRY_INFO!D11*AK11*PROFILE!$G$7,COUNTRY_INFO!D11*AL11*PROFILE!$G$7)","v":0},{"$f":"MAX(COUNTRY_INFO!D11*AK11*PROFILE!$G$8,COUNTRY_INFO!D11*AL11*PROFILE!$G$8,COUNTRY_INFO!D11*AM11*PROFILE!$G$8)","v":9239.6771606175189},{"$f":"MAX(COUNTRY_INFO!D11*AK11*PROFILE!$G$9,COUNTRY_INFO!D11*AL11*PROFILE!$G$9,COUNTRY_INFO!D11*AM11*PROFILE!$G$9,IF(AND(DISTRICT!Z11<>\"Unknown\",Z11<>\"Not required\"),COUNTRY_INFO!O11*DISTRICT!AN11,0))","v":23315.720789615763},{"$f":"MAX(COUNTRY_INFO!D11*AK11*PROFILE!$G$10,COUNTRY_INFO!D11*AL11*PROFILE!$G$10,IF(AND(DISTRICT!Z11<>\"Unknown\",Z11<>\"Not required\"),COUNTRY_INFO!O11*DISTRICT!AO11,0))","v":39629.356635383105},72184.754585616378,"Y",{"$f":"MAX('MDA2'!J11,T1_R1!L11,'T2'!J11,T3_R1!K11,T3_R2!K11)","v":0},{"$f":"MAX('MDA1'!K11,'MDA2'!K11,'MDA3'!I11,'MDA3'!L11,T1_R1!M11,'T2'!K11,T3_R1!L11,T3_R2!L11)","v":26703},{"$f":"MAX('MDA1'!L11,'MDA2'!L11,'MDA3'!J11,'MDA3'!M11,T1_R1!N11,'T2'!L11,T3_R1!M11,T3_R2!M11)","v":61750},88453,{"$f":"MAX('MDA2'!J11,T11)","v":0},{"$f":"MAX('MDA1'!K11,'MDA2'!K11,'MDA3'!I11,'MDA3'!L11,V11,AD11)","v":23316},{"$f":"MAX('MDA1'!L11,'MDA2'!L11,'MDA3'!J11,'MDA3'!M11,AF11)","v":33750},57066,79.055474147682474]
[{"$f":"IF(COUNTRY_INFO!A12=0,\" \",COUNTRY_INFO!A12)","v":"Zanzibar"},{"$f":"IF(COUNTRY_INFO!B12=0,\" \",COUNTRY_INFO!B12)","v":"Kaskazini Pemba"},{"$f":"IF(COUNTRY_INFO!C12=0,\" \",COUNTRY_INFO!C12)","v":"Micheweni"},{"$f":"COUNTRY_INFO!L12","v":106147.133333333},null,null,{"$f":"MAX('MDA1'!M12,'MDA2'!M12)","v":72874},{"$f":"IF(AND(COUNTRY_INFO!H12>0,COUNTRY_INFO!H12<4),IF(D12>MAX('MDA1'!M12,'MDA2'!M12),MAX('MDA1'!M12,'MDA2'!M12),D12),0)","v":72874},{"$f":"IF(AND(COUNTRY_INFO!H12>0,COUNTRY_INFO!H12<4), IF(G12/D12*100<>0, IF(G12/D12*100>100,100,G12/D12*100), \"-\"),0)","v":68.653761728217717},{"$f":"COUNTRY_INFO!M12","v":"Not required"},null,null,{"$f":"MAX('MDA1'!M12,MAX('MDA3'!I12,'MDA3'!L12)+MAX('MDA3'!J12,'MDA3'!M12))","v":72874},{"$f":"IF(AND(COUNTRY_INFO!I12>0,COUNTRY_INFO!I12<4),IF(J12>MAX('MDA1'!M12,MAX('MDA3'!I12,'MDA3'!L12)+MAX('MDA3'!J12,'MDA3'!M12)),MAX('MDA1'!M12,MAX('MDA3'!I12,'MDA3'!L12)+MAX('MDA3'!J12,'MDA3'!M12)),J12),0)","v":0},{"$f":"IF(AND(COUNTRY_INFO!I12>0,COUNTRY_INFO!I12<4), IF(M12/J12*100<>0, IF(M12/J12*100>100,100,M12/J12*100), \"-\"),0)","v":0},{"$f":"COUNTRY_INFO!N12","v":47873},null,null,{"$f":"SUM(MAX('MDA2'!J12, T1_R1!L12, MAX(T3_R1!K12, T3_R2!K12)), MAX('MDA1'!K12, 'MDA2'!K12, T1_R1!M12, MAX(T3_R1!L12, T3_R2!L12)), MAX('MDA1'!L12, 'MDA2'!L12, T1_R1!N12, MAX(T3_R1!M12, T3_R2!M12)))","v":72874},{"$f":"IF(AND(COUNTRY_INFO!J12>1,COUNTRY_INFO!J12<4),IF(COUNTRY_INFO!E12>MAX('MDA2'!J12,T1_R1!L12,MAX(T3_R1!K12,T3_R2!K12)),MAX('MDA2'!J12,T1_R1!L12,MAX(T3_R1!K12,T3_R2!K12)),COUNTRY_INFO!E12),0)","v":0},{"$f":"IF(AND(COUNTRY_INFO!J12>1,COUNTRY_INFO!J12<4), IF(T12/COUNTRY_INFO!E12*100<>0, IF(T12/COUNTRY_INFO!E12*100>100,100,T12/COUNTRY_INFO!E12*100), \"-\"),0)","v":"-"},{"$f":"IF(AND(COUNTRY_INFO!J12>1,COUNTRY_INFO!J12<4),IF(COUNTRY_INFO!F12>MAX('MDA1'!K12,'MDA2'!K12,T1_R1!M12,MAX(T3_R1!L12,T3_R2!L12)),MAX('MDA1'!K12,'MDA2'!K12,T1_R1!M12,MAX(T3_R1!L12,T3_R2!L12)),COUNTRY_INFO!F12),0)","v":23206},{"$f":"IF(AND(COUNTRY_INFO!J12>1,COUNTRY_INFO!J12<4), IF(V12/COUNTRY_INFO!F12*100<>0, IF(V12/COUNTRY_INFO!F12*100>100,100,V12/COUNTRY_INFO!F12*100), \"-\"),0)","v":67.683602636644693},23206,{"$f":"IF(AND(COUNTRY_INFO!J12>1,COUNTRY_INFO!J12<4), IF(S12/P12*100<>0, IF(X12/P12*100>100,100,X12/P12*100), \"-\"),0)","v":48.474087690347375},{"$f":"COUNTRY_INFO!O12","v":11314.380000000001},null,null,{"$f":"MAX(SUM(T1_R1!L12:'T1_R1'!N12),SUM(T1_R2!L12:'T1_R2'!N12))","v":47472},{"$f":"IF(COUNTRY_INFO!K12=1,IF(COUNTRY_INFO!F12*0.33>MAX(T1_R1!M12,T1_R2!M12),MAX(T1_R1!M12,T1_R2!M12),COUNTRY_INFO!F12*0.33),IF(COUNTRY_INFO!K12=2,IF(COUNTRY_INFO!F12*0.5>MAX(T1_R1!M12,T1_R2!M12),MAX(T1_R1!M12,T1_R2!M12),COUNTRY_INFO!F12*0.5),IF(COUNTRY_INFO!K12=3,IF(COUNTRY_INFO!F12>MAX(T1_R1!M12,T1_R2!M12),MAX(T1_R1!M12,T1_R2!M12),COUNTRY_INFO!F12),0)))","v":11314.380000000001},{"$f":"IF(AND(COUNTRY_INFO!K12>0,COUNTRY_INFO!K12<4),IF(Z12>0,IF(COUNTRY_INFO!K12=1, AD12/(COUNTRY_INFO!F12*0.33)*100, IF(COUNTRY_INFO!K12=2, AD12/(COUNTRY_INFO!F12*0.5)*100, IF(COUNTRY_INFO!K12=3, AD12/COUNTRY_INFO!F12*100))),\"-\"),0)","v":100},{"$f":"IF(COUNTRY_INFO!K12=2,IF(COUNTRY_INFO!G12*0.2>MAX(T1_R1!N12,T1_R2!N12),MAX(T1_R1!N12,T1_R2!N12),COUNTRY_INFO!G12*0.2),IF(COUNTRY_INFO!K12=3,IF(COUNTRY_INFO!G12>MAX(T1_R1!N12,T1_R2!N12),MAX(T1_R1!N12,T1_R2!N12),COUNTRY_INFO!G12),0))","v":0},{"$f":"IF(AND(COUNTRY_INFO!K12>0,COUNTRY_INFO!K12<4),IF(Z12>0,IF(COUNTRY_INFO!K12=1, 0, IF(COUNTRY_INFO!K12=2, AF12/(COUNTRY_INFO!G12*0.2)*100, IF(COUNTRY_INFO!K12=3, AF12/COUNTRY_INFO!G12*100))),\"-\"),0)","v":0},11314.380000000001,{"$f":"IF(AND(COUNTRY_INFO!K12>0,COUNTRY_INFO!K12<4), IF(AC12/Z12*100<>0, IF(AH12/Z12*100>100,100,AH12/Z12*100), \"-\"),0)","v":100},null,{"$f":"IF(AND(D12<>0, D12<>\"Unknown\",D12<>\"Stopped\",D12<>\"Not required\"),D12/COUNTRY_INFO!D12, 0)","v":1},{"$f":"IF(AND(J12<>0,J12<>\"Unknown\",J12<>\"Stopped\",J12<>\"Not required\"),J12/COUNTRY_INFO!D12, 0)","v":0},{"$f":"IF(AND(P12<>0,P12<>\"Unknown\",P12<>\"Not required\"),P12/(COUNTRY_INFO!E12+COUNTRY_INFO!F12), 0)","v":1},{"$f":"IF(AND(Z12<>0,Z12<>\"Unknown\",Z12<>\"Not required\"),IF(COUNTRY_INFO!K12=1,1,IF(COUNTRY_INFO!K12=2,0.5*COUNTRY_INFO!F12/(0.5*COUNTRY_INFO!F12+0.2*COUNTRY_INFO!G12),IF(COUNTRY_INFO!K12=3,COUNTRY_INFO!F12/(COUNTRY_INFO!F12+COUNTRY_INFO!G12)))),0)","v":1},{"$f":"IF(AND(Z12<>0,Z12<>\"Unknown\",Z12<>\"Not required\"),IF(COUNTRY_INFO!K12=1,0,IF(COUNTRY_INFO!K12=2,0.2*COUNTRY_INFO!G12/(0.5*COUNTRY_INFO!F12+0.2*COUNTRY_INFO!G12),IF(COUNTRY_INFO!K12=3,COUNTRY_INFO!G12/(COUNTRY_INFO!F12+COUNTRY_INFO!G12)))),0)","v":0},{"$f":"MAX(COUNTRY_INFO!D12*AK12*PROFILE!$G$7,COUNTRY_INFO!D12*AL12*PROFILE!$G$7)","v":0},{"$f":"MAX(COUNTRY_INFO!D12*AK12*PROFILE!$G$8,COUNTRY_INFO!D12*AL12*PROFILE!$G$8,COUNTRY_INFO!D12*AM12*PROFILE!$G$8)","v":13586.891632456833},{"$f":"MAX(COUNTRY_INFO!D12*AK12*PROFILE!$G$9,COUNTRY_INFO!D12*AL12*PROFILE!$G$9,COUNTRY_INFO!D12*AM12*PROFILE!$G$9,IF(AND(DISTRICT!Z12<>\"Unknown\",Z12<>\"Not required\"),COUNTRY_INFO!O12*DISTRICT!AN12,0))","v":34285.632083703473},{"$f":"MAX(COUNTRY_INFO!D12*AK12*PROFILE!$G$10,COUNTRY_INFO!D12*AL12*PROFILE!$G$10,IF(AND(DISTRICT!Z12<>\"Unknown\",Z12<>\"Not required\"),COUNTRY_INFO!O12*DISTRICT!AO12,0))","v":58274.738901477875},106147.26261763819,"Y",{"$f":"MAX('MDA2'!J12,T1_R1!L12,'T2'!J12,T3_R1!K12,T3_R2!K12)","v":0},{"$f":"MAX('MDA1'!K12,'MDA2'!K12,'MDA3'!I12,'MDA3'!L12,T1_R1!M12,'T2'!K12,T3_R1!L12,T3_R2!L12)","v":23206},{"$f":"MAX('MDA1'!L12,'MDA2'!L12,'MDA3'!J12,'MDA3'!M12,T1_R1!N12,'T2'!L12,T3_R1!M12,T3_R2!M12)","v":49668},72874,{"$f":"MAX('MDA2'!J12,T12)","v":0},{"$f":"MAX('MDA1'!K12,'MDA2'!K12,'MDA3'!I12,'MDA3'!L12,V12,AD12)","v":23206},{"$f":"MAX('MDA1'!L12,'MDA2'!L12,'MDA3'!J12,'MDA3'!M12,AF12)","v":49668},72874,68.653678109915504]
[{"$f":"IF(COUNTRY_INFO!A13=0,\" \",COUNTRY_INFO!A13)","v":"Zanzibar"},{"$f":"IF(COUNTRY_INFO!B13=0,\" \",COUNTRY_INFO!B13)","v":"Kaskazini Unguja"},{"$f":"IF(COUNTRY_INFO!C13=0,\" \",COUNTRY_INFO!C13)","v":"Kaskazini A"},{"$f":"COUNTRY_INFO!L13","v":110542.33333333299},null,null,{"$f":"MAX('MDA1'!M13,'MDA2'!M13)","v":87409},{"$f":"IF(AND(COUNTRY_INFO!H13>0,COUNTRY_INFO!H13<4),IF(D13>MAX('MDA1'!M13,'MDA2'!M13),MAX('MDA1'!M13,'MDA2'!M13),D13),0)","v":87409},{"$f":"IF(AND(COUNTRY_INFO!H13>0,COUNTRY_INFO!H13<4), IF(G13/D13*100<>0, IF(G13/D13*100>100,100,G13/D13*100), \"-\"),0)","v":79.072874042222381},{"$f":"COUNTRY_INFO!M13","v":"Not required"},null,null,{"$f":"MAX('MDA1'!M13,MAX('MDA3'!I13,'MDA3'!L13)+MAX('MDA3'!J13,'MDA3'!M13))","v":87409},{"$f":"IF(AND(COUNTRY_INFO!I13>0,COUNTRY_INFO!I13<4),IF(J13>MAX('MDA1'!M13,MAX('MDA3'!I13,'MDA3'!L13)+MAX('MDA3'!J13,'MDA3'!M13)),MAX('MDA1'!M13,MAX('MDA3'!I13,'MDA3'!L13)+MAX('MDA3'!J13,'MDA3'!M13)),J13),0)","v":0},{"$f":"IF(AND(COUNTRY_INFO!I13>0,COUNTRY_INFO!I13<4), IF(M13/J13*100<>0, IF(M13/J13*100>100,100,M13/J13*100), \"-\"),0)","v":0},{"$f":"COUNTRY_INFO!N13","v":49854},null,null,{"$f":"SUM(MAX('MDA2'!J13, T1_R1!L13, MAX(T3_R1!K13, T3_R2!K13)), MAX('MDA1'!K13, 'MDA2'!K13, T1_R1!M13, MAX(T3_R1!L13, T3_R2!L13)), MAX('MDA1'!L13, 'MDA2'!L13, T1_R1!N13, MAX(T3_R1!M13, T3_R2!M13)))","v":87409},{"$f":"IF(AND(COUNTRY_INFO!J13>1,COUNTRY_INFO!J13<4),IF(COUNTRY_INFO!E13>MAX('MDA2'!J13,T1_R1!L13,MAX(T3_R1!K13,T3_R2!K13)),MAX('MDA2'!J13,T1_R1!L13,MAX(T3_R1!K13,T3_R2!K13)),COUNTRY_INFO!E13),0)","v":0},{"$f":"IF(AND(COUNTRY_INFO!J13>1,COUNTRY_INFO!J13<4), IF(T13/COUNTRY_INFO!E13*100<>0, IF(T13/COUNTRY_INFO!E13*100>100,100,T13/COUNTRY_INFO!E13*100), \"-\"),0)","v":"-"},{"$f":"IF(AND(COUNTRY_INFO!J13>1,COUNTRY_INFO!J13<4),IF(COUNTRY_INFO!F13>MAX('MDA1'!K13,'MDA2'!K13,T1_R1!M13,MAX(T3_R1!L13,T3_R2!L13)),MAX('MDA1'!K13,'MDA2'!K13,T1_R1!M13,MAX(T3_R1!L13,T3_R2!L13)),COUNTRY_INFO!F13),0)","v":29822},{"$f":"IF(AND(COUNTRY_INFO!J13>1,COUNTRY_INFO!J13<4), IF(V13/COUNTRY_INFO!F13*100<>0, IF(V13/COUNTRY_INFO!F13*100>100,100,V13/COUNTRY_INFO!F13*100), \"-\"),0)","v":83.523316062176164},29822,{"$f":"IF(AND(COUNTRY_INFO!J13>1,COUNTRY_INFO!J13<4), IF(S13/P13*100<>0, IF(X13/P13*100>100,100,X13/P13*100), \"-\"),0)","v":59.818670517912309},{"$f":"COUNTRY_INFO!O13","v":29990.1},null,null,{"$f":"MAX(SUM(T1_R1!L13:'T1_R1'!N13),SUM(T1_R2!L13:'T1_R2'!N13))","v":84239},{"$f":"IF(COUNTRY_INFO!K13=1,IF(COUNTRY_INFO!F13*0.33>MAX(T1_R1!M13,T1_R2!M13),MAX(T1_R1!M13,T1_R2!M13),COUNTRY_INFO!F13*0.33),IF(COUNTRY_INFO!K13=2,IF(COUNTRY_INFO!F13*0.5>MAX(T1_R1!M13,T1_R2!M13),MAX(T1_R1!M13,T1_R2!M13),COUNTRY_INFO!F13*0.5),IF(COUNTRY_INFO!K13=3,IF(COUNTRY_INFO!F13>MAX(T1_R1!M13,T1_R2!M13),MAX(T1_R1!M13,T1_R2!M13),COUNTRY_INFO!F13),0)))","v":17852.5},{"$f":"IF(AND(COUNTRY_INFO!K13>0,COUNTRY_INFO!K13<4),IF(Z13>0,IF(COUNTRY_INFO!K13=1, AD13/(COUNTRY_INFO!F13*0.33)*100, IF(COUNTRY_INFO!K13=2, AD13/(COUNTRY_INFO!F13*0.5)*100, IF(COUNTRY_INFO!K13=3, AD13/COUNTRY_INFO!F13*100))),\"-\"),0)","v":100},{"$f":"IF(COUNTRY_INFO!K13=2,IF(COUNTRY_INFO!G13*0.2>MAX(T1_R1!N13,T1_R2!N13),MAX(T1_R1!N13,T1_R2!N13),COUNTRY_INFO!G13*0.2),IF(COUNTRY_INFO!K13=3,IF(COUNTRY_INFO!G13>MAX(T1_R1!N13,T1_R2!N13),MAX(T1_R1!N13,T1_R2!N13),COUNTRY_INFO!G13),0))","v":12137.6},{"$f":"IF(AND(COUNTRY_INFO!K13>0,COUNTRY_INFO!K13<4),IF(Z13>0,IF(COUNTRY_INFO!K13=1, 0, IF(COUNTRY_INFO!K13=2, AF13/(COUNTRY_INFO!G13*0.2)*100, IF(COUNTRY_INFO!K13=3, AF13/COUNTRY_INFO!G13*100))),\"-\"),0)","v":100},29990.1,{"$f":"IF(AND(COUNTRY_INFO!K13>0,COUNTRY_INFO!K13<4), IF(AC13/Z13*100<>0, IF(AH13/Z13*100>100,100,AH13/Z13*100), \"-\"),0)","v":100},null,{"$f":"IF(AND(D13<>0, D13<>\"Unknown\",D13<>\"Stopped\",D13<>\"Not required\"),D13/COUNTRY_INFO!D13, 0)","v":1},{"$f":"IF(AND(J13<>0,J13<>\"Unknown\",J13<>\"Stopped\",J13<>\"Not required\"),J13/COUNTRY_INFO!D13, 0)","v":0},{"$f":"IF(AND(P13<>0,P13<>\"Unknown\",P13<>\"Not required\"),P13/(COUNTRY_INFO!E13+COUNTRY_INFO!F13), 0)","v":1},{"$f":"IF(AND(Z13<>0,Z13<>\"Unknown\",Z13<>\"Not required\"),IF(COUNTRY_INFO!K13=1,1,IF(COUNTRY_INFO!K13=2,0.5*COUNTRY_INFO!F13/(0.5*COUNTRY_INFO!F13+0.2*COUNTRY_INFO!G13),IF(COUNTRY_INFO!K13=3,COUNTRY_INFO!F13/(COUNTRY_INFO!F13+COUNTRY_INFO!G13)))),0)","v":0.5952797756593009},{"$f":"IF(AND(Z13<>0,Z13<>\"Unknown\",Z13<>\"Not required\"),IF(COUNTRY_INFO!K13=1,0,IF(COUNTRY_INFO!K13=2,0.2*COUNTRY_INFO!G13/(0.5*COUNTRY_INFO!F13+0.2*COUNTRY_INFO!G13),IF(COUNTRY_INFO!K13=3,COUNTRY_INFO!G13/(COUNTRY_INFO!F13+COUNTRY_INFO!G13)))),0)","v":0.40472022434069915},{"$f":"MAX(COUNTRY_INFO!D13*AK13*PROFILE!$G$7,COUNTRY_INFO!D13*AL13*PROFILE!$G$7)","v":0},{"$f":"MAX(COUNTRY_INFO!D13*AK13*PROFILE!$G$8,COUNTRY_INFO!D13*AL13*PROFILE!$G$8,COUNTRY_INFO!D13*AM13*PROFILE!$G$8)","v":14149.479657471555},{"$f":"MAX(COUNTRY_INFO!D13*AK13*PROFILE!$G$9,COUNTRY_INFO!D13*AL13*PROFILE!$G$9,COUNTRY_INFO!D13*AM13*PROFILE!$G$9,IF(AND(DISTRICT!Z13<>\"Unknown\",Z13<>\"Not required\"),COUNTRY_INFO!O13*DISTRICT!AN13,0))","v":35705.286156329967},{"$f":"MAX(COUNTRY_INFO!D13*AK13*PROFILE!$G$10,COUNTRY_INFO!D13*AL13*PROFILE!$G$10,IF(AND(DISTRICT!Z13<>\"Unknown\",Z13<>\"Not required\"),COUNTRY_INFO!O13*DISTRICT!AO13,0))","v":60687.702157070045},110542.46797087157,"Y",{"$f":"MAX('MDA2'!J13,T1_R1!L13,'T2'!J13,T3_R1!K13,T3_R2!K13)","v":0},{"$f":"MAX('MDA1'!K13,'MDA2'!K13,'MDA3'!I13,'MDA3'!L13,T1_R1!M13,'T2'!K13,T3_R1!L13,T3_R2!L13)","v":29822},{"$f":"MAX('MDA1'!L13,'MDA2'!L13,'MDA3'!J13,'MDA3'!M13,T1_R1!N13,'T2'!L13,T3_R1!M13,T3_R2!M13)","v":57587},87409,{"$f":"MAX('MDA2'!J13,T13)","v":0},{"$f":"MAX('MDA1'!K13,'MDA2'!K13,'MDA3'!I13,'MDA3'!L13,V13,AD13)","v":29822},{"$f":"MAX('MDA1'!L13,'MDA2'!L13,'MDA3'!J13,'MDA3'!M13,AF13)","v":57587},87409,79.072777733741802]
[{"$f":"IF(COUNTRY_INFO!A14=0,\" \",COUNTRY_INFO!A14)","v":"Zanzibar"},{"$f":"IF(COUNTRY_INFO!B14=0,\" \",COUNTRY_INFO!B14)","v":"Kaskazini Unguja"},{"$f":"IF(COUNTRY_INFO!C14=0,\" \",COUNTRY_INFO!C14)","v":"Kaskazini B "},{"$f":"COUNTRY_INFO!L14","v":109599.33333333299},null,null,{"$f":"MAX('MDA1'!M14,'MDA2'!M14)","v":90071},{"$f":"IF(AND(COUNTRY_INFO!H14>0,COUNTRY_INFO!H14<4),IF(D14>MAX('MDA1'!M14,'MDA2'!M14),MAX('MDA1'!M14,'MDA2'!M14),D14),0)","v":90071},{"$f":"IF(AND(COUNTRY_INFO!H14>0,COUNTRY_INFO!H14<4), IF(G14/D14*100<>0, IF(G14/D14*100>100,100,G14/D14*100), \"-\"),0)","v":82.182069233998021},{"$f":"COUNTRY_INFO!M14","v":"Not required"},null,null,{"$f":"MAX('MDA1'!M14,MAX('MDA3'!I14,'MDA3'!L14)+MAX('MDA3'!J14,'MDA3'!M14))","v":90071},{"$f":"IF(AND(COUNTRY_INFO!I14>0,COUNTRY_INFO!I14<4),IF(J14>MAX('MDA1'!M14,MAX('MDA3'!I14,'MDA3'!L14)+MAX('MDA3'!J14,'MDA3'!M14)),MAX('MDA1'!M14,MAX('MDA3'!I14,'MDA3'!L14)+MAX('MDA3'!J14,'MDA3'!M14)),J14),0)","v":0},{"$f":"IF(AND(COUNTRY_INFO!I14>0,COUNTRY_INFO!I14<4), IF(M14/J14*100<>0, IF(M14/J14*100>100,100,M14/J14*100), \"-\"),0)","v":0},{"$f":"COUNTRY_INFO!N14","v":49430},null,null,{"$f":"SUM(MAX('MDA2'!J14, T1_R1!L14, MAX(T3_R1!K14, T3_R2!K14)), MAX('MDA1'!K14, 'MDA2'!K14, T1_R1!M14, MAX(T3_R1!L14, T3_R2!L14)), MAX('MDA1'!L14, 'MDA2'!L14, T1_R1!N14, MAX(T3_R1!M14, T3_R2!M14)))","v":90071},{"$f":"IF(AND(COUNTRY_INFO!J14>1,COUNTRY_INFO!J14<4),IF(COUNTRY_INFO!E14>MAX('MDA2'!J14,T1_R1!L14,MAX(T3_R1!K14,T3_R2!K14)),MAX('MDA2'!J14,T1_R1!L14,MAX(T3_R1!K14,T3_R2!K14)),COUNTRY_INFO!E14),0)","v":0},{"$f":"IF(AND(COUNTRY_INFO!J14>1,COUNTRY_INFO!J14<4), IF(T14/COUNTRY_INFO!E14*100<>0, IF(T14/COUNTRY_INFO!E14*100>100,100,T14/COUNTRY_INFO!E14*100), \"-\"),0)","v":"-"},{"$f":"IF(AND(COUNTRY_INFO!J14>1,COUNTRY_INFO!J14<4),IF(COUNTRY_INFO!F14>MAX('MDA1'!K14,'MDA2'!K14,T1_R1!M14,MAX(T3_R1!L14,T3_R2!L14)),MAX('MDA1'!K14,'MDA2'!K14,T1_R1!M14,MAX(T3_R1!L14,T3_R2!L14)),COUNTRY_INFO!F14),0)","v":33665},{"$f":"IF(AND(COUNTRY_INFO!J14>1,COUNTRY_INFO!J14<4), IF(V14/COUNTRY_INFO!F14*100<>0, IF(V14/COUNTRY_INFO!F14*100>100,100,V14/COUNTRY_INFO!F14*100), \"-\"),0)","v":95.096183723623625},33665,{"$f":"IF(AND(COUNTRY_INFO!J14>1,COUNTRY_INFO!J14<4), IF(S14/P14*100<>0, IF(X14/P14*100>100,100,X14/P14*100), \"-\"),0)","v":68.106413109447701},{"$f":"COUNTRY_INFO!O14","v":11682.33},null,null,{"$f":"MAX(SUM(T1_R1!L14:'T1_R1'!N14),SUM(T1_R2!L14:'T1_R2'!N14))","v":60558},{"$f":"IF(COUNTRY_INFO!K14=1,IF(COUNTRY_INFO!F14*0.33>MAX(T1_R1!M14,T1_R2!M14),MAX(T1_R1!M14,T1_R2!M14),COUNTRY_INFO!F14*0.33),IF(COUNTRY_INFO!K14=2,IF(COUNTRY_INFO!F14*0.5>MAX(T1_R1!M14,T1_R2!M14),MAX(T1_R1!M14,T1_R2!M14),COUNTRY_INFO!F14*0.5),IF(COUNTRY_INFO!K14=3,IF(COUNTRY_INFO!F14>MAX(T1_R1!M14,T1_R2!M14),MAX(T1_R1!M14,T1_R2!M14),COUNTRY_INFO!F14),0)))","v":11682.33},{"$f":"IF(AND(COUNTRY_INFO!K14>0,COUNTRY_INFO!K14<4),IF(Z14>0,IF(COUNTRY_INFO!K14=1, AD14/(COUNTRY_INFO!F14*0.33)*100, IF(COUNTRY_INFO!K14=2, AD14/(COUNTRY_INFO!F14*0.5)*100, IF(COUNTRY_INFO!K14=3, AD14/COUNTRY_INFO!F14*100))),\"-\"),0)","v":100},{"$f":"IF(COUNTRY_INFO!K14=2,IF(COUNTRY_INFO!G14*0.2>MAX(T1_R1!N14,T1_R2!N14),MAX(T1_R1!N14,T1_R2!N14),COUNTRY_INFO!G14*0.2),IF(COUNTRY_INFO!K14=3,IF(COUNTRY_INFO!G14>MAX(T1_R1!N14,T1_R2!N14),MAX(T1_R1!N14,T1_R2!N14),COUNTRY_INFO!G14),0))","v":0},{"$f":"IF(AND(COUNTRY_INFO!K14>0,COUNTRY_INFO!K14<4),IF(Z14>0,IF(COUNTRY_INFO!K14=1, 0, IF(COUNTRY_INFO!K14=2, AF14/(COUNTRY_INFO!G14*0.2)*100, IF(COUNTRY_INFO!K14=3, AF14/COUNTRY_INFO!G14*100))),\"-\"),0)","v":0},11682.33,{"$f":"IF(AND(COUNTRY_INFO!K14>0,COUNTRY_INFO!K14<4), IF(AC14/Z14*100<>0, IF(AH14/Z14*100>100,100,AH14/Z14*100), \"-\"),0)","v":100},null,{"$f":"IF(AND(D14<>0, D14<>\"Unknown\",D14<>\"Stopped\",D14<>\"Not required\"),D14/COUNTRY_INFO!D14, 0)","v":1},{"$f":"IF(AND(J14<>0,J14<>\"Unknown\",J14<>\"Stopped\",J14<>\"Not required\"),J14/COUNTRY_INFO!D14, 0)","v":0},{"$f":"IF(AND(P14<>0,P14<>\"Unknown\",P14<>\"Not required\"),P14/(COUNTRY_INFO!E14+COUNTRY_INFO!F14), 0)","v":1},{"$f":"IF(AND(Z14<>0,Z14<>\"Unknown\",Z14<>\"Not required\"),IF(COUNTRY_INFO!K14=1,1,IF(COUNTRY_INFO!K14=2,0.5*COUNTRY_INFO!F14/(0.5*COUNTRY_INFO!F14+0.2*COUNTRY_INFO!G14),IF(COUNTRY_INFO!K14=3,COUNTRY_INFO!F14/(COUNTRY_INFO!F14+COUNTRY_INFO!G14)))),0)","v":1},{"$f":"IF(AND(Z14<>0,Z14<>\"Unknown\",Z14<>\"Not required\"),IF(COUNTRY_INFO!K14=1,0,IF(COUNTRY_INFO!K14=2,0.2*COUNTRY_INFO!G14/(0.5*COUNTRY_INFO!F14+0.2*COUNTRY_INFO!G14),IF(COUNTRY_INFO!K14=3,COUNTRY_INFO!G14/(COUNTRY_INFO!F14+COUNTRY_INFO!G14)))),0)","v":0},{"$f":"MAX(COUNTRY_INFO!D14*AK14*PROFILE!$G$7,COUNTRY_INFO!D14*AL14*PROFILE!$G$7)","v":0},{"$f":"MAX(COUNTRY_INFO!D14*AK14*PROFILE!$G$8,COUNTRY_INFO!D14*AL14*PROFILE!$G$8,COUNTRY_INFO!D14*AM14*PROFILE!$G$8)","v":14028.775137179216},{"$f":"MAX(COUNTRY_INFO!D14*AK14*PROFILE!$G$9,COUNTRY_INFO!D14*AL14*PROFILE!$G$9,COUNTRY_INFO!D14*AM14*PROFILE!$G$9,IF(AND(DISTRICT!Z14<>\"Unknown\",Z14<>\"Not required\"),COUNTRY_INFO!O14*DISTRICT!AN14,0))","v":35400.696196717938},{"$f":"MAX(COUNTRY_INFO!D14*AK14*PROFILE!$G$10,COUNTRY_INFO!D14*AL14*PROFILE!$G$10,IF(AND(DISTRICT!Z14<>\"Unknown\",Z14<>\"Not required\"),COUNTRY_INFO!O14*DISTRICT!AO14,0))","v":60169.995488426204},109599.46682232336,"Y",{"$f":"MAX('MDA2'!J14,T1_R1!L14,'T2'!J14,T3_R1!K14,T3_R2!K14)","v":0},{"$f":"MAX('MDA1'!K14,'MDA2'!K14,'MDA3'!I14,'MDA3'!L14,T1_R1!M14,'T2'!K14,T3_R1!L14,T3_R2!L14)","v":33665},{"$f":"MAX('MDA1'!L14,'MDA2'!L14,'MDA3'!J14,'MDA3'!M14,T1_R1!N14,'T2'!L14,T3_R1!M14,T3_R2!M14)","v":56406},90071,{"$f":"MAX('MDA2'!J14,T14)","v":0},{"$f":"MAX('MDA1'!K14,'MDA2'!K14,'MDA3'!I14,'MDA3'!L14,V14,AD14)","v":33665},{"$f":"MAX('MDA1'!L14,'MDA2'!L14,'MDA3'!J14,'MDA3'!M14,AF14)","v":56406},90071,82.181969138607357]
[{"$f":"IF(COUNTRY_INFO!A15=0,\" \",COUNTRY_INFO!A15)","v":"Zanzibar"},{"$f":"IF(COUNTRY_INFO!B15=0,\" \",COUNTRY_INFO!B15)","v":"Kusini Unguja"},{"$f":"IF(COUNTRY_INFO!C15=0,\" \",COUNTRY_INFO!C15)","v":"Kati "},{"$f":"COUNTRY_INFO!L15","v":75060.800000000003},null,null,{"$f":"MAX('MDA1'!M15,'MDA2'!M15)","v":65757},{"$f":"IF(AND(COUNTRY_INFO!H15>0,COUNTRY_INFO!H15<4),IF(D15>MAX('MDA1'!M15,'MDA2'!M15),MAX('MDA1'!M15,'MDA2'!M15),D15),0)","v":65757},{"$f":"IF(AND(COUNTRY_INFO!H15>0,COUNTRY_INFO!H15<4), IF(G15/D15*100<>0, IF(G15/D15*100>100,100,G15/D15*100), \"-\"),0)","v":87.604981561614053},{"$f":"COUNTRY_INFO!M15","v":"Not required"},null,null,{"$f":"MAX('MDA1'!M15,MAX('MDA3'!I15,'MDA3'!L15)+MAX('MDA3'!J15,'MDA3'!M15))","v":65757},{"$f":"IF(AND(COUNTRY_INFO!I15>0,COUNTRY_INFO!I15<4),IF(J15>MAX('MDA1'!M15,MAX('MDA3'!I15,'MDA3'!L15)+MAX('MDA3'!J15,'MDA3'!M15)),MAX('MDA1'!M15,MAX('MDA3'!I15,'MDA3'!L15)+MAX('MDA3'!J15,'MDA3'!M15)),J15),0)","v":0},{"$f":"IF(AND(COUNTRY_INFO!I15>0,COUNTRY_INFO!I15<4), IF(M15/J15*100<>0, IF(M15/J15*100>100,100,M15/J15*100), \"-\"),0)","v":0},{"$f":"COUNTRY_INFO!N15","v":33853},null,null,{"$f":"SUM(MAX('MDA2'!J15, T1_R1!L15, MAX(T3_R1!K15, T3_R2!K15)), MAX('MDA1'!K15, 'MDA2'!K15, T1_R1!M15, MAX(T3_R1!L15, T3_R2!L15)), MAX('MDA1'!L15, 'MDA2'!L15, T1_R1!N15, MAX(T3_R1!M15, T3_R2!M15)))","v":65757},{"$f":"IF(AND(COUNTRY_INFO!J15>1,COUNTRY_INFO!J15<4),IF(COUNTRY_INFO!E15>MAX('MDA2'!J15,T1_R1!L15,MAX(T3_R1!K15,T3_R2!K15)),MAX('MDA2'!J15,T1_R1!L15,MAX(T3_R1!K15,T3_R2!K15)),COUNTRY_INFO!E15),0)","v":0},{"$f":"IF(AND(COUNTRY_INFO!J15>1,COUNTRY_INFO!J15<4), IF(T15/COUNTRY_INFO!E15*100<>0, IF(T15/COUNTRY_INFO!E15*100>100,100,T15/COUNTRY_INFO!E15*100), \"-\"),0)","v":"-"},{"$f":"IF(AND(COUNTRY_INFO!J15>1,COUNTRY_INFO!J15<4),IF(COUNTRY_INFO!F15>MAX('MDA1'!K15,'MDA2'!K15,T1_R1!M15,MAX(T3_R1!L15,T3_R2!L15)),MAX('MDA1'!K15,'MDA2'!K15,T1_R1!M15,MAX(T3_R1!L15,T3_R2!L15)),COUNTRY_INFO!F15),0)","v":24245},{"$f":"IF(AND(COUNTRY_INFO!J15>1,COUNTRY_INFO!J15<4), IF(V15/COUNTRY_INFO!F15*100<>0, IF(V15/COUNTRY_INFO!F15*100>100,100,V15/COUNTRY_INFO!F15*100), \"-\"),0)","v":100},24245,{"$f":"IF(AND(COUNTRY_INFO!J15>1,COUNTRY_INFO!J15<4), IF(S15/P15*100<>0, IF(X15/P15*100>100,100,X15/P15*100), \"-\"),0)","v":71.618468082592386},{"$f":"COUNTRY_INFO!O15","v":8000.85},null,null,{"$f":"MAX(SUM(T1_R1!L15:'T1_R1'!N15),SUM(T1_R2!L15:'T1_R2'!N15))","v":72945},{"$f":"IF(COUNTRY_INFO!K15=1,IF(COUNTRY_INFO!F15*0.33>MAX(T1_R1!M15,T1_R2!M15),MAX(T1_R1!M15,T1_R2!M15),COUNTRY_INFO!F15*0.33),IF(COUNTRY_INFO!K15=2,IF(COUNTRY_INFO!F15*0.5>MAX(T1_R1!M15,T1_R2!M15),MAX(T1_R1!M15,T1_R2!M15),COUNTRY_INFO!F15*0.5),IF(COUNTRY_INFO!K15=3,IF(COUNTRY_INFO!F15>MAX(T1_R1!M15,T1_R2!M15),MAX(T1_R1!M15,T1_R2!M15),COUNTRY_INFO!F15),0)))","v":8000.85},{"$f":"IF(AND(COUNTRY_INFO!K15>0,COUNTRY_INFO!K15<4),IF(Z15>0,IF(COUNTRY_INFO!K15=1, AD15/(COUNTRY_INFO!F15*0.33)*100, IF(COUNTRY_INFO!K15=2, AD15/(COUNTRY_INFO!F15*0.5)*100, IF(COUNTRY_INFO!K15=3, AD15/COUNTRY_INFO!F15*100))),\"-\"),0)","v":100},{"$f":"IF(COUNTRY_INFO!K15=2,IF(COUNTRY_INFO!G15*0.2>MAX(T1_R1!N15,T1_R2!N15),MAX(T1_R1!N15,T1_R2!N15),COUNTRY_INFO!G15*0.2),IF(COUNTRY_INFO!K15=3,IF(COUNTRY_INFO!G15>MAX(T1_R1!N15,T1_R2!N15),MAX(T1_R1!N15,T1_R2!N15),COUNTRY_INFO!G15),0))","v":0},{"$f":"IF(AND(COUNTRY_INFO!K15>0,COUNTRY_INFO!K15<4),IF(Z15>0,IF(COUNTRY_INFO!K15=1, 0, IF(COUNTRY_INFO!K15=2, AF15/(COUNTRY_INFO!G15*0.2)*100, IF(COUNTRY_INFO!K15=3, AF15/COUNTRY_INFO!G15*100))),\"-\"),0)","v":0},8000.85,{"$f":"IF(AND(COUNTRY_INFO!K15>0,COUNTRY_INFO!K15<4), IF(AC15/Z15*100<>0, IF(AH15/Z15*100>100,100,AH15/Z15*100), \"-\"),0)","v":100},null,{"$f":"IF(AND(D15<>0, D15<>\"Unknown\",D15<>\"Stopped\",D15<>\"Not required\"),D15/COUNTRY_INFO!D15, 0)","v":1},{"$f":"IF(AND(J15<>0,J15<>\"Unknown\",J15<>\"Stopped\",J15<>\"Not required\"),J15/COUNTRY_INFO!D15, 0)","v":0},{"$f":"IF(AND(P15<>0,P15<>\"Unknown\",P15<>\"Not required\"),P15/(COUNTRY_INFO!E15+COUNTRY_INFO!F15), 0)","v":1},{"$f":"IF(AND(Z15<>0,Z15<>\"Unknown\",Z15<>\"Not required\"),IF(COUNTRY_INFO!K15=1,1,IF(COUNTRY_INFO!K15=2,0.5*COUNTRY_INFO!F15/(0.5*COUNTRY_INFO!F15+0.2*COUNTRY_INFO!G15),IF(COUNTRY_INFO!K15=3,COUNTRY_INFO!F15/(COUNTRY_INFO!F15+COUNTRY_INFO!G15)))),0)","v":1},{"$f":"IF(AND(Z15<>0,Z15<>\"Unknown\",Z15<>\"Not required\"),IF(COUNTRY_INFO!K15=1,0,IF(COUNTRY_INFO!K15=2,0.2*COUNTRY_INFO!G15/(0.5*COUNTRY_INFO!F15+0.2*COUNTRY_INFO!G15),IF(COUNTRY_INFO!K15=3,COUNTRY_INFO!G15/(COUNTRY_INFO!F15+COUNTRY_INFO!G15)))),0)","v":0},{"$f":"MAX(COUNTRY_INFO!D15*AK15*PROFILE!$G$7,COUNTRY_INFO!D15*AL15*PROFILE!$G$7)","v":0},{"$f":"MAX(COUNTRY_INFO!D15*AK15*PROFILE!$G$8,COUNTRY_INFO!D15*AL15*PROFILE!$G$8,COUNTRY_INFO!D15*AM15*PROFILE!$G$8)","v":9607.823814166617},{"$f":"MAX(COUNTRY_INFO!D15*AK15*PROFILE!$G$9,COUNTRY_INFO!D15*AL15*PROFILE!$G$9,COUNTRY_INFO!D15*AM15*PROFILE!$G$9,IF(AND(DISTRICT!Z15<>\"Unknown\",Z15<>\"Not required\"),COUNTRY_INFO!O15*DISTRICT!AN15,0))","v":24244.714783082145},{"$f":"MAX(COUNTRY_INFO!D15*AK15*PROFILE!$G$10,COUNTRY_INFO!D15*AL15*PROFILE!$G$10,IF(AND(DISTRICT!Z15<>\"Unknown\",Z15<>\"Not required\"),COUNTRY_INFO!O15*DISTRICT!AO15,0))","v":41208.352824752663},75060.891422001427,"Y",{"$f":"MAX('MDA2'!J15,T1_R1!L15,'T2'!J15,T3_R1!K15,T3_R2!K15)","v":0},{"$f":"MAX('MDA1'!K15,'MDA2'!K15,'MDA3'!I15,'MDA3'!L15,T1_R1!M15,'T2'!K15,T3_R1!L15,T3_R2!L15)","v":29357},{"$f":"MAX('MDA1'!L15,'MDA2'!L15,'MDA3'!J15,'MDA3'!M15,T1_R1!N15,'T2'!L15,T3_R1!M15,T3_R2!M15)","v":36400},65757,{"$f":"MAX('MDA2'!J15,T15)","v":0},{"$f":"MAX('MDA1'!K15,'MDA2'!K15,'MDA3'!I15,'MDA3'!L15,V15,AD15)","v":29357},{"$f":"MAX('MDA1'!L15,'MDA2'!L15,'MDA3'!J15,'MDA3'!M15,AF15)","v":36400},65757,87.604874861272535]
[{"$f":"IF(COUNTRY_INFO!A16=0,\" \",COUNTRY_INFO!A16)","v":"Zanzibar"},{"$f":"IF(COUNTRY_INFO!B16=0,\" \",COUNTRY_INFO!B16)","v":"Kusini Unguja"},{"$f":"IF(COUNTRY_INFO!C16=0,\" \",COUNTRY_INFO!C16)","v":"Kusini "},{"$f":"COUNTRY_INFO!L16","v":38126.666666666701},null,null,{"$f":"MAX('MDA1'!M16,'MDA2'!M16)","v":31319},{"$f":"IF(AND(COUNTRY_INFO!H16>0,COUNTRY_INFO!H16<4),IF(D16>MAX('MDA1'!M16,'MDA2'!M16),MAX('MDA1'!M16,'MDA2'!M16),D16),0)","v":31319},{"$f":"IF(AND(COUNTRY_INFO!H16>0,COUNTRY_INFO!H16<4), IF(G16/D16*100<>0, IF(G16/D16*100>100,100,G16/D16*100), \"-\"),0)","v":82.144605700297177},{"$f":"COUNTRY_INFO!M16","v":"Not required"},null,null,{"$f":"MAX('MDA1'!M16,MAX('MDA3'!I16,'MDA3'!L16)+MAX('MDA3'!J16,'MDA3'!M16))","v":31319},{"$f":"IF(AND(COUNTRY_INFO!I16>0,COUNTRY_INFO!I16<4),IF(J16>MAX('MDA1'!M16,MAX('MDA3'!I16,'MDA3'!L16)+MAX('MDA3'!J16,'MDA3'!M16)),MAX('MDA1'!M16,MAX('MDA3'!I16,'MDA3'!L16)+MAX('MDA3'!J16,'MDA3'!M16)),J16),0)","v":0},{"$f":"IF(AND(COUNTRY_INFO!I16>0,COUNTRY_INFO!I16<4), IF(M16/J16*100<>0, IF(M16/J16*100>100,100,M16/J16*100), \"-\"),0)","v":0},{"$f":"COUNTRY_INFO!N16","v":17195},null,null,{"$f":"SUM(MAX('MDA2'!J16, T1_R1!L16, MAX(T3_R1!K16, T3_R2!K16)), MAX('MDA1'!K16, 'MDA2'!K16, T1_R1!M16, MAX(T3_R1!L16, T3_R2!L16)), MAX('MDA1'!L16, 'MDA2'!L16, T1_R1!N16, MAX(T3_R1!M16, T3_R2!M16)))","v":34013},{"$f":"IF(AND(COUNTRY_INFO!J16>1,COUNTRY_INFO!J16<4),IF(COUNTRY_INFO!E16>MAX('MDA2'!J16,T1_R1!L16,MAX(T3_R1!K16,T3_R2!K16)),MAX('MDA2'!J16,T1_R1!L16,MAX(T3_R1!K16,T3_R2!K16)),COUNTRY_INFO!E16),0)","v":0},{"$f":"IF(AND(COUNTRY_INFO!J16>1,COUNTRY_INFO!J16<4), IF(T16/COUNTRY_INFO!E16*100<>0, IF(T16/COUNTRY_INFO!E16*100>100,100,T16/COUNTRY_INFO!E16*100), \"-\"),0)","v":"-"},{"$f":"IF(AND(COUNTRY_INFO!J16>1,COUNTRY_INFO!J16<4),IF(COUNTRY_INFO!F16>MAX('MDA1'!K16,'MDA2'!K16,T1_R1!M16,MAX(T3_R1!L16,T3_R2!L16)),MAX('MDA1'!K16,'MDA2'!K16,T1_R1!M16,MAX(T3_R1!L16,T3_R2!L16)),COUNTRY_INFO!F16),0)","v":11230},{"$f":"IF(AND(COUNTRY_INFO!J16>1,COUNTRY_INFO!J16<4), IF(V16/COUNTRY_INFO!F16*100<>0, IF(V16/COUNTRY_INFO!F16*100>100,100,V16/COUNTRY_INFO!F16*100), \"-\"),0)","v":91.189606171335768},11230,{"$f":"IF(AND(COUNTRY_INFO!J16>1,COUNTRY_INFO!J16<4), IF(S16/P16*100<>0, IF(X16/P16*100>100,100,X16/P16*100), \"-\"),0)","v":65.309683047397499},{"$f":"COUNTRY_INFO!O16","v":0},null,null,{"$f":"MAX(SUM(T1_R1!L16:'T1_R1'!N16),SUM(T1_R2!L16:'T1_R2'!N16))","v":0},{"$f":"IF(COUNTRY_INFO!K16=1,IF(COUNTRY_INFO!F16*0.33>MAX(T1_R1!M16,T1_R2!M16),MAX(T1_R1!M16,T1_R2!M16),COUNTRY_INFO!F16*0.33),IF(COUNTRY_INFO!K16=2,IF(COUNTRY_INFO!F16*0.5>MAX(T1_R1!M16,T1_R2!M16),MAX(T1_R1!M16,T1_R2!M16),COUNTRY_INFO!F16*0.5),IF(COUNTRY_INFO!K16=3,IF(COUNTRY_INFO!F16>MAX(T1_R1!M16,T1_R2!M16),MAX(T1_R1!M16,T1_R2!M16),COUNTRY_INFO!F16),0)))","v":0},{"$f":"IF(AND(COUNTRY_INFO!K16>0,COUNTRY_INFO!K16<4),IF(Z16>0,IF(COUNTRY_INFO!K16=1, AD16/(COUNTRY_INFO!F16*0.33)*100, IF(COUNTRY_INFO!K16=2, AD16/(COUNTRY_INFO!F16*0.5)*100, IF(COUNTRY_INFO!K16=3, AD16/COUNTRY_INFO!F16*100))),\"-\"),0)","v":0},{"$f":"IF(COUNTRY_INFO!K16=2,IF(COUNTRY_INFO!G16*0.2>MAX(T1_R1!N16,T1_R2!N16),MAX(T1_R1!N16,T1_R2!N16),COUNTRY_INFO!G16*0.2),IF(COUNTRY_INFO!K16=3,IF(COUNTRY_INFO!G16>MAX(T1_R1!N16,T1_R2!N16),MAX(T1_R1!N16,T1_R2!N16),COUNTRY_INFO!G16),0))","v":0},{"$f":"IF(AND(COUNTRY_INFO!K16>0,COUNTRY_INFO!K16<4),IF(Z16>0,IF(COUNTRY_INFO!K16=1, 0, IF(COUNTRY_INFO!K16=2, AF16/(COUNTRY_INFO!G16*0.2)*100, IF(COUNTRY_INFO!K16=3, AF16/COUNTRY_INFO!G16*100))),\"-\"),0)","v":0},0,{"$f":"IF(AND(COUNTRY_INFO!K16>0,COUNTRY_INFO!K16<4), IF(AC16/Z16*100<>0, IF(AH16/Z16*100>100,100,AH16/Z16*100), \"-\"),0)","v":0},null,{"$f":"IF(AND(D16<>0, D16<>\"Unknown\",D16<>\"Stopped\",D16<>\"Not required\"),D16/COUNTRY_INFO!D16, 0)","v":1},{"$f":"IF(AND(J16<>0,J16<>\"Unknown\",J16<>\"Stopped\",J16<>\"Not required\"),J16/COUNTRY_INFO!D16, 0)","v":0},{"$f":"IF(AND(P16<>0,P16<>\"Unknown\",P16<>\"Not required\"),P16/(COUNTRY_INFO!E16+COUNTRY_INFO!F16), 0)","v":1},{"$f":"IF(AND(Z16<>0,Z16<>\"Unknown\",Z16<>\"Not required\"),IF(COUNTRY_INFO!K16=1,1,IF(COUNTRY_INFO!K16=2,0.5*COUNTRY_INFO!F16/(0.5*COUNTRY_INFO!F16+0.2*COUNTRY_INFO!G16),IF(COUNTRY_INFO!K16=3,COUNTRY_INFO!F16/(COUNTRY_INFO!F16+COUNTRY_INFO!G16)))),0)","v":0},{"$f":"IF(AND(Z16<>0,Z16<>\"Unknown\",Z16<>\"Not required\"),IF(COUNTRY_INFO!K16=1,0,IF(COUNTRY_INFO!K16=2,0.2*COUNTRY_INFO!G16/(0.5*COUNTRY_INFO!F16+0.2*COUNTRY_INFO!G16),IF(COUNTRY_INFO!K16=3,COUNTRY_INFO!G16/(COUNTRY_INFO!F16+COUNTRY_INFO!G16)))),0)","v":0},{"$f":"MAX(COUNTRY_INFO!D16*AK16*PROFILE!$G$7,COUNTRY_INFO!D16*AL16*PROFILE!$G$7)","v":0},{"$f":"MAX(COUNTRY_INFO!D16*AK16*PROFILE!$G$8,COUNTRY_INFO!D16*AL16*PROFILE!$G$8,COUNTRY_INFO!D16*AM16*PROFILE!$G$8)","v":4880.2343694017763},{"$f":"MAX(COUNTRY_INFO!D16*AK16*PROFILE!$G$9,COUNTRY_INFO!D16*AL16*PROFILE!$G$9,COUNTRY_INFO!D16*AM16*PROFILE!$G$9,IF(AND(DISTRICT!Z16<>\"Unknown\",Z16<>\"Not required\"),COUNTRY_INFO!O16*DISTRICT!AN16,0))","v":12314.952131645005},{"$f":"MAX(COUNTRY_INFO!D16*AK16*PROFILE!$G$10,COUNTRY_INFO!D16*AL16*PROFILE!$G$10,IF(AND(DISTRICT!Z16<>\"Unknown\",Z16<>\"Not required\"),COUNTRY_INFO!O16*DISTRICT!AO16,0))","v":20931.526602857124},38126.713103903909,"Y",{"$f":"MAX('MDA2'!J16,T1_R1!L16,'T2'!J16,T3_R1!K16,T3_R2!K16)","v":0},{"$f":"MAX('MDA1'!K16,'MDA2'!K16,'MDA3'!I16,'MDA3'!L16,T1_R1!M16,'T2'!K16,T3_R1!L16,T3_R2!L16)","v":11230},{"$f":"MAX('MDA1'!L16,'MDA2'!L16,'MDA3'!J16,'MDA3'!M16,T1_R1!N16,'T2'!L16,T3_R1!M16,T3_R2!M16)","v":22783},34013,{"$f":"MAX('MDA2'!J16,T16)","v":0},{"$f":"MAX('MDA1'!K16,'MDA2'!K16,'MDA3'!I16,'MDA3'!L16,V16,AD16)","v":11230},{"$f":"MAX('MDA1'!L16,'MDA2'!L16,'MDA3'!J16,'MDA3'!M16,AF16)","v":20089},31319,82.144505650536018]
[{"$f":"IF(COUNTRY_INFO!A17=0,\" \",COUNTRY_INFO!A17)","v":"Zanzibar"},{"$f":"IF(COUNTRY_INFO!B17=0,\" \",COUNTRY_INFO!B17)","v":"Mjini Magharibi"},{"$f":"IF(COUNTRY_INFO!C17=0,\" \",COUNTRY_INFO!C17)","v":"Mjini "},{"$f":"COUNTRY_INFO!L17","v":172688.66666666701},null,null,{"$f":"MAX('MDA1'!M17,'MDA2'!M17)","v":136503},{"$f":"IF(AND(COUNTRY_INFO!H17>0,COUNTRY_INFO!H17<4),IF(D17>MAX('MDA1'!M17,'MDA2'!M17),MAX('MDA1'!M17,'MDA2'!M17),D17),0)","v":136503},{"$f":"IF(AND(COUNTRY_INFO!H17>0,COUNTRY_INFO!H17<4), IF(G17/D17*100<>0, IF(G17/D17*100>100,100,G17/D17*100), \"-\"),0)","v":79.045720043391995},{"$f":"COUNTRY_INFO!M17","v":"Not required"},null,null,{"$f":"MAX('MDA1'!M17,MAX('MDA3'!I17,'MDA3'!L17)+MAX('MDA3'!J17,'MDA3'!M17))","v":136503},{"$f":"IF(AND(COUNTRY_INFO!I17>0,COUNTRY_INFO!I17<4),IF(J17>MAX('MDA1'!M17,MAX('MDA3'!I17,'MDA3'!L17)+MAX('MDA3'!J17,'MDA3'!M17)),MAX('MDA1'!M17,MAX('MDA3'!I17,'MDA3'!L17)+MAX('MDA3'!J17,'MDA3'!M17)),J17),0)","v":0},{"$f":"IF(AND(COUNTRY_INFO!I17>0,COUNTRY_INFO!I17<4), IF(M17/J17*100<>0, IF(M17/J17*100>100,100,M17/J17*100), \"-\"),0)","v":0},{"$f":"COUNTRY_INFO!N17","v":77882},null,null,{"$f":"SUM(MAX('MDA2'!J17, T1_R1!L17, MAX(T3_R1!K17, T3_R2!K17)), MAX('MDA1'!K17, 'MDA2'!K17, T1_R1!M17, MAX(T3_R1!L17, T3_R2!L17)), MAX('MDA1'!L17, 'MDA2'!L17, T1_R1!N17, MAX(T3_R1!M17, T3_R2!M17)))","v":136503},{"$f":"IF(AND(COUNTRY_INFO!J17>1,COUNTRY_INFO!J17<4),IF(COUNTRY_INFO!E17>MAX('MDA2'!J17,T1_R1!L17,MAX(T3_R1!K17,T3_R2!K17)),MAX('MDA2'!J17,T1_R1!L17,MAX(T3_R1!K17,T3_R2!K17)),COUNTRY_INFO!E17),0)","v":0},{"$f":"IF(AND(COUNTRY_INFO!J17>1,COUNTRY_INFO!J17<4), IF(T17/COUNTRY_INFO!E17*100<>0, IF(T17/COUNTRY_INFO!E17*100>100,100,T17/COUNTRY_INFO!E17*100), \"-\"),0)","v":"-"},{"$f":"IF(AND(COUNTRY_INFO!J17>1,COUNTRY_INFO!J17<4),IF(COUNTRY_INFO!F17>MAX('MDA1'!K17,'MDA2'!K17,T1_R1!M17,MAX(T3_R1!L17,T3_R2!L17)),MAX('MDA1'!K17,'MDA2'!K17,T1_R1!M17,MAX(T3_R1!L17,T3_R2!L17)),COUNTRY_INFO!F17),0)","v":42172},{"$f":"IF(AND(COUNTRY_INFO!J17>1,COUNTRY_INFO!J17<4), IF(V17/COUNTRY_INFO!F17*100<>0, IF(V17/COUNTRY_INFO!F17*100>100,100,V17/COUNTRY_INFO!F17*100), \"-\"),0)","v":75.606870092151027},42172,{"$f":"IF(AND(COUNTRY_INFO!J17>1,COUNTRY_INFO!J17<4), IF(S17/P17*100<>0, IF(X17/P17*100>100,100,X17/P17*100), \"-\"),0)","v":54.148583754911272},{"$f":"COUNTRY_INFO!O17","v":18406.740000000002},null,null,{"$f":"MAX(SUM(T1_R1!L17:'T1_R1'!N17),SUM(T1_R2!L17:'T1_R2'!N17))","v":169210},{"$f":"IF(COUNTRY_INFO!K17=1,IF(COUNTRY_INFO!F17*0.33>MAX(T1_R1!M17,T1_R2!M17),MAX(T1_R1!M17,T1_R2!M17),COUNTRY_INFO!F17*0.33),IF(COUNTRY_INFO!K17=2,IF(COUNTRY_INFO!F17*0.5>MAX(T1_R1!M17,T1_R2!M17),MAX(T1_R1!M17,T1_R2!M17),COUNTRY_INFO!F17*0.5),IF(COUNTRY_INFO!K17=3,IF(COUNTRY_INFO!F17>MAX(T1_R1!M17,T1_R2!M17),MAX(T1_R1!M17,T1_R2!M17),COUNTRY_INFO!F17),0)))","v":18406.740000000002},{"$f":"IF(AND(COUNTRY_INFO!K17>0,COUNTRY_INFO!K17<4),IF(Z17>0,IF(COUNTRY_INFO!K17=1, AD17/(COUNTRY_INFO!F17*0.33)*100, IF(COUNTRY_INFO!K17=2, AD17/(COUNTRY_INFO!F17*0.5)*100, IF(COUNTRY_INFO!K17=3, AD17/COUNTRY_INFO!F17*100))),\"-\"),0)","v":100},{"$f":"IF(COUNTRY_INFO!K17=2,IF(COUNTRY_INFO!G17*0.2>MAX(T1_R1!N17,T1_R2!N17),MAX(T1_R1!N17,T1_R2!N17),COUNTRY_INFO!G17*0.2),IF(COUNTRY_INFO!K17=3,IF(COUNTRY_INFO!G17>MAX(T1_R1!N17,T1_R2!N17),MAX(T1_R1!N17,T1_R2!N17),COUNTRY_INFO!G17),0))","v":0},{"$f":"IF(AND(COUNTRY_INFO!K17>0,COUNTRY_INFO!K17<4),IF(Z17>0,IF(COUNTRY_INFO!K17=1, 0, IF(COUNTRY_INFO!K17=2, AF17/(COUNTRY_INFO!G17*0.2)*100, IF(COUNTRY_INFO!K17=3, AF17/COUNTRY_INFO!G17*100))),\"-\"),0)","v":0},18406.740000000002,{"$f":"IF(AND(COUNTRY_INFO!K17>0,COUNTRY_INFO!K17<4), IF(AC17/Z17*100<>0, IF(AH17/Z17*100>100,100,AH17/Z17*100), \"-\"),0)","v":100},null,{"$f":"IF(AND(D17<>0, D17<>\"Unknown\",D17<>\"Stopped\",D17<>\"Not required\"),D17/COUNTRY_INFO!D17, 0)","v":1},{"$f":"IF(AND(J17<>0,J17<>\"Unknown\",J17<>\"Stopped\",J17<>\"Not required\"),J17/COUNTRY_INFO!D17, 0)","v":0},{"$f":"IF(AND(P17<>0,P17<>\"Unknown\",P17<>\"Not required\"),P17/(COUNTRY_INFO!E17+COUNTRY_INFO!F17), 0)","v":1},{"$f":"IF(AND(Z17<>0,Z17<>\"Unknown\",Z17<>\"Not required\"),IF(COUNTRY_INFO!K17=1,1,IF(COUNTRY_INFO!K17=2,0.5*COUNTRY_INFO!F17/(0.5*COUNTRY_INFO!F17+0.2*COUNTRY_INFO!G17),IF(COUNTRY_INFO!K17=3,COUNTRY_INFO!F17/(COUNTRY_INFO!F17+COUNTRY_INFO!G17)))),0)","v":1},{"$f":"IF(AND(Z17<>0,Z17<>\"Unknown\",Z17<>\"Not required\"),IF(COUNTRY_INFO!K17=1,0,IF(COUNTRY_INFO!K17=2,0.2*COUNTRY_INFO!G17/(0.5*COUNTRY_INFO!F17+0.2*COUNTRY_INFO!G17),IF(COUNTRY_INFO!K17=3,COUNTRY_INFO!G17/(COUNTRY_INFO!F17+COUNTRY_INFO!G17)))),0)","v":0},{"$f":"MAX(COUNTRY_INFO!D17*AK17*PROFILE!$G$7,COUNTRY_INFO!D17*AL17*PROFILE!$G$7)","v":0},{"$f":"MAX(COUNTRY_INFO!D17*AK17*PROFILE!$G$8,COUNTRY_INFO!D17*AL17*PROFILE!$G$8,COUNTRY_INFO!D17*AM17*PROFILE!$G$8)","v":22104.244612856299},{"$f":"MAX(COUNTRY_INFO!D17*AK17*PROFILE!$G$9,COUNTRY_INFO!D17*AL17*PROFILE!$G$9,COUNTRY_INFO!D17*AM17*PROFILE!$G$9,IF(AND(DISTRICT!Z17<>\"Unknown\",Z17<>\"Not required\"),COUNTRY_INFO!O17*DISTRICT!AN17,0))","v":55778.615064109174},{"$f":"MAX(COUNTRY_INFO!D17*AK17*PROFILE!$G$10,COUNTRY_INFO!D17*AL17*PROFILE!$G$10,IF(AND(DISTRICT!Z17<>\"Unknown\",Z17<>\"Not required\"),COUNTRY_INFO!O17*DISTRICT!AO17,0))","v":94806.017319774342},172688.87699673983,"Y",{"$f":"MAX('MDA2'!J17,T1_R1!L17,'T2'!J17,T3_R1!K17,T3_R2!K17)","v":0},{"$f":"MAX('MDA1'!K17,'MDA2'!K17,'MDA3'!I17,'MDA3'!L17,T1_R1!M17,'T2'!K17,T3_R1!L17,T3_R2!L17)","v":42172},{"$f":"MAX('MDA1'!L17,'MDA2'!L17,'MDA3'!J17,'MDA3'!M17,T1_R1!N17,'T2'!L17,T3_R1!M17,T3_R2!M17)","v":94331},136503,{"$f":"MAX('MDA2'!J17,T17)","v":0},{"$f":"MAX('MDA1'!K17,'MDA2'!K17,'MDA3'!I17,'MDA3'!L17,V17,AD17)","v":42172},{"$f":"MAX('MDA1'!L17,'MDA2'!L17,'MDA3'!J17,'MDA3'!M17,AF17)","v":94331},136503,79.045623767984225]
[{"$f":"IF(COUNTRY_INFO!A18=0,\" \",COUNTRY_INFO!A18)","v":"Zanzibar"},{"$f":"IF(COUNTRY_INFO!B18=0,\" \",COUNTRY_INFO!B18)","v":"Mjini Magharibi"},{"$f":"IF(COUNTRY_INFO!C18=0,\" \",COUNTRY_INFO!C18)","v":"Magharibi A "},{"$f":"COUNTRY_INFO!L18","v":369408.33333333302},null,null,{"$f":"MAX('MDA1'!M18,'MDA2'!M18)","v":233415},{"$f":"IF(AND(COUNTRY_INFO!H18>0,COUNTRY_INFO!H18<4),IF(D18>MAX('MDA1'!M18,'MDA2'!M18),MAX('MDA1'!M18,'MDA2'!M18),D18),0)","v":233415},{"$f":"IF(AND(COUNTRY_INFO!H18>0,COUNTRY_INFO!H18<4), IF(G18/D18*100<>0, IF(G18/D18*100>100,100,G18/D18*100), \"-\"),0)","v":63.186176092400061},{"$f":"COUNTRY_INFO!M18","v":"Not required"},null,null,{"$f":"MAX('MDA1'!M18,MAX('MDA3'!I18,'MDA3'!L18)+MAX('MDA3'!J18,'MDA3'!M18))","v":233415},{"$f":"IF(AND(COUNTRY_INFO!I18>0,COUNTRY_INFO!I18<4),IF(J18>MAX('MDA1'!M18,MAX('MDA3'!I18,'MDA3'!L18)+MAX('MDA3'!J18,'MDA3'!M18)),MAX('MDA1'!M18,MAX('MDA3'!I18,'MDA3'!L18)+MAX('MDA3'!J18,'MDA3'!M18)),J18),0)","v":0},{"$f":"IF(AND(COUNTRY_INFO!I18>0,COUNTRY_INFO!I18<4), IF(M18/J18*100<>0, IF(M18/J18*100>100,100,M18/J18*100), \"-\"),0)","v":0},{"$f":"COUNTRY_INFO!N18","v":166603},null,null,{"$f":"SUM(MAX('MDA2'!J18, T1_R1!L18, MAX(T3_R1!K18, T3_R2!K18)), MAX('MDA1'!K18, 'MDA2'!K18, T1_R1!M18, MAX(T3_R1!L18, T3_R2!L18)), MAX('MDA1'!L18, 'MDA2'!L18, T1_R1!N18, MAX(T3_R1!M18, T3_R2!M18)))","v":233415},{"$f":"IF(AND(COUNTRY_INFO!J18>1,COUNTRY_INFO!J18<4),IF(COUNTRY_INFO!E18>MAX('MDA2'!J18,T1_R1!L18,MAX(T3_R1!K18,T3_R2!K18)),MAX('MDA2'!J18,T1_R1!L18,MAX(T3_R1!K18,T3_R2!K18)),COUNTRY_INFO!E18),0)","v":0},{"$f":"IF(AND(COUNTRY_INFO!J18>1,COUNTRY_INFO!J18<4), IF(T18/COUNTRY_INFO!E18*100<>0, IF(T18/COUNTRY_INFO!E18*100>100,100,T18/COUNTRY_INFO!E18*100), \"-\"),0)","v":"-"},{"$f":"IF(AND(COUNTRY_INFO!J18>1,COUNTRY_INFO!J18<4),IF(COUNTRY_INFO!F18>MAX('MDA1'!K18,'MDA2'!K18,T1_R1!M18,MAX(T3_R1!L18,T3_R2!L18)),MAX('MDA1'!K18,'MDA2'!K18,T1_R1!M18,MAX(T3_R1!L18,T3_R2!L18)),COUNTRY_INFO!F18),0)","v":80289},{"$f":"IF(AND(COUNTRY_INFO!J18>1,COUNTRY_INFO!J18<4), IF(V18/COUNTRY_INFO!F18*100<>0, IF(V18/COUNTRY_INFO!F18*100>100,100,V18/COUNTRY_INFO!F18*100), \"-\"),0)","v":67.289367158625197},80289,{"$f":"IF(AND(COUNTRY_INFO!J18>1,COUNTRY_INFO!J18<4), IF(S18/P18*100<>0, IF(X18/P18*100>100,100,X18/P18*100), \"-\"),0)","v":48.19180927114158},{"$f":"COUNTRY_INFO!O18","v":39375.270000000004},null,null,{"$f":"MAX(SUM(T1_R1!L18:'T1_R1'!N18),SUM(T1_R2!L18:'T1_R2'!N18))","v":203415},{"$f":"IF(COUNTRY_INFO!K18=1,IF(COUNTRY_INFO!F18*0.33>MAX(T1_R1!M18,T1_R2!M18),MAX(T1_R1!M18,T1_R2!M18),COUNTRY_INFO!F18*0.33),IF(COUNTRY_INFO!K18=2,IF(COUNTRY_INFO!F18*0.5>MAX(T1_R1!M18,T1_R2!M18),MAX(T1_R1!M18,T1_R2!M18),COUNTRY_INFO!F18*0.5),IF(COUNTRY_INFO!K18=3,IF(COUNTRY_INFO!F18>MAX(T1_R1!M18,T1_R2!M18),MAX(T1_R1!M18,T1_R2!M18),COUNTRY_INFO!F18),0)))","v":39375.270000000004},{"$f":"IF(AND(COUNTRY_INFO!K18>0,COUNTRY_INFO!K18<4),IF(Z18>0,IF(COUNTRY_INFO!K18=1, AD18/(COUNTRY_INFO!F18*0.33)*100, IF(COUNTRY_INFO!K18=2, AD18/(COUNTRY_INFO!F18*0.5)*100, IF(COUNTRY_INFO!K18=3, AD18/COUNTRY_INFO!F18*100))),\"-\"),0)","v":100},{"$f":"IF(COUNTRY_INFO!K18=2,IF(COUNTRY_INFO!G18*0.2>MAX(T1_R1!N18,T1_R2!N18),MAX(T1_R1!N18,T1_R2!N18),COUNTRY_INFO!G18*0.2),IF(COUNTRY_INFO!K18=3,IF(COUNTRY_INFO!G18>MAX(T1_R1!N18,T1_R2!N18),MAX(T1_R1!N18,T1_R2!N18),COUNTRY_INFO!G18),0))","v":0},{"$f":"IF(AND(COUNTRY_INFO!K18>0,COUNTRY_INFO!K18<4),IF(Z18>0,IF(COUNTRY_INFO!K18=1, 0, IF(COUNTRY_INFO!K18=2, AF18/(COUNTRY_INFO!G18*0.2)*100, IF(COUNTRY_INFO!K18=3, AF18/COUNTRY_INFO!G18*100))),\"-\"),0)","v":0},39375.270000000004,{"$f":"IF(AND(COUNTRY_INFO!K18>0,COUNTRY_INFO!K18<4), IF(AC18/Z18*100<>0, IF(AH18/Z18*100>100,100,AH18/Z18*100), \"-\"),0)","v":100},null,{"$f":"IF(AND(D18<>0, D18<>\"Unknown\",D18<>\"Stopped\",D18<>\"Not required\"),D18/COUNTRY_INFO!D18, 0)","v":1},{"$f":"IF(AND(J18<>0,J18<>\"Unknown\",J18<>\"Stopped\",J18<>\"Not required\"),J18/COUNTRY_INFO!D18, 0)","v":0},{"$f":"IF(AND(P18<>0,P18<>\"Unknown\",P18<>\"Not required\"),P18/(COUNTRY_INFO!E18+COUNTRY_INFO!F18), 0)","v":1},{"$f":"IF(AND(Z18<>0,Z18<>\"Unknown\",Z18<>\"Not required\"),IF(COUNTRY_INFO!K18=1,1,IF(COUNTRY_INFO!K18=2,0.5*COUNTRY_INFO!F18/(0.5*COUNTRY_INFO!F18+0.2*COUNTRY_INFO!G18),IF(COUNTRY_INFO!K18=3,COUNTRY_INFO!F18/(COUNTRY_INFO!F18+COUNTRY_INFO!G18)))),0)","v":1},{"$f":"IF(AND(Z18<>0,Z18<>\"Unknown\",Z18<>\"Not required\"),IF(COUNTRY_INFO!K18=1,0,IF(COUNTRY_INFO!K18=2,0.2*COUNTRY_INFO!G18/(0.5*COUNTRY_INFO!F18+0.2*COUNTRY_INFO!G18),IF(COUNTRY_INFO!K18=3,COUNTRY_INFO!G18/(COUNTRY_INFO!F18+COUNTRY_INFO!G18)))),0)","v":0},{"$f":"MAX(COUNTRY_INFO!D18*AK18*PROFILE!$G$7,COUNTRY_INFO!D18*AL18*PROFILE!$G$7)","v":0},{"$f":"MAX(COUNTRY_INFO!D18*AK18*PROFILE!$G$8,COUNTRY_INFO!D18*AL18*PROFILE!$G$8,COUNTRY_INFO!D18*AM18*PROFILE!$G$8)","v":47284.470484615093},{"$f":"MAX(COUNTRY_INFO!D18*AK18*PROFILE!$G$9,COUNTRY_INFO!D18*AL18*PROFILE!$G$9,COUNTRY_INFO!D18*AM18*PROFILE!$G$9,IF(AND(DISTRICT!Z18<>\"Unknown\",Z18<>\"Not required\"),COUNTRY_INFO!O18*DISTRICT!AN18,0))","v":119319.26758255168},{"$f":"MAX(COUNTRY_INFO!D18*AK18*PROFILE!$G$10,COUNTRY_INFO!D18*AL18*PROFILE!$G$10,IF(AND(DISTRICT!Z18<>\"Unknown\",Z18<>\"Not required\"),COUNTRY_INFO!O18*DISTRICT!AO18,0))","v":202805.04519541262},369408.78326257935,"Y",{"$f":"MAX('MDA2'!J18,T1_R1!L18,'T2'!J18,T3_R1!K18,T3_R2!K18)","v":0},{"$f":"MAX('MDA1'!K18,'MDA2'!K18,'MDA3'!I18,'MDA3'!L18,T1_R1!M18,'T2'!K18,T3_R1!L18,T3_R2!L18)","v":80289},{"$f":"MAX('MDA1'!L18,'MDA2'!L18,'MDA3'!J18,'MDA3'!M18,T1_R1!N18,'T2'!L18,T3_R1!M18,T3_R2!M18)","v":153126},233415,{"$f":"MAX('MDA2'!J18,T18)","v":0},{"$f":"MAX('MDA1'!K18,'MDA2'!K18,'MDA3'!I18,'MDA3'!L18,V18,AD18)","v":80289},{"$f":"MAX('MDA1'!L18,'MDA2'!L18,'MDA3'!J18,'MDA3'!M18,AF18)","v":153126},233415,63.186099133459514]

{"sheet":"SUMMARY","index":11,"n_rows":70,"n_cols":8,"rows_kept":70,"cut":false,"hidden":false,"merged":[[15,1,15,3],[0,1,0,5],[1,1,1,7],[5,1,11,7],[3,3,3,5],[32,1,32,2],[33,1,33,2],[34,1,34,2],[35,1,35,2],[23,1,23,5],[31,1,31,2],[24,1,24,5],[25,1,25,5],[26,1,26,5],[27,1,27,5],[69,1,69,2],[36,1,36,2],[37,1,37,2],[38,1,38,2],[66,1,66,7],[62,1,62,2],[68,1,68,2],[63,3,64,7],[49,1,49,7],[62,3,62,7],[50,3,50,4],[54,1,60,7]]}
[]
[null,"PC Joint Reporting Form v.3"]
[]
[null,"Country",null,{"$f":"IF(INTRO!$E$34<>0,INTRO!$E$34,\" \")","v":"Zanzibar"},null,null,"Year",{"$f":"IF(INTRO!$E$36<>0,INTRO!$E$36,\" \")","v":2017}]
[]
[null,"National authorities are requested to complete the Joint Reporting Form (JRF) for submission to the World Health Organization any time before 15 August of the current year for reporting data on PC interventions implemented during the previous year."]
[]
[]
[]
[]
[]
[]
[]
[null,"Number of people received treatment (at least once) for the diseases"]
[]
[null,null,null,null,"PreSAC","SAC","Adults","Total"]
[null,"Lymphatic filariasis",null,null,"Not eligible",321850,606158,{"$f":"SUM(E17:G17)","v":928008}]
[null,"Onchocerciasis",null,null,"Not eligible",321850,606158,{"$f":"SUM(E18:G18)","v":928008}]
[null,"Soil-transmitted helminthiases",null,null,0,347963,672479,{"$f":"SUM(E19:G19)","v":1020442}]
[null,"Schistosomiasis",null,null,"Not eligible",281108,571738,{"$f":"SUM(E20:G20)","v":852846}]
[]
[null,"Coverage of PC interventions for the diseases (%)"]
[]
[null,null,null,null,null,null,"Geographical","National"]
[null,"Lymphatic filariasis",null,null,null,null,100,70.643022569642227]
[null,"Onchocerciasis",null,null,null,null,0,0]
[null,"Soil-transmitted helminthiases",null,null,null,null,100,55.590231947365396]
[null,"Schistosomiasis",null,null,null,null,100,91.804972861109405]
[]
[null,"Number of people treated and programme coverage (%) by PC interventions"]
[]
[null,null,null,"PreSAC","SAC","Adults","Total","Coverage (%)"]
[null,"MDA 1 (IVM+ALB)",null,"Not eligible",{"$f":"'MDA1'!$K$4","v":321850},{"$f":"'MDA1'!$L$4","v":606158},{"$f":"'MDA1'!$M$4","v":928008},{"$f":"'MDA1'!$Q$4","v":79.612646634421537}]
[null,"MDA 2 (DEC+ALB)",null,{"$f":"'MDA2'!$J$4","v":0},{"$f":"'MDA2'!$K$4","v":0},{"$f":"'MDA2'!$L$4","v":0},{"$f":"'MDA2'!$M$4","v":0},{"$f":"'MDA2'!$Q$4","v":" "}]
[null,"MDA 3 (IVM)",null,"Not eligible",{"$f":"'MDA3'!$O$4","v":0},{"$f":"'MDA3'!$P$4","v":0},{"$f":"'MDA3'!$Q$4","v":0},{"$f":"'MDA3'!$T$4","v":" "}]
[null,"T 1 (PZQ+ALB/MBD) - round 1",null,{"$f":"IF(T1_R1!$L$4<>0,T1_R1!$L$4,\"Not targeted\")","v":"Not targeted"},{"$f":"T1_R1!$M$4","v":256620},{"$f":"IF(T1_R1!$N$4<>0,T1_R1!$N$4,\"Not targeted\")","v":508069},{"$f":"T1_R1!$O$4","v":764689},{"$f":"T1_R1!$S$4","v":68.750674300345963}]
[null,"T 1 (PZQ+ALB/MBD) - round 2",null,{"$f":"IF('T2'!$J$4<>0,'T2'!$J$4,\"Not targeted\")","v":"Not targeted"},{"$f":"T1_R2!$M$4","v":243761},{"$f":"IF(T1_R2!$N$4<>0,T1_R2!$N$4,\"Not targeted\")","v":526953},{"$f":"T1_R2!$O$4","v":770714},{"$f":"T1_R2!$S$4","v":69.292362244934651}]
[null,"T 3 (ALB/MBD) - round 1",null,{"$f":"T3_R1!$K$4","v":0},{"$f":"T3_R1!$L$4","v":9306},{"$f":"IF(T3_R1!$M$4<>0,T3_R1!$M$4,\"Not targeted\")","v":19208},{"$f":"T3_R1!$N$4","v":28514},{"$f":"T3_R1!$R$4","v":85.764129094354374}]
[null,"T 3 (ALB/MBD) - round 2",null,{"$f":"T3_R2!$K$4","v":0},{"$f":"T3_R2!$L$4","v":9325},{"$f":"IF(T3_R2!$M$4<>0,T3_R2!$M$4,\"Not targeted\")","v":22783},{"$f":"T3_R2!$N$4","v":32108},{"$f":"T3_R2!$R$4","v":96.574126988901256}]
[]
[null,"Inventory of PC medicines in the country"]
[]
[null,null,"IVM","DEC","ALB (LF)","ALB (STH)","MBD","PZQ"]
[null,"Available"]
[null,"Distributed"]
[null,"Wasted"]
[null,"Received"]
[null,"Remaining",0,0,0,0,0,0]
[]
[null,"Please indicate the medicine has been used to treat PreSAC for STH and delivery channels"]
[null,"PC medicine",null,"Delivery channels",null,null,"Source"]
[]
[null,"Additional information"]
[]
[]
[]
[]
[]
[]
[]
[]
[]
[null,"Name and signature of NTD coordinator or Ministry of Health representative:"]
[]
[null,"Date:"]
[]
[null,"Please send the national report (signed and in electronic format) to the concerned WR with copy to:"]
[]
[null,"WHO headquarters",null,"PC_JointForms@who.int"]
[null,"WHO Regional Office",null,"Regional Advisor for NTD"]

{"sheet":"PROFILE","index":12,"n_rows":124,"n_cols":8,"rows_kept":124,"cut":false,"hidden":true,"merged":[[12,1,12,6],[47,1,47,3],[51,1,51,3],[55,1,55,3],[65,1,65,3],[29,1,29,3],[21,1,21,6],[16,1,16,6],[18,1,18,6],[17,1,17,6],[63,1,63,3],[13,1,13,6],[14,1,14,6],[15,1,15,6],[0,1,0,5],[1,1,1,7],[3,3,3,5],[69,1,69,3],[73,1,73,3],[26,1,26,3],[27,1,27,3],[28,1,28,3],[59,1,59,3],[5,3,5,5],[30,1,30,3],[34,1,34,3],[42,1,42,3],[6,1,6,2],[7,1,7,2],[8,1,8,2],[9,1,9,2],[4,1,4,7],[5,1,5,2],[81,1,81,3],[19,1,19,6],[9,3,9,5],[43,1,43,3],[77,1,77,3],[80,1,80,3],[6,3,6,5],[7,3,7,5],[8,3,8,5],[78,1,78,3],[23,1,23,3],[11,1,11,6],[20,1,20,6],[79,1,79,3],[123,1,124,7],[85,6,85,7],[87,6,87,7],[89,6,89,7],[86,6,86,7],[88,6,88,7]]}
[]
[null,"PC Joint Reporting Form v.3 - Country Profile"]
[]
[null,"Country",null,{"$f":"IF(INTRO!$E$34<>0,INTRO!$E$34,\" \")","v":"Zanzibar"},null,null,"Year",{"$f":"IF(INTRO!$E$36<>0,INTRO!$E$36,\" \")","v":2017}]
[null,"!!! WARNING !!!\nBefore analysing data in the country profile please be ensure that your report in the SUMMARY tab is updated"]
[null,"Total population",null,null,null,null,1,{"$f":"COUNTRY_INFO!D4","v":1313658.3999999985}]
[null,"Population — other age groups",null,null,null,null,{"$f":"IF($H$6<>0,H7/$H$6,0)","v":-1.217972649122571E-6},{"$f":"H6-SUM(H8:H10)","v":-1.6000000014901161}]
[null,"Population — Pre-SAC",null,{"$f":"INTRO!B48","v":"1-4 years age"},null,null,{"$f":"IF($H$6<>0,H8/$H$6,0)","v":0.12800055174160968},{"$f":"COUNTRY_INFO!E4","v":168149}]
[null,"Population — SAC",null,{"$f":"INTRO!B49","v":"5-14 years age"},null,null,{"$f":"IF($H$6<>0,H9/$H$6,0)","v":0.32300101761614775},{"$f":"COUNTRY_INFO!F4","v":424313}]
[null,"Population — Adults",null,{"$f":"INTRO!B50","v":"15 years +"},null,null,0.5489996486148917,{"$f":"COUNTRY_INFO!G4","v":721198}]
[]
[null,"Total number of people requiring PC for at least one disease (LF, ONCHO, STH, SCH)",null,null,null,null,null,{"$f":"DISTRICT!AT6","v":1313660}]
[null,"Proportion of number of people requiring PC for at least one disease out of total population",null,null,null,null,null,{"$f":"IF(H6<>0,H12/H6,0)","v":1.0000012179726492}]
[null,"Number of IUs requiring PC for at least one disease (LF, ONCHO, STH, SCH)",null,null,null,null,null,{"$f":"COUNTIF(DISTRICT!AT9:AT1000,\">0\")","v":10}]
[null,"Number of IUs received PC for at least one disease (LF, ONCHO, STH, SCH)",null,null,null,null,null,{"$f":"COUNTIF(DISTRICT!AY9:AY1000,\">0\")","v":10}]
[null,"Proportion of IUs requiring PC for at least one disease and received it",null,null,null,null,null,{"$f":"IF(H14<>0,H15/H14,0)","v":1}]
[null,"Total number of people received PC for at least one disease (LF, ONCHO, STH, SCH)",null,null,null,null,null,{"$f":"DISTRICT!AY6","v":974702}]
[null,"Total number of people in need who received PC for at least one disease (LF, ONCHO, STH, SCH)",null,null,null,null,null,{"$f":"DISTRICT!BC6","v":940621}]
[null,"Coverage of PC for at least one disease (LF, ONCHO, STH, SCH)",null,null,null,null,null,{"$f":"DISTRICT!BD6","v":0.7160307842211836}]
[null,"Number of IUs received treatment for all diseases requiring PC in those IUs",null,null,null,null,null,{"$f":"DISTRICT!AU6","v":10}]
[null,"Population requring PC in IUs which received treatment for all diseases in need of PC",null,null,null,null,null,{"$f":"SUMIF(DISTRICT!AU9:AU1000,\"Y\",DISTRICT!AT9:AT1000)","v":1313660}]
[null,"Population received PC in IUs which were treated for all diseases in need of PC",null,null,null,null,null,{"$f":"SUMIF(DISTRICT!AU9:AU1000,\"Y\",DISTRICT!AY9:AY1000)","v":974702}]
[]
[null,null,null,null,"LF","ONCHO","STH","SCH"]
[]
[null,"Diseases requiring PC in the country",null,null,{"$f":"IF(INTRO!E38=\"Endemic\",\"Yes\",\"No\")","v":"Yes"},{"$f":"IF(INTRO!E40=\"Endemic\",\"Yes\",\"No\")","v":"No"},{"$f":"IF(INTRO!E42=\"Endemic\",\"Yes\",\"No\")","v":"Yes"},{"$f":"IF(INTRO!E44=\"Endemic\",\"Yes\",\"No\")","v":"Yes"}]
[null,"Number of implementation units (IUs) in the country",null,null,{"$f":"IF(E26=\"Yes\",INTRO!$E$46,\"-\")","v":10},{"$f":"IF(F26=\"Yes\",INTRO!$E$46,\"-\")","v":"-"},{"$f":"IF(G26=\"Yes\",INTRO!$E$46,\"-\")","v":10},{"$f":"IF(H26=\"Yes\",INTRO!$E$46,\"-\")","v":10}]
[null,"Number of IUs with endemicity status known",null,null,{"$f":"IF(E26=\"Yes\",E27-E29,\"-\")","v":10},{"$f":"IF(F26=\"Yes\",F27-F29,\"-\")","v":"-"},{"$f":"IF(G26=\"Yes\",G27-G29,\"-\")","v":10},{"$f":"IF(H26=\"Yes\",H27-H29,\"-\")","v":10}]
[null,"Number of IUs with endemicity status unknown",null,null,{"$f":"IF(E26=\"Yes\",E27-(992-COUNTIF(COUNTRY_INFO!H$9:H$1000,\"\"))+COUNTIF(COUNTRY_INFO!H$9:H$1000,\"=4\"),\"-\")","v":0},{"$f":"IF(F26=\"Yes\",F27-(992-COUNTIF(COUNTRY_INFO!I$9:I$1000,\"\"))+COUNTIF(COUNTRY_INFO!I$9:I$1000,\"=4\"),\"-\")","v":"-"},{"$f":"IF(G26=\"Yes\",G27-(992-COUNTIF(COUNTRY_INFO!J$9:J$1000,\"\"))+COUNTIF(COUNTRY_INFO!J$9:J$1000,\"=4\")+COUNTIF(COUNTRY_INFO!J$9:J$1000,\"=5\"),\"-\")","v":0},{"$f":"IF(H26=\"Yes\",H27-(992-COUNTIF(COUNTRY_INFO!K$9:K$1000,\"\"))+COUNTIF(COUNTRY_INFO!K$9:K$1000,\"=4\")+COUNTIF(COUNTRY_INFO!K$9:K$1000,\"=5\"),\"-\")","v":0}]
[null,"Number of non-endemic IUs",null,null,{"$f":"IF(E26=\"Yes\",COUNTIF(COUNTRY_INFO!H$9:H$1000,\"=0\"),\"-\")","v":0},{"$f":"IF(F26=\"Yes\",COUNTIF(COUNTRY_INFO!I$9:I$1000,\"=0\"),\"-\")","v":"-"},{"$f":"IF(G26=\"Yes\",COUNTIF(COUNTRY_INFO!J$9:J$1000,\"=0\"),\"-\")","v":0},{"$f":"IF(H26=\"Yes\",COUNTIF(COUNTRY_INFO!K$9:K$1000,\"=0\"),\"-\")","v":1}]
[null,"Number of IUs requiring PC (total)",null,null,{"$f":"COUNTIF(COUNTRY_INFO!H$9:H$1000,\"=1\")","v":10},{"$f":"COUNTIF(COUNTRY_INFO!I$9:I$1000,\"=1\")","v":0},{"$f":"SUM(G33:G34)","v":10},{"$f":"SUM(H32:H34)","v":9}]
[null,null,null,"low prevalence",null,null,{"$f":"COUNTIF(COUNTRY_INFO!J$9:J$1000,\"=1\")","v":0},{"$f":"COUNTIF(COUNTRY_INFO!K$9:K$1000,\"=1\")","v":5}]
[null,null,null,"moderate prevalence",null,null,{"$f":"COUNTIF(COUNTRY_INFO!J$9:J$1000,\"=2\")","v":3},{"$f":"COUNTIF(COUNTRY_INFO!K$9:K$1000,\"=2\")","v":4}]
[null,null,null,"high prevalence",null,null,{"$f":"COUNTIF(COUNTRY_INFO!J$9:J$1000,\"=3\")","v":7},{"$f":"COUNTIF(COUNTRY_INFO!K$9:K$1000,\"=3\")","v":0}]
[null,"Population requiring PC in the country (total)",null,null,{"$f":"COUNTRY_INFO!L4","v":1313658.3999999985},{"$f":"COUNTRY_INFO!M4","v":0},{"$f":"COUNTRY_INFO!N4","v":592462},{"$f":"COUNTRY_INFO!O4","v":208864.46999999997}]
[null,null,"Pre-SAC","moderate prevalence",null,null,{"$f":"SUMIF(COUNTRY_INFO!J$9:J$1000,\"=2\",COUNTRY_INFO!E$9:E$1000)","v":74268}]
[null,null,null,"high prevalence",null,null,{"$f":"SUMIF(COUNTRY_INFO!J$9:J$1000,\"=3\",COUNTRY_INFO!E$9:E$1000)","v":93881}]
[null,null,"SAC","low prevalence",null,null,null,{"$f":"SUMIF(COUNTRY_INFO!K$9:K$1000,\"=1\",COUNTRY_INFO!F$9:F$1000)*0.33","v":88779.57}]
[null,null,null,"moderate prevalence",null,null,{"$f":"SUMIF(COUNTRY_INFO!J$9:J$1000,\"=2\",COUNTRY_INFO!F$9:F$1000)","v":187412},{"$f":"SUMIF(COUNTRY_INFO!K$9:K$1000,\"=2\",COUNTRY_INFO!F$9:F$1000)*0.5","v":71484.5}]
[null,null,null,"high prevalence",null,null,{"$f":"SUMIF(COUNTRY_INFO!J$9:J$1000,\"=3\",COUNTRY_INFO!F$9:F$1000)","v":236901},{"$f":"SUMIF(COUNTRY_INFO!K$9:K$1000,\"=3\",COUNTRY_INFO!F$9:F$1000)","v":0}]
[null,null,"Adults","moderate prevalence",null,null,null,{"$f":"SUMIF(COUNTRY_INFO!K$9:K$1000,\"=2\",COUNTRY_INFO!G$9:G$1000)*0.2","v":48600.4}]
[null,null,null,"high prevalence",null,null,null,{"$f":"SUMIF(COUNTRY_INFO!K$9:K$1000,\"=3\",COUNTRY_INFO!G$9:G$1000)","v":0}]
[null,"Number of IUs where PC was implemented (total)",null,null,{"$f":"COUNTIF(DISTRICT!G$9:G$1000,\">0\")","v":10},{"$f":"COUNTIF(DISTRICT!M$9:M$1000,\">0\")","v":10},{"$f":"COUNTIF(DISTRICT!S$9:S$1000,\">0\")","v":10},{"$f":"COUNTIF(DISTRICT!AC$9:AC$1000,\">0\")","v":9}]
[null,"Number of IUs in need where PC was implemented (total)",null,null,{"$f":"COUNTIF(DISTRICT!H$9:H$1000,\">0\")","v":10},{"$f":"COUNTIF(DISTRICT!N$9:N$1000,\">0\")","v":0},{"$f":"COUNTIF(DISTRICT!X$9:X$1000,\">0\")","v":10},{"$f":"COUNTIF(DISTRICT!AH$9:AH$1000,\">0\")","v":9}]
[null,null,"Pre-SAC",null,null,null,{"$f":"COUNTIF(DISTRICT!T$9:T$1000,\">0\")","v":0}]
[null,null,"SAC",null,null,null,{"$f":"COUNTIF(DISTRICT!V$9:V$1000,\">0\")","v":10},{"$f":"COUNTIF(DISTRICT!AD$9:AD$1000,\">0\")","v":9}]
[null,null,"Adults",null,null,null,null,{"$f":"COUNTIF(DISTRICT!AF$9:AF$1000,\">0\")","v":4}]
[null,"Number of individuals treated (total)",null,null,{"$f":"DISTRICT!G4","v":928008},{"$f":"DISTRICT!M4","v":928008},{"$f":"DISTRICT!S4","v":974702},{"$f":"DISTRICT!AC4","v":844760}]
[null,null,"Pre-SAC",null,{"$f":"SUMMARY!$E17","v":"Not eligible"},{"$f":"SUMMARY!$E18","v":"Not eligible"},{"$f":"SUMMARY!$E19","v":0},{"$f":"SUMMARY!$E20","v":"Not eligible"}]
[null,null,"SAC",null,{"$f":"SUMMARY!$F17","v":321850},{"$f":"SUMMARY!$F18","v":321850},{"$f":"SUMMARY!$F19","v":347963},{"$f":"SUMMARY!$F20","v":281108}]
[null,null,"Adults",null,{"$f":"SUMMARY!$G17","v":606158},{"$f":"SUMMARY!$G18","v":606158},{"$f":"SUMMARY!$G19","v":672479},{"$f":"SUMMARY!$G20","v":571738}]
[null,"Number of individuals in need treated (total)",null,null,{"$f":"DISTRICT!H4","v":928008},{"$f":"DISTRICT!N4","v":0},{"$f":"DISTRICT!X4","v":329351},{"$f":"DISTRICT!AH4","v":191747.96999999997}]
[null,null,"Pre-SAC",null,null,null,{"$f":"DISTRICT!T4","v":0}]
[null,null,"SAC",null,null,null,{"$f":"DISTRICT!V4","v":329351},{"$f":"DISTRICT!AD4","v":143147.57}]
[null,null,"Adults",null,null,null,null,{"$f":"DISTRICT!AF4","v":48600.4}]
[null,"Geographical coverage (all ages)",null,null,{"$f":"IF(E31<>0,E44/E31,0)","v":1},{"$f":"IF(F31<>0,F44/F31,0)","v":0},{"$f":"IF(G31<>0,G44/G31,0)","v":1},{"$f":"IF(H31<>0,H44/H31,0)","v":1}]
[null,null,"Pre-SAC",null,null,null,{"$f":"IF(G31<>0,G45/G31,0)","v":0}]
[null,null,"SAC",null,null,null,{"$f":"IF(G31<>0,G46/G31,0)","v":1},{"$f":"IF(H31<>0,H46/H31,0)","v":1}]
[null,null,"Adults",null,null,null,null,{"$f":"IF(SUM(H33:H34)<>0,H47/SUM(H33:H34),0)","v":1}]
[null,"National coverage (total)",null,null,{"$f":"IF(E35<>0,E52/E35,0)","v":0.70643022569642233},{"$f":"IF(F35<>0,F52/F35,0)","v":0},{"$f":"IF(G35<>0,G52/G35,0)","v":0.55590231947365398},{"$f":"IF(H35<>0,H52/H35,0)","v":0.91804972861109402}]
[null,null,"Pre-SAC",null,null,null,{"$f":"IF(SUM(G36:G37)<>0,G53/SUM(G36:G37),0)","v":0}]
[null,null,"SAC",null,null,null,{"$f":"IF(SUM(G39:G40)<>0,G54/SUM(G39:G40),0)","v":0.77619823102285346},{"$f":"IF(SUM(H38:H40)<>0,H54/SUM(H38:H40),0)","v":0.89319814478691328}]
[null,null,"Adults",null,null,null,null,{"$f":"IF(SUM(H41:H42)<>0,H55/SUM(H41:H42),0)","v":1}]
[null,null,null,null,"LF","ONCHO","STH","SCH"]
[]
[null,"Number of IUs achieved effective coverage (all ages)",null,null,{"$f":"COUNTIF(DISTRICT!I$9:I$1000,\">=65\")","v":7},{"$f":"COUNTIF(DISTRICT!O$9:O$1000,\">=65\")","v":0},{"$f":"COUNTIF(DISTRICT!Y$9:Y$1000,\">=75\")","v":0},{"$f":"COUNTIF(DISTRICT!AI$9:AI$1000,\">=75\")","v":8}]
[null,null,"Pre-SAC",null,null,null,{"$f":"COUNTIF(DISTRICT!U$9:U$1000,\">=75\")","v":0}]
[null,null,"SAC",null,null,null,{"$f":"COUNTIF(DISTRICT!W$9:W$1000,\">=75\")","v":7},{"$f":"COUNTIF(DISTRICT!AE$9:AE$1000,\">=75\")","v":8}]
[null,null,"Adults",null,null,null,null,{"$f":"COUNTIF(DISTRICT!AG$9:AG$1000,\">=75\")","v":4}]
[null,"Number of individuals in need treated in IUs achieved effective coverage (total)",null,null,{"$f":"SUMIF(DISTRICT!I9:I1000,\">=65\",DISTRICT!H9:H1000)","v":562224},{"$f":"SUMIF(DISTRICT!O9:O1000,\">=65\",DISTRICT!N9:N1000)","v":0},{"$f":"SUMIF(DISTRICT!Y9:Y1000,\">=75\",DISTRICT!X9:X1000)","v":0},{"$f":"SUMIF(DISTRICT!AI9:AI1000,\">=75\",DISTRICT!AH9:AH1000)","v":167360.57}]
[null,null,"Pre-SAC",null,null,null,{"$f":"SUMIF(DISTRICT!U9:U1000,\">=75\",DISTRICT!T9:T1000)","v":0}]
[null,null,"SAC",null,null,null,{"$f":"SUMIF(DISTRICT!W9:W1000,\">=75\",DISTRICT!V9:V1000)","v":192781},{"$f":"SUMIF(DISTRICT!AE9:AE1000,\">=75\",DISTRICT!AD9:AD1000)","v":135557.57}]
[null,null,"Adults",null,null,null,null,{"$f":"SUMIF(DISTRICT!AG9:AG1000,\">=75\",DISTRICT!AF9:AF1000)","v":48600.4}]
[null,"Proportion of IUs requiring PC and achieved effective coverage (total)",null,null,{"$f":"IF(E44<>0,E66/E44,0)","v":0.7},{"$f":"IF(F44<>0,F66/F44,0)","v":0},{"$f":"IF(G44<>0,G66/G44,0)","v":0},{"$f":"IF(H44<>0,H66/H44,0)","v":0.88888888888888884}]
[null,null,"Pre-SAC",null,null,null,{"$f":"IF(G45<>0,G67/G45,0)","v":0}]
[null,null,"SAC",null,null,null,{"$f":"IF(G46<>0,G68/G46,0)","v":0.7},{"$f":"IF(H46<>0,H68/H46,0)","v":0.88888888888888884}]
[null,null,"Adults",null,null,null,null,{"$f":"IF(H47<>0,H69/H47,0)","v":1}]
[null,"Number of implementation units where PC was stopped (i.e. under surveillance)",null,null,{"$f":"COUNTIF(COUNTRY_INFO!H$9:H$1000,\"=99\")","v":0},{"$f":"COUNTIF(COUNTRY_INFO!I$9:I$1000,\"=99\")","v":0}]
[null,"Number of individuals in IUs no longer requiring PC (stopped)",null,null,{"$f":"SUMIF(COUNTRY_INFO!H$9:H$1000,\"=99\",COUNTRY_INFO!D$9:D$1000)","v":0},{"$f":"SUMIF(COUNTRY_INFO!I$9:I$1000,\"=99\",COUNTRY_INFO!D$9:D$1000)","v":0}]
[null,"Number of individuals requiring PC living in IUs targeted with PC",null,null,{"$f":"SUMIF(DISTRICT!H$9:H$1000,\">0\",DISTRICT!D$9:D$1000)","v":1313658.3999999985},{"$f":"SUMIF(DISTRICT!N$9:N$1000,\">0\",DISTRICT!J$9:J$1000)","v":0},{"$f":"SUMIF(DISTRICT!X$9:X$1000,\">0\",DISTRICT!P$9:P$1000)","v":592462},{"$f":"SUMIF(DISTRICT!AH$9:AH$1000,\">0\",DISTRICT!Z$9:Z$1000)","v":208864.46999999997}]
[null,"Number of individuals requiring PC living in IUs not targeted with PC",null,null,{"$f":"SUMIF(DISTRICT!H$9:H$1000,\"=0\",DISTRICT!D$9:D$1000)","v":0},{"$f":"SUMIF(DISTRICT!N$9:N$1000,\"=0\",DISTRICT!J$9:J$1000)","v":0},{"$f":"SUMIF(DISTRICT!X$9:X$1000,\"=0\",DISTRICT!P$9:P$1000)","v":0},{"$f":"SUMIF(DISTRICT!AH$9:AH$1000,\"=0\",DISTRICT!Z$9:Z$1000)","v":0}]
[null,null,null,null,{"$f":"E35-E52","v":385650.39999999851},{"$f":"F35-F52","v":0},263111,17116.5]
[null,"Number of IUs requiring and receiving PC",null,null,{"$f":"E31-E44","v":0},{"$f":"F31-F44","v":0},0,0]
[null,null,null,null,{"$f":"E27-E31-E29","v":0},{"$error":"#VALUE!"},0,{"$f":"H27-H31-H29","v":1}]
[]
[null,null,null,null,null,null,"Requiring and receiving PC"]
[null,null,null,null,null,null,"Requiring and not receiving PC"]
[null,null,null,null,null,null,"Not requiring PC"]
[null,null,null,null,null,null,"Status unknown"]
[]
[]
[]
[]
[]
[]
[]
[]
[]
[]
[]
[]
[]
[]
[]
[]
[]
[]
[]
[]
[]
[]
[]
[]
[]
[]
[]
[]
[]
[]
[]
[]
[]
[]
[null,"Click here to access data Preventive Chemotherapy Data Portal"]