{"text_format":"1","workbook":"xlsx","n_sheets":13,"sheets":["INTRO","COUNTRY_INFO","MDA1","MDA2","MDA3","T1","T2","T3_R1","T3_R2","DISTRICT","SUMMARY","PROFILE","DATA_POLICY"],"not_rendered":{"charts":8,"images":3,"macros":1,"external_links":0,"defined_names":5,"comments":11,"pivot_tables":0},"unopened":[],"bounds":{"document_bytes":16777216,"sheet_cells":100000,"rows_first":2000,"rows_last":500,"rows_between":2000,"halvings":0,"cell_chars":16384,"cell_head_chars":4096},"cells_cut":0,"cells_raw":0,"read":"whole","date_system":"1900"}

{"sheet":"INTRO","index":0,"n_rows":50,"n_cols":5,"rows_kept":50,"cut":false,"hidden":false,"merged":[[7,2,7,4],[8,2,8,4],[0,1,0,4],[1,1,1,4],[2,1,2,4],[3,1,3,4],[4,1,4,4],[5,1,5,4],[9,2,9,4],[11,2,11,4],[12,1,12,4],[13,1,13,4],[14,1,14,4],[22,1,22,4],[23,2,24,4],[25,1,25,4],[15,1,15,4],[16,1,16,4],[17,1,17,4],[18,1,18,4],[19,2,19,4],[45,1,45,2],[10,2,10,4],[41,1,41,2],[43,1,43,2],[46,1,46,4],[33,1,33,2],[35,1,35,2],[26,2,27,4],[37,1,37,2],[39,1,39,2],[28,1,28,4],[29,2,29,4],[30,1,30,4],[31,1,31,4],[20,1,20,4],[21,2,21,4]]}
[]
[null,"PC Joint Reporting Form v.3.1"]
[]
[null,"The purpose of this template Joint Reporting Form (JRF) - available as an Excel file - is to provide national health authorities and data managers with a standardized tool to address these reporting challenges, facilitate  integration and thereby further contribute to improving overall programme management. This template aims to standardize national reporting of programme implementation outcomes, improve availability and coordination of preventive chemotherapy data across the World Health Organization regions. \nNational authorities are requested to complete this form for submission to the World Health Organization any time before 15 August of the current year for reporting data on PC interventions implemented during the previous year."]
[]
[null,"Structure of the application (worksheets):"]
[]
[null,"INTRO","This worksheet includes guides on how to complete the joint reporting form and information about status of PC for endemic diseases in the country"]
[null,"COUNTRY_INFO","This worksheet includes information about administrative structure of the country, population by age group, status of endemicity for each disease, population requiring PC, planned interventions and interventions implemented"]
[null,"MDA1, MDA2, MDA3, T1, T2 and T3","These worksheets include information about endemic districts targeted for treatment with specified PC medicines, treatment plan, and number of people who received treatment by age group"]
[null,"DISTRICT","This worksheet includes summary of people treated by disease at the level of implementation. If data by gender is available, it requires to enter."]
[null,"SUMMARY","This worksheet includes summary of people treated by disease and by PC intervention. Before generating the report (run macros) please select the disease for which you need the report. Follow the same rule to generate various reports.\nThis worksheet should be printed and submitted as a Joint Report (see the instruction for submission in the SUMMARY worksheet)."]
[]
[null,"Instruction for data entry"]
[]
[null,"Most of the cells in the above-mentioned worksheets include formula that are calculated automatically according to the treatment policy recommended by WHO for each disease.\nSee the link http://www.who.int/neglected_diseases/preventive_chemotherapy/pct_manual/en/index.html"]
[]
[null,"Please enter your data into the cells according to their colour code:"]
[]
[null,null,"White - cell is not protected. Please enter the value of the requested indicator."]
[]
[null,null,"Yellow - cell is protected and includes name of indicator. No data entry required."]
[]
[null,null,"Orange - cell is not protected and includes a drop-down menu. Please select the value from the drop-down list."]
[]
[]
[null,null,"Green - cell is not protected and includes formula. Please change the value only if your data are different from those that are calculated automatically."]
[]
[]
[null,null,"Blue - cell is protected and includes formula. No data entry required."]
[]
[null,"Country data"]
[]
[null,"COUNTRY",null,null,"South Africa"]
[]
[null,"Year of reporting data",null,null,2016]
[]
[null,"Is country endemic for lymphatic filariasis (LF)?",null,null,"Non-endemic"]
[]
[null,"Is country endemic for onchocerciasis (ONCHO)?",null,null,"Non-endemic"]
[]
[null,"Is country endemic for soil-transmitted helminthiases (STH)?",null,null,"Endemic"]
[]
[null,"Is country endemic for schistosomiasis (SCH)?",null,null,"Endemic but PC is not required"]
[]
[null,"How many administrative units in the country?",null,null,9]
[null,"If demographical data at the second administrative level are not available by age group, please enter the proportion (%) of population by age group in the country. If data are available, please leave these cells blank."]
[null,"1-4 years age","Preschool-age children (PreSAC)"]
[null,"5-14 years age","School-age children (SAC)"]
[null,"15 years +","Adults"]

{"sheet":"COUNTRY_INFO","index":1,"n_rows":17,"n_cols":25,"rows_kept":17,"cut":false,"hidden":false,"merged":[[3,21,3,22],[5,21,5,22],[5,3,5,6],[5,7,5,10],[5,11,5,14],[5,19,5,20],[3,0,3,2],[3,7,3,10],[3,19,3,20],[5,0,5,2],[3,15,3,18],[5,15,5,18]]}
["COUNTRY INFORMATION"]
["Administrative structure, population by age group, endemicity status, planned interventions and interventions implemented"]
[]
["TOTAL",null,null,{"$f":"SUM(D$9:D$1000)","v":55650997},{"$f":"SUM(E$9:E$1000)","v":5480020},{"$f":"SUM(F$9:F$1000)","v":10843926},{"$f":"SUM(G$9:G$1000)","v":39138192},null,null,null,null,{"$f":"SUM(L$9:L$1000)","v":0},{"$f":"SUM(M$9:M$1000)","v":0},{"$f":"SUM(N$9:N$1000)","v":16323946},{"$f":"SUM(O$9:O$1000)","v":0}]
[]
["Country administrative structure",null,null,"Population",null,null,null,"Endemicity",null,null,null,"Population requiring PC",null,null,null,"Number of treatment\nrounds planned for the year",null,null,null,"PC implemented",null,"Click to see the recommended strategy"]
["Country","Province/State","District","Total","PreSAC","SAC","Adults","LF","Oncho","STH","SCH","LF","Oncho","STH","SCH","LF","Oncho","STH","SCH","ROUND 1","ROUND2",null,null,"UI_Id","UI_Name"]
[]
[{"$f":"IF(INTRO!$E$34<>0,INTRO!$E$34,\"\")","v":"South Africa"},"Eastern Cape",null,6837091,673803,1345189,4837977,0,0,2,4,0,0,{"$f":"IF(INTRO!$E$42=\"Endemic\", IF(AND($J9>1,$J9<5), IF($J9=4, \"Unknown\", E9+F9), 0),\"Not required\")","v":2018992},0,0,0,1,0,"T3 (ALB/MBD)",null,null,null,43258,"Eastern Cape"]
[{"$f":"IF(INTRO!$E$34<>0,INTRO!$E$34,\"\")","v":"South Africa"},"Free State",null,2822581,278168,547127,1997279,0,0,2,4,0,0,{"$f":"IF(INTRO!$E$42=\"Endemic\", IF(AND($J10>1,$J10<5), IF($J10=4, \"Unknown\", E10+F10), 0),\"Not required\")","v":825295},0,0,0,1,0,"T3 (ALB/MBD)",null,null,null,43259,"Free State"]
[{"$f":"IF(INTRO!$E$34<>0,INTRO!$E$34,\"\")","v":"South Africa"},"Gauteng",null,13553577,1335726,2627231,9590614,0,0,2,4,0,0,{"$f":"IF(INTRO!$E$42=\"Endemic\", IF(AND($J11>1,$J11<5), IF($J11=4, \"Unknown\", E11+F11), 0),\"Not required\")","v":3962957},0,0,0,1,0,"T3 (ALB/MBD)",null,null,null,43260,"Gauteng"]
[{"$f":"IF(INTRO!$E$34<>0,INTRO!$E$34,\"\")","v":"South Africa"},"KwaZulu-Natal",null,10918587,1076040,2116462,7726079,0,0,2,4,0,0,{"$f":"IF(INTRO!$E$42=\"Endemic\", IF(AND($J12>1,$J12<5), IF($J12=4, \"Unknown\", E12+F12), 0),\"Not required\")","v":3192502},0,0,0,1,0,"T3 (ALB/MBD)",null,null,null,43261,"KwaZulu-Natal"]
[{"$f":"IF(INTRO!$E$34<>0,INTRO!$E$34,\"\")","v":"South Africa"},"Limpopo",null,5775924,569226,1119607,4087090,0,0,2,4,0,0,{"$f":"IF(INTRO!$E$42=\"Endemic\", IF(AND($J13>1,$J13<5), IF($J13=4, \"Unknown\", E13+F13), 0),\"Not required\")","v":1688833},0,0,0,1,0,"T3 (ALB/MBD)",null,null,null,43262,"Limpopo"]
[{"$f":"IF(INTRO!$E$34<>0,INTRO!$E$34,\"\")","v":"South Africa"},"Mpumalanga",null,4326923,426426,838731,3053434,0,0,2,4,0,0,{"$f":"IF(INTRO!$E$42=\"Endemic\", IF(AND($J14>1,$J14<5), IF($J14=4, \"Unknown\", E14+F14), 0),\"Not required\")","v":1265157},0,0,0,1,0,"T3 (ALB/MBD)",null,null,null,43263,"Mpumalanga"]
[{"$f":"IF(INTRO!$E$34<>0,INTRO!$E$34,\"\")","v":"South Africa"},"North West",null,3783870,372801,733260,2676739,0,0,2,4,0,0,{"$f":"IF(INTRO!$E$42=\"Endemic\", IF(AND($J15>1,$J15<5), IF($J15=4, \"Unknown\", E15+F15), 0),\"Not required\")","v":1106061},0,0,0,1,0,"T3 (ALB/MBD)",null,null,null,43264,"North West"]
[{"$f":"IF(INTRO!$E$34<>0,INTRO!$E$34,\"\")","v":"South Africa"},"Northern Cape",null,1207763,119024,279524,654102,0,0,2,4,0,0,{"$f":"IF(INTRO!$E$42=\"Endemic\", IF(AND($J16>1,$J16<5), IF($J16=4, \"Unknown\", E16+F16), 0),\"Not required\")","v":398548},0,0,0,1,0,"T3 (ALB/MBD)",null,null,null,43265,"Northern Cape"]
[{"$f":"IF(INTRO!$E$34<>0,INTRO!$E$34,\"\")","v":"South Africa"},"Western Cape",null,6424681,628806,1236795,4514878,0,0,2,4,0,0,{"$f":"IF(INTRO!$E$42=\"Endemic\", IF(AND($J17>1,$J17<5), IF($J17=4, \"Unknown\", E17+F17), 0),\"Not required\")","v":1865601},0,0,0,1,0,"T3 (ALB/MBD)",null,null,null,43266,"Western Cape"]

{"sheet":"MDA1","index":2,"n_rows":17,"n_cols":17,"rows_kept":17,"cut":false,"hidden":true,"merged":[[5,13,5,16],[3,0,3,2],[5,0,5,2],[5,5,5,8],[5,9,5,12],[5,3,6,3],[5,4,6,4]]}
["MDA 1 - Ivermectin (IVM) and Albendazole (ALB)"]
["Administrative structure, population requiring PC by age group, population treated by age group and coverage"]
[]
["TOTAL",null,null,null,null,null,{"$f":"SUM(G$9:G$1000)","v":0},{"$f":"SUM(H$9:H$1000)","v":0},{"$f":"SUM(I$9:I$1000)","v":0},null,{"$f":"SUM(K$9:K$1000)","v":0},{"$f":"SUM(L$9:L$1000)","v":0},{"$f":"SUM(M$9:M$1000)","v":0},null,{"$f":"IF(G4<>0, IF(K4/G4*100=0, \"-\", K4/G4*100), \" \")","v":" "},{"$f":"IF(H4<>0, IF(L4/H4*100=0, \"-\", L4/H4*100), \" \")","v":" "},{"$f":"IF(I4<>0, IF(M4/I4*100=0, \"-\", M4/I4*100), \" \")","v":" "}]
[]
[null,null,null,"PC implemented","Date","Population targeted for MDA 1",null,null,null,"Population treated",null,null,null,"Programme coverage (%)"]
["Country","Province/State","District",null,null,"PreSAC","SAC","Adults","Total","PreSAC","SAC","Adults","Total","PreSAC","SAC","Adults","Total"]
[]
[{"$f":"IF(COUNTRY_INFO!A9=0,\" \",COUNTRY_INFO!A9)","v":"South Africa"},{"$f":"IF(COUNTRY_INFO!B9=0,\" \",COUNTRY_INFO!B9)","v":"Eastern Cape"},{"$f":"IF(COUNTRY_INFO!C9=0,\" \",COUNTRY_INFO!C9)","v":" "},{"$f":"IF(COUNTRY_INFO!$T$9:$T$1000=\"MDA1 (IVM+ALB)\", COUNTRY_INFO!$T$9:$T$1000, \" \")","v":" "},null,null,null,null,{"$f":"SUM(F9:H9)","v":0},null,null,null,{"$f":"SUM(J9:L9)","v":0},null,{"$f":"IF(G9<>0, IF(K9/G9*100=0, \"-\", K9/G9*100), \" \")","v":" "},{"$f":"IF(H9<>0, IF(L9/H9*100=0, \"-\", L9/H9*100), \" \")","v":" "}," "]
[{"$f":"IF(COUNTRY_INFO!A10=0,\" \",COUNTRY_INFO!A10)","v":"South Africa"},{"$f":"IF(COUNTRY_INFO!B10=0,\" \",COUNTRY_INFO!B10)","v":"Free State"},{"$f":"IF(COUNTRY_INFO!C10=0,\" \",COUNTRY_INFO!C10)","v":" "},{"$f":"IF(COUNTRY_INFO!$T$9:$T$1000=\"MDA1 (IVM+ALB)\", COUNTRY_INFO!$T$9:$T$1000, \" \")","v":" "},null,null,null,null,{"$f":"SUM(F10:H10)","v":0},null,null,null,{"$f":"SUM(J10:L10)","v":0},null,{"$f":"IF(G10<>0, IF(K10/G10*100=0, \"-\", K10/G10*100), \" \")","v":" "},{"$f":"IF(H10<>0, IF(L10/H10*100=0, \"-\", L10/H10*100), \" \")","v":" "},{"$f":"IF(I10<>0, IF(M10/I10*100=0, \"-\", M10/I10*100), \" \")","v":" "}]
[{"$f":"IF(COUNTRY_INFO!A11=0,\" \",COUNTRY_INFO!A11)","v":"South Africa"},{"$f":"IF(COUNTRY_INFO!B11=0,\" \",COUNTRY_INFO!B11)","v":"Gauteng"},{"$f":"IF(COUNTRY_INFO!C11=0,\" \",COUNTRY_INFO!C11)","v":" "},{"$f":"IF(COUNTRY_INFO!$T$9:$T$1000=\"MDA1 (IVM+ALB)\", COUNTRY_INFO!$T$9:$T$1000, \" \")","v":" "},null,null,null,null,0,null,null,null,0,null," "," "," "]
[{"$f":"IF(COUNTRY_INFO!A12=0,\" \",COUNTRY_INFO!A12)","v":"South Africa"},{"$f":"IF(COUNTRY_INFO!B12=0,\" \",COUNTRY_INFO!B12)","v":"KwaZulu-Natal"},{"$f":"IF(COUNTRY_INFO!C12=0,\" \",COUNTRY_INFO!C12)","v":" "},{"$f":"IF(COUNTRY_INFO!$T$9:$T$1000=\"MDA1 (IVM+ALB)\", COUNTRY_INFO!$T$9:$T$1000, \" \")","v":" "},null,null,null,null,0,null,null,null,0,null," "," "," "]
[{"$f":"IF(COUNTRY_INFO!A13=0,\" \",COUNTRY_INFO!A13)","v":"South Africa"},{"$f":"IF(COUNTRY_INFO!B13=0,\" \",COUNTRY_INFO!B13)","v":"Limpopo"},{"$f":"IF(COUNTRY_INFO!C13=0,\" \",COUNTRY_INFO!C13)","v":" "},{"$f":"IF(COUNTRY_INFO!$T$9:$T$1000=\"MDA1 (IVM+ALB)\", COUNTRY_INFO!$T$9:$T$1000, \" \")","v":" "},null,null,null,null,0,null,null,null,0,null," "," "," "]
[{"$f":"IF(COUNTRY_INFO!A14=0,\" \",COUNTRY_INFO!A14)","v":"South Africa"},{"$f":"IF(COUNTRY_INFO!B14=0,\" \",COUNTRY_INFO!B14)","v":"Mpumalanga"},{"$f":"IF(COUNTRY_INFO!C14=0,\" \",COUNTRY_INFO!C14)","v":" "},{"$f":"IF(COUNTRY_INFO!$T$9:$T$1000=\"MDA1 (IVM+ALB)\", COUNTRY_INFO!$T$9:$T$1000, \" \")","v":" "},null,null,null,null,0,null,null,null,0,null," "," "," "]
[{"$f":"IF(COUNTRY_INFO!A15=0,\" \",COUNTRY_INFO!A15)","v":"South Africa"},{"$f":"IF(COUNTRY_INFO!B15=0,\" \",COUNTRY_INFO!B15)","v":"North West"},{"$f":"IF(COUNTRY_INFO!C15=0,\" \",COUNTRY_INFO!C15)","v":" "},{"$f":"IF(COUNTRY_INFO!$T$9:$T$1000=\"MDA1 (IVM+ALB)\", COUNTRY_INFO!$T$9:$T$1000, \" \")","v":" "},null,null,null,null,0,null,null,null,0,null," "," "," "]
[{"$f":"IF(COUNTRY_INFO!A16=0,\" \",COUNTRY_INFO!A16)","v":"South Africa"},{"$f":"IF(COUNTRY_INFO!B16=0,\" \",COUNTRY_INFO!B16)","v":"Northern Cape"},{"$f":"IF(COUNTRY_INFO!C16=0,\" \",COUNTRY_INFO!C16)","v":" "},{"$f":"IF(COUNTRY_INFO!$T$9:$T$1000=\"MDA1 (IVM+ALB)\", COUNTRY_INFO!$T$9:$T$1000, \" \")","v":" "},null,null,null,null,0,null,null,null,0,null," "," "," "]
[{"$f":"IF(COUNTRY_INFO!A17=0,\" \",COUNTRY_INFO!A17)","v":"South Africa"},{"$f":"IF(COUNTRY_INFO!B17=0,\" \",COUNTRY_INFO!B17)","v":"Western Cape"},{"$f":"IF(COUNTRY_INFO!C17=0,\" \",COUNTRY_INFO!C17)","v":" "},{"$f":"IF(COUNTRY_INFO!$T$9:$T$1000=\"MDA1 (IVM+ALB)\", COUNTRY_INFO!$T$9:$T$1000, \" \")","v":" "},null,null,null,null,0,null,null,null,0,null," "," "," "]

{"sheet":"MDA2","index":3,"n_rows":17,"n_cols":17,"rows_kept":17,"cut":false,"hidden":true,"merged":[[5,5,5,8],[5,9,5,12],[5,13,5,16],[3,0,3,2],[5,0,5,2],[5,3,6,3],[5,4,6,4]]}
["MDA 2 - Diethylcarbamazine citrate (DEC) + Albendazole (ALB)"]
["Administrative structure, population requiring PC by age group, population treated by age group and coverage"]
[]
["TOTAL",null,null,null,null,{"$f":"SUM(F$9:F$1000)","v":0},{"$f":"SUM(G$9:G$1000)","v":0},0,0,0,0,0,0,{"$f":"IF(F4<>0, IF(J4/F4*100=0, \"-\", J4/F4*100), \" \")","v":" "},{"$f":"IF(G4<>0, IF(K4/G4*100=0, \"-\", K4/G4*100), \" \")","v":" "},{"$f":"IF(H4<>0, IF(L4/H4*100=0, \"-\", L4/H4*100), \" \")","v":" "},{"$f":"IF(I4<>0, IF(M4/I4*100=0, \"-\", M4/I4*100), \" \")","v":" "}]
[]
[null,null,null,"PC implemented","Date","Population targeted for MDA 2",null,null,null,"Population treated",null,null,null,"Programme coverage (%)"]
["Country","Province/State","District",null,null,"PreSAC","SAC","Adults","Total","PreSAC","SAC","Adults","Total","PreSAC","SAC","Adults","Total"]
[]
[{"$f":"IF(COUNTRY_INFO!A9=0,\" \",COUNTRY_INFO!A9)","v":"South Africa"},{"$f":"IF(COUNTRY_INFO!B9=0,\" \",COUNTRY_INFO!B9)","v":"Eastern Cape"},{"$f":"IF(COUNTRY_INFO!C9=0,\" \",COUNTRY_INFO!C9)","v":" "},{"$f":"IF(COUNTRY_INFO!$T$9:$T$1000=\"MDA2 (DEC+ALB)\", COUNTRY_INFO!$T$9:$T$1000, \" \")","v":" "},null,null,null,null,{"$f":"SUM(F9:H9)","v":0},null,null,null,{"$f":"SUM(J9:L9)","v":0},{"$f":"IF(F9<>0, IF(J9/F9*100=0, \"-\", J9/F9*100), \" \")","v":" "}," "," "," "]
[{"$f":"IF(COUNTRY_INFO!A10=0,\" \",COUNTRY_INFO!A10)","v":"South Africa"},{"$f":"IF(COUNTRY_INFO!B10=0,\" \",COUNTRY_INFO!B10)","v":"Free State"},{"$f":"IF(COUNTRY_INFO!C10=0,\" \",COUNTRY_INFO!C10)","v":" "},{"$f":"IF(COUNTRY_INFO!$T$9:$T$1000=\"MDA2 (DEC+ALB)\", COUNTRY_INFO!$T$9:$T$1000, \" \")","v":" "},null,null,null,null,{"$f":"SUM(F10:H10)","v":0},null,null,null,{"$f":"SUM(J10:L10)","v":0},{"$f":"IF(F10<>0, IF(J10/F10*100=0, \"-\", J10/F10*100), \" \")","v":" "},{"$f":"IF(G10<>0, IF(K10/G10*100=0, \"-\", K10/G10*100), \" \")","v":" "},{"$f":"IF(H10<>0, IF(L10/H10*100=0, \"-\", L10/H10*100), \" \")","v":" "},{"$f":"IF(I10<>0, IF(M10/I10*100=0, \"-\", M10/I10*100), \" \")","v":" "}]
[{"$f":"IF(COUNTRY_INFO!A11=0,\" \",COUNTRY_INFO!A11)","v":"South Africa"},{"$f":"IF(COUNTRY_INFO!B11=0,\" \",COUNTRY_INFO!B11)","v":"Gauteng"},{"$f":"IF(COUNTRY_INFO!C11=0,\" \",COUNTRY_INFO!C11)","v":" "},{"$f":"IF(COUNTRY_INFO!$T$9:$T$1000=\"MDA2 (DEC+ALB)\", COUNTRY_INFO!$T$9:$T$1000, \" \")","v":" "},null,null,null,null,0,null,null,null,0," "," "," "," "]
[{"$f":"IF(COUNTRY_INFO!A12=0,\" \",COUNTRY_INFO!A12)","v":"South Africa"},{"$f":"IF(COUNTRY_INFO!B12=0,\" \",COUNTRY_INFO!B12)","v":"KwaZulu-Natal"},{"$f":"IF(COUNTRY_INFO!C12=0,\" \",COUNTRY_INFO!C12)","v":" "},{"$f":"IF(COUNTRY_INFO!$T$9:$T$1000=\"MDA2 (DEC+ALB)\", COUNTRY_INFO!$T$9:$T$1000, \" \")","v":" "},null,null,null,null,0,null,null,null,0," "," "," "," "]
[{"$f":"IF(COUNTRY_INFO!A13=0,\" \",COUNTRY_INFO!A13)","v":"South Africa"},{"$f":"IF(COUNTRY_INFO!B13=0,\" \",COUNTRY_INFO!B13)","v":"Limpopo"},{"$f":"IF(COUNTRY_INFO!C13=0,\" \",COUNTRY_INFO!C13)","v":" "},{"$f":"IF(COUNTRY_INFO!$T$9:$T$1000=\"MDA2 (DEC+ALB)\", COUNTRY_INFO!$T$9:$T$1000, \" \")","v":" "},null,null,null,null,0,null,null,null,0," "," "," "," "]
[{"$f":"IF(COUNTRY_INFO!A14=0,\" \",COUNTRY_INFO!A14)","v":"South Africa"},{"$f":"IF(COUNTRY_INFO!B14=0,\" \",COUNTRY_INFO!B14)","v":"Mpumalanga"},{"$f":"IF(COUNTRY_INFO!C14=0,\" \",COUNTRY_INFO!C14)","v":" "},{"$f":"IF(COUNTRY_INFO!$T$9:$T$1000=\"MDA2 (DEC+ALB)\", COUNTRY_INFO!$T$9:$T$1000, \" \")","v":" "},null,null,null,null,0,null,null,null,0," "," "," "," "]
[{"$f":"IF(COUNTRY_INFO!A15=0,\" \",COUNTRY_INFO!A15)","v":"South Africa"},{"$f":"IF(COUNTRY_INFO!B15=0,\" \",COUNTRY_INFO!B15)","v":"North West"},{"$f":"IF(COUNTRY_INFO!C15=0,\" \",COUNTRY_INFO!C15)","v":" "},{"$f":"IF(COUNTRY_INFO!$T$9:$T$1000=\"MDA2 (DEC+ALB)\", COUNTRY_INFO!$T$9:$T$1000, \" \")","v":" "},null,null,null,null,0,null,null,null,0," "," "," "," "]
[{"$f":"IF(COUNTRY_INFO!A16=0,\" \",COUNTRY_INFO!A16)","v":"South Africa"},{"$f":"IF(COUNTRY_INFO!B16=0,\" \",COUNTRY_INFO!B16)","v":"Northern Cape"},{"$f":"IF(COUNTRY_INFO!C16=0,\" \",COUNTRY_INFO!C16)","v":" "},{"$f":"IF(COUNTRY_INFO!$T$9:$T$1000=\"MDA2 (DEC+ALB)\", COUNTRY_INFO!$T$9:$T$1000, \" \")","v":" "},null,null,null,null,0,null,null,null,0," "," "," "," "]
[{"$f":"IF(COUNTRY_INFO!A17=0,\" \",COUNTRY_INFO!A17)","v":"South Africa"},{"$f":"IF(COUNTRY_INFO!B17=0,\" \",COUNTRY_INFO!B17)","v":"Western Cape"},{"$f":"IF(COUNTRY_INFO!C17=0,\" \",COUNTRY_INFO!C17)","v":" "},{"$f":"IF(COUNTRY_INFO!$T$9:$T$1000=\"MDA2 (DEC+ALB)\", COUNTRY_INFO!$T$9:$T$1000, \" \")","v":" "},null,null,null,null,0,null,null,null,0," "," "," "," "]

{"sheet":"MDA3","index":4,"n_rows":17,"n_cols":20,"rows_kept":17,"cut":false,"hidden":true,"merged":[[5,5,5,7],[5,17,5,19],[3,0,3,2],[5,0,5,2],[5,3,6,3],[5,4,6,4],[5,8,5,10],[5,11,5,13],[5,14,5,16]]}
["MDA 3 - Ivermectin (IVM) "]
["Administrative structure, population requiring PC by age group, population treated by age group and coverage"]
[]
["TOTAL",null,null,null,null,{"$f":"SUM(F$9:F$1000)","v":0},0,0,0,0,0,0,0,0,0,0,0,{"$f":"IF(F4<>0, IF(O4/F4*100=0, \"-\", O4/F4*100), \" \")","v":" "},{"$f":"IF(G4<>0, IF(P4/G4*100=0, \"-\", P4/G4*100), \" \")","v":" "},{"$f":"IF(H4<>0, IF(Q4/H4*100=0, \"-\", Q4/H4*100), \" \")","v":" "}]
[]
[null,null,null,"PC implemented","Date","Population targeted for MDA 3",null,null,"Population treated - 1st round",null,null,"Population treated - 2nd round",null,null,"Population treated",null,null,"Programme coverage (%)"]
["Country","Province/State","District",null,null,"SAC","Adults","Total","SAC","Adults","Total","SAC","Adults","Total","SAC","Adults","Total","SAC","Adults","Total"]
[]
[{"$f":"IF(COUNTRY_INFO!A9=0,\" \",COUNTRY_INFO!A9)","v":"South Africa"},{"$f":"IF(COUNTRY_INFO!B9=0,\" \",COUNTRY_INFO!B9)","v":"Eastern Cape"},{"$f":"IF(COUNTRY_INFO!C9=0,\" \",COUNTRY_INFO!C9)","v":" "},{"$f":"IF(COUNTRY_INFO!$T$9:$T$1000=\"MDA3 (IVM)\", COUNTRY_INFO!$T$9:$T$1000, \" \")","v":" "},null,null,null,{"$f":"SUM(F9:G9)","v":0},null,null,{"$f":"SUM(I9:J9)","v":0},null,null,{"$f":"SUM(L9:M9)","v":0},{"$f":"MAX(I9,L9)","v":0},0,{"$f":"SUM(O9:P9)","v":0},{"$f":"IF(F9<>0, IF(MAX(I9,L9)/F9*100=0, \"-\", MAX(I9,L9)/F9*100), \" \")","v":" "}," ",{"$f":"IF(H9<>0, IF((MAX(I9,L9)+MAX(J9,M9))/H9*100=0, \"-\",(MAX(I9,L9)+MAX(J9,M9))/H9*100), \" \")","v":" "}]
[{"$f":"IF(COUNTRY_INFO!A10=0,\" \",COUNTRY_INFO!A10)","v":"South Africa"},{"$f":"IF(COUNTRY_INFO!B10=0,\" \",COUNTRY_INFO!B10)","v":"Free State"},{"$f":"IF(COUNTRY_INFO!C10=0,\" \",COUNTRY_INFO!C10)","v":" "},{"$f":"IF(COUNTRY_INFO!$T$9:$T$1000=\"MDA3 (IVM)\", COUNTRY_INFO!$T$9:$T$1000, \" \")","v":" "},null,null,null,{"$f":"SUM(F10:G10)","v":0},null,null,{"$f":"SUM(I10:J10)","v":0},null,null,{"$f":"SUM(L10:M10)","v":0},{"$f":"MAX(I10,L10)","v":0},{"$f":"MAX(J10,M10)","v":0},{"$f":"SUM(O10:P10)","v":0},{"$f":"IF(F10<>0, IF(MAX(I10,L10)/F10*100=0, \"-\", MAX(I10,L10)/F10*100), \" \")","v":" "},{"$f":"IF(G10<>0, IF(MAX(J10,M10)/G10*100=0, \"-\", MAX(J10,M10)/G10*100), \" \")","v":" "},{"$f":"IF(H10<>0, IF((MAX(I10,L10)+MAX(J10,M10))/H10*100=0, \"-\",(MAX(I10,L10)+MAX(J10,M10))/H10*100), \" \")","v":" "}]
[{"$f":"IF(COUNTRY_INFO!A11=0,\" \",COUNTRY_INFO!A11)","v":"South Africa"},{"$f":"IF(COUNTRY_INFO!B11=0,\" \",COUNTRY_INFO!B11)","v":"Gauteng"},{"$f":"IF(COUNTRY_INFO!C11=0,\" \",COUNTRY_INFO!C11)","v":" "},{"$f":"IF(COUNTRY_INFO!$T$9:$T$1000=\"MDA3 (IVM)\", COUNTRY_INFO!$T$9:$T$1000, \" \")","v":" "},null,null,null,0,null,null,0,null,null,0,0,0,0," "," "," "]
[{"$f":"IF(COUNTRY_INFO!A12=0,\" \",COUNTRY_INFO!A12)","v":"South Africa"},{"$f":"IF(COUNTRY_INFO!B12=0,\" \",COUNTRY_INFO!B12)","v":"KwaZulu-Natal"},{"$f":"IF(COUNTRY_INFO!C12=0,\" \",COUNTRY_INFO!C12)","v":" "},{"$f":"IF(COUNTRY_INFO!$T$9:$T$1000=\"MDA3 (IVM)\", COUNTRY_INFO!$T$9:$T$1000, \" \")","v":" "},null,null,null,0,null,null,0,null,null,0,0,0,0," "," "," "]
[{"$f":"IF(COUNTRY_INFO!A13=0,\" \",COUNTRY_INFO!A13)","v":"South Africa"},{"$f":"IF(COUNTRY_INFO!B13=0,\" \",COUNTRY_INFO!B13)","v":"Limpopo"},{"$f":"IF(COUNTRY_INFO!C13=0,\" \",COUNTRY_INFO!C13)","v":" "},{"$f":"IF(COUNTRY_INFO!$T$9:$T$1000=\"MDA3 (IVM)\", COUNTRY_INFO!$T$9:$T$1000, \" \")","v":" "},null,null,null,0,null,null,0,null,null,0,0,0,0," "," "," "]
[{"$f":"IF(COUNTRY_INFO!A14=0,\" \",COUNTRY_INFO!A14)","v":"South Africa"},{"$f":"IF(COUNTRY_INFO!B14=0,\" \",COUNTRY_INFO!B14)","v":"Mpumalanga"},{"$f":"IF(COUNTRY_INFO!C14=0,\" \",COUNTRY_INFO!C14)","v":" "},{"$f":"IF(COUNTRY_INFO!$T$9:$T$1000=\"MDA3 (IVM)\", COUNTRY_INFO!$T$9:$T$1000, \" \")","v":" "},null,null,null,0,null,null,0,null,null,0,0,0,0," "," "," "]
[{"$f":"IF(COUNTRY_INFO!A15=0,\" \",COUNTRY_INFO!A15)","v":"South Africa"},{"$f":"IF(COUNTRY_INFO!B15=0,\" \",COUNTRY_INFO!B15)","v":"North West"},{"$f":"IF(COUNTRY_INFO!C15=0,\" \",COUNTRY_INFO!C15)","v":" "},{"$f":"IF(COUNTRY_INFO!$T$9:$T$1000=\"MDA3 (IVM)\", COUNTRY_INFO!$T$9:$T$1000, \" \")","v":" "},null,null,null,0,null,null,0,null,null,0,0,0,0," "," "," "]
[{"$f":"IF(COUNTRY_INFO!A16=0,\" \",COUNTRY_INFO!A16)","v":"South Africa"},{"$f":"IF(COUNTRY_INFO!B16=0,\" \",COUNTRY_INFO!B16)","v":"Northern Cape"},{"$f":"IF(COUNTRY_INFO!C16=0,\" \",COUNTRY_INFO!C16)","v":" "},{"$f":"IF(COUNTRY_INFO!$T$9:$T$1000=\"MDA3 (IVM)\", COUNTRY_INFO!$T$9:$T$1000, \" \")","v":" "},null,null,null,0,null,null,0,null,null,0,0,0,0," "," "," "]
[{"$f":"IF(COUNTRY_INFO!A17=0,\" \",COUNTRY_INFO!A17)","v":"South Africa"},{"$f":"IF(COUNTRY_INFO!B17=0,\" \",COUNTRY_INFO!B17)","v":"Western Cape"},{"$f":"IF(COUNTRY_INFO!C17=0,\" \",COUNTRY_INFO!C17)","v":" "},{"$f":"IF(COUNTRY_INFO!$T$9:$T$1000=\"MDA3 (IVM)\", COUNTRY_INFO!$T$9:$T$1000, \" \")","v":" "},null,null,null,0,null,null,0,null,null,0,0,0,0," "," "," "]

{"sheet":"T1","index":5,"n_rows":17,"n_cols":19,"rows_kept":17,"cut":false,"hidden":true,"merged":[[5,6,5,10],[5,11,5,14],[5,15,5,18],[3,0,3,2],[5,0,5,2],[5,3,6,3],[5,5,6,5],[5,4,6,4]]}
["T 1 - Praziquantel (PZQ) and Albendazole (ALB) or Mebendazole (MBD)"]
["Administrative structure, population requiring PC by age group, population treated by age group and coverage"]
[]
["TOTAL",null,null,null,null,null,{"$f":"SUM(G$9:G$1000)","v":0},0,0,0,{"$f":"SUM(K$9:K$1000)","v":0},0,0,0,0,{"$f":"IF(G4<>0, IF(L4/G4*100=0, \"-\", L4/G4*100), \" \")","v":" "},{"$f":"IF(OR(I4<>0,H4<>0), IF(M4/MAX(H4,I4)*100=0, \"-\", M4/MAX(H4,I4)*100), \" \")","v":" "},{"$f":"IF(J4<>0, IF(N4/J4*100=0, \"-\", N4/J4*100), \" \")","v":" "},{"$f":"IF(K4<>0, IF(O4/K4*100=0, \"-\", O4/K4*100), \" \")","v":" "}]
[]
[null,null,null,"PC implemented","Medicine","Date","Population targeted for T1",null,null,null,null,"Population treated",null,null,null,"Programme coverage (%)"]
["Country","Province/State","District",null,null,null,"PreSAC (ALB)","SAC (ALB)","SAC (PZQ)","Adults (PZQ)","Total","PreSAC","SAC","Adults","Total","PreSAC","SAC","Adults","Total"]
[]
[{"$f":"IF(COUNTRY_INFO!A9=0,\" \",COUNTRY_INFO!A9)","v":"South Africa"},{"$f":"IF(COUNTRY_INFO!B9=0,\" \",COUNTRY_INFO!B9)","v":"Eastern Cape"},{"$f":"IF(COUNTRY_INFO!C9=0,\" \",COUNTRY_INFO!C9)","v":" "},{"$f":"IF(OR(COUNTRY_INFO!$T$9:$T$1000=\"T1 (PZQ+ALB/MBD)\",COUNTRY_INFO!$U$9:$U$1000=\"T1 (PZQ+ALB/MBD)\"), \"T1 (PZQ+ALB/MBD)\", \" \")","v":" "},null,null,null,null,null,null,{"$f":"MAX(H9:I9)+G9+J9","v":0},null,null,null,{"$f":"SUM(L9:N9)","v":0},{"$f":"IF(G9<>0, IF(L9/G9*100=0, \"-\", L9/G9*100), \" \")","v":" "},{"$f":"IF(OR(I9<>0,H9<>0), IF(M9/MAX(H9,I9)*100=0, \"-\", M9/MAX(H9,I9)*100), \" \")","v":" "},{"$f":"IF(J9<>0, IF(N9/J9*100=0, \"-\", N9/J9*100), \" \")","v":" "}," "]
[{"$f":"IF(COUNTRY_INFO!A10=0,\" \",COUNTRY_INFO!A10)","v":"South Africa"},{"$f":"IF(COUNTRY_INFO!B10=0,\" \",COUNTRY_INFO!B10)","v":"Free State"},{"$f":"IF(COUNTRY_INFO!C10=0,\" \",COUNTRY_INFO!C10)","v":" "},{"$f":"IF(OR(COUNTRY_INFO!$T$9:$T$1000=\"T1 (PZQ+ALB/MBD)\",COUNTRY_INFO!$U$9:$U$1000=\"T1 (PZQ+ALB/MBD)\"), \"T1 (PZQ+ALB/MBD)\", \" \")","v":" "},null,null,null,null,null,null,{"$f":"MAX(H10:I10)+G10+J10","v":0},null,null,null,{"$f":"SUM(L10:N10)","v":0},{"$f":"IF(G10<>0, IF(L10/G10*100=0, \"-\", L10/G10*100), \" \")","v":" "},{"$f":"IF(OR(I10<>0,H10<>0), IF(M10/MAX(H10,I10)*100=0, \"-\", M10/MAX(H10,I10)*100), \" \")","v":" "},{"$f":"IF(J10<>0, IF(N10/J10*100=0, \"-\", N10/J10*100), \" \")","v":" "},{"$f":"IF(K10<>0, IF(O10/K10*100=0, \"-\", O10/K10*100), \" \")","v":" "}]
[{"$f":"IF(COUNTRY_INFO!A11=0,\" \",COUNTRY_INFO!A11)","v":"South Africa"},{"$f":"IF(COUNTRY_INFO!B11=0,\" \",COUNTRY_INFO!B11)","v":"Gauteng"},{"$f":"IF(COUNTRY_INFO!C11=0,\" \",COUNTRY_INFO!C11)","v":" "},{"$f":"IF(OR(COUNTRY_INFO!$T$9:$T$1000=\"T1 (PZQ+ALB/MBD)\",COUNTRY_INFO!$U$9:$U$1000=\"T1 (PZQ+ALB/MBD)\"), \"T1 (PZQ+ALB/MBD)\", \" \")","v":" "},null,null,null,null,null,null,0,null,null,null,0," "," "," "," "]
[{"$f":"IF(COUNTRY_INFO!A12=0,\" \",COUNTRY_INFO!A12)","v":"South Africa"},{"$f":"IF(COUNTRY_INFO!B12=0,\" \",COUNTRY_INFO!B12)","v":"KwaZulu-Natal"},{"$f":"IF(COUNTRY_INFO!C12=0,\" \",COUNTRY_INFO!C12)","v":" "},{"$f":"IF(OR(COUNTRY_INFO!$T$9:$T$1000=\"T1 (PZQ+ALB/MBD)\",COUNTRY_INFO!$U$9:$U$1000=\"T1 (PZQ+ALB/MBD)\"), \"T1 (PZQ+ALB/MBD)\", \" \")","v":" "},null,null,null,null,null,null,0,null,null,null,0," "," "," "," "]
[{"$f":"IF(COUNTRY_INFO!A13=0,\" \",COUNTRY_INFO!A13)","v":"South Africa"},{"$f":"IF(COUNTRY_INFO!B13=0,\" \",COUNTRY_INFO!B13)","v":"Limpopo"},{"$f":"IF(COUNTRY_INFO!C13=0,\" \",COUNTRY_INFO!C13)","v":" "},{"$f":"IF(OR(COUNTRY_INFO!$T$9:$T$1000=\"T1 (PZQ+ALB/MBD)\",COUNTRY_INFO!$U$9:$U$1000=\"T1 (PZQ+ALB/MBD)\"), \"T1 (PZQ+ALB/MBD)\", \" \")","v":" "},null,null,null,null,null,null,0,null,null,null,0," "," "," "," "]
[{"$f":"IF(COUNTRY_INFO!A14=0,\" \",COUNTRY_INFO!A14)","v":"South Africa"},{"$f":"IF(COUNTRY_INFO!B14=0,\" \",COUNTRY_INFO!B14)","v":"Mpumalanga"},{"$f":"IF(COUNTRY_INFO!C14=0,\" \",COUNTRY_INFO!C14)","v":" "},{"$f":"IF(OR(COUNTRY_INFO!$T$9:$T$1000=\"T1 (PZQ+ALB/MBD)\",COUNTRY_INFO!$U$9:$U$1000=\"T1 (PZQ+ALB/MBD)\"), \"T1 (PZQ+ALB/MBD)\", \" \")","v":" "},null,null,null,null,null,null,0,null,null,null,0," "," "," "," "]
[{"$f":"IF(COUNTRY_INFO!A15=0,\" \",COUNTRY_INFO!A15)","v":"South Africa"},{"$f":"IF(COUNTRY_INFO!B15=0,\" \",COUNTRY_INFO!B15)","v":"North West"},{"$f":"IF(COUNTRY_INFO!C15=0,\" \",COUNTRY_INFO!C15)","v":" "},{"$f":"IF(OR(COUNTRY_INFO!$T$9:$T$1000=\"T1 (PZQ+ALB/MBD)\",COUNTRY_INFO!$U$9:$U$1000=\"T1 (PZQ+ALB/MBD)\"), \"T1 (PZQ+ALB/MBD)\", \" \")","v":" "},null,null,null,null,null,null,0,null,null,null,0," "," "," "," "]
[{"$f":"IF(COUNTRY_INFO!A16=0,\" \",COUNTRY_INFO!A16)","v":"South Africa"},{"$f":"IF(COUNTRY_INFO!B16=0,\" \",COUNTRY_INFO!B16)","v":"Northern Cape"},{"$f":"IF(COUNTRY_INFO!C16=0,\" \",COUNTRY_INFO!C16)","v":" "},{"$f":"IF(OR(COUNTRY_INFO!$T$9:$T$1000=\"T1 (PZQ+ALB/MBD)\",COUNTRY_INFO!$U$9:$U$1000=\"T1 (PZQ+ALB/MBD)\"), \"T1 (PZQ+ALB/MBD)\", \" \")","v":" "},null,null,null,null,null,null,0,null,null,null,0," "," "," "," "]
[{"$f":"IF(COUNTRY_INFO!A17=0,\" \",COUNTRY_INFO!A17)","v":"South Africa"},{"$f":"IF(COUNTRY_INFO!B17=0,\" \",COUNTRY_INFO!B17)","v":"Western Cape"},{"$f":"IF(COUNTRY_INFO!C17=0,\" \",COUNTRY_INFO!C17)","v":" "},{"$f":"IF(OR(COUNTRY_INFO!$T$9:$T$1000=\"T1 (PZQ+ALB/MBD)\",COUNTRY_INFO!$U$9:$U$1000=\"T1 (PZQ+ALB/MBD)\"), \"T1 (PZQ+ALB/MBD)\", \" \")","v":" "},null,null,null,null,null,null,0,null,null,null,0," "," "," "," "]

{"sheet":"T2","index":6,"n_rows":17,"n_cols":17,"rows_kept":17,"cut":false,"hidden":true,"merged":[[5,5,5,8],[5,9,5,12],[5,13,5,16],[3,0,3,2],[5,0,5,2],[5,3,6,3],[5,4,6,4]]}
["T 2 - Praziquantel (PZQ) "]
["Administrative structure, population requiring PC by age group, population treated by age group and coverage"]
[]
["TOTAL",null,null,null,null,{"$f":"SUM(F$9:F$1000)","v":0},0,0,0,0,0,0,0,{"$f":"IF(F4<>0, IF(J4/F4*100=0, \"-\", J4/F4*100), \" \")","v":" "},{"$f":"IF(G4<>0, IF(K4/G4*100=0, \"-\", K4/G4*100), \" \")","v":" "},{"$f":"IF(H4<>0, IF(L4/H4*100=0, \"-\", L4/H4*100), \" \")","v":" "},{"$f":"IF(I4<>0, IF(M4/I4*100=0, \"-\", M4/I4*100), \" \")","v":" "}]
[]
[null,null,null,"PC implemented","Date","Population targeted for T2",null,null,null,"Population treated",null,null,null,"Programme coverage (%)"]
["Country","Province/State","District",null,null,"PreSAC","SAC","Adults","Total","PreSAC","SAC","Adults","Total","PreSAC","SAC","Adults","Total"]
[]
[{"$f":"IF(COUNTRY_INFO!A9=0,\" \",COUNTRY_INFO!A9)","v":"South Africa"},{"$f":"IF(COUNTRY_INFO!B9=0,\" \",COUNTRY_INFO!B9)","v":"Eastern Cape"},{"$f":"IF(COUNTRY_INFO!C9=0,\" \",COUNTRY_INFO!C9)","v":" "},{"$f":"IF(OR(COUNTRY_INFO!$T$9:$T$1000=\"T2 (PZQ)\",COUNTRY_INFO!$U$9:$U$1000=\"T2 (PZQ)\"), \"T2 (PZQ)\", \" \")","v":" "},null,null,null,null,{"$f":"SUM(F9:H9)","v":0},null,null,null,{"$f":"SUM(J9:L9)","v":0},{"$f":"IF(F9<>0, IF(J9/F9*100=0, \"-\", J9/F9*100), \" \")","v":" "}," "," "," "]
[{"$f":"IF(COUNTRY_INFO!A10=0,\" \",COUNTRY_INFO!A10)","v":"South Africa"},{"$f":"IF(COUNTRY_INFO!B10=0,\" \",COUNTRY_INFO!B10)","v":"Free State"},{"$f":"IF(COUNTRY_INFO!C10=0,\" \",COUNTRY_INFO!C10)","v":" "},{"$f":"IF(OR(COUNTRY_INFO!$T$9:$T$1000=\"T2 (PZQ)\",COUNTRY_INFO!$U$9:$U$1000=\"T2 (PZQ)\"), \"T2 (PZQ)\", \" \")","v":" "},null,null,null,null,{"$f":"SUM(F10:H10)","v":0},null,null,null,{"$f":"SUM(J10:L10)","v":0},{"$f":"IF(F10<>0, IF(J10/F10*100=0, \"-\", J10/F10*100), \" \")","v":" "},{"$f":"IF(G10<>0, IF(K10/G10*100=0, \"-\", K10/G10*100), \" \")","v":" "},{"$f":"IF(H10<>0, IF(L10/H10*100=0, \"-\", L10/H10*100), \" \")","v":" "},{"$f":"IF(I10<>0, IF(M10/I10*100=0, \"-\", M10/I10*100), \" \")","v":" "}]
[{"$f":"IF(COUNTRY_INFO!A11=0,\" \",COUNTRY_INFO!A11)","v":"South Africa"},{"$f":"IF(COUNTRY_INFO!B11=0,\" \",COUNTRY_INFO!B11)","v":"Gauteng"},{"$f":"IF(COUNTRY_INFO!C11=0,\" \",COUNTRY_INFO!C11)","v":" "},{"$f":"IF(OR(COUNTRY_INFO!$T$9:$T$1000=\"T2 (PZQ)\",COUNTRY_INFO!$U$9:$U$1000=\"T2 (PZQ)\"), \"T2 (PZQ)\", \" \")","v":" "},null,null,null,null,0,null,null,null,0," "," "," "," "]
[{"$f":"IF(COUNTRY_INFO!A12=0,\" \",COUNTRY_INFO!A12)","v":"South Africa"},{"$f":"IF(COUNTRY_INFO!B12=0,\" \",COUNTRY_INFO!B12)","v":"KwaZulu-Natal"},{"$f":"IF(COUNTRY_INFO!C12=0,\" \",COUNTRY_INFO!C12)","v":" "},{"$f":"IF(OR(COUNTRY_INFO!$T$9:$T$1000=\"T2 (PZQ)\",COUNTRY_INFO!$U$9:$U$1000=\"T2 (PZQ)\"), \"T2 (PZQ)\", \" \")","v":" "},null,null,null,null,0,null,null,null,0," "," "," "," "]
[{"$f":"IF(COUNTRY_INFO!A13=0,\" \",COUNTRY_INFO!A13)","v":"South Africa"},{"$f":"IF(COUNTRY_INFO!B13=0,\" \",COUNTRY_INFO!B13)","v":"Limpopo"},{"$f":"IF(COUNTRY_INFO!C13=0,\" \",COUNTRY_INFO!C13)","v":" "},{"$f":"IF(OR(COUNTRY_INFO!$T$9:$T$1000=\"T2 (PZQ)\",COUNTRY_INFO!$U$9:$U$1000=\"T2 (PZQ)\"), \"T2 (PZQ)\", \" \")","v":" "},null,null,null,null,0,null,null,null,0," "," "," "," "]
[{"$f":"IF(COUNTRY_INFO!A14=0,\" \",COUNTRY_INFO!A14)","v":"South Africa"},{"$f":"IF(COUNTRY_INFO!B14=0,\" \",COUNTRY_INFO!B14)","v":"Mpumalanga"},{"$f":"IF(COUNTRY_INFO!C14=0,\" \",COUNTRY_INFO!C14)","v":" "},{"$f":"IF(OR(COUNTRY_INFO!$T$9:$T$1000=\"T2 (PZQ)\",COUNTRY_INFO!$U$9:$U$1000=\"T2 (PZQ)\"), \"T2 (PZQ)\", \" \")","v":" "},null,null,null,null,0,null,null,null,0," "," "," "," "]
[{"$f":"IF(COUNTRY_INFO!A15=0,\" \",COUNTRY_INFO!A15)","v":"South Africa"},{"$f":"IF(COUNTRY_INFO!B15=0,\" \",COUNTRY_INFO!B15)","v":"North West"},{"$f":"IF(COUNTRY_INFO!C15=0,\" \",COUNTRY_INFO!C15)","v":" "},{"$f":"IF(OR(COUNTRY_INFO!$T$9:$T$1000=\"T2 (PZQ)\",COUNTRY_INFO!$U$9:$U$1000=\"T2 (PZQ)\"), \"T2 (PZQ)\", \" \")","v":" "},null,null,null,null,0,null,null,null,0," "," "," "," "]
[{"$f":"IF(COUNTRY_INFO!A16=0,\" \",COUNTRY_INFO!A16)","v":"South Africa"},{"$f":"IF(COUNTRY_INFO!B16=0,\" \",COUNTRY_INFO!B16)","v":"Northern Cape"},{"$f":"IF(COUNTRY_INFO!C16=0,\" \",COUNTRY_INFO!C16)","v":" "},{"$f":"IF(OR(COUNTRY_INFO!$T$9:$T$1000=\"T2 (PZQ)\",COUNTRY_INFO!$U$9:$U$1000=\"T2 (PZQ)\"), \"T2 (PZQ)\", \" \")","v":" "},null,null,null,null,0,null,null,null,0," "," "," "," "]
[{"$f":"IF(COUNTRY_INFO!A17=0,\" \",COUNTRY_INFO!A17)","v":"South Africa"},{"$f":"IF(COUNTRY_INFO!B17=0,\" \",COUNTRY_INFO!B17)","v":"Western Cape"},{"$f":"IF(COUNTRY_INFO!C17=0,\" \",COUNTRY_INFO!C17)","v":" "},{"$f":"IF(OR(COUNTRY_INFO!$T$9:$T$1000=\"T2 (PZQ)\",COUNTRY_INFO!$U$9:$U$1000=\"T2 (PZQ)\"), \"T2 (PZQ)\", \" \")","v":" "},null,null,null,null,0,null,null,null,0," "," "," "," "]

{"sheet":"T3_R1","index":7,"n_rows":17,"n_cols":20,"rows_kept":17,"cut":false,"hidden":false,"merged":[[5,6,5,9],[5,10,5,13],[5,14,5,17],[3,0,3,2],[5,0,5,2],[5,3,6,3],[5,5,6,5],[5,4,6,4]]}
["T 3 - Albendazole (ALB) or Mebendazole (MBD) - Round 1"]
["Administrative structure, population requiring PC by age group, population treated by age group and coverage"]
[]
["TOTAL",null,null,null,null,null,{"$f":"SUM(G$9:G$1000)","v":5480020},6149073,0,11629093,592066,6409934,0,7002000,{"$f":"IF(G4<>0, IF(K4/G4*100=0, \"-\", K4/G4*100), \" \")","v":10.80408465662534},{"$f":"IF(H4<>0, IF(L4/H4*100=0, \"-\", L4/H4*100), \" \")","v":104.24228172278976},{"$f":"IF(I4<>0, IF(M4/I4*100=0, \"-\", M4/I4*100), \" \")","v":" "},{"$f":"IF(J4<>0, IF(N4/J4*100=0, \"-\", N4/J4*100), \" \")","v":60.211058592445688}]
[]
[null,null,null,"PC implemented","Medicine","Date","Population targeted for T3",null,null,null,"Population treated",null,null,null,"Programme coverage (%)"]
["Country","Province/State","District",null,null,null,"PreSAC","SAC","Adults","Total","PreSAC","SAC","Adults","Total","PreSAC","SAC","Adults","Total","IU_ID","IU_NAME"]
[]
[{"$f":"IF(COUNTRY_INFO!A9=0,\" \",COUNTRY_INFO!A9)","v":"South Africa"},{"$f":"IF(COUNTRY_INFO!B9=0,\" \",COUNTRY_INFO!B9)","v":"Eastern Cape"},{"$f":"IF(COUNTRY_INFO!C9=0,\" \",COUNTRY_INFO!C9)","v":" "},{"$f":"IF(OR(COUNTRY_INFO!$T$9:$T$1000=\"T3 (ALB/MBD)\",COUNTRY_INFO!$U$9:$U$1000=\"T3 (ALB/MBD)\"), \"T3 (ALB/MBD)\", \" \")","v":"T3 (ALB/MBD)"},"MBD","February - March",673803,1345189,null,{"$f":"SUM(G9:I9)","v":2018992},108224,1073238,null,{"$f":"SUM(K9:M9)","v":1181462},{"$f":"IF(G9<>0, IF(K9/G9*100=0, \"-\", K9/G9*100), \" \")","v":16.061667876219012},79.783435636181977," ",58.517418593040482,43258,"Eastern Cape"]
[{"$f":"IF(COUNTRY_INFO!A10=0,\" \",COUNTRY_INFO!A10)","v":"South Africa"},{"$f":"IF(COUNTRY_INFO!B10=0,\" \",COUNTRY_INFO!B10)","v":"Free State"},{"$f":"IF(COUNTRY_INFO!C10=0,\" \",COUNTRY_INFO!C10)","v":" "},{"$f":"IF(OR(COUNTRY_INFO!$T$9:$T$1000=\"T3 (ALB/MBD)\",COUNTRY_INFO!$U$9:$U$1000=\"T3 (ALB/MBD)\"), \"T3 (ALB/MBD)\", \" \")","v":"T3 (ALB/MBD)"},"MBD","February - March",278168,386994,null,{"$f":"SUM(G10:I10)","v":665162},31776,390376,null,{"$f":"SUM(K10:M10)","v":422152},{"$f":"IF(G10<>0, IF(K10/G10*100=0, \"-\", K10/G10*100), \" \")","v":11.423312530557075},{"$f":"IF(H10<>0, IF(L10/H10*100=0, \"-\", L10/H10*100), \" \")","v":100.87391535786085},{"$f":"IF(I10<>0, IF(M10/I10*100=0, \"-\", M10/I10*100), \" \")","v":" "},{"$f":"IF(J10<>0, IF(N10/J10*100=0, \"-\", N10/J10*100), \" \")","v":63.466042858732166},43259,"Free State"]
[{"$f":"IF(COUNTRY_INFO!A11=0,\" \",COUNTRY_INFO!A11)","v":"South Africa"},{"$f":"IF(COUNTRY_INFO!B11=0,\" \",COUNTRY_INFO!B11)","v":"Gauteng"},{"$f":"IF(COUNTRY_INFO!C11=0,\" \",COUNTRY_INFO!C11)","v":" "},{"$f":"IF(OR(COUNTRY_INFO!$T$9:$T$1000=\"T3 (ALB/MBD)\",COUNTRY_INFO!$U$9:$U$1000=\"T3 (ALB/MBD)\"), \"T3 (ALB/MBD)\", \" \")","v":"T3 (ALB/MBD)"},"MBD","February - March",1335726,716625,null,2052351,65961,723340,null,789301,4.9382133760965941,100.9370312227455," ",38.458382606094183,43260,"Gauteng"]
[{"$f":"IF(COUNTRY_INFO!A12=0,\" \",COUNTRY_INFO!A12)","v":"South Africa"},{"$f":"IF(COUNTRY_INFO!B12=0,\" \",COUNTRY_INFO!B12)","v":"KwaZulu-Natal"},{"$f":"IF(COUNTRY_INFO!C12=0,\" \",COUNTRY_INFO!C12)","v":" "},{"$f":"IF(OR(COUNTRY_INFO!$T$9:$T$1000=\"T3 (ALB/MBD)\",COUNTRY_INFO!$U$9:$U$1000=\"T3 (ALB/MBD)\"), \"T3 (ALB/MBD)\", \" \")","v":"T3 (ALB/MBD)"},"MBD","February - March",1076040,1293412,null,2369452,120776,1315577,null,1436353,11.224118062525557,101.71368442538031," ",60.619628504818834,43261,"KwaZulu-Natal"]
[{"$f":"IF(COUNTRY_INFO!A13=0,\" \",COUNTRY_INFO!A13)","v":"South Africa"},{"$f":"IF(COUNTRY_INFO!B13=0,\" \",COUNTRY_INFO!B13)","v":"Limpopo"},{"$f":"IF(COUNTRY_INFO!C13=0,\" \",COUNTRY_INFO!C13)","v":" "},{"$f":"IF(OR(COUNTRY_INFO!$T$9:$T$1000=\"T3 (ALB/MBD)\",COUNTRY_INFO!$U$9:$U$1000=\"T3 (ALB/MBD)\"), \"T3 (ALB/MBD)\", \" \")","v":"T3 (ALB/MBD)"},"MBD","February - March",569226,960895,null,1530121,99799,1230031,null,1329830,17.532403649868417,128.00888754754683," ",86.910120180038049,43262,"Limpopo"]
[{"$f":"IF(COUNTRY_INFO!A14=0,\" \",COUNTRY_INFO!A14)","v":"South Africa"},{"$f":"IF(COUNTRY_INFO!B14=0,\" \",COUNTRY_INFO!B14)","v":"Mpumalanga"},{"$f":"IF(COUNTRY_INFO!C14=0,\" \",COUNTRY_INFO!C14)","v":" "},{"$f":"IF(OR(COUNTRY_INFO!$T$9:$T$1000=\"T3 (ALB/MBD)\",COUNTRY_INFO!$U$9:$U$1000=\"T3 (ALB/MBD)\"), \"T3 (ALB/MBD)\", \" \")","v":"T3 (ALB/MBD)"},"MBD","February - March",426426,516828,null,943254,59791,577790,null,637581,14.021424584804867,111.79541356118476," ",67.593776437735755,43263,"Mpumalanga"]
[{"$f":"IF(COUNTRY_INFO!A15=0,\" \",COUNTRY_INFO!A15)","v":"South Africa"},{"$f":"IF(COUNTRY_INFO!B15=0,\" \",COUNTRY_INFO!B15)","v":"North West"},{"$f":"IF(COUNTRY_INFO!C15=0,\" \",COUNTRY_INFO!C15)","v":" "},{"$f":"IF(OR(COUNTRY_INFO!$T$9:$T$1000=\"T3 (ALB/MBD)\",COUNTRY_INFO!$U$9:$U$1000=\"T3 (ALB/MBD)\"), \"T3 (ALB/MBD)\", \" \")","v":"T3 (ALB/MBD)"},"MBD","February - March",372801,498542,null,871343,51401,529950,null,581351,13.787784904010451,106.29997071460377," ",66.718961419326263,43264,"North West"]
[{"$f":"IF(COUNTRY_INFO!A16=0,\" \",COUNTRY_INFO!A16)","v":"South Africa"},{"$f":"IF(COUNTRY_INFO!B16=0,\" \",COUNTRY_INFO!B16)","v":"Northern Cape"},{"$f":"IF(COUNTRY_INFO!C16=0,\" \",COUNTRY_INFO!C16)","v":" "},{"$f":"IF(OR(COUNTRY_INFO!$T$9:$T$1000=\"T3 (ALB/MBD)\",COUNTRY_INFO!$U$9:$U$1000=\"T3 (ALB/MBD)\"), \"T3 (ALB/MBD)\", \" \")","v":"T3 (ALB/MBD)"},"MBD","February - March",119024,151064,null,270088,8997,105463,null,114460,7.5589797015727918,69.813456548217971," ",42.378780249400194,43265,"Northern Cape"]
[{"$f":"IF(COUNTRY_INFO!A17=0,\" \",COUNTRY_INFO!A17)","v":"South Africa"},{"$f":"IF(COUNTRY_INFO!B17=0,\" \",COUNTRY_INFO!B17)","v":"Western Cape"},{"$f":"IF(COUNTRY_INFO!C17=0,\" \",COUNTRY_INFO!C17)","v":" "},{"$f":"IF(OR(COUNTRY_INFO!$T$9:$T$1000=\"T3 (ALB/MBD)\",COUNTRY_INFO!$U$9:$U$1000=\"T3 (ALB/MBD)\"), \"T3 (ALB/MBD)\", \" \")","v":"T3 (ALB/MBD)"},"MBD","February - March",628806,279524,null,908330,45341,464169,null,509510,7.2106500256040817,166.05693965455558," ",56.093049882751863,43266,"Western Cape"]

{"sheet":"T3_R2","index":8,"n_rows":17,"n_cols":18,"rows_kept":17,"cut":false,"hidden":false,"merged":[[5,6,5,9],[5,10,5,13],[5,14,5,17],[3,0,3,2],[5,0,5,2],[5,3,6,3],[5,5,6,5],[5,4,6,4]]}
["T 3 - Albendazole (ALB) or Mebendazole (MBD) - Round 2"]
["Administrative structure, population requiring PC by age group, population treated by age group and coverage"]
[]
["TOTAL",null,null,null,null,null,{"$f":"SUM(G$9:G$1000)","v":0},0,0,0,0,0,0,0,{"$f":"IF(G4<>0, IF(K4/G4*100=0, \"-\", K4/G4*100), \" \")","v":" "},{"$f":"IF(H4<>0, IF(L4/H4*100=0, \"-\", L4/H4*100), \" \")","v":" "},{"$f":"IF(I4<>0, IF(M4/I4*100=0, \"-\", M4/I4*100), \" \")","v":" "},{"$f":"IF(J4<>0, IF(N4/J4*100=0, \"-\", N4/J4*100), \" \")","v":" "}]
[]
[null,null,null,"PC implemented","Medicine","Date","Population targeted for T3",null,null,null,"Population treated",null,null,null,"Programme coverage (%)"]
["Country","Province/State","District",null,null,null,"PreSAC","SAC","Adults","Total","PreSAC","SAC","Adults","Total","PreSAC","SAC","Adults","Total"]
[]
[{"$f":"IF(COUNTRY_INFO!A9=0,\" \",COUNTRY_INFO!A9)","v":"South Africa"},{"$f":"IF(COUNTRY_INFO!B9=0,\" \",COUNTRY_INFO!B9)","v":"Eastern Cape"},{"$f":"IF(COUNTRY_INFO!C9=0,\" \",COUNTRY_INFO!C9)","v":" "},{"$f":"IF(AND(COUNTRY_INFO!$T$9:$T$1000=\"T3 (ALB/MBD)\",COUNTRY_INFO!$U$9:$U$1000=\"T3 (ALB/MBD)\"), \"T3 (ALB/MBD)\", \" \")","v":" "},null,null,null,null,null,{"$f":"SUM(G9:I9)","v":0},null,null,null,{"$f":"SUM(K9:M9)","v":0},{"$f":"IF(G9<>0, IF(K9/G9*100=0, \"-\", K9/G9*100), \" \")","v":" "}," "," "," "]
[{"$f":"IF(COUNTRY_INFO!A10=0,\" \",COUNTRY_INFO!A10)","v":"South Africa"},{"$f":"IF(COUNTRY_INFO!B10=0,\" \",COUNTRY_INFO!B10)","v":"Free State"},{"$f":"IF(COUNTRY_INFO!C10=0,\" \",COUNTRY_INFO!C10)","v":" "},{"$f":"IF(AND(COUNTRY_INFO!$T$9:$T$1000=\"T3 (ALB/MBD)\",COUNTRY_INFO!$U$9:$U$1000=\"T3 (ALB/MBD)\"), \"T3 (ALB/MBD)\", \" \")","v":" "},null,null,null,null,null,{"$f":"SUM(G10:I10)","v":0},null,null,null,{"$f":"SUM(K10:M10)","v":0},{"$f":"IF(G10<>0, IF(K10/G10*100=0, \"-\", K10/G10*100), \" \")","v":" "},{"$f":"IF(H10<>0, IF(L10/H10*100=0, \"-\", L10/H10*100), \" \")","v":" "},{"$f":"IF(I10<>0, IF(M10/I10*100=0, \"-\", M10/I10*100), \" \")","v":" "},{"$f":"IF(J10<>0, IF(N10/J10*100=0, \"-\", N10/J10*100), \" \")","v":" "}]
[{"$f":"IF(COUNTRY_INFO!A11=0,\" \",COUNTRY_INFO!A11)","v":"South Africa"},{"$f":"IF(COUNTRY_INFO!B11=0,\" \",COUNTRY_INFO!B11)","v":"Gauteng"},{"$f":"IF(COUNTRY_INFO!C11=0,\" \",COUNTRY_INFO!C11)","v":" "},{"$f":"IF(AND(COUNTRY_INFO!$T$9:$T$1000=\"T3 (ALB/MBD)\",COUNTRY_INFO!$U$9:$U$1000=\"T3 (ALB/MBD)\"), \"T3 (ALB/MBD)\", \" \")","v":" "},null,null,null,null,null,0,null,null,null,0," "," "," "," "]
[{"$f":"IF(COUNTRY_INFO!A12=0,\" \",COUNTRY_INFO!A12)","v":"South Africa"},{"$f":"IF(COUNTRY_INFO!B12=0,\" \",COUNTRY_INFO!B12)","v":"KwaZulu-Natal"},{"$f":"IF(COUNTRY_INFO!C12=0,\" \",COUNTRY_INFO!C12)","v":" "},{"$f":"IF(AND(COUNTRY_INFO!$T$9:$T$1000=\"T3 (ALB/MBD)\",COUNTRY_INFO!$U$9:$U$1000=\"T3 (ALB/MBD)\"), \"T3 (ALB/MBD)\", \" \")","v":" "},null,null,null,null,null,0,null,null,null,0," "," "," "," "]
[{"$f":"IF(COUNTRY_INFO!A13=0,\" \",COUNTRY_INFO!A13)","v":"South Africa"},{"$f":"IF(COUNTRY_INFO!B13=0,\" \",COUNTRY_INFO!B13)","v":"Limpopo"},{"$f":"IF(COUNTRY_INFO!C13=0,\" \",COUNTRY_INFO!C13)","v":" "},{"$f":"IF(AND(COUNTRY_INFO!$T$9:$T$1000=\"T3 (ALB/MBD)\",COUNTRY_INFO!$U$9:$U$1000=\"T3 (ALB/MBD)\"), \"T3 (ALB/MBD)\", \" \")","v":" "},null,null,null,null,null,0,null,null,null,0," "," "," "," "]
[{"$f":"IF(COUNTRY_INFO!A14=0,\" \",COUNTRY_INFO!A14)","v":"South Africa"},{"$f":"IF(COUNTRY_INFO!B14=0,\" \",COUNTRY_INFO!B14)","v":"Mpumalanga"},{"$f":"IF(COUNTRY_INFO!C14=0,\" \",COUNTRY_INFO!C14)","v":" "},{"$f":"IF(AND(COUNTRY_INFO!$T$9:$T$1000=\"T3 (ALB/MBD)\",COUNTRY_INFO!$U$9:$U$1000=\"T3 (ALB/MBD)\"), \"T3 (ALB/MBD)\", \" \")","v":" "},null,null,null,null,null,0,null,null,null,0," "," "," "," "]
[{"$f":"IF(COUNTRY_INFO!A15=0,\" \",COUNTRY_INFO!A15)","v":"South Africa"},{"$f":"IF(COUNTRY_INFO!B15=0,\" \",COUNTRY_INFO!B15)","v":"North West"},{"$f":"IF(COUNTRY_INFO!C15=0,\" \",COUNTRY_INFO!C15)","v":" "},{"$f":"IF(AND(COUNTRY_INFO!$T$9:$T$1000=\"T3 (ALB/MBD)\",COUNTRY_INFO!$U$9:$U$1000=\"T3 (ALB/MBD)\"), \"T3 (ALB/MBD)\", \" \")","v":" "},null,null,null,null,null,0,null,null,null,0," "," "," "," "]
[{"$f":"IF(COUNTRY_INFO!A16=0,\" \",COUNTRY_INFO!A16)","v":"South Africa"},{"$f":"IF(COUNTRY_INFO!B16=0,\" \",COUNTRY_INFO!B16)","v":"Northern Cape"},{"$f":"IF(COUNTRY_INFO!C16=0,\" \",COUNTRY_INFO!C16)","v":" "},{"$f":"IF(AND(COUNTRY_INFO!$T$9:$T$1000=\"T3 (ALB/MBD)\",COUNTRY_INFO!$U$9:$U$1000=\"T3 (ALB/MBD)\"), \"T3 (ALB/MBD)\", \" \")","v":" "},null,null,null,null,null,0,null,null,null,0," "," "," "," "]
[{"$f":"IF(COUNTRY_INFO!A17=0,\" \",COUNTRY_INFO!A17)","v":"South Africa"},{"$f":"IF(COUNTRY_INFO!B17=0,\" \",COUNTRY_INFO!B17)","v":"Western Cape"},{"$f":"IF(COUNTRY_INFO!C17=0,\" \",COUNTRY_INFO!C17)","v":" "},{"$f":"IF(AND(COUNTRY_INFO!$T$9:$T$1000=\"T3 (ALB/MBD)\",COUNTRY_INFO!$U$9:$U$1000=\"T3 (ALB/MBD)\"), \"T3 (ALB/MBD)\", \" \")","v":" "},null,null,null,null,null,0,null,null,null,0," "," "," "," "]

{"sheet":"DISTRICT","index":9,"n_rows":17,"n_cols":56,"rows_kept":17,"cut":false,"hidden":false,"merged":[[3,0,3,2],[5,0,5,2],[5,4,5,8],[5,10,5,14],[5,16,5,24],[5,26,5,34],[5,3,6,3],[5,9,6,9],[5,15,6,15],[5,25,6,25]]}
["Number of individuals treated"]
["Administrative structure, population treated by age group and gender"]
[]
["TOTAL",null,null,{"$f":"SUM(D$9:D$1000)","v":0},{"$f":"SUM(E$9:E$1000)","v":0},{"$f":"SUM(F$9:F$1000)","v":0},{"$f":"SUM(G$9:G$1000)","v":0},{"$f":"SUM(H$9:H$1000)","v":0},{"$f":"IF(D4>0, IF(H4/D4*100<>0, H4/D4*100, \"-\"),0)","v":0},{"$f":"SUM(J$9:J$1000)","v":0},{"$f":"SUM(K$9:K$1000)","v":0},{"$f":"SUM(L$9:L$1000)","v":0},{"$f":"SUM(M$9:M$1000)","v":0},{"$f":"SUM(N$9:N$1000)","v":0},{"$f":"IF(J4>0, IF(N4/J4*100<>0, N4/J4*100, \"-\"),0)","v":0},{"$f":"SUM(P$9:P$1000)","v":16323946},{"$f":"SUM(Q$9:Q$1000)","v":0},{"$f":"SUM(R$9:R$1000)","v":0},{"$f":"SUM(S$9:S$1000)","v":7002000},{"$f":"SUM(T$9:T$1000)","v":592066},null,6299510,null,{"$f":"SUM(X$9:X$1000)","v":6891576},{"$f":"IF(P4>0, IF(X4/P4*100<>0, X4/P4*100, \"-\"),0)","v":42.217586360552772},{"$f":"SUM(Z$9:Z$1000)","v":0},0,0,0,0,null,0,null,0,{"$f":"IF(Z4>0, IF(AH4/Z4*100<>0, AH4/Z4*100, \"-\"),0)","v":0}]
[]
[null,null,null,"Population requiring PC for LF","Population treated for lymphatic filariasis",null,null,null,null,"Population requiring PC for ONCHO","Population treated for onchocerciasis",null,null,null,null,"Population requiring PC for STH","Population treated for STH",null,null,null,null,null,null,null,null,"Population requiring PC for SCH","Population treated for schistosomiasis",null,null,null,null,null,null,null,null,null,null,null,null,null,null,{"$f":"SUM(AP9:AP1000)","v":0},5480020,10843926,0,{"$f":"SUM(AT9:AT1000)","v":16323946},{"$f":"COUNTIF(AU9:AU1000,\"Y\")","v":9},{"$f":"SUM(AV9:AV1000)","v":592066},6409934,0,{"$f":"SUM(AY9:AY1000)","v":7002000},592066,6299510,0,6891576,{"$f":"IF(AT6<>0,BC6/AT6,0)","v":0.42217586360552772}]
["Country","Province/State","District",null,"Male","Female","Total treated","Total in need treated","(%)",null,"Male","Female","Total treated","Total in need treated","(%)",null,"Male","Female","Total treated","PreSAC in need treated ","PreSAC (%)","SAC in need treated","SAC (%)","Total in need treated ","(%)",null,"Male","Female","Total treated","SAC in need treated","SAC (%)","Adults in need treated","Adults (%)","Total in need treated ","(%)",null,"LF","ONCHO","STH","SCH-SAC","SCH_Adults","<1","PreSAC","SAC","Adults","Total","Dis","PreSAC","SAC","Adults","Total","PreSAC","SAC","Adults","Total","Coverage"]
[]
[{"$f":"IF(COUNTRY_INFO!A9=0,\" \",COUNTRY_INFO!A9)","v":"South Africa"},{"$f":"IF(COUNTRY_INFO!B9=0,\" \",COUNTRY_INFO!B9)","v":"Eastern Cape"},{"$f":"IF(COUNTRY_INFO!C9=0,\" \",COUNTRY_INFO!C9)","v":" "},{"$f":"COUNTRY_INFO!L9","v":0},null,null,{"$f":"MAX('MDA1'!M9,'MDA2'!M9)","v":0},{"$f":"IF(AND(COUNTRY_INFO!H9>0,COUNTRY_INFO!H9<4),IF(D9>MAX('MDA1'!M9,'MDA2'!M9),MAX('MDA1'!M9,'MDA2'!M9),D9),0)","v":0},{"$f":"IF(AND(COUNTRY_INFO!H9>0,COUNTRY_INFO!H9<4), IF(G9/D9*100<>0, IF(G9/D9*100>100,100,G9/D9*100), \"-\"),0)","v":0},{"$f":"COUNTRY_INFO!M9","v":0},null,null,{"$f":"MAX('MDA1'!M9,MAX('MDA3'!I9,'MDA3'!L9)+MAX('MDA3'!J9,'MDA3'!M9))","v":0},{"$f":"IF(AND(COUNTRY_INFO!I9>0,COUNTRY_INFO!I9<4),IF(J9>MAX('MDA1'!M9,MAX('MDA3'!I9,'MDA3'!L9)+MAX('MDA3'!J9,'MDA3'!M9)),MAX('MDA1'!M9,MAX('MDA3'!I9,'MDA3'!L9)+MAX('MDA3'!J9,'MDA3'!M9)),J9),0)","v":0},{"$f":"IF(AND(COUNTRY_INFO!I9>0,COUNTRY_INFO!I9<4), IF(M9/J9*100<>0, IF(M9/J9*100>100,100,M9/J9*100), \"-\"),0)","v":0},{"$f":"COUNTRY_INFO!N9","v":2018992},null,null,{"$f":"SUM(MAX('MDA2'!J9, 'T1'!L9, MAX(T3_R1!K9, T3_R2!K9)), MAX('MDA1'!K9, 'MDA2'!K9, 'T1'!M9, MAX(T3_R1!L9, T3_R2!L9)), MAX('MDA1'!L9, 'MDA2'!L9, 'T1'!N9, MAX(T3_R1!M9, T3_R2!M9)))","v":1181462},{"$f":"IF(AND(COUNTRY_INFO!J9>1,COUNTRY_INFO!J9<4),IF(COUNTRY_INFO!E9>MAX('MDA2'!J9,'T1'!L9,MAX(T3_R1!K9,T3_R2!K9)),MAX('MDA2'!J9,'T1'!L9,MAX(T3_R1!K9,T3_R2!K9)),COUNTRY_INFO!E9),0)","v":108224},{"$f":"IF(AND(COUNTRY_INFO!J9>1,COUNTRY_INFO!J9<4), IF(T9/COUNTRY_INFO!E9*100<>0, IF(T9/COUNTRY_INFO!E9*100>100,100,T9/COUNTRY_INFO!E9*100), \"-\"),0)","v":16.061667876219012},{"$f":"IF(AND(COUNTRY_INFO!J9>1,COUNTRY_INFO!J9<4),IF(COUNTRY_INFO!F9>MAX('MDA1'!K9,'MDA2'!K9,'T1'!M9,MAX(T3_R1!L9,T3_R2!L9)),MAX('MDA1'!K9,'MDA2'!K9,'T1'!M9,MAX(T3_R1!L9,T3_R2!L9)),COUNTRY_INFO!F9),0)","v":1073238},{"$f":"IF(AND(COUNTRY_INFO!J9>1,COUNTRY_INFO!J9<4), IF(V9/COUNTRY_INFO!F9*100<>0, IF(V9/COUNTRY_INFO!F9*100>100,100,V9/COUNTRY_INFO!F9*100), \"-\"),0)","v":79.783435636181977},{"$f":"SUM(T9,V9)","v":1181462},{"$f":"IF(AND(COUNTRY_INFO!J9>1,COUNTRY_INFO!J9<4), IF(S9/P9*100<>0, IF(X9/P9*100>100,100,X9/P9*100), \"-\"),0)","v":58.517418593040482},{"$f":"COUNTRY_INFO!O9","v":0},null,null,{"$f":"MAX('T1'!L9,'T2'!J9)+MAX('T1'!M9,'T2'!K9)+MAX('T1'!N9,'T2'!L9)","v":0},{"$f":"IF(COUNTRY_INFO!K9=1,IF(COUNTRY_INFO!F9*0.33>MAX('T1'!M9,'T2'!K9),MAX('T1'!M9,'T2'!K9),COUNTRY_INFO!F9*0.33),IF(COUNTRY_INFO!K9=2,IF(COUNTRY_INFO!F9*0.5>MAX('T1'!M9,'T2'!K9),MAX('T1'!M9,'T2'!K9),COUNTRY_INFO!F9*0.5),IF(COUNTRY_INFO!K9=3,IF(COUNTRY_INFO!F9>MAX('T1'!M9,'T2'!K9),MAX('T1'!M9,'T2'!K9),COUNTRY_INFO!F9),0)))","v":0},{"$f":"IF(AND(COUNTRY_INFO!K9>0,COUNTRY_INFO!K9<4),IF(Z9>0,IF(COUNTRY_INFO!K9=1, AD9/(COUNTRY_INFO!F9*0.33)*100, IF(COUNTRY_INFO!K9=2, AD9/(COUNTRY_INFO!F9*0.5)*100, IF(COUNTRY_INFO!K9=3, AD9/COUNTRY_INFO!F9*100))),\"-\"),0)","v":0},{"$f":"IF(COUNTRY_INFO!K9=2,IF(COUNTRY_INFO!G9*0.2>MAX('T1'!N9,'T2'!L9),MAX('T1'!N9,'T2'!L9),COUNTRY_INFO!G9*0.2),IF(COUNTRY_INFO!K9=3,IF(COUNTRY_INFO!G9>MAX('T1'!N9,'T2'!L9),MAX('T1'!N9,'T2'!L9),COUNTRY_INFO!G9),0))","v":0},{"$f":"IF(AND(COUNTRY_INFO!K9>0,COUNTRY_INFO!K9<4),IF(Z9>0,IF(COUNTRY_INFO!K9=1, 0, IF(COUNTRY_INFO!K9=2, AF9/(COUNTRY_INFO!G9*0.2)*100, IF(COUNTRY_INFO!K9=3, AF9/COUNTRY_INFO!G9*100))),\"-\"),0)","v":0},{"$f":"SUM(AD9,AF9)","v":0},{"$f":"IF(AND(COUNTRY_INFO!K9>0,COUNTRY_INFO!K9<4), IF(AC9/Z9*100<>0, IF(AH9/Z9*100>100,100,AH9/Z9*100), \"-\"),0)","v":0},null,{"$f":"IF(AND(D9<>0, D9<>\"Unknown\",D9<>\"Stopped\",D9<>\"Not required\"),D9/COUNTRY_INFO!D9, 0)","v":0},{"$f":"IF(AND(J9<>0,J9<>\"Unknown\",J9<>\"Stopped\",J9<>\"Not required\"),J9/COUNTRY_INFO!D9, 0)","v":0},{"$f":"IF(AND(P9<>0,P9<>\"Unknown\",P9<>\"Not required\"),P9/(COUNTRY_INFO!E9+COUNTRY_INFO!F9), 0)","v":1},{"$f":"IF(AND(Z9<>0,Z9<>\"Unknown\",Z9<>\"Not required\"),IF(COUNTRY_INFO!K9=1,1,IF(COUNTRY_INFO!K9=2,0.5*COUNTRY_INFO!F9/(0.5*COUNTRY_INFO!F9+0.2*COUNTRY_INFO!G9),IF(COUNTRY_INFO!K9=3,COUNTRY_INFO!F9/(COUNTRY_INFO!F9+COUNTRY_INFO!G9)))),0)","v":0},{"$f":"IF(AND(Z9<>0,Z9<>\"Unknown\",Z9<>\"Not required\"),IF(COUNTRY_INFO!K9=1,0,IF(COUNTRY_INFO!K9=2,0.2*COUNTRY_INFO!G9/(0.5*COUNTRY_INFO!F9+0.2*COUNTRY_INFO!G9),IF(COUNTRY_INFO!K9=3,COUNTRY_INFO!G9/(COUNTRY_INFO!F9+COUNTRY_INFO!G9)))),0)","v":0},{"$f":"MAX(COUNTRY_INFO!D9*AK9*PROFILE!$G$7,COUNTRY_INFO!D9*AL9*PROFILE!$G$7)","v":0},{"$f":"MAX(COUNTRY_INFO!D9*AK9*PROFILE!$G$8,COUNTRY_INFO!D9*AL9*PROFILE!$G$8,COUNTRY_INFO!D9*AM9*PROFILE!$G$8)","v":673256.49928284308},{"$f":"MAX(COUNTRY_INFO!D9*AK9*PROFILE!$G$9,COUNTRY_INFO!D9*AL9*PROFILE!$G$9,COUNTRY_INFO!D9*AM9*PROFILE!$G$9,IF(AND(DISTRICT!Z9<>\"Unknown\",Z9<>\"Not required\"),COUNTRY_INFO!O9*DISTRICT!AN9,0))","v":1332247.6299798547},{"$f":"MAX(COUNTRY_INFO!D9*AK9*PROFILE!$G$10,COUNTRY_INFO!D9*AL9*PROFILE!$G$10,IF(AND(DISTRICT!Z9<>\"Unknown\",Z9<>\"Not required\"),COUNTRY_INFO!O9*DISTRICT!AO9,0))","v":0},{"$f":"SUM(AP9:AS9)","v":2005504.1292626979},{"$f":"IF(COUNTIFS(AK9:AN9,\">0\")=0,0, IF(COUNTIFS(AK9:AN9,\">0\")<=IF(AND(OR(D9>=0,D9=\"Not required\",D9=\"Unknown\",D9=\"Stopped\"),D9>0,H9>0),1,0)+IF(AND(OR(J9>=0,J9=\"Not required\",J9=\"Unknown\",J9=\"Stopped\"),J9>0,N9>0),1,0)+IF(AND(OR(P9>=0,P9=\"Not required\",P9=\"Unknown\"),P9>0,X9>0),1,0)+IF(AND(OR(Z9>=0,Z9=\"Not required\",Z9=\"Unknown\"),Z9>0,AH9>0),1,0),\"Y\",0))","v":"Y"},{"$f":"MAX('MDA2'!J9,'T1'!L9,'T2'!J9,T3_R1!K9,T3_R2!K9)","v":108224},{"$f":"MAX('MDA1'!K9,'MDA2'!K9,'MDA3'!I9,'MDA3'!L9,'T1'!M9,'T2'!K9,T3_R1!L9,T3_R2!L9)","v":1073238},{"$f":"MAX('MDA1'!L9,'MDA2'!L9,'MDA3'!J9,'MDA3'!M9,'T1'!N9,'T2'!L9,T3_R1!M9,T3_R2!M9)","v":0},{"$f":"SUM(AV9:AX9)","v":1181462},{"$f":"MAX('MDA2'!J9,T9)","v":108224},{"$f":"MAX('MDA1'!K9,'MDA2'!K9,'MDA3'!I9,'MDA3'!L9,V9,AD9)","v":1073238},{"$f":"MAX('MDA1'!L9,'MDA2'!L9,'MDA3'!J9,'MDA3'!M9,AF9)","v":0},{"$f":"IF(AT9<SUM(AZ9:BB9), AT9,SUM(AZ9:BB9))","v":1181462},{"$f":"IF(AT9<>0,BC9/AT9*100,0)","v":58.910973194273694}]
[{"$f":"IF(COUNTRY_INFO!A10=0,\" \",COUNTRY_INFO!A10)","v":"South Africa"},{"$f":"IF(COUNTRY_INFO!B10=0,\" \",COUNTRY_INFO!B10)","v":"Free State"},{"$f":"IF(COUNTRY_INFO!C10=0,\" \",COUNTRY_INFO!C10)","v":" "},{"$f":"COUNTRY_INFO!L10","v":0},null,null,{"$f":"MAX('MDA1'!M10,'MDA2'!M10)","v":0},{"$f":"IF(AND(COUNTRY_INFO!H10>0,COUNTRY_INFO!H10<4),IF(D10>MAX('MDA1'!M10,'MDA2'!M10),MAX('MDA1'!M10,'MDA2'!M10),D10),0)","v":0},{"$f":"IF(AND(COUNTRY_INFO!H10>0,COUNTRY_INFO!H10<4), IF(G10/D10*100<>0, IF(G10/D10*100>100,100,G10/D10*100), \"-\"),0)","v":0},{"$f":"COUNTRY_INFO!M10","v":0},null,null,{"$f":"MAX('MDA1'!M10,MAX('MDA3'!I10,'MDA3'!L10)+MAX('MDA3'!J10,'MDA3'!M10))","v":0},{"$f":"IF(AND(COUNTRY_INFO!I10>0,COUNTRY_INFO!I10<4),IF(J10>MAX('MDA1'!M10,MAX('MDA3'!I10,'MDA3'!L10)+MAX('MDA3'!J10,'MDA3'!M10)),MAX('MDA1'!M10,MAX('MDA3'!I10,'MDA3'!L10)+MAX('MDA3'!J10,'MDA3'!M10)),J10),0)","v":0},{"$f":"IF(AND(COUNTRY_INFO!I10>0,COUNTRY_INFO!I10<4), IF(M10/J10*100<>0, IF(M10/J10*100>100,100,M10/J10*100), \"-\"),0)","v":0},{"$f":"COUNTRY_INFO!N10","v":825295},null,null,{"$f":"SUM(MAX('MDA2'!J10, 'T1'!L10, MAX(T3_R1!K10, T3_R2!K10)), MAX('MDA1'!K10, 'MDA2'!K10, 'T1'!M10, MAX(T3_R1!L10, T3_R2!L10)), MAX('MDA1'!L10, 'MDA2'!L10, 'T1'!N10, MAX(T3_R1!M10, T3_R2!M10)))","v":422152},{"$f":"IF(AND(COUNTRY_INFO!J10>1,COUNTRY_INFO!J10<4),IF(COUNTRY_INFO!E10>MAX('MDA2'!J10,'T1'!L10,MAX(T3_R1!K10,T3_R2!K10)),MAX('MDA2'!J10,'T1'!L10,MAX(T3_R1!K10,T3_R2!K10)),COUNTRY_INFO!E10),0)","v":31776},{"$f":"IF(AND(COUNTRY_INFO!J10>1,COUNTRY_INFO!J10<4), IF(T10/COUNTRY_INFO!E10*100<>0, IF(T10/COUNTRY_INFO!E10*100>100,100,T10/COUNTRY_INFO!E10*100), \"-\"),0)","v":11.423312530557075},{"$f":"IF(AND(COUNTRY_INFO!J10>1,COUNTRY_INFO!J10<4),IF(COUNTRY_INFO!F10>MAX('MDA1'!K10,'MDA2'!K10,'T1'!M10,MAX(T3_R1!L10,T3_R2!L10)),MAX('MDA1'!K10,'MDA2'!K10,'T1'!M10,MAX(T3_R1!L10,T3_R2!L10)),COUNTRY_INFO!F10),0)","v":390376},{"$f":"IF(AND(COUNTRY_INFO!J10>1,COUNTRY_INFO!J10<4), IF(V10/COUNTRY_INFO!F10*100<>0, IF(V10/COUNTRY_INFO!F10*100>100,100,V10/COUNTRY_INFO!F10*100), \"-\"),0)","v":71.350161845421638},{"$f":"SUM(T10,V10)","v":422152},{"$f":"IF(AND(COUNTRY_INFO!J10>1,COUNTRY_INFO!J10<4), IF(S10/P10*100<>0, IF(X10/P10*100>100,100,X10/P10*100), \"-\"),0)","v":51.151648804366921},{"$f":"COUNTRY_INFO!O10","v":0},null,null,{"$f":"MAX('T1'!L10,'T2'!J10)+MAX('T1'!M10,'T2'!K10)+MAX('T1'!N10,'T2'!L10)","v":0},{"$f":"IF(COUNTRY_INFO!K10=1,IF(COUNTRY_INFO!F10*0.33>MAX('T1'!M10,'T2'!K10),MAX('T1'!M10,'T2'!K10),COUNTRY_INFO!F10*0.33),IF(COUNTRY_INFO!K10=2,IF(COUNTRY_INFO!F10*0.5>MAX('T1'!M10,'T2'!K10),MAX('T1'!M10,'T2'!K10),COUNTRY_INFO!F10*0.5),IF(COUNTRY_INFO!K10=3,IF(COUNTRY_INFO!F10>MAX('T1'!M10,'T2'!K10),MAX('T1'!M10,'T2'!K10),COUNTRY_INFO!F10),0)))","v":0},{"$f":"IF(AND(COUNTRY_INFO!K10>0,COUNTRY_INFO!K10<4),IF(Z10>0,IF(COUNTRY_INFO!K10=1, AD10/(COUNTRY_INFO!F10*0.33)*100, IF(COUNTRY_INFO!K10=2, AD10/(COUNTRY_INFO!F10*0.5)*100, IF(COUNTRY_INFO!K10=3, AD10/COUNTRY_INFO!F10*100))),\"-\"),0)","v":0},{"$f":"IF(COUNTRY_INFO!K10=2,IF(COUNTRY_INFO!G10*0.2>MAX('T1'!N10,'T2'!L10),MAX('T1'!N10,'T2'!L10),COUNTRY_INFO!G10*0.2),IF(COUNTRY_INFO!K10=3,IF(COUNTRY_INFO!G10>MAX('T1'!N10,'T2'!L10),MAX('T1'!N10,'T2'!L10),COUNTRY_INFO!G10),0))","v":0},{"$f":"IF(AND(COUNTRY_INFO!K10>0,COUNTRY_INFO!K10<4),IF(Z10>0,IF(COUNTRY_INFO!K10=1, 0, IF(COUNTRY_INFO!K10=2, AF10/(COUNTRY_INFO!G10*0.2)*100, IF(COUNTRY_INFO!K10=3, AF10/COUNTRY_INFO!G10*100))),\"-\"),0)","v":0},{"$f":"SUM(AD10,AF10)","v":0},{"$f":"IF(AND(COUNTRY_INFO!K10>0,COUNTRY_INFO!K10<4), IF(AC10/Z10*100<>0, IF(AH10/Z10*100>100,100,AH10/Z10*100), \"-\"),0)","v":0},null,{"$f":"IF(AND(D10<>0, D10<>\"Unknown\",D10<>\"Stopped\",D10<>\"Not required\"),D10/COUNTRY_INFO!D10, 0)","v":0},{"$f":"IF(AND(J10<>0,J10<>\"Unknown\",J10<>\"Stopped\",J10<>\"Not required\"),J10/COUNTRY_INFO!D10, 0)","v":0},{"$f":"IF(AND(P10<>0,P10<>\"Unknown\",P10<>\"Not required\"),P10/(COUNTRY_INFO!E10+COUNTRY_INFO!F10), 0)","v":1},{"$f":"IF(AND(Z10<>0,Z10<>\"Unknown\",Z10<>\"Not required\"),IF(COUNTRY_INFO!K10=1,1,IF(COUNTRY_INFO!K10=2,0.5*COUNTRY_INFO!F10/(0.5*COUNTRY_INFO!F10+0.2*COUNTRY_INFO!G10),IF(COUNTRY_INFO!K10=3,COUNTRY_INFO!F10/(COUNTRY_INFO!F10+COUNTRY_INFO!G10)))),0)","v":0},{"$f":"IF(AND(Z10<>0,Z10<>\"Unknown\",Z10<>\"Not required\"),IF(COUNTRY_INFO!K10=1,0,IF(COUNTRY_INFO!K10=2,0.2*COUNTRY_INFO!G10/(0.5*COUNTRY_INFO!F10+0.2*COUNTRY_INFO!G10),IF(COUNTRY_INFO!K10=3,COUNTRY_INFO!G10/(COUNTRY_INFO!F10+COUNTRY_INFO!G10)))),0)","v":0},{"$f":"MAX(COUNTRY_INFO!D10*AK10*PROFILE!$G$7,COUNTRY_INFO!D10*AL10*PROFILE!$G$7)","v":0},{"$f":"MAX(COUNTRY_INFO!D10*AK10*PROFILE!$G$8,COUNTRY_INFO!D10*AL10*PROFILE!$G$8,COUNTRY_INFO!D10*AM10*PROFILE!$G$8)","v":277942.91505002149},{"$f":"MAX(COUNTRY_INFO!D10*AK10*PROFILE!$G$9,COUNTRY_INFO!D10*AL10*PROFILE!$G$9,COUNTRY_INFO!D10*AM10*PROFILE!$G$9,IF(AND(DISTRICT!Z10<>\"Unknown\",Z10<>\"Not required\"),COUNTRY_INFO!O10*DISTRICT!AN10,0))","v":549996.60640412243},{"$f":"MAX(COUNTRY_INFO!D10*AK10*PROFILE!$G$10,COUNTRY_INFO!D10*AL10*PROFILE!$G$10,IF(AND(DISTRICT!Z10<>\"Unknown\",Z10<>\"Not required\"),COUNTRY_INFO!O10*DISTRICT!AO10,0))","v":0},{"$f":"SUM(AP10:AS10)","v":827939.52145414392},"Y",{"$f":"MAX('MDA2'!J10,'T1'!L10,'T2'!J10,T3_R1!K10,T3_R2!K10)","v":31776},{"$f":"MAX('MDA1'!K10,'MDA2'!K10,'MDA3'!I10,'MDA3'!L10,'T1'!M10,'T2'!K10,T3_R1!L10,T3_R2!L10)","v":390376},{"$f":"MAX('MDA1'!L10,'MDA2'!L10,'MDA3'!J10,'MDA3'!M10,'T1'!N10,'T2'!L10,T3_R1!M10,T3_R2!M10)","v":0},{"$f":"SUM(AV10:AX10)","v":422152},{"$f":"MAX('MDA2'!J10,T10)","v":31776},{"$f":"MAX('MDA1'!K10,'MDA2'!K10,'MDA3'!I10,'MDA3'!L10,V10,AD10)","v":390376},{"$f":"MAX('MDA1'!L10,'MDA2'!L10,'MDA3'!J10,'MDA3'!M10,AF10)","v":0},422152,50.988265333506156]
[{"$f":"IF(COUNTRY_INFO!A11=0,\" \",COUNTRY_INFO!A11)","v":"South Africa"},{"$f":"IF(COUNTRY_INFO!B11=0,\" \",COUNTRY_INFO!B11)","v":"Gauteng"},{"$f":"IF(COUNTRY_INFO!C11=0,\" \",COUNTRY_INFO!C11)","v":" "},{"$f":"COUNTRY_INFO!L11","v":0},null,null,{"$f":"MAX('MDA1'!M11,'MDA2'!M11)","v":0},{"$f":"IF(AND(COUNTRY_INFO!H11>0,COUNTRY_INFO!H11<4),IF(D11>MAX('MDA1'!M11,'MDA2'!M11),MAX('MDA1'!M11,'MDA2'!M11),D11),0)","v":0},{"$f":"IF(AND(COUNTRY_INFO!H11>0,COUNTRY_INFO!H11<4), IF(G11/D11*100<>0, IF(G11/D11*100>100,100,G11/D11*100), \"-\"),0)","v":0},{"$f":"COUNTRY_INFO!M11","v":0},null,null,{"$f":"MAX('MDA1'!M11,MAX('MDA3'!I11,'MDA3'!L11)+MAX('MDA3'!J11,'MDA3'!M11))","v":0},{"$f":"IF(AND(COUNTRY_INFO!I11>0,COUNTRY_INFO!I11<4),IF(J11>MAX('MDA1'!M11,MAX('MDA3'!I11,'MDA3'!L11)+MAX('MDA3'!J11,'MDA3'!M11)),MAX('MDA1'!M11,MAX('MDA3'!I11,'MDA3'!L11)+MAX('MDA3'!J11,'MDA3'!M11)),J11),0)","v":0},{"$f":"IF(AND(COUNTRY_INFO!I11>0,COUNTRY_INFO!I11<4), IF(M11/J11*100<>0, IF(M11/J11*100>100,100,M11/J11*100), \"-\"),0)","v":0},{"$f":"COUNTRY_INFO!N11","v":3962957},null,null,{"$f":"SUM(MAX('MDA2'!J11, 'T1'!L11, MAX(T3_R1!K11, T3_R2!K11)), MAX('MDA1'!K11, 'MDA2'!K11, 'T1'!M11, MAX(T3_R1!L11, T3_R2!L11)), MAX('MDA1'!L11, 'MDA2'!L11, 'T1'!N11, MAX(T3_R1!M11, T3_R2!M11)))","v":789301},{"$f":"IF(AND(COUNTRY_INFO!J11>1,COUNTRY_INFO!J11<4),IF(COUNTRY_INFO!E11>MAX('MDA2'!J11,'T1'!L11,MAX(T3_R1!K11,T3_R2!K11)),MAX('MDA2'!J11,'T1'!L11,MAX(T3_R1!K11,T3_R2!K11)),COUNTRY_INFO!E11),0)","v":65961},{"$f":"IF(AND(COUNTRY_INFO!J11>1,COUNTRY_INFO!J11<4), IF(T11/COUNTRY_INFO!E11*100<>0, IF(T11/COUNTRY_INFO!E11*100>100,100,T11/COUNTRY_INFO!E11*100), \"-\"),0)","v":4.9382133760965941},{"$f":"IF(AND(COUNTRY_INFO!J11>1,COUNTRY_INFO!J11<4),IF(COUNTRY_INFO!F11>MAX('MDA1'!K11,'MDA2'!K11,'T1'!M11,MAX(T3_R1!L11,T3_R2!L11)),MAX('MDA1'!K11,'MDA2'!K11,'T1'!M11,MAX(T3_R1!L11,T3_R2!L11)),COUNTRY_INFO!F11),0)","v":723340},{"$f":"IF(AND(COUNTRY_INFO!J11>1,COUNTRY_INFO!J11<4), IF(V11/COUNTRY_INFO!F11*100<>0, IF(V11/COUNTRY_INFO!F11*100>100,100,V11/COUNTRY_INFO!F11*100), \"-\"),0)","v":27.532409597785652},789301,{"$f":"IF(AND(COUNTRY_INFO!J11>1,COUNTRY_INFO!J11<4), IF(S11/P11*100<>0, IF(X11/P11*100>100,100,X11/P11*100), \"-\"),0)","v":19.916971090021921},{"$f":"COUNTRY_INFO!O11","v":0},null,null,{"$f":"MAX('T1'!L11,'T2'!J11)+MAX('T1'!M11,'T2'!K11)+MAX('T1'!N11,'T2'!L11)","v":0},{"$f":"IF(COUNTRY_INFO!K11=1,IF(COUNTRY_INFO!F11*0.33>MAX('T1'!M11,'T2'!K11),MAX('T1'!M11,'T2'!K11),COUNTRY_INFO!F11*0.33),IF(COUNTRY_INFO!K11=2,IF(COUNTRY_INFO!F11*0.5>MAX('T1'!M11,'T2'!K11),MAX('T1'!M11,'T2'!K11),COUNTRY_INFO!F11*0.5),IF(COUNTRY_INFO!K11=3,IF(COUNTRY_INFO!F11>MAX('T1'!M11,'T2'!K11),MAX('T1'!M11,'T2'!K11),COUNTRY_INFO!F11),0)))","v":0},{"$f":"IF(AND(COUNTRY_INFO!K11>0,COUNTRY_INFO!K11<4),IF(Z11>0,IF(COUNTRY_INFO!K11=1, AD11/(COUNTRY_INFO!F11*0.33)*100, IF(COUNTRY_INFO!K11=2, AD11/(COUNTRY_INFO!F11*0.5)*100, IF(COUNTRY_INFO!K11=3, AD11/COUNTRY_INFO!F11*100))),\"-\"),0)","v":0},{"$f":"IF(COUNTRY_INFO!K11=2,IF(COUNTRY_INFO!G11*0.2>MAX('T1'!N11,'T2'!L11),MAX('T1'!N11,'T2'!L11),COUNTRY_INFO!G11*0.2),IF(COUNTRY_INFO!K11=3,IF(COUNTRY_INFO!G11>MAX('T1'!N11,'T2'!L11),MAX('T1'!N11,'T2'!L11),COUNTRY_INFO!G11),0))","v":0},{"$f":"IF(AND(COUNTRY_INFO!K11>0,COUNTRY_INFO!K11<4),IF(Z11>0,IF(COUNTRY_INFO!K11=1, 0, IF(COUNTRY_INFO!K11=2, AF11/(COUNTRY_INFO!G11*0.2)*100, IF(COUNTRY_INFO!K11=3, AF11/COUNTRY_INFO!G11*100))),\"-\"),0)","v":0},0,{"$f":"IF(AND(COUNTRY_INFO!K11>0,COUNTRY_INFO!K11<4), IF(AC11/Z11*100<>0, IF(AH11/Z11*100>100,100,AH11/Z11*100), \"-\"),0)","v":0},null,{"$f":"IF(AND(D11<>0, D11<>\"Unknown\",D11<>\"Stopped\",D11<>\"Not required\"),D11/COUNTRY_INFO!D11, 0)","v":0},{"$f":"IF(AND(J11<>0,J11<>\"Unknown\",J11<>\"Stopped\",J11<>\"Not required\"),J11/COUNTRY_INFO!D11, 0)","v":0},{"$f":"IF(AND(P11<>0,P11<>\"Unknown\",P11<>\"Not required\"),P11/(COUNTRY_INFO!E11+COUNTRY_INFO!F11), 0)","v":1},{"$f":"IF(AND(Z11<>0,Z11<>\"Unknown\",Z11<>\"Not required\"),IF(COUNTRY_INFO!K11=1,1,IF(COUNTRY_INFO!K11=2,0.5*COUNTRY_INFO!F11/(0.5*COUNTRY_INFO!F11+0.2*COUNTRY_INFO!G11),IF(COUNTRY_INFO!K11=3,COUNTRY_INFO!F11/(COUNTRY_INFO!F11+COUNTRY_INFO!G11)))),0)","v":0},{"$f":"IF(AND(Z11<>0,Z11<>\"Unknown\",Z11<>\"Not required\"),IF(COUNTRY_INFO!K11=1,0,IF(COUNTRY_INFO!K11=2,0.2*COUNTRY_INFO!G11/(0.5*COUNTRY_INFO!F11+0.2*COUNTRY_INFO!G11),IF(COUNTRY_INFO!K11=3,COUNTRY_INFO!G11/(COUNTRY_INFO!F11+COUNTRY_INFO!G11)))),0)","v":0},{"$f":"MAX(COUNTRY_INFO!D11*AK11*PROFILE!$G$7,COUNTRY_INFO!D11*AL11*PROFILE!$G$7)","v":0},{"$f":"MAX(COUNTRY_INFO!D11*AK11*PROFILE!$G$8,COUNTRY_INFO!D11*AL11*PROFILE!$G$8,COUNTRY_INFO!D11*AM11*PROFILE!$G$8)","v":1334636.8804774513},{"$f":"MAX(COUNTRY_INFO!D11*AK11*PROFILE!$G$9,COUNTRY_INFO!D11*AL11*PROFILE!$G$9,COUNTRY_INFO!D11*AM11*PROFILE!$G$9,IF(AND(DISTRICT!Z11<>\"Unknown\",Z11<>\"Not required\"),COUNTRY_INFO!O11*DISTRICT!AN11,0))","v":2640994.6622034824},{"$f":"MAX(COUNTRY_INFO!D11*AK11*PROFILE!$G$10,COUNTRY_INFO!D11*AL11*PROFILE!$G$10,IF(AND(DISTRICT!Z11<>\"Unknown\",Z11<>\"Not required\"),COUNTRY_INFO!O11*DISTRICT!AO11,0))","v":0},3975631.5426809336,"Y",{"$f":"MAX('MDA2'!J11,'T1'!L11,'T2'!J11,T3_R1!K11,T3_R2!K11)","v":65961},{"$f":"MAX('MDA1'!K11,'MDA2'!K11,'MDA3'!I11,'MDA3'!L11,'T1'!M11,'T2'!K11,T3_R1!L11,T3_R2!L11)","v":723340},{"$f":"MAX('MDA1'!L11,'MDA2'!L11,'MDA3'!J11,'MDA3'!M11,'T1'!N11,'T2'!L11,T3_R1!M11,T3_R2!M11)","v":0},789301,{"$f":"MAX('MDA2'!J11,T11)","v":65961},{"$f":"MAX('MDA1'!K11,'MDA2'!K11,'MDA3'!I11,'MDA3'!L11,V11,AD11)","v":723340},{"$f":"MAX('MDA1'!L11,'MDA2'!L11,'MDA3'!J11,'MDA3'!M11,AF11)","v":0},789301,19.853474637333761]
[{"$f":"IF(COUNTRY_INFO!A12=0,\" \",COUNTRY_INFO!A12)","v":"South Africa"},{"$f":"IF(COUNTRY_INFO!B12=0,\" \",COUNTRY_INFO!B12)","v":"KwaZulu-Natal"},{"$f":"IF(COUNTRY_INFO!C12=0,\" \",COUNTRY_INFO!C12)","v":" "},{"$f":"COUNTRY_INFO!L12","v":0},null,null,{"$f":"MAX('MDA1'!M12,'MDA2'!M12)","v":0},{"$f":"IF(AND(COUNTRY_INFO!H12>0,COUNTRY_INFO!H12<4),IF(D12>MAX('MDA1'!M12,'MDA2'!M12),MAX('MDA1'!M12,'MDA2'!M12),D12),0)","v":0},{"$f":"IF(AND(COUNTRY_INFO!H12>0,COUNTRY_INFO!H12<4), IF(G12/D12*100<>0, IF(G12/D12*100>100,100,G12/D12*100), \"-\"),0)","v":0},{"$f":"COUNTRY_INFO!M12","v":0},null,null,{"$f":"MAX('MDA1'!M12,MAX('MDA3'!I12,'MDA3'!L12)+MAX('MDA3'!J12,'MDA3'!M12))","v":0},{"$f":"IF(AND(COUNTRY_INFO!I12>0,COUNTRY_INFO!I12<4),IF(J12>MAX('MDA1'!M12,MAX('MDA3'!I12,'MDA3'!L12)+MAX('MDA3'!J12,'MDA3'!M12)),MAX('MDA1'!M12,MAX('MDA3'!I12,'MDA3'!L12)+MAX('MDA3'!J12,'MDA3'!M12)),J12),0)","v":0},{"$f":"IF(AND(COUNTRY_INFO!I12>0,COUNTRY_INFO!I12<4), IF(M12/J12*100<>0, IF(M12/J12*100>100,100,M12/J12*100), \"-\"),0)","v":0},{"$f":"COUNTRY_INFO!N12","v":3192502},null,null,{"$f":"SUM(MAX('MDA2'!J12, 'T1'!L12, MAX(T3_R1!K12, T3_R2!K12)), MAX('MDA1'!K12, 'MDA2'!K12, 'T1'!M12, MAX(T3_R1!L12, T3_R2!L12)), MAX('MDA1'!L12, 'MDA2'!L12, 'T1'!N12, MAX(T3_R1!M12, T3_R2!M12)))","v":1436353},{"$f":"IF(AND(COUNTRY_INFO!J12>1,COUNTRY_INFO!J12<4),IF(COUNTRY_INFO!E12>MAX('MDA2'!J12,'T1'!L12,MAX(T3_R1!K12,T3_R2!K12)),MAX('MDA2'!J12,'T1'!L12,MAX(T3_R1!K12,T3_R2!K12)),COUNTRY_INFO!E12),0)","v":120776},{"$f":"IF(AND(COUNTRY_INFO!J12>1,COUNTRY_INFO!J12<4), IF(T12/COUNTRY_INFO!E12*100<>0, IF(T12/COUNTRY_INFO!E12*100>100,100,T12/COUNTRY_INFO!E12*100), \"-\"),0)","v":11.224118062525557},{"$f":"IF(AND(COUNTRY_INFO!J12>1,COUNTRY_INFO!J12<4),IF(COUNTRY_INFO!F12>MAX('MDA1'!K12,'MDA2'!K12,'T1'!M12,MAX(T3_R1!L12,T3_R2!L12)),MAX('MDA1'!K12,'MDA2'!K12,'T1'!M12,MAX(T3_R1!L12,T3_R2!L12)),COUNTRY_INFO!F12),0)","v":1315577},{"$f":"IF(AND(COUNTRY_INFO!J12>1,COUNTRY_INFO!J12<4), IF(V12/COUNTRY_INFO!F12*100<>0, IF(V12/COUNTRY_INFO!F12*100>100,100,V12/COUNTRY_INFO!F12*100), \"-\"),0)","v":62.15925445389523},1436353,{"$f":"IF(AND(COUNTRY_INFO!J12>1,COUNTRY_INFO!J12<4), IF(S12/P12*100<>0, IF(X12/P12*100>100,100,X12/P12*100), \"-\"),0)","v":44.991451845605738},{"$f":"COUNTRY_INFO!O12","v":0},null,null,{"$f":"MAX('T1'!L12,'T2'!J12)+MAX('T1'!M12,'T2'!K12)+MAX('T1'!N12,'T2'!L12)","v":0},{"$f":"IF(COUNTRY_INFO!K12=1,IF(COUNTRY_INFO!F12*0.33>MAX('T1'!M12,'T2'!K12),MAX('T1'!M12,'T2'!K12),COUNTRY_INFO!F12*0.33),IF(COUNTRY_INFO!K12=2,IF(COUNTRY_INFO!F12*0.5>MAX('T1'!M12,'T2'!K12),MAX('T1'!M12,'T2'!K12),COUNTRY_INFO!F12*0.5),IF(COUNTRY_INFO!K12=3,IF(COUNTRY_INFO!F12>MAX('T1'!M12,'T2'!K12),MAX('T1'!M12,'T2'!K12),COUNTRY_INFO!F12),0)))","v":0},{"$f":"IF(AND(COUNTRY_INFO!K12>0,COUNTRY_INFO!K12<4),IF(Z12>0,IF(COUNTRY_INFO!K12=1, AD12/(COUNTRY_INFO!F12*0.33)*100, IF(COUNTRY_INFO!K12=2, AD12/(COUNTRY_INFO!F12*0.5)*100, IF(COUNTRY_INFO!K12=3, AD12/COUNTRY_INFO!F12*100))),\"-\"),0)","v":0},{"$f":"IF(COUNTRY_INFO!K12=2,IF(COUNTRY_INFO!G12*0.2>MAX('T1'!N12,'T2'!L12),MAX('T1'!N12,'T2'!L12),COUNTRY_INFO!G12*0.2),IF(COUNTRY_INFO!K12=3,IF(COUNTRY_INFO!G12>MAX('T1'!N12,'T2'!L12),MAX('T1'!N12,'T2'!L12),COUNTRY_INFO!G12),0))","v":0},{"$f":"IF(AND(COUNTRY_INFO!K12>0,COUNTRY_INFO!K12<4),IF(Z12>0,IF(COUNTRY_INFO!K12=1, 0, IF(COUNTRY_INFO!K12=2, AF12/(COUNTRY_INFO!G12*0.2)*100, IF(COUNTRY_INFO!K12=3, AF12/COUNTRY_INFO!G12*100))),\"-\"),0)","v":0},0,{"$f":"IF(AND(COUNTRY_INFO!K12>0,COUNTRY_INFO!K12<4), IF(AC12/Z12*100<>0, IF(AH12/Z12*100>100,100,AH12/Z12*100), \"-\"),0)","v":0},null,{"$f":"IF(AND(D12<>0, D12<>\"Unknown\",D12<>\"Stopped\",D12<>\"Not required\"),D12/COUNTRY_INFO!D12, 0)","v":0},{"$f":"IF(AND(J12<>0,J12<>\"Unknown\",J12<>\"Stopped\",J12<>\"Not required\"),J12/COUNTRY_INFO!D12, 0)","v":0},{"$f":"IF(AND(P12<>0,P12<>\"Unknown\",P12<>\"Not required\"),P12/(COUNTRY_INFO!E12+COUNTRY_INFO!F12), 0)","v":1},{"$f":"IF(AND(Z12<>0,Z12<>\"Unknown\",Z12<>\"Not required\"),IF(COUNTRY_INFO!K12=1,1,IF(COUNTRY_INFO!K12=2,0.5*COUNTRY_INFO!F12/(0.5*COUNTRY_INFO!F12+0.2*COUNTRY_INFO!G12),IF(COUNTRY_INFO!K12=3,COUNTRY_INFO!F12/(COUNTRY_INFO!F12+COUNTRY_INFO!G12)))),0)","v":0},{"$f":"IF(AND(Z12<>0,Z12<>\"Unknown\",Z12<>\"Not required\"),IF(COUNTRY_INFO!K12=1,0,IF(COUNTRY_INFO!K12=2,0.2*COUNTRY_INFO!G12/(0.5*COUNTRY_INFO!F12+0.2*COUNTRY_INFO!G12),IF(COUNTRY_INFO!K12=3,COUNTRY_INFO!G12/(COUNTRY_INFO!F12+COUNTRY_INFO!G12)))),0)","v":0},{"$f":"MAX(COUNTRY_INFO!D12*AK12*PROFILE!$G$7,COUNTRY_INFO!D12*AL12*PROFILE!$G$7)","v":0},{"$f":"MAX(COUNTRY_INFO!D12*AK12*PROFILE!$G$8,COUNTRY_INFO!D12*AL12*PROFILE!$G$8,COUNTRY_INFO!D12*AM12*PROFILE!$G$8)","v":1075166.2747702436},{"$f":"MAX(COUNTRY_INFO!D12*AK12*PROFILE!$G$9,COUNTRY_INFO!D12*AL12*PROFILE!$G$9,COUNTRY_INFO!D12*AM12*PROFILE!$G$9,IF(AND(DISTRICT!Z12<>\"Unknown\",Z12<>\"Not required\"),COUNTRY_INFO!O12*DISTRICT!AN12,0))","v":2127551.271948677},{"$f":"MAX(COUNTRY_INFO!D12*AK12*PROFILE!$G$10,COUNTRY_INFO!D12*AL12*PROFILE!$G$10,IF(AND(DISTRICT!Z12<>\"Unknown\",Z12<>\"Not required\"),COUNTRY_INFO!O12*DISTRICT!AO12,0))","v":0},3202717.5467189206,"Y",{"$f":"MAX('MDA2'!J12,'T1'!L12,'T2'!J12,T3_R1!K12,T3_R2!K12)","v":120776},{"$f":"MAX('MDA1'!K12,'MDA2'!K12,'MDA3'!I12,'MDA3'!L12,'T1'!M12,'T2'!K12,T3_R1!L12,T3_R2!L12)","v":1315577},{"$f":"MAX('MDA1'!L12,'MDA2'!L12,'MDA3'!J12,'MDA3'!M12,'T1'!N12,'T2'!L12,T3_R1!M12,T3_R2!M12)","v":0},1436353,{"$f":"MAX('MDA2'!J12,T12)","v":120776},{"$f":"MAX('MDA1'!K12,'MDA2'!K12,'MDA3'!I12,'MDA3'!L12,V12,AD12)","v":1315577},{"$f":"MAX('MDA1'!L12,'MDA2'!L12,'MDA3'!J12,'MDA3'!M12,AF12)","v":0},1436353,44.847944879544457]
[{"$f":"IF(COUNTRY_INFO!A13=0,\" \",COUNTRY_INFO!A13)","v":"South Africa"},{"$f":"IF(COUNTRY_INFO!B13=0,\" \",COUNTRY_INFO!B13)","v":"Limpopo"},{"$f":"IF(COUNTRY_INFO!C13=0,\" \",COUNTRY_INFO!C13)","v":" "},{"$f":"COUNTRY_INFO!L13","v":0},null,null,{"$f":"MAX('MDA1'!M13,'MDA2'!M13)","v":0},{"$f":"IF(AND(COUNTRY_INFO!H13>0,COUNTRY_INFO!H13<4),IF(D13>MAX('MDA1'!M13,'MDA2'!M13),MAX('MDA1'!M13,'MDA2'!M13),D13),0)","v":0},{"$f":"IF(AND(COUNTRY_INFO!H13>0,COUNTRY_INFO!H13<4), IF(G13/D13*100<>0, IF(G13/D13*100>100,100,G13/D13*100), \"-\"),0)","v":0},{"$f":"COUNTRY_INFO!M13","v":0},null,null,{"$f":"MAX('MDA1'!M13,MAX('MDA3'!I13,'MDA3'!L13)+MAX('MDA3'!J13,'MDA3'!M13))","v":0},{"$f":"IF(AND(COUNTRY_INFO!I13>0,COUNTRY_INFO!I13<4),IF(J13>MAX('MDA1'!M13,MAX('MDA3'!I13,'MDA3'!L13)+MAX('MDA3'!J13,'MDA3'!M13)),MAX('MDA1'!M13,MAX('MDA3'!I13,'MDA3'!L13)+MAX('MDA3'!J13,'MDA3'!M13)),J13),0)","v":0},{"$f":"IF(AND(COUNTRY_INFO!I13>0,COUNTRY_INFO!I13<4), IF(M13/J13*100<>0, IF(M13/J13*100>100,100,M13/J13*100), \"-\"),0)","v":0},{"$f":"COUNTRY_INFO!N13","v":1688833},null,null,{"$f":"SUM(MAX('MDA2'!J13, 'T1'!L13, MAX(T3_R1!K13, T3_R2!K13)), MAX('MDA1'!K13, 'MDA2'!K13, 'T1'!M13, MAX(T3_R1!L13, T3_R2!L13)), MAX('MDA1'!L13, 'MDA2'!L13, 'T1'!N13, MAX(T3_R1!M13, T3_R2!M13)))","v":1329830},{"$f":"IF(AND(COUNTRY_INFO!J13>1,COUNTRY_INFO!J13<4),IF(COUNTRY_INFO!E13>MAX('MDA2'!J13,'T1'!L13,MAX(T3_R1!K13,T3_R2!K13)),MAX('MDA2'!J13,'T1'!L13,MAX(T3_R1!K13,T3_R2!K13)),COUNTRY_INFO!E13),0)","v":99799},{"$f":"IF(AND(COUNTRY_INFO!J13>1,COUNTRY_INFO!J13<4), IF(T13/COUNTRY_INFO!E13*100<>0, IF(T13/COUNTRY_INFO!E13*100>100,100,T13/COUNTRY_INFO!E13*100), \"-\"),0)","v":17.532403649868417},{"$f":"IF(AND(COUNTRY_INFO!J13>1,COUNTRY_INFO!J13<4),IF(COUNTRY_INFO!F13>MAX('MDA1'!K13,'MDA2'!K13,'T1'!M13,MAX(T3_R1!L13,T3_R2!L13)),MAX('MDA1'!K13,'MDA2'!K13,'T1'!M13,MAX(T3_R1!L13,T3_R2!L13)),COUNTRY_INFO!F13),0)","v":1119607},{"$f":"IF(AND(COUNTRY_INFO!J13>1,COUNTRY_INFO!J13<4), IF(V13/COUNTRY_INFO!F13*100<>0, IF(V13/COUNTRY_INFO!F13*100>100,100,V13/COUNTRY_INFO!F13*100), \"-\"),0)","v":100},1219406,{"$f":"IF(AND(COUNTRY_INFO!J13>1,COUNTRY_INFO!J13<4), IF(S13/P13*100<>0, IF(X13/P13*100>100,100,X13/P13*100), \"-\"),0)","v":72.204060436999981},{"$f":"COUNTRY_INFO!O13","v":0},null,null,{"$f":"MAX('T1'!L13,'T2'!J13)+MAX('T1'!M13,'T2'!K13)+MAX('T1'!N13,'T2'!L13)","v":0},{"$f":"IF(COUNTRY_INFO!K13=1,IF(COUNTRY_INFO!F13*0.33>MAX('T1'!M13,'T2'!K13),MAX('T1'!M13,'T2'!K13),COUNTRY_INFO!F13*0.33),IF(COUNTRY_INFO!K13=2,IF(COUNTRY_INFO!F13*0.5>MAX('T1'!M13,'T2'!K13),MAX('T1'!M13,'T2'!K13),COUNTRY_INFO!F13*0.5),IF(COUNTRY_INFO!K13=3,IF(COUNTRY_INFO!F13>MAX('T1'!M13,'T2'!K13),MAX('T1'!M13,'T2'!K13),COUNTRY_INFO!F13),0)))","v":0},{"$f":"IF(AND(COUNTRY_INFO!K13>0,COUNTRY_INFO!K13<4),IF(Z13>0,IF(COUNTRY_INFO!K13=1, AD13/(COUNTRY_INFO!F13*0.33)*100, IF(COUNTRY_INFO!K13=2, AD13/(COUNTRY_INFO!F13*0.5)*100, IF(COUNTRY_INFO!K13=3, AD13/COUNTRY_INFO!F13*100))),\"-\"),0)","v":0},{"$f":"IF(COUNTRY_INFO!K13=2,IF(COUNTRY_INFO!G13*0.2>MAX('T1'!N13,'T2'!L13),MAX('T1'!N13,'T2'!L13),COUNTRY_INFO!G13*0.2),IF(COUNTRY_INFO!K13=3,IF(COUNTRY_INFO!G13>MAX('T1'!N13,'T2'!L13),MAX('T1'!N13,'T2'!L13),COUNTRY_INFO!G13),0))","v":0},{"$f":"IF(AND(COUNTRY_INFO!K13>0,COUNTRY_INFO!K13<4),IF(Z13>0,IF(COUNTRY_INFO!K13=1, 0, IF(COUNTRY_INFO!K13=2, AF13/(COUNTRY_INFO!G13*0.2)*100, IF(COUNTRY_INFO!K13=3, AF13/COUNTRY_INFO!G13*100))),\"-\"),0)","v":0},0,{"$f":"IF(AND(COUNTRY_INFO!K13>0,COUNTRY_INFO!K13<4), IF(AC13/Z13*100<>0, IF(AH13/Z13*100>100,100,AH13/Z13*100), \"-\"),0)","v":0},null,{"$f":"IF(AND(D13<>0, D13<>\"Unknown\",D13<>\"Stopped\",D13<>\"Not required\"),D13/COUNTRY_INFO!D13, 0)","v":0},{"$f":"IF(AND(J13<>0,J13<>\"Unknown\",J13<>\"Stopped\",J13<>\"Not required\"),J13/COUNTRY_INFO!D13, 0)","v":0},{"$f":"IF(AND(P13<>0,P13<>\"Unknown\",P13<>\"Not required\"),P13/(COUNTRY_INFO!E13+COUNTRY_INFO!F13), 0)","v":1},{"$f":"IF(AND(Z13<>0,Z13<>\"Unknown\",Z13<>\"Not required\"),IF(COUNTRY_INFO!K13=1,1,IF(COUNTRY_INFO!K13=2,0.5*COUNTRY_INFO!F13/(0.5*COUNTRY_INFO!F13+0.2*COUNTRY_INFO!G13),IF(COUNTRY_INFO!K13=3,COUNTRY_INFO!F13/(COUNTRY_INFO!F13+COUNTRY_INFO!G13)))),0)","v":0},{"$f":"IF(AND(Z13<>0,Z13<>\"Unknown\",Z13<>\"Not required\"),IF(COUNTRY_INFO!K13=1,0,IF(COUNTRY_INFO!K13=2,0.2*COUNTRY_INFO!G13/(0.5*COUNTRY_INFO!F13+0.2*COUNTRY_INFO!G13),IF(COUNTRY_INFO!K13=3,COUNTRY_INFO!G13/(COUNTRY_INFO!F13+COUNTRY_INFO!G13)))),0)","v":0},{"$f":"MAX(COUNTRY_INFO!D13*AK13*PROFILE!$G$7,COUNTRY_INFO!D13*AL13*PROFILE!$G$7)","v":0},{"$f":"MAX(COUNTRY_INFO!D13*AK13*PROFILE!$G$8,COUNTRY_INFO!D13*AL13*PROFILE!$G$8,COUNTRY_INFO!D13*AM13*PROFILE!$G$8)","v":568762.12008349109},{"$f":"MAX(COUNTRY_INFO!D13*AK13*PROFILE!$G$9,COUNTRY_INFO!D13*AL13*PROFILE!$G$9,COUNTRY_INFO!D13*AM13*PROFILE!$G$9,IF(AND(DISTRICT!Z13<>\"Unknown\",Z13<>\"Not required\"),COUNTRY_INFO!O13*DISTRICT!AN13,0))","v":1125472.9621038774},{"$f":"MAX(COUNTRY_INFO!D13*AK13*PROFILE!$G$10,COUNTRY_INFO!D13*AL13*PROFILE!$G$10,IF(AND(DISTRICT!Z13<>\"Unknown\",Z13<>\"Not required\"),COUNTRY_INFO!O13*DISTRICT!AO13,0))","v":0},1694235.0821873685,"Y",{"$f":"MAX('MDA2'!J13,'T1'!L13,'T2'!J13,T3_R1!K13,T3_R2!K13)","v":99799},{"$f":"MAX('MDA1'!K13,'MDA2'!K13,'MDA3'!I13,'MDA3'!L13,'T1'!M13,'T2'!K13,T3_R1!L13,T3_R2!L13)","v":1230031},{"$f":"MAX('MDA1'!L13,'MDA2'!L13,'MDA3'!J13,'MDA3'!M13,'T1'!N13,'T2'!L13,T3_R1!M13,T3_R2!M13)","v":0},1329830,{"$f":"MAX('MDA2'!J13,T13)","v":99799},{"$f":"MAX('MDA1'!K13,'MDA2'!K13,'MDA3'!I13,'MDA3'!L13,V13,AD13)","v":1119607},{"$f":"MAX('MDA1'!L13,'MDA2'!L13,'MDA3'!J13,'MDA3'!M13,AF13)","v":0},1219406,71.973837209513263]
[{"$f":"IF(COUNTRY_INFO!A14=0,\" \",COUNTRY_INFO!A14)","v":"South Africa"},{"$f":"IF(COUNTRY_INFO!B14=0,\" \",COUNTRY_INFO!B14)","v":"Mpumalanga"},{"$f":"IF(COUNTRY_INFO!C14=0,\" \",COUNTRY_INFO!C14)","v":" "},{"$f":"COUNTRY_INFO!L14","v":0},null,null,{"$f":"MAX('MDA1'!M14,'MDA2'!M14)","v":0},{"$f":"IF(AND(COUNTRY_INFO!H14>0,COUNTRY_INFO!H14<4),IF(D14>MAX('MDA1'!M14,'MDA2'!M14),MAX('MDA1'!M14,'MDA2'!M14),D14),0)","v":0},{"$f":"IF(AND(COUNTRY_INFO!H14>0,COUNTRY_INFO!H14<4), IF(G14/D14*100<>0, IF(G14/D14*100>100,100,G14/D14*100), \"-\"),0)","v":0},{"$f":"COUNTRY_INFO!M14","v":0},null,null,{"$f":"MAX('MDA1'!M14,MAX('MDA3'!I14,'MDA3'!L14)+MAX('MDA3'!J14,'MDA3'!M14))","v":0},{"$f":"IF(AND(COUNTRY_INFO!I14>0,COUNTRY_INFO!I14<4),IF(J14>MAX('MDA1'!M14,MAX('MDA3'!I14,'MDA3'!L14)+MAX('MDA3'!J14,'MDA3'!M14)),MAX('MDA1'!M14,MAX('MDA3'!I14,'MDA3'!L14)+MAX('MDA3'!J14,'MDA3'!M14)),J14),0)","v":0},{"$f":"IF(AND(COUNTRY_INFO!I14>0,COUNTRY_INFO!I14<4), IF(M14/J14*100<>0, IF(M14/J14*100>100,100,M14/J14*100), \"-\"),0)","v":0},{"$f":"COUNTRY_INFO!N14","v":1265157},null,null,{"$f":"SUM(MAX('MDA2'!J14, 'T1'!L14, MAX(T3_R1!K14, T3_R2!K14)), MAX('MDA1'!K14, 'MDA2'!K14, 'T1'!M14, MAX(T3_R1!L14, T3_R2!L14)), MAX('MDA1'!L14, 'MDA2'!L14, 'T1'!N14, MAX(T3_R1!M14, T3_R2!M14)))","v":637581},{"$f":"IF(AND(COUNTRY_INFO!J14>1,COUNTRY_INFO!J14<4),IF(COUNTRY_INFO!E14>MAX('MDA2'!J14,'T1'!L14,MAX(T3_R1!K14,T3_R2!K14)),MAX('MDA2'!J14,'T1'!L14,MAX(T3_R1!K14,T3_R2!K14)),COUNTRY_INFO!E14),0)","v":59791},{"$f":"IF(AND(COUNTRY_INFO!J14>1,COUNTRY_INFO!J14<4), IF(T14/COUNTRY_INFO!E14*100<>0, IF(T14/COUNTRY_INFO!E14*100>100,100,T14/COUNTRY_INFO!E14*100), \"-\"),0)","v":14.021424584804867},{"$f":"IF(AND(COUNTRY_INFO!J14>1,COUNTRY_INFO!J14<4),IF(COUNTRY_INFO!F14>MAX('MDA1'!K14,'MDA2'!K14,'T1'!M14,MAX(T3_R1!L14,T3_R2!L14)),MAX('MDA1'!K14,'MDA2'!K14,'T1'!M14,MAX(T3_R1!L14,T3_R2!L14)),COUNTRY_INFO!F14),0)","v":577790},{"$f":"IF(AND(COUNTRY_INFO!J14>1,COUNTRY_INFO!J14<4), IF(V14/COUNTRY_INFO!F14*100<>0, IF(V14/COUNTRY_INFO!F14*100>100,100,V14/COUNTRY_INFO!F14*100), \"-\"),0)","v":68.888594793801587},637581,{"$f":"IF(AND(COUNTRY_INFO!J14>1,COUNTRY_INFO!J14<4), IF(S14/P14*100<>0, IF(X14/P14*100>100,100,X14/P14*100), \"-\"),0)","v":50.395405471415799},{"$f":"COUNTRY_INFO!O14","v":0},null,null,{"$f":"MAX('T1'!L14,'T2'!J14)+MAX('T1'!M14,'T2'!K14)+MAX('T1'!N14,'T2'!L14)","v":0},{"$f":"IF(COUNTRY_INFO!K14=1,IF(COUNTRY_INFO!F14*0.33>MAX('T1'!M14,'T2'!K14),MAX('T1'!M14,'T2'!K14),COUNTRY_INFO!F14*0.33),IF(COUNTRY_INFO!K14=2,IF(COUNTRY_INFO!F14*0.5>MAX('T1'!M14,'T2'!K14),MAX('T1'!M14,'T2'!K14),COUNTRY_INFO!F14*0.5),IF(COUNTRY_INFO!K14=3,IF(COUNTRY_INFO!F14>MAX('T1'!M14,'T2'!K14),MAX('T1'!M14,'T2'!K14),COUNTRY_INFO!F14),0)))","v":0},{"$f":"IF(AND(COUNTRY_INFO!K14>0,COUNTRY_INFO!K14<4),IF(Z14>0,IF(COUNTRY_INFO!K14=1, AD14/(COUNTRY_INFO!F14*0.33)*100, IF(COUNTRY_INFO!K14=2, AD14/(COUNTRY_INFO!F14*0.5)*100, IF(COUNTRY_INFO!K14=3, AD14/COUNTRY_INFO!F14*100))),\"-\"),0)","v":0},{"$f":"IF(COUNTRY_INFO!K14=2,IF(COUNTRY_INFO!G14*0.2>MAX('T1'!N14,'T2'!L14),MAX('T1'!N14,'T2'!L14),COUNTRY_INFO!G14*0.2),IF(COUNTRY_INFO!K14=3,IF(COUNTRY_INFO!G14>MAX('T1'!N14,'T2'!L14),MAX('T1'!N14,'T2'!L14),COUNTRY_INFO!G14),0))","v":0},{"$f":"IF(AND(COUNTRY_INFO!K14>0,COUNTRY_INFO!K14<4),IF(Z14>0,IF(COUNTRY_INFO!K14=1, 0, IF(COUNTRY_INFO!K14=2, AF14/(COUNTRY_INFO!G14*0.2)*100, IF(COUNTRY_INFO!K14=3, AF14/COUNTRY_INFO!G14*100))),\"-\"),0)","v":0},0,{"$f":"IF(AND(COUNTRY_INFO!K14>0,COUNTRY_INFO!K14<4), IF(AC14/Z14*100<>0, IF(AH14/Z14*100>100,100,AH14/Z14*100), \"-\"),0)","v":0},null,{"$f":"IF(AND(D14<>0, D14<>\"Unknown\",D14<>\"Stopped\",D14<>\"Not required\"),D14/COUNTRY_INFO!D14, 0)","v":0},{"$f":"IF(AND(J14<>0,J14<>\"Unknown\",J14<>\"Stopped\",J14<>\"Not required\"),J14/COUNTRY_INFO!D14, 0)","v":0},{"$f":"IF(AND(P14<>0,P14<>\"Unknown\",P14<>\"Not required\"),P14/(COUNTRY_INFO!E14+COUNTRY_INFO!F14), 0)","v":1},{"$f":"IF(AND(Z14<>0,Z14<>\"Unknown\",Z14<>\"Not required\"),IF(COUNTRY_INFO!K14=1,1,IF(COUNTRY_INFO!K14=2,0.5*COUNTRY_INFO!F14/(0.5*COUNTRY_INFO!F14+0.2*COUNTRY_INFO!G14),IF(COUNTRY_INFO!K14=3,COUNTRY_INFO!F14/(COUNTRY_INFO!F14+COUNTRY_INFO!G14)))),0)","v":0},{"$f":"IF(AND(Z14<>0,Z14<>\"Unknown\",Z14<>\"Not required\"),IF(COUNTRY_INFO!K14=1,0,IF(COUNTRY_INFO!K14=2,0.2*COUNTRY_INFO!G14/(0.5*COUNTRY_INFO!F14+0.2*COUNTRY_INFO!G14),IF(COUNTRY_INFO!K14=3,COUNTRY_INFO!G14/(COUNTRY_INFO!F14+COUNTRY_INFO!G14)))),0)","v":0},{"$f":"MAX(COUNTRY_INFO!D14*AK14*PROFILE!$G$7,COUNTRY_INFO!D14*AL14*PROFILE!$G$7)","v":0},{"$f":"MAX(COUNTRY_INFO!D14*AK14*PROFILE!$G$8,COUNTRY_INFO!D14*AL14*PROFILE!$G$8,COUNTRY_INFO!D14*AM14*PROFILE!$G$8)","v":426077.2646797325},{"$f":"MAX(COUNTRY_INFO!D14*AK14*PROFILE!$G$9,COUNTRY_INFO!D14*AL14*PROFILE!$G$9,COUNTRY_INFO!D14*AM14*PROFILE!$G$9,IF(AND(DISTRICT!Z14<>\"Unknown\",Z14<>\"Not required\"),COUNTRY_INFO!O14*DISTRICT!AN14,0))","v":843126.54487929482},{"$f":"MAX(COUNTRY_INFO!D14*AK14*PROFILE!$G$10,COUNTRY_INFO!D14*AL14*PROFILE!$G$10,IF(AND(DISTRICT!Z14<>\"Unknown\",Z14<>\"Not required\"),COUNTRY_INFO!O14*DISTRICT!AO14,0))","v":0},1269203.8095590272,"Y",{"$f":"MAX('MDA2'!J14,'T1'!L14,'T2'!J14,T3_R1!K14,T3_R2!K14)","v":59791},{"$f":"MAX('MDA1'!K14,'MDA2'!K14,'MDA3'!I14,'MDA3'!L14,'T1'!M14,'T2'!K14,T3_R1!L14,T3_R2!L14)","v":577790},{"$f":"MAX('MDA1'!L14,'MDA2'!L14,'MDA3'!J14,'MDA3'!M14,'T1'!N14,'T2'!L14,T3_R1!M14,T3_R2!M14)","v":0},637581,{"$f":"MAX('MDA2'!J14,T14)","v":59791},{"$f":"MAX('MDA1'!K14,'MDA2'!K14,'MDA3'!I14,'MDA3'!L14,V14,AD14)","v":577790},{"$f":"MAX('MDA1'!L14,'MDA2'!L14,'MDA3'!J14,'MDA3'!M14,AF14)","v":0},637581,50.23472157883937]
[{"$f":"IF(COUNTRY_INFO!A15=0,\" \",COUNTRY_INFO!A15)","v":"South Africa"},{"$f":"IF(COUNTRY_INFO!B15=0,\" \",COUNTRY_INFO!B15)","v":"North West"},{"$f":"IF(COUNTRY_INFO!C15=0,\" \",COUNTRY_INFO!C15)","v":" "},{"$f":"COUNTRY_INFO!L15","v":0},null,null,{"$f":"MAX('MDA1'!M15,'MDA2'!M15)","v":0},{"$f":"IF(AND(COUNTRY_INFO!H15>0,COUNTRY_INFO!H15<4),IF(D15>MAX('MDA1'!M15,'MDA2'!M15),MAX('MDA1'!M15,'MDA2'!M15),D15),0)","v":0},{"$f":"IF(AND(COUNTRY_INFO!H15>0,COUNTRY_INFO!H15<4), IF(G15/D15*100<>0, IF(G15/D15*100>100,100,G15/D15*100), \"-\"),0)","v":0},{"$f":"COUNTRY_INFO!M15","v":0},null,null,{"$f":"MAX('MDA1'!M15,MAX('MDA3'!I15,'MDA3'!L15)+MAX('MDA3'!J15,'MDA3'!M15))","v":0},{"$f":"IF(AND(COUNTRY_INFO!I15>0,COUNTRY_INFO!I15<4),IF(J15>MAX('MDA1'!M15,MAX('MDA3'!I15,'MDA3'!L15)+MAX('MDA3'!J15,'MDA3'!M15)),MAX('MDA1'!M15,MAX('MDA3'!I15,'MDA3'!L15)+MAX('MDA3'!J15,'MDA3'!M15)),J15),0)","v":0},{"$f":"IF(AND(COUNTRY_INFO!I15>0,COUNTRY_INFO!I15<4), IF(M15/J15*100<>0, IF(M15/J15*100>100,100,M15/J15*100), \"-\"),0)","v":0},{"$f":"COUNTRY_INFO!N15","v":1106061},null,null,{"$f":"SUM(MAX('MDA2'!J15, 'T1'!L15, MAX(T3_R1!K15, T3_R2!K15)), MAX('MDA1'!K15, 'MDA2'!K15, 'T1'!M15, MAX(T3_R1!L15, T3_R2!L15)), MAX('MDA1'!L15, 'MDA2'!L15, 'T1'!N15, MAX(T3_R1!M15, T3_R2!M15)))","v":581351},{"$f":"IF(AND(COUNTRY_INFO!J15>1,COUNTRY_INFO!J15<4),IF(COUNTRY_INFO!E15>MAX('MDA2'!J15,'T1'!L15,MAX(T3_R1!K15,T3_R2!K15)),MAX('MDA2'!J15,'T1'!L15,MAX(T3_R1!K15,T3_R2!K15)),COUNTRY_INFO!E15),0)","v":51401},{"$f":"IF(AND(COUNTRY_INFO!J15>1,COUNTRY_INFO!J15<4), IF(T15/COUNTRY_INFO!E15*100<>0, IF(T15/COUNTRY_INFO!E15*100>100,100,T15/COUNTRY_INFO!E15*100), \"-\"),0)","v":13.787784904010451},{"$f":"IF(AND(COUNTRY_INFO!J15>1,COUNTRY_INFO!J15<4),IF(COUNTRY_INFO!F15>MAX('MDA1'!K15,'MDA2'!K15,'T1'!M15,MAX(T3_R1!L15,T3_R2!L15)),MAX('MDA1'!K15,'MDA2'!K15,'T1'!M15,MAX(T3_R1!L15,T3_R2!L15)),COUNTRY_INFO!F15),0)","v":529950},{"$f":"IF(AND(COUNTRY_INFO!J15>1,COUNTRY_INFO!J15<4), IF(V15/COUNTRY_INFO!F15*100<>0, IF(V15/COUNTRY_INFO!F15*100>100,100,V15/COUNTRY_INFO!F15*100), \"-\"),0)","v":72.273136404549547},581351,{"$f":"IF(AND(COUNTRY_INFO!J15>1,COUNTRY_INFO!J15<4), IF(S15/P15*100<>0, IF(X15/P15*100>100,100,X15/P15*100), \"-\"),0)","v":52.56048264969111},{"$f":"COUNTRY_INFO!O15","v":0},null,null,{"$f":"MAX('T1'!L15,'T2'!J15)+MAX('T1'!M15,'T2'!K15)+MAX('T1'!N15,'T2'!L15)","v":0},{"$f":"IF(COUNTRY_INFO!K15=1,IF(COUNTRY_INFO!F15*0.33>MAX('T1'!M15,'T2'!K15),MAX('T1'!M15,'T2'!K15),COUNTRY_INFO!F15*0.33),IF(COUNTRY_INFO!K15=2,IF(COUNTRY_INFO!F15*0.5>MAX('T1'!M15,'T2'!K15),MAX('T1'!M15,'T2'!K15),COUNTRY_INFO!F15*0.5),IF(COUNTRY_INFO!K15=3,IF(COUNTRY_INFO!F15>MAX('T1'!M15,'T2'!K15),MAX('T1'!M15,'T2'!K15),COUNTRY_INFO!F15),0)))","v":0},{"$f":"IF(AND(COUNTRY_INFO!K15>0,COUNTRY_INFO!K15<4),IF(Z15>0,IF(COUNTRY_INFO!K15=1, AD15/(COUNTRY_INFO!F15*0.33)*100, IF(COUNTRY_INFO!K15=2, AD15/(COUNTRY_INFO!F15*0.5)*100, IF(COUNTRY_INFO!K15=3, AD15/COUNTRY_INFO!F15*100))),\"-\"),0)","v":0},{"$f":"IF(COUNTRY_INFO!K15=2,IF(COUNTRY_INFO!G15*0.2>MAX('T1'!N15,'T2'!L15),MAX('T1'!N15,'T2'!L15),COUNTRY_INFO!G15*0.2),IF(COUNTRY_INFO!K15=3,IF(COUNTRY_INFO!G15>MAX('T1'!N15,'T2'!L15),MAX('T1'!N15,'T2'!L15),COUNTRY_INFO!G15),0))","v":0},{"$f":"IF(AND(COUNTRY_INFO!K15>0,COUNTRY_INFO!K15<4),IF(Z15>0,IF(COUNTRY_INFO!K15=1, 0, IF(COUNTRY_INFO!K15=2, AF15/(COUNTRY_INFO!G15*0.2)*100, IF(COUNTRY_INFO!K15=3, AF15/COUNTRY_INFO!G15*100))),\"-\"),0)","v":0},0,{"$f":"IF(AND(COUNTRY_INFO!K15>0,COUNTRY_INFO!K15<4), IF(AC15/Z15*100<>0, IF(AH15/Z15*100>100,100,AH15/Z15*100), \"-\"),0)","v":0},null,{"$f":"IF(AND(D15<>0, D15<>\"Unknown\",D15<>\"Stopped\",D15<>\"Not required\"),D15/COUNTRY_INFO!D15, 0)","v":0},{"$f":"IF(AND(J15<>0,J15<>\"Unknown\",J15<>\"Stopped\",J15<>\"Not required\"),J15/COUNTRY_INFO!D15, 0)","v":0},{"$f":"IF(AND(P15<>0,P15<>\"Unknown\",P15<>\"Not required\"),P15/(COUNTRY_INFO!E15+COUNTRY_INFO!F15), 0)","v":1},{"$f":"IF(AND(Z15<>0,Z15<>\"Unknown\",Z15<>\"Not required\"),IF(COUNTRY_INFO!K15=1,1,IF(COUNTRY_INFO!K15=2,0.5*COUNTRY_INFO!F15/(0.5*COUNTRY_INFO!F15+0.2*COUNTRY_INFO!G15),IF(COUNTRY_INFO!K15=3,COUNTRY_INFO!F15/(COUNTRY_INFO!F15+COUNTRY_INFO!G15)))),0)","v":0},{"$f":"IF(AND(Z15<>0,Z15<>\"Unknown\",Z15<>\"Not required\"),IF(COUNTRY_INFO!K15=1,0,IF(COUNTRY_INFO!K15=2,0.2*COUNTRY_INFO!G15/(0.5*COUNTRY_INFO!F15+0.2*COUNTRY_INFO!G15),IF(COUNTRY_INFO!K15=3,COUNTRY_INFO!G15/(COUNTRY_INFO!F15+COUNTRY_INFO!G15)))),0)","v":0},{"$f":"MAX(COUNTRY_INFO!D15*AK15*PROFILE!$G$7,COUNTRY_INFO!D15*AL15*PROFILE!$G$7)","v":0},{"$f":"MAX(COUNTRY_INFO!D15*AK15*PROFILE!$G$8,COUNTRY_INFO!D15*AL15*PROFILE!$G$8,COUNTRY_INFO!D15*AM15*PROFILE!$G$8)","v":372602.18855378282},{"$f":"MAX(COUNTRY_INFO!D15*AK15*PROFILE!$G$9,COUNTRY_INFO!D15*AL15*PROFILE!$G$9,COUNTRY_INFO!D15*AM15*PROFILE!$G$9,IF(AND(DISTRICT!Z15<>\"Unknown\",Z15<>\"Not required\"),COUNTRY_INFO!O15*DISTRICT!AN15,0))","v":737309.45509601559},{"$f":"MAX(COUNTRY_INFO!D15*AK15*PROFILE!$G$10,COUNTRY_INFO!D15*AL15*PROFILE!$G$10,IF(AND(DISTRICT!Z15<>\"Unknown\",Z15<>\"Not required\"),COUNTRY_INFO!O15*DISTRICT!AO15,0))","v":0},1109911.6436497984,"Y",{"$f":"MAX('MDA2'!J15,'T1'!L15,'T2'!J15,T3_R1!K15,T3_R2!K15)","v":51401},{"$f":"MAX('MDA1'!K15,'MDA2'!K15,'MDA3'!I15,'MDA3'!L15,'T1'!M15,'T2'!K15,T3_R1!L15,T3_R2!L15)","v":529950},{"$f":"MAX('MDA1'!L15,'MDA2'!L15,'MDA3'!J15,'MDA3'!M15,'T1'!N15,'T2'!L15,T3_R1!M15,T3_R2!M15)","v":0},581351,{"$f":"MAX('MDA2'!J15,T15)","v":51401},{"$f":"MAX('MDA1'!K15,'MDA2'!K15,'MDA3'!I15,'MDA3'!L15,V15,AD15)","v":529950},{"$f":"MAX('MDA1'!L15,'MDA2'!L15,'MDA3'!J15,'MDA3'!M15,AF15)","v":0},581351,52.378133279898186]
[{"$f":"IF(COUNTRY_INFO!A16=0,\" \",COUNTRY_INFO!A16)","v":"South Africa"},{"$f":"IF(COUNTRY_INFO!B16=0,\" \",COUNTRY_INFO!B16)","v":"Northern Cape"},{"$f":"IF(COUNTRY_INFO!C16=0,\" \",COUNTRY_INFO!C16)","v":" "},{"$f":"COUNTRY_INFO!L16","v":0},null,null,{"$f":"MAX('MDA1'!M16,'MDA2'!M16)","v":0},{"$f":"IF(AND(COUNTRY_INFO!H16>0,COUNTRY_INFO!H16<4),IF(D16>MAX('MDA1'!M16,'MDA2'!M16),MAX('MDA1'!M16,'MDA2'!M16),D16),0)","v":0},{"$f":"IF(AND(COUNTRY_INFO!H16>0,COUNTRY_INFO!H16<4), IF(G16/D16*100<>0, IF(G16/D16*100>100,100,G16/D16*100), \"-\"),0)","v":0},{"$f":"COUNTRY_INFO!M16","v":0},null,null,{"$f":"MAX('MDA1'!M16,MAX('MDA3'!I16,'MDA3'!L16)+MAX('MDA3'!J16,'MDA3'!M16))","v":0},{"$f":"IF(AND(COUNTRY_INFO!I16>0,COUNTRY_INFO!I16<4),IF(J16>MAX('MDA1'!M16,MAX('MDA3'!I16,'MDA3'!L16)+MAX('MDA3'!J16,'MDA3'!M16)),MAX('MDA1'!M16,MAX('MDA3'!I16,'MDA3'!L16)+MAX('MDA3'!J16,'MDA3'!M16)),J16),0)","v":0},{"$f":"IF(AND(COUNTRY_INFO!I16>0,COUNTRY_INFO!I16<4), IF(M16/J16*100<>0, IF(M16/J16*100>100,100,M16/J16*100), \"-\"),0)","v":0},{"$f":"COUNTRY_INFO!N16","v":398548},null,null,{"$f":"SUM(MAX('MDA2'!J16, 'T1'!L16, MAX(T3_R1!K16, T3_R2!K16)), MAX('MDA1'!K16, 'MDA2'!K16, 'T1'!M16, MAX(T3_R1!L16, T3_R2!L16)), MAX('MDA1'!L16, 'MDA2'!L16, 'T1'!N16, MAX(T3_R1!M16, T3_R2!M16)))","v":114460},{"$f":"IF(AND(COUNTRY_INFO!J16>1,COUNTRY_INFO!J16<4),IF(COUNTRY_INFO!E16>MAX('MDA2'!J16,'T1'!L16,MAX(T3_R1!K16,T3_R2!K16)),MAX('MDA2'!J16,'T1'!L16,MAX(T3_R1!K16,T3_R2!K16)),COUNTRY_INFO!E16),0)","v":8997},{"$f":"IF(AND(COUNTRY_INFO!J16>1,COUNTRY_INFO!J16<4), IF(T16/COUNTRY_INFO!E16*100<>0, IF(T16/COUNTRY_INFO!E16*100>100,100,T16/COUNTRY_INFO!E16*100), \"-\"),0)","v":7.5589797015727918},{"$f":"IF(AND(COUNTRY_INFO!J16>1,COUNTRY_INFO!J16<4),IF(COUNTRY_INFO!F16>MAX('MDA1'!K16,'MDA2'!K16,'T1'!M16,MAX(T3_R1!L16,T3_R2!L16)),MAX('MDA1'!K16,'MDA2'!K16,'T1'!M16,MAX(T3_R1!L16,T3_R2!L16)),COUNTRY_INFO!F16),0)","v":105463},{"$f":"IF(AND(COUNTRY_INFO!J16>1,COUNTRY_INFO!J16<4), IF(V16/COUNTRY_INFO!F16*100<>0, IF(V16/COUNTRY_INFO!F16*100>100,100,V16/COUNTRY_INFO!F16*100), \"-\"),0)","v":37.729497288247167},114460,{"$f":"IF(AND(COUNTRY_INFO!J16>1,COUNTRY_INFO!J16<4), IF(S16/P16*100<>0, IF(X16/P16*100>100,100,X16/P16*100), \"-\"),0)","v":28.719250880696929},{"$f":"COUNTRY_INFO!O16","v":0},null,null,{"$f":"MAX('T1'!L16,'T2'!J16)+MAX('T1'!M16,'T2'!K16)+MAX('T1'!N16,'T2'!L16)","v":0},{"$f":"IF(COUNTRY_INFO!K16=1,IF(COUNTRY_INFO!F16*0.33>MAX('T1'!M16,'T2'!K16),MAX('T1'!M16,'T2'!K16),COUNTRY_INFO!F16*0.33),IF(COUNTRY_INFO!K16=2,IF(COUNTRY_INFO!F16*0.5>MAX('T1'!M16,'T2'!K16),MAX('T1'!M16,'T2'!K16),COUNTRY_INFO!F16*0.5),IF(COUNTRY_INFO!K16=3,IF(COUNTRY_INFO!F16>MAX('T1'!M16,'T2'!K16),MAX('T1'!M16,'T2'!K16),COUNTRY_INFO!F16),0)))","v":0},{"$f":"IF(AND(COUNTRY_INFO!K16>0,COUNTRY_INFO!K16<4),IF(Z16>0,IF(COUNTRY_INFO!K16=1, AD16/(COUNTRY_INFO!F16*0.33)*100, IF(COUNTRY_INFO!K16=2, AD16/(COUNTRY_INFO!F16*0.5)*100, IF(COUNTRY_INFO!K16=3, AD16/COUNTRY_INFO!F16*100))),\"-\"),0)","v":0},{"$f":"IF(COUNTRY_INFO!K16=2,IF(COUNTRY_INFO!G16*0.2>MAX('T1'!N16,'T2'!L16),MAX('T1'!N16,'T2'!L16),COUNTRY_INFO!G16*0.2),IF(COUNTRY_INFO!K16=3,IF(COUNTRY_INFO!G16>MAX('T1'!N16,'T2'!L16),MAX('T1'!N16,'T2'!L16),COUNTRY_INFO!G16),0))","v":0},{"$f":"IF(AND(COUNTRY_INFO!K16>0,COUNTRY_INFO!K16<4),IF(Z16>0,IF(COUNTRY_INFO!K16=1, 0, IF(COUNTRY_INFO!K16=2, AF16/(COUNTRY_INFO!G16*0.2)*100, IF(COUNTRY_INFO!K16=3, AF16/COUNTRY_INFO!G16*100))),\"-\"),0)","v":0},0,{"$f":"IF(AND(COUNTRY_INFO!K16>0,COUNTRY_INFO!K16<4), IF(AC16/Z16*100<>0, IF(AH16/Z16*100>100,100,AH16/Z16*100), \"-\"),0)","v":0},null,{"$f":"IF(AND(D16<>0, D16<>\"Unknown\",D16<>\"Stopped\",D16<>\"Not required\"),D16/COUNTRY_INFO!D16, 0)","v":0},{"$f":"IF(AND(J16<>0,J16<>\"Unknown\",J16<>\"Stopped\",J16<>\"Not required\"),J16/COUNTRY_INFO!D16, 0)","v":0},{"$f":"IF(AND(P16<>0,P16<>\"Unknown\",P16<>\"Not required\"),P16/(COUNTRY_INFO!E16+COUNTRY_INFO!F16), 0)","v":1},{"$f":"IF(AND(Z16<>0,Z16<>\"Unknown\",Z16<>\"Not required\"),IF(COUNTRY_INFO!K16=1,1,IF(COUNTRY_INFO!K16=2,0.5*COUNTRY_INFO!F16/(0.5*COUNTRY_INFO!F16+0.2*COUNTRY_INFO!G16),IF(COUNTRY_INFO!K16=3,COUNTRY_INFO!F16/(COUNTRY_INFO!F16+COUNTRY_INFO!G16)))),0)","v":0},{"$f":"IF(AND(Z16<>0,Z16<>\"Unknown\",Z16<>\"Not required\"),IF(COUNTRY_INFO!K16=1,0,IF(COUNTRY_INFO!K16=2,0.2*COUNTRY_INFO!G16/(0.5*COUNTRY_INFO!F16+0.2*COUNTRY_INFO!G16),IF(COUNTRY_INFO!K16=3,COUNTRY_INFO!G16/(COUNTRY_INFO!F16+COUNTRY_INFO!G16)))),0)","v":0},{"$f":"MAX(COUNTRY_INFO!D16*AK16*PROFILE!$G$7,COUNTRY_INFO!D16*AL16*PROFILE!$G$7)","v":0},{"$f":"MAX(COUNTRY_INFO!D16*AK16*PROFILE!$G$8,COUNTRY_INFO!D16*AL16*PROFILE!$G$8,COUNTRY_INFO!D16*AM16*PROFILE!$G$8)","v":118929.86203391828},{"$f":"MAX(COUNTRY_INFO!D16*AK16*PROFILE!$G$9,COUNTRY_INFO!D16*AL16*PROFILE!$G$9,COUNTRY_INFO!D16*AM16*PROFILE!$G$9,IF(AND(DISTRICT!Z16<>\"Unknown\",Z16<>\"Not required\"),COUNTRY_INFO!O16*DISTRICT!AN16,0))","v":235339.76574647889},{"$f":"MAX(COUNTRY_INFO!D16*AK16*PROFILE!$G$10,COUNTRY_INFO!D16*AL16*PROFILE!$G$10,IF(AND(DISTRICT!Z16<>\"Unknown\",Z16<>\"Not required\"),COUNTRY_INFO!O16*DISTRICT!AO16,0))","v":0},354269.62778039719,"Y",{"$f":"MAX('MDA2'!J16,'T1'!L16,'T2'!J16,T3_R1!K16,T3_R2!K16)","v":8997},{"$f":"MAX('MDA1'!K16,'MDA2'!K16,'MDA3'!I16,'MDA3'!L16,'T1'!M16,'T2'!K16,T3_R1!L16,T3_R2!L16)","v":105463},{"$f":"MAX('MDA1'!L16,'MDA2'!L16,'MDA3'!J16,'MDA3'!M16,'T1'!N16,'T2'!L16,T3_R1!M16,T3_R2!M16)","v":0},114460,{"$f":"MAX('MDA2'!J16,T16)","v":8997},{"$f":"MAX('MDA1'!K16,'MDA2'!K16,'MDA3'!I16,'MDA3'!L16,V16,AD16)","v":105463},{"$f":"MAX('MDA1'!L16,'MDA2'!L16,'MDA3'!J16,'MDA3'!M16,AF16)","v":0},114460,32.308725056992706]
[{"$f":"IF(COUNTRY_INFO!A17=0,\" \",COUNTRY_INFO!A17)","v":"South Africa"},{"$f":"IF(COUNTRY_INFO!B17=0,\" \",COUNTRY_INFO!B17)","v":"Western Cape"},{"$f":"IF(COUNTRY_INFO!C17=0,\" \",COUNTRY_INFO!C17)","v":" "},{"$f":"COUNTRY_INFO!L17","v":0},null,null,{"$f":"MAX('MDA1'!M17,'MDA2'!M17)","v":0},{"$f":"IF(AND(COUNTRY_INFO!H17>0,COUNTRY_INFO!H17<4),IF(D17>MAX('MDA1'!M17,'MDA2'!M17),MAX('MDA1'!M17,'MDA2'!M17),D17),0)","v":0},{"$f":"IF(AND(COUNTRY_INFO!H17>0,COUNTRY_INFO!H17<4), IF(G17/D17*100<>0, IF(G17/D17*100>100,100,G17/D17*100), \"-\"),0)","v":0},{"$f":"COUNTRY_INFO!M17","v":0},null,null,{"$f":"MAX('MDA1'!M17,MAX('MDA3'!I17,'MDA3'!L17)+MAX('MDA3'!J17,'MDA3'!M17))","v":0},{"$f":"IF(AND(COUNTRY_INFO!I17>0,COUNTRY_INFO!I17<4),IF(J17>MAX('MDA1'!M17,MAX('MDA3'!I17,'MDA3'!L17)+MAX('MDA3'!J17,'MDA3'!M17)),MAX('MDA1'!M17,MAX('MDA3'!I17,'MDA3'!L17)+MAX('MDA3'!J17,'MDA3'!M17)),J17),0)","v":0},{"$f":"IF(AND(COUNTRY_INFO!I17>0,COUNTRY_INFO!I17<4), IF(M17/J17*100<>0, IF(M17/J17*100>100,100,M17/J17*100), \"-\"),0)","v":0},{"$f":"COUNTRY_INFO!N17","v":1865601},null,null,{"$f":"SUM(MAX('MDA2'!J17, 'T1'!L17, MAX(T3_R1!K17, T3_R2!K17)), MAX('MDA1'!K17, 'MDA2'!K17, 'T1'!M17, MAX(T3_R1!L17, T3_R2!L17)), MAX('MDA1'!L17, 'MDA2'!L17, 'T1'!N17, MAX(T3_R1!M17, T3_R2!M17)))","v":509510},{"$f":"IF(AND(COUNTRY_INFO!J17>1,COUNTRY_INFO!J17<4),IF(COUNTRY_INFO!E17>MAX('MDA2'!J17,'T1'!L17,MAX(T3_R1!K17,T3_R2!K17)),MAX('MDA2'!J17,'T1'!L17,MAX(T3_R1!K17,T3_R2!K17)),COUNTRY_INFO!E17),0)","v":45341},{"$f":"IF(AND(COUNTRY_INFO!J17>1,COUNTRY_INFO!J17<4), IF(T17/COUNTRY_INFO!E17*100<>0, IF(T17/COUNTRY_INFO!E17*100>100,100,T17/COUNTRY_INFO!E17*100), \"-\"),0)","v":7.2106500256040817},{"$f":"IF(AND(COUNTRY_INFO!J17>1,COUNTRY_INFO!J17<4),IF(COUNTRY_INFO!F17>MAX('MDA1'!K17,'MDA2'!K17,'T1'!M17,MAX(T3_R1!L17,T3_R2!L17)),MAX('MDA1'!K17,'MDA2'!K17,'T1'!M17,MAX(T3_R1!L17,T3_R2!L17)),COUNTRY_INFO!F17),0)","v":464169},{"$f":"IF(AND(COUNTRY_INFO!J17>1,COUNTRY_INFO!J17<4), IF(V17/COUNTRY_INFO!F17*100<>0, IF(V17/COUNTRY_INFO!F17*100>100,100,V17/COUNTRY_INFO!F17*100), \"-\"),0)","v":37.529986780347592},509510,{"$f":"IF(AND(COUNTRY_INFO!J17>1,COUNTRY_INFO!J17<4), IF(S17/P17*100<>0, IF(X17/P17*100>100,100,X17/P17*100), \"-\"),0)","v":27.310770094998876},{"$f":"COUNTRY_INFO!O17","v":0},null,null,{"$f":"MAX('T1'!L17,'T2'!J17)+MAX('T1'!M17,'T2'!K17)+MAX('T1'!N17,'T2'!L17)","v":0},{"$f":"IF(COUNTRY_INFO!K17=1,IF(COUNTRY_INFO!F17*0.33>MAX('T1'!M17,'T2'!K17),MAX('T1'!M17,'T2'!K17),COUNTRY_INFO!F17*0.33),IF(COUNTRY_INFO!K17=2,IF(COUNTRY_INFO!F17*0.5>MAX('T1'!M17,'T2'!K17),MAX('T1'!M17,'T2'!K17),COUNTRY_INFO!F17*0.5),IF(COUNTRY_INFO!K17=3,IF(COUNTRY_INFO!F17>MAX('T1'!M17,'T2'!K17),MAX('T1'!M17,'T2'!K17),COUNTRY_INFO!F17),0)))","v":0},{"$f":"IF(AND(COUNTRY_INFO!K17>0,COUNTRY_INFO!K17<4),IF(Z17>0,IF(COUNTRY_INFO!K17=1, AD17/(COUNTRY_INFO!F17*0.33)*100, IF(COUNTRY_INFO!K17=2, AD17/(COUNTRY_INFO!F17*0.5)*100, IF(COUNTRY_INFO!K17=3, AD17/COUNTRY_INFO!F17*100))),\"-\"),0)","v":0},{"$f":"IF(COUNTRY_INFO!K17=2,IF(COUNTRY_INFO!G17*0.2>MAX('T1'!N17,'T2'!L17),MAX('T1'!N17,'T2'!L17),COUNTRY_INFO!G17*0.2),IF(COUNTRY_INFO!K17=3,IF(COUNTRY_INFO!G17>MAX('T1'!N17,'T2'!L17),MAX('T1'!N17,'T2'!L17),COUNTRY_INFO!G17),0))","v":0},{"$f":"IF(AND(COUNTRY_INFO!K17>0,COUNTRY_INFO!K17<4),IF(Z17>0,IF(COUNTRY_INFO!K17=1, 0, IF(COUNTRY_INFO!K17=2, AF17/(COUNTRY_INFO!G17*0.2)*100, IF(COUNTRY_INFO!K17=3, AF17/COUNTRY_INFO!G17*100))),\"-\"),0)","v":0},0,{"$f":"IF(AND(COUNTRY_INFO!K17>0,COUNTRY_INFO!K17<4), IF(AC17/Z17*100<>0, IF(AH17/Z17*100>100,100,AH17/Z17*100), \"-\"),0)","v":0},null,{"$f":"IF(AND(D17<>0, D17<>\"Unknown\",D17<>\"Stopped\",D17<>\"Not required\"),D17/COUNTRY_INFO!D17, 0)","v":0},{"$f":"IF(AND(J17<>0,J17<>\"Unknown\",J17<>\"Stopped\",J17<>\"Not required\"),J17/COUNTRY_INFO!D17, 0)","v":0},{"$f":"IF(AND(P17<>0,P17<>\"Unknown\",P17<>\"Not required\"),P17/(COUNTRY_INFO!E17+COUNTRY_INFO!F17), 0)","v":1},{"$f":"IF(AND(Z17<>0,Z17<>\"Unknown\",Z17<>\"Not required\"),IF(COUNTRY_INFO!K17=1,1,IF(COUNTRY_INFO!K17=2,0.5*COUNTRY_INFO!F17/(0.5*COUNTRY_INFO!F17+0.2*COUNTRY_INFO!G17),IF(COUNTRY_INFO!K17=3,COUNTRY_INFO!F17/(COUNTRY_INFO!F17+COUNTRY_INFO!G17)))),0)","v":0},{"$f":"IF(AND(Z17<>0,Z17<>\"Unknown\",Z17<>\"Not required\"),IF(COUNTRY_INFO!K17=1,0,IF(COUNTRY_INFO!K17=2,0.2*COUNTRY_INFO!G17/(0.5*COUNTRY_INFO!F17+0.2*COUNTRY_INFO!G17),IF(COUNTRY_INFO!K17=3,COUNTRY_INFO!G17/(COUNTRY_INFO!F17+COUNTRY_INFO!G17)))),0)","v":0},{"$f":"MAX(COUNTRY_INFO!D17*AK17*PROFILE!$G$7,COUNTRY_INFO!D17*AL17*PROFILE!$G$7)","v":0},{"$f":"MAX(COUNTRY_INFO!D17*AK17*PROFILE!$G$8,COUNTRY_INFO!D17*AL17*PROFILE!$G$8,COUNTRY_INFO!D17*AM17*PROFILE!$G$8)","v":632645.995068516},{"$f":"MAX(COUNTRY_INFO!D17*AK17*PROFILE!$G$9,COUNTRY_INFO!D17*AL17*PROFILE!$G$9,COUNTRY_INFO!D17*AM17*PROFILE!$G$9,IF(AND(DISTRICT!Z17<>\"Unknown\",Z17<>\"Not required\"),COUNTRY_INFO!O17*DISTRICT!AN17,0))","v":1251887.101638197},{"$f":"MAX(COUNTRY_INFO!D17*AK17*PROFILE!$G$10,COUNTRY_INFO!D17*AL17*PROFILE!$G$10,IF(AND(DISTRICT!Z17<>\"Unknown\",Z17<>\"Not required\"),COUNTRY_INFO!O17*DISTRICT!AO17,0))","v":0},1884533.0967067131,"Y",{"$f":"MAX('MDA2'!J17,'T1'!L17,'T2'!J17,T3_R1!K17,T3_R2!K17)","v":45341},{"$f":"MAX('MDA1'!K17,'MDA2'!K17,'MDA3'!I17,'MDA3'!L17,'T1'!M17,'T2'!K17,T3_R1!L17,T3_R2!L17)","v":464169},{"$f":"MAX('MDA1'!L17,'MDA2'!L17,'MDA3'!J17,'MDA3'!M17,'T1'!N17,'T2'!L17,T3_R1!M17,T3_R2!M17)","v":0},509510,{"$f":"MAX('MDA2'!J17,T17)","v":45341},{"$f":"MAX('MDA1'!K17,'MDA2'!K17,'MDA3'!I17,'MDA3'!L17,V17,AD17)","v":464169},{"$f":"MAX('MDA1'!L17,'MDA2'!L17,'MDA3'!J17,'MDA3'!M17,AF17)","v":0},509510,27.03640497958812]

{"sheet":"SUMMARY","index":10,"n_rows":71,"n_cols":8,"rows_kept":71,"cut":false,"hidden":false,"merged":[[70,1,70,2],[36,1,36,2],[37,1,37,2],[38,1,38,2],[67,1,67,7],[63,1,63,2],[54,1,60,7],[69,1,69,2],[64,3,65,7],[49,1,49,7],[63,3,63,7],[50,3,50,4],[32,1,32,2],[33,1,33,2],[34,1,34,2],[35,1,35,2],[23,1,23,5],[31,1,31,2],[24,1,24,5],[25,1,25,5],[26,1,26,5],[27,1,27,5],[15,1,15,3],[0,1,0,5],[1,1,1,7],[5,1,11,7],[3,3,3,5]]}
[]
[null,"PC Joint Reporting Form v.3.1"]
[]
[null,"Country",null,{"$f":"IF(INTRO!$E$34<>0,INTRO!$E$34,\" \")","v":"South Africa"},null,null,"Year",{"$f":"IF(INTRO!$E$36<>0,INTRO!$E$36,\" \")","v":2016}]
[]
[null,"National authorities are requested to complete the Joint Reporting Form (JRF) for submission to the World Health Organization any time before 15 August of the current year for reporting data on PC interventions implemented during the previous year."]
[]
[]
[]
[]
[]
[]
[]
[null,"Number of people received treatment (at least once) for the diseases"]
[]
[null,null,null,null,"PreSAC","SAC","Adults","Total"]
[null,"Lymphatic filariasis",null,null,0,0,0,{"$f":"SUM(E17:G17)","v":0}]
[null,"Onchocerciasis",null,null,"Not eligible",0,0,{"$f":"SUM(E18:G18)","v":0}]
[null,"Soil-transmitted helminthiases",null,null,592066,6409934,0,{"$f":"SUM(E19:G19)","v":7002000}]
[null,"Schistosomiasis",null,null,"Not targeted",0,0,{"$f":"SUM(E20:G20)","v":0}]
[]
[null,"Coverage of PC interventions for the diseases (%)"]
[]
[null,null,null,null,null,null,"Geographical","National"]
[null,"Lymphatic filariasis",null,null,null,null,0,0]
[null,"Onchocerciasis",null,null,null,null,0,0]
[null,"Soil-transmitted helminthiases",null,null,null,null,100,42.217586360552772]
[null,"Schistosomiasis",null,null,null,null,0,0]
[]
[null,"Number of people treated and programme coverage (%) by PC interventions"]
[]
[null,null,null,"PreSAC","SAC","Adults","Total","Coverage (%)"]
[null,"MDA 1 (IVM+ALB)",null,"Not eligible",{"$f":"'MDA1'!$K$4","v":0},{"$f":"'MDA1'!$L$4","v":0},{"$f":"'MDA1'!$M$4","v":0},{"$f":"'MDA1'!$Q$4","v":" "}]
[null,"MDA 2 (DEC+ALB)",null,{"$f":"'MDA2'!$J$4","v":0},{"$f":"'MDA2'!$K$4","v":0},{"$f":"'MDA2'!$L$4","v":0},{"$f":"'MDA2'!$M$4","v":0},{"$f":"'MDA2'!$Q$4","v":" "}]
[null,"MDA 3 (IVM)",null,"Not eligible",{"$f":"'MDA3'!$O$4","v":0},{"$f":"'MDA3'!$P$4","v":0},{"$f":"'MDA3'!$Q$4","v":0},{"$f":"'MDA3'!$T$4","v":" "}]
[null,"T 1 (PZQ+ALB/MBD)",null,{"$f":"IF('T1'!$L$4<>0,'T1'!$L$4,\"Not targeted\")","v":"Not targeted"},{"$f":"'T1'!$M$4","v":0},{"$f":"IF('T1'!$N$4<>0,'T1'!$N$4,\"Not targeted\")","v":"Not targeted"},{"$f":"'T1'!$O$4","v":0},{"$f":"'T1'!$S$4","v":" "}]
[null,"T 2 (PZQ)",null,{"$f":"IF('T2'!$J$4<>0,'T2'!$J$4,\"Not targeted\")","v":"Not targeted"},{"$f":"'T2'!$K$4","v":0},{"$f":"'T2'!$L$4","v":0},{"$f":"'T2'!$M$4","v":0},{"$f":"'T2'!$Q$4","v":" "}]
[null,"T 3 (ALB/MBD) - round 1",null,{"$f":"T3_R1!$K$4","v":592066},{"$f":"T3_R1!$L$4","v":6409934},{"$f":"IF(T3_R1!$M$4<>0,T3_R1!$M$4,\"Not targeted\")","v":"Not targeted"},{"$f":"T3_R1!$N$4","v":7002000},{"$f":"T3_R1!$R$4","v":60.211058592445688}]
[null,"T 3 (ALB/MBD) - round 2",null,{"$f":"T3_R2!$K$4","v":0},{"$f":"T3_R2!$L$4","v":0},{"$f":"IF(T3_R2!$M$4<>0,T3_R2!$M$4,\"Not targeted\")","v":"Not targeted"},{"$f":"T3_R2!$N$4","v":0},{"$f":"T3_R2!$R$4","v":" "}]
[]
[null,"Inventory of PC medicines in the country"]
[]
[null,null,"IVM","DEC","ALB (LF)","ALB (STH)","MBD","PZQ"]
[null,"Available"]
[null,"Distributed"]
[null,"Wasted"]
[null,"Received"]
[null,"Remaining",{"$f":"C44-C45-C46+C47","v":0},0,0,0,0,0]
[]
[null,"Please indicate the medicine has been used to treat PreSAC for STH and delivery channels"]
[null,"PC medicine",null,"Delivery channels",null,null,"Source"]
[]
[null,"Additional information"]
[]
[null,"Tablets remaining 592066, after school health campaign used in facilities for pre-school aged children. Total PRE-SAC dewormed during 2016 was 3966714, of which 592066 was used from the WHO donated deworming tablets. As per joint communique sent. "]
[]
[]
[]
[]
[]
[]
[]
[null,null,null,"       I have read and accept WHO Data Sharing Policy"]
[null,"Name and signature of NTD coordinator or Ministry of Health representative:"]
[]
[null,"Date:"]
[]
[null,"Please send the national report (signed and in electronic format) to the concerned WR with copy to:"]
[]
[null,"WHO headquarters",null,"PC_JointForms@who.int"]
[null,"WHO Regional Office",null,"Regional Advisor for NTD"]

{"sheet":"PROFILE","index":11,"n_rows":124,"n_cols":8,"rows_kept":124,"cut":false,"hidden":true,"merged":[[79,1,79,3],[123,1,124,7],[85,6,85,7],[87,6,87,7],[89,6,89,7],[86,6,86,7],[88,6,88,7],[9,1,9,2],[4,1,4,7],[5,1,5,2],[81,1,81,3],[19,1,19,6],[9,3,9,5],[43,1,43,3],[77,1,77,3],[80,1,80,3],[6,3,6,5],[7,3,7,5],[8,3,8,5],[78,1,78,3],[23,1,23,3],[11,1,11,6],[20,1,20,6],[0,1,0,5],[1,1,1,7],[3,3,3,5],[69,1,69,3],[73,1,73,3],[26,1,26,3],[27,1,27,3],[28,1,28,3],[59,1,59,3],[5,3,5,5],[30,1,30,3],[34,1,34,3],[42,1,42,3],[6,1,6,2],[7,1,7,2],[8,1,8,2],[12,1,12,6],[47,1,47,3],[51,1,51,3],[55,1,55,3],[65,1,65,3],[29,1,29,3],[21,1,21,6],[16,1,16,6],[18,1,18,6],[17,1,17,6],[63,1,63,3],[13,1,13,6],[14,1,14,6],[15,1,15,6]]}
[]
[null,"PC Joint Reporting Form v.3.1 - Country Profile"]
[]
[null,"Country",null,{"$f":"IF(INTRO!$E$34<>0,INTRO!$E$34,\" \")","v":"South Africa"},null,null,"Year",{"$f":"IF(INTRO!$E$36<>0,INTRO!$E$36,\" \")","v":2016}]
[null,"!!! WARNING !!!\nBefore analysing data in the country profile please be ensure that your report in the SUMMARY tab is updated"]
[null,"Total population",null,null,null,null,1,{"$f":"COUNTRY_INFO!D4","v":55650997}]
[null,"Population — other age groups",null,null,null,null,{"$f":"IF($H$6<>0,H7/$H$6,0)","v":3.3936319236113595E-3},{"$f":"H6-SUM(H8:H10)","v":188859}]
[null,"Population — Pre-SAC",null,{"$f":"INTRO!B48","v":"1-4 years age"},null,null,{"$f":"IF($H$6<>0,H8/$H$6,0)","v":9.8471191809914926E-2},{"$f":"COUNTRY_INFO!E4","v":5480020}]
[null,"Population — SAC",null,{"$f":"INTRO!B49","v":"5-14 years age"},null,null,{"$f":"IF($H$6<>0,H9/$H$6,0)","v":0.19485591605843108},{"$f":"COUNTRY_INFO!F4","v":10843926}]
[null,"Population — Adults",null,{"$f":"INTRO!B50","v":"15 years +"},null,null,0.70327926020804266,{"$f":"COUNTRY_INFO!G4","v":39138192}]
[]
[null,"Total number of people requiring PC for at least one disease (LF, ONCHO, STH, SCH)",null,null,null,null,null,{"$f":"DISTRICT!AT6","v":16323946}]
[null,"Proportion of number of people requiring PC for at least one disease out of total population",null,null,null,null,null,{"$f":"IF(H6<>0,H12/H6,0)","v":0.29332710786834598}]
[null,"Number of IUs requiring PC for at least one disease (LF, ONCHO, STH, SCH)",null,null,null,null,null,{"$f":"COUNTIF(DISTRICT!AT9:AT1000,\">0\")","v":9}]
[null,"Number of IUs received PC for at least one disease (LF, ONCHO, STH, SCH)",null,null,null,null,null,{"$f":"COUNTIF(DISTRICT!AY9:AY1000,\">0\")","v":9}]
[null,"Proportion of IUs requiring PC for at least one disease and received it",null,null,null,null,null,{"$f":"IF(H14<>0,H15/H14,0)","v":1}]
[null,"Total number of people received PC for at least one disease (LF, ONCHO, STH, SCH)",null,null,null,null,null,{"$f":"DISTRICT!AY6","v":7002000}]
[null,"Total number of people in need who received PC for at least one disease (LF, ONCHO, STH, SCH)",null,null,null,null,null,{"$f":"DISTRICT!BC6","v":6891576}]
[null,"Coverage of PC for at least one disease (LF, ONCHO, STH, SCH)",null,null,null,null,null,{"$f":"DISTRICT!BD6","v":0.42217586360552772}]
[null,"Number of IUs received treatment for all diseases requiring PC in those IUs",null,null,null,null,null,{"$f":"DISTRICT!AU6","v":9}]
[null,"Population requiring PC in IUs which received treatment for all diseases in need of PC",null,null,null,null,null,{"$f":"SUMIF(DISTRICT!AU9:AU1000,\"Y\",DISTRICT!AT9:AT1000)","v":16323946}]
[null,"Population received PC in IUs which were treated for all diseases in need of PC",null,null,null,null,null,{"$f":"SUMIF(DISTRICT!AU9:AU1000,\"Y\",DISTRICT!AY9:AY1000)","v":7002000}]
[]
[null,null,null,null,"LF","ONCHO","STH","SCH"]
[]
[null,"Diseases requiring PC in the country",null,null,{"$f":"IF(INTRO!E38=\"Endemic\",\"Yes\",\"No\")","v":"No"},{"$f":"IF(INTRO!E40=\"Endemic\",\"Yes\",\"No\")","v":"No"},{"$f":"IF(INTRO!E42=\"Endemic\",\"Yes\",\"No\")","v":"Yes"},{"$f":"IF(INTRO!E44=\"Endemic\",\"Yes\",\"No\")","v":"No"}]
[null,"Number of implementation units (IUs) in the country",null,null,{"$f":"IF(E26=\"Yes\",INTRO!$E$46,\"-\")","v":"-"},{"$f":"IF(F26=\"Yes\",INTRO!$E$46,\"-\")","v":"-"},{"$f":"IF(G26=\"Yes\",INTRO!$E$46,\"-\")","v":9},{"$f":"IF(H26=\"Yes\",INTRO!$E$46,\"-\")","v":"-"}]
[null,"Number of IUs with endemicity status known",null,null,{"$f":"IF(E26=\"Yes\",E27-E29,\"-\")","v":"-"},{"$f":"IF(F26=\"Yes\",F27-F29,\"-\")","v":"-"},{"$f":"IF(G26=\"Yes\",G27-G29,\"-\")","v":9},{"$f":"IF(H26=\"Yes\",H27-H29,\"-\")","v":"-"}]
[null,"Number of IUs with endemicity status unknown",null,null,{"$f":"IF(E26=\"Yes\",E27-(992-COUNTIF(COUNTRY_INFO!H$9:H$1000,\"\"))+COUNTIF(COUNTRY_INFO!H$9:H$1000,\"=4\"),\"-\")","v":"-"},{"$f":"IF(F26=\"Yes\",F27-(992-COUNTIF(COUNTRY_INFO!I$9:I$1000,\"\"))+COUNTIF(COUNTRY_INFO!I$9:I$1000,\"=4\"),\"-\")","v":"-"},{"$f":"IF(G26=\"Yes\",G27-(992-COUNTIF(COUNTRY_INFO!J$9:J$1000,\"\"))+COUNTIF(COUNTRY_INFO!J$9:J$1000,\"=4\")+COUNTIF(COUNTRY_INFO!J$9:J$1000,\"=5\"),\"-\")","v":0},{"$f":"IF(H26=\"Yes\",H27-(992-COUNTIF(COUNTRY_INFO!K$9:K$1000,\"\"))+COUNTIF(COUNTRY_INFO!K$9:K$1000,\"=4\")+COUNTIF(COUNTRY_INFO!K$9:K$1000,\"=5\"),\"-\")","v":"-"}]
[null,"Number of non-endemic IUs",null,null,{"$f":"IF(E26=\"Yes\",COUNTIF(COUNTRY_INFO!H$9:H$1000,\"=0\"),\"-\")","v":"-"},{"$f":"IF(F26=\"Yes\",COUNTIF(COUNTRY_INFO!I$9:I$1000,\"=0\"),\"-\")","v":"-"},{"$f":"IF(G26=\"Yes\",COUNTIF(COUNTRY_INFO!J$9:J$1000,\"=0\"),\"-\")","v":0},{"$f":"IF(H26=\"Yes\",COUNTIF(COUNTRY_INFO!K$9:K$1000,\"=0\"),\"-\")","v":"-"}]
[null,"Number of IUs requiring PC (total)",null,null,{"$f":"COUNTIF(COUNTRY_INFO!H$9:H$1000,\"=1\")","v":0},{"$f":"COUNTIF(COUNTRY_INFO!I$9:I$1000,\"=1\")","v":0},{"$f":"SUM(G33:G34)","v":9},{"$f":"SUM(H32:H34)","v":0}]
[null,null,null,"low prevalence",null,null,{"$f":"COUNTIF(COUNTRY_INFO!J$9:J$1000,\"=1\")","v":0},{"$f":"COUNTIF(COUNTRY_INFO!K$9:K$1000,\"=1\")","v":0}]
[null,null,null,"moderate prevalence",null,null,{"$f":"COUNTIF(COUNTRY_INFO!J$9:J$1000,\"=2\")","v":9},{"$f":"COUNTIF(COUNTRY_INFO!K$9:K$1000,\"=2\")","v":0}]
[null,null,null,"high prevalence",null,null,{"$f":"COUNTIF(COUNTRY_INFO!J$9:J$1000,\"=3\")","v":0},{"$f":"COUNTIF(COUNTRY_INFO!K$9:K$1000,\"=3\")","v":0}]
[null,"Population requiring PC in the country (total)",null,null,{"$f":"COUNTRY_INFO!L4","v":0},{"$f":"COUNTRY_INFO!M4","v":0},{"$f":"COUNTRY_INFO!N4","v":16323946},{"$f":"COUNTRY_INFO!O4","v":0}]
[null,null,"Pre-SAC","moderate prevalence",null,null,{"$f":"SUMIF(COUNTRY_INFO!J$9:J$1000,\"=2\",COUNTRY_INFO!E$9:E$1000)","v":5480020}]
[null,null,null,"high prevalence",null,null,{"$f":"SUMIF(COUNTRY_INFO!J$9:J$1000,\"=3\",COUNTRY_INFO!E$9:E$1000)","v":0}]
[null,null,"SAC","low prevalence",null,null,null,{"$f":"SUMIF(COUNTRY_INFO!K$9:K$1000,\"=1\",COUNTRY_INFO!F$9:F$1000)*0.33","v":0}]
[null,null,null,"moderate prevalence",null,null,{"$f":"SUMIF(COUNTRY_INFO!J$9:J$1000,\"=2\",COUNTRY_INFO!F$9:F$1000)","v":10843926},{"$f":"SUMIF(COUNTRY_INFO!K$9:K$1000,\"=2\",COUNTRY_INFO!F$9:F$1000)*0.5","v":0}]
[null,null,null,"high prevalence",null,null,{"$f":"SUMIF(COUNTRY_INFO!J$9:J$1000,\"=3\",COUNTRY_INFO!F$9:F$1000)","v":0},{"$f":"SUMIF(COUNTRY_INFO!K$9:K$1000,\"=3\",COUNTRY_INFO!F$9:F$1000)","v":0}]
[null,null,"Adults","moderate prevalence",null,null,null,{"$f":"SUMIF(COUNTRY_INFO!K$9:K$1000,\"=2\",COUNTRY_INFO!G$9:G$1000)*0.2","v":0}]
[null,null,null,"high prevalence",null,null,null,{"$f":"SUMIF(COUNTRY_INFO!K$9:K$1000,\"=3\",COUNTRY_INFO!G$9:G$1000)","v":0}]
[null,"Number of IUs where PC was implemented (total)",null,null,{"$f":"COUNTIF(DISTRICT!G$9:G$1000,\">0\")","v":0},{"$f":"COUNTIF(DISTRICT!M$9:M$1000,\">0\")","v":0},{"$f":"COUNTIF(DISTRICT!S$9:S$1000,\">0\")","v":9},{"$f":"COUNTIF(DISTRICT!AC$9:AC$1000,\">0\")","v":0}]
[null,"Number of IUs in need where PC was implemented (total)",null,null,{"$f":"COUNTIF(DISTRICT!H$9:H$1000,\">0\")","v":0},{"$f":"COUNTIF(DISTRICT!N$9:N$1000,\">0\")","v":0},{"$f":"COUNTIF(DISTRICT!X$9:X$1000,\">0\")","v":9},{"$f":"COUNTIF(DISTRICT!AH$9:AH$1000,\">0\")","v":0}]
[null,null,"Pre-SAC",null,null,null,{"$f":"COUNTIF(DISTRICT!T$9:T$1000,\">0\")","v":9}]
[null,null,"SAC",null,null,null,{"$f":"COUNTIF(DISTRICT!V$9:V$1000,\">0\")","v":9},{"$f":"COUNTIF(DISTRICT!AD$9:AD$1000,\">0\")","v":0}]
[null,null,"Adults",null,null,null,null,{"$f":"COUNTIF(DISTRICT!AF$9:AF$1000,\">0\")","v":0}]
[null,"Number of individuals treated (total)",null,null,{"$f":"DISTRICT!G4","v":0},{"$f":"DISTRICT!M4","v":0},{"$f":"DISTRICT!S4","v":7002000},{"$f":"DISTRICT!AC4","v":0}]
[null,null,"Pre-SAC",null,{"$f":"SUMMARY!$E17","v":0},{"$f":"SUMMARY!$E18","v":"Not eligible"},{"$f":"SUMMARY!$E19","v":592066},{"$f":"SUMMARY!$E20","v":"Not targeted"}]
[null,null,"SAC",null,{"$f":"SUMMARY!$F17","v":0},{"$f":"SUMMARY!$F18","v":0},{"$f":"SUMMARY!$F19","v":6409934},{"$f":"SUMMARY!$F20","v":0}]
[null,null,"Adults",null,{"$f":"SUMMARY!$G17","v":0},{"$f":"SUMMARY!$G18","v":0},{"$f":"SUMMARY!$G19","v":0},{"$f":"SUMMARY!$G20","v":0}]
[null,"Number of individuals in need treated (total)",null,null,{"$f":"DISTRICT!H4","v":0},{"$f":"DISTRICT!N4","v":0},{"$f":"DISTRICT!X4","v":6891576},{"$f":"DISTRICT!AH4","v":0}]
[null,null,"Pre-SAC",null,null,null,{"$f":"DISTRICT!T4","v":592066}]
[null,null,"SAC",null,null,null,{"$f":"DISTRICT!V4","v":6299510},{"$f":"DISTRICT!AD4","v":0}]
[null,null,"Adults",null,null,null,null,{"$f":"DISTRICT!AF4","v":0}]
[null,"Geographical coverage (all ages)",null,null,{"$f":"IF(E31<>0,E44/E31,0)","v":0},{"$f":"IF(F31<>0,F44/F31,0)","v":0},{"$f":"IF(G31<>0,G44/G31,0)","v":1},{"$f":"IF(H31<>0,H44/H31,0)","v":0}]
[null,null,"Pre-SAC",null,null,null,{"$f":"IF(G31<>0,G45/G31,0)","v":1}]
[null,null,"SAC",null,null,null,{"$f":"IF(G31<>0,G46/G31,0)","v":1},{"$f":"IF(H31<>0,H46/H31,0)","v":0}]
[null,null,"Adults",null,null,null,null,{"$f":"IF(SUM(H33:H34)<>0,H47/SUM(H33:H34),0)","v":0}]
[null,"National coverage (total)",null,null,{"$f":"IF(E35<>0,E52/E35,0)","v":0},{"$f":"IF(F35<>0,F52/F35,0)","v":0},{"$f":"IF(G35<>0,G52/G35,0)","v":0.42217586360552772},{"$f":"IF(H35<>0,H52/H35,0)","v":0}]
[null,null,"Pre-SAC",null,null,null,{"$f":"IF(SUM(G36:G37)<>0,G53/SUM(G36:G37),0)","v":0.1080408465662534}]
[null,null,"SAC",null,null,null,{"$f":"IF(SUM(G39:G40)<>0,G54/SUM(G39:G40),0)","v":0.58092521103519146},{"$f":"IF(SUM(H38:H40)<>0,H54/SUM(H38:H40),0)","v":0}]
[null,null,"Adults",null,null,null,null,{"$f":"IF(SUM(H41:H42)<>0,H55/SUM(H41:H42),0)","v":0}]
[null,null,null,null,"LF","ONCHO","STH","SCH"]
[]
[null,"Number of IUs achieved effective coverage (all ages)",null,null,{"$f":"COUNTIF(DISTRICT!I$9:I$1000,\">=65\")","v":0},{"$f":"COUNTIF(DISTRICT!O$9:O$1000,\">=65\")","v":0},{"$f":"COUNTIF(DISTRICT!Y$9:Y$1000,\">=75\")","v":0},{"$f":"COUNTIF(DISTRICT!AI$9:AI$1000,\">=75\")","v":0}]
[null,null,"Pre-SAC",null,null,null,{"$f":"COUNTIF(DISTRICT!U$9:U$1000,\">=75\")","v":0}]
[null,null,"SAC",null,null,null,{"$f":"COUNTIF(DISTRICT!W$9:W$1000,\">=75\")","v":2},{"$f":"COUNTIF(DISTRICT!AE$9:AE$1000,\">=75\")","v":0}]
[null,null,"Adults",null,null,null,null,{"$f":"COUNTIF(DISTRICT!AG$9:AG$1000,\">=75\")","v":0}]
[null,"Number of individuals in need treated in IUs achieved effective coverage (total)",null,null,{"$f":"SUMIF(DISTRICT!I9:I1000,\">=65\",DISTRICT!H9:H1000)","v":0},{"$f":"SUMIF(DISTRICT!O9:O1000,\">=65\",DISTRICT!N9:N1000)","v":0},{"$f":"SUMIF(DISTRICT!Y9:Y1000,\">=75\",DISTRICT!X9:X1000)","v":0},{"$f":"SUMIF(DISTRICT!AI9:AI1000,\">=75\",DISTRICT!AH9:AH1000)","v":0}]
[null,null,"Pre-SAC",null,null,null,{"$f":"SUMIF(DISTRICT!U9:U1000,\">=75\",DISTRICT!T9:T1000)","v":0}]
[null,null,"SAC",null,null,null,{"$f":"SUMIF(DISTRICT!W9:W1000,\">=75\",DISTRICT!V9:V1000)","v":2192845},{"$f":"SUMIF(DISTRICT!AE9:AE1000,\">=75\",DISTRICT!AD9:AD1000)","v":0}]
[null,null,"Adults",null,null,null,null,{"$f":"SUMIF(DISTRICT!AG9:AG1000,\">=75\",DISTRICT!AF9:AF1000)","v":0}]
[null,"Proportion of IUs requiring PC and achieved effective coverage (total)",null,null,{"$f":"IF(E44<>0,E66/E44,0)","v":0},{"$f":"IF(F44<>0,F66/F44,0)","v":0},{"$f":"IF(G44<>0,G66/G44,0)","v":0},{"$f":"IF(H44<>0,H66/H44,0)","v":0}]
[null,null,"Pre-SAC",null,null,null,{"$f":"IF(G45<>0,G67/G45,0)","v":0}]
[null,null,"SAC",null,null,null,{"$f":"IF(G46<>0,G68/G46,0)","v":0.22222222222222221},{"$f":"IF(H46<>0,H68/H46,0)","v":0}]
[null,null,"Adults",null,null,null,null,{"$f":"IF(H47<>0,H69/H47,0)","v":0}]
[null,"Number of implementation units where PC was stopped (i.e. under surveillance)",null,null,{"$f":"COUNTIF(COUNTRY_INFO!H$9:H$1000,\"=99\")","v":0},{"$f":"COUNTIF(COUNTRY_INFO!I$9:I$1000,\"=99\")","v":0}]
[null,"Number of individuals in IUs no longer requiring PC (stopped)",null,null,{"$f":"SUMIF(COUNTRY_INFO!H$9:H$1000,\"=99\",COUNTRY_INFO!D$9:D$1000)","v":0},{"$f":"SUMIF(COUNTRY_INFO!I$9:I$1000,\"=99\",COUNTRY_INFO!D$9:D$1000)","v":0}]
[null,"Number of individuals requiring PC living in IUs targeted with PC",null,null,{"$f":"SUMIF(DISTRICT!H$9:H$1000,\">0\",DISTRICT!D$9:D$1000)","v":0},{"$f":"SUMIF(DISTRICT!N$9:N$1000,\">0\",DISTRICT!J$9:J$1000)","v":0},{"$f":"SUMIF(DISTRICT!X$9:X$1000,\">0\",DISTRICT!P$9:P$1000)","v":16323946},{"$f":"SUMIF(DISTRICT!AH$9:AH$1000,\">0\",DISTRICT!Z$9:Z$1000)","v":0}]
[null,"Number of individuals requiring PC living in IUs not targeted with PC",null,null,{"$f":"SUMIF(DISTRICT!H$9:H$1000,\"=0\",DISTRICT!D$9:D$1000)","v":0},{"$f":"SUMIF(DISTRICT!N$9:N$1000,\"=0\",DISTRICT!J$9:J$1000)","v":0},{"$f":"SUMIF(DISTRICT!X$9:X$1000,\"=0\",DISTRICT!P$9:P$1000)","v":0},{"$f":"SUMIF(DISTRICT!AH$9:AH$1000,\"=0\",DISTRICT!Z$9:Z$1000)","v":0}]
[null,null,null,null,{"$f":"E35-E52","v":0},{"$f":"F35-F52","v":0},9432370,0]
[null,"Number of IUs requiring and receiving PC",null,null,{"$f":"E31-E44","v":0},{"$f":"F31-F44","v":0},0,0]
[null,null,null,null,{"$f":"E27-E31-E29","v":{"$error":"#VALUE!"}},{"$error":"#VALUE!"},0,{"$f":"H27-H31-H29","v":{"$error":"#VALUE!"}}]
[]
[null,null,null,null,null,null,"Requiring and receiving PC"]
[null,null,null,null,null,null,"Requiring and not receiving PC"]
[null,null,null,null,null,null,"Not requiring PC"]
[null,null,null,null,null,null,"Status unknown"]
[]
[]
[]
[]
[]
[]
[]
[]
[]
[]
[]
[]
[]
[]
[]
[]
[]
[]
[]
[]
[]
[]
[]
[]
[]
[]
[]
[]
[]
[]
[]
[]
[]
[]
[null,"Click here to access data Preventive Chemotherapy Data Portal"]

{"sheet":"DATA_POLICY","index":12,"n_rows":39,"n_cols":8,"rows_kept":39,"cut":false,"hidden":true,"merged":[[55,1,55,2],[8,1,12,7],[13,1,16,7],[26,2,36,7],[38,1,45,7],[6,1,6,7],[17,1,21,7],[22,1,25,7],[0,1,0,5],[1,1,1,7],[3,3,3,5]]}
[]
[null,"PC Joint Reporting Form v.3.1"]
[]
[null,"Country",null,{"$f":"IF(INTRO!$E$34<>0,INTRO!$E$34,\" \")","v":"South Africa"},null,null,"Year",{"$f":"IF(INTRO!$E$36<>0,INTRO!$E$36,\" \")","v":2016}]
[]
[]
[null,"WHO Data Sharing Policy statement"]
[]
[null,"Data are the basis for all sound public health actions and the benefits of data sharing are widely recognized, including scientific and public health benefits. Whenever possible, WHO wishes to promote the sharing of health data, including but not restricted to surveillance and epidemiological data.  "]
[]
[]
[]
[]
[null,{"$f":"\"In this connection, and without prejudice to information sharing and publication pursuant to legally binding instruments, by providing data to WHO, the Ministry of Health of \" & D4 & \":\"","v":"In this connection, and without prejudice to information sharing and publication pursuant to legally binding instruments, by providing data to WHO, the Ministry of Health of South Africa:"}]
[]
[]
[]
[null,"Confirms that all data to be supplied to WHO hereunder have been collected in accordance with applicable national laws, including data protection laws aimed at protecting the confidentiality of identifiable persons;"]
[]
[]
[]
[]
[null,{"$f":"\"Agrees that WHO shall be entitled, subject always to measures to ensure the ethical and secure use of the data, and subject always to an appropriate acknowledgement of \"&D4&\":\"","v":"Agrees that WHO shall be entitled, subject always to measures to ensure the ethical and secure use of the data, and subject always to an appropriate acknowledgement of South Africa:"}]
[]
[]
[]
[null,null,"to publish the data, stripped of any personal identifiers and make the Data available to any interested party on request (to the extent they have not, or not yet, been published by WHO) on terms that allow non-commercial, not-for-profit use of the Data for public health purposes (provided always that publication of the Data shall remain under the control of WHO); \nto use, compile, aggregate, evaluate and analyse the Data and publish and disseminate the results thereof in conjunction with WHO’s work and in accordance with the Organization’s policies and practices."]
[]
[]
[]
[]
[]
[]
[]
[]
[]
[]
[]
[null,{"$f":"CONCATENATE(\"Except where data sharing and publication is required under legally binding instruments (IHR, WHO Nomenclature Regulations 1967, etc.), the Ministry of Health of \", D4,\" may in respect of certain data opt out of (any part of) the above,\" & \" by notifying WHO thereof in writing at the following address, provided that any such notification shall clearly identify the data in question and clearly indicate the scope of the opt-out (in reference to the  above), \" & \"and provided that specific reasons shall be given for the opt out.\")","v":"Except where data sharing and publication is required under legally binding instruments (IHR, WHO Nomenclature Regulations 1967, etc.), the Ministry of Health of South Africa may in respect of certain data opt out of (any part of) the above, by notifying WHO thereof in writing at the following address, provided that any such notification shall clearly identify the data in question and clearly indicate the scope of the opt-out (in reference to the  above), and provided that specific reasons shall be given for the opt out."}]