{"text_format":"1","workbook":"xlsx","n_sheets":10,"sheets":["INTRO","COUNTRY_INFO","DEC","ALB_MBD","PZQ","IVM","IVM+","SUMMARY","SHIPMENT","DATA_POLICY"],"not_rendered":{"charts":0,"images":3,"macros":1,"external_links":0,"defined_names":10,"comments":9,"pivot_tables":0},"unopened":[],"bounds":{"document_bytes":16777216,"sheet_cells":100000,"rows_first":2000,"rows_last":500,"rows_between":2000,"halvings":0,"cell_chars":16384,"cell_head_chars":4096},"cells_cut":0,"cells_raw":0,"read":"whole","date_system":"1900"}

{"sheet":"INTRO","index":0,"n_rows":51,"n_cols":8,"rows_kept":51,"cut":false,"hidden":false,"merged":[[21,1,21,4],[46,1,46,4],[38,1,38,2],[40,1,40,2],[42,1,42,2],[44,1,44,2],[36,1,36,2],[22,2,23,4],[25,2,26,4],[27,1,27,4],[32,1,32,2],[29,1,29,4],[30,1,30,4],[28,2,28,4],[24,1,24,4],[34,1,34,2],[0,1,0,4],[2,1,2,4],[1,1,1,4],[5,1,5,4],[3,1,3,4],[7,2,7,4],[11,1,11,4],[4,1,4,4],[10,2,10,4],[20,2,20,4],[17,1,17,4],[13,1,13,4],[18,2,18,4],[8,2,8,4],[9,2,9,4],[19,1,19,4],[12,1,12,4],[16,1,16,4],[14,1,14,4],[15,1,15,4]]}
[]
[null,"Formulaire de demande commune de médicaments pour CP v.4.1"]
[]
[null,"Dans le cadre des efforts mondiaux entrepris pour accélérer l'expansion de la chimioprévention (CP) pour l'élimination de la filariose lymphatique et la lutte contre la schistosomiase et les géohelminthiases, l'Organisation mondiale de la Santé (OMS) facilite l'approvisionnement en albendazole, comprimés de 400 mg (GSK), pour les programmes nationaux d'élimination de la filariose lymphatique et programmes nationaux de lutte contre les géohelminthiases; en diethylcarbamazine, comprimés de 100 mg (Eisai), pour les programmes nationaux d'élimination de la filariose lymphatique; en mebendazole, comprimés de 500 mg (J&J) pour les programmes nationaux de lutte contre les géohelminthiases et en praziquantel, comprimés de 600 mg (Merck KGaA), destinés aux enfants d'âge scolaire, pour les programmes nationaux de lutte contre la schistosomiase. L'OMS contribue également à l'approvisionnement en ivermectine, comprimés de 3 mg (Merck), pour les programmes de donation pour l'onchocercose et la filariose lymphatique. \nCet outil Excel est concu pour aider les pays à quantifier le nombre de comprimés nécessaires, selon le traitement de chimioprévention requis, pour atteindre les objectifs de couverture de traitement de populations et districts pour l'année de la demande de médicaments. Le résultat de cet outil est une demande commune de médicaments pour la chimioprévention des maladies tropicales négligées, qui peut être imprimée, signée et soumise à l'OMS pour la demande de ces médicaments. "]
[]
[null,"Structure de l'application (feuilles de travail) :"]
[]
[null,"INTRO","Cette feuille contient des instructions pour compléter le formulaire de demande de médicaments pour la chimioprévention et des informations sur le statut de la chimioprévention pour les maladies d'endémie du pays."]
[null,"COUNTRY_INFO","Cette feuille contient des informations sur la structure administrative du pays, la population par groupe d'âge, le statut d'endémicité pour chaque maladie, la population devant être traitée par chimioprévention et les interventions prévues."]
[null,"DEC, ALB_MBD, PZQ et IVM","Ces feuilles contiennent des informations sur l'endémicité des districts ciblés pour le traitement aux médicaments spécifiques à la chimioprévention, les plans de traitement, et le nombre de comprimés requis et demandés."]
[null,"SUMMARY","Cette feuille inclut un résumé du nombre de comprimés demandés, des informations concernant le stock et les dates de soumission de la demande de médicaments. Avant de générer le rapport (run macros), veuillez sélectionner le médicament pour lequel le rapport est nécessaire. Veuillez suivre la même règle pour voir le nombre de personnes à traiter pour les maladies spécifiques. \nCette feuille doit être imprimée et soumise en tant que \"Formulaire de demande commune de médicaments pour chimioprévention\" (voir les instructions pour la soumission du formulaire sous la feuille SUMMARY)."]
[]
[null,"Instructions pour la saisie des données"]
[]
[null,"La plupart des cellules des feuilles de travail mentionnées ci-dessus contiennent des formules calculées automatiquement en fonction du protocole de traitement recommandé par l'OMS pour chaque maladie.\nVoir : https://www.who.int/publications/i/item/9789241599993."]
[]
[null,"Veuillez entrer vos données dans les cellules en fonction de leur code de couleur :"]
[]
[null,null,"Blanc - la cellule n'est pas protégée. Veuillez entrer la valeur de l'indicateur demandé."]
[]
[null,null,"Jaune - la cellule est protégée et inclut le nom de l'indicateur. Aucune entrée de données requise."]
[]
[null,null,"Orange - la cellule n'est pas protégée et contient un menu déroulant. Veuillez sélectionner la valeur dans le menu déroulant. "]
[]
[]
[null,null,"Vert - la cellule n'est pas protégée et contient des formules. Veuillez changer la valeur indiquée uniquement si vos données sont différentes de celles calculées automatiquement.  "]
[]
[]
[null,null,"Bleu - la cellule est protégée et contient des formules. Aucune entrée de données requise. "]
[]
[null,"Données pays"]
[]
[null,"PAYS",null,null,"SENEGAL",null,"SN","SEN"]
[null,null,null,null,5]
[null,"Année de la demande de médicaments",null,null,2024]
[]
[null,"Le pays est-il endémique à la filariose lymphatique (FL) ?",null,null,"Endémique"]
[]
[null,"Le pays est-il endémique à l'onchocercose (ONCHO) ? ",null,null,"Endémique"]
[]
[null,"Le pays est-il endémique aux géohelminthiases (STH) ?",null,null,"Endémique"]
[]
[null,"Le pays est-il endémique à la schistosomiase (SCH) ?",null,null,"Endémique"]
[]
[null,"Combien d'unités administratives compte le pays ?",null,null,79]
[]
[null,"Si les données démographiques par groupe d'âge ne sont pas disponibles au second niveau administratif, veuillez entrer la proportion (%) de population, par groupe d'âge, du pays. Si les données sont disponibles, veuillez laisser les cellules vierges."]
[null,"1-4 ans","Enfants d'âge pré-scolaire (EAPréS)",null,0.1207]
[null,"5-14 ans","Enfants d'âge scolaire (EAS)",null,0.26529999999999998]
[null,"15 ans et plus","Adultes",null,0.58240000000000003]
[null,"15-49 ans","Femmes en âge de procréer (FAP)",null,0.24590000000000001]

{"sheet":"COUNTRY_INFO","index":1,"n_rows":88,"n_cols":35,"rows_kept":88,"cut":false,"hidden":false,"merged":[[3,0,3,2],[3,7,3,10],[3,21,3,24],[5,0,5,2],[3,26,3,29],[5,26,5,29],[5,3,5,6],[5,7,5,10],[5,11,5,20],[5,21,5,24],[6,3,7,3],[6,2,7,2],[6,1,7,1],[6,0,7,0],[6,21,7,21],[6,13,6,16],[6,11,7,11],[6,12,7,12],[6,7,7,7],[6,8,7,8],[6,9,7,9],[6,10,7,10],[6,6,7,6],[6,5,7,5],[6,4,7,4],[6,28,7,28],[6,29,7,29],[6,17,6,20],[6,25,7,25],[6,22,7,22],[6,23,7,23],[6,24,7,24],[6,26,7,26],[6,27,7,27]]}
["INFORMATIONS PAYS"]
["Struture administrative, population par groupe d'âge, statut d'endémicité et interventions planifiées"]
[]
["TOTAL",null,null,{"$f":"SUBTOTAL(9,D$10:D$1010)","v":18715211.094619002},{"$f":"SUBTOTAL(9,E$10:E$1010)","v":2258926},4965144,10899737,null,null,null,null,{"$f":"SUBTOTAL(9,L$10:L$1010)","v":1654525.9593460001},0,450862,990999,918533,2360394,504787,1494247,3280485,5281184]
[]
["Structure administrative du pays",null,null,"Population",null,null,null,"Endémicité",null,null,null,"Population nécessitant la CP",null,null,null,null,null,null,null,null,null,"Nombre de tournées de traitement prévues pour l'année",null,null,null,"Criteria to apply for \nIVM+DEC+ALB therapy","Enquêtes épidémiologiques planifiées pour l’année"]
["Pays","Région/Département","District","Total","EAPréS","EAS","Adultes","FL","Oncho","STH","SCH","FL","ONCHO","STH",null,null,null,"SCH",null,null,null,"FL","Oncho","STH","SCH","FL","FL","Oncho","STH","SCH"]
[null,null,null,null,null,null,null,null,null,null,null,null,null,"EAPréS","EAS","FAP","TOTAL","EAPréS","EAS","Adultes","TOTAL",null,null,null,null,null,null,null,null,null,null,null,null,"IU_ID","IU_Name"]
[]
[{"$f":"IF(INTRO!$E$33<>0,INTRO!$E$33, \" \")","v":"SENEGAL"},"Dakar","Dakar sud",231905.37468799998,{"$f":"IF(INTRO!$E$48=\"\",\"\",ROUND($D10*INTRO!$E$48,0))","v":27991},{"$f":"IF(INTRO!$E$49=\"\",\"\",ROUND($D10*INTRO!$E$49,0))","v":61524},{"$f":"IF(INTRO!$E$50=\"\",\"\",ROUND($D10*INTRO!$E$50,0))","v":135062},0,0,0,0,{"$f":"IF(INTRO!$E$37=\"Endémique\",IF($H10>0,IF($H10=4,\"Inconnu\",IF($H10=99,\"Interrompu\",$D10)),0),\"Non requis\")","v":0},{"$f":"IF(INTRO!$E$39=\"Endémique\", IF($I10>0, IF($I10=4,\"Inconnu\",IF($I10=99,\"Interrompu\",$D10)), 0),\"Non requis\")","v":0},{"$f":"IF(INTRO!$E$41=\"Endémique\", IF($J10>1, IF($J10=4, \"Inconnu\", IF($J10=99, \"Surveillance\", E10)), 0),\"Non requis\")","v":0},{"$f":"IF(INTRO!$E$41=\"Endémique\", IF($J10>1, IF($J10=4, \"Inconnu\", IF($J10=99, \"Surveillance\", F10)), 0),\"Non requis\")","v":0},{"$f":"IF(INTRO!$E$41=\"Endémique\", IF($J10>1, IF($J10=4, \"Inconnu\", IF($J10=99, \"Surveillance\", ROUND(D10*INTRO!$E$51,0))), 0),\"Non requis\")","v":0},{"$f":"IF(INTRO!$E$41=\"Endémique\", IF($J10>1, IF($J10=4, \"Inconnu\", IF($J10=99, \"Surveillance\", SUM($N10:$P10))), 0),\"Non requis\")","v":0},0,0,0,0,0,0,0,0,null,null,null,null,null,null,null,null,40159,"Dakar sud"]
[{"$f":"IF(INTRO!$E$33<>0,INTRO!$E$33, \" \")","v":"SENEGAL"},"Dakar","Dakar centre",442447.21348099998,{"$f":"IF(INTRO!$E$48=\"\",\"\",ROUND($D11*INTRO!$E$48,0))","v":53403},{"$f":"IF(INTRO!$E$49=\"\",\"\",ROUND($D11*INTRO!$E$49,0))","v":117381},{"$f":"IF(INTRO!$E$50=\"\",\"\",ROUND($D11*INTRO!$E$50,0))","v":257681},0,0,0,0,{"$f":"IF(INTRO!$E$37=\"Endémique\",IF($H11>0,IF($H11=4,\"Inconnu\",IF($H11=99,\"Interrompu\",$D11)),0),\"Non requis\")","v":0},{"$f":"IF(INTRO!$E$39=\"Endémique\", IF($I11>0, IF($I11=4,\"Inconnu\",IF($I11=99,\"Interrompu\",$D11)), 0),\"Non requis\")","v":0},{"$f":"IF(INTRO!$E$41=\"Endémique\", IF($J11>1, IF($J11=4, \"Inconnu\", IF($J11=99, \"Surveillance\", E11)), 0),\"Non requis\")","v":0},{"$f":"IF(INTRO!$E$41=\"Endémique\", IF($J11>1, IF($J11=4, \"Inconnu\", IF($J11=99, \"Surveillance\", F11)), 0),\"Non requis\")","v":0},{"$f":"IF(INTRO!$E$41=\"Endémique\", IF($J11>1, IF($J11=4, \"Inconnu\", IF($J11=99, \"Surveillance\", ROUND(D11*INTRO!$E$51,0))), 0),\"Non requis\")","v":0},{"$f":"IF(INTRO!$E$41=\"Endémique\", IF($J11>1, IF($J11=4, \"Inconnu\", IF($J11=99, \"Surveillance\", SUM($N11:$P11))), 0),\"Non requis\")","v":0},0,0,0,0,0,0,0,0,null,null,null,null,null,null,null,null,40149,"Dakar centre"]
[{"$f":"IF(INTRO!$E$33<>0,INTRO!$E$33, \" \")","v":"SENEGAL"},"Dakar","Dakar ouest",287177.39320399996,{"$f":"IF(INTRO!$E$48=\"\",\"\",ROUND($D12*INTRO!$E$48,0))","v":34662},{"$f":"IF(INTRO!$E$49=\"\",\"\",ROUND($D12*INTRO!$E$49,0))","v":76188},{"$f":"IF(INTRO!$E$50=\"\",\"\",ROUND($D12*INTRO!$E$50,0))","v":167252},0,0,0,0,{"$f":"IF(INTRO!$E$37=\"Endémique\",IF($H12>0,IF($H12=4,\"Inconnu\",IF($H12=99,\"Interrompu\",$D12)),0),\"Non requis\")","v":0},{"$f":"IF(INTRO!$E$39=\"Endémique\", IF($I12>0, IF($I12=4,\"Inconnu\",IF($I12=99,\"Interrompu\",$D12)), 0),\"Non requis\")","v":0},{"$f":"IF(INTRO!$E$41=\"Endémique\", IF($J12>1, IF($J12=4, \"Inconnu\", IF($J12=99, \"Surveillance\", E12)), 0),\"Non requis\")","v":0},{"$f":"IF(INTRO!$E$41=\"Endémique\", IF($J12>1, IF($J12=4, \"Inconnu\", IF($J12=99, \"Surveillance\", F12)), 0),\"Non requis\")","v":0},{"$f":"IF(INTRO!$E$41=\"Endémique\", IF($J12>1, IF($J12=4, \"Inconnu\", IF($J12=99, \"Surveillance\", ROUND(D12*INTRO!$E$51,0))), 0),\"Non requis\")","v":0},{"$f":"IF(INTRO!$E$41=\"Endémique\", IF($J12>1, IF($J12=4, \"Inconnu\", IF($J12=99, \"Surveillance\", SUM($N12:$P12))), 0),\"Non requis\")","v":0},0,0,0,0,0,0,0,0,null,null,null,null,null,null,null,null,40156,"Dakar ouest"]
[{"$f":"IF(INTRO!$E$33<>0,INTRO!$E$33, \" \")","v":"SENEGAL"},"Dakar","Dakar nord",595958.80051499989,{"$f":"IF(INTRO!$E$48=\"\",\"\",ROUND($D13*INTRO!$E$48,0))","v":71932},{"$f":"IF(INTRO!$E$49=\"\",\"\",ROUND($D13*INTRO!$E$49,0))","v":158108},{"$f":"IF(INTRO!$E$50=\"\",\"\",ROUND($D13*INTRO!$E$50,0))","v":347086},0,0,0,0,{"$f":"IF(INTRO!$E$37=\"Endémique\",IF($H13>0,IF($H13=4,\"Inconnu\",IF($H13=99,\"Interrompu\",$D13)),0),\"Non requis\")","v":0},{"$f":"IF(INTRO!$E$39=\"Endémique\", IF($I13>0, IF($I13=4,\"Inconnu\",IF($I13=99,\"Interrompu\",$D13)), 0),\"Non requis\")","v":0},{"$f":"IF(INTRO!$E$41=\"Endémique\", IF($J13>1, IF($J13=4, \"Inconnu\", IF($J13=99, \"Surveillance\", E13)), 0),\"Non requis\")","v":0},{"$f":"IF(INTRO!$E$41=\"Endémique\", IF($J13>1, IF($J13=4, \"Inconnu\", IF($J13=99, \"Surveillance\", F13)), 0),\"Non requis\")","v":0},{"$f":"IF(INTRO!$E$41=\"Endémique\", IF($J13>1, IF($J13=4, \"Inconnu\", IF($J13=99, \"Surveillance\", ROUND(D13*INTRO!$E$51,0))), 0),\"Non requis\")","v":0},{"$f":"IF(INTRO!$E$41=\"Endémique\", IF($J13>1, IF($J13=4, \"Inconnu\", IF($J13=99, \"Surveillance\", SUM($N13:$P13))), 0),\"Non requis\")","v":0},0,0,0,0,0,0,0,0,null,null,null,null,null,null,null,null,40155,"Dakar nord"]
[{"$f":"IF(INTRO!$E$33<>0,INTRO!$E$33, \" \")","v":"SENEGAL"},"Dakar","Guédiawaye",448006.69004000002,{"$f":"IF(INTRO!$E$48=\"\",\"\",ROUND($D14*INTRO!$E$48,0))","v":54074},{"$f":"IF(INTRO!$E$49=\"\",\"\",ROUND($D14*INTRO!$E$49,0))","v":118856},{"$f":"IF(INTRO!$E$50=\"\",\"\",ROUND($D14*INTRO!$E$50,0))","v":260919},0,0,3,1,{"$f":"IF(INTRO!$E$37=\"Endémique\",IF($H14>0,IF($H14=4,\"Inconnu\",IF($H14=99,\"Interrompu\",$D14)),0),\"Non requis\")","v":0},{"$f":"IF(INTRO!$E$39=\"Endémique\", IF($I14>0, IF($I14=4,\"Inconnu\",IF($I14=99,\"Interrompu\",$D14)), 0),\"Non requis\")","v":0},{"$f":"IF(INTRO!$E$41=\"Endémique\", IF($J14>1, IF($J14=4, \"Inconnu\", IF($J14=99, \"Surveillance\", E14)), 0),\"Non requis\")","v":54074},{"$f":"IF(INTRO!$E$41=\"Endémique\", IF($J14>1, IF($J14=4, \"Inconnu\", IF($J14=99, \"Surveillance\", F14)), 0),\"Non requis\")","v":118856},{"$f":"IF(INTRO!$E$41=\"Endémique\", IF($J14>1, IF($J14=4, \"Inconnu\", IF($J14=99, \"Surveillance\", ROUND(D14*INTRO!$E$51,0))), 0),\"Non requis\")","v":110165},{"$f":"IF(INTRO!$E$41=\"Endémique\", IF($J14>1, IF($J14=4, \"Inconnu\", IF($J14=99, \"Surveillance\", SUM($N14:$P14))), 0),\"Non requis\")","v":283095},0,0,0,0,0,0,1,0,null,null,null,null,null,null,null,null,40152,"Guédiawaye"]
[{"$f":"IF(INTRO!$E$33<>0,INTRO!$E$33, \" \")","v":"SENEGAL"},"Dakar","Pikine",446667.18420999998,{"$f":"IF(INTRO!$E$48=\"\",\"\",ROUND($D15*INTRO!$E$48,0))","v":53913},{"$f":"IF(INTRO!$E$49=\"\",\"\",ROUND($D15*INTRO!$E$49,0))","v":118501},{"$f":"IF(INTRO!$E$50=\"\",\"\",ROUND($D15*INTRO!$E$50,0))","v":260139},0,0,3,0,{"$f":"IF(INTRO!$E$37=\"Endémique\",IF($H15>0,IF($H15=4,\"Inconnu\",IF($H15=99,\"Interrompu\",$D15)),0),\"Non requis\")","v":0},{"$f":"IF(INTRO!$E$39=\"Endémique\", IF($I15>0, IF($I15=4,\"Inconnu\",IF($I15=99,\"Interrompu\",$D15)), 0),\"Non requis\")","v":0},{"$f":"IF(INTRO!$E$41=\"Endémique\", IF($J15>1, IF($J15=4, \"Inconnu\", IF($J15=99, \"Surveillance\", E15)), 0),\"Non requis\")","v":53913},{"$f":"IF(INTRO!$E$41=\"Endémique\", IF($J15>1, IF($J15=4, \"Inconnu\", IF($J15=99, \"Surveillance\", F15)), 0),\"Non requis\")","v":118501},{"$f":"IF(INTRO!$E$41=\"Endémique\", IF($J15>1, IF($J15=4, \"Inconnu\", IF($J15=99, \"Surveillance\", ROUND(D15*INTRO!$E$51,0))), 0),\"Non requis\")","v":109835},{"$f":"IF(INTRO!$E$41=\"Endémique\", IF($J15>1, IF($J15=4, \"Inconnu\", IF($J15=99, \"Surveillance\", SUM($N15:$P15))), 0),\"Non requis\")","v":282249},0,0,0,0,0,0,1,0,null,null,null,null,null,null,null,null,40157,"Pikine"]
[{"$f":"IF(INTRO!$E$33<>0,INTRO!$E$33, \" \")","v":"SENEGAL"},"Dakar","Keur  Massar",317711.797754,{"$f":"IF(INTRO!$E$48=\"\",\"\",ROUND($D16*INTRO!$E$48,0))","v":38348},{"$f":"IF(INTRO!$E$49=\"\",\"\",ROUND($D16*INTRO!$E$49,0))","v":84289},{"$f":"IF(INTRO!$E$50=\"\",\"\",ROUND($D16*INTRO!$E$50,0))","v":185035},0,0,1,0,{"$f":"IF(INTRO!$E$37=\"Endémique\",IF($H16>0,IF($H16=4,\"Inconnu\",IF($H16=99,\"Interrompu\",$D16)),0),\"Non requis\")","v":0},{"$f":"IF(INTRO!$E$39=\"Endémique\", IF($I16>0, IF($I16=4,\"Inconnu\",IF($I16=99,\"Interrompu\",$D16)), 0),\"Non requis\")","v":0},{"$f":"IF(INTRO!$E$41=\"Endémique\", IF($J16>1, IF($J16=4, \"Inconnu\", IF($J16=99, \"Surveillance\", E16)), 0),\"Non requis\")","v":0},{"$f":"IF(INTRO!$E$41=\"Endémique\", IF($J16>1, IF($J16=4, \"Inconnu\", IF($J16=99, \"Surveillance\", F16)), 0),\"Non requis\")","v":0},{"$f":"IF(INTRO!$E$41=\"Endémique\", IF($J16>1, IF($J16=4, \"Inconnu\", IF($J16=99, \"Surveillance\", ROUND(D16*INTRO!$E$51,0))), 0),\"Non requis\")","v":0},{"$f":"IF(INTRO!$E$41=\"Endémique\", IF($J16>1, IF($J16=4, \"Inconnu\", IF($J16=99, \"Surveillance\", SUM($N16:$P16))), 0),\"Non requis\")","v":0},0,0,0,0,0,0,0,0,null,null,null,null,null,null,null,null,40227,"Keur  Massar"]
[{"$f":"IF(INTRO!$E$33<>0,INTRO!$E$33, \" \")","v":"SENEGAL"},"Dakar","Yeumbeul",360506.37219999998,{"$f":"IF(INTRO!$E$48=\"\",\"\",ROUND($D17*INTRO!$E$48,0))","v":43513},{"$f":"IF(INTRO!$E$49=\"\",\"\",ROUND($D17*INTRO!$E$49,0))","v":95642},{"$f":"IF(INTRO!$E$50=\"\",\"\",ROUND($D17*INTRO!$E$50,0))","v":209959},0,0,1,0,{"$f":"IF(INTRO!$E$37=\"Endémique\",IF($H17>0,IF($H17=4,\"Inconnu\",IF($H17=99,\"Interrompu\",$D17)),0),\"Non requis\")","v":0},{"$f":"IF(INTRO!$E$39=\"Endémique\", IF($I17>0, IF($I17=4,\"Inconnu\",IF($I17=99,\"Interrompu\",$D17)), 0),\"Non requis\")","v":0},{"$f":"IF(INTRO!$E$41=\"Endémique\", IF($J17>1, IF($J17=4, \"Inconnu\", IF($J17=99, \"Surveillance\", E17)), 0),\"Non requis\")","v":0},{"$f":"IF(INTRO!$E$41=\"Endémique\", IF($J17>1, IF($J17=4, \"Inconnu\", IF($J17=99, \"Surveillance\", F17)), 0),\"Non requis\")","v":0},{"$f":"IF(INTRO!$E$41=\"Endémique\", IF($J17>1, IF($J17=4, \"Inconnu\", IF($J17=99, \"Surveillance\", ROUND(D17*INTRO!$E$51,0))), 0),\"Non requis\")","v":0},{"$f":"IF(INTRO!$E$41=\"Endémique\", IF($J17>1, IF($J17=4, \"Inconnu\", IF($J17=99, \"Surveillance\", SUM($N17:$P17))), 0),\"Non requis\")","v":0},0,0,0,0,0,0,0,0,null,null,null,null,null,null,null,null,40228,"Yeumbeul"]
[{"$f":"IF(INTRO!$E$33<>0,INTRO!$E$33, \" \")","v":"SENEGAL"},"Dakar","Mbao",466137.48155000003,{"$f":"IF(INTRO!$E$48=\"\",\"\",ROUND($D18*INTRO!$E$48,0))","v":56263},{"$f":"IF(INTRO!$E$49=\"\",\"\",ROUND($D18*INTRO!$E$49,0))","v":123666},{"$f":"IF(INTRO!$E$50=\"\",\"\",ROUND($D18*INTRO!$E$50,0))","v":271478},0,0,3,0,{"$f":"IF(INTRO!$E$37=\"Endémique\",IF($H18>0,IF($H18=4,\"Inconnu\",IF($H18=99,\"Interrompu\",$D18)),0),\"Non requis\")","v":0},{"$f":"IF(INTRO!$E$39=\"Endémique\", IF($I18>0, IF($I18=4,\"Inconnu\",IF($I18=99,\"Interrompu\",$D18)), 0),\"Non requis\")","v":0},{"$f":"IF(INTRO!$E$41=\"Endémique\", IF($J18>1, IF($J18=4, \"Inconnu\", IF($J18=99, \"Surveillance\", E18)), 0),\"Non requis\")","v":56263},{"$f":"IF(INTRO!$E$41=\"Endémique\", IF($J18>1, IF($J18=4, \"Inconnu\", IF($J18=99, \"Surveillance\", F18)), 0),\"Non requis\")","v":123666},{"$f":"IF(INTRO!$E$41=\"Endémique\", IF($J18>1, IF($J18=4, \"Inconnu\", IF($J18=99, \"Surveillance\", ROUND(D18*INTRO!$E$51,0))), 0),\"Non requis\")","v":114623},{"$f":"IF(INTRO!$E$41=\"Endémique\", IF($J18>1, IF($J18=4, \"Inconnu\", IF($J18=99, \"Surveillance\", SUM($N18:$P18))), 0),\"Non requis\")","v":294552},0,0,0,0,0,0,1,0,null,null,null,null,null,null,null,null,40154,"Mbao"]
[{"$f":"IF(INTRO!$E$33<>0,INTRO!$E$33, \" \")","v":"SENEGAL"},"Dakar","Diamniadio",176748.32163299999,{"$f":"IF(INTRO!$E$48=\"\",\"\",ROUND($D19*INTRO!$E$48,0))","v":21334},{"$f":"IF(INTRO!$E$49=\"\",\"\",ROUND($D19*INTRO!$E$49,0))","v":46891},{"$f":"IF(INTRO!$E$50=\"\",\"\",ROUND($D19*INTRO!$E$50,0))","v":102938},0,0,1,0,{"$f":"IF(INTRO!$E$37=\"Endémique\",IF($H19>0,IF($H19=4,\"Inconnu\",IF($H19=99,\"Interrompu\",$D19)),0),\"Non requis\")","v":0},{"$f":"IF(INTRO!$E$39=\"Endémique\", IF($I19>0, IF($I19=4,\"Inconnu\",IF($I19=99,\"Interrompu\",$D19)), 0),\"Non requis\")","v":0},{"$f":"IF(INTRO!$E$41=\"Endémique\", IF($J19>1, IF($J19=4, \"Inconnu\", IF($J19=99, \"Surveillance\", E19)), 0),\"Non requis\")","v":0},{"$f":"IF(INTRO!$E$41=\"Endémique\", IF($J19>1, IF($J19=4, \"Inconnu\", IF($J19=99, \"Surveillance\", F19)), 0),\"Non requis\")","v":0},{"$f":"IF(INTRO!$E$41=\"Endémique\", IF($J19>1, IF($J19=4, \"Inconnu\", IF($J19=99, \"Surveillance\", ROUND(D19*INTRO!$E$51,0))), 0),\"Non requis\")","v":0},{"$f":"IF(INTRO!$E$41=\"Endémique\", IF($J19>1, IF($J19=4, \"Inconnu\", IF($J19=99, \"Surveillance\", SUM($N19:$P19))), 0),\"Non requis\")","v":0},0,0,0,0,0,0,0,0,null,null,null,null,null,null,null,null,40150,"Diamniadio"]
[{"$f":"IF(INTRO!$E$33<>0,INTRO!$E$33, \" \")","v":"SENEGAL"},"Dakar","Sangalkam",189677.18971500001,{"$f":"IF(INTRO!$E$48=\"\",\"\",ROUND($D20*INTRO!$E$48,0))","v":22894},{"$f":"IF(INTRO!$E$49=\"\",\"\",ROUND($D20*INTRO!$E$49,0))","v":50321},{"$f":"IF(INTRO!$E$50=\"\",\"\",ROUND($D20*INTRO!$E$50,0))","v":110468},0,0,2,0,{"$f":"IF(INTRO!$E$37=\"Endémique\",IF($H20>0,IF($H20=4,\"Inconnu\",IF($H20=99,\"Interrompu\",$D20)),0),\"Non requis\")","v":0},{"$f":"IF(INTRO!$E$39=\"Endémique\", IF($I20>0, IF($I20=4,\"Inconnu\",IF($I20=99,\"Interrompu\",$D20)), 0),\"Non requis\")","v":0},{"$f":"IF(INTRO!$E$41=\"Endémique\", IF($J20>1, IF($J20=4, \"Inconnu\", IF($J20=99, \"Surveillance\", E20)), 0),\"Non requis\")","v":22894},{"$f":"IF(INTRO!$E$41=\"Endémique\", IF($J20>1, IF($J20=4, \"Inconnu\", IF($J20=99, \"Surveillance\", F20)), 0),\"Non requis\")","v":50321},{"$f":"IF(INTRO!$E$41=\"Endémique\", IF($J20>1, IF($J20=4, \"Inconnu\", IF($J20=99, \"Surveillance\", ROUND(D20*INTRO!$E$51,0))), 0),\"Non requis\")","v":46642},{"$f":"IF(INTRO!$E$41=\"Endémique\", IF($J20>1, IF($J20=4, \"Inconnu\", IF($J20=99, \"Surveillance\", SUM($N20:$P20))), 0),\"Non requis\")","v":119857},0,0,0,0,0,0,1,0,null,null,null,null,null,null,null,null,40229,"Sangalkam"]
[{"$f":"IF(INTRO!$E$33<>0,INTRO!$E$33, \" \")","v":"SENEGAL"},"Dakar","Rufisque",300429.00835999998,{"$f":"IF(INTRO!$E$48=\"\",\"\",ROUND($D21*INTRO!$E$48,0))","v":36262},{"$f":"IF(INTRO!$E$49=\"\",\"\",ROUND($D21*INTRO!$E$49,0))","v":79704},{"$f":"IF(INTRO!$E$50=\"\",\"\",ROUND($D21*INTRO!$E$50,0))","v":174970},0,0,2,0,{"$f":"IF(INTRO!$E$37=\"Endémique\",IF($H21>0,IF($H21=4,\"Inconnu\",IF($H21=99,\"Interrompu\",$D21)),0),\"Non requis\")","v":0},{"$f":"IF(INTRO!$E$39=\"Endémique\", IF($I21>0, IF($I21=4,\"Inconnu\",IF($I21=99,\"Interrompu\",$D21)), 0),\"Non requis\")","v":0},{"$f":"IF(INTRO!$E$41=\"Endémique\", IF($J21>1, IF($J21=4, \"Inconnu\", IF($J21=99, \"Surveillance\", E21)), 0),\"Non requis\")","v":36262},{"$f":"IF(INTRO!$E$41=\"Endémique\", IF($J21>1, IF($J21=4, \"Inconnu\", IF($J21=99, \"Surveillance\", F21)), 0),\"Non requis\")","v":79704},{"$f":"IF(INTRO!$E$41=\"Endémique\", IF($J21>1, IF($J21=4, \"Inconnu\", IF($J21=99, \"Surveillance\", ROUND(D21*INTRO!$E$51,0))), 0),\"Non requis\")","v":73875},{"$f":"IF(INTRO!$E$41=\"Endémique\", IF($J21>1, IF($J21=4, \"Inconnu\", IF($J21=99, \"Surveillance\", SUM($N21:$P21))), 0),\"Non requis\")","v":189841},0,0,0,0,0,0,1,0,null,null,null,null,null,null,null,null,40158,"Rufisque"]
[{"$f":"IF(INTRO!$E$33<>0,INTRO!$E$33, \" \")","v":"SENEGAL"},"Diourbel","Bambéye",417826.67443399999,{"$f":"IF(INTRO!$E$48=\"\",\"\",ROUND($D22*INTRO!$E$48,0))","v":50432},{"$f":"IF(INTRO!$E$49=\"\",\"\",ROUND($D22*INTRO!$E$49,0))","v":110849},{"$f":"IF(INTRO!$E$50=\"\",\"\",ROUND($D22*INTRO!$E$50,0))","v":243342},99,0,0,2,{"$f":"IF(INTRO!$E$37=\"Endémique\",IF($H22>0,IF($H22=4,\"Inconnu\",IF($H22=99,\"Interrompu\",$D22)),0),\"Non requis\")","v":"Interrompu"},{"$f":"IF(INTRO!$E$39=\"Endémique\", IF($I22>0, IF($I22=4,\"Inconnu\",IF($I22=99,\"Interrompu\",$D22)), 0),\"Non requis\")","v":0},{"$f":"IF(INTRO!$E$41=\"Endémique\", IF($J22>1, IF($J22=4, \"Inconnu\", IF($J22=99, \"Surveillance\", E22)), 0),\"Non requis\")","v":0},{"$f":"IF(INTRO!$E$41=\"Endémique\", IF($J22>1, IF($J22=4, \"Inconnu\", IF($J22=99, \"Surveillance\", F22)), 0),\"Non requis\")","v":0},{"$f":"IF(INTRO!$E$41=\"Endémique\", IF($J22>1, IF($J22=4, \"Inconnu\", IF($J22=99, \"Surveillance\", ROUND(D22*INTRO!$E$51,0))), 0),\"Non requis\")","v":0},{"$f":"IF(INTRO!$E$41=\"Endémique\", IF($J22>1, IF($J22=4, \"Inconnu\", IF($J22=99, \"Surveillance\", SUM($N22:$P22))), 0),\"Non requis\")","v":0},10349,30642,67274,108265,0,0,0,1,null,null,null,null,null,null,null,null,40160,"Bambéye"]
[{"$f":"IF(INTRO!$E$33<>0,INTRO!$E$33, \" \")","v":"SENEGAL"},"Diourbel","Diourbel",374209.41136800003,{"$f":"IF(INTRO!$E$48=\"\",\"\",ROUND($D23*INTRO!$E$48,0))","v":45167},{"$f":"IF(INTRO!$E$49=\"\",\"\",ROUND($D23*INTRO!$E$49,0))","v":99278},{"$f":"IF(INTRO!$E$50=\"\",\"\",ROUND($D23*INTRO!$E$50,0))","v":217940},0,0,0,2,{"$f":"IF(INTRO!$E$37=\"Endémique\",IF($H23>0,IF($H23=4,\"Inconnu\",IF($H23=99,\"Interrompu\",$D23)),0),\"Non requis\")","v":0},{"$f":"IF(INTRO!$E$39=\"Endémique\", IF($I23>0, IF($I23=4,\"Inconnu\",IF($I23=99,\"Interrompu\",$D23)), 0),\"Non requis\")","v":0},{"$f":"IF(INTRO!$E$41=\"Endémique\", IF($J23>1, IF($J23=4, \"Inconnu\", IF($J23=99, \"Surveillance\", E23)), 0),\"Non requis\")","v":0},{"$f":"IF(INTRO!$E$41=\"Endémique\", IF($J23>1, IF($J23=4, \"Inconnu\", IF($J23=99, \"Surveillance\", F23)), 0),\"Non requis\")","v":0},{"$f":"IF(INTRO!$E$41=\"Endémique\", IF($J23>1, IF($J23=4, \"Inconnu\", IF($J23=99, \"Surveillance\", ROUND(D23*INTRO!$E$51,0))), 0),\"Non requis\")","v":0},{"$f":"IF(INTRO!$E$41=\"Endémique\", IF($J23>1, IF($J23=4, \"Inconnu\", IF($J23=99, \"Surveillance\", SUM($N23:$P23))), 0),\"Non requis\")","v":0},13844,40994,90000,144838,0,0,0,1,null,null,null,null,null,null,null,null,40161,"Diourbel"]
[{"$f":"IF(INTRO!$E$33<>0,INTRO!$E$33, \" \")","v":"SENEGAL"},"Diourbel","Mbacké",246182.18643200002,{"$f":"IF(INTRO!$E$48=\"\",\"\",ROUND($D24*INTRO!$E$48,0))","v":29714},{"$f":"IF(INTRO!$E$49=\"\",\"\",ROUND($D24*INTRO!$E$49,0))","v":65312},{"$f":"IF(INTRO!$E$50=\"\",\"\",ROUND($D24*INTRO!$E$50,0))","v":143377},99,0,0,1,{"$f":"IF(INTRO!$E$37=\"Endémique\",IF($H24>0,IF($H24=4,\"Inconnu\",IF($H24=99,\"Interrompu\",$D24)),0),\"Non requis\")","v":"Interrompu"},{"$f":"IF(INTRO!$E$39=\"Endémique\", IF($I24>0, IF($I24=4,\"Inconnu\",IF($I24=99,\"Interrompu\",$D24)), 0),\"Non requis\")","v":0},{"$f":"IF(INTRO!$E$41=\"Endémique\", IF($J24>1, IF($J24=4, \"Inconnu\", IF($J24=99, \"Surveillance\", E24)), 0),\"Non requis\")","v":0},{"$f":"IF(INTRO!$E$41=\"Endémique\", IF($J24>1, IF($J24=4, \"Inconnu\", IF($J24=99, \"Surveillance\", F24)), 0),\"Non requis\")","v":0},{"$f":"IF(INTRO!$E$41=\"Endémique\", IF($J24>1, IF($J24=4, \"Inconnu\", IF($J24=99, \"Surveillance\", ROUND(D24*INTRO!$E$51,0))), 0),\"Non requis\")","v":0},{"$f":"IF(INTRO!$E$41=\"Endémique\", IF($J24>1, IF($J24=4, \"Inconnu\", IF($J24=99, \"Surveillance\", SUM($N24:$P24))), 0),\"Non requis\")","v":0},0,0,0,0,0,0,0,0,null,null,null,null,null,null,null,null,40162,"Mbacké"]
[{"$f":"IF(INTRO!$E$33<>0,INTRO!$E$33, \" \")","v":"SENEGAL"},"Diourbel","Touba",1056420.469,{"$f":"IF(INTRO!$E$48=\"\",\"\",ROUND($D25*INTRO!$E$48,0))","v":127510},{"$f":"IF(INTRO!$E$49=\"\",\"\",ROUND($D25*INTRO!$E$49,0))","v":280268},{"$f":"IF(INTRO!$E$50=\"\",\"\",ROUND($D25*INTRO!$E$50,0))","v":615259},99,0,0,1,{"$f":"IF(INTRO!$E$37=\"Endémique\",IF($H25>0,IF($H25=4,\"Inconnu\",IF($H25=99,\"Interrompu\",$D25)),0),\"Non requis\")","v":"Interrompu"},{"$f":"IF(INTRO!$E$39=\"Endémique\", IF($I25>0, IF($I25=4,\"Inconnu\",IF($I25=99,\"Interrompu\",$D25)), 0),\"Non requis\")","v":0},{"$f":"IF(INTRO!$E$41=\"Endémique\", IF($J25>1, IF($J25=4, \"Inconnu\", IF($J25=99, \"Surveillance\", E25)), 0),\"Non requis\")","v":0},{"$f":"IF(INTRO!$E$41=\"Endémique\", IF($J25>1, IF($J25=4, \"Inconnu\", IF($J25=99, \"Surveillance\", F25)), 0),\"Non requis\")","v":0},{"$f":"IF(INTRO!$E$41=\"Endémique\", IF($J25>1, IF($J25=4, \"Inconnu\", IF($J25=99, \"Surveillance\", ROUND(D25*INTRO!$E$51,0))), 0),\"Non requis\")","v":0},{"$f":"IF(INTRO!$E$41=\"Endémique\", IF($J25>1, IF($J25=4, \"Inconnu\", IF($J25=99, \"Surveillance\", SUM($N25:$P25))), 0),\"Non requis\")","v":0},0,0,0,0,0,0,0,0,null,null,null,null,null,null,null,null,40163,"Touba"]
[{"$f":"IF(INTRO!$E$33<>0,INTRO!$E$33, \" \")","v":"SENEGAL"},"Fatick","Niakhar",110923.739472,{"$f":"IF(INTRO!$E$48=\"\",\"\",ROUND($D26*INTRO!$E$48,0))","v":13388},{"$f":"IF(INTRO!$E$49=\"\",\"\",ROUND($D26*INTRO!$E$49,0))","v":29428},{"$f":"IF(INTRO!$E$50=\"\",\"\",ROUND($D26*INTRO!$E$50,0))","v":64602},99,0,99,21,{"$f":"IF(INTRO!$E$37=\"Endémique\",IF($H26>0,IF($H26=4,\"Inconnu\",IF($H26=99,\"Interrompu\",$D26)),0),\"Non requis\")","v":"Interrompu"},{"$f":"IF(INTRO!$E$39=\"Endémique\", IF($I26>0, IF($I26=4,\"Inconnu\",IF($I26=99,\"Interrompu\",$D26)), 0),\"Non requis\")","v":0},{"$f":"IF(INTRO!$E$41=\"Endémique\", IF($J26>1, IF($J26=4, \"Inconnu\", IF($J26=99, \"Surveillance\", E26)), 0),\"Non requis\")","v":"Surveillance"},{"$f":"IF(INTRO!$E$41=\"Endémique\", IF($J26>1, IF($J26=4, \"Inconnu\", IF($J26=99, \"Surveillance\", F26)), 0),\"Non requis\")","v":"Surveillance"},{"$f":"IF(INTRO!$E$41=\"Endémique\", IF($J26>1, IF($J26=4, \"Inconnu\", IF($J26=99, \"Surveillance\", ROUND(D26*INTRO!$E$51,0))), 0),\"Non requis\")","v":"Surveillance"},{"$f":"IF(INTRO!$E$41=\"Endémique\", IF($J26>1, IF($J26=4, \"Inconnu\", IF($J26=99, \"Surveillance\", SUM($N26:$P26))), 0),\"Non requis\")","v":"Surveillance"},4430,13118,28799,46347,0,0,0,1,null,null,null,null,null,null,null,null,40168,"Niakhar"]
[{"$f":"IF(INTRO!$E$33<>0,INTRO!$E$33, \" \")","v":"SENEGAL"},"Fatick","Diakhao",105480.08900000001,{"$f":"IF(INTRO!$E$48=\"\",\"\",ROUND($D27*INTRO!$E$48,0))","v":12731},{"$f":"IF(INTRO!$E$49=\"\",\"\",ROUND($D27*INTRO!$E$49,0))","v":27984},{"$f":"IF(INTRO!$E$50=\"\",\"\",ROUND($D27*INTRO!$E$50,0))","v":61432},99,0,99,21,{"$f":"IF(INTRO!$E$37=\"Endémique\",IF($H27>0,IF($H27=4,\"Inconnu\",IF($H27=99,\"Interrompu\",$D27)),0),\"Non requis\")","v":"Interrompu"},{"$f":"IF(INTRO!$E$39=\"Endémique\", IF($I27>0, IF($I27=4,\"Inconnu\",IF($I27=99,\"Interrompu\",$D27)), 0),\"Non requis\")","v":0},{"$f":"IF(INTRO!$E$41=\"Endémique\", IF($J27>1, IF($J27=4, \"Inconnu\", IF($J27=99, \"Surveillance\", E27)), 0),\"Non requis\")","v":"Surveillance"},{"$f":"IF(INTRO!$E$41=\"Endémique\", IF($J27>1, IF($J27=4, \"Inconnu\", IF($J27=99, \"Surveillance\", F27)), 0),\"Non requis\")","v":"Surveillance"},{"$f":"IF(INTRO!$E$41=\"Endémique\", IF($J27>1, IF($J27=4, \"Inconnu\", IF($J27=99, \"Surveillance\", ROUND(D27*INTRO!$E$51,0))), 0),\"Non requis\")","v":"Surveillance"},{"$f":"IF(INTRO!$E$41=\"Endémique\", IF($J27>1, IF($J27=4, \"Inconnu\", IF($J27=99, \"Surveillance\", SUM($N27:$P27))), 0),\"Non requis\")","v":"Surveillance"},3329,9861,21647,34837,0,0,0,1,null,null,null,null,null,null,null,null,40231,"Diakhao"]
[{"$f":"IF(INTRO!$E$33<>0,INTRO!$E$33, \" \")","v":"SENEGAL"},"Fatick","Fatick",155280.34599999999,{"$f":"IF(INTRO!$E$48=\"\",\"\",ROUND($D28*INTRO!$E$48,0))","v":18742},{"$f":"IF(INTRO!$E$49=\"\",\"\",ROUND($D28*INTRO!$E$49,0))","v":41196},{"$f":"IF(INTRO!$E$50=\"\",\"\",ROUND($D28*INTRO!$E$50,0))","v":90435},99,0,11,31,{"$f":"IF(INTRO!$E$37=\"Endémique\",IF($H28>0,IF($H28=4,\"Inconnu\",IF($H28=99,\"Interrompu\",$D28)),0),\"Non requis\")","v":"Interrompu"},{"$f":"IF(INTRO!$E$39=\"Endémique\", IF($I28>0, IF($I28=4,\"Inconnu\",IF($I28=99,\"Interrompu\",$D28)), 0),\"Non requis\")","v":0},{"$f":"IF(INTRO!$E$41=\"Endémique\", IF($J28>1, IF($J28=4, \"Inconnu\", IF($J28=99, \"Surveillance\", E28)), 0),\"Non requis\")","v":18742},{"$f":"IF(INTRO!$E$41=\"Endémique\", IF($J28>1, IF($J28=4, \"Inconnu\", IF($J28=99, \"Surveillance\", F28)), 0),\"Non requis\")","v":41196},{"$f":"IF(INTRO!$E$41=\"Endémique\", IF($J28>1, IF($J28=4, \"Inconnu\", IF($J28=99, \"Surveillance\", ROUND(D28*INTRO!$E$51,0))), 0),\"Non requis\")","v":38183},{"$f":"IF(INTRO!$E$41=\"Endémique\", IF($J28>1, IF($J28=4, \"Inconnu\", IF($J28=99, \"Surveillance\", SUM($N28:$P28))), 0),\"Non requis\")","v":98121},14048,41196,90435,146973,0,0,1,1,null,null,null,null,null,null,null,null,40165,"Fatick"]
[{"$f":"IF(INTRO!$E$33<>0,INTRO!$E$33, \" \")","v":"SENEGAL"},"Fatick","Dioffior",108246.83726999999,{"$f":"IF(INTRO!$E$48=\"\",\"\",ROUND($D29*INTRO!$E$48,0))","v":13065},{"$f":"IF(INTRO!$E$49=\"\",\"\",ROUND($D29*INTRO!$E$49,0))","v":28718},{"$f":"IF(INTRO!$E$50=\"\",\"\",ROUND($D29*INTRO!$E$50,0))","v":63043},99,0,1,11,{"$f":"IF(INTRO!$E$37=\"Endémique\",IF($H29>0,IF($H29=4,\"Inconnu\",IF($H29=99,\"Interrompu\",$D29)),0),\"Non requis\")","v":"Interrompu"},{"$f":"IF(INTRO!$E$39=\"Endémique\", IF($I29>0, IF($I29=4,\"Inconnu\",IF($I29=99,\"Interrompu\",$D29)), 0),\"Non requis\")","v":0},{"$f":"IF(INTRO!$E$41=\"Endémique\", IF($J29>1, IF($J29=4, \"Inconnu\", IF($J29=99, \"Surveillance\", E29)), 0),\"Non requis\")","v":0},{"$f":"IF(INTRO!$E$41=\"Endémique\", IF($J29>1, IF($J29=4, \"Inconnu\", IF($J29=99, \"Surveillance\", F29)), 0),\"Non requis\")","v":0},{"$f":"IF(INTRO!$E$41=\"Endémique\", IF($J29>1, IF($J29=4, \"Inconnu\", IF($J29=99, \"Surveillance\", ROUND(D29*INTRO!$E$51,0))), 0),\"Non requis\")","v":0},{"$f":"IF(INTRO!$E$41=\"Endémique\", IF($J29>1, IF($J29=4, \"Inconnu\", IF($J29=99, \"Surveillance\", SUM($N29:$P29))), 0),\"Non requis\")","v":0},1008,2984,6551,10543,0,0,0,1,null,null,null,null,null,null,null,null,40164,"Dioffior"]
[{"$f":"IF(INTRO!$E$33<>0,INTRO!$E$33, \" \")","v":"SENEGAL"},"Fatick","Passy",80076.217000000004,{"$f":"IF(INTRO!$E$48=\"\",\"\",ROUND($D30*INTRO!$E$48,0))","v":9665},{"$f":"IF(INTRO!$E$49=\"\",\"\",ROUND($D30*INTRO!$E$49,0))","v":21244},{"$f":"IF(INTRO!$E$50=\"\",\"\",ROUND($D30*INTRO!$E$50,0))","v":46636},0,0,0,2,{"$f":"IF(INTRO!$E$37=\"Endémique\",IF($H30>0,IF($H30=4,\"Inconnu\",IF($H30=99,\"Interrompu\",$D30)),0),\"Non requis\")","v":0},{"$f":"IF(INTRO!$E$39=\"Endémique\", IF($I30>0, IF($I30=4,\"Inconnu\",IF($I30=99,\"Interrompu\",$D30)), 0),\"Non requis\")","v":0},{"$f":"IF(INTRO!$E$41=\"Endémique\", IF($J30>1, IF($J30=4, \"Inconnu\", IF($J30=99, \"Surveillance\", E30)), 0),\"Non requis\")","v":0},{"$f":"IF(INTRO!$E$41=\"Endémique\", IF($J30>1, IF($J30=4, \"Inconnu\", IF($J30=99, \"Surveillance\", F30)), 0),\"Non requis\")","v":0},{"$f":"IF(INTRO!$E$41=\"Endémique\", IF($J30>1, IF($J30=4, \"Inconnu\", IF($J30=99, \"Surveillance\", ROUND(D30*INTRO!$E$51,0))), 0),\"Non requis\")","v":0},{"$f":"IF(INTRO!$E$41=\"Endémique\", IF($J30>1, IF($J30=4, \"Inconnu\", IF($J30=99, \"Surveillance\", SUM($N30:$P30))), 0),\"Non requis\")","v":0},1595,4723,10370,16688,0,0,0,1,null,null,null,null,null,null,null,null,40169,"Passy"]
[{"$f":"IF(INTRO!$E$33<>0,INTRO!$E$33, \" \")","v":"SENEGAL"},"Fatick","Foundiougne",72297.454033999995,{"$f":"IF(INTRO!$E$48=\"\",\"\",ROUND($D31*INTRO!$E$48,0))","v":8726},{"$f":"IF(INTRO!$E$49=\"\",\"\",ROUND($D31*INTRO!$E$49,0))","v":19181},{"$f":"IF(INTRO!$E$50=\"\",\"\",ROUND($D31*INTRO!$E$50,0))","v":42106},0,0,1,99,{"$f":"IF(INTRO!$E$37=\"Endémique\",IF($H31>0,IF($H31=4,\"Inconnu\",IF($H31=99,\"Interrompu\",$D31)),0),\"Non requis\")","v":0},{"$f":"IF(INTRO!$E$39=\"Endémique\", IF($I31>0, IF($I31=4,\"Inconnu\",IF($I31=99,\"Interrompu\",$D31)), 0),\"Non requis\")","v":0},{"$f":"IF(INTRO!$E$41=\"Endémique\", IF($J31>1, IF($J31=4, \"Inconnu\", IF($J31=99, \"Surveillance\", E31)), 0),\"Non requis\")","v":0},{"$f":"IF(INTRO!$E$41=\"Endémique\", IF($J31>1, IF($J31=4, \"Inconnu\", IF($J31=99, \"Surveillance\", F31)), 0),\"Non requis\")","v":0},{"$f":"IF(INTRO!$E$41=\"Endémique\", IF($J31>1, IF($J31=4, \"Inconnu\", IF($J31=99, \"Surveillance\", ROUND(D31*INTRO!$E$51,0))), 0),\"Non requis\")","v":0},{"$f":"IF(INTRO!$E$41=\"Endémique\", IF($J31>1, IF($J31=4, \"Inconnu\", IF($J31=99, \"Surveillance\", SUM($N31:$P31))), 0),\"Non requis\")","v":0},0,0,0,0,0,0,0,0,null,null,null,null,null,null,null,null,40166,"Foundiougne"]
[{"$f":"IF(INTRO!$E$33<>0,INTRO!$E$33, \" \")","v":"SENEGAL"},"Fatick","Sokone",249002.31200000001,{"$f":"IF(INTRO!$E$48=\"\",\"\",ROUND($D32*INTRO!$E$48,0))","v":30055},{"$f":"IF(INTRO!$E$49=\"\",\"\",ROUND($D32*INTRO!$E$49,0))","v":66060},{"$f":"IF(INTRO!$E$50=\"\",\"\",ROUND($D32*INTRO!$E$50,0))","v":145019},99,0,0,1,{"$f":"IF(INTRO!$E$37=\"Endémique\",IF($H32>0,IF($H32=4,\"Inconnu\",IF($H32=99,\"Interrompu\",$D32)),0),\"Non requis\")","v":"Interrompu"},{"$f":"IF(INTRO!$E$39=\"Endémique\", IF($I32>0, IF($I32=4,\"Inconnu\",IF($I32=99,\"Interrompu\",$D32)), 0),\"Non requis\")","v":0},{"$f":"IF(INTRO!$E$41=\"Endémique\", IF($J32>1, IF($J32=4, \"Inconnu\", IF($J32=99, \"Surveillance\", E32)), 0),\"Non requis\")","v":0},{"$f":"IF(INTRO!$E$41=\"Endémique\", IF($J32>1, IF($J32=4, \"Inconnu\", IF($J32=99, \"Surveillance\", F32)), 0),\"Non requis\")","v":0},{"$f":"IF(INTRO!$E$41=\"Endémique\", IF($J32>1, IF($J32=4, \"Inconnu\", IF($J32=99, \"Surveillance\", ROUND(D32*INTRO!$E$51,0))), 0),\"Non requis\")","v":0},{"$f":"IF(INTRO!$E$41=\"Endémique\", IF($J32>1, IF($J32=4, \"Inconnu\", IF($J32=99, \"Surveillance\", SUM($N32:$P32))), 0),\"Non requis\")","v":0},0,0,0,0,0,0,0,0,null,null,null,null,null,null,null,null,40170,"Sokone"]
[{"$f":"IF(INTRO!$E$33<>0,INTRO!$E$33, \" \")","v":"SENEGAL"},"Fatick","Gossas",136497.753535,{"$f":"IF(INTRO!$E$48=\"\",\"\",ROUND($D33*INTRO!$E$48,0))","v":16475},{"$f":"IF(INTRO!$E$49=\"\",\"\",ROUND($D33*INTRO!$E$49,0))","v":36213},{"$f":"IF(INTRO!$E$50=\"\",\"\",ROUND($D33*INTRO!$E$50,0))","v":79496},99,0,99,31,{"$f":"IF(INTRO!$E$37=\"Endémique\",IF($H33>0,IF($H33=4,\"Inconnu\",IF($H33=99,\"Interrompu\",$D33)),0),\"Non requis\")","v":"Interrompu"},{"$f":"IF(INTRO!$E$39=\"Endémique\", IF($I33>0, IF($I33=4,\"Inconnu\",IF($I33=99,\"Interrompu\",$D33)), 0),\"Non requis\")","v":0},{"$f":"IF(INTRO!$E$41=\"Endémique\", IF($J33>1, IF($J33=4, \"Inconnu\", IF($J33=99, \"Surveillance\", E33)), 0),\"Non requis\")","v":"Surveillance"},{"$f":"IF(INTRO!$E$41=\"Endémique\", IF($J33>1, IF($J33=4, \"Inconnu\", IF($J33=99, \"Surveillance\", F33)), 0),\"Non requis\")","v":"Surveillance"},{"$f":"IF(INTRO!$E$41=\"Endémique\", IF($J33>1, IF($J33=4, \"Inconnu\", IF($J33=99, \"Surveillance\", ROUND(D33*INTRO!$E$51,0))), 0),\"Non requis\")","v":"Surveillance"},{"$f":"IF(INTRO!$E$41=\"Endémique\", IF($J33>1, IF($J33=4, \"Inconnu\", IF($J33=99, \"Surveillance\", SUM($N33:$P33))), 0),\"Non requis\")","v":"Surveillance"},6217,18410,40415,65042,0,0,0,1,null,null,null,null,null,null,null,null,40167,"Gossas"]
[{"$f":"IF(INTRO!$E$33<>0,INTRO!$E$33, \" \")","v":"SENEGAL"},"Kaffrine","Birkelane",148555.54999999999,{"$f":"IF(INTRO!$E$48=\"\",\"\",ROUND($D34*INTRO!$E$48,0))","v":17931},{"$f":"IF(INTRO!$E$49=\"\",\"\",ROUND($D34*INTRO!$E$49,0))","v":39412},{"$f":"IF(INTRO!$E$50=\"\",\"\",ROUND($D34*INTRO!$E$50,0))","v":86519},99,0,0,21,{"$f":"IF(INTRO!$E$37=\"Endémique\",IF($H34>0,IF($H34=4,\"Inconnu\",IF($H34=99,\"Interrompu\",$D34)),0),\"Non requis\")","v":"Interrompu"},{"$f":"IF(INTRO!$E$39=\"Endémique\", IF($I34>0, IF($I34=4,\"Inconnu\",IF($I34=99,\"Interrompu\",$D34)), 0),\"Non requis\")","v":0},{"$f":"IF(INTRO!$E$41=\"Endémique\", IF($J34>1, IF($J34=4, \"Inconnu\", IF($J34=99, \"Surveillance\", E34)), 0),\"Non requis\")","v":0},{"$f":"IF(INTRO!$E$41=\"Endémique\", IF($J34>1, IF($J34=4, \"Inconnu\", IF($J34=99, \"Surveillance\", F34)), 0),\"Non requis\")","v":0},{"$f":"IF(INTRO!$E$41=\"Endémique\", IF($J34>1, IF($J34=4, \"Inconnu\", IF($J34=99, \"Surveillance\", ROUND(D34*INTRO!$E$51,0))), 0),\"Non requis\")","v":0},{"$f":"IF(INTRO!$E$41=\"Endémique\", IF($J34>1, IF($J34=4, \"Inconnu\", IF($J34=99, \"Surveillance\", SUM($N34:$P34))), 0),\"Non requis\")","v":0},2262,6700,14711,23673,0,0,0,1,null,null,null,null,null,null,null,null,40171,"Birkelane"]
[{"$f":"IF(INTRO!$E$33<>0,INTRO!$E$33, \" \")","v":"SENEGAL"},"Kaffrine","Kaffrine",302212.55509899999,{"$f":"IF(INTRO!$E$48=\"\",\"\",ROUND($D35*INTRO!$E$48,0))","v":36477},{"$f":"IF(INTRO!$E$49=\"\",\"\",ROUND($D35*INTRO!$E$49,0))","v":80177},{"$f":"IF(INTRO!$E$50=\"\",\"\",ROUND($D35*INTRO!$E$50,0))","v":176009},99,0,0,21,{"$f":"IF(INTRO!$E$37=\"Endémique\",IF($H35>0,IF($H35=4,\"Inconnu\",IF($H35=99,\"Interrompu\",$D35)),0),\"Non requis\")","v":"Interrompu"},{"$f":"IF(INTRO!$E$39=\"Endémique\", IF($I35>0, IF($I35=4,\"Inconnu\",IF($I35=99,\"Interrompu\",$D35)), 0),\"Non requis\")","v":0},{"$f":"IF(INTRO!$E$41=\"Endémique\", IF($J35>1, IF($J35=4, \"Inconnu\", IF($J35=99, \"Surveillance\", E35)), 0),\"Non requis\")","v":0},{"$f":"IF(INTRO!$E$41=\"Endémique\", IF($J35>1, IF($J35=4, \"Inconnu\", IF($J35=99, \"Surveillance\", F35)), 0),\"Non requis\")","v":0},{"$f":"IF(INTRO!$E$41=\"Endémique\", IF($J35>1, IF($J35=4, \"Inconnu\", IF($J35=99, \"Surveillance\", ROUND(D35*INTRO!$E$51,0))), 0),\"Non requis\")","v":0},{"$f":"IF(INTRO!$E$41=\"Endémique\", IF($J35>1, IF($J35=4, \"Inconnu\", IF($J35=99, \"Surveillance\", SUM($N35:$P35))), 0),\"Non requis\")","v":0},1269,3758,8251,13278,0,0,0,1,null,null,null,null,null,null,null,null,40172,"Kaffrine"]
[{"$f":"IF(INTRO!$E$33<>0,INTRO!$E$33, \" \")","v":"SENEGAL"},"Kaffrine","Koungheul",237832.95166800002,{"$f":"IF(INTRO!$E$48=\"\",\"\",ROUND($D36*INTRO!$E$48,0))","v":28706},{"$f":"IF(INTRO!$E$49=\"\",\"\",ROUND($D36*INTRO!$E$49,0))","v":63097},{"$f":"IF(INTRO!$E$50=\"\",\"\",ROUND($D36*INTRO!$E$50,0))","v":138514},99,0,1,21,{"$f":"IF(INTRO!$E$37=\"Endémique\",IF($H36>0,IF($H36=4,\"Inconnu\",IF($H36=99,\"Interrompu\",$D36)),0),\"Non requis\")","v":"Interrompu"},{"$f":"IF(INTRO!$E$39=\"Endémique\", IF($I36>0, IF($I36=4,\"Inconnu\",IF($I36=99,\"Interrompu\",$D36)), 0),\"Non requis\")","v":0},{"$f":"IF(INTRO!$E$41=\"Endémique\", IF($J36>1, IF($J36=4, \"Inconnu\", IF($J36=99, \"Surveillance\", E36)), 0),\"Non requis\")","v":0},{"$f":"IF(INTRO!$E$41=\"Endémique\", IF($J36>1, IF($J36=4, \"Inconnu\", IF($J36=99, \"Surveillance\", F36)), 0),\"Non requis\")","v":0},{"$f":"IF(INTRO!$E$41=\"Endémique\", IF($J36>1, IF($J36=4, \"Inconnu\", IF($J36=99, \"Surveillance\", ROUND(D36*INTRO!$E$51,0))), 0),\"Non requis\")","v":0},{"$f":"IF(INTRO!$E$41=\"Endémique\", IF($J36>1, IF($J36=4, \"Inconnu\", IF($J36=99, \"Surveillance\", SUM($N36:$P36))), 0),\"Non requis\")","v":0},1991,5897,12947,20835,0,0,0,1,null,null,null,null,null,null,null,null,40173,"Koungheul"]
[{"$f":"IF(INTRO!$E$33<>0,INTRO!$E$33, \" \")","v":"SENEGAL"},"Kaffrine","Malem Hodar",137753.93577399998,{"$f":"IF(INTRO!$E$48=\"\",\"\",ROUND($D37*INTRO!$E$48,0))","v":16627},{"$f":"IF(INTRO!$E$49=\"\",\"\",ROUND($D37*INTRO!$E$49,0))","v":36546},{"$f":"IF(INTRO!$E$50=\"\",\"\",ROUND($D37*INTRO!$E$50,0))","v":80228},99,0,11,21,{"$f":"IF(INTRO!$E$37=\"Endémique\",IF($H37>0,IF($H37=4,\"Inconnu\",IF($H37=99,\"Interrompu\",$D37)),0),\"Non requis\")","v":"Interrompu"},{"$f":"IF(INTRO!$E$39=\"Endémique\", IF($I37>0, IF($I37=4,\"Inconnu\",IF($I37=99,\"Interrompu\",$D37)), 0),\"Non requis\")","v":0},{"$f":"IF(INTRO!$E$41=\"Endémique\", IF($J37>1, IF($J37=4, \"Inconnu\", IF($J37=99, \"Surveillance\", E37)), 0),\"Non requis\")","v":16627},{"$f":"IF(INTRO!$E$41=\"Endémique\", IF($J37>1, IF($J37=4, \"Inconnu\", IF($J37=99, \"Surveillance\", F37)), 0),\"Non requis\")","v":36546},{"$f":"IF(INTRO!$E$41=\"Endémique\", IF($J37>1, IF($J37=4, \"Inconnu\", IF($J37=99, \"Surveillance\", ROUND(D37*INTRO!$E$51,0))), 0),\"Non requis\")","v":33874},{"$f":"IF(INTRO!$E$41=\"Endémique\", IF($J37>1, IF($J37=4, \"Inconnu\", IF($J37=99, \"Surveillance\", SUM($N37:$P37))), 0),\"Non requis\")","v":87047},4342,12860,28235,45437,0,0,1,1,null,null,null,null,null,null,null,null,40174,"Malem Hodar"]
[{"$f":"IF(INTRO!$E$33<>0,INTRO!$E$33, \" \")","v":"SENEGAL"},"Kaolack","Guinguineo",160193.29524900002,{"$f":"IF(INTRO!$E$48=\"\",\"\",ROUND($D38*INTRO!$E$48,0))","v":19335},{"$f":"IF(INTRO!$E$49=\"\",\"\",ROUND($D38*INTRO!$E$49,0))","v":42499},{"$f":"IF(INTRO!$E$50=\"\",\"\",ROUND($D38*INTRO!$E$50,0))","v":93297},99,0,0,2,{"$f":"IF(INTRO!$E$37=\"Endémique\",IF($H38>0,IF($H38=4,\"Inconnu\",IF($H38=99,\"Interrompu\",$D38)),0),\"Non requis\")","v":"Interrompu"},{"$f":"IF(INTRO!$E$39=\"Endémique\", IF($I38>0, IF($I38=4,\"Inconnu\",IF($I38=99,\"Interrompu\",$D38)), 0),\"Non requis\")","v":0},{"$f":"IF(INTRO!$E$41=\"Endémique\", IF($J38>1, IF($J38=4, \"Inconnu\", IF($J38=99, \"Surveillance\", E38)), 0),\"Non requis\")","v":0},{"$f":"IF(INTRO!$E$41=\"Endémique\", IF($J38>1, IF($J38=4, \"Inconnu\", IF($J38=99, \"Surveillance\", F38)), 0),\"Non requis\")","v":0},{"$f":"IF(INTRO!$E$41=\"Endémique\", IF($J38>1, IF($J38=4, \"Inconnu\", IF($J38=99, \"Surveillance\", ROUND(D38*INTRO!$E$51,0))), 0),\"Non requis\")","v":0},{"$f":"IF(INTRO!$E$41=\"Endémique\", IF($J38>1, IF($J38=4, \"Inconnu\", IF($J38=99, \"Surveillance\", SUM($N38:$P38))), 0),\"Non requis\")","v":0},5224,15471,33968,54663,0,0,0,1,null,null,null,null,null,null,null,null,40175,"Guinguineo"]
[{"$f":"IF(INTRO!$E$33<>0,INTRO!$E$33, \" \")","v":"SENEGAL"},"Kaolack","Kaolack",435465.96223,{"$f":"IF(INTRO!$E$48=\"\",\"\",ROUND($D39*INTRO!$E$48,0))","v":52561},{"$f":"IF(INTRO!$E$49=\"\",\"\",ROUND($D39*INTRO!$E$49,0))","v":115529},{"$f":"IF(INTRO!$E$50=\"\",\"\",ROUND($D39*INTRO!$E$50,0))","v":253615},19,0,0,1,{"$f":"IF(INTRO!$E$37=\"Endémique\",IF($H39>0,IF($H39=4,\"Inconnu\",IF($H39=99,\"Interrompu\",$D39)),0),\"Non requis\")","v":435465.96223},{"$f":"IF(INTRO!$E$39=\"Endémique\", IF($I39>0, IF($I39=4,\"Inconnu\",IF($I39=99,\"Interrompu\",$D39)), 0),\"Non requis\")","v":0},{"$f":"IF(INTRO!$E$41=\"Endémique\", IF($J39>1, IF($J39=4, \"Inconnu\", IF($J39=99, \"Surveillance\", E39)), 0),\"Non requis\")","v":0},{"$f":"IF(INTRO!$E$41=\"Endémique\", IF($J39>1, IF($J39=4, \"Inconnu\", IF($J39=99, \"Surveillance\", F39)), 0),\"Non requis\")","v":0},{"$f":"IF(INTRO!$E$41=\"Endémique\", IF($J39>1, IF($J39=4, \"Inconnu\", IF($J39=99, \"Surveillance\", ROUND(D39*INTRO!$E$51,0))), 0),\"Non requis\")","v":0},{"$f":"IF(INTRO!$E$41=\"Endémique\", IF($J39>1, IF($J39=4, \"Inconnu\", IF($J39=99, \"Surveillance\", SUM($N39:$P39))), 0),\"Non requis\")","v":0},0,0,0,0,0,0,0,0,null,null,null,null,null,null,null,null,40176,"Kaolack"]
[{"$f":"IF(INTRO!$E$33<>0,INTRO!$E$33, \" \")","v":"SENEGAL"},"Kaolack","Ndoffane",244288.947877,{"$f":"IF(INTRO!$E$48=\"\",\"\",ROUND($D40*INTRO!$E$48,0))","v":29486},{"$f":"IF(INTRO!$E$49=\"\",\"\",ROUND($D40*INTRO!$E$49,0))","v":64810},{"$f":"IF(INTRO!$E$50=\"\",\"\",ROUND($D40*INTRO!$E$50,0))","v":142274},0,0,1,3,{"$f":"IF(INTRO!$E$37=\"Endémique\",IF($H40>0,IF($H40=4,\"Inconnu\",IF($H40=99,\"Interrompu\",$D40)),0),\"Non requis\")","v":0},{"$f":"IF(INTRO!$E$39=\"Endémique\", IF($I40>0, IF($I40=4,\"Inconnu\",IF($I40=99,\"Interrompu\",$D40)), 0),\"Non requis\")","v":0},{"$f":"IF(INTRO!$E$41=\"Endémique\", IF($J40>1, IF($J40=4, \"Inconnu\", IF($J40=99, \"Surveillance\", E40)), 0),\"Non requis\")","v":0},{"$f":"IF(INTRO!$E$41=\"Endémique\", IF($J40>1, IF($J40=4, \"Inconnu\", IF($J40=99, \"Surveillance\", F40)), 0),\"Non requis\")","v":0},{"$f":"IF(INTRO!$E$41=\"Endémique\", IF($J40>1, IF($J40=4, \"Inconnu\", IF($J40=99, \"Surveillance\", ROUND(D40*INTRO!$E$51,0))), 0),\"Non requis\")","v":0},{"$f":"IF(INTRO!$E$41=\"Endémique\", IF($J40>1, IF($J40=4, \"Inconnu\", IF($J40=99, \"Surveillance\", SUM($N40:$P40))), 0),\"Non requis\")","v":0},19358,57318,125840,202516,0,0,0,1,null,null,null,null,null,null,null,null,40177,"Ndoffane"]
[{"$f":"IF(INTRO!$E$33<>0,INTRO!$E$33, \" \")","v":"SENEGAL"},"Kaolack","Nioro",496405.03966299997,{"$f":"IF(INTRO!$E$48=\"\",\"\",ROUND($D41*INTRO!$E$48,0))","v":59916},{"$f":"IF(INTRO!$E$49=\"\",\"\",ROUND($D41*INTRO!$E$49,0))","v":131696},{"$f":"IF(INTRO!$E$50=\"\",\"\",ROUND($D41*INTRO!$E$50,0))","v":289106},0,0,0,2,{"$f":"IF(INTRO!$E$37=\"Endémique\",IF($H41>0,IF($H41=4,\"Inconnu\",IF($H41=99,\"Interrompu\",$D41)),0),\"Non requis\")","v":0},{"$f":"IF(INTRO!$E$39=\"Endémique\", IF($I41>0, IF($I41=4,\"Inconnu\",IF($I41=99,\"Interrompu\",$D41)), 0),\"Non requis\")","v":0},{"$f":"IF(INTRO!$E$41=\"Endémique\", IF($J41>1, IF($J41=4, \"Inconnu\", IF($J41=99, \"Surveillance\", E41)), 0),\"Non requis\")","v":0},{"$f":"IF(INTRO!$E$41=\"Endémique\", IF($J41>1, IF($J41=4, \"Inconnu\", IF($J41=99, \"Surveillance\", F41)), 0),\"Non requis\")","v":0},{"$f":"IF(INTRO!$E$41=\"Endémique\", IF($J41>1, IF($J41=4, \"Inconnu\", IF($J41=99, \"Surveillance\", ROUND(D41*INTRO!$E$51,0))), 0),\"Non requis\")","v":0},{"$f":"IF(INTRO!$E$41=\"Endémique\", IF($J41>1, IF($J41=4, \"Inconnu\", IF($J41=99, \"Surveillance\", SUM($N41:$P41))), 0),\"Non requis\")","v":0},329,975,2140,3444,0,0,0,1,null,null,null,null,null,null,null,null,40178,"Nioro"]
[{"$f":"IF(INTRO!$E$33<>0,INTRO!$E$33, \" \")","v":"SENEGAL"},"Kédougou","Kédougou",111473.253281,{"$f":"IF(INTRO!$E$48=\"\",\"\",ROUND($D42*INTRO!$E$48,0))","v":13455},{"$f":"IF(INTRO!$E$49=\"\",\"\",ROUND($D42*INTRO!$E$49,0))","v":29574},{"$f":"IF(INTRO!$E$50=\"\",\"\",ROUND($D42*INTRO!$E$50,0))","v":64922},19,99,0,3,{"$f":"IF(INTRO!$E$37=\"Endémique\",IF($H42>0,IF($H42=4,\"Inconnu\",IF($H42=99,\"Interrompu\",$D42)),0),\"Non requis\")","v":111473.253281},{"$f":"IF(INTRO!$E$39=\"Endémique\", IF($I42>0, IF($I42=4,\"Inconnu\",IF($I42=99,\"Interrompu\",$D42)), 0),\"Non requis\")","v":"Interrompu"},{"$f":"IF(INTRO!$E$41=\"Endémique\", IF($J42>1, IF($J42=4, \"Inconnu\", IF($J42=99, \"Surveillance\", E42)), 0),\"Non requis\")","v":0},{"$f":"IF(INTRO!$E$41=\"Endémique\", IF($J42>1, IF($J42=4, \"Inconnu\", IF($J42=99, \"Surveillance\", F42)), 0),\"Non requis\")","v":0},{"$f":"IF(INTRO!$E$41=\"Endémique\", IF($J42>1, IF($J42=4, \"Inconnu\", IF($J42=99, \"Surveillance\", ROUND(D42*INTRO!$E$51,0))), 0),\"Non requis\")","v":0},{"$f":"IF(INTRO!$E$41=\"Endémique\", IF($J42>1, IF($J42=4, \"Inconnu\", IF($J42=99, \"Surveillance\", SUM($N42:$P42))), 0),\"Non requis\")","v":0},9858,29190,64084,103132,0,0,0,1,null,null,null,null,null,null,null,null,40210,"Kédougou"]
[{"$f":"IF(INTRO!$E$33<>0,INTRO!$E$33, \" \")","v":"SENEGAL"},"Kédougou","Salemata",31387.680311,{"$f":"IF(INTRO!$E$48=\"\",\"\",ROUND($D43*INTRO!$E$48,0))","v":3788},{"$f":"IF(INTRO!$E$49=\"\",\"\",ROUND($D43*INTRO!$E$49,0))","v":8327},{"$f":"IF(INTRO!$E$50=\"\",\"\",ROUND($D43*INTRO!$E$50,0))","v":18280},19,99,0,3,{"$f":"IF(INTRO!$E$37=\"Endémique\",IF($H43>0,IF($H43=4,\"Inconnu\",IF($H43=99,\"Interrompu\",$D43)),0),\"Non requis\")","v":31387.680311},{"$f":"IF(INTRO!$E$39=\"Endémique\", IF($I43>0, IF($I43=4,\"Inconnu\",IF($I43=99,\"Interrompu\",$D43)), 0),\"Non requis\")","v":"Interrompu"},{"$f":"IF(INTRO!$E$41=\"Endémique\", IF($J43>1, IF($J43=4, \"Inconnu\", IF($J43=99, \"Surveillance\", E43)), 0),\"Non requis\")","v":0},{"$f":"IF(INTRO!$E$41=\"Endémique\", IF($J43>1, IF($J43=4, \"Inconnu\", IF($J43=99, \"Surveillance\", F43)), 0),\"Non requis\")","v":0},{"$f":"IF(INTRO!$E$41=\"Endémique\", IF($J43>1, IF($J43=4, \"Inconnu\", IF($J43=99, \"Surveillance\", ROUND(D43*INTRO!$E$51,0))), 0),\"Non requis\")","v":0},{"$f":"IF(INTRO!$E$41=\"Endémique\", IF($J43>1, IF($J43=4, \"Inconnu\", IF($J43=99, \"Surveillance\", SUM($N43:$P43))), 0),\"Non requis\")","v":0},2777,8220,18045,29042,0,0,0,1,null,null,null,null,null,null,null,null,40179,"Salemata"]
[{"$f":"IF(INTRO!$E$33<>0,INTRO!$E$33, \" \")","v":"SENEGAL"},"Kédougou","Saraya",72008.458287999994,{"$f":"IF(INTRO!$E$48=\"\",\"\",ROUND($D44*INTRO!$E$48,0))","v":8691},{"$f":"IF(INTRO!$E$49=\"\",\"\",ROUND($D44*INTRO!$E$49,0))","v":19104},{"$f":"IF(INTRO!$E$50=\"\",\"\",ROUND($D44*INTRO!$E$50,0))","v":41938},99,99,0,31,{"$f":"IF(INTRO!$E$37=\"Endémique\",IF($H44>0,IF($H44=4,\"Inconnu\",IF($H44=99,\"Interrompu\",$D44)),0),\"Non requis\")","v":"Interrompu"},{"$f":"IF(INTRO!$E$39=\"Endémique\", IF($I44>0, IF($I44=4,\"Inconnu\",IF($I44=99,\"Interrompu\",$D44)), 0),\"Non requis\")","v":"Interrompu"},{"$f":"IF(INTRO!$E$41=\"Endémique\", IF($J44>1, IF($J44=4, \"Inconnu\", IF($J44=99, \"Surveillance\", E44)), 0),\"Non requis\")","v":0},{"$f":"IF(INTRO!$E$41=\"Endémique\", IF($J44>1, IF($J44=4, \"Inconnu\", IF($J44=99, \"Surveillance\", F44)), 0),\"Non requis\")","v":0},{"$f":"IF(INTRO!$E$41=\"Endémique\", IF($J44>1, IF($J44=4, \"Inconnu\", IF($J44=99, \"Surveillance\", ROUND(D44*INTRO!$E$51,0))), 0),\"Non requis\")","v":0},{"$f":"IF(INTRO!$E$41=\"Endémique\", IF($J44>1, IF($J44=4, \"Inconnu\", IF($J44=99, \"Surveillance\", SUM($N44:$P44))), 0),\"Non requis\")","v":0},6368,18856,41401,66625,0,0,0,1,null,null,null,null,null,null,null,null,40180,"Saraya"]
[{"$f":"IF(INTRO!$E$33<>0,INTRO!$E$33, \" \")","v":"SENEGAL"},"Kolda","Kolda",342954.626911,{"$f":"IF(INTRO!$E$48=\"\",\"\",ROUND($D45*INTRO!$E$48,0))","v":41395},{"$f":"IF(INTRO!$E$49=\"\",\"\",ROUND($D45*INTRO!$E$49,0))","v":90986},{"$f":"IF(INTRO!$E$50=\"\",\"\",ROUND($D45*INTRO!$E$50,0))","v":199737},99,0,99,2,{"$f":"IF(INTRO!$E$37=\"Endémique\",IF($H45>0,IF($H45=4,\"Inconnu\",IF($H45=99,\"Interrompu\",$D45)),0),\"Non requis\")","v":"Interrompu"},{"$f":"IF(INTRO!$E$39=\"Endémique\", IF($I45>0, IF($I45=4,\"Inconnu\",IF($I45=99,\"Interrompu\",$D45)), 0),\"Non requis\")","v":0},{"$f":"IF(INTRO!$E$41=\"Endémique\", IF($J45>1, IF($J45=4, \"Inconnu\", IF($J45=99, \"Surveillance\", E45)), 0),\"Non requis\")","v":"Surveillance"},{"$f":"IF(INTRO!$E$41=\"Endémique\", IF($J45>1, IF($J45=4, \"Inconnu\", IF($J45=99, \"Surveillance\", F45)), 0),\"Non requis\")","v":"Surveillance"},{"$f":"IF(INTRO!$E$41=\"Endémique\", IF($J45>1, IF($J45=4, \"Inconnu\", IF($J45=99, \"Surveillance\", ROUND(D45*INTRO!$E$51,0))), 0),\"Non requis\")","v":"Surveillance"},{"$f":"IF(INTRO!$E$41=\"Endémique\", IF($J45>1, IF($J45=4, \"Inconnu\", IF($J45=99, \"Surveillance\", SUM($N45:$P45))), 0),\"Non requis\")","v":"Surveillance"},1129,3343,7340,11812,0,0,0,1,null,null,null,null,null,null,null,null,40181,"Kolda"]
[{"$f":"IF(INTRO!$E$33<>0,INTRO!$E$33, \" \")","v":"SENEGAL"},"Kolda","Medina Yoro Foulah",192514.41072499999,{"$f":"IF(INTRO!$E$48=\"\",\"\",ROUND($D46*INTRO!$E$48,0))","v":23236},{"$f":"IF(INTRO!$E$49=\"\",\"\",ROUND($D46*INTRO!$E$49,0))","v":51074},{"$f":"IF(INTRO!$E$50=\"\",\"\",ROUND($D46*INTRO!$E$50,0))","v":112120},99,0,0,31,{"$f":"IF(INTRO!$E$37=\"Endémique\",IF($H46>0,IF($H46=4,\"Inconnu\",IF($H46=99,\"Interrompu\",$D46)),0),\"Non requis\")","v":"Interrompu"},{"$f":"IF(INTRO!$E$39=\"Endémique\", IF($I46>0, IF($I46=4,\"Inconnu\",IF($I46=99,\"Interrompu\",$D46)), 0),\"Non requis\")","v":0},{"$f":"IF(INTRO!$E$41=\"Endémique\", IF($J46>1, IF($J46=4, \"Inconnu\", IF($J46=99, \"Surveillance\", E46)), 0),\"Non requis\")","v":0},{"$f":"IF(INTRO!$E$41=\"Endémique\", IF($J46>1, IF($J46=4, \"Inconnu\", IF($J46=99, \"Surveillance\", F46)), 0),\"Non requis\")","v":0},{"$f":"IF(INTRO!$E$41=\"Endémique\", IF($J46>1, IF($J46=4, \"Inconnu\", IF($J46=99, \"Surveillance\", ROUND(D46*INTRO!$E$51,0))), 0),\"Non requis\")","v":0},{"$f":"IF(INTRO!$E$41=\"Endémique\", IF($J46>1, IF($J46=4, \"Inconnu\", IF($J46=99, \"Surveillance\", SUM($N46:$P46))), 0),\"Non requis\")","v":0},17088,50604,111097,178789,0,0,0,1,null,null,null,null,null,null,null,null,40182,"Medina Yoro Foulah"]
[{"$f":"IF(INTRO!$E$33<>0,INTRO!$E$33, \" \")","v":"SENEGAL"},"Kolda","Velingara",388114.95850400004,{"$f":"IF(INTRO!$E$48=\"\",\"\",ROUND($D47*INTRO!$E$48,0))","v":46845},{"$f":"IF(INTRO!$E$49=\"\",\"\",ROUND($D47*INTRO!$E$49,0))","v":102967},{"$f":"IF(INTRO!$E$50=\"\",\"\",ROUND($D47*INTRO!$E$50,0))","v":226038},99,99,99,2,{"$f":"IF(INTRO!$E$37=\"Endémique\",IF($H47>0,IF($H47=4,\"Inconnu\",IF($H47=99,\"Interrompu\",$D47)),0),\"Non requis\")","v":"Interrompu"},{"$f":"IF(INTRO!$E$39=\"Endémique\", IF($I47>0, IF($I47=4,\"Inconnu\",IF($I47=99,\"Interrompu\",$D47)), 0),\"Non requis\")","v":"Interrompu"},{"$f":"IF(INTRO!$E$41=\"Endémique\", IF($J47>1, IF($J47=4, \"Inconnu\", IF($J47=99, \"Surveillance\", E47)), 0),\"Non requis\")","v":"Surveillance"},{"$f":"IF(INTRO!$E$41=\"Endémique\", IF($J47>1, IF($J47=4, \"Inconnu\", IF($J47=99, \"Surveillance\", F47)), 0),\"Non requis\")","v":"Surveillance"},{"$f":"IF(INTRO!$E$41=\"Endémique\", IF($J47>1, IF($J47=4, \"Inconnu\", IF($J47=99, \"Surveillance\", ROUND(D47*INTRO!$E$51,0))), 0),\"Non requis\")","v":"Surveillance"},{"$f":"IF(INTRO!$E$41=\"Endémique\", IF($J47>1, IF($J47=4, \"Inconnu\", IF($J47=99, \"Surveillance\", SUM($N47:$P47))), 0),\"Non requis\")","v":"Surveillance"},12738,37722,82815,133275,0,0,0,1,null,null,null,null,null,null,null,null,40184,"Velingara"]
[{"$f":"IF(INTRO!$E$33<>0,INTRO!$E$33, \" \")","v":"SENEGAL"},"Louga","Darou-Mousty",112152.49875699999,{"$f":"IF(INTRO!$E$48=\"\",\"\",ROUND($D48*INTRO!$E$48,0))","v":13537},{"$f":"IF(INTRO!$E$49=\"\",\"\",ROUND($D48*INTRO!$E$49,0))","v":29754},{"$f":"IF(INTRO!$E$50=\"\",\"\",ROUND($D48*INTRO!$E$50,0))","v":65318},0,0,0,1,{"$f":"IF(INTRO!$E$37=\"Endémique\",IF($H48>0,IF($H48=4,\"Inconnu\",IF($H48=99,\"Interrompu\",$D48)),0),\"Non requis\")","v":0},{"$f":"IF(INTRO!$E$39=\"Endémique\", IF($I48>0, IF($I48=4,\"Inconnu\",IF($I48=99,\"Interrompu\",$D48)), 0),\"Non requis\")","v":0},{"$f":"IF(INTRO!$E$41=\"Endémique\", IF($J48>1, IF($J48=4, \"Inconnu\", IF($J48=99, \"Surveillance\", E48)), 0),\"Non requis\")","v":0},{"$f":"IF(INTRO!$E$41=\"Endémique\", IF($J48>1, IF($J48=4, \"Inconnu\", IF($J48=99, \"Surveillance\", F48)), 0),\"Non requis\")","v":0},{"$f":"IF(INTRO!$E$41=\"Endémique\", IF($J48>1, IF($J48=4, \"Inconnu\", IF($J48=99, \"Surveillance\", ROUND(D48*INTRO!$E$51,0))), 0),\"Non requis\")","v":0},{"$f":"IF(INTRO!$E$41=\"Endémique\", IF($J48>1, IF($J48=4, \"Inconnu\", IF($J48=99, \"Surveillance\", SUM($N48:$P48))), 0),\"Non requis\")","v":0},0,0,0,0,0,0,0,0,null,null,null,null,null,null,null,null,40187,"Darou-Mousty"]
[{"$f":"IF(INTRO!$E$33<>0,INTRO!$E$33, \" \")","v":"SENEGAL"},"Louga","Kébémer",238456.29650700002,{"$f":"IF(INTRO!$E$48=\"\",\"\",ROUND($D49*INTRO!$E$48,0))","v":28782},{"$f":"IF(INTRO!$E$49=\"\",\"\",ROUND($D49*INTRO!$E$49,0))","v":63262},{"$f":"IF(INTRO!$E$50=\"\",\"\",ROUND($D49*INTRO!$E$50,0))","v":138877},0,0,0,1,{"$f":"IF(INTRO!$E$37=\"Endémique\",IF($H49>0,IF($H49=4,\"Inconnu\",IF($H49=99,\"Interrompu\",$D49)),0),\"Non requis\")","v":0},{"$f":"IF(INTRO!$E$39=\"Endémique\", IF($I49>0, IF($I49=4,\"Inconnu\",IF($I49=99,\"Interrompu\",$D49)), 0),\"Non requis\")","v":0},{"$f":"IF(INTRO!$E$41=\"Endémique\", IF($J49>1, IF($J49=4, \"Inconnu\", IF($J49=99, \"Surveillance\", E49)), 0),\"Non requis\")","v":0},{"$f":"IF(INTRO!$E$41=\"Endémique\", IF($J49>1, IF($J49=4, \"Inconnu\", IF($J49=99, \"Surveillance\", F49)), 0),\"Non requis\")","v":0},{"$f":"IF(INTRO!$E$41=\"Endémique\", IF($J49>1, IF($J49=4, \"Inconnu\", IF($J49=99, \"Surveillance\", ROUND(D49*INTRO!$E$51,0))), 0),\"Non requis\")","v":0},{"$f":"IF(INTRO!$E$41=\"Endémique\", IF($J49>1, IF($J49=4, \"Inconnu\", IF($J49=99, \"Surveillance\", SUM($N49:$P49))), 0),\"Non requis\")","v":0},0,0,0,0,0,0,0,0,null,null,null,null,null,null,null,null,40189,"Kébémer"]
[{"$f":"IF(INTRO!$E$33<>0,INTRO!$E$33, \" \")","v":"SENEGAL"},"Louga","Linguère",148973.08814699997,{"$f":"IF(INTRO!$E$48=\"\",\"\",ROUND($D50*INTRO!$E$48,0))","v":17981},{"$f":"IF(INTRO!$E$49=\"\",\"\",ROUND($D50*INTRO!$E$49,0))","v":39523},{"$f":"IF(INTRO!$E$50=\"\",\"\",ROUND($D50*INTRO!$E$50,0))","v":86762},19,0,1,21,{"$f":"IF(INTRO!$E$37=\"Endémique\",IF($H50>0,IF($H50=4,\"Inconnu\",IF($H50=99,\"Interrompu\",$D50)),0),\"Non requis\")","v":148973.08814699997},{"$f":"IF(INTRO!$E$39=\"Endémique\", IF($I50>0, IF($I50=4,\"Inconnu\",IF($I50=99,\"Interrompu\",$D50)), 0),\"Non requis\")","v":0},{"$f":"IF(INTRO!$E$41=\"Endémique\", IF($J50>1, IF($J50=4, \"Inconnu\", IF($J50=99, \"Surveillance\", E50)), 0),\"Non requis\")","v":0},{"$f":"IF(INTRO!$E$41=\"Endémique\", IF($J50>1, IF($J50=4, \"Inconnu\", IF($J50=99, \"Surveillance\", F50)), 0),\"Non requis\")","v":0},{"$f":"IF(INTRO!$E$41=\"Endémique\", IF($J50>1, IF($J50=4, \"Inconnu\", IF($J50=99, \"Surveillance\", ROUND(D50*INTRO!$E$51,0))), 0),\"Non requis\")","v":0},{"$f":"IF(INTRO!$E$41=\"Endémique\", IF($J50>1, IF($J50=4, \"Inconnu\", IF($J50=99, \"Surveillance\", SUM($N50:$P50))), 0),\"Non requis\")","v":0},11906,35255,77402,124563,0,0,0,1,null,null,null,null,null,null,null,null,40190,"Linguère"]
[{"$f":"IF(INTRO!$E$33<>0,INTRO!$E$33, \" \")","v":"SENEGAL"},"Louga","Dahra",178374.713751,{"$f":"IF(INTRO!$E$48=\"\",\"\",ROUND($D51*INTRO!$E$48,0))","v":21530},{"$f":"IF(INTRO!$E$49=\"\",\"\",ROUND($D51*INTRO!$E$49,0))","v":47323},{"$f":"IF(INTRO!$E$50=\"\",\"\",ROUND($D51*INTRO!$E$50,0))","v":103885},0,0,0,1,{"$f":"IF(INTRO!$E$37=\"Endémique\",IF($H51>0,IF($H51=4,\"Inconnu\",IF($H51=99,\"Interrompu\",$D51)),0),\"Non requis\")","v":0},{"$f":"IF(INTRO!$E$39=\"Endémique\", IF($I51>0, IF($I51=4,\"Inconnu\",IF($I51=99,\"Interrompu\",$D51)), 0),\"Non requis\")","v":0},{"$f":"IF(INTRO!$E$41=\"Endémique\", IF($J51>1, IF($J51=4, \"Inconnu\", IF($J51=99, \"Surveillance\", E51)), 0),\"Non requis\")","v":0},{"$f":"IF(INTRO!$E$41=\"Endémique\", IF($J51>1, IF($J51=4, \"Inconnu\", IF($J51=99, \"Surveillance\", F51)), 0),\"Non requis\")","v":0},{"$f":"IF(INTRO!$E$41=\"Endémique\", IF($J51>1, IF($J51=4, \"Inconnu\", IF($J51=99, \"Surveillance\", ROUND(D51*INTRO!$E$51,0))), 0),\"Non requis\")","v":0},{"$f":"IF(INTRO!$E$41=\"Endémique\", IF($J51>1, IF($J51=4, \"Inconnu\", IF($J51=99, \"Surveillance\", SUM($N51:$P51))), 0),\"Non requis\")","v":0},0,0,0,0,0,0,0,0,null,null,null,null,null,null,null,null,40186,"Dahra"]
[{"$f":"IF(INTRO!$E$33<>0,INTRO!$E$33, \" \")","v":"SENEGAL"},"Louga","Coki",85857.050058000008,{"$f":"IF(INTRO!$E$48=\"\",\"\",ROUND($D52*INTRO!$E$48,0))","v":10363},{"$f":"IF(INTRO!$E$49=\"\",\"\",ROUND($D52*INTRO!$E$49,0))","v":22778},{"$f":"IF(INTRO!$E$50=\"\",\"\",ROUND($D52*INTRO!$E$50,0))","v":50003},1,0,1,3,{"$f":"IF(INTRO!$E$37=\"Endémique\",IF($H52>0,IF($H52=4,\"Inconnu\",IF($H52=99,\"Interrompu\",$D52)),0),\"Non requis\")","v":85857.050058000008},{"$f":"IF(INTRO!$E$39=\"Endémique\", IF($I52>0, IF($I52=4,\"Inconnu\",IF($I52=99,\"Interrompu\",$D52)), 0),\"Non requis\")","v":0},{"$f":"IF(INTRO!$E$41=\"Endémique\", IF($J52>1, IF($J52=4, \"Inconnu\", IF($J52=99, \"Surveillance\", E52)), 0),\"Non requis\")","v":0},{"$f":"IF(INTRO!$E$41=\"Endémique\", IF($J52>1, IF($J52=4, \"Inconnu\", IF($J52=99, \"Surveillance\", F52)), 0),\"Non requis\")","v":0},{"$f":"IF(INTRO!$E$41=\"Endémique\", IF($J52>1, IF($J52=4, \"Inconnu\", IF($J52=99, \"Surveillance\", ROUND(D52*INTRO!$E$51,0))), 0),\"Non requis\")","v":0},{"$f":"IF(INTRO!$E$41=\"Endémique\", IF($J52>1, IF($J52=4, \"Inconnu\", IF($J52=99, \"Surveillance\", SUM($N52:$P52))), 0),\"Non requis\")","v":0},6279,18595,40821,65695,1,0,0,1,null,null,null,null,null,null,null,null,40185,"Coki"]
[{"$f":"IF(INTRO!$E$33<>0,INTRO!$E$33, \" \")","v":"SENEGAL"},"Louga","Keur Momar Sarr",102376.215656,{"$f":"IF(INTRO!$E$48=\"\",\"\",ROUND($D53*INTRO!$E$48,0))","v":12357},{"$f":"IF(INTRO!$E$49=\"\",\"\",ROUND($D53*INTRO!$E$49,0))","v":27160},{"$f":"IF(INTRO!$E$50=\"\",\"\",ROUND($D53*INTRO!$E$50,0))","v":59624},19,0,1,31,{"$f":"IF(INTRO!$E$37=\"Endémique\",IF($H53>0,IF($H53=4,\"Inconnu\",IF($H53=99,\"Interrompu\",$D53)),0),\"Non requis\")","v":102376.215656},{"$f":"IF(INTRO!$E$39=\"Endémique\", IF($I53>0, IF($I53=4,\"Inconnu\",IF($I53=99,\"Interrompu\",$D53)), 0),\"Non requis\")","v":0},{"$f":"IF(INTRO!$E$41=\"Endémique\", IF($J53>1, IF($J53=4, \"Inconnu\", IF($J53=99, \"Surveillance\", E53)), 0),\"Non requis\")","v":0},{"$f":"IF(INTRO!$E$41=\"Endémique\", IF($J53>1, IF($J53=4, \"Inconnu\", IF($J53=99, \"Surveillance\", F53)), 0),\"Non requis\")","v":0},{"$f":"IF(INTRO!$E$41=\"Endémique\", IF($J53>1, IF($J53=4, \"Inconnu\", IF($J53=99, \"Surveillance\", ROUND(D53*INTRO!$E$51,0))), 0),\"Non requis\")","v":0},{"$f":"IF(INTRO!$E$41=\"Endémique\", IF($J53>1, IF($J53=4, \"Inconnu\", IF($J53=99, \"Surveillance\", SUM($N53:$P53))), 0),\"Non requis\")","v":0},9163,27135,59570,95868,0,0,0,1,null,null,null,null,null,null,null,null,40188,"Keur Momar Sarr"]
[{"$f":"IF(INTRO!$E$33<>0,INTRO!$E$33, \" \")","v":"SENEGAL"},"Louga","Sakal",97026.630168000003,{"$f":"IF(INTRO!$E$48=\"\",\"\",ROUND($D54*INTRO!$E$48,0))","v":11711},{"$f":"IF(INTRO!$E$49=\"\",\"\",ROUND($D54*INTRO!$E$49,0))","v":25741},{"$f":"IF(INTRO!$E$50=\"\",\"\",ROUND($D54*INTRO!$E$50,0))","v":56508},99,0,1,3,{"$f":"IF(INTRO!$E$37=\"Endémique\",IF($H54>0,IF($H54=4,\"Inconnu\",IF($H54=99,\"Interrompu\",$D54)),0),\"Non requis\")","v":"Interrompu"},{"$f":"IF(INTRO!$E$39=\"Endémique\", IF($I54>0, IF($I54=4,\"Inconnu\",IF($I54=99,\"Interrompu\",$D54)), 0),\"Non requis\")","v":0},{"$f":"IF(INTRO!$E$41=\"Endémique\", IF($J54>1, IF($J54=4, \"Inconnu\", IF($J54=99, \"Surveillance\", E54)), 0),\"Non requis\")","v":0},{"$f":"IF(INTRO!$E$41=\"Endémique\", IF($J54>1, IF($J54=4, \"Inconnu\", IF($J54=99, \"Surveillance\", F54)), 0),\"Non requis\")","v":0},{"$f":"IF(INTRO!$E$41=\"Endémique\", IF($J54>1, IF($J54=4, \"Inconnu\", IF($J54=99, \"Surveillance\", ROUND(D54*INTRO!$E$51,0))), 0),\"Non requis\")","v":0},{"$f":"IF(INTRO!$E$41=\"Endémique\", IF($J54>1, IF($J54=4, \"Inconnu\", IF($J54=99, \"Surveillance\", SUM($N54:$P54))), 0),\"Non requis\")","v":0},8685,25713,56454,90852,0,0,0,1,null,null,null,null,null,null,null,null,40192,"Sakal"]
[{"$f":"IF(INTRO!$E$33<>0,INTRO!$E$33, \" \")","v":"SENEGAL"},"Louga","Louga",219787.59320700003,{"$f":"IF(INTRO!$E$48=\"\",\"\",ROUND($D55*INTRO!$E$48,0))","v":26528},{"$f":"IF(INTRO!$E$49=\"\",\"\",ROUND($D55*INTRO!$E$49,0))","v":58310},{"$f":"IF(INTRO!$E$50=\"\",\"\",ROUND($D55*INTRO!$E$50,0))","v":128004},1,0,1,3,{"$f":"IF(INTRO!$E$37=\"Endémique\",IF($H55>0,IF($H55=4,\"Inconnu\",IF($H55=99,\"Interrompu\",$D55)),0),\"Non requis\")","v":219787.59320700003},{"$f":"IF(INTRO!$E$39=\"Endémique\", IF($I55>0, IF($I55=4,\"Inconnu\",IF($I55=99,\"Interrompu\",$D55)), 0),\"Non requis\")","v":0},{"$f":"IF(INTRO!$E$41=\"Endémique\", IF($J55>1, IF($J55=4, \"Inconnu\", IF($J55=99, \"Surveillance\", E55)), 0),\"Non requis\")","v":0},{"$f":"IF(INTRO!$E$41=\"Endémique\", IF($J55>1, IF($J55=4, \"Inconnu\", IF($J55=99, \"Surveillance\", F55)), 0),\"Non requis\")","v":0},{"$f":"IF(INTRO!$E$41=\"Endémique\", IF($J55>1, IF($J55=4, \"Inconnu\", IF($J55=99, \"Surveillance\", ROUND(D55*INTRO!$E$51,0))), 0),\"Non requis\")","v":0},{"$f":"IF(INTRO!$E$41=\"Endémique\", IF($J55>1, IF($J55=4, \"Inconnu\", IF($J55=99, \"Surveillance\", SUM($N55:$P55))), 0),\"Non requis\")","v":0},18906,55988,122916,197810,1,0,0,1,null,null,null,null,null,null,null,null,40191,"Louga"]
[{"$f":"IF(INTRO!$E$33<>0,INTRO!$E$33, \" \")","v":"SENEGAL"},"Matam","Kanel",353071.58747899998,{"$f":"IF(INTRO!$E$48=\"\",\"\",ROUND($D56*INTRO!$E$48,0))","v":42616},{"$f":"IF(INTRO!$E$49=\"\",\"\",ROUND($D56*INTRO!$E$49,0))","v":93670},{"$f":"IF(INTRO!$E$50=\"\",\"\",ROUND($D56*INTRO!$E$50,0))","v":205629},0,0,1,31,{"$f":"IF(INTRO!$E$37=\"Endémique\",IF($H56>0,IF($H56=4,\"Inconnu\",IF($H56=99,\"Interrompu\",$D56)),0),\"Non requis\")","v":0},{"$f":"IF(INTRO!$E$39=\"Endémique\", IF($I56>0, IF($I56=4,\"Inconnu\",IF($I56=99,\"Interrompu\",$D56)), 0),\"Non requis\")","v":0},{"$f":"IF(INTRO!$E$41=\"Endémique\", IF($J56>1, IF($J56=4, \"Inconnu\", IF($J56=99, \"Surveillance\", E56)), 0),\"Non requis\")","v":0},{"$f":"IF(INTRO!$E$41=\"Endémique\", IF($J56>1, IF($J56=4, \"Inconnu\", IF($J56=99, \"Surveillance\", F56)), 0),\"Non requis\")","v":0},{"$f":"IF(INTRO!$E$41=\"Endémique\", IF($J56>1, IF($J56=4, \"Inconnu\", IF($J56=99, \"Surveillance\", ROUND(D56*INTRO!$E$51,0))), 0),\"Non requis\")","v":0},{"$f":"IF(INTRO!$E$41=\"Endémique\", IF($J56>1, IF($J56=4, \"Inconnu\", IF($J56=99, \"Surveillance\", SUM($N56:$P56))), 0),\"Non requis\")","v":0},30681,90849,199454,320984,0,0,0,1,null,null,null,null,null,null,null,null,40193,"Kanel"]
[{"$f":"IF(INTRO!$E$33<>0,INTRO!$E$33, \" \")","v":"SENEGAL"},"Matam","Matam",286422.20724000002,{"$f":"IF(INTRO!$E$48=\"\",\"\",ROUND($D57*INTRO!$E$48,0))","v":34571},{"$f":"IF(INTRO!$E$49=\"\",\"\",ROUND($D57*INTRO!$E$49,0))","v":75988},{"$f":"IF(INTRO!$E$50=\"\",\"\",ROUND($D57*INTRO!$E$50,0))","v":166812},0,0,1,31,{"$f":"IF(INTRO!$E$37=\"Endémique\",IF($H57>0,IF($H57=4,\"Inconnu\",IF($H57=99,\"Interrompu\",$D57)),0),\"Non requis\")","v":0},{"$f":"IF(INTRO!$E$39=\"Endémique\", IF($I57>0, IF($I57=4,\"Inconnu\",IF($I57=99,\"Interrompu\",$D57)), 0),\"Non requis\")","v":0},{"$f":"IF(INTRO!$E$41=\"Endémique\", IF($J57>1, IF($J57=4, \"Inconnu\", IF($J57=99, \"Surveillance\", E57)), 0),\"Non requis\")","v":0},{"$f":"IF(INTRO!$E$41=\"Endémique\", IF($J57>1, IF($J57=4, \"Inconnu\", IF($J57=99, \"Surveillance\", F57)), 0),\"Non requis\")","v":0},{"$f":"IF(INTRO!$E$41=\"Endémique\", IF($J57>1, IF($J57=4, \"Inconnu\", IF($J57=99, \"Surveillance\", ROUND(D57*INTRO!$E$51,0))), 0),\"Non requis\")","v":0},{"$f":"IF(INTRO!$E$41=\"Endémique\", IF($J57>1, IF($J57=4, \"Inconnu\", IF($J57=99, \"Surveillance\", SUM($N57:$P57))), 0),\"Non requis\")","v":0},25151,74473,163506,263130,0,0,0,1,null,null,null,null,null,null,null,null,40194,"Matam"]
[{"$f":"IF(INTRO!$E$33<>0,INTRO!$E$33, \" \")","v":"SENEGAL"},"Matam","Thilogne",116985.267035,{"$f":"IF(INTRO!$E$48=\"\",\"\",ROUND($D58*INTRO!$E$48,0))","v":14120},{"$f":"IF(INTRO!$E$49=\"\",\"\",ROUND($D58*INTRO!$E$49,0))","v":31036},{"$f":"IF(INTRO!$E$50=\"\",\"\",ROUND($D58*INTRO!$E$50,0))","v":68132},0,0,1,21,{"$f":"IF(INTRO!$E$37=\"Endémique\",IF($H58>0,IF($H58=4,\"Inconnu\",IF($H58=99,\"Interrompu\",$D58)),0),\"Non requis\")","v":0},{"$f":"IF(INTRO!$E$39=\"Endémique\", IF($I58>0, IF($I58=4,\"Inconnu\",IF($I58=99,\"Interrompu\",$D58)), 0),\"Non requis\")","v":0},{"$f":"IF(INTRO!$E$41=\"Endémique\", IF($J58>1, IF($J58=4, \"Inconnu\", IF($J58=99, \"Surveillance\", E58)), 0),\"Non requis\")","v":0},{"$f":"IF(INTRO!$E$41=\"Endémique\", IF($J58>1, IF($J58=4, \"Inconnu\", IF($J58=99, \"Surveillance\", F58)), 0),\"Non requis\")","v":0},{"$f":"IF(INTRO!$E$41=\"Endémique\", IF($J58>1, IF($J58=4, \"Inconnu\", IF($J58=99, \"Surveillance\", ROUND(D58*INTRO!$E$51,0))), 0),\"Non requis\")","v":0},{"$f":"IF(INTRO!$E$41=\"Endémique\", IF($J58>1, IF($J58=4, \"Inconnu\", IF($J58=99, \"Surveillance\", SUM($N58:$P58))), 0),\"Non requis\")","v":0},10273,30417,66782,107472,0,0,0,1,null,null,null,null,null,null,null,null,40196,"Thilogne"]
[{"$f":"IF(INTRO!$E$33<>0,INTRO!$E$33, \" \")","v":"SENEGAL"},"Matam","Ranerou",75928.885980999999,{"$f":"IF(INTRO!$E$48=\"\",\"\",ROUND($D59*INTRO!$E$48,0))","v":9165},{"$f":"IF(INTRO!$E$49=\"\",\"\",ROUND($D59*INTRO!$E$49,0))","v":20144},{"$f":"IF(INTRO!$E$50=\"\",\"\",ROUND($D59*INTRO!$E$50,0))","v":44221},0,0,1,21,{"$f":"IF(INTRO!$E$37=\"Endémique\",IF($H59>0,IF($H59=4,\"Inconnu\",IF($H59=99,\"Interrompu\",$D59)),0),\"Non requis\")","v":0},{"$f":"IF(INTRO!$E$39=\"Endémique\", IF($I59>0, IF($I59=4,\"Inconnu\",IF($I59=99,\"Interrompu\",$D59)), 0),\"Non requis\")","v":0},{"$f":"IF(INTRO!$E$41=\"Endémique\", IF($J59>1, IF($J59=4, \"Inconnu\", IF($J59=99, \"Surveillance\", E59)), 0),\"Non requis\")","v":0},{"$f":"IF(INTRO!$E$41=\"Endémique\", IF($J59>1, IF($J59=4, \"Inconnu\", IF($J59=99, \"Surveillance\", F59)), 0),\"Non requis\")","v":0},{"$f":"IF(INTRO!$E$41=\"Endémique\", IF($J59>1, IF($J59=4, \"Inconnu\", IF($J59=99, \"Surveillance\", ROUND(D59*INTRO!$E$51,0))), 0),\"Non requis\")","v":0},{"$f":"IF(INTRO!$E$41=\"Endémique\", IF($J59>1, IF($J59=4, \"Inconnu\", IF($J59=99, \"Surveillance\", SUM($N59:$P59))), 0),\"Non requis\")","v":0},2455,7271,15961,25687,0,0,0,1,null,null,null,null,null,null,null,null,40195,"Ranerou"]
[{"$f":"IF(INTRO!$E$33<>0,INTRO!$E$33, \" \")","v":"SENEGAL"},"Saint Louis","Dagana",105296.760257,{"$f":"IF(INTRO!$E$48=\"\",\"\",ROUND($D60*INTRO!$E$48,0))","v":12709},{"$f":"IF(INTRO!$E$49=\"\",\"\",ROUND($D60*INTRO!$E$49,0))","v":27935},{"$f":"IF(INTRO!$E$50=\"\",\"\",ROUND($D60*INTRO!$E$50,0))","v":61325},0,0,1,31,{"$f":"IF(INTRO!$E$37=\"Endémique\",IF($H60>0,IF($H60=4,\"Inconnu\",IF($H60=99,\"Interrompu\",$D60)),0),\"Non requis\")","v":0},{"$f":"IF(INTRO!$E$39=\"Endémique\", IF($I60>0, IF($I60=4,\"Inconnu\",IF($I60=99,\"Interrompu\",$D60)), 0),\"Non requis\")","v":0},{"$f":"IF(INTRO!$E$41=\"Endémique\", IF($J60>1, IF($J60=4, \"Inconnu\", IF($J60=99, \"Surveillance\", E60)), 0),\"Non requis\")","v":0},{"$f":"IF(INTRO!$E$41=\"Endémique\", IF($J60>1, IF($J60=4, \"Inconnu\", IF($J60=99, \"Surveillance\", F60)), 0),\"Non requis\")","v":0},{"$f":"IF(INTRO!$E$41=\"Endémique\", IF($J60>1, IF($J60=4, \"Inconnu\", IF($J60=99, \"Surveillance\", ROUND(D60*INTRO!$E$51,0))), 0),\"Non requis\")","v":0},{"$f":"IF(INTRO!$E$41=\"Endémique\", IF($J60>1, IF($J60=4, \"Inconnu\", IF($J60=99, \"Surveillance\", SUM($N60:$P60))), 0),\"Non requis\")","v":0},8439,24990,54865,88294,0,0,0,1,null,null,null,null,null,null,null,null,40197,"Dagana"]
[{"$f":"IF(INTRO!$E$33<>0,INTRO!$E$33, \" \")","v":"SENEGAL"},"Saint Louis","Richard Toll",217249.91523300001,{"$f":"IF(INTRO!$E$48=\"\",\"\",ROUND($D61*INTRO!$E$48,0))","v":26222},{"$f":"IF(INTRO!$E$49=\"\",\"\",ROUND($D61*INTRO!$E$49,0))","v":57636},{"$f":"IF(INTRO!$E$50=\"\",\"\",ROUND($D61*INTRO!$E$50,0))","v":126526},0,0,1,31,{"$f":"IF(INTRO!$E$37=\"Endémique\",IF($H61>0,IF($H61=4,\"Inconnu\",IF($H61=99,\"Interrompu\",$D61)),0),\"Non requis\")","v":0},{"$f":"IF(INTRO!$E$39=\"Endémique\", IF($I61>0, IF($I61=4,\"Inconnu\",IF($I61=99,\"Interrompu\",$D61)), 0),\"Non requis\")","v":0},{"$f":"IF(INTRO!$E$41=\"Endémique\", IF($J61>1, IF($J61=4, \"Inconnu\", IF($J61=99, \"Surveillance\", E61)), 0),\"Non requis\")","v":0},{"$f":"IF(INTRO!$E$41=\"Endémique\", IF($J61>1, IF($J61=4, \"Inconnu\", IF($J61=99, \"Surveillance\", F61)), 0),\"Non requis\")","v":0},{"$f":"IF(INTRO!$E$41=\"Endémique\", IF($J61>1, IF($J61=4, \"Inconnu\", IF($J61=99, \"Surveillance\", ROUND(D61*INTRO!$E$51,0))), 0),\"Non requis\")","v":0},{"$f":"IF(INTRO!$E$41=\"Endémique\", IF($J61>1, IF($J61=4, \"Inconnu\", IF($J61=99, \"Surveillance\", SUM($N61:$P61))), 0),\"Non requis\")","v":0},18204,53899,118329,190432,0,0,0,1,null,null,null,null,null,null,null,null,40200,"Richard Toll"]
[{"$f":"IF(INTRO!$E$33<>0,INTRO!$E$33, \" \")","v":"SENEGAL"},"Saint Louis","Peté",219350.935401,{"$f":"IF(INTRO!$E$48=\"\",\"\",ROUND($D62*INTRO!$E$48,0))","v":26476},{"$f":"IF(INTRO!$E$49=\"\",\"\",ROUND($D62*INTRO!$E$49,0))","v":58194},{"$f":"IF(INTRO!$E$50=\"\",\"\",ROUND($D62*INTRO!$E$50,0))","v":127750},1,0,1,3,{"$f":"IF(INTRO!$E$37=\"Endémique\",IF($H62>0,IF($H62=4,\"Inconnu\",IF($H62=99,\"Interrompu\",$D62)),0),\"Non requis\")","v":219350.935401},{"$f":"IF(INTRO!$E$39=\"Endémique\", IF($I62>0, IF($I62=4,\"Inconnu\",IF($I62=99,\"Interrompu\",$D62)), 0),\"Non requis\")","v":0},{"$f":"IF(INTRO!$E$41=\"Endémique\", IF($J62>1, IF($J62=4, \"Inconnu\", IF($J62=99, \"Surveillance\", E62)), 0),\"Non requis\")","v":0},{"$f":"IF(INTRO!$E$41=\"Endémique\", IF($J62>1, IF($J62=4, \"Inconnu\", IF($J62=99, \"Surveillance\", F62)), 0),\"Non requis\")","v":0},{"$f":"IF(INTRO!$E$41=\"Endémique\", IF($J62>1, IF($J62=4, \"Inconnu\", IF($J62=99, \"Surveillance\", ROUND(D62*INTRO!$E$51,0))), 0),\"Non requis\")","v":0},{"$f":"IF(INTRO!$E$41=\"Endémique\", IF($J62>1, IF($J62=4, \"Inconnu\", IF($J62=99, \"Surveillance\", SUM($N62:$P62))), 0),\"Non requis\")","v":0},19689,58194,127750,206004,1,0,0,1,null,null,null,null,null,null,null,null,40198,"Peté"]
[{"$f":"IF(INTRO!$E$33<>0,INTRO!$E$33, \" \")","v":"SENEGAL"},"Saint Louis","Podor",275427.71214400005,{"$f":"IF(INTRO!$E$48=\"\",\"\",ROUND($D63*INTRO!$E$48,0))","v":33244},{"$f":"IF(INTRO!$E$49=\"\",\"\",ROUND($D63*INTRO!$E$49,0))","v":73071},{"$f":"IF(INTRO!$E$50=\"\",\"\",ROUND($D63*INTRO!$E$50,0))","v":160409},99,0,1,31,{"$f":"IF(INTRO!$E$37=\"Endémique\",IF($H63>0,IF($H63=4,\"Inconnu\",IF($H63=99,\"Interrompu\",$D63)),0),\"Non requis\")","v":"Interrompu"},{"$f":"IF(INTRO!$E$39=\"Endémique\", IF($I63>0, IF($I63=4,\"Inconnu\",IF($I63=99,\"Interrompu\",$D63)), 0),\"Non requis\")","v":0},{"$f":"IF(INTRO!$E$41=\"Endémique\", IF($J63>1, IF($J63=4, \"Inconnu\", IF($J63=99, \"Surveillance\", E63)), 0),\"Non requis\")","v":0},{"$f":"IF(INTRO!$E$41=\"Endémique\", IF($J63>1, IF($J63=4, \"Inconnu\", IF($J63=99, \"Surveillance\", F63)), 0),\"Non requis\")","v":0},{"$f":"IF(INTRO!$E$41=\"Endémique\", IF($J63>1, IF($J63=4, \"Inconnu\", IF($J63=99, \"Surveillance\", ROUND(D63*INTRO!$E$51,0))), 0),\"Non requis\")","v":0},{"$f":"IF(INTRO!$E$41=\"Endémique\", IF($J63>1, IF($J63=4, \"Inconnu\", IF($J63=99, \"Surveillance\", SUM($N63:$P63))), 0),\"Non requis\")","v":0},24387,72209,158531,255127,0,0,0,1,null,null,null,null,null,null,null,null,40199,"Podor"]
[{"$f":"IF(INTRO!$E$33<>0,INTRO!$E$33, \" \")","v":"SENEGAL"},"Saint Louis","Saint Louis",395679.47489199997,{"$f":"IF(INTRO!$E$48=\"\",\"\",ROUND($D64*INTRO!$E$48,0))","v":47759},{"$f":"IF(INTRO!$E$49=\"\",\"\",ROUND($D64*INTRO!$E$49,0))","v":104974},{"$f":"IF(INTRO!$E$50=\"\",\"\",ROUND($D64*INTRO!$E$50,0))","v":230444},0,0,1,31,{"$f":"IF(INTRO!$E$37=\"Endémique\",IF($H64>0,IF($H64=4,\"Inconnu\",IF($H64=99,\"Interrompu\",$D64)),0),\"Non requis\")","v":0},{"$f":"IF(INTRO!$E$39=\"Endémique\", IF($I64>0, IF($I64=4,\"Inconnu\",IF($I64=99,\"Interrompu\",$D64)), 0),\"Non requis\")","v":0},{"$f":"IF(INTRO!$E$41=\"Endémique\", IF($J64>1, IF($J64=4, \"Inconnu\", IF($J64=99, \"Surveillance\", E64)), 0),\"Non requis\")","v":0},{"$f":"IF(INTRO!$E$41=\"Endémique\", IF($J64>1, IF($J64=4, \"Inconnu\", IF($J64=99, \"Surveillance\", F64)), 0),\"Non requis\")","v":0},{"$f":"IF(INTRO!$E$41=\"Endémique\", IF($J64>1, IF($J64=4, \"Inconnu\", IF($J64=99, \"Surveillance\", ROUND(D64*INTRO!$E$51,0))), 0),\"Non requis\")","v":0},{"$f":"IF(INTRO!$E$41=\"Endémique\", IF($J64>1, IF($J64=4, \"Inconnu\", IF($J64=99, \"Surveillance\", SUM($N64:$P64))), 0),\"Non requis\")","v":0},33513,99239,217869,350621,0,0,0,1,null,null,null,null,null,null,null,null,40201,"Saint Louis"]
[{"$f":"IF(INTRO!$E$33<>0,INTRO!$E$33, \" \")","v":"SENEGAL"},"Sédhiou","Bounkiling",207648.71714600001,{"$f":"IF(INTRO!$E$48=\"\",\"\",ROUND($D65*INTRO!$E$48,0))","v":25063},{"$f":"IF(INTRO!$E$49=\"\",\"\",ROUND($D65*INTRO!$E$49,0))","v":55089},{"$f":"IF(INTRO!$E$50=\"\",\"\",ROUND($D65*INTRO!$E$50,0))","v":120935},99,0,1,3,{"$f":"IF(INTRO!$E$37=\"Endémique\",IF($H65>0,IF($H65=4,\"Inconnu\",IF($H65=99,\"Interrompu\",$D65)),0),\"Non requis\")","v":"Interrompu"},{"$f":"IF(INTRO!$E$39=\"Endémique\", IF($I65>0, IF($I65=4,\"Inconnu\",IF($I65=99,\"Interrompu\",$D65)), 0),\"Non requis\")","v":0},{"$f":"IF(INTRO!$E$41=\"Endémique\", IF($J65>1, IF($J65=4, \"Inconnu\", IF($J65=99, \"Surveillance\", E65)), 0),\"Non requis\")","v":0},{"$f":"IF(INTRO!$E$41=\"Endémique\", IF($J65>1, IF($J65=4, \"Inconnu\", IF($J65=99, \"Surveillance\", F65)), 0),\"Non requis\")","v":0},{"$f":"IF(INTRO!$E$41=\"Endémique\", IF($J65>1, IF($J65=4, \"Inconnu\", IF($J65=99, \"Surveillance\", ROUND(D65*INTRO!$E$51,0))), 0),\"Non requis\")","v":0},{"$f":"IF(INTRO!$E$41=\"Endémique\", IF($J65>1, IF($J65=4, \"Inconnu\", IF($J65=99, \"Surveillance\", SUM($N65:$P65))), 0),\"Non requis\")","v":0},1563,4629,10163,16355,0,0,0,1,null,null,null,null,null,null,null,null,40202,"Bounkiling"]
[{"$f":"IF(INTRO!$E$33<>0,INTRO!$E$33, \" \")","v":"SENEGAL"},"Sédhiou","Goudomp",222667.00337700002,{"$f":"IF(INTRO!$E$48=\"\",\"\",ROUND($D66*INTRO!$E$48,0))","v":26876},{"$f":"IF(INTRO!$E$49=\"\",\"\",ROUND($D66*INTRO!$E$49,0))","v":59074},{"$f":"IF(INTRO!$E$50=\"\",\"\",ROUND($D66*INTRO!$E$50,0))","v":129681},99,0,1,0,{"$f":"IF(INTRO!$E$37=\"Endémique\",IF($H66>0,IF($H66=4,\"Inconnu\",IF($H66=99,\"Interrompu\",$D66)),0),\"Non requis\")","v":"Interrompu"},{"$f":"IF(INTRO!$E$39=\"Endémique\", IF($I66>0, IF($I66=4,\"Inconnu\",IF($I66=99,\"Interrompu\",$D66)), 0),\"Non requis\")","v":0},{"$f":"IF(INTRO!$E$41=\"Endémique\", IF($J66>1, IF($J66=4, \"Inconnu\", IF($J66=99, \"Surveillance\", E66)), 0),\"Non requis\")","v":0},{"$f":"IF(INTRO!$E$41=\"Endémique\", IF($J66>1, IF($J66=4, \"Inconnu\", IF($J66=99, \"Surveillance\", F66)), 0),\"Non requis\")","v":0},{"$f":"IF(INTRO!$E$41=\"Endémique\", IF($J66>1, IF($J66=4, \"Inconnu\", IF($J66=99, \"Surveillance\", ROUND(D66*INTRO!$E$51,0))), 0),\"Non requis\")","v":0},{"$f":"IF(INTRO!$E$41=\"Endémique\", IF($J66>1, IF($J66=4, \"Inconnu\", IF($J66=99, \"Surveillance\", SUM($N66:$P66))), 0),\"Non requis\")","v":0},0,0,0,0,0,0,0,0,null,null,null,null,null,null,null,null,40203,"Goudomp"]
[{"$f":"IF(INTRO!$E$33<>0,INTRO!$E$33, \" \")","v":"SENEGAL"},"Sédhiou","Sedhiou",215864.00132700001,{"$f":"IF(INTRO!$E$48=\"\",\"\",ROUND($D67*INTRO!$E$48,0))","v":26055},{"$f":"IF(INTRO!$E$49=\"\",\"\",ROUND($D67*INTRO!$E$49,0))","v":57269},{"$f":"IF(INTRO!$E$50=\"\",\"\",ROUND($D67*INTRO!$E$50,0))","v":125719},99,0,1,3,{"$f":"IF(INTRO!$E$37=\"Endémique\",IF($H67>0,IF($H67=4,\"Inconnu\",IF($H67=99,\"Interrompu\",$D67)),0),\"Non requis\")","v":"Interrompu"},{"$f":"IF(INTRO!$E$39=\"Endémique\", IF($I67>0, IF($I67=4,\"Inconnu\",IF($I67=99,\"Interrompu\",$D67)), 0),\"Non requis\")","v":0},{"$f":"IF(INTRO!$E$41=\"Endémique\", IF($J67>1, IF($J67=4, \"Inconnu\", IF($J67=99, \"Surveillance\", E67)), 0),\"Non requis\")","v":0},{"$f":"IF(INTRO!$E$41=\"Endémique\", IF($J67>1, IF($J67=4, \"Inconnu\", IF($J67=99, \"Surveillance\", F67)), 0),\"Non requis\")","v":0},{"$f":"IF(INTRO!$E$41=\"Endémique\", IF($J67>1, IF($J67=4, \"Inconnu\", IF($J67=99, \"Surveillance\", ROUND(D67*INTRO!$E$51,0))), 0),\"Non requis\")","v":0},{"$f":"IF(INTRO!$E$41=\"Endémique\", IF($J67>1, IF($J67=4, \"Inconnu\", IF($J67=99, \"Surveillance\", SUM($N67:$P67))), 0),\"Non requis\")","v":0},15744,46617,102342,164703,0,0,0,1,null,null,null,null,null,null,null,null,40183,"Sedhiou"]
[{"$f":"IF(INTRO!$E$33<>0,INTRO!$E$33, \" \")","v":"SENEGAL"},"Tambacounda","Bakel",123038.356766,{"$f":"IF(INTRO!$E$48=\"\",\"\",ROUND($D68*INTRO!$E$48,0))","v":14851},{"$f":"IF(INTRO!$E$49=\"\",\"\",ROUND($D68*INTRO!$E$49,0))","v":32642},{"$f":"IF(INTRO!$E$50=\"\",\"\",ROUND($D68*INTRO!$E$50,0))","v":71658},99,0,0,3,{"$f":"IF(INTRO!$E$37=\"Endémique\",IF($H68>0,IF($H68=4,\"Inconnu\",IF($H68=99,\"Interrompu\",$D68)),0),\"Non requis\")","v":"Interrompu"},{"$f":"IF(INTRO!$E$39=\"Endémique\", IF($I68>0, IF($I68=4,\"Inconnu\",IF($I68=99,\"Interrompu\",$D68)), 0),\"Non requis\")","v":0},{"$f":"IF(INTRO!$E$41=\"Endémique\", IF($J68>1, IF($J68=4, \"Inconnu\", IF($J68=99, \"Surveillance\", E68)), 0),\"Non requis\")","v":0},{"$f":"IF(INTRO!$E$41=\"Endémique\", IF($J68>1, IF($J68=4, \"Inconnu\", IF($J68=99, \"Surveillance\", F68)), 0),\"Non requis\")","v":0},{"$f":"IF(INTRO!$E$41=\"Endémique\", IF($J68>1, IF($J68=4, \"Inconnu\", IF($J68=99, \"Surveillance\", ROUND(D68*INTRO!$E$51,0))), 0),\"Non requis\")","v":0},{"$f":"IF(INTRO!$E$41=\"Endémique\", IF($J68>1, IF($J68=4, \"Inconnu\", IF($J68=99, \"Surveillance\", SUM($N68:$P68))), 0),\"Non requis\")","v":0},10300,30502,66959,107761,0,0,0,1,null,null,null,null,null,null,null,null,40205,"Bakel"]
[{"$f":"IF(INTRO!$E$33<>0,INTRO!$E$33, \" \")","v":"SENEGAL"},"Tambacounda","Kidira",78437.031543000005,{"$f":"IF(INTRO!$E$48=\"\",\"\",ROUND($D69*INTRO!$E$48,0))","v":9467},{"$f":"IF(INTRO!$E$49=\"\",\"\",ROUND($D69*INTRO!$E$49,0))","v":20809},{"$f":"IF(INTRO!$E$50=\"\",\"\",ROUND($D69*INTRO!$E$50,0))","v":45682},99,99,0,3,{"$f":"IF(INTRO!$E$37=\"Endémique\",IF($H69>0,IF($H69=4,\"Inconnu\",IF($H69=99,\"Interrompu\",$D69)),0),\"Non requis\")","v":"Interrompu"},{"$f":"IF(INTRO!$E$39=\"Endémique\", IF($I69>0, IF($I69=4,\"Inconnu\",IF($I69=99,\"Interrompu\",$D69)), 0),\"Non requis\")","v":"Interrompu"},{"$f":"IF(INTRO!$E$41=\"Endémique\", IF($J69>1, IF($J69=4, \"Inconnu\", IF($J69=99, \"Surveillance\", E69)), 0),\"Non requis\")","v":0},{"$f":"IF(INTRO!$E$41=\"Endémique\", IF($J69>1, IF($J69=4, \"Inconnu\", IF($J69=99, \"Surveillance\", F69)), 0),\"Non requis\")","v":0},{"$f":"IF(INTRO!$E$41=\"Endémique\", IF($J69>1, IF($J69=4, \"Inconnu\", IF($J69=99, \"Surveillance\", ROUND(D69*INTRO!$E$51,0))), 0),\"Non requis\")","v":0},{"$f":"IF(INTRO!$E$41=\"Endémique\", IF($J69>1, IF($J69=4, \"Inconnu\", IF($J69=99, \"Surveillance\", SUM($N69:$P69))), 0),\"Non requis\")","v":0},6903,20440,44874,72217,0,0,0,1,null,null,null,null,null,null,null,null,40208,"Kidira"]
[{"$f":"IF(INTRO!$E$33<>0,INTRO!$E$33, \" \")","v":"SENEGAL"},"Tambacounda","Goudiry",106287.150788,{"$f":"IF(INTRO!$E$48=\"\",\"\",ROUND($D70*INTRO!$E$48,0))","v":12829},{"$f":"IF(INTRO!$E$49=\"\",\"\",ROUND($D70*INTRO!$E$49,0))","v":28198},{"$f":"IF(INTRO!$E$50=\"\",\"\",ROUND($D70*INTRO!$E$50,0))","v":61902},99,99,0,3,{"$f":"IF(INTRO!$E$37=\"Endémique\",IF($H70>0,IF($H70=4,\"Inconnu\",IF($H70=99,\"Interrompu\",$D70)),0),\"Non requis\")","v":"Interrompu"},{"$f":"IF(INTRO!$E$39=\"Endémique\", IF($I70>0, IF($I70=4,\"Inconnu\",IF($I70=99,\"Interrompu\",$D70)), 0),\"Non requis\")","v":"Interrompu"},{"$f":"IF(INTRO!$E$41=\"Endémique\", IF($J70>1, IF($J70=4, \"Inconnu\", IF($J70=99, \"Surveillance\", E70)), 0),\"Non requis\")","v":0},{"$f":"IF(INTRO!$E$41=\"Endémique\", IF($J70>1, IF($J70=4, \"Inconnu\", IF($J70=99, \"Surveillance\", F70)), 0),\"Non requis\")","v":0},{"$f":"IF(INTRO!$E$41=\"Endémique\", IF($J70>1, IF($J70=4, \"Inconnu\", IF($J70=99, \"Surveillance\", ROUND(D70*INTRO!$E$51,0))), 0),\"Non requis\")","v":0},{"$f":"IF(INTRO!$E$41=\"Endémique\", IF($J70>1, IF($J70=4, \"Inconnu\", IF($J70=99, \"Surveillance\", SUM($N70:$P70))), 0),\"Non requis\")","v":0},9025,26731,58686,94442,0,0,0,1,null,null,null,null,null,null,null,null,40207,"Goudiry"]
[{"$f":"IF(INTRO!$E$33<>0,INTRO!$E$33, \" \")","v":"SENEGAL"},"Tambacounda","Dianke Makha",60337.881903000001,{"$f":"IF(INTRO!$E$48=\"\",\"\",ROUND($D71*INTRO!$E$48,0))","v":7283},{"$f":"IF(INTRO!$E$49=\"\",\"\",ROUND($D71*INTRO!$E$49,0))","v":16008},{"$f":"IF(INTRO!$E$50=\"\",\"\",ROUND($D71*INTRO!$E$50,0))","v":35141},99,99,0,3,{"$f":"IF(INTRO!$E$37=\"Endémique\",IF($H71>0,IF($H71=4,\"Inconnu\",IF($H71=99,\"Interrompu\",$D71)),0),\"Non requis\")","v":"Interrompu"},{"$f":"IF(INTRO!$E$39=\"Endémique\", IF($I71>0, IF($I71=4,\"Inconnu\",IF($I71=99,\"Interrompu\",$D71)), 0),\"Non requis\")","v":"Interrompu"},{"$f":"IF(INTRO!$E$41=\"Endémique\", IF($J71>1, IF($J71=4, \"Inconnu\", IF($J71=99, \"Surveillance\", E71)), 0),\"Non requis\")","v":0},{"$f":"IF(INTRO!$E$41=\"Endémique\", IF($J71>1, IF($J71=4, \"Inconnu\", IF($J71=99, \"Surveillance\", F71)), 0),\"Non requis\")","v":0},{"$f":"IF(INTRO!$E$41=\"Endémique\", IF($J71>1, IF($J71=4, \"Inconnu\", IF($J71=99, \"Surveillance\", ROUND(D71*INTRO!$E$51,0))), 0),\"Non requis\")","v":0},{"$f":"IF(INTRO!$E$41=\"Endémique\", IF($J71>1, IF($J71=4, \"Inconnu\", IF($J71=99, \"Surveillance\", SUM($N71:$P71))), 0),\"Non requis\")","v":0},5311,15722,34516,55549,0,0,0,1,null,null,null,null,null,null,null,null,40206,"Dianke Makha"]
[{"$f":"IF(INTRO!$E$33<>0,INTRO!$E$33, \" \")","v":"SENEGAL"},"Tambacounda","Koumpentoum",186334.75351399998,{"$f":"IF(INTRO!$E$48=\"\",\"\",ROUND($D72*INTRO!$E$48,0))","v":22491},{"$f":"IF(INTRO!$E$49=\"\",\"\",ROUND($D72*INTRO!$E$49,0))","v":49435},{"$f":"IF(INTRO!$E$50=\"\",\"\",ROUND($D72*INTRO!$E$50,0))","v":108521},99,0,0,2,{"$f":"IF(INTRO!$E$37=\"Endémique\",IF($H72>0,IF($H72=4,\"Inconnu\",IF($H72=99,\"Interrompu\",$D72)),0),\"Non requis\")","v":"Interrompu"},{"$f":"IF(INTRO!$E$39=\"Endémique\", IF($I72>0, IF($I72=4,\"Inconnu\",IF($I72=99,\"Interrompu\",$D72)), 0),\"Non requis\")","v":0},{"$f":"IF(INTRO!$E$41=\"Endémique\", IF($J72>1, IF($J72=4, \"Inconnu\", IF($J72=99, \"Surveillance\", E72)), 0),\"Non requis\")","v":0},{"$f":"IF(INTRO!$E$41=\"Endémique\", IF($J72>1, IF($J72=4, \"Inconnu\", IF($J72=99, \"Surveillance\", F72)), 0),\"Non requis\")","v":0},{"$f":"IF(INTRO!$E$41=\"Endémique\", IF($J72>1, IF($J72=4, \"Inconnu\", IF($J72=99, \"Surveillance\", ROUND(D72*INTRO!$E$51,0))), 0),\"Non requis\")","v":0},{"$f":"IF(INTRO!$E$41=\"Endémique\", IF($J72>1, IF($J72=4, \"Inconnu\", IF($J72=99, \"Surveillance\", SUM($N72:$P72))), 0),\"Non requis\")","v":0},710,2103,4617,7430,0,0,0,1,null,null,null,null,null,null,null,null,40209,"Koumpentoum"]
[{"$f":"IF(INTRO!$E$33<>0,INTRO!$E$33, \" \")","v":"SENEGAL"},"Tambacounda","Tambacounda",334362.80447700003,{"$f":"IF(INTRO!$E$48=\"\",\"\",ROUND($D73*INTRO!$E$48,0))","v":40358},{"$f":"IF(INTRO!$E$49=\"\",\"\",ROUND($D73*INTRO!$E$49,0))","v":88706},{"$f":"IF(INTRO!$E$50=\"\",\"\",ROUND($D73*INTRO!$E$50,0))","v":194733},99,99,0,3,{"$f":"IF(INTRO!$E$37=\"Endémique\",IF($H73>0,IF($H73=4,\"Inconnu\",IF($H73=99,\"Interrompu\",$D73)),0),\"Non requis\")","v":"Interrompu"},{"$f":"IF(INTRO!$E$39=\"Endémique\", IF($I73>0, IF($I73=4,\"Inconnu\",IF($I73=99,\"Interrompu\",$D73)), 0),\"Non requis\")","v":"Interrompu"},{"$f":"IF(INTRO!$E$41=\"Endémique\", IF($J73>1, IF($J73=4, \"Inconnu\", IF($J73=99, \"Surveillance\", E73)), 0),\"Non requis\")","v":0},{"$f":"IF(INTRO!$E$41=\"Endémique\", IF($J73>1, IF($J73=4, \"Inconnu\", IF($J73=99, \"Surveillance\", F73)), 0),\"Non requis\")","v":0},{"$f":"IF(INTRO!$E$41=\"Endémique\", IF($J73>1, IF($J73=4, \"Inconnu\", IF($J73=99, \"Surveillance\", ROUND(D73*INTRO!$E$51,0))), 0),\"Non requis\")","v":0},{"$f":"IF(INTRO!$E$41=\"Endémique\", IF($J73>1, IF($J73=4, \"Inconnu\", IF($J73=99, \"Surveillance\", SUM($N73:$P73))), 0),\"Non requis\")","v":0},27435,81239,178351,287025,0,0,0,1,null,null,null,null,null,null,null,null,40212,"Tambacounda"]
[{"$f":"IF(INTRO!$E$33<>0,INTRO!$E$33, \" \")","v":"SENEGAL"},"Tambacounda","Maka Colibantang",99670.835770999998,{"$f":"IF(INTRO!$E$48=\"\",\"\",ROUND($D74*INTRO!$E$48,0))","v":12030},{"$f":"IF(INTRO!$E$49=\"\",\"\",ROUND($D74*INTRO!$E$49,0))","v":26443},{"$f":"IF(INTRO!$E$50=\"\",\"\",ROUND($D74*INTRO!$E$50,0))","v":58048},99,0,0,3,{"$f":"IF(INTRO!$E$37=\"Endémique\",IF($H74>0,IF($H74=4,\"Inconnu\",IF($H74=99,\"Interrompu\",$D74)),0),\"Non requis\")","v":"Interrompu"},{"$f":"IF(INTRO!$E$39=\"Endémique\", IF($I74>0, IF($I74=4,\"Inconnu\",IF($I74=99,\"Interrompu\",$D74)), 0),\"Non requis\")","v":0},{"$f":"IF(INTRO!$E$41=\"Endémique\", IF($J74>1, IF($J74=4, \"Inconnu\", IF($J74=99, \"Surveillance\", E74)), 0),\"Non requis\")","v":0},{"$f":"IF(INTRO!$E$41=\"Endémique\", IF($J74>1, IF($J74=4, \"Inconnu\", IF($J74=99, \"Surveillance\", F74)), 0),\"Non requis\")","v":0},{"$f":"IF(INTRO!$E$41=\"Endémique\", IF($J74>1, IF($J74=4, \"Inconnu\", IF($J74=99, \"Surveillance\", ROUND(D74*INTRO!$E$51,0))), 0),\"Non requis\")","v":0},{"$f":"IF(INTRO!$E$41=\"Endémique\", IF($J74>1, IF($J74=4, \"Inconnu\", IF($J74=99, \"Surveillance\", SUM($N74:$P74))), 0),\"Non requis\")","v":0},8037,23799,52248,84084,0,0,0,1,null,null,null,null,null,null,null,null,40211,"Maka Colibantang"]
[{"$f":"IF(INTRO!$E$33<>0,INTRO!$E$33, \" \")","v":"SENEGAL"},"Thiès","Joal-Fadhiouth",108083.35427499999,{"$f":"IF(INTRO!$E$48=\"\",\"\",ROUND($D75*INTRO!$E$48,0))","v":13046},{"$f":"IF(INTRO!$E$49=\"\",\"\",ROUND($D75*INTRO!$E$49,0))","v":28675},{"$f":"IF(INTRO!$E$50=\"\",\"\",ROUND($D75*INTRO!$E$50,0))","v":62948},99,0,1,31,{"$f":"IF(INTRO!$E$37=\"Endémique\",IF($H75>0,IF($H75=4,\"Inconnu\",IF($H75=99,\"Interrompu\",$D75)),0),\"Non requis\")","v":"Interrompu"},{"$f":"IF(INTRO!$E$39=\"Endémique\", IF($I75>0, IF($I75=4,\"Inconnu\",IF($I75=99,\"Interrompu\",$D75)), 0),\"Non requis\")","v":0},{"$f":"IF(INTRO!$E$41=\"Endémique\", IF($J75>1, IF($J75=4, \"Inconnu\", IF($J75=99, \"Surveillance\", E75)), 0),\"Non requis\")","v":0},{"$f":"IF(INTRO!$E$41=\"Endémique\", IF($J75>1, IF($J75=4, \"Inconnu\", IF($J75=99, \"Surveillance\", F75)), 0),\"Non requis\")","v":0},{"$f":"IF(INTRO!$E$41=\"Endémique\", IF($J75>1, IF($J75=4, \"Inconnu\", IF($J75=99, \"Surveillance\", ROUND(D75*INTRO!$E$51,0))), 0),\"Non requis\")","v":0},{"$f":"IF(INTRO!$E$41=\"Endémique\", IF($J75>1, IF($J75=4, \"Inconnu\", IF($J75=99, \"Surveillance\", SUM($N75:$P75))), 0),\"Non requis\")","v":0},2432,7203,15814,25449,0,0,0,1,null,null,null,null,null,null,null,null,40213,"Joal-Fadhiouth"]
[{"$f":"IF(INTRO!$E$33<>0,INTRO!$E$33, \" \")","v":"SENEGAL"},"Thiès","Mbour",487758.37132100004,{"$f":"IF(INTRO!$E$48=\"\",\"\",ROUND($D76*INTRO!$E$48,0))","v":58872},{"$f":"IF(INTRO!$E$49=\"\",\"\",ROUND($D76*INTRO!$E$49,0))","v":129402},{"$f":"IF(INTRO!$E$50=\"\",\"\",ROUND($D76*INTRO!$E$50,0))","v":284070},99,0,2,1,{"$f":"IF(INTRO!$E$37=\"Endémique\",IF($H76>0,IF($H76=4,\"Inconnu\",IF($H76=99,\"Interrompu\",$D76)),0),\"Non requis\")","v":"Interrompu"},{"$f":"IF(INTRO!$E$39=\"Endémique\", IF($I76>0, IF($I76=4,\"Inconnu\",IF($I76=99,\"Interrompu\",$D76)), 0),\"Non requis\")","v":0},{"$f":"IF(INTRO!$E$41=\"Endémique\", IF($J76>1, IF($J76=4, \"Inconnu\", IF($J76=99, \"Surveillance\", E76)), 0),\"Non requis\")","v":58872},{"$f":"IF(INTRO!$E$41=\"Endémique\", IF($J76>1, IF($J76=4, \"Inconnu\", IF($J76=99, \"Surveillance\", F76)), 0),\"Non requis\")","v":129402},{"$f":"IF(INTRO!$E$41=\"Endémique\", IF($J76>1, IF($J76=4, \"Inconnu\", IF($J76=99, \"Surveillance\", ROUND(D76*INTRO!$E$51,0))), 0),\"Non requis\")","v":119940},{"$f":"IF(INTRO!$E$41=\"Endémique\", IF($J76>1, IF($J76=4, \"Inconnu\", IF($J76=99, \"Surveillance\", SUM($N76:$P76))), 0),\"Non requis\")","v":308214},0,0,0,0,0,0,1,0,null,null,null,null,null,null,null,null,40215,"Mbour"]
[{"$f":"IF(INTRO!$E$33<>0,INTRO!$E$33, \" \")","v":"SENEGAL"},"Thiès","Popenguine",97763.885739000005,{"$f":"IF(INTRO!$E$48=\"\",\"\",ROUND($D77*INTRO!$E$48,0))","v":11800},{"$f":"IF(INTRO!$E$49=\"\",\"\",ROUND($D77*INTRO!$E$49,0))","v":25937},{"$f":"IF(INTRO!$E$50=\"\",\"\",ROUND($D77*INTRO!$E$50,0))","v":56938},99,0,1,99,{"$f":"IF(INTRO!$E$37=\"Endémique\",IF($H77>0,IF($H77=4,\"Inconnu\",IF($H77=99,\"Interrompu\",$D77)),0),\"Non requis\")","v":"Interrompu"},{"$f":"IF(INTRO!$E$39=\"Endémique\", IF($I77>0, IF($I77=4,\"Inconnu\",IF($I77=99,\"Interrompu\",$D77)), 0),\"Non requis\")","v":0},{"$f":"IF(INTRO!$E$41=\"Endémique\", IF($J77>1, IF($J77=4, \"Inconnu\", IF($J77=99, \"Surveillance\", E77)), 0),\"Non requis\")","v":0},{"$f":"IF(INTRO!$E$41=\"Endémique\", IF($J77>1, IF($J77=4, \"Inconnu\", IF($J77=99, \"Surveillance\", F77)), 0),\"Non requis\")","v":0},{"$f":"IF(INTRO!$E$41=\"Endémique\", IF($J77>1, IF($J77=4, \"Inconnu\", IF($J77=99, \"Surveillance\", ROUND(D77*INTRO!$E$51,0))), 0),\"Non requis\")","v":0},{"$f":"IF(INTRO!$E$41=\"Endémique\", IF($J77>1, IF($J77=4, \"Inconnu\", IF($J77=99, \"Surveillance\", SUM($N77:$P77))), 0),\"Non requis\")","v":0},0,0,0,0,0,0,0,0,null,null,null,null,null,null,null,null,40217,"Popenguine"]
[{"$f":"IF(INTRO!$E$33<>0,INTRO!$E$33, \" \")","v":"SENEGAL"},"Thiès","Thiadiaye",205758.64277800001,{"$f":"IF(INTRO!$E$48=\"\",\"\",ROUND($D78*INTRO!$E$48,0))","v":24835},{"$f":"IF(INTRO!$E$49=\"\",\"\",ROUND($D78*INTRO!$E$49,0))","v":54588},{"$f":"IF(INTRO!$E$50=\"\",\"\",ROUND($D78*INTRO!$E$50,0))","v":119834},99,0,2,21,{"$f":"IF(INTRO!$E$37=\"Endémique\",IF($H78>0,IF($H78=4,\"Inconnu\",IF($H78=99,\"Interrompu\",$D78)),0),\"Non requis\")","v":"Interrompu"},{"$f":"IF(INTRO!$E$39=\"Endémique\", IF($I78>0, IF($I78=4,\"Inconnu\",IF($I78=99,\"Interrompu\",$D78)), 0),\"Non requis\")","v":0},{"$f":"IF(INTRO!$E$41=\"Endémique\", IF($J78>1, IF($J78=4, \"Inconnu\", IF($J78=99, \"Surveillance\", E78)), 0),\"Non requis\")","v":24835},{"$f":"IF(INTRO!$E$41=\"Endémique\", IF($J78>1, IF($J78=4, \"Inconnu\", IF($J78=99, \"Surveillance\", F78)), 0),\"Non requis\")","v":54588},{"$f":"IF(INTRO!$E$41=\"Endémique\", IF($J78>1, IF($J78=4, \"Inconnu\", IF($J78=99, \"Surveillance\", ROUND(D78*INTRO!$E$51,0))), 0),\"Non requis\")","v":50596},{"$f":"IF(INTRO!$E$41=\"Endémique\", IF($J78>1, IF($J78=4, \"Inconnu\", IF($J78=99, \"Surveillance\", SUM($N78:$P78))), 0),\"Non requis\")","v":130019},17215,50976,111914,180105,0,0,1,1,null,null,null,null,null,null,null,null,40219,"Thiadiaye"]
[{"$f":"IF(INTRO!$E$33<>0,INTRO!$E$33, \" \")","v":"SENEGAL"},"Thiès","Pout",161987.38927800002,{"$f":"IF(INTRO!$E$48=\"\",\"\",ROUND($D79*INTRO!$E$48,0))","v":19552},{"$f":"IF(INTRO!$E$49=\"\",\"\",ROUND($D79*INTRO!$E$49,0))","v":42975},{"$f":"IF(INTRO!$E$50=\"\",\"\",ROUND($D79*INTRO!$E$50,0))","v":94341},99,0,2,1,{"$f":"IF(INTRO!$E$37=\"Endémique\",IF($H79>0,IF($H79=4,\"Inconnu\",IF($H79=99,\"Interrompu\",$D79)),0),\"Non requis\")","v":"Interrompu"},{"$f":"IF(INTRO!$E$39=\"Endémique\", IF($I79>0, IF($I79=4,\"Inconnu\",IF($I79=99,\"Interrompu\",$D79)), 0),\"Non requis\")","v":0},{"$f":"IF(INTRO!$E$41=\"Endémique\", IF($J79>1, IF($J79=4, \"Inconnu\", IF($J79=99, \"Surveillance\", E79)), 0),\"Non requis\")","v":19552},{"$f":"IF(INTRO!$E$41=\"Endémique\", IF($J79>1, IF($J79=4, \"Inconnu\", IF($J79=99, \"Surveillance\", F79)), 0),\"Non requis\")","v":42975},{"$f":"IF(INTRO!$E$41=\"Endémique\", IF($J79>1, IF($J79=4, \"Inconnu\", IF($J79=99, \"Surveillance\", ROUND(D79*INTRO!$E$51,0))), 0),\"Non requis\")","v":39833},{"$f":"IF(INTRO!$E$41=\"Endémique\", IF($J79>1, IF($J79=4, \"Inconnu\", IF($J79=99, \"Surveillance\", SUM($N79:$P79))), 0),\"Non requis\")","v":102360},0,0,0,0,0,0,1,0,null,null,null,null,null,null,null,null,40218,"Pout"]
[{"$f":"IF(INTRO!$E$33<>0,INTRO!$E$33, \" \")","v":"SENEGAL"},"Thiès","Thiès",548608.85151800001,{"$f":"IF(INTRO!$E$48=\"\",\"\",ROUND($D80*INTRO!$E$48,0))","v":66217},{"$f":"IF(INTRO!$E$49=\"\",\"\",ROUND($D80*INTRO!$E$49,0))","v":145546},{"$f":"IF(INTRO!$E$50=\"\",\"\",ROUND($D80*INTRO!$E$50,0))","v":319510},99,0,2,2,{"$f":"IF(INTRO!$E$37=\"Endémique\",IF($H80>0,IF($H80=4,\"Inconnu\",IF($H80=99,\"Interrompu\",$D80)),0),\"Non requis\")","v":"Interrompu"},{"$f":"IF(INTRO!$E$39=\"Endémique\", IF($I80>0, IF($I80=4,\"Inconnu\",IF($I80=99,\"Interrompu\",$D80)), 0),\"Non requis\")","v":0},{"$f":"IF(INTRO!$E$41=\"Endémique\", IF($J80>1, IF($J80=4, \"Inconnu\", IF($J80=99, \"Surveillance\", E80)), 0),\"Non requis\")","v":66217},{"$f":"IF(INTRO!$E$41=\"Endémique\", IF($J80>1, IF($J80=4, \"Inconnu\", IF($J80=99, \"Surveillance\", F80)), 0),\"Non requis\")","v":145546},{"$f":"IF(INTRO!$E$41=\"Endémique\", IF($J80>1, IF($J80=4, \"Inconnu\", IF($J80=99, \"Surveillance\", ROUND(D80*INTRO!$E$51,0))), 0),\"Non requis\")","v":134903},{"$f":"IF(INTRO!$E$41=\"Endémique\", IF($J80>1, IF($J80=4, \"Inconnu\", IF($J80=99, \"Surveillance\", SUM($N80:$P80))), 0),\"Non requis\")","v":346666},3527,10444,22929,36900,0,0,1,1,null,null,null,null,null,null,null,null,40220,"Thiès"]
[{"$f":"IF(INTRO!$E$33<>0,INTRO!$E$33, \" \")","v":"SENEGAL"},"Thiès","Khombole",187329.36296100001,{"$f":"IF(INTRO!$E$48=\"\",\"\",ROUND($D81*INTRO!$E$48,0))","v":22611},{"$f":"IF(INTRO!$E$49=\"\",\"\",ROUND($D81*INTRO!$E$49,0))","v":49698},{"$f":"IF(INTRO!$E$50=\"\",\"\",ROUND($D81*INTRO!$E$50,0))","v":109101},19,0,21,2,{"$f":"IF(INTRO!$E$37=\"Endémique\",IF($H81>0,IF($H81=4,\"Inconnu\",IF($H81=99,\"Interrompu\",$D81)),0),\"Non requis\")","v":187329.36296100001},{"$f":"IF(INTRO!$E$39=\"Endémique\", IF($I81>0, IF($I81=4,\"Inconnu\",IF($I81=99,\"Interrompu\",$D81)), 0),\"Non requis\")","v":0},{"$f":"IF(INTRO!$E$41=\"Endémique\", IF($J81>1, IF($J81=4, \"Inconnu\", IF($J81=99, \"Surveillance\", E81)), 0),\"Non requis\")","v":22611},{"$f":"IF(INTRO!$E$41=\"Endémique\", IF($J81>1, IF($J81=4, \"Inconnu\", IF($J81=99, \"Surveillance\", F81)), 0),\"Non requis\")","v":49698},{"$f":"IF(INTRO!$E$41=\"Endémique\", IF($J81>1, IF($J81=4, \"Inconnu\", IF($J81=99, \"Surveillance\", ROUND(D81*INTRO!$E$51,0))), 0),\"Non requis\")","v":46064},{"$f":"IF(INTRO!$E$41=\"Endémique\", IF($J81>1, IF($J81=4, \"Inconnu\", IF($J81=99, \"Surveillance\", SUM($N81:$P81))), 0),\"Non requis\")","v":118373},4204,12448,27327,43979,0,0,1,1,null,null,null,null,null,null,null,null,40214,"Khombole"]
[{"$f":"IF(INTRO!$E$33<>0,INTRO!$E$33, \" \")","v":"SENEGAL"},"Thiès","Tivaouane",395337.74269600003,{"$f":"IF(INTRO!$E$48=\"\",\"\",ROUND($D82*INTRO!$E$48,0))","v":47717},{"$f":"IF(INTRO!$E$49=\"\",\"\",ROUND($D82*INTRO!$E$49,0))","v":104883},{"$f":"IF(INTRO!$E$50=\"\",\"\",ROUND($D82*INTRO!$E$50,0))","v":230245},99,0,1,2,{"$f":"IF(INTRO!$E$37=\"Endémique\",IF($H82>0,IF($H82=4,\"Inconnu\",IF($H82=99,\"Interrompu\",$D82)),0),\"Non requis\")","v":"Interrompu"},{"$f":"IF(INTRO!$E$39=\"Endémique\", IF($I82>0, IF($I82=4,\"Inconnu\",IF($I82=99,\"Interrompu\",$D82)), 0),\"Non requis\")","v":0},{"$f":"IF(INTRO!$E$41=\"Endémique\", IF($J82>1, IF($J82=4, \"Inconnu\", IF($J82=99, \"Surveillance\", E82)), 0),\"Non requis\")","v":0},{"$f":"IF(INTRO!$E$41=\"Endémique\", IF($J82>1, IF($J82=4, \"Inconnu\", IF($J82=99, \"Surveillance\", F82)), 0),\"Non requis\")","v":0},{"$f":"IF(INTRO!$E$41=\"Endémique\", IF($J82>1, IF($J82=4, \"Inconnu\", IF($J82=99, \"Surveillance\", ROUND(D82*INTRO!$E$51,0))), 0),\"Non requis\")","v":0},{"$f":"IF(INTRO!$E$41=\"Endémique\", IF($J82>1, IF($J82=4, \"Inconnu\", IF($J82=99, \"Surveillance\", SUM($N82:$P82))), 0),\"Non requis\")","v":0},1005,2976,6534,10515,0,0,0,1,null,null,null,null,null,null,null,null,40221,"Tivaouane"]
[{"$f":"IF(INTRO!$E$33<>0,INTRO!$E$33, \" \")","v":"SENEGAL"},"Thiès","Mékhé",212639.694774,{"$f":"IF(INTRO!$E$48=\"\",\"\",ROUND($D83*INTRO!$E$48,0))","v":25666},{"$f":"IF(INTRO!$E$49=\"\",\"\",ROUND($D83*INTRO!$E$49,0))","v":56413},{"$f":"IF(INTRO!$E$50=\"\",\"\",ROUND($D83*INTRO!$E$50,0))","v":123841},0,0,1,0,{"$f":"IF(INTRO!$E$37=\"Endémique\",IF($H83>0,IF($H83=4,\"Inconnu\",IF($H83=99,\"Interrompu\",$D83)),0),\"Non requis\")","v":0},{"$f":"IF(INTRO!$E$39=\"Endémique\", IF($I83>0, IF($I83=4,\"Inconnu\",IF($I83=99,\"Interrompu\",$D83)), 0),\"Non requis\")","v":0},{"$f":"IF(INTRO!$E$41=\"Endémique\", IF($J83>1, IF($J83=4, \"Inconnu\", IF($J83=99, \"Surveillance\", E83)), 0),\"Non requis\")","v":0},{"$f":"IF(INTRO!$E$41=\"Endémique\", IF($J83>1, IF($J83=4, \"Inconnu\", IF($J83=99, \"Surveillance\", F83)), 0),\"Non requis\")","v":0},{"$f":"IF(INTRO!$E$41=\"Endémique\", IF($J83>1, IF($J83=4, \"Inconnu\", IF($J83=99, \"Surveillance\", ROUND(D83*INTRO!$E$51,0))), 0),\"Non requis\")","v":0},{"$f":"IF(INTRO!$E$41=\"Endémique\", IF($J83>1, IF($J83=4, \"Inconnu\", IF($J83=99, \"Surveillance\", SUM($N83:$P83))), 0),\"Non requis\")","v":0},0,0,0,0,0,0,0,0,null,null,null,null,null,null,null,null,40216,"Mékhé"]
[{"$f":"IF(INTRO!$E$33<>0,INTRO!$E$33, \" \")","v":"SENEGAL"},"Ziguinchor","Diouloulou",112524.818094,{"$f":"IF(INTRO!$E$48=\"\",\"\",ROUND($D84*INTRO!$E$48,0))","v":13582},{"$f":"IF(INTRO!$E$49=\"\",\"\",ROUND($D84*INTRO!$E$49,0))","v":29853},{"$f":"IF(INTRO!$E$50=\"\",\"\",ROUND($D84*INTRO!$E$50,0))","v":65534},19,0,1,11,{"$f":"IF(INTRO!$E$37=\"Endémique\",IF($H84>0,IF($H84=4,\"Inconnu\",IF($H84=99,\"Interrompu\",$D84)),0),\"Non requis\")","v":112524.818094},{"$f":"IF(INTRO!$E$39=\"Endémique\", IF($I84>0, IF($I84=4,\"Inconnu\",IF($I84=99,\"Interrompu\",$D84)), 0),\"Non requis\")","v":0},{"$f":"IF(INTRO!$E$41=\"Endémique\", IF($J84>1, IF($J84=4, \"Inconnu\", IF($J84=99, \"Surveillance\", E84)), 0),\"Non requis\")","v":0},{"$f":"IF(INTRO!$E$41=\"Endémique\", IF($J84>1, IF($J84=4, \"Inconnu\", IF($J84=99, \"Surveillance\", F84)), 0),\"Non requis\")","v":0},{"$f":"IF(INTRO!$E$41=\"Endémique\", IF($J84>1, IF($J84=4, \"Inconnu\", IF($J84=99, \"Surveillance\", ROUND(D84*INTRO!$E$51,0))), 0),\"Non requis\")","v":0},{"$f":"IF(INTRO!$E$41=\"Endémique\", IF($J84>1, IF($J84=4, \"Inconnu\", IF($J84=99, \"Surveillance\", SUM($N84:$P84))), 0),\"Non requis\")","v":0},717,2124,4664,7505,0,0,0,1,null,null,null,null,null,null,null,null,40223,"Diouloulou"]
[{"$f":"IF(INTRO!$E$33<>0,INTRO!$E$33, \" \")","v":"SENEGAL"},"Ziguinchor","Bignona",184248.49955199999,{"$f":"IF(INTRO!$E$48=\"\",\"\",ROUND($D85*INTRO!$E$48,0))","v":22239},{"$f":"IF(INTRO!$E$49=\"\",\"\",ROUND($D85*INTRO!$E$49,0))","v":48881},{"$f":"IF(INTRO!$E$50=\"\",\"\",ROUND($D85*INTRO!$E$50,0))","v":107306},99,0,0,2,{"$f":"IF(INTRO!$E$37=\"Endémique\",IF($H85>0,IF($H85=4,\"Inconnu\",IF($H85=99,\"Interrompu\",$D85)),0),\"Non requis\")","v":"Interrompu"},{"$f":"IF(INTRO!$E$39=\"Endémique\", IF($I85>0, IF($I85=4,\"Inconnu\",IF($I85=99,\"Interrompu\",$D85)), 0),\"Non requis\")","v":0},{"$f":"IF(INTRO!$E$41=\"Endémique\", IF($J85>1, IF($J85=4, \"Inconnu\", IF($J85=99, \"Surveillance\", E85)), 0),\"Non requis\")","v":0},{"$f":"IF(INTRO!$E$41=\"Endémique\", IF($J85>1, IF($J85=4, \"Inconnu\", IF($J85=99, \"Surveillance\", F85)), 0),\"Non requis\")","v":0},{"$f":"IF(INTRO!$E$41=\"Endémique\", IF($J85>1, IF($J85=4, \"Inconnu\", IF($J85=99, \"Surveillance\", ROUND(D85*INTRO!$E$51,0))), 0),\"Non requis\")","v":0},{"$f":"IF(INTRO!$E$41=\"Endémique\", IF($J85>1, IF($J85=4, \"Inconnu\", IF($J85=99, \"Surveillance\", SUM($N85:$P85))), 0),\"Non requis\")","v":0},16325,48345,106133,170803,0,0,0,1,null,null,null,null,null,null,null,null,40222,"Bignona"]
[{"$f":"IF(INTRO!$E$33<>0,INTRO!$E$33, \" \")","v":"SENEGAL"},"Ziguinchor","Thionk Essyl",57305.536028000002,{"$f":"IF(INTRO!$E$48=\"\",\"\",ROUND($D86*INTRO!$E$48,0))","v":6917},{"$f":"IF(INTRO!$E$49=\"\",\"\",ROUND($D86*INTRO!$E$49,0))","v":15203},{"$f":"IF(INTRO!$E$50=\"\",\"\",ROUND($D86*INTRO!$E$50,0))","v":33375},99,0,0,99,{"$f":"IF(INTRO!$E$37=\"Endémique\",IF($H86>0,IF($H86=4,\"Inconnu\",IF($H86=99,\"Interrompu\",$D86)),0),\"Non requis\")","v":"Interrompu"},{"$f":"IF(INTRO!$E$39=\"Endémique\", IF($I86>0, IF($I86=4,\"Inconnu\",IF($I86=99,\"Interrompu\",$D86)), 0),\"Non requis\")","v":0},{"$f":"IF(INTRO!$E$41=\"Endémique\", IF($J86>1, IF($J86=4, \"Inconnu\", IF($J86=99, \"Surveillance\", E86)), 0),\"Non requis\")","v":0},{"$f":"IF(INTRO!$E$41=\"Endémique\", IF($J86>1, IF($J86=4, \"Inconnu\", IF($J86=99, \"Surveillance\", F86)), 0),\"Non requis\")","v":0},{"$f":"IF(INTRO!$E$41=\"Endémique\", IF($J86>1, IF($J86=4, \"Inconnu\", IF($J86=99, \"Surveillance\", ROUND(D86*INTRO!$E$51,0))), 0),\"Non requis\")","v":0},{"$f":"IF(INTRO!$E$41=\"Endémique\", IF($J86>1, IF($J86=4, \"Inconnu\", IF($J86=99, \"Surveillance\", SUM($N86:$P86))), 0),\"Non requis\")","v":0},0,0,0,0,0,0,0,0,null,null,null,null,null,null,null,null,40225,"Thionk Essyl"]
[{"$f":"IF(INTRO!$E$33<>0,INTRO!$E$33, \" \")","v":"SENEGAL"},"Ziguinchor","Oussouye",67760.009875999996,{"$f":"IF(INTRO!$E$48=\"\",\"\",ROUND($D87*INTRO!$E$48,0))","v":8179},{"$f":"IF(INTRO!$E$49=\"\",\"\",ROUND($D87*INTRO!$E$49,0))","v":17977},{"$f":"IF(INTRO!$E$50=\"\",\"\",ROUND($D87*INTRO!$E$50,0))","v":39463},99,0,0,2,{"$f":"IF(INTRO!$E$37=\"Endémique\",IF($H87>0,IF($H87=4,\"Inconnu\",IF($H87=99,\"Interrompu\",$D87)),0),\"Non requis\")","v":"Interrompu"},{"$f":"IF(INTRO!$E$39=\"Endémique\", IF($I87>0, IF($I87=4,\"Inconnu\",IF($I87=99,\"Interrompu\",$D87)), 0),\"Non requis\")","v":0},{"$f":"IF(INTRO!$E$41=\"Endémique\", IF($J87>1, IF($J87=4, \"Inconnu\", IF($J87=99, \"Surveillance\", E87)), 0),\"Non requis\")","v":0},{"$f":"IF(INTRO!$E$41=\"Endémique\", IF($J87>1, IF($J87=4, \"Inconnu\", IF($J87=99, \"Surveillance\", F87)), 0),\"Non requis\")","v":0},{"$f":"IF(INTRO!$E$41=\"Endémique\", IF($J87>1, IF($J87=4, \"Inconnu\", IF($J87=99, \"Surveillance\", ROUND(D87*INTRO!$E$51,0))), 0),\"Non requis\")","v":0},{"$f":"IF(INTRO!$E$41=\"Endémique\", IF($J87>1, IF($J87=4, \"Inconnu\", IF($J87=99, \"Surveillance\", SUM($N87:$P87))), 0),\"Non requis\")","v":0},6003,17780,39032,62815,0,0,0,1,null,null,null,null,null,null,null,null,40224,"Oussouye"]
[{"$f":"IF(INTRO!$E$33<>0,INTRO!$E$33, \" \")","v":"SENEGAL"},"Ziguinchor","Ziguinchor",348061.62472900003,{"$f":"IF(INTRO!$E$48=\"\",\"\",ROUND($D88*INTRO!$E$48,0))","v":42011},{"$f":"IF(INTRO!$E$49=\"\",\"\",ROUND($D88*INTRO!$E$49,0))","v":92341},{"$f":"IF(INTRO!$E$50=\"\",\"\",ROUND($D88*INTRO!$E$50,0))","v":202711},99,0,1,11,{"$f":"IF(INTRO!$E$37=\"Endémique\",IF($H88>0,IF($H88=4,\"Inconnu\",IF($H88=99,\"Interrompu\",$D88)),0),\"Non requis\")","v":"Interrompu"},{"$f":"IF(INTRO!$E$39=\"Endémique\", IF($I88>0, IF($I88=4,\"Inconnu\",IF($I88=99,\"Interrompu\",$D88)), 0),\"Non requis\")","v":0},{"$f":"IF(INTRO!$E$41=\"Endémique\", IF($J88>1, IF($J88=4, \"Inconnu\", IF($J88=99, \"Surveillance\", E88)), 0),\"Non requis\")","v":0},{"$f":"IF(INTRO!$E$41=\"Endémique\", IF($J88>1, IF($J88=4, \"Inconnu\", IF($J88=99, \"Surveillance\", F88)), 0),\"Non requis\")","v":0},{"$f":"IF(INTRO!$E$41=\"Endémique\", IF($J88>1, IF($J88=4, \"Inconnu\", IF($J88=99, \"Surveillance\", ROUND(D88*INTRO!$E$51,0))), 0),\"Non requis\")","v":0},{"$f":"IF(INTRO!$E$41=\"Endémique\", IF($J88>1, IF($J88=4, \"Inconnu\", IF($J88=99, \"Surveillance\", SUM($N88:$P88))), 0),\"Non requis\")","v":0},1047,3100,6807,10954,0,0,0,1,null,null,null,null,null,null,null,null,40226,"Ziguinchor"]

{"sheet":"DEC","index":2,"n_rows":88,"n_cols":12,"rows_kept":88,"cut":false,"hidden":true,"merged":[[3,0,3,2],[5,0,5,2],[6,5,7,5],[6,2,7,2],[6,1,7,1],[6,10,7,10],[6,0,7,0],[6,11,7,11],[5,3,5,6],[5,9,5,11],[6,4,7,4],[6,3,7,3],[6,8,7,8],[6,7,7,7],[6,6,7,6],[6,9,7,9]]}
["Diethylcarbamazine (DEC)"]
["Structure administrative, population ciblée par groupe d'âge, plan de traitement et information sur les comprimés"]
[]
["TOTAL",null,null,{"$f":"SUBTOTAL(9,D$10:D$1010)","v":0},0,0,0,null,{"$f":"SUBTOTAL(9,I$10:I$1010)","v":0},0,0,0]
[]
["Structure administrative du pays",null,null,"Population nécessitant un traitement avec DEC",null,null,null,"Plan de traitement","Population cible","Diethylcarbamazine (DEC)"]
["Pays","Région/Département","District","EAPréS","EAS","Adultes","Total","FL","FL","Total requis","Reste en stock","Comprimés devant être fournis"]
[]
[]
[{"$f":"IF(INTRO!$E$39<>\"Non endémique\", \" \", IF(INTRO!$E$37=\"Non endémique\",\" \", IF(COUNTRY_INFO!A10=0,\" \",COUNTRY_INFO!A10)))","v":" "},{"$f":"IF(INTRO!$E$39<>\"Non endémique\", \" \", IF(INTRO!$E$37=\"Non endémique\",\" \", IF(COUNTRY_INFO!B10=0,\" \",COUNTRY_INFO!B10)))","v":" "},{"$f":"IF(INTRO!$E$39<>\"Non endémique\", \" \", IF(INTRO!$E$37=\"Non endémique\",\" \", IF(COUNTRY_INFO!C10=0,\" \",COUNTRY_INFO!C10)))","v":" "},{"$f":"IF(INTRO!$E$39<>\"Non endémique\", 0, IF(INTRO!$E$37=\"Non endémique\",0,IF(COUNTRY_INFO!$H10=1,COUNTRY_INFO!E10,0)))","v":0},{"$f":"IF(INTRO!$E$39<>\"Non endémique\", 0, IF(INTRO!$E$37=\"Non endémique\",0,IF(COUNTRY_INFO!$H10=1,COUNTRY_INFO!F10,0)))","v":0},{"$f":"IF(INTRO!$E$39<>\"Non endémique\", 0, IF(INTRO!$E$37=\"Non endémique\",0,IF(COUNTRY_INFO!$H10=1,COUNTRY_INFO!G10,0)))","v":0},{"$f":"SUM(D10:F10)","v":0},{"$f":"IF(INTRO!$E$39=\"Non endémique\",IF(INTRO!$E$37=\"Non endémique\",\"Non requis\",COUNTRY_INFO!V10),\"Traiter avec IVM\")","v":"Traiter avec IVM"},{"$f":"IF(H10=1,G10,0)","v":0},{"$f":"IF(I10>0,I10*2.5,0)","v":0},null,{"$f":"IF($J10>$K10,$J10-$K10,0)","v":0}]
[{"$f":"IF(INTRO!$E$39<>\"Non endémique\", \" \", IF(INTRO!$E$37=\"Non endémique\",\" \", IF(COUNTRY_INFO!A11=0,\" \",COUNTRY_INFO!A11)))","v":" "},{"$f":"IF(INTRO!$E$39<>\"Non endémique\", \" \", IF(INTRO!$E$37=\"Non endémique\",\" \", IF(COUNTRY_INFO!B11=0,\" \",COUNTRY_INFO!B11)))","v":" "},{"$f":"IF(INTRO!$E$39<>\"Non endémique\", \" \", IF(INTRO!$E$37=\"Non endémique\",\" \", IF(COUNTRY_INFO!C11=0,\" \",COUNTRY_INFO!C11)))","v":" "},{"$f":"IF(INTRO!$E$39<>\"Non endémique\", 0, IF(INTRO!$E$37=\"Non endémique\",0,IF(COUNTRY_INFO!$H11=1,COUNTRY_INFO!E11,0)))","v":0},{"$f":"IF(INTRO!$E$39<>\"Non endémique\", 0, IF(INTRO!$E$37=\"Non endémique\",0,IF(COUNTRY_INFO!$H11=1,COUNTRY_INFO!F11,0)))","v":0},{"$f":"IF(INTRO!$E$39<>\"Non endémique\", 0, IF(INTRO!$E$37=\"Non endémique\",0,IF(COUNTRY_INFO!$H11=1,COUNTRY_INFO!G11,0)))","v":0},{"$f":"SUM(D11:F11)","v":0},{"$f":"IF(INTRO!$E$39=\"Non endémique\",IF(INTRO!$E$37=\"Non endémique\",\"Non requis\",COUNTRY_INFO!V11),\"Traiter avec IVM\")","v":"Traiter avec IVM"},{"$f":"IF(H11=1,G11,0)","v":0},{"$f":"IF(I11>0,I11*2.5,0)","v":0},null,0]
[{"$f":"IF(INTRO!$E$39<>\"Non endémique\", \" \", IF(INTRO!$E$37=\"Non endémique\",\" \", IF(COUNTRY_INFO!A12=0,\" \",COUNTRY_INFO!A12)))","v":" "},{"$f":"IF(INTRO!$E$39<>\"Non endémique\", \" \", IF(INTRO!$E$37=\"Non endémique\",\" \", IF(COUNTRY_INFO!B12=0,\" \",COUNTRY_INFO!B12)))","v":" "},{"$f":"IF(INTRO!$E$39<>\"Non endémique\", \" \", IF(INTRO!$E$37=\"Non endémique\",\" \", IF(COUNTRY_INFO!C12=0,\" \",COUNTRY_INFO!C12)))","v":" "},{"$f":"IF(INTRO!$E$39<>\"Non endémique\", 0, IF(INTRO!$E$37=\"Non endémique\",0,IF(COUNTRY_INFO!$H12=1,COUNTRY_INFO!E12,0)))","v":0},{"$f":"IF(INTRO!$E$39<>\"Non endémique\", 0, IF(INTRO!$E$37=\"Non endémique\",0,IF(COUNTRY_INFO!$H12=1,COUNTRY_INFO!F12,0)))","v":0},{"$f":"IF(INTRO!$E$39<>\"Non endémique\", 0, IF(INTRO!$E$37=\"Non endémique\",0,IF(COUNTRY_INFO!$H12=1,COUNTRY_INFO!G12,0)))","v":0},0,{"$f":"IF(INTRO!$E$39=\"Non endémique\",IF(INTRO!$E$37=\"Non endémique\",\"Non requis\",COUNTRY_INFO!V12),\"Traiter avec IVM\")","v":"Traiter avec IVM"},0,0,null,0]
[{"$f":"IF(INTRO!$E$39<>\"Non endémique\", \" \", IF(INTRO!$E$37=\"Non endémique\",\" \", IF(COUNTRY_INFO!A13=0,\" \",COUNTRY_INFO!A13)))","v":" "},{"$f":"IF(INTRO!$E$39<>\"Non endémique\", \" \", IF(INTRO!$E$37=\"Non endémique\",\" \", IF(COUNTRY_INFO!B13=0,\" \",COUNTRY_INFO!B13)))","v":" "},{"$f":"IF(INTRO!$E$39<>\"Non endémique\", \" \", IF(INTRO!$E$37=\"Non endémique\",\" \", IF(COUNTRY_INFO!C13=0,\" \",COUNTRY_INFO!C13)))","v":" "},{"$f":"IF(INTRO!$E$39<>\"Non endémique\", 0, IF(INTRO!$E$37=\"Non endémique\",0,IF(COUNTRY_INFO!$H13=1,COUNTRY_INFO!E13,0)))","v":0},{"$f":"IF(INTRO!$E$39<>\"Non endémique\", 0, IF(INTRO!$E$37=\"Non endémique\",0,IF(COUNTRY_INFO!$H13=1,COUNTRY_INFO!F13,0)))","v":0},{"$f":"IF(INTRO!$E$39<>\"Non endémique\", 0, IF(INTRO!$E$37=\"Non endémique\",0,IF(COUNTRY_INFO!$H13=1,COUNTRY_INFO!G13,0)))","v":0},0,{"$f":"IF(INTRO!$E$39=\"Non endémique\",IF(INTRO!$E$37=\"Non endémique\",\"Non requis\",COUNTRY_INFO!V13),\"Traiter avec IVM\")","v":"Traiter avec IVM"},0,0,null,0]
[{"$f":"IF(INTRO!$E$39<>\"Non endémique\", \" \", IF(INTRO!$E$37=\"Non endémique\",\" \", IF(COUNTRY_INFO!A14=0,\" \",COUNTRY_INFO!A14)))","v":" "},{"$f":"IF(INTRO!$E$39<>\"Non endémique\", \" \", IF(INTRO!$E$37=\"Non endémique\",\" \", IF(COUNTRY_INFO!B14=0,\" \",COUNTRY_INFO!B14)))","v":" "},{"$f":"IF(INTRO!$E$39<>\"Non endémique\", \" \", IF(INTRO!$E$37=\"Non endémique\",\" \", IF(COUNTRY_INFO!C14=0,\" \",COUNTRY_INFO!C14)))","v":" "},{"$f":"IF(INTRO!$E$39<>\"Non endémique\", 0, IF(INTRO!$E$37=\"Non endémique\",0,IF(COUNTRY_INFO!$H14=1,COUNTRY_INFO!E14,0)))","v":0},{"$f":"IF(INTRO!$E$39<>\"Non endémique\", 0, IF(INTRO!$E$37=\"Non endémique\",0,IF(COUNTRY_INFO!$H14=1,COUNTRY_INFO!F14,0)))","v":0},{"$f":"IF(INTRO!$E$39<>\"Non endémique\", 0, IF(INTRO!$E$37=\"Non endémique\",0,IF(COUNTRY_INFO!$H14=1,COUNTRY_INFO!G14,0)))","v":0},0,{"$f":"IF(INTRO!$E$39=\"Non endémique\",IF(INTRO!$E$37=\"Non endémique\",\"Non requis\",COUNTRY_INFO!V14),\"Traiter avec IVM\")","v":"Traiter avec IVM"},0,0,null,0]
[{"$f":"IF(INTRO!$E$39<>\"Non endémique\", \" \", IF(INTRO!$E$37=\"Non endémique\",\" \", IF(COUNTRY_INFO!A15=0,\" \",COUNTRY_INFO!A15)))","v":" "},{"$f":"IF(INTRO!$E$39<>\"Non endémique\", \" \", IF(INTRO!$E$37=\"Non endémique\",\" \", IF(COUNTRY_INFO!B15=0,\" \",COUNTRY_INFO!B15)))","v":" "},{"$f":"IF(INTRO!$E$39<>\"Non endémique\", \" \", IF(INTRO!$E$37=\"Non endémique\",\" \", IF(COUNTRY_INFO!C15=0,\" \",COUNTRY_INFO!C15)))","v":" "},{"$f":"IF(INTRO!$E$39<>\"Non endémique\", 0, IF(INTRO!$E$37=\"Non endémique\",0,IF(COUNTRY_INFO!$H15=1,COUNTRY_INFO!E15,0)))","v":0},{"$f":"IF(INTRO!$E$39<>\"Non endémique\", 0, IF(INTRO!$E$37=\"Non endémique\",0,IF(COUNTRY_INFO!$H15=1,COUNTRY_INFO!F15,0)))","v":0},{"$f":"IF(INTRO!$E$39<>\"Non endémique\", 0, IF(INTRO!$E$37=\"Non endémique\",0,IF(COUNTRY_INFO!$H15=1,COUNTRY_INFO!G15,0)))","v":0},0,{"$f":"IF(INTRO!$E$39=\"Non endémique\",IF(INTRO!$E$37=\"Non endémique\",\"Non requis\",COUNTRY_INFO!V15),\"Traiter avec IVM\")","v":"Traiter avec IVM"},0,0,null,0]
[{"$f":"IF(INTRO!$E$39<>\"Non endémique\", \" \", IF(INTRO!$E$37=\"Non endémique\",\" \", IF(COUNTRY_INFO!A16=0,\" \",COUNTRY_INFO!A16)))","v":" "},{"$f":"IF(INTRO!$E$39<>\"Non endémique\", \" \", IF(INTRO!$E$37=\"Non endémique\",\" \", IF(COUNTRY_INFO!B16=0,\" \",COUNTRY_INFO!B16)))","v":" "},{"$f":"IF(INTRO!$E$39<>\"Non endémique\", \" \", IF(INTRO!$E$37=\"Non endémique\",\" \", IF(COUNTRY_INFO!C16=0,\" \",COUNTRY_INFO!C16)))","v":" "},{"$f":"IF(INTRO!$E$39<>\"Non endémique\", 0, IF(INTRO!$E$37=\"Non endémique\",0,IF(COUNTRY_INFO!$H16=1,COUNTRY_INFO!E16,0)))","v":0},{"$f":"IF(INTRO!$E$39<>\"Non endémique\", 0, IF(INTRO!$E$37=\"Non endémique\",0,IF(COUNTRY_INFO!$H16=1,COUNTRY_INFO!F16,0)))","v":0},{"$f":"IF(INTRO!$E$39<>\"Non endémique\", 0, IF(INTRO!$E$37=\"Non endémique\",0,IF(COUNTRY_INFO!$H16=1,COUNTRY_INFO!G16,0)))","v":0},0,{"$f":"IF(INTRO!$E$39=\"Non endémique\",IF(INTRO!$E$37=\"Non endémique\",\"Non requis\",COUNTRY_INFO!V16),\"Traiter avec IVM\")","v":"Traiter avec IVM"},0,0,null,0]
[{"$f":"IF(INTRO!$E$39<>\"Non endémique\", \" \", IF(INTRO!$E$37=\"Non endémique\",\" \", IF(COUNTRY_INFO!A17=0,\" \",COUNTRY_INFO!A17)))","v":" "},{"$f":"IF(INTRO!$E$39<>\"Non endémique\", \" \", IF(INTRO!$E$37=\"Non endémique\",\" \", IF(COUNTRY_INFO!B17=0,\" \",COUNTRY_INFO!B17)))","v":" "},{"$f":"IF(INTRO!$E$39<>\"Non endémique\", \" \", IF(INTRO!$E$37=\"Non endémique\",\" \", IF(COUNTRY_INFO!C17=0,\" \",COUNTRY_INFO!C17)))","v":" "},{"$f":"IF(INTRO!$E$39<>\"Non endémique\", 0, IF(INTRO!$E$37=\"Non endémique\",0,IF(COUNTRY_INFO!$H17=1,COUNTRY_INFO!E17,0)))","v":0},{"$f":"IF(INTRO!$E$39<>\"Non endémique\", 0, IF(INTRO!$E$37=\"Non endémique\",0,IF(COUNTRY_INFO!$H17=1,COUNTRY_INFO!F17,0)))","v":0},{"$f":"IF(INTRO!$E$39<>\"Non endémique\", 0, IF(INTRO!$E$37=\"Non endémique\",0,IF(COUNTRY_INFO!$H17=1,COUNTRY_INFO!G17,0)))","v":0},0,{"$f":"IF(INTRO!$E$39=\"Non endémique\",IF(INTRO!$E$37=\"Non endémique\",\"Non requis\",COUNTRY_INFO!V17),\"Traiter avec IVM\")","v":"Traiter avec IVM"},0,0,null,0]
[{"$f":"IF(INTRO!$E$39<>\"Non endémique\", \" \", IF(INTRO!$E$37=\"Non endémique\",\" \", IF(COUNTRY_INFO!A18=0,\" \",COUNTRY_INFO!A18)))","v":" "},{"$f":"IF(INTRO!$E$39<>\"Non endémique\", \" \", IF(INTRO!$E$37=\"Non endémique\",\" \", IF(COUNTRY_INFO!B18=0,\" \",COUNTRY_INFO!B18)))","v":" "},{"$f":"IF(INTRO!$E$39<>\"Non endémique\", \" \", IF(INTRO!$E$37=\"Non endémique\",\" \", IF(COUNTRY_INFO!C18=0,\" \",COUNTRY_INFO!C18)))","v":" "},{"$f":"IF(INTRO!$E$39<>\"Non endémique\", 0, IF(INTRO!$E$37=\"Non endémique\",0,IF(COUNTRY_INFO!$H18=1,COUNTRY_INFO!E18,0)))","v":0},{"$f":"IF(INTRO!$E$39<>\"Non endémique\", 0, IF(INTRO!$E$37=\"Non endémique\",0,IF(COUNTRY_INFO!$H18=1,COUNTRY_INFO!F18,0)))","v":0},{"$f":"IF(INTRO!$E$39<>\"Non endémique\", 0, IF(INTRO!$E$37=\"Non endémique\",0,IF(COUNTRY_INFO!$H18=1,COUNTRY_INFO!G18,0)))","v":0},0,{"$f":"IF(INTRO!$E$39=\"Non endémique\",IF(INTRO!$E$37=\"Non endémique\",\"Non requis\",COUNTRY_INFO!V18),\"Traiter avec IVM\")","v":"Traiter avec IVM"},0,0,null,0]
[{"$f":"IF(INTRO!$E$39<>\"Non endémique\", \" \", IF(INTRO!$E$37=\"Non endémique\",\" \", IF(COUNTRY_INFO!A19=0,\" \",COUNTRY_INFO!A19)))","v":" "},{"$f":"IF(INTRO!$E$39<>\"Non endémique\", \" \", IF(INTRO!$E$37=\"Non endémique\",\" \", IF(COUNTRY_INFO!B19=0,\" \",COUNTRY_INFO!B19)))","v":" "},{"$f":"IF(INTRO!$E$39<>\"Non endémique\", \" \", IF(INTRO!$E$37=\"Non endémique\",\" \", IF(COUNTRY_INFO!C19=0,\" \",COUNTRY_INFO!C19)))","v":" "},{"$f":"IF(INTRO!$E$39<>\"Non endémique\", 0, IF(INTRO!$E$37=\"Non endémique\",0,IF(COUNTRY_INFO!$H19=1,COUNTRY_INFO!E19,0)))","v":0},{"$f":"IF(INTRO!$E$39<>\"Non endémique\", 0, IF(INTRO!$E$37=\"Non endémique\",0,IF(COUNTRY_INFO!$H19=1,COUNTRY_INFO!F19,0)))","v":0},{"$f":"IF(INTRO!$E$39<>\"Non endémique\", 0, IF(INTRO!$E$37=\"Non endémique\",0,IF(COUNTRY_INFO!$H19=1,COUNTRY_INFO!G19,0)))","v":0},0,{"$f":"IF(INTRO!$E$39=\"Non endémique\",IF(INTRO!$E$37=\"Non endémique\",\"Non requis\",COUNTRY_INFO!V19),\"Traiter avec IVM\")","v":"Traiter avec IVM"},0,0,null,0]
[{"$f":"IF(INTRO!$E$39<>\"Non endémique\", \" \", IF(INTRO!$E$37=\"Non endémique\",\" \", IF(COUNTRY_INFO!A20=0,\" \",COUNTRY_INFO!A20)))","v":" "},{"$f":"IF(INTRO!$E$39<>\"Non endémique\", \" \", IF(INTRO!$E$37=\"Non endémique\",\" \", IF(COUNTRY_INFO!B20=0,\" \",COUNTRY_INFO!B20)))","v":" "},{"$f":"IF(INTRO!$E$39<>\"Non endémique\", \" \", IF(INTRO!$E$37=\"Non endémique\",\" \", IF(COUNTRY_INFO!C20=0,\" \",COUNTRY_INFO!C20)))","v":" "},{"$f":"IF(INTRO!$E$39<>\"Non endémique\", 0, IF(INTRO!$E$37=\"Non endémique\",0,IF(COUNTRY_INFO!$H20=1,COUNTRY_INFO!E20,0)))","v":0},{"$f":"IF(INTRO!$E$39<>\"Non endémique\", 0, IF(INTRO!$E$37=\"Non endémique\",0,IF(COUNTRY_INFO!$H20=1,COUNTRY_INFO!F20,0)))","v":0},{"$f":"IF(INTRO!$E$39<>\"Non endémique\", 0, IF(INTRO!$E$37=\"Non endémique\",0,IF(COUNTRY_INFO!$H20=1,COUNTRY_INFO!G20,0)))","v":0},0,{"$f":"IF(INTRO!$E$39=\"Non endémique\",IF(INTRO!$E$37=\"Non endémique\",\"Non requis\",COUNTRY_INFO!V20),\"Traiter avec IVM\")","v":"Traiter avec IVM"},0,0,null,0]
[{"$f":"IF(INTRO!$E$39<>\"Non endémique\", \" \", IF(INTRO!$E$37=\"Non endémique\",\" \", IF(COUNTRY_INFO!A21=0,\" \",COUNTRY_INFO!A21)))","v":" "},{"$f":"IF(INTRO!$E$39<>\"Non endémique\", \" \", IF(INTRO!$E$37=\"Non endémique\",\" \", IF(COUNTRY_INFO!B21=0,\" \",COUNTRY_INFO!B21)))","v":" "},{"$f":"IF(INTRO!$E$39<>\"Non endémique\", \" \", IF(INTRO!$E$37=\"Non endémique\",\" \", IF(COUNTRY_INFO!C21=0,\" \",COUNTRY_INFO!C21)))","v":" "},{"$f":"IF(INTRO!$E$39<>\"Non endémique\", 0, IF(INTRO!$E$37=\"Non endémique\",0,IF(COUNTRY_INFO!$H21=1,COUNTRY_INFO!E21,0)))","v":0},{"$f":"IF(INTRO!$E$39<>\"Non endémique\", 0, IF(INTRO!$E$37=\"Non endémique\",0,IF(COUNTRY_INFO!$H21=1,COUNTRY_INFO!F21,0)))","v":0},{"$f":"IF(INTRO!$E$39<>\"Non endémique\", 0, IF(INTRO!$E$37=\"Non endémique\",0,IF(COUNTRY_INFO!$H21=1,COUNTRY_INFO!G21,0)))","v":0},0,{"$f":"IF(INTRO!$E$39=\"Non endémique\",IF(INTRO!$E$37=\"Non endémique\",\"Non requis\",COUNTRY_INFO!V21),\"Traiter avec IVM\")","v":"Traiter avec IVM"},0,0,null,0]
[{"$f":"IF(INTRO!$E$39<>\"Non endémique\", \" \", IF(INTRO!$E$37=\"Non endémique\",\" \", IF(COUNTRY_INFO!A22=0,\" \",COUNTRY_INFO!A22)))","v":" "},{"$f":"IF(INTRO!$E$39<>\"Non endémique\", \" \", IF(INTRO!$E$37=\"Non endémique\",\" \", IF(COUNTRY_INFO!B22=0,\" \",COUNTRY_INFO!B22)))","v":" "},{"$f":"IF(INTRO!$E$39<>\"Non endémique\", \" \", IF(INTRO!$E$37=\"Non endémique\",\" \", IF(COUNTRY_INFO!C22=0,\" \",COUNTRY_INFO!C22)))","v":" "},{"$f":"IF(INTRO!$E$39<>\"Non endémique\", 0, IF(INTRO!$E$37=\"Non endémique\",0,IF(COUNTRY_INFO!$H22=1,COUNTRY_INFO!E22,0)))","v":0},{"$f":"IF(INTRO!$E$39<>\"Non endémique\", 0, IF(INTRO!$E$37=\"Non endémique\",0,IF(COUNTRY_INFO!$H22=1,COUNTRY_INFO!F22,0)))","v":0},{"$f":"IF(INTRO!$E$39<>\"Non endémique\", 0, IF(INTRO!$E$37=\"Non endémique\",0,IF(COUNTRY_INFO!$H22=1,COUNTRY_INFO!G22,0)))","v":0},0,{"$f":"IF(INTRO!$E$39=\"Non endémique\",IF(INTRO!$E$37=\"Non endémique\",\"Non requis\",COUNTRY_INFO!V22),\"Traiter avec IVM\")","v":"Traiter avec IVM"},0,0,null,0]
[{"$f":"IF(INTRO!$E$39<>\"Non endémique\", \" \", IF(INTRO!$E$37=\"Non endémique\",\" \", IF(COUNTRY_INFO!A23=0,\" \",COUNTRY_INFO!A23)))","v":" "},{"$f":"IF(INTRO!$E$39<>\"Non endémique\", \" \", IF(INTRO!$E$37=\"Non endémique\",\" \", IF(COUNTRY_INFO!B23=0,\" \",COUNTRY_INFO!B23)))","v":" "},{"$f":"IF(INTRO!$E$39<>\"Non endémique\", \" \", IF(INTRO!$E$37=\"Non endémique\",\" \", IF(COUNTRY_INFO!C23=0,\" \",COUNTRY_INFO!C23)))","v":" "},{"$f":"IF(INTRO!$E$39<>\"Non endémique\", 0, IF(INTRO!$E$37=\"Non endémique\",0,IF(COUNTRY_INFO!$H23=1,COUNTRY_INFO!E23,0)))","v":0},{"$f":"IF(INTRO!$E$39<>\"Non endémique\", 0, IF(INTRO!$E$37=\"Non endémique\",0,IF(COUNTRY_INFO!$H23=1,COUNTRY_INFO!F23,0)))","v":0},{"$f":"IF(INTRO!$E$39<>\"Non endémique\", 0, IF(INTRO!$E$37=\"Non endémique\",0,IF(COUNTRY_INFO!$H23=1,COUNTRY_INFO!G23,0)))","v":0},0,{"$f":"IF(INTRO!$E$39=\"Non endémique\",IF(INTRO!$E$37=\"Non endémique\",\"Non requis\",COUNTRY_INFO!V23),\"Traiter avec IVM\")","v":"Traiter avec IVM"},0,0,null,0]
[{"$f":"IF(INTRO!$E$39<>\"Non endémique\", \" \", IF(INTRO!$E$37=\"Non endémique\",\" \", IF(COUNTRY_INFO!A24=0,\" \",COUNTRY_INFO!A24)))","v":" "},{"$f":"IF(INTRO!$E$39<>\"Non endémique\", \" \", IF(INTRO!$E$37=\"Non endémique\",\" \", IF(COUNTRY_INFO!B24=0,\" \",COUNTRY_INFO!B24)))","v":" "},{"$f":"IF(INTRO!$E$39<>\"Non endémique\", \" \", IF(INTRO!$E$37=\"Non endémique\",\" \", IF(COUNTRY_INFO!C24=0,\" \",COUNTRY_INFO!C24)))","v":" "},{"$f":"IF(INTRO!$E$39<>\"Non endémique\", 0, IF(INTRO!$E$37=\"Non endémique\",0,IF(COUNTRY_INFO!$H24=1,COUNTRY_INFO!E24,0)))","v":0},{"$f":"IF(INTRO!$E$39<>\"Non endémique\", 0, IF(INTRO!$E$37=\"Non endémique\",0,IF(COUNTRY_INFO!$H24=1,COUNTRY_INFO!F24,0)))","v":0},{"$f":"IF(INTRO!$E$39<>\"Non endémique\", 0, IF(INTRO!$E$37=\"Non endémique\",0,IF(COUNTRY_INFO!$H24=1,COUNTRY_INFO!G24,0)))","v":0},0,{"$f":"IF(INTRO!$E$39=\"Non endémique\",IF(INTRO!$E$37=\"Non endémique\",\"Non requis\",COUNTRY_INFO!V24),\"Traiter avec IVM\")","v":"Traiter avec IVM"},0,0,null,0]
[{"$f":"IF(INTRO!$E$39<>\"Non endémique\", \" \", IF(INTRO!$E$37=\"Non endémique\",\" \", IF(COUNTRY_INFO!A25=0,\" \",COUNTRY_INFO!A25)))","v":" "},{"$f":"IF(INTRO!$E$39<>\"Non endémique\", \" \", IF(INTRO!$E$37=\"Non endémique\",\" \", IF(COUNTRY_INFO!B25=0,\" \",COUNTRY_INFO!B25)))","v":" "},{"$f":"IF(INTRO!$E$39<>\"Non endémique\", \" \", IF(INTRO!$E$37=\"Non endémique\",\" \", IF(COUNTRY_INFO!C25=0,\" \",COUNTRY_INFO!C25)))","v":" "},{"$f":"IF(INTRO!$E$39<>\"Non endémique\", 0, IF(INTRO!$E$37=\"Non endémique\",0,IF(COUNTRY_INFO!$H25=1,COUNTRY_INFO!E25,0)))","v":0},{"$f":"IF(INTRO!$E$39<>\"Non endémique\", 0, IF(INTRO!$E$37=\"Non endémique\",0,IF(COUNTRY_INFO!$H25=1,COUNTRY_INFO!F25,0)))","v":0},{"$f":"IF(INTRO!$E$39<>\"Non endémique\", 0, IF(INTRO!$E$37=\"Non endémique\",0,IF(COUNTRY_INFO!$H25=1,COUNTRY_INFO!G25,0)))","v":0},0,{"$f":"IF(INTRO!$E$39=\"Non endémique\",IF(INTRO!$E$37=\"Non endémique\",\"Non requis\",COUNTRY_INFO!V25),\"Traiter avec IVM\")","v":"Traiter avec IVM"},0,0,null,0]
[{"$f":"IF(INTRO!$E$39<>\"Non endémique\", \" \", IF(INTRO!$E$37=\"Non endémique\",\" \", IF(COUNTRY_INFO!A26=0,\" \",COUNTRY_INFO!A26)))","v":" "},{"$f":"IF(INTRO!$E$39<>\"Non endémique\", \" \", IF(INTRO!$E$37=\"Non endémique\",\" \", IF(COUNTRY_INFO!B26=0,\" \",COUNTRY_INFO!B26)))","v":" "},{"$f":"IF(INTRO!$E$39<>\"Non endémique\", \" \", IF(INTRO!$E$37=\"Non endémique\",\" \", IF(COUNTRY_INFO!C26=0,\" \",COUNTRY_INFO!C26)))","v":" "},{"$f":"IF(INTRO!$E$39<>\"Non endémique\", 0, IF(INTRO!$E$37=\"Non endémique\",0,IF(COUNTRY_INFO!$H26=1,COUNTRY_INFO!E26,0)))","v":0},{"$f":"IF(INTRO!$E$39<>\"Non endémique\", 0, IF(INTRO!$E$37=\"Non endémique\",0,IF(COUNTRY_INFO!$H26=1,COUNTRY_INFO!F26,0)))","v":0},{"$f":"IF(INTRO!$E$39<>\"Non endémique\", 0, IF(INTRO!$E$37=\"Non endémique\",0,IF(COUNTRY_INFO!$H26=1,COUNTRY_INFO!G26,0)))","v":0},0,{"$f":"IF(INTRO!$E$39=\"Non endémique\",IF(INTRO!$E$37=\"Non endémique\",\"Non requis\",COUNTRY_INFO!V26),\"Traiter avec IVM\")","v":"Traiter avec IVM"},0,0,null,0]
[{"$f":"IF(INTRO!$E$39<>\"Non endémique\", \" \", IF(INTRO!$E$37=\"Non endémique\",\" \", IF(COUNTRY_INFO!A27=0,\" \",COUNTRY_INFO!A27)))","v":" "},{"$f":"IF(INTRO!$E$39<>\"Non endémique\", \" \", IF(INTRO!$E$37=\"Non endémique\",\" \", IF(COUNTRY_INFO!B27=0,\" \",COUNTRY_INFO!B27)))","v":" "},{"$f":"IF(INTRO!$E$39<>\"Non endémique\", \" \", IF(INTRO!$E$37=\"Non endémique\",\" \", IF(COUNTRY_INFO!C27=0,\" \",COUNTRY_INFO!C27)))","v":" "},{"$f":"IF(INTRO!$E$39<>\"Non endémique\", 0, IF(INTRO!$E$37=\"Non endémique\",0,IF(COUNTRY_INFO!$H27=1,COUNTRY_INFO!E27,0)))","v":0},{"$f":"IF(INTRO!$E$39<>\"Non endémique\", 0, IF(INTRO!$E$37=\"Non endémique\",0,IF(COUNTRY_INFO!$H27=1,COUNTRY_INFO!F27,0)))","v":0},{"$f":"IF(INTRO!$E$39<>\"Non endémique\", 0, IF(INTRO!$E$37=\"Non endémique\",0,IF(COUNTRY_INFO!$H27=1,COUNTRY_INFO!G27,0)))","v":0},0,{"$f":"IF(INTRO!$E$39=\"Non endémique\",IF(INTRO!$E$37=\"Non endémique\",\"Non requis\",COUNTRY_INFO!V27),\"Traiter avec IVM\")","v":"Traiter avec IVM"},0,0,null,0]
[{"$f":"IF(INTRO!$E$39<>\"Non endémique\", \" \", IF(INTRO!$E$37=\"Non endémique\",\" \", IF(COUNTRY_INFO!A28=0,\" \",COUNTRY_INFO!A28)))","v":" "},{"$f":"IF(INTRO!$E$39<>\"Non endémique\", \" \", IF(INTRO!$E$37=\"Non endémique\",\" \", IF(COUNTRY_INFO!B28=0,\" \",COUNTRY_INFO!B28)))","v":" "},{"$f":"IF(INTRO!$E$39<>\"Non endémique\", \" \", IF(INTRO!$E$37=\"Non endémique\",\" \", IF(COUNTRY_INFO!C28=0,\" \",COUNTRY_INFO!C28)))","v":" "},{"$f":"IF(INTRO!$E$39<>\"Non endémique\", 0, IF(INTRO!$E$37=\"Non endémique\",0,IF(COUNTRY_INFO!$H28=1,COUNTRY_INFO!E28,0)))","v":0},{"$f":"IF(INTRO!$E$39<>\"Non endémique\", 0, IF(INTRO!$E$37=\"Non endémique\",0,IF(COUNTRY_INFO!$H28=1,COUNTRY_INFO!F28,0)))","v":0},{"$f":"IF(INTRO!$E$39<>\"Non endémique\", 0, IF(INTRO!$E$37=\"Non endémique\",0,IF(COUNTRY_INFO!$H28=1,COUNTRY_INFO!G28,0)))","v":0},0,{"$f":"IF(INTRO!$E$39=\"Non endémique\",IF(INTRO!$E$37=\"Non endémique\",\"Non requis\",COUNTRY_INFO!V28),\"Traiter avec IVM\")","v":"Traiter avec IVM"},0,0,null,0]
[{"$f":"IF(INTRO!$E$39<>\"Non endémique\", \" \", IF(INTRO!$E$37=\"Non endémique\",\" \", IF(COUNTRY_INFO!A29=0,\" \",COUNTRY_INFO!A29)))","v":" "},{"$f":"IF(INTRO!$E$39<>\"Non endémique\", \" \", IF(INTRO!$E$37=\"Non endémique\",\" \", IF(COUNTRY_INFO!B29=0,\" \",COUNTRY_INFO!B29)))","v":" "},{"$f":"IF(INTRO!$E$39<>\"Non endémique\", \" \", IF(INTRO!$E$37=\"Non endémique\",\" \", IF(COUNTRY_INFO!C29=0,\" \",COUNTRY_INFO!C29)))","v":" "},{"$f":"IF(INTRO!$E$39<>\"Non endémique\", 0, IF(INTRO!$E$37=\"Non endémique\",0,IF(COUNTRY_INFO!$H29=1,COUNTRY_INFO!E29,0)))","v":0},{"$f":"IF(INTRO!$E$39<>\"Non endémique\", 0, IF(INTRO!$E$37=\"Non endémique\",0,IF(COUNTRY_INFO!$H29=1,COUNTRY_INFO!F29,0)))","v":0},{"$f":"IF(INTRO!$E$39<>\"Non endémique\", 0, IF(INTRO!$E$37=\"Non endémique\",0,IF(COUNTRY_INFO!$H29=1,COUNTRY_INFO!G29,0)))","v":0},0,{"$f":"IF(INTRO!$E$39=\"Non endémique\",IF(INTRO!$E$37=\"Non endémique\",\"Non requis\",COUNTRY_INFO!V29),\"Traiter avec IVM\")","v":"Traiter avec IVM"},0,0,null,0]
[{"$f":"IF(INTRO!$E$39<>\"Non endémique\", \" \", IF(INTRO!$E$37=\"Non endémique\",\" \", IF(COUNTRY_INFO!A30=0,\" \",COUNTRY_INFO!A30)))","v":" "},{"$f":"IF(INTRO!$E$39<>\"Non endémique\", \" \", IF(INTRO!$E$37=\"Non endémique\",\" \", IF(COUNTRY_INFO!B30=0,\" \",COUNTRY_INFO!B30)))","v":" "},{"$f":"IF(INTRO!$E$39<>\"Non endémique\", \" \", IF(INTRO!$E$37=\"Non endémique\",\" \", IF(COUNTRY_INFO!C30=0,\" \",COUNTRY_INFO!C30)))","v":" "},{"$f":"IF(INTRO!$E$39<>\"Non endémique\", 0, IF(INTRO!$E$37=\"Non endémique\",0,IF(COUNTRY_INFO!$H30=1,COUNTRY_INFO!E30,0)))","v":0},{"$f":"IF(INTRO!$E$39<>\"Non endémique\", 0, IF(INTRO!$E$37=\"Non endémique\",0,IF(COUNTRY_INFO!$H30=1,COUNTRY_INFO!F30,0)))","v":0},{"$f":"IF(INTRO!$E$39<>\"Non endémique\", 0, IF(INTRO!$E$37=\"Non endémique\",0,IF(COUNTRY_INFO!$H30=1,COUNTRY_INFO!G30,0)))","v":0},0,{"$f":"IF(INTRO!$E$39=\"Non endémique\",IF(INTRO!$E$37=\"Non endémique\",\"Non requis\",COUNTRY_INFO!V30),\"Traiter avec IVM\")","v":"Traiter avec IVM"},0,0,null,0]
[{"$f":"IF(INTRO!$E$39<>\"Non endémique\", \" \", IF(INTRO!$E$37=\"Non endémique\",\" \", IF(COUNTRY_INFO!A31=0,\" \",COUNTRY_INFO!A31)))","v":" "},{"$f":"IF(INTRO!$E$39<>\"Non endémique\", \" \", IF(INTRO!$E$37=\"Non endémique\",\" \", IF(COUNTRY_INFO!B31=0,\" \",COUNTRY_INFO!B31)))","v":" "},{"$f":"IF(INTRO!$E$39<>\"Non endémique\", \" \", IF(INTRO!$E$37=\"Non endémique\",\" \", IF(COUNTRY_INFO!C31=0,\" \",COUNTRY_INFO!C31)))","v":" "},{"$f":"IF(INTRO!$E$39<>\"Non endémique\", 0, IF(INTRO!$E$37=\"Non endémique\",0,IF(COUNTRY_INFO!$H31=1,COUNTRY_INFO!E31,0)))","v":0},{"$f":"IF(INTRO!$E$39<>\"Non endémique\", 0, IF(INTRO!$E$37=\"Non endémique\",0,IF(COUNTRY_INFO!$H31=1,COUNTRY_INFO!F31,0)))","v":0},{"$f":"IF(INTRO!$E$39<>\"Non endémique\", 0, IF(INTRO!$E$37=\"Non endémique\",0,IF(COUNTRY_INFO!$H31=1,COUNTRY_INFO!G31,0)))","v":0},0,{"$f":"IF(INTRO!$E$39=\"Non endémique\",IF(INTRO!$E$37=\"Non endémique\",\"Non requis\",COUNTRY_INFO!V31),\"Traiter avec IVM\")","v":"Traiter avec IVM"},0,0,null,0]
[{"$f":"IF(INTRO!$E$39<>\"Non endémique\", \" \", IF(INTRO!$E$37=\"Non endémique\",\" \", IF(COUNTRY_INFO!A32=0,\" \",COUNTRY_INFO!A32)))","v":" "},{"$f":"IF(INTRO!$E$39<>\"Non endémique\", \" \", IF(INTRO!$E$37=\"Non endémique\",\" \", IF(COUNTRY_INFO!B32=0,\" \",COUNTRY_INFO!B32)))","v":" "},{"$f":"IF(INTRO!$E$39<>\"Non endémique\", \" \", IF(INTRO!$E$37=\"Non endémique\",\" \", IF(COUNTRY_INFO!C32=0,\" \",COUNTRY_INFO!C32)))","v":" "},{"$f":"IF(INTRO!$E$39<>\"Non endémique\", 0, IF(INTRO!$E$37=\"Non endémique\",0,IF(COUNTRY_INFO!$H32=1,COUNTRY_INFO!E32,0)))","v":0},{"$f":"IF(INTRO!$E$39<>\"Non endémique\", 0, IF(INTRO!$E$37=\"Non endémique\",0,IF(COUNTRY_INFO!$H32=1,COUNTRY_INFO!F32,0)))","v":0},{"$f":"IF(INTRO!$E$39<>\"Non endémique\", 0, IF(INTRO!$E$37=\"Non endémique\",0,IF(COUNTRY_INFO!$H32=1,COUNTRY_INFO!G32,0)))","v":0},0,{"$f":"IF(INTRO!$E$39=\"Non endémique\",IF(INTRO!$E$37=\"Non endémique\",\"Non requis\",COUNTRY_INFO!V32),\"Traiter avec IVM\")","v":"Traiter avec IVM"},0,0,null,0]
[{"$f":"IF(INTRO!$E$39<>\"Non endémique\", \" \", IF(INTRO!$E$37=\"Non endémique\",\" \", IF(COUNTRY_INFO!A33=0,\" \",COUNTRY_INFO!A33)))","v":" "},{"$f":"IF(INTRO!$E$39<>\"Non endémique\", \" \", IF(INTRO!$E$37=\"Non endémique\",\" \", IF(COUNTRY_INFO!B33=0,\" \",COUNTRY_INFO!B33)))","v":" "},{"$f":"IF(INTRO!$E$39<>\"Non endémique\", \" \", IF(INTRO!$E$37=\"Non endémique\",\" \", IF(COUNTRY_INFO!C33=0,\" \",COUNTRY_INFO!C33)))","v":" "},{"$f":"IF(INTRO!$E$39<>\"Non endémique\", 0, IF(INTRO!$E$37=\"Non endémique\",0,IF(COUNTRY_INFO!$H33=1,COUNTRY_INFO!E33,0)))","v":0},{"$f":"IF(INTRO!$E$39<>\"Non endémique\", 0, IF(INTRO!$E$37=\"Non endémique\",0,IF(COUNTRY_INFO!$H33=1,COUNTRY_INFO!F33,0)))","v":0},{"$f":"IF(INTRO!$E$39<>\"Non endémique\", 0, IF(INTRO!$E$37=\"Non endémique\",0,IF(COUNTRY_INFO!$H33=1,COUNTRY_INFO!G33,0)))","v":0},0,{"$f":"IF(INTRO!$E$39=\"Non endémique\",IF(INTRO!$E$37=\"Non endémique\",\"Non requis\",COUNTRY_INFO!V33),\"Traiter avec IVM\")","v":"Traiter avec IVM"},0,0,null,0]
[{"$f":"IF(INTRO!$E$39<>\"Non endémique\", \" \", IF(INTRO!$E$37=\"Non endémique\",\" \", IF(COUNTRY_INFO!A34=0,\" \",COUNTRY_INFO!A34)))","v":" "},{"$f":"IF(INTRO!$E$39<>\"Non endémique\", \" \", IF(INTRO!$E$37=\"Non endémique\",\" \", IF(COUNTRY_INFO!B34=0,\" \",COUNTRY_INFO!B34)))","v":" "},{"$f":"IF(INTRO!$E$39<>\"Non endémique\", \" \", IF(INTRO!$E$37=\"Non endémique\",\" \", IF(COUNTRY_INFO!C34=0,\" \",COUNTRY_INFO!C34)))","v":" "},{"$f":"IF(INTRO!$E$39<>\"Non endémique\", 0, IF(INTRO!$E$37=\"Non endémique\",0,IF(COUNTRY_INFO!$H34=1,COUNTRY_INFO!E34,0)))","v":0},{"$f":"IF(INTRO!$E$39<>\"Non endémique\", 0, IF(INTRO!$E$37=\"Non endémique\",0,IF(COUNTRY_INFO!$H34=1,COUNTRY_INFO!F34,0)))","v":0},{"$f":"IF(INTRO!$E$39<>\"Non endémique\", 0, IF(INTRO!$E$37=\"Non endémique\",0,IF(COUNTRY_INFO!$H34=1,COUNTRY_INFO!G34,0)))","v":0},0,{"$f":"IF(INTRO!$E$39=\"Non endémique\",IF(INTRO!$E$37=\"Non endémique\",\"Non requis\",COUNTRY_INFO!V34),\"Traiter avec IVM\")","v":"Traiter avec IVM"},0,0,null,0]
[{"$f":"IF(INTRO!$E$39<>\"Non endémique\", \" \", IF(INTRO!$E$37=\"Non endémique\",\" \", IF(COUNTRY_INFO!A35=0,\" \",COUNTRY_INFO!A35)))","v":" "},{"$f":"IF(INTRO!$E$39<>\"Non endémique\", \" \", IF(INTRO!$E$37=\"Non endémique\",\" \", IF(COUNTRY_INFO!B35=0,\" \",COUNTRY_INFO!B35)))","v":" "},{"$f":"IF(INTRO!$E$39<>\"Non endémique\", \" \", IF(INTRO!$E$37=\"Non endémique\",\" \", IF(COUNTRY_INFO!C35=0,\" \",COUNTRY_INFO!C35)))","v":" "},{"$f":"IF(INTRO!$E$39<>\"Non endémique\", 0, IF(INTRO!$E$37=\"Non endémique\",0,IF(COUNTRY_INFO!$H35=1,COUNTRY_INFO!E35,0)))","v":0},{"$f":"IF(INTRO!$E$39<>\"Non endémique\", 0, IF(INTRO!$E$37=\"Non endémique\",0,IF(COUNTRY_INFO!$H35=1,COUNTRY_INFO!F35,0)))","v":0},{"$f":"IF(INTRO!$E$39<>\"Non endémique\", 0, IF(INTRO!$E$37=\"Non endémique\",0,IF(COUNTRY_INFO!$H35=1,COUNTRY_INFO!G35,0)))","v":0},0,{"$f":"IF(INTRO!$E$39=\"Non endémique\",IF(INTRO!$E$37=\"Non endémique\",\"Non requis\",COUNTRY_INFO!V35),\"Traiter avec IVM\")","v":"Traiter avec IVM"},0,0,null,0]
[{"$f":"IF(INTRO!$E$39<>\"Non endémique\", \" \", IF(INTRO!$E$37=\"Non endémique\",\" \", IF(COUNTRY_INFO!A36=0,\" \",COUNTRY_INFO!A36)))","v":" "},{"$f":"IF(INTRO!$E$39<>\"Non endémique\", \" \", IF(INTRO!$E$37=\"Non endémique\",\" \", IF(COUNTRY_INFO!B36=0,\" \",COUNTRY_INFO!B36)))","v":" "},{"$f":"IF(INTRO!$E$39<>\"Non endémique\", \" \", IF(INTRO!$E$37=\"Non endémique\",\" \", IF(COUNTRY_INFO!C36=0,\" \",COUNTRY_INFO!C36)))","v":" "},{"$f":"IF(INTRO!$E$39<>\"Non endémique\", 0, IF(INTRO!$E$37=\"Non endémique\",0,IF(COUNTRY_INFO!$H36=1,COUNTRY_INFO!E36,0)))","v":0},{"$f":"IF(INTRO!$E$39<>\"Non endémique\", 0, IF(INTRO!$E$37=\"Non endémique\",0,IF(COUNTRY_INFO!$H36=1,COUNTRY_INFO!F36,0)))","v":0},{"$f":"IF(INTRO!$E$39<>\"Non endémique\", 0, IF(INTRO!$E$37=\"Non endémique\",0,IF(COUNTRY_INFO!$H36=1,COUNTRY_INFO!G36,0)))","v":0},0,{"$f":"IF(INTRO!$E$39=\"Non endémique\",IF(INTRO!$E$37=\"Non endémique\",\"Non requis\",COUNTRY_INFO!V36),\"Traiter avec IVM\")","v":"Traiter avec IVM"},0,0,null,0]
[{"$f":"IF(INTRO!$E$39<>\"Non endémique\", \" \", IF(INTRO!$E$37=\"Non endémique\",\" \", IF(COUNTRY_INFO!A37=0,\" \",COUNTRY_INFO!A37)))","v":" "},{"$f":"IF(INTRO!$E$39<>\"Non endémique\", \" \", IF(INTRO!$E$37=\"Non endémique\",\" \", IF(COUNTRY_INFO!B37=0,\" \",COUNTRY_INFO!B37)))","v":" "},{"$f":"IF(INTRO!$E$39<>\"Non endémique\", \" \", IF(INTRO!$E$37=\"Non endémique\",\" \", IF(COUNTRY_INFO!C37=0,\" \",COUNTRY_INFO!C37)))","v":" "},{"$f":"IF(INTRO!$E$39<>\"Non endémique\", 0, IF(INTRO!$E$37=\"Non endémique\",0,IF(COUNTRY_INFO!$H37=1,COUNTRY_INFO!E37,0)))","v":0},{"$f":"IF(INTRO!$E$39<>\"Non endémique\", 0, IF(INTRO!$E$37=\"Non endémique\",0,IF(COUNTRY_INFO!$H37=1,COUNTRY_INFO!F37,0)))","v":0},{"$f":"IF(INTRO!$E$39<>\"Non endémique\", 0, IF(INTRO!$E$37=\"Non endémique\",0,IF(COUNTRY_INFO!$H37=1,COUNTRY_INFO!G37,0)))","v":0},0,{"$f":"IF(INTRO!$E$39=\"Non endémique\",IF(INTRO!$E$37=\"Non endémique\",\"Non requis\",COUNTRY_INFO!V37),\"Traiter avec IVM\")","v":"Traiter avec IVM"},0,0,null,0]
[{"$f":"IF(INTRO!$E$39<>\"Non endémique\", \" \", IF(INTRO!$E$37=\"Non endémique\",\" \", IF(COUNTRY_INFO!A38=0,\" \",COUNTRY_INFO!A38)))","v":" "},{"$f":"IF(INTRO!$E$39<>\"Non endémique\", \" \", IF(INTRO!$E$37=\"Non endémique\",\" \", IF(COUNTRY_INFO!B38=0,\" \",COUNTRY_INFO!B38)))","v":" "},{"$f":"IF(INTRO!$E$39<>\"Non endémique\", \" \", IF(INTRO!$E$37=\"Non endémique\",\" \", IF(COUNTRY_INFO!C38=0,\" \",COUNTRY_INFO!C38)))","v":" "},{"$f":"IF(INTRO!$E$39<>\"Non endémique\", 0, IF(INTRO!$E$37=\"Non endémique\",0,IF(COUNTRY_INFO!$H38=1,COUNTRY_INFO!E38,0)))","v":0},{"$f":"IF(INTRO!$E$39<>\"Non endémique\", 0, IF(INTRO!$E$37=\"Non endémique\",0,IF(COUNTRY_INFO!$H38=1,COUNTRY_INFO!F38,0)))","v":0},{"$f":"IF(INTRO!$E$39<>\"Non endémique\", 0, IF(INTRO!$E$37=\"Non endémique\",0,IF(COUNTRY_INFO!$H38=1,COUNTRY_INFO!G38,0)))","v":0},0,{"$f":"IF(INTRO!$E$39=\"Non endémique\",IF(INTRO!$E$37=\"Non endémique\",\"Non requis\",COUNTRY_INFO!V38),\"Traiter avec IVM\")","v":"Traiter avec IVM"},0,0,null,0]
[{"$f":"IF(INTRO!$E$39<>\"Non endémique\", \" \", IF(INTRO!$E$37=\"Non endémique\",\" \", IF(COUNTRY_INFO!A39=0,\" \",COUNTRY_INFO!A39)))","v":" "},{"$f":"IF(INTRO!$E$39<>\"Non endémique\", \" \", IF(INTRO!$E$37=\"Non endémique\",\" \", IF(COUNTRY_INFO!B39=0,\" \",COUNTRY_INFO!B39)))","v":" "},{"$f":"IF(INTRO!$E$39<>\"Non endémique\", \" \", IF(INTRO!$E$37=\"Non endémique\",\" \", IF(COUNTRY_INFO!C39=0,\" \",COUNTRY_INFO!C39)))","v":" "},{"$f":"IF(INTRO!$E$39<>\"Non endémique\", 0, IF(INTRO!$E$37=\"Non endémique\",0,IF(COUNTRY_INFO!$H39=1,COUNTRY_INFO!E39,0)))","v":0},{"$f":"IF(INTRO!$E$39<>\"Non endémique\", 0, IF(INTRO!$E$37=\"Non endémique\",0,IF(COUNTRY_INFO!$H39=1,COUNTRY_INFO!F39,0)))","v":0},{"$f":"IF(INTRO!$E$39<>\"Non endémique\", 0, IF(INTRO!$E$37=\"Non endémique\",0,IF(COUNTRY_INFO!$H39=1,COUNTRY_INFO!G39,0)))","v":0},0,{"$f":"IF(INTRO!$E$39=\"Non endémique\",IF(INTRO!$E$37=\"Non endémique\",\"Non requis\",COUNTRY_INFO!V39),\"Traiter avec IVM\")","v":"Traiter avec IVM"},0,0,null,0]
[{"$f":"IF(INTRO!$E$39<>\"Non endémique\", \" \", IF(INTRO!$E$37=\"Non endémique\",\" \", IF(COUNTRY_INFO!A40=0,\" \",COUNTRY_INFO!A40)))","v":" "},{"$f":"IF(INTRO!$E$39<>\"Non endémique\", \" \", IF(INTRO!$E$37=\"Non endémique\",\" \", IF(COUNTRY_INFO!B40=0,\" \",COUNTRY_INFO!B40)))","v":" "},{"$f":"IF(INTRO!$E$39<>\"Non endémique\", \" \", IF(INTRO!$E$37=\"Non endémique\",\" \", IF(COUNTRY_INFO!C40=0,\" \",COUNTRY_INFO!C40)))","v":" "},{"$f":"IF(INTRO!$E$39<>\"Non endémique\", 0, IF(INTRO!$E$37=\"Non endémique\",0,IF(COUNTRY_INFO!$H40=1,COUNTRY_INFO!E40,0)))","v":0},{"$f":"IF(INTRO!$E$39<>\"Non endémique\", 0, IF(INTRO!$E$37=\"Non endémique\",0,IF(COUNTRY_INFO!$H40=1,COUNTRY_INFO!F40,0)))","v":0},{"$f":"IF(INTRO!$E$39<>\"Non endémique\", 0, IF(INTRO!$E$37=\"Non endémique\",0,IF(COUNTRY_INFO!$H40=1,COUNTRY_INFO!G40,0)))","v":0},0,{"$f":"IF(INTRO!$E$39=\"Non endémique\",IF(INTRO!$E$37=\"Non endémique\",\"Non requis\",COUNTRY_INFO!V40),\"Traiter avec IVM\")","v":"Traiter avec IVM"},0,0,null,0]
[{"$f":"IF(INTRO!$E$39<>\"Non endémique\", \" \", IF(INTRO!$E$37=\"Non endémique\",\" \", IF(COUNTRY_INFO!A41=0,\" \",COUNTRY_INFO!A41)))","v":" "},{"$f":"IF(INTRO!$E$39<>\"Non endémique\", \" \", IF(INTRO!$E$37=\"Non endémique\",\" \", IF(COUNTRY_INFO!B41=0,\" \",COUNTRY_INFO!B41)))","v":" "},{"$f":"IF(INTRO!$E$39<>\"Non endémique\", \" \", IF(INTRO!$E$37=\"Non endémique\",\" \", IF(COUNTRY_INFO!C41=0,\" \",COUNTRY_INFO!C41)))","v":" "},{"$f":"IF(INTRO!$E$39<>\"Non endémique\", 0, IF(INTRO!$E$37=\"Non endémique\",0,IF(COUNTRY_INFO!$H41=1,COUNTRY_INFO!E41,0)))","v":0},{"$f":"IF(INTRO!$E$39<>\"Non endémique\", 0, IF(INTRO!$E$37=\"Non endémique\",0,IF(COUNTRY_INFO!$H41=1,COUNTRY_INFO!F41,0)))","v":0},{"$f":"IF(INTRO!$E$39<>\"Non endémique\", 0, IF(INTRO!$E$37=\"Non endémique\",0,IF(COUNTRY_INFO!$H41=1,COUNTRY_INFO!G41,0)))","v":0},0,{"$f":"IF(INTRO!$E$39=\"Non endémique\",IF(INTRO!$E$37=\"Non endémique\",\"Non requis\",COUNTRY_INFO!V41),\"Traiter avec IVM\")","v":"Traiter avec IVM"},0,0,null,0]
[{"$f":"IF(INTRO!$E$39<>\"Non endémique\", \" \", IF(INTRO!$E$37=\"Non endémique\",\" \", IF(COUNTRY_INFO!A42=0,\" \",COUNTRY_INFO!A42)))","v":" "},{"$f":"IF(INTRO!$E$39<>\"Non endémique\", \" \", IF(INTRO!$E$37=\"Non endémique\",\" \", IF(COUNTRY_INFO!B42=0,\" \",COUNTRY_INFO!B42)))","v":" "},{"$f":"IF(INTRO!$E$39<>\"Non endémique\", \" \", IF(INTRO!$E$37=\"Non endémique\",\" \", IF(COUNTRY_INFO!C42=0,\" \",COUNTRY_INFO!C42)))","v":" "},{"$f":"IF(INTRO!$E$39<>\"Non endémique\", 0, IF(INTRO!$E$37=\"Non endémique\",0,IF(COUNTRY_INFO!$H42=1,COUNTRY_INFO!E42,0)))","v":0},{"$f":"IF(INTRO!$E$39<>\"Non endémique\", 0, IF(INTRO!$E$37=\"Non endémique\",0,IF(COUNTRY_INFO!$H42=1,COUNTRY_INFO!F42,0)))","v":0},{"$f":"IF(INTRO!$E$39<>\"Non endémique\", 0, IF(INTRO!$E$37=\"Non endémique\",0,IF(COUNTRY_INFO!$H42=1,COUNTRY_INFO!G42,0)))","v":0},0,{"$f":"IF(INTRO!$E$39=\"Non endémique\",IF(INTRO!$E$37=\"Non endémique\",\"Non requis\",COUNTRY_INFO!V42),\"Traiter avec IVM\")","v":"Traiter avec IVM"},0,0,null,0]
[{"$f":"IF(INTRO!$E$39<>\"Non endémique\", \" \", IF(INTRO!$E$37=\"Non endémique\",\" \", IF(COUNTRY_INFO!A43=0,\" \",COUNTRY_INFO!A43)))","v":" "},{"$f":"IF(INTRO!$E$39<>\"Non endémique\", \" \", IF(INTRO!$E$37=\"Non endémique\",\" \", IF(COUNTRY_INFO!B43=0,\" \",COUNTRY_INFO!B43)))","v":" "},{"$f":"IF(INTRO!$E$39<>\"Non endémique\", \" \", IF(INTRO!$E$37=\"Non endémique\",\" \", IF(COUNTRY_INFO!C43=0,\" \",COUNTRY_INFO!C43)))","v":" "},{"$f":"IF(INTRO!$E$39<>\"Non endémique\", 0, IF(INTRO!$E$37=\"Non endémique\",0,IF(COUNTRY_INFO!$H43=1,COUNTRY_INFO!E43,0)))","v":0},{"$f":"IF(INTRO!$E$39<>\"Non endémique\", 0, IF(INTRO!$E$37=\"Non endémique\",0,IF(COUNTRY_INFO!$H43=1,COUNTRY_INFO!F43,0)))","v":0},{"$f":"IF(INTRO!$E$39<>\"Non endémique\", 0, IF(INTRO!$E$37=\"Non endémique\",0,IF(COUNTRY_INFO!$H43=1,COUNTRY_INFO!G43,0)))","v":0},0,{"$f":"IF(INTRO!$E$39=\"Non endémique\",IF(INTRO!$E$37=\"Non endémique\",\"Non requis\",COUNTRY_INFO!V43),\"Traiter avec IVM\")","v":"Traiter avec IVM"},0,0,null,0]
[{"$f":"IF(INTRO!$E$39<>\"Non endémique\", \" \", IF(INTRO!$E$37=\"Non endémique\",\" \", IF(COUNTRY_INFO!A44=0,\" \",COUNTRY_INFO!A44)))","v":" "},{"$f":"IF(INTRO!$E$39<>\"Non endémique\", \" \", IF(INTRO!$E$37=\"Non endémique\",\" \", IF(COUNTRY_INFO!B44=0,\" \",COUNTRY_INFO!B44)))","v":" "},{"$f":"IF(INTRO!$E$39<>\"Non endémique\", \" \", IF(INTRO!$E$37=\"Non endémique\",\" \", IF(COUNTRY_INFO!C44=0,\" \",COUNTRY_INFO!C44)))","v":" "},{"$f":"IF(INTRO!$E$39<>\"Non endémique\", 0, IF(INTRO!$E$37=\"Non endémique\",0,IF(COUNTRY_INFO!$H44=1,COUNTRY_INFO!E44,0)))","v":0},{"$f":"IF(INTRO!$E$39<>\"Non endémique\", 0, IF(INTRO!$E$37=\"Non endémique\",0,IF(COUNTRY_INFO!$H44=1,COUNTRY_INFO!F44,0)))","v":0},{"$f":"IF(INTRO!$E$39<>\"Non endémique\", 0, IF(INTRO!$E$37=\"Non endémique\",0,IF(COUNTRY_INFO!$H44=1,COUNTRY_INFO!G44,0)))","v":0},0,{"$f":"IF(INTRO!$E$39=\"Non endémique\",IF(INTRO!$E$37=\"Non endémique\",\"Non requis\",COUNTRY_INFO!V44),\"Traiter avec IVM\")","v":"Traiter avec IVM"},0,0,null,0]
[{"$f":"IF(INTRO!$E$39<>\"Non endémique\", \" \", IF(INTRO!$E$37=\"Non endémique\",\" \", IF(COUNTRY_INFO!A45=0,\" \",COUNTRY_INFO!A45)))","v":" "},{"$f":"IF(INTRO!$E$39<>\"Non endémique\", \" \", IF(INTRO!$E$37=\"Non endémique\",\" \", IF(COUNTRY_INFO!B45=0,\" \",COUNTRY_INFO!B45)))","v":" "},{"$f":"IF(INTRO!$E$39<>\"Non endémique\", \" \", IF(INTRO!$E$37=\"Non endémique\",\" \", IF(COUNTRY_INFO!C45=0,\" \",COUNTRY_INFO!C45)))","v":" "},{"$f":"IF(INTRO!$E$39<>\"Non endémique\", 0, IF(INTRO!$E$37=\"Non endémique\",0,IF(COUNTRY_INFO!$H45=1,COUNTRY_INFO!E45,0)))","v":0},{"$f":"IF(INTRO!$E$39<>\"Non endémique\", 0, IF(INTRO!$E$37=\"Non endémique\",0,IF(COUNTRY_INFO!$H45=1,COUNTRY_INFO!F45,0)))","v":0},{"$f":"IF(INTRO!$E$39<>\"Non endémique\", 0, IF(INTRO!$E$37=\"Non endémique\",0,IF(COUNTRY_INFO!$H45=1,COUNTRY_INFO!G45,0)))","v":0},0,{"$f":"IF(INTRO!$E$39=\"Non endémique\",IF(INTRO!$E$37=\"Non endémique\",\"Non requis\",COUNTRY_INFO!V45),\"Traiter avec IVM\")","v":"Traiter avec IVM"},0,0,null,0]
[{"$f":"IF(INTRO!$E$39<>\"Non endémique\", \" \", IF(INTRO!$E$37=\"Non endémique\",\" \", IF(COUNTRY_INFO!A46=0,\" \",COUNTRY_INFO!A46)))","v":" "},{"$f":"IF(INTRO!$E$39<>\"Non endémique\", \" \", IF(INTRO!$E$37=\"Non endémique\",\" \", IF(COUNTRY_INFO!B46=0,\" \",COUNTRY_INFO!B46)))","v":" "},{"$f":"IF(INTRO!$E$39<>\"Non endémique\", \" \", IF(INTRO!$E$37=\"Non endémique\",\" \", IF(COUNTRY_INFO!C46=0,\" \",COUNTRY_INFO!C46)))","v":" "},{"$f":"IF(INTRO!$E$39<>\"Non endémique\", 0, IF(INTRO!$E$37=\"Non endémique\",0,IF(COUNTRY_INFO!$H46=1,COUNTRY_INFO!E46,0)))","v":0},{"$f":"IF(INTRO!$E$39<>\"Non endémique\", 0, IF(INTRO!$E$37=\"Non endémique\",0,IF(COUNTRY_INFO!$H46=1,COUNTRY_INFO!F46,0)))","v":0},{"$f":"IF(INTRO!$E$39<>\"Non endémique\", 0, IF(INTRO!$E$37=\"Non endémique\",0,IF(COUNTRY_INFO!$H46=1,COUNTRY_INFO!G46,0)))","v":0},0,{"$f":"IF(INTRO!$E$39=\"Non endémique\",IF(INTRO!$E$37=\"Non endémique\",\"Non requis\",COUNTRY_INFO!V46),\"Traiter avec IVM\")","v":"Traiter avec IVM"},0,0,null,0]
[{"$f":"IF(INTRO!$E$39<>\"Non endémique\", \" \", IF(INTRO!$E$37=\"Non endémique\",\" \", IF(COUNTRY_INFO!A47=0,\" \",COUNTRY_INFO!A47)))","v":" "},{"$f":"IF(INTRO!$E$39<>\"Non endémique\", \" \", IF(INTRO!$E$37=\"Non endémique\",\" \", IF(COUNTRY_INFO!B47=0,\" \",COUNTRY_INFO!B47)))","v":" "},{"$f":"IF(INTRO!$E$39<>\"Non endémique\", \" \", IF(INTRO!$E$37=\"Non endémique\",\" \", IF(COUNTRY_INFO!C47=0,\" \",COUNTRY_INFO!C47)))","v":" "},{"$f":"IF(INTRO!$E$39<>\"Non endémique\", 0, IF(INTRO!$E$37=\"Non endémique\",0,IF(COUNTRY_INFO!$H47=1,COUNTRY_INFO!E47,0)))","v":0},{"$f":"IF(INTRO!$E$39<>\"Non endémique\", 0, IF(INTRO!$E$37=\"Non endémique\",0,IF(COUNTRY_INFO!$H47=1,COUNTRY_INFO!F47,0)))","v":0},{"$f":"IF(INTRO!$E$39<>\"Non endémique\", 0, IF(INTRO!$E$37=\"Non endémique\",0,IF(COUNTRY_INFO!$H47=1,COUNTRY_INFO!G47,0)))","v":0},0,{"$f":"IF(INTRO!$E$39=\"Non endémique\",IF(INTRO!$E$37=\"Non endémique\",\"Non requis\",COUNTRY_INFO!V47),\"Traiter avec IVM\")","v":"Traiter avec IVM"},0,0,null,0]
[{"$f":"IF(INTRO!$E$39<>\"Non endémique\", \" \", IF(INTRO!$E$37=\"Non endémique\",\" \", IF(COUNTRY_INFO!A48=0,\" \",COUNTRY_INFO!A48)))","v":" "},{"$f":"IF(INTRO!$E$39<>\"Non endémique\", \" \", IF(INTRO!$E$37=\"Non endémique\",\" \", IF(COUNTRY_INFO!B48=0,\" \",COUNTRY_INFO!B48)))","v":" "},{"$f":"IF(INTRO!$E$39<>\"Non endémique\", \" \", IF(INTRO!$E$37=\"Non endémique\",\" \", IF(COUNTRY_INFO!C48=0,\" \",COUNTRY_INFO!C48)))","v":" "},{"$f":"IF(INTRO!$E$39<>\"Non endémique\", 0, IF(INTRO!$E$37=\"Non endémique\",0,IF(COUNTRY_INFO!$H48=1,COUNTRY_INFO!E48,0)))","v":0},{"$f":"IF(INTRO!$E$39<>\"Non endémique\", 0, IF(INTRO!$E$37=\"Non endémique\",0,IF(COUNTRY_INFO!$H48=1,COUNTRY_INFO!F48,0)))","v":0},{"$f":"IF(INTRO!$E$39<>\"Non endémique\", 0, IF(INTRO!$E$37=\"Non endémique\",0,IF(COUNTRY_INFO!$H48=1,COUNTRY_INFO!G48,0)))","v":0},0,{"$f":"IF(INTRO!$E$39=\"Non endémique\",IF(INTRO!$E$37=\"Non endémique\",\"Non requis\",COUNTRY_INFO!V48),\"Traiter avec IVM\")","v":"Traiter avec IVM"},0,0,null,0]
[{"$f":"IF(INTRO!$E$39<>\"Non endémique\", \" \", IF(INTRO!$E$37=\"Non endémique\",\" \", IF(COUNTRY_INFO!A49=0,\" \",COUNTRY_INFO!A49)))","v":" "},{"$f":"IF(INTRO!$E$39<>\"Non endémique\", \" \", IF(INTRO!$E$37=\"Non endémique\",\" \", IF(COUNTRY_INFO!B49=0,\" \",COUNTRY_INFO!B49)))","v":" "},{"$f":"IF(INTRO!$E$39<>\"Non endémique\", \" \", IF(INTRO!$E$37=\"Non endémique\",\" \", IF(COUNTRY_INFO!C49=0,\" \",COUNTRY_INFO!C49)))","v":" "},{"$f":"IF(INTRO!$E$39<>\"Non endémique\", 0, IF(INTRO!$E$37=\"Non endémique\",0,IF(COUNTRY_INFO!$H49=1,COUNTRY_INFO!E49,0)))","v":0},{"$f":"IF(INTRO!$E$39<>\"Non endémique\", 0, IF(INTRO!$E$37=\"Non endémique\",0,IF(COUNTRY_INFO!$H49=1,COUNTRY_INFO!F49,0)))","v":0},{"$f":"IF(INTRO!$E$39<>\"Non endémique\", 0, IF(INTRO!$E$37=\"Non endémique\",0,IF(COUNTRY_INFO!$H49=1,COUNTRY_INFO!G49,0)))","v":0},0,{"$f":"IF(INTRO!$E$39=\"Non endémique\",IF(INTRO!$E$37=\"Non endémique\",\"Non requis\",COUNTRY_INFO!V49),\"Traiter avec IVM\")","v":"Traiter avec IVM"},0,0,null,0]
[{"$f":"IF(INTRO!$E$39<>\"Non endémique\", \" \", IF(INTRO!$E$37=\"Non endémique\",\" \", IF(COUNTRY_INFO!A50=0,\" \",COUNTRY_INFO!A50)))","v":" "},{"$f":"IF(INTRO!$E$39<>\"Non endémique\", \" \", IF(INTRO!$E$37=\"Non endémique\",\" \", IF(COUNTRY_INFO!B50=0,\" \",COUNTRY_INFO!B50)))","v":" "},{"$f":"IF(INTRO!$E$39<>\"Non endémique\", \" \", IF(INTRO!$E$37=\"Non endémique\",\" \", IF(COUNTRY_INFO!C50=0,\" \",COUNTRY_INFO!C50)))","v":" "},{"$f":"IF(INTRO!$E$39<>\"Non endémique\", 0, IF(INTRO!$E$37=\"Non endémique\",0,IF(COUNTRY_INFO!$H50=1,COUNTRY_INFO!E50,0)))","v":0},{"$f":"IF(INTRO!$E$39<>\"Non endémique\", 0, IF(INTRO!$E$37=\"Non endémique\",0,IF(COUNTRY_INFO!$H50=1,COUNTRY_INFO!F50,0)))","v":0},{"$f":"IF(INTRO!$E$39<>\"Non endémique\", 0, IF(INTRO!$E$37=\"Non endémique\",0,IF(COUNTRY_INFO!$H50=1,COUNTRY_INFO!G50,0)))","v":0},0,{"$f":"IF(INTRO!$E$39=\"Non endémique\",IF(INTRO!$E$37=\"Non endémique\",\"Non requis\",COUNTRY_INFO!V50),\"Traiter avec IVM\")","v":"Traiter avec IVM"},0,0,null,0]
[{"$f":"IF(INTRO!$E$39<>\"Non endémique\", \" \", IF(INTRO!$E$37=\"Non endémique\",\" \", IF(COUNTRY_INFO!A51=0,\" \",COUNTRY_INFO!A51)))","v":" "},{"$f":"IF(INTRO!$E$39<>\"Non endémique\", \" \", IF(INTRO!$E$37=\"Non endémique\",\" \", IF(COUNTRY_INFO!B51=0,\" \",COUNTRY_INFO!B51)))","v":" "},{"$f":"IF(INTRO!$E$39<>\"Non endémique\", \" \", IF(INTRO!$E$37=\"Non endémique\",\" \", IF(COUNTRY_INFO!C51=0,\" \",COUNTRY_INFO!C51)))","v":" "},{"$f":"IF(INTRO!$E$39<>\"Non endémique\", 0, IF(INTRO!$E$37=\"Non endémique\",0,IF(COUNTRY_INFO!$H51=1,COUNTRY_INFO!E51,0)))","v":0},{"$f":"IF(INTRO!$E$39<>\"Non endémique\", 0, IF(INTRO!$E$37=\"Non endémique\",0,IF(COUNTRY_INFO!$H51=1,COUNTRY_INFO!F51,0)))","v":0},{"$f":"IF(INTRO!$E$39<>\"Non endémique\", 0, IF(INTRO!$E$37=\"Non endémique\",0,IF(COUNTRY_INFO!$H51=1,COUNTRY_INFO!G51,0)))","v":0},0,{"$f":"IF(INTRO!$E$39=\"Non endémique\",IF(INTRO!$E$37=\"Non endémique\",\"Non requis\",COUNTRY_INFO!V51),\"Traiter avec IVM\")","v":"Traiter avec IVM"},0,0,null,0]
[{"$f":"IF(INTRO!$E$39<>\"Non endémique\", \" \", IF(INTRO!$E$37=\"Non endémique\",\" \", IF(COUNTRY_INFO!A52=0,\" \",COUNTRY_INFO!A52)))","v":" "},{"$f":"IF(INTRO!$E$39<>\"Non endémique\", \" \", IF(INTRO!$E$37=\"Non endémique\",\" \", IF(COUNTRY_INFO!B52=0,\" \",COUNTRY_INFO!B52)))","v":" "},{"$f":"IF(INTRO!$E$39<>\"Non endémique\", \" \", IF(INTRO!$E$37=\"Non endémique\",\" \", IF(COUNTRY_INFO!C52=0,\" \",COUNTRY_INFO!C52)))","v":" "},{"$f":"IF(INTRO!$E$39<>\"Non endémique\", 0, IF(INTRO!$E$37=\"Non endémique\",0,IF(COUNTRY_INFO!$H52=1,COUNTRY_INFO!E52,0)))","v":0},{"$f":"IF(INTRO!$E$39<>\"Non endémique\", 0, IF(INTRO!$E$37=\"Non endémique\",0,IF(COUNTRY_INFO!$H52=1,COUNTRY_INFO!F52,0)))","v":0},{"$f":"IF(INTRO!$E$39<>\"Non endémique\", 0, IF(INTRO!$E$37=\"Non endémique\",0,IF(COUNTRY_INFO!$H52=1,COUNTRY_INFO!G52,0)))","v":0},0,{"$f":"IF(INTRO!$E$39=\"Non endémique\",IF(INTRO!$E$37=\"Non endémique\",\"Non requis\",COUNTRY_INFO!V52),\"Traiter avec IVM\")","v":"Traiter avec IVM"},0,0,null,0]
[{"$f":"IF(INTRO!$E$39<>\"Non endémique\", \" \", IF(INTRO!$E$37=\"Non endémique\",\" \", IF(COUNTRY_INFO!A53=0,\" \",COUNTRY_INFO!A53)))","v":" "},{"$f":"IF(INTRO!$E$39<>\"Non endémique\", \" \", IF(INTRO!$E$37=\"Non endémique\",\" \", IF(COUNTRY_INFO!B53=0,\" \",COUNTRY_INFO!B53)))","v":" "},{"$f":"IF(INTRO!$E$39<>\"Non endémique\", \" \", IF(INTRO!$E$37=\"Non endémique\",\" \", IF(COUNTRY_INFO!C53=0,\" \",COUNTRY_INFO!C53)))","v":" "},{"$f":"IF(INTRO!$E$39<>\"Non endémique\", 0, IF(INTRO!$E$37=\"Non endémique\",0,IF(COUNTRY_INFO!$H53=1,COUNTRY_INFO!E53,0)))","v":0},{"$f":"IF(INTRO!$E$39<>\"Non endémique\", 0, IF(INTRO!$E$37=\"Non endémique\",0,IF(COUNTRY_INFO!$H53=1,COUNTRY_INFO!F53,0)))","v":0},{"$f":"IF(INTRO!$E$39<>\"Non endémique\", 0, IF(INTRO!$E$37=\"Non endémique\",0,IF(COUNTRY_INFO!$H53=1,COUNTRY_INFO!G53,0)))","v":0},0,{"$f":"IF(INTRO!$E$39=\"Non endémique\",IF(INTRO!$E$37=\"Non endémique\",\"Non requis\",COUNTRY_INFO!V53),\"Traiter avec IVM\")","v":"Traiter avec IVM"},0,0,null,0]
[{"$f":"IF(INTRO!$E$39<>\"Non endémique\", \" \", IF(INTRO!$E$37=\"Non endémique\",\" \", IF(COUNTRY_INFO!A54=0,\" \",COUNTRY_INFO!A54)))","v":" "},{"$f":"IF(INTRO!$E$39<>\"Non endémique\", \" \", IF(INTRO!$E$37=\"Non endémique\",\" \", IF(COUNTRY_INFO!B54=0,\" \",COUNTRY_INFO!B54)))","v":" "},{"$f":"IF(INTRO!$E$39<>\"Non endémique\", \" \", IF(INTRO!$E$37=\"Non endémique\",\" \", IF(COUNTRY_INFO!C54=0,\" \",COUNTRY_INFO!C54)))","v":" "},{"$f":"IF(INTRO!$E$39<>\"Non endémique\", 0, IF(INTRO!$E$37=\"Non endémique\",0,IF(COUNTRY_INFO!$H54=1,COUNTRY_INFO!E54,0)))","v":0},{"$f":"IF(INTRO!$E$39<>\"Non endémique\", 0, IF(INTRO!$E$37=\"Non endémique\",0,IF(COUNTRY_INFO!$H54=1,COUNTRY_INFO!F54,0)))","v":0},{"$f":"IF(INTRO!$E$39<>\"Non endémique\", 0, IF(INTRO!$E$37=\"Non endémique\",0,IF(COUNTRY_INFO!$H54=1,COUNTRY_INFO!G54,0)))","v":0},0,{"$f":"IF(INTRO!$E$39=\"Non endémique\",IF(INTRO!$E$37=\"Non endémique\",\"Non requis\",COUNTRY_INFO!V54),\"Traiter avec IVM\")","v":"Traiter avec IVM"},0,0,null,0]
[{"$f":"IF(INTRO!$E$39<>\"Non endémique\", \" \", IF(INTRO!$E$37=\"Non endémique\",\" \", IF(COUNTRY_INFO!A55=0,\" \",COUNTRY_INFO!A55)))","v":" "},{"$f":"IF(INTRO!$E$39<>\"Non endémique\", \" \", IF(INTRO!$E$37=\"Non endémique\",\" \", IF(COUNTRY_INFO!B55=0,\" \",COUNTRY_INFO!B55)))","v":" "},{"$f":"IF(INTRO!$E$39<>\"Non endémique\", \" \", IF(INTRO!$E$37=\"Non endémique\",\" \", IF(COUNTRY_INFO!C55=0,\" \",COUNTRY_INFO!C55)))","v":" "},{"$f":"IF(INTRO!$E$39<>\"Non endémique\", 0, IF(INTRO!$E$37=\"Non endémique\",0,IF(COUNTRY_INFO!$H55=1,COUNTRY_INFO!E55,0)))","v":0},{"$f":"IF(INTRO!$E$39<>\"Non endémique\", 0, IF(INTRO!$E$37=\"Non endémique\",0,IF(COUNTRY_INFO!$H55=1,COUNTRY_INFO!F55,0)))","v":0},{"$f":"IF(INTRO!$E$39<>\"Non endémique\", 0, IF(INTRO!$E$37=\"Non endémique\",0,IF(COUNTRY_INFO!$H55=1,COUNTRY_INFO!G55,0)))","v":0},0,{"$f":"IF(INTRO!$E$39=\"Non endémique\",IF(INTRO!$E$37=\"Non endémique\",\"Non requis\",COUNTRY_INFO!V55),\"Traiter avec IVM\")","v":"Traiter avec IVM"},0,0,null,0]
[{"$f":"IF(INTRO!$E$39<>\"Non endémique\", \" \", IF(INTRO!$E$37=\"Non endémique\",\" \", IF(COUNTRY_INFO!A56=0,\" \",COUNTRY_INFO!A56)))","v":" "},{"$f":"IF(INTRO!$E$39<>\"Non endémique\", \" \", IF(INTRO!$E$37=\"Non endémique\",\" \", IF(COUNTRY_INFO!B56=0,\" \",COUNTRY_INFO!B56)))","v":" "},{"$f":"IF(INTRO!$E$39<>\"Non endémique\", \" \", IF(INTRO!$E$37=\"Non endémique\",\" \", IF(COUNTRY_INFO!C56=0,\" \",COUNTRY_INFO!C56)))","v":" "},{"$f":"IF(INTRO!$E$39<>\"Non endémique\", 0, IF(INTRO!$E$37=\"Non endémique\",0,IF(COUNTRY_INFO!$H56=1,COUNTRY_INFO!E56,0)))","v":0},{"$f":"IF(INTRO!$E$39<>\"Non endémique\", 0, IF(INTRO!$E$37=\"Non endémique\",0,IF(COUNTRY_INFO!$H56=1,COUNTRY_INFO!F56,0)))","v":0},{"$f":"IF(INTRO!$E$39<>\"Non endémique\", 0, IF(INTRO!$E$37=\"Non endémique\",0,IF(COUNTRY_INFO!$H56=1,COUNTRY_INFO!G56,0)))","v":0},0,{"$f":"IF(INTRO!$E$39=\"Non endémique\",IF(INTRO!$E$37=\"Non endémique\",\"Non requis\",COUNTRY_INFO!V56),\"Traiter avec IVM\")","v":"Traiter avec IVM"},0,0,null,0]
[{"$f":"IF(INTRO!$E$39<>\"Non endémique\", \" \", IF(INTRO!$E$37=\"Non endémique\",\" \", IF(COUNTRY_INFO!A57=0,\" \",COUNTRY_INFO!A57)))","v":" "},{"$f":"IF(INTRO!$E$39<>\"Non endémique\", \" \", IF(INTRO!$E$37=\"Non endémique\",\" \", IF(COUNTRY_INFO!B57=0,\" \",COUNTRY_INFO!B57)))","v":" "},{"$f":"IF(INTRO!$E$39<>\"Non endémique\", \" \", IF(INTRO!$E$37=\"Non endémique\",\" \", IF(COUNTRY_INFO!C57=0,\" \",COUNTRY_INFO!C57)))","v":" "},{"$f":"IF(INTRO!$E$39<>\"Non endémique\", 0, IF(INTRO!$E$37=\"Non endémique\",0,IF(COUNTRY_INFO!$H57=1,COUNTRY_INFO!E57,0)))","v":0},{"$f":"IF(INTRO!$E$39<>\"Non endémique\", 0, IF(INTRO!$E$37=\"Non endémique\",0,IF(COUNTRY_INFO!$H57=1,COUNTRY_INFO!F57,0)))","v":0},{"$f":"IF(INTRO!$E$39<>\"Non endémique\", 0, IF(INTRO!$E$37=\"Non endémique\",0,IF(COUNTRY_INFO!$H57=1,COUNTRY_INFO!G57,0)))","v":0},0,{"$f":"IF(INTRO!$E$39=\"Non endémique\",IF(INTRO!$E$37=\"Non endémique\",\"Non requis\",COUNTRY_INFO!V57),\"Traiter avec IVM\")","v":"Traiter avec IVM"},0,0,null,0]
[{"$f":"IF(INTRO!$E$39<>\"Non endémique\", \" \", IF(INTRO!$E$37=\"Non endémique\",\" \", IF(COUNTRY_INFO!A58=0,\" \",COUNTRY_INFO!A58)))","v":" "},{"$f":"IF(INTRO!$E$39<>\"Non endémique\", \" \", IF(INTRO!$E$37=\"Non endémique\",\" \", IF(COUNTRY_INFO!B58=0,\" \",COUNTRY_INFO!B58)))","v":" "},{"$f":"IF(INTRO!$E$39<>\"Non endémique\", \" \", IF(INTRO!$E$37=\"Non endémique\",\" \", IF(COUNTRY_INFO!C58=0,\" \",COUNTRY_INFO!C58)))","v":" "},{"$f":"IF(INTRO!$E$39<>\"Non endémique\", 0, IF(INTRO!$E$37=\"Non endémique\",0,IF(COUNTRY_INFO!$H58=1,COUNTRY_INFO!E58,0)))","v":0},{"$f":"IF(INTRO!$E$39<>\"Non endémique\", 0, IF(INTRO!$E$37=\"Non endémique\",0,IF(COUNTRY_INFO!$H58=1,COUNTRY_INFO!F58,0)))","v":0},{"$f":"IF(INTRO!$E$39<>\"Non endémique\", 0, IF(INTRO!$E$37=\"Non endémique\",0,IF(COUNTRY_INFO!$H58=1,COUNTRY_INFO!G58,0)))","v":0},0,{"$f":"IF(INTRO!$E$39=\"Non endémique\",IF(INTRO!$E$37=\"Non endémique\",\"Non requis\",COUNTRY_INFO!V58),\"Traiter avec IVM\")","v":"Traiter avec IVM"},0,0,null,0]
[{"$f":"IF(INTRO!$E$39<>\"Non endémique\", \" \", IF(INTRO!$E$37=\"Non endémique\",\" \", IF(COUNTRY_INFO!A59=0,\" \",COUNTRY_INFO!A59)))","v":" "},{"$f":"IF(INTRO!$E$39<>\"Non endémique\", \" \", IF(INTRO!$E$37=\"Non endémique\",\" \", IF(COUNTRY_INFO!B59=0,\" \",COUNTRY_INFO!B59)))","v":" "},{"$f":"IF(INTRO!$E$39<>\"Non endémique\", \" \", IF(INTRO!$E$37=\"Non endémique\",\" \", IF(COUNTRY_INFO!C59=0,\" \",COUNTRY_INFO!C59)))","v":" "},{"$f":"IF(INTRO!$E$39<>\"Non endémique\", 0, IF(INTRO!$E$37=\"Non endémique\",0,IF(COUNTRY_INFO!$H59=1,COUNTRY_INFO!E59,0)))","v":0},{"$f":"IF(INTRO!$E$39<>\"Non endémique\", 0, IF(INTRO!$E$37=\"Non endémique\",0,IF(COUNTRY_INFO!$H59=1,COUNTRY_INFO!F59,0)))","v":0},{"$f":"IF(INTRO!$E$39<>\"Non endémique\", 0, IF(INTRO!$E$37=\"Non endémique\",0,IF(COUNTRY_INFO!$H59=1,COUNTRY_INFO!G59,0)))","v":0},0,{"$f":"IF(INTRO!$E$39=\"Non endémique\",IF(INTRO!$E$37=\"Non endémique\",\"Non requis\",COUNTRY_INFO!V59),\"Traiter avec IVM\")","v":"Traiter avec IVM"},0,0,null,0]
[{"$f":"IF(INTRO!$E$39<>\"Non endémique\", \" \", IF(INTRO!$E$37=\"Non endémique\",\" \", IF(COUNTRY_INFO!A60=0,\" \",COUNTRY_INFO!A60)))","v":" "},{"$f":"IF(INTRO!$E$39<>\"Non endémique\", \" \", IF(INTRO!$E$37=\"Non endémique\",\" \", IF(COUNTRY_INFO!B60=0,\" \",COUNTRY_INFO!B60)))","v":" "},{"$f":"IF(INTRO!$E$39<>\"Non endémique\", \" \", IF(INTRO!$E$37=\"Non endémique\",\" \", IF(COUNTRY_INFO!C60=0,\" \",COUNTRY_INFO!C60)))","v":" "},{"$f":"IF(INTRO!$E$39<>\"Non endémique\", 0, IF(INTRO!$E$37=\"Non endémique\",0,IF(COUNTRY_INFO!$H60=1,COUNTRY_INFO!E60,0)))","v":0},{"$f":"IF(INTRO!$E$39<>\"Non endémique\", 0, IF(INTRO!$E$37=\"Non endémique\",0,IF(COUNTRY_INFO!$H60=1,COUNTRY_INFO!F60,0)))","v":0},{"$f":"IF(INTRO!$E$39<>\"Non endémique\", 0, IF(INTRO!$E$37=\"Non endémique\",0,IF(COUNTRY_INFO!$H60=1,COUNTRY_INFO!G60,0)))","v":0},0,{"$f":"IF(INTRO!$E$39=\"Non endémique\",IF(INTRO!$E$37=\"Non endémique\",\"Non requis\",COUNTRY_INFO!V60),\"Traiter avec IVM\")","v":"Traiter avec IVM"},0,0,null,0]
[{"$f":"IF(INTRO!$E$39<>\"Non endémique\", \" \", IF(INTRO!$E$37=\"Non endémique\",\" \", IF(COUNTRY_INFO!A61=0,\" \",COUNTRY_INFO!A61)))","v":" "},{"$f":"IF(INTRO!$E$39<>\"Non endémique\", \" \", IF(INTRO!$E$37=\"Non endémique\",\" \", IF(COUNTRY_INFO!B61=0,\" \",COUNTRY_INFO!B61)))","v":" "},{"$f":"IF(INTRO!$E$39<>\"Non endémique\", \" \", IF(INTRO!$E$37=\"Non endémique\",\" \", IF(COUNTRY_INFO!C61=0,\" \",COUNTRY_INFO!C61)))","v":" "},{"$f":"IF(INTRO!$E$39<>\"Non endémique\", 0, IF(INTRO!$E$37=\"Non endémique\",0,IF(COUNTRY_INFO!$H61=1,COUNTRY_INFO!E61,0)))","v":0},{"$f":"IF(INTRO!$E$39<>\"Non endémique\", 0, IF(INTRO!$E$37=\"Non endémique\",0,IF(COUNTRY_INFO!$H61=1,COUNTRY_INFO!F61,0)))","v":0},{"$f":"IF(INTRO!$E$39<>\"Non endémique\", 0, IF(INTRO!$E$37=\"Non endémique\",0,IF(COUNTRY_INFO!$H61=1,COUNTRY_INFO!G61,0)))","v":0},0,{"$f":"IF(INTRO!$E$39=\"Non endémique\",IF(INTRO!$E$37=\"Non endémique\",\"Non requis\",COUNTRY_INFO!V61),\"Traiter avec IVM\")","v":"Traiter avec IVM"},0,0,null,0]
[{"$f":"IF(INTRO!$E$39<>\"Non endémique\", \" \", IF(INTRO!$E$37=\"Non endémique\",\" \", IF(COUNTRY_INFO!A62=0,\" \",COUNTRY_INFO!A62)))","v":" "},{"$f":"IF(INTRO!$E$39<>\"Non endémique\", \" \", IF(INTRO!$E$37=\"Non endémique\",\" \", IF(COUNTRY_INFO!B62=0,\" \",COUNTRY_INFO!B62)))","v":" "},{"$f":"IF(INTRO!$E$39<>\"Non endémique\", \" \", IF(INTRO!$E$37=\"Non endémique\",\" \", IF(COUNTRY_INFO!C62=0,\" \",COUNTRY_INFO!C62)))","v":" "},{"$f":"IF(INTRO!$E$39<>\"Non endémique\", 0, IF(INTRO!$E$37=\"Non endémique\",0,IF(COUNTRY_INFO!$H62=1,COUNTRY_INFO!E62,0)))","v":0},{"$f":"IF(INTRO!$E$39<>\"Non endémique\", 0, IF(INTRO!$E$37=\"Non endémique\",0,IF(COUNTRY_INFO!$H62=1,COUNTRY_INFO!F62,0)))","v":0},{"$f":"IF(INTRO!$E$39<>\"Non endémique\", 0, IF(INTRO!$E$37=\"Non endémique\",0,IF(COUNTRY_INFO!$H62=1,COUNTRY_INFO!G62,0)))","v":0},0,{"$f":"IF(INTRO!$E$39=\"Non endémique\",IF(INTRO!$E$37=\"Non endémique\",\"Non requis\",COUNTRY_INFO!V62),\"Traiter avec IVM\")","v":"Traiter avec IVM"},0,0,null,0]
[{"$f":"IF(INTRO!$E$39<>\"Non endémique\", \" \", IF(INTRO!$E$37=\"Non endémique\",\" \", IF(COUNTRY_INFO!A63=0,\" \",COUNTRY_INFO!A63)))","v":" "},{"$f":"IF(INTRO!$E$39<>\"Non endémique\", \" \", IF(INTRO!$E$37=\"Non endémique\",\" \", IF(COUNTRY_INFO!B63=0,\" \",COUNTRY_INFO!B63)))","v":" "},{"$f":"IF(INTRO!$E$39<>\"Non endémique\", \" \", IF(INTRO!$E$37=\"Non endémique\",\" \", IF(COUNTRY_INFO!C63=0,\" \",COUNTRY_INFO!C63)))","v":" "},{"$f":"IF(INTRO!$E$39<>\"Non endémique\", 0, IF(INTRO!$E$37=\"Non endémique\",0,IF(COUNTRY_INFO!$H63=1,COUNTRY_INFO!E63,0)))","v":0},{"$f":"IF(INTRO!$E$39<>\"Non endémique\", 0, IF(INTRO!$E$37=\"Non endémique\",0,IF(COUNTRY_INFO!$H63=1,COUNTRY_INFO!F63,0)))","v":0},{"$f":"IF(INTRO!$E$39<>\"Non endémique\", 0, IF(INTRO!$E$37=\"Non endémique\",0,IF(COUNTRY_INFO!$H63=1,COUNTRY_INFO!G63,0)))","v":0},0,{"$f":"IF(INTRO!$E$39=\"Non endémique\",IF(INTRO!$E$37=\"Non endémique\",\"Non requis\",COUNTRY_INFO!V63),\"Traiter avec IVM\")","v":"Traiter avec IVM"},0,0,null,0]
[{"$f":"IF(INTRO!$E$39<>\"Non endémique\", \" \", IF(INTRO!$E$37=\"Non endémique\",\" \", IF(COUNTRY_INFO!A64=0,\" \",COUNTRY_INFO!A64)))","v":" "},{"$f":"IF(INTRO!$E$39<>\"Non endémique\", \" \", IF(INTRO!$E$37=\"Non endémique\",\" \", IF(COUNTRY_INFO!B64=0,\" \",COUNTRY_INFO!B64)))","v":" "},{"$f":"IF(INTRO!$E$39<>\"Non endémique\", \" \", IF(INTRO!$E$37=\"Non endémique\",\" \", IF(COUNTRY_INFO!C64=0,\" \",COUNTRY_INFO!C64)))","v":" "},{"$f":"IF(INTRO!$E$39<>\"Non endémique\", 0, IF(INTRO!$E$37=\"Non endémique\",0,IF(COUNTRY_INFO!$H64=1,COUNTRY_INFO!E64,0)))","v":0},{"$f":"IF(INTRO!$E$39<>\"Non endémique\", 0, IF(INTRO!$E$37=\"Non endémique\",0,IF(COUNTRY_INFO!$H64=1,COUNTRY_INFO!F64,0)))","v":0},{"$f":"IF(INTRO!$E$39<>\"Non endémique\", 0, IF(INTRO!$E$37=\"Non endémique\",0,IF(COUNTRY_INFO!$H64=1,COUNTRY_INFO!G64,0)))","v":0},0,{"$f":"IF(INTRO!$E$39=\"Non endémique\",IF(INTRO!$E$37=\"Non endémique\",\"Non requis\",COUNTRY_INFO!V64),\"Traiter avec IVM\")","v":"Traiter avec IVM"},0,0,null,0]
[{"$f":"IF(INTRO!$E$39<>\"Non endémique\", \" \", IF(INTRO!$E$37=\"Non endémique\",\" \", IF(COUNTRY_INFO!A65=0,\" \",COUNTRY_INFO!A65)))","v":" "},{"$f":"IF(INTRO!$E$39<>\"Non endémique\", \" \", IF(INTRO!$E$37=\"Non endémique\",\" \", IF(COUNTRY_INFO!B65=0,\" \",COUNTRY_INFO!B65)))","v":" "},{"$f":"IF(INTRO!$E$39<>\"Non endémique\", \" \", IF(INTRO!$E$37=\"Non endémique\",\" \", IF(COUNTRY_INFO!C65=0,\" \",COUNTRY_INFO!C65)))","v":" "},{"$f":"IF(INTRO!$E$39<>\"Non endémique\", 0, IF(INTRO!$E$37=\"Non endémique\",0,IF(COUNTRY_INFO!$H65=1,COUNTRY_INFO!E65,0)))","v":0},{"$f":"IF(INTRO!$E$39<>\"Non endémique\", 0, IF(INTRO!$E$37=\"Non endémique\",0,IF(COUNTRY_INFO!$H65=1,COUNTRY_INFO!F65,0)))","v":0},{"$f":"IF(INTRO!$E$39<>\"Non endémique\", 0, IF(INTRO!$E$37=\"Non endémique\",0,IF(COUNTRY_INFO!$H65=1,COUNTRY_INFO!G65,0)))","v":0},0,{"$f":"IF(INTRO!$E$39=\"Non endémique\",IF(INTRO!$E$37=\"Non endémique\",\"Non requis\",COUNTRY_INFO!V65),\"Traiter avec IVM\")","v":"Traiter avec IVM"},0,0,null,0]
[{"$f":"IF(INTRO!$E$39<>\"Non endémique\", \" \", IF(INTRO!$E$37=\"Non endémique\",\" \", IF(COUNTRY_INFO!A66=0,\" \",COUNTRY_INFO!A66)))","v":" "},{"$f":"IF(INTRO!$E$39<>\"Non endémique\", \" \", IF(INTRO!$E$37=\"Non endémique\",\" \", IF(COUNTRY_INFO!B66=0,\" \",COUNTRY_INFO!B66)))","v":" "},{"$f":"IF(INTRO!$E$39<>\"Non endémique\", \" \", IF(INTRO!$E$37=\"Non endémique\",\" \", IF(COUNTRY_INFO!C66=0,\" \",COUNTRY_INFO!C66)))","v":" "},{"$f":"IF(INTRO!$E$39<>\"Non endémique\", 0, IF(INTRO!$E$37=\"Non endémique\",0,IF(COUNTRY_INFO!$H66=1,COUNTRY_INFO!E66,0)))","v":0},{"$f":"IF(INTRO!$E$39<>\"Non endémique\", 0, IF(INTRO!$E$37=\"Non endémique\",0,IF(COUNTRY_INFO!$H66=1,COUNTRY_INFO!F66,0)))","v":0},{"$f":"IF(INTRO!$E$39<>\"Non endémique\", 0, IF(INTRO!$E$37=\"Non endémique\",0,IF(COUNTRY_INFO!$H66=1,COUNTRY_INFO!G66,0)))","v":0},0,{"$f":"IF(INTRO!$E$39=\"Non endémique\",IF(INTRO!$E$37=\"Non endémique\",\"Non requis\",COUNTRY_INFO!V66),\"Traiter avec IVM\")","v":"Traiter avec IVM"},0,0,null,0]
[{"$f":"IF(INTRO!$E$39<>\"Non endémique\", \" \", IF(INTRO!$E$37=\"Non endémique\",\" \", IF(COUNTRY_INFO!A67=0,\" \",COUNTRY_INFO!A67)))","v":" "},{"$f":"IF(INTRO!$E$39<>\"Non endémique\", \" \", IF(INTRO!$E$37=\"Non endémique\",\" \", IF(COUNTRY_INFO!B67=0,\" \",COUNTRY_INFO!B67)))","v":" "},{"$f":"IF(INTRO!$E$39<>\"Non endémique\", \" \", IF(INTRO!$E$37=\"Non endémique\",\" \", IF(COUNTRY_INFO!C67=0,\" \",COUNTRY_INFO!C67)))","v":" "},{"$f":"IF(INTRO!$E$39<>\"Non endémique\", 0, IF(INTRO!$E$37=\"Non endémique\",0,IF(COUNTRY_INFO!$H67=1,COUNTRY_INFO!E67,0)))","v":0},{"$f":"IF(INTRO!$E$39<>\"Non endémique\", 0, IF(INTRO!$E$37=\"Non endémique\",0,IF(COUNTRY_INFO!$H67=1,COUNTRY_INFO!F67,0)))","v":0},{"$f":"IF(INTRO!$E$39<>\"Non endémique\", 0, IF(INTRO!$E$37=\"Non endémique\",0,IF(COUNTRY_INFO!$H67=1,COUNTRY_INFO!G67,0)))","v":0},0,{"$f":"IF(INTRO!$E$39=\"Non endémique\",IF(INTRO!$E$37=\"Non endémique\",\"Non requis\",COUNTRY_INFO!V67),\"Traiter avec IVM\")","v":"Traiter avec IVM"},0,0,null,0]
[{"$f":"IF(INTRO!$E$39<>\"Non endémique\", \" \", IF(INTRO!$E$37=\"Non endémique\",\" \", IF(COUNTRY_INFO!A68=0,\" \",COUNTRY_INFO!A68)))","v":" "},{"$f":"IF(INTRO!$E$39<>\"Non endémique\", \" \", IF(INTRO!$E$37=\"Non endémique\",\" \", IF(COUNTRY_INFO!B68=0,\" \",COUNTRY_INFO!B68)))","v":" "},{"$f":"IF(INTRO!$E$39<>\"Non endémique\", \" \", IF(INTRO!$E$37=\"Non endémique\",\" \", IF(COUNTRY_INFO!C68=0,\" \",COUNTRY_INFO!C68)))","v":" "},{"$f":"IF(INTRO!$E$39<>\"Non endémique\", 0, IF(INTRO!$E$37=\"Non endémique\",0,IF(COUNTRY_INFO!$H68=1,COUNTRY_INFO!E68,0)))","v":0},{"$f":"IF(INTRO!$E$39<>\"Non endémique\", 0, IF(INTRO!$E$37=\"Non endémique\",0,IF(COUNTRY_INFO!$H68=1,COUNTRY_INFO!F68,0)))","v":0},{"$f":"IF(INTRO!$E$39<>\"Non endémique\", 0, IF(INTRO!$E$37=\"Non endémique\",0,IF(COUNTRY_INFO!$H68=1,COUNTRY_INFO!G68,0)))","v":0},0,{"$f":"IF(INTRO!$E$39=\"Non endémique\",IF(INTRO!$E$37=\"Non endémique\",\"Non requis\",COUNTRY_INFO!V68),\"Traiter avec IVM\")","v":"Traiter avec IVM"},0,0,null,0]
[{"$f":"IF(INTRO!$E$39<>\"Non endémique\", \" \", IF(INTRO!$E$37=\"Non endémique\",\" \", IF(COUNTRY_INFO!A69=0,\" \",COUNTRY_INFO!A69)))","v":" "},{"$f":"IF(INTRO!$E$39<>\"Non endémique\", \" \", IF(INTRO!$E$37=\"Non endémique\",\" \", IF(COUNTRY_INFO!B69=0,\" \",COUNTRY_INFO!B69)))","v":" "},{"$f":"IF(INTRO!$E$39<>\"Non endémique\", \" \", IF(INTRO!$E$37=\"Non endémique\",\" \", IF(COUNTRY_INFO!C69=0,\" \",COUNTRY_INFO!C69)))","v":" "},{"$f":"IF(INTRO!$E$39<>\"Non endémique\", 0, IF(INTRO!$E$37=\"Non endémique\",0,IF(COUNTRY_INFO!$H69=1,COUNTRY_INFO!E69,0)))","v":0},{"$f":"IF(INTRO!$E$39<>\"Non endémique\", 0, IF(INTRO!$E$37=\"Non endémique\",0,IF(COUNTRY_INFO!$H69=1,COUNTRY_INFO!F69,0)))","v":0},{"$f":"IF(INTRO!$E$39<>\"Non endémique\", 0, IF(INTRO!$E$37=\"Non endémique\",0,IF(COUNTRY_INFO!$H69=1,COUNTRY_INFO!G69,0)))","v":0},0,{"$f":"IF(INTRO!$E$39=\"Non endémique\",IF(INTRO!$E$37=\"Non endémique\",\"Non requis\",COUNTRY_INFO!V69),\"Traiter avec IVM\")","v":"Traiter avec IVM"},0,0,null,0]
[{"$f":"IF(INTRO!$E$39<>\"Non endémique\", \" \", IF(INTRO!$E$37=\"Non endémique\",\" \", IF(COUNTRY_INFO!A70=0,\" \",COUNTRY_INFO!A70)))","v":" "},{"$f":"IF(INTRO!$E$39<>\"Non endémique\", \" \", IF(INTRO!$E$37=\"Non endémique\",\" \", IF(COUNTRY_INFO!B70=0,\" \",COUNTRY_INFO!B70)))","v":" "},{"$f":"IF(INTRO!$E$39<>\"Non endémique\", \" \", IF(INTRO!$E$37=\"Non endémique\",\" \", IF(COUNTRY_INFO!C70=0,\" \",COUNTRY_INFO!C70)))","v":" "},{"$f":"IF(INTRO!$E$39<>\"Non endémique\", 0, IF(INTRO!$E$37=\"Non endémique\",0,IF(COUNTRY_INFO!$H70=1,COUNTRY_INFO!E70,0)))","v":0},{"$f":"IF(INTRO!$E$39<>\"Non endémique\", 0, IF(INTRO!$E$37=\"Non endémique\",0,IF(COUNTRY_INFO!$H70=1,COUNTRY_INFO!F70,0)))","v":0},{"$f":"IF(INTRO!$E$39<>\"Non endémique\", 0, IF(INTRO!$E$37=\"Non endémique\",0,IF(COUNTRY_INFO!$H70=1,COUNTRY_INFO!G70,0)))","v":0},0,{"$f":"IF(INTRO!$E$39=\"Non endémique\",IF(INTRO!$E$37=\"Non endémique\",\"Non requis\",COUNTRY_INFO!V70),\"Traiter avec IVM\")","v":"Traiter avec IVM"},0,0,null,0]
[{"$f":"IF(INTRO!$E$39<>\"Non endémique\", \" \", IF(INTRO!$E$37=\"Non endémique\",\" \", IF(COUNTRY_INFO!A71=0,\" \",COUNTRY_INFO!A71)))","v":" "},{"$f":"IF(INTRO!$E$39<>\"Non endémique\", \" \", IF(INTRO!$E$37=\"Non endémique\",\" \", IF(COUNTRY_INFO!B71=0,\" \",COUNTRY_INFO!B71)))","v":" "},{"$f":"IF(INTRO!$E$39<>\"Non endémique\", \" \", IF(INTRO!$E$37=\"Non endémique\",\" \", IF(COUNTRY_INFO!C71=0,\" \",COUNTRY_INFO!C71)))","v":" "},{"$f":"IF(INTRO!$E$39<>\"Non endémique\", 0, IF(INTRO!$E$37=\"Non endémique\",0,IF(COUNTRY_INFO!$H71=1,COUNTRY_INFO!E71,0)))","v":0},{"$f":"IF(INTRO!$E$39<>\"Non endémique\", 0, IF(INTRO!$E$37=\"Non endémique\",0,IF(COUNTRY_INFO!$H71=1,COUNTRY_INFO!F71,0)))","v":0},{"$f":"IF(INTRO!$E$39<>\"Non endémique\", 0, IF(INTRO!$E$37=\"Non endémique\",0,IF(COUNTRY_INFO!$H71=1,COUNTRY_INFO!G71,0)))","v":0},0,{"$f":"IF(INTRO!$E$39=\"Non endémique\",IF(INTRO!$E$37=\"Non endémique\",\"Non requis\",COUNTRY_INFO!V71),\"Traiter avec IVM\")","v":"Traiter avec IVM"},0,0,null,0]
[{"$f":"IF(INTRO!$E$39<>\"Non endémique\", \" \", IF(INTRO!$E$37=\"Non endémique\",\" \", IF(COUNTRY_INFO!A72=0,\" \",COUNTRY_INFO!A72)))","v":" "},{"$f":"IF(INTRO!$E$39<>\"Non endémique\", \" \", IF(INTRO!$E$37=\"Non endémique\",\" \", IF(COUNTRY_INFO!B72=0,\" \",COUNTRY_INFO!B72)))","v":" "},{"$f":"IF(INTRO!$E$39<>\"Non endémique\", \" \", IF(INTRO!$E$37=\"Non endémique\",\" \", IF(COUNTRY_INFO!C72=0,\" \",COUNTRY_INFO!C72)))","v":" "},{"$f":"IF(INTRO!$E$39<>\"Non endémique\", 0, IF(INTRO!$E$37=\"Non endémique\",0,IF(COUNTRY_INFO!$H72=1,COUNTRY_INFO!E72,0)))","v":0},{"$f":"IF(INTRO!$E$39<>\"Non endémique\", 0, IF(INTRO!$E$37=\"Non endémique\",0,IF(COUNTRY_INFO!$H72=1,COUNTRY_INFO!F72,0)))","v":0},{"$f":"IF(INTRO!$E$39<>\"Non endémique\", 0, IF(INTRO!$E$37=\"Non endémique\",0,IF(COUNTRY_INFO!$H72=1,COUNTRY_INFO!G72,0)))","v":0},0,{"$f":"IF(INTRO!$E$39=\"Non endémique\",IF(INTRO!$E$37=\"Non endémique\",\"Non requis\",COUNTRY_INFO!V72),\"Traiter avec IVM\")","v":"Traiter avec IVM"},0,0,null,0]
[{"$f":"IF(INTRO!$E$39<>\"Non endémique\", \" \", IF(INTRO!$E$37=\"Non endémique\",\" \", IF(COUNTRY_INFO!A73=0,\" \",COUNTRY_INFO!A73)))","v":" "},{"$f":"IF(INTRO!$E$39<>\"Non endémique\", \" \", IF(INTRO!$E$37=\"Non endémique\",\" \", IF(COUNTRY_INFO!B73=0,\" \",COUNTRY_INFO!B73)))","v":" "},{"$f":"IF(INTRO!$E$39<>\"Non endémique\", \" \", IF(INTRO!$E$37=\"Non endémique\",\" \", IF(COUNTRY_INFO!C73=0,\" \",COUNTRY_INFO!C73)))","v":" "},{"$f":"IF(INTRO!$E$39<>\"Non endémique\", 0, IF(INTRO!$E$37=\"Non endémique\",0,IF(COUNTRY_INFO!$H73=1,COUNTRY_INFO!E73,0)))","v":0},{"$f":"IF(INTRO!$E$39<>\"Non endémique\", 0, IF(INTRO!$E$37=\"Non endémique\",0,IF(COUNTRY_INFO!$H73=1,COUNTRY_INFO!F73,0)))","v":0},{"$f":"IF(INTRO!$E$39<>\"Non endémique\", 0, IF(INTRO!$E$37=\"Non endémique\",0,IF(COUNTRY_INFO!$H73=1,COUNTRY_INFO!G73,0)))","v":0},0,{"$f":"IF(INTRO!$E$39=\"Non endémique\",IF(INTRO!$E$37=\"Non endémique\",\"Non requis\",COUNTRY_INFO!V73),\"Traiter avec IVM\")","v":"Traiter avec IVM"},0,0,null,0]
[{"$f":"IF(INTRO!$E$39<>\"Non endémique\", \" \", IF(INTRO!$E$37=\"Non endémique\",\" \", IF(COUNTRY_INFO!A74=0,\" \",COUNTRY_INFO!A74)))","v":" "},{"$f":"IF(INTRO!$E$39<>\"Non endémique\", \" \", IF(INTRO!$E$37=\"Non endémique\",\" \", IF(COUNTRY_INFO!B74=0,\" \",COUNTRY_INFO!B74)))","v":" "},{"$f":"IF(INTRO!$E$39<>\"Non endémique\", \" \", IF(INTRO!$E$37=\"Non endémique\",\" \", IF(COUNTRY_INFO!C74=0,\" \",COUNTRY_INFO!C74)))","v":" "},{"$f":"IF(INTRO!$E$39<>\"Non endémique\", 0, IF(INTRO!$E$37=\"Non endémique\",0,IF(COUNTRY_INFO!$H74=1,COUNTRY_INFO!E74,0)))","v":0},{"$f":"IF(INTRO!$E$39<>\"Non endémique\", 0, IF(INTRO!$E$37=\"Non endémique\",0,IF(COUNTRY_INFO!$H74=1,COUNTRY_INFO!F74,0)))","v":0},{"$f":"IF(INTRO!$E$39<>\"Non endémique\", 0, IF(INTRO!$E$37=\"Non endémique\",0,IF(COUNTRY_INFO!$H74=1,COUNTRY_INFO!G74,0)))","v":0},0,{"$f":"IF(INTRO!$E$39=\"Non endémique\",IF(INTRO!$E$37=\"Non endémique\",\"Non requis\",COUNTRY_INFO!V74),\"Traiter avec IVM\")","v":"Traiter avec IVM"},0,0,null,0]
[{"$f":"IF(INTRO!$E$39<>\"Non endémique\", \" \", IF(INTRO!$E$37=\"Non endémique\",\" \", IF(COUNTRY_INFO!A75=0,\" \",COUNTRY_INFO!A75)))","v":" "},{"$f":"IF(INTRO!$E$39<>\"Non endémique\", \" \", IF(INTRO!$E$37=\"Non endémique\",\" \", IF(COUNTRY_INFO!B75=0,\" \",COUNTRY_INFO!B75)))","v":" "},{"$f":"IF(INTRO!$E$39<>\"Non endémique\", \" \", IF(INTRO!$E$37=\"Non endémique\",\" \", IF(COUNTRY_INFO!C75=0,\" \",COUNTRY_INFO!C75)))","v":" "},{"$f":"IF(INTRO!$E$39<>\"Non endémique\", 0, IF(INTRO!$E$37=\"Non endémique\",0,IF(COUNTRY_INFO!$H75=1,COUNTRY_INFO!E75,0)))","v":0},{"$f":"IF(INTRO!$E$39<>\"Non endémique\", 0, IF(INTRO!$E$37=\"Non endémique\",0,IF(COUNTRY_INFO!$H75=1,COUNTRY_INFO!F75,0)))","v":0},{"$f":"IF(INTRO!$E$39<>\"Non endémique\", 0, IF(INTRO!$E$37=\"Non endémique\",0,IF(COUNTRY_INFO!$H75=1,COUNTRY_INFO!G75,0)))","v":0},{"$f":"SUM(D75:F75)","v":0},{"$f":"IF(INTRO!$E$39=\"Non endémique\",IF(INTRO!$E$37=\"Non endémique\",\"Non requis\",COUNTRY_INFO!V75),\"Traiter avec IVM\")","v":"Traiter avec IVM"},{"$f":"IF(H75=1,G75,0)","v":0},{"$f":"IF(I75>0,I75*2.5,0)","v":0},null,0]
[{"$f":"IF(INTRO!$E$39<>\"Non endémique\", \" \", IF(INTRO!$E$37=\"Non endémique\",\" \", IF(COUNTRY_INFO!A76=0,\" \",COUNTRY_INFO!A76)))","v":" "},{"$f":"IF(INTRO!$E$39<>\"Non endémique\", \" \", IF(INTRO!$E$37=\"Non endémique\",\" \", IF(COUNTRY_INFO!B76=0,\" \",COUNTRY_INFO!B76)))","v":" "},{"$f":"IF(INTRO!$E$39<>\"Non endémique\", \" \", IF(INTRO!$E$37=\"Non endémique\",\" \", IF(COUNTRY_INFO!C76=0,\" \",COUNTRY_INFO!C76)))","v":" "},{"$f":"IF(INTRO!$E$39<>\"Non endémique\", 0, IF(INTRO!$E$37=\"Non endémique\",0,IF(COUNTRY_INFO!$H76=1,COUNTRY_INFO!E76,0)))","v":0},{"$f":"IF(INTRO!$E$39<>\"Non endémique\", 0, IF(INTRO!$E$37=\"Non endémique\",0,IF(COUNTRY_INFO!$H76=1,COUNTRY_INFO!F76,0)))","v":0},{"$f":"IF(INTRO!$E$39<>\"Non endémique\", 0, IF(INTRO!$E$37=\"Non endémique\",0,IF(COUNTRY_INFO!$H76=1,COUNTRY_INFO!G76,0)))","v":0},0,{"$f":"IF(INTRO!$E$39=\"Non endémique\",IF(INTRO!$E$37=\"Non endémique\",\"Non requis\",COUNTRY_INFO!V76),\"Traiter avec IVM\")","v":"Traiter avec IVM"},0,0,null,0]
[{"$f":"IF(INTRO!$E$39<>\"Non endémique\", \" \", IF(INTRO!$E$37=\"Non endémique\",\" \", IF(COUNTRY_INFO!A77=0,\" \",COUNTRY_INFO!A77)))","v":" "},{"$f":"IF(INTRO!$E$39<>\"Non endémique\", \" \", IF(INTRO!$E$37=\"Non endémique\",\" \", IF(COUNTRY_INFO!B77=0,\" \",COUNTRY_INFO!B77)))","v":" "},{"$f":"IF(INTRO!$E$39<>\"Non endémique\", \" \", IF(INTRO!$E$37=\"Non endémique\",\" \", IF(COUNTRY_INFO!C77=0,\" \",COUNTRY_INFO!C77)))","v":" "},{"$f":"IF(INTRO!$E$39<>\"Non endémique\", 0, IF(INTRO!$E$37=\"Non endémique\",0,IF(COUNTRY_INFO!$H77=1,COUNTRY_INFO!E77,0)))","v":0},{"$f":"IF(INTRO!$E$39<>\"Non endémique\", 0, IF(INTRO!$E$37=\"Non endémique\",0,IF(COUNTRY_INFO!$H77=1,COUNTRY_INFO!F77,0)))","v":0},{"$f":"IF(INTRO!$E$39<>\"Non endémique\", 0, IF(INTRO!$E$37=\"Non endémique\",0,IF(COUNTRY_INFO!$H77=1,COUNTRY_INFO!G77,0)))","v":0},0,{"$f":"IF(INTRO!$E$39=\"Non endémique\",IF(INTRO!$E$37=\"Non endémique\",\"Non requis\",COUNTRY_INFO!V77),\"Traiter avec IVM\")","v":"Traiter avec IVM"},0,0,null,0]
[{"$f":"IF(INTRO!$E$39<>\"Non endémique\", \" \", IF(INTRO!$E$37=\"Non endémique\",\" \", IF(COUNTRY_INFO!A78=0,\" \",COUNTRY_INFO!A78)))","v":" "},{"$f":"IF(INTRO!$E$39<>\"Non endémique\", \" \", IF(INTRO!$E$37=\"Non endémique\",\" \", IF(COUNTRY_INFO!B78=0,\" \",COUNTRY_INFO!B78)))","v":" "},{"$f":"IF(INTRO!$E$39<>\"Non endémique\", \" \", IF(INTRO!$E$37=\"Non endémique\",\" \", IF(COUNTRY_INFO!C78=0,\" \",COUNTRY_INFO!C78)))","v":" "},{"$f":"IF(INTRO!$E$39<>\"Non endémique\", 0, IF(INTRO!$E$37=\"Non endémique\",0,IF(COUNTRY_INFO!$H78=1,COUNTRY_INFO!E78,0)))","v":0},{"$f":"IF(INTRO!$E$39<>\"Non endémique\", 0, IF(INTRO!$E$37=\"Non endémique\",0,IF(COUNTRY_INFO!$H78=1,COUNTRY_INFO!F78,0)))","v":0},{"$f":"IF(INTRO!$E$39<>\"Non endémique\", 0, IF(INTRO!$E$37=\"Non endémique\",0,IF(COUNTRY_INFO!$H78=1,COUNTRY_INFO!G78,0)))","v":0},0,{"$f":"IF(INTRO!$E$39=\"Non endémique\",IF(INTRO!$E$37=\"Non endémique\",\"Non requis\",COUNTRY_INFO!V78),\"Traiter avec IVM\")","v":"Traiter avec IVM"},0,0,null,0]
[{"$f":"IF(INTRO!$E$39<>\"Non endémique\", \" \", IF(INTRO!$E$37=\"Non endémique\",\" \", IF(COUNTRY_INFO!A79=0,\" \",COUNTRY_INFO!A79)))","v":" "},{"$f":"IF(INTRO!$E$39<>\"Non endémique\", \" \", IF(INTRO!$E$37=\"Non endémique\",\" \", IF(COUNTRY_INFO!B79=0,\" \",COUNTRY_INFO!B79)))","v":" "},{"$f":"IF(INTRO!$E$39<>\"Non endémique\", \" \", IF(INTRO!$E$37=\"Non endémique\",\" \", IF(COUNTRY_INFO!C79=0,\" \",COUNTRY_INFO!C79)))","v":" "},{"$f":"IF(INTRO!$E$39<>\"Non endémique\", 0, IF(INTRO!$E$37=\"Non endémique\",0,IF(COUNTRY_INFO!$H79=1,COUNTRY_INFO!E79,0)))","v":0},{"$f":"IF(INTRO!$E$39<>\"Non endémique\", 0, IF(INTRO!$E$37=\"Non endémique\",0,IF(COUNTRY_INFO!$H79=1,COUNTRY_INFO!F79,0)))","v":0},{"$f":"IF(INTRO!$E$39<>\"Non endémique\", 0, IF(INTRO!$E$37=\"Non endémique\",0,IF(COUNTRY_INFO!$H79=1,COUNTRY_INFO!G79,0)))","v":0},0,{"$f":"IF(INTRO!$E$39=\"Non endémique\",IF(INTRO!$E$37=\"Non endémique\",\"Non requis\",COUNTRY_INFO!V79),\"Traiter avec IVM\")","v":"Traiter avec IVM"},0,0,null,0]
[{"$f":"IF(INTRO!$E$39<>\"Non endémique\", \" \", IF(INTRO!$E$37=\"Non endémique\",\" \", IF(COUNTRY_INFO!A80=0,\" \",COUNTRY_INFO!A80)))","v":" "},{"$f":"IF(INTRO!$E$39<>\"Non endémique\", \" \", IF(INTRO!$E$37=\"Non endémique\",\" \", IF(COUNTRY_INFO!B80=0,\" \",COUNTRY_INFO!B80)))","v":" "},{"$f":"IF(INTRO!$E$39<>\"Non endémique\", \" \", IF(INTRO!$E$37=\"Non endémique\",\" \", IF(COUNTRY_INFO!C80=0,\" \",COUNTRY_INFO!C80)))","v":" "},{"$f":"IF(INTRO!$E$39<>\"Non endémique\", 0, IF(INTRO!$E$37=\"Non endémique\",0,IF(COUNTRY_INFO!$H80=1,COUNTRY_INFO!E80,0)))","v":0},{"$f":"IF(INTRO!$E$39<>\"Non endémique\", 0, IF(INTRO!$E$37=\"Non endémique\",0,IF(COUNTRY_INFO!$H80=1,COUNTRY_INFO!F80,0)))","v":0},{"$f":"IF(INTRO!$E$39<>\"Non endémique\", 0, IF(INTRO!$E$37=\"Non endémique\",0,IF(COUNTRY_INFO!$H80=1,COUNTRY_INFO!G80,0)))","v":0},0,{"$f":"IF(INTRO!$E$39=\"Non endémique\",IF(INTRO!$E$37=\"Non endémique\",\"Non requis\",COUNTRY_INFO!V80),\"Traiter avec IVM\")","v":"Traiter avec IVM"},0,0,null,0]
[{"$f":"IF(INTRO!$E$39<>\"Non endémique\", \" \", IF(INTRO!$E$37=\"Non endémique\",\" \", IF(COUNTRY_INFO!A81=0,\" \",COUNTRY_INFO!A81)))","v":" "},{"$f":"IF(INTRO!$E$39<>\"Non endémique\", \" \", IF(INTRO!$E$37=\"Non endémique\",\" \", IF(COUNTRY_INFO!B81=0,\" \",COUNTRY_INFO!B81)))","v":" "},{"$f":"IF(INTRO!$E$39<>\"Non endémique\", \" \", IF(INTRO!$E$37=\"Non endémique\",\" \", IF(COUNTRY_INFO!C81=0,\" \",COUNTRY_INFO!C81)))","v":" "},{"$f":"IF(INTRO!$E$39<>\"Non endémique\", 0, IF(INTRO!$E$37=\"Non endémique\",0,IF(COUNTRY_INFO!$H81=1,COUNTRY_INFO!E81,0)))","v":0},{"$f":"IF(INTRO!$E$39<>\"Non endémique\", 0, IF(INTRO!$E$37=\"Non endémique\",0,IF(COUNTRY_INFO!$H81=1,COUNTRY_INFO!F81,0)))","v":0},{"$f":"IF(INTRO!$E$39<>\"Non endémique\", 0, IF(INTRO!$E$37=\"Non endémique\",0,IF(COUNTRY_INFO!$H81=1,COUNTRY_INFO!G81,0)))","v":0},0,{"$f":"IF(INTRO!$E$39=\"Non endémique\",IF(INTRO!$E$37=\"Non endémique\",\"Non requis\",COUNTRY_INFO!V81),\"Traiter avec IVM\")","v":"Traiter avec IVM"},0,0,null,0]
[{"$f":"IF(INTRO!$E$39<>\"Non endémique\", \" \", IF(INTRO!$E$37=\"Non endémique\",\" \", IF(COUNTRY_INFO!A82=0,\" \",COUNTRY_INFO!A82)))","v":" "},{"$f":"IF(INTRO!$E$39<>\"Non endémique\", \" \", IF(INTRO!$E$37=\"Non endémique\",\" \", IF(COUNTRY_INFO!B82=0,\" \",COUNTRY_INFO!B82)))","v":" "},{"$f":"IF(INTRO!$E$39<>\"Non endémique\", \" \", IF(INTRO!$E$37=\"Non endémique\",\" \", IF(COUNTRY_INFO!C82=0,\" \",COUNTRY_INFO!C82)))","v":" "},{"$f":"IF(INTRO!$E$39<>\"Non endémique\", 0, IF(INTRO!$E$37=\"Non endémique\",0,IF(COUNTRY_INFO!$H82=1,COUNTRY_INFO!E82,0)))","v":0},{"$f":"IF(INTRO!$E$39<>\"Non endémique\", 0, IF(INTRO!$E$37=\"Non endémique\",0,IF(COUNTRY_INFO!$H82=1,COUNTRY_INFO!F82,0)))","v":0},{"$f":"IF(INTRO!$E$39<>\"Non endémique\", 0, IF(INTRO!$E$37=\"Non endémique\",0,IF(COUNTRY_INFO!$H82=1,COUNTRY_INFO!G82,0)))","v":0},0,{"$f":"IF(INTRO!$E$39=\"Non endémique\",IF(INTRO!$E$37=\"Non endémique\",\"Non requis\",COUNTRY_INFO!V82),\"Traiter avec IVM\")","v":"Traiter avec IVM"},0,0,null,0]
[{"$f":"IF(INTRO!$E$39<>\"Non endémique\", \" \", IF(INTRO!$E$37=\"Non endémique\",\" \", IF(COUNTRY_INFO!A83=0,\" \",COUNTRY_INFO!A83)))","v":" "},{"$f":"IF(INTRO!$E$39<>\"Non endémique\", \" \", IF(INTRO!$E$37=\"Non endémique\",\" \", IF(COUNTRY_INFO!B83=0,\" \",COUNTRY_INFO!B83)))","v":" "},{"$f":"IF(INTRO!$E$39<>\"Non endémique\", \" \", IF(INTRO!$E$37=\"Non endémique\",\" \", IF(COUNTRY_INFO!C83=0,\" \",COUNTRY_INFO!C83)))","v":" "},{"$f":"IF(INTRO!$E$39<>\"Non endémique\", 0, IF(INTRO!$E$37=\"Non endémique\",0,IF(COUNTRY_INFO!$H83=1,COUNTRY_INFO!E83,0)))","v":0},{"$f":"IF(INTRO!$E$39<>\"Non endémique\", 0, IF(INTRO!$E$37=\"Non endémique\",0,IF(COUNTRY_INFO!$H83=1,COUNTRY_INFO!F83,0)))","v":0},{"$f":"IF(INTRO!$E$39<>\"Non endémique\", 0, IF(INTRO!$E$37=\"Non endémique\",0,IF(COUNTRY_INFO!$H83=1,COUNTRY_INFO!G83,0)))","v":0},0,{"$f":"IF(INTRO!$E$39=\"Non endémique\",IF(INTRO!$E$37=\"Non endémique\",\"Non requis\",COUNTRY_INFO!V83),\"Traiter avec IVM\")","v":"Traiter avec IVM"},0,0,null,0]
[{"$f":"IF(INTRO!$E$39<>\"Non endémique\", \" \", IF(INTRO!$E$37=\"Non endémique\",\" \", IF(COUNTRY_INFO!A84=0,\" \",COUNTRY_INFO!A84)))","v":" "},{"$f":"IF(INTRO!$E$39<>\"Non endémique\", \" \", IF(INTRO!$E$37=\"Non endémique\",\" \", IF(COUNTRY_INFO!B84=0,\" \",COUNTRY_INFO!B84)))","v":" "},{"$f":"IF(INTRO!$E$39<>\"Non endémique\", \" \", IF(INTRO!$E$37=\"Non endémique\",\" \", IF(COUNTRY_INFO!C84=0,\" \",COUNTRY_INFO!C84)))","v":" "},{"$f":"IF(INTRO!$E$39<>\"Non endémique\", 0, IF(INTRO!$E$37=\"Non endémique\",0,IF(COUNTRY_INFO!$H84=1,COUNTRY_INFO!E84,0)))","v":0},{"$f":"IF(INTRO!$E$39<>\"Non endémique\", 0, IF(INTRO!$E$37=\"Non endémique\",0,IF(COUNTRY_INFO!$H84=1,COUNTRY_INFO!F84,0)))","v":0},{"$f":"IF(INTRO!$E$39<>\"Non endémique\", 0, IF(INTRO!$E$37=\"Non endémique\",0,IF(COUNTRY_INFO!$H84=1,COUNTRY_INFO!G84,0)))","v":0},0,{"$f":"IF(INTRO!$E$39=\"Non endémique\",IF(INTRO!$E$37=\"Non endémique\",\"Non requis\",COUNTRY_INFO!V84),\"Traiter avec IVM\")","v":"Traiter avec IVM"},0,0,null,0]
[{"$f":"IF(INTRO!$E$39<>\"Non endémique\", \" \", IF(INTRO!$E$37=\"Non endémique\",\" \", IF(COUNTRY_INFO!A85=0,\" \",COUNTRY_INFO!A85)))","v":" "},{"$f":"IF(INTRO!$E$39<>\"Non endémique\", \" \", IF(INTRO!$E$37=\"Non endémique\",\" \", IF(COUNTRY_INFO!B85=0,\" \",COUNTRY_INFO!B85)))","v":" "},{"$f":"IF(INTRO!$E$39<>\"Non endémique\", \" \", IF(INTRO!$E$37=\"Non endémique\",\" \", IF(COUNTRY_INFO!C85=0,\" \",COUNTRY_INFO!C85)))","v":" "},{"$f":"IF(INTRO!$E$39<>\"Non endémique\", 0, IF(INTRO!$E$37=\"Non endémique\",0,IF(COUNTRY_INFO!$H85=1,COUNTRY_INFO!E85,0)))","v":0},{"$f":"IF(INTRO!$E$39<>\"Non endémique\", 0, IF(INTRO!$E$37=\"Non endémique\",0,IF(COUNTRY_INFO!$H85=1,COUNTRY_INFO!F85,0)))","v":0},{"$f":"IF(INTRO!$E$39<>\"Non endémique\", 0, IF(INTRO!$E$37=\"Non endémique\",0,IF(COUNTRY_INFO!$H85=1,COUNTRY_INFO!G85,0)))","v":0},0,{"$f":"IF(INTRO!$E$39=\"Non endémique\",IF(INTRO!$E$37=\"Non endémique\",\"Non requis\",COUNTRY_INFO!V85),\"Traiter avec IVM\")","v":"Traiter avec IVM"},0,0,null,0]
[{"$f":"IF(INTRO!$E$39<>\"Non endémique\", \" \", IF(INTRO!$E$37=\"Non endémique\",\" \", IF(COUNTRY_INFO!A86=0,\" \",COUNTRY_INFO!A86)))","v":" "},{"$f":"IF(INTRO!$E$39<>\"Non endémique\", \" \", IF(INTRO!$E$37=\"Non endémique\",\" \", IF(COUNTRY_INFO!B86=0,\" \",COUNTRY_INFO!B86)))","v":" "},{"$f":"IF(INTRO!$E$39<>\"Non endémique\", \" \", IF(INTRO!$E$37=\"Non endémique\",\" \", IF(COUNTRY_INFO!C86=0,\" \",COUNTRY_INFO!C86)))","v":" "},{"$f":"IF(INTRO!$E$39<>\"Non endémique\", 0, IF(INTRO!$E$37=\"Non endémique\",0,IF(COUNTRY_INFO!$H86=1,COUNTRY_INFO!E86,0)))","v":0},{"$f":"IF(INTRO!$E$39<>\"Non endémique\", 0, IF(INTRO!$E$37=\"Non endémique\",0,IF(COUNTRY_INFO!$H86=1,COUNTRY_INFO!F86,0)))","v":0},{"$f":"IF(INTRO!$E$39<>\"Non endémique\", 0, IF(INTRO!$E$37=\"Non endémique\",0,IF(COUNTRY_INFO!$H86=1,COUNTRY_INFO!G86,0)))","v":0},0,{"$f":"IF(INTRO!$E$39=\"Non endémique\",IF(INTRO!$E$37=\"Non endémique\",\"Non requis\",COUNTRY_INFO!V86),\"Traiter avec IVM\")","v":"Traiter avec IVM"},0,0,null,0]
[{"$f":"IF(INTRO!$E$39<>\"Non endémique\", \" \", IF(INTRO!$E$37=\"Non endémique\",\" \", IF(COUNTRY_INFO!A87=0,\" \",COUNTRY_INFO!A87)))","v":" "},{"$f":"IF(INTRO!$E$39<>\"Non endémique\", \" \", IF(INTRO!$E$37=\"Non endémique\",\" \", IF(COUNTRY_INFO!B87=0,\" \",COUNTRY_INFO!B87)))","v":" "},{"$f":"IF(INTRO!$E$39<>\"Non endémique\", \" \", IF(INTRO!$E$37=\"Non endémique\",\" \", IF(COUNTRY_INFO!C87=0,\" \",COUNTRY_INFO!C87)))","v":" "},{"$f":"IF(INTRO!$E$39<>\"Non endémique\", 0, IF(INTRO!$E$37=\"Non endémique\",0,IF(COUNTRY_INFO!$H87=1,COUNTRY_INFO!E87,0)))","v":0},{"$f":"IF(INTRO!$E$39<>\"Non endémique\", 0, IF(INTRO!$E$37=\"Non endémique\",0,IF(COUNTRY_INFO!$H87=1,COUNTRY_INFO!F87,0)))","v":0},{"$f":"IF(INTRO!$E$39<>\"Non endémique\", 0, IF(INTRO!$E$37=\"Non endémique\",0,IF(COUNTRY_INFO!$H87=1,COUNTRY_INFO!G87,0)))","v":0},0,{"$f":"IF(INTRO!$E$39=\"Non endémique\",IF(INTRO!$E$37=\"Non endémique\",\"Non requis\",COUNTRY_INFO!V87),\"Traiter avec IVM\")","v":"Traiter avec IVM"},0,0,null,0]
[{"$f":"IF(INTRO!$E$39<>\"Non endémique\", \" \", IF(INTRO!$E$37=\"Non endémique\",\" \", IF(COUNTRY_INFO!A88=0,\" \",COUNTRY_INFO!A88)))","v":" "},{"$f":"IF(INTRO!$E$39<>\"Non endémique\", \" \", IF(INTRO!$E$37=\"Non endémique\",\" \", IF(COUNTRY_INFO!B88=0,\" \",COUNTRY_INFO!B88)))","v":" "},{"$f":"IF(INTRO!$E$39<>\"Non endémique\", \" \", IF(INTRO!$E$37=\"Non endémique\",\" \", IF(COUNTRY_INFO!C88=0,\" \",COUNTRY_INFO!C88)))","v":" "},{"$f":"IF(INTRO!$E$39<>\"Non endémique\", 0, IF(INTRO!$E$37=\"Non endémique\",0,IF(COUNTRY_INFO!$H88=1,COUNTRY_INFO!E88,0)))","v":0},{"$f":"IF(INTRO!$E$39<>\"Non endémique\", 0, IF(INTRO!$E$37=\"Non endémique\",0,IF(COUNTRY_INFO!$H88=1,COUNTRY_INFO!F88,0)))","v":0},{"$f":"IF(INTRO!$E$39<>\"Non endémique\", 0, IF(INTRO!$E$37=\"Non endémique\",0,IF(COUNTRY_INFO!$H88=1,COUNTRY_INFO!G88,0)))","v":0},0,{"$f":"IF(INTRO!$E$39=\"Non endémique\",IF(INTRO!$E$37=\"Non endémique\",\"Non requis\",COUNTRY_INFO!V88),\"Traiter avec IVM\")","v":"Traiter avec IVM"},0,0,null,0]

{"sheet":"ALB_MBD","index":3,"n_rows":88,"n_cols":21,"rows_kept":88,"cut":false,"hidden":false,"merged":[[6,9,6,10],[6,11,7,11],[0,6,0,10],[1,6,1,7],[1,9,1,10],[5,6,5,11],[6,6,6,7],[3,0,3,2],[3,3,3,4],[5,0,5,2],[5,3,5,4],[5,5,7,5],[6,0,7,0],[6,1,7,1],[6,2,7,2],[6,3,7,3],[6,4,7,4],[5,12,5,17],[6,20,7,20],[5,18,5,20],[6,18,7,18],[6,19,7,19],[6,16,7,16],[6,17,7,17],[6,15,7,15],[6,12,7,12],[6,13,7,13],[6,14,7,14]]}
["Albendazole (ALB) et Mebendazole (MBD)",null,null,null,null,null,"Choisir le médicament pour le traitement de STH \npour chaque groupe d'âge"]
["Structure administrative, population ciblée par groupe d'âge, plan de traitement et information sur les comprimés",null,null,null,null,null,null,null,"ALB"]
[]
["TOTAL",null,null,null,null,{"$f":"SUBTOTAL(9,F$10:F$1010)","v":445039},null,{"$f":"SUBTOTAL(9,H$10:H$1010)","v":450862},990999,null,918533,2360394,445039,0,445039,990999,0,990999,0,0,0]
[]
["Structure administrative du pays",null,null,"Plan de traitement",null,"Population couverte par le PEFL avec ALB","Population cible pour STH",null,null,null,null,null,"Albendazole (ALB)",null,null,null,null,null,"Mebendazole (MBD)"]
["Pays","Région/Département","District","FL","STH",null,"EAPréS",null,"EAS","FAP",null,"Total","Total requis (FL)","Reste en stock (FL)","Comprimés devant être fournis (FL)","Total requis (STH)","Reste en stock (STH)","Comprimés devant être fournis (STH)","Total requis","Reste en stock","Comprimés devant être fournis"]
[null,null,null,null,null,null,"Tournées","Personnes","Personnes","Tournées","Personnes"]
[]
[{"$f":"IF(AND(INTRO!$E$37=\"Non endémique\",INTRO!$E$41=\"Non endémique\"),\" \",IF(COUNTRY_INFO!A10=0,\" \",COUNTRY_INFO!A10))","v":"SENEGAL"},{"$f":"IF(AND(INTRO!$E$37=\"Non endémique\",INTRO!$E$41=\"Non endémique\"),\" \",IF(COUNTRY_INFO!B10=0,\" \",COUNTRY_INFO!B10))","v":"Dakar"},{"$f":"IF(AND(INTRO!$E$37=\"Non endémique\",INTRO!$E$41=\"Non endémique\"),\" \",IF(COUNTRY_INFO!C10=0,\" \",COUNTRY_INFO!C10))","v":"Dakar sud"},{"$f":"IF(AND(INTRO!$E$37=\"Non endémique\",INTRO!$E$41=\"Non endémique\"),0,COUNTRY_INFO!V10)","v":0},{"$f":"IF(AND(INTRO!$E$37=\"Non endémique\",INTRO!$E$41=\"Non endémique\"),0,COUNTRY_INFO!X10)","v":0},{"$f":"IF(INTRO!$E$39=\"Non endémique\",IF($D10=1,DEC!I10,0),IF($D10=1,IVM!G10,0))","v":0},null,{"$f":"IF(OR(COUNTRY_INFO!N10=\"Inconnu\",COUNTRY_INFO!N10=\"Surveillance\",COUNTRY_INFO!N10=\"Non requis\",COUNTRY_INFO!N10=0),0,IF(INTRO!$E$39=\"Non endémique\",IF(AND($E10<>0,$G10=\"\"),IF($F10=0,COUNTRY_INFO!N10*$E10,COUNTRY_INFO!N10*($E10-$D10)),IF(AND($E10<>0,$G10<>0),IF($F10=0,COUNTRY_INFO!N10*$G10,COUNTRY_INFO!N10*($G10-$D10)),0)),IF($G10=\"\",COUNTRY_INFO!N10*$E10,COUNTRY_INFO!N10*$G10)))","v":0},{"$f":"IF(OR(COUNTRY_INFO!O10=\"Inconnu\",COUNTRY_INFO!O10=\"Surveillance\",COUNTRY_INFO!O10=\"Non requis\",COUNTRY_INFO!O10=0),0,IF($E10<>0, IF($F10=0,COUNTRY_INFO!O10*$E10,COUNTRY_INFO!O10*($E10-$D10)),COUNTRY_INFO!O10*$E10))","v":0},null,{"$f":"IF(OR(COUNTRY_INFO!P10=\"Inconnu\",COUNTRY_INFO!P10=\"Surveillance\",COUNTRY_INFO!P10=\"Non requis\",COUNTRY_INFO!P10=0),0,IF(AND($E10<>0,$J10=\"\"),IF($F10=0,COUNTRY_INFO!P10*$E10,COUNTRY_INFO!P10*($E10-$D10)), IF(AND($E10<>0,$J10<>0),IF($F10=0,COUNTRY_INFO!P10*$J10,COUNTRY_INFO!P10*($J10-$D10)), COUNTRY_INFO!P10*$J10)))","v":0},{"$f":"ROUND($H10,0)+ROUND($I10,0)+ROUND($K10,0)","v":0},{"$f":"$F10","v":0},null,{"$f":"IF($M10>$N10, $M10-$N10,0)","v":0},{"$f":"ROUND((IF($G$2=\"ALB\",$H10,0)+IF($I$2=\"ALB\",$I10,0)+IF($J$2=\"ALB\",$K10,0)),0)","v":0},null,{"$f":"IF($P10>$Q10,$P10-$Q10,0)","v":0},{"$f":"ROUND((IF($G$2=\"MBD\",$H10,0)+IF($I$2=\"MBD\",$I10,0)+IF($J$2=\"MBD\",$K10,0)),0)","v":0},null,{"$f":"IF($S10>$T10,$S10-$T10,0)","v":0}]
[{"$f":"IF(AND(INTRO!$E$37=\"Non endémique\",INTRO!$E$41=\"Non endémique\"),\" \",IF(COUNTRY_INFO!A11=0,\" \",COUNTRY_INFO!A11))","v":"SENEGAL"},{"$f":"IF(AND(INTRO!$E$37=\"Non endémique\",INTRO!$E$41=\"Non endémique\"),\" \",IF(COUNTRY_INFO!B11=0,\" \",COUNTRY_INFO!B11))","v":"Dakar"},{"$f":"IF(AND(INTRO!$E$37=\"Non endémique\",INTRO!$E$41=\"Non endémique\"),\" \",IF(COUNTRY_INFO!C11=0,\" \",COUNTRY_INFO!C11))","v":"Dakar centre"},{"$f":"IF(AND(INTRO!$E$37=\"Non endémique\",INTRO!$E$41=\"Non endémique\"),0,COUNTRY_INFO!V11)","v":0},{"$f":"IF(AND(INTRO!$E$37=\"Non endémique\",INTRO!$E$41=\"Non endémique\"),0,COUNTRY_INFO!X11)","v":0},{"$f":"IF(INTRO!$E$39=\"Non endémique\",IF($D11=1,DEC!I11,0),IF($D11=1,IVM!G11,0))","v":0},null,{"$f":"IF(OR(COUNTRY_INFO!N11=\"Inconnu\",COUNTRY_INFO!N11=\"Surveillance\",COUNTRY_INFO!N11=\"Non requis\",COUNTRY_INFO!N11=0),0,IF(INTRO!$E$39=\"Non endémique\",IF(AND($E11<>0,$G11=\"\"),IF($F11=0,COUNTRY_INFO!N11*$E11,COUNTRY_INFO!N11*($E11-$D11)),IF(AND($E11<>0,$G11<>0),IF($F11=0,COUNTRY_INFO!N11*$G11,COUNTRY_INFO!N11*($G11-$D11)),0)),IF($G11=\"\",COUNTRY_INFO!N11*$E11,COUNTRY_INFO!N11*$G11)))","v":0},{"$f":"IF(OR(COUNTRY_INFO!O11=\"Inconnu\",COUNTRY_INFO!O11=\"Surveillance\",COUNTRY_INFO!O11=\"Non requis\",COUNTRY_INFO!O11=0),0,IF($E11<>0, IF($F11=0,COUNTRY_INFO!O11*$E11,COUNTRY_INFO!O11*($E11-$D11)),COUNTRY_INFO!O11*$E11))","v":0},null,{"$f":"IF(OR(COUNTRY_INFO!P11=\"Inconnu\",COUNTRY_INFO!P11=\"Surveillance\",COUNTRY_INFO!P11=\"Non requis\",COUNTRY_INFO!P11=0),0,IF(AND($E11<>0,$J11=\"\"),IF($F11=0,COUNTRY_INFO!P11*$E11,COUNTRY_INFO!P11*($E11-$D11)), IF(AND($E11<>0,$J11<>0),IF($F11=0,COUNTRY_INFO!P11*$J11,COUNTRY_INFO!P11*($J11-$D11)), COUNTRY_INFO!P11*$J11)))","v":0},0,0,null,0,0,null,0,0,null,0]
[{"$f":"IF(AND(INTRO!$E$37=\"Non endémique\",INTRO!$E$41=\"Non endémique\"),\" \",IF(COUNTRY_INFO!A12=0,\" \",COUNTRY_INFO!A12))","v":"SENEGAL"},{"$f":"IF(AND(INTRO!$E$37=\"Non endémique\",INTRO!$E$41=\"Non endémique\"),\" \",IF(COUNTRY_INFO!B12=0,\" \",COUNTRY_INFO!B12))","v":"Dakar"},{"$f":"IF(AND(INTRO!$E$37=\"Non endémique\",INTRO!$E$41=\"Non endémique\"),\" \",IF(COUNTRY_INFO!C12=0,\" \",COUNTRY_INFO!C12))","v":"Dakar ouest"},{"$f":"IF(AND(INTRO!$E$37=\"Non endémique\",INTRO!$E$41=\"Non endémique\"),0,COUNTRY_INFO!V12)","v":0},{"$f":"IF(AND(INTRO!$E$37=\"Non endémique\",INTRO!$E$41=\"Non endémique\"),0,COUNTRY_INFO!X12)","v":0},{"$f":"IF(INTRO!$E$39=\"Non endémique\",IF($D12=1,DEC!I12,0),IF($D12=1,IVM!G12,0))","v":0},null,{"$f":"IF(OR(COUNTRY_INFO!N12=\"Inconnu\",COUNTRY_INFO!N12=\"Surveillance\",COUNTRY_INFO!N12=\"Non requis\",COUNTRY_INFO!N12=0),0,IF(INTRO!$E$39=\"Non endémique\",IF(AND($E12<>0,$G12=\"\"),IF($F12=0,COUNTRY_INFO!N12*$E12,COUNTRY_INFO!N12*($E12-$D12)),IF(AND($E12<>0,$G12<>0),IF($F12=0,COUNTRY_INFO!N12*$G12,COUNTRY_INFO!N12*($G12-$D12)),0)),IF($G12=\"\",COUNTRY_INFO!N12*$E12,COUNTRY_INFO!N12*$G12)))","v":0},{"$f":"IF(OR(COUNTRY_INFO!O12=\"Inconnu\",COUNTRY_INFO!O12=\"Surveillance\",COUNTRY_INFO!O12=\"Non requis\",COUNTRY_INFO!O12=0),0,IF($E12<>0, IF($F12=0,COUNTRY_INFO!O12*$E12,COUNTRY_INFO!O12*($E12-$D12)),COUNTRY_INFO!O12*$E12))","v":0},null,{"$f":"IF(OR(COUNTRY_INFO!P12=\"Inconnu\",COUNTRY_INFO!P12=\"Surveillance\",COUNTRY_INFO!P12=\"Non requis\",COUNTRY_INFO!P12=0),0,IF(AND($E12<>0,$J12=\"\"),IF($F12=0,COUNTRY_INFO!P12*$E12,COUNTRY_INFO!P12*($E12-$D12)), IF(AND($E12<>0,$J12<>0),IF($F12=0,COUNTRY_INFO!P12*$J12,COUNTRY_INFO!P12*($J12-$D12)), COUNTRY_INFO!P12*$J12)))","v":0},0,0,null,0,0,null,0,0,null,0]
[{"$f":"IF(AND(INTRO!$E$37=\"Non endémique\",INTRO!$E$41=\"Non endémique\"),\" \",IF(COUNTRY_INFO!A13=0,\" \",COUNTRY_INFO!A13))","v":"SENEGAL"},{"$f":"IF(AND(INTRO!$E$37=\"Non endémique\",INTRO!$E$41=\"Non endémique\"),\" \",IF(COUNTRY_INFO!B13=0,\" \",COUNTRY_INFO!B13))","v":"Dakar"},{"$f":"IF(AND(INTRO!$E$37=\"Non endémique\",INTRO!$E$41=\"Non endémique\"),\" \",IF(COUNTRY_INFO!C13=0,\" \",COUNTRY_INFO!C13))","v":"Dakar nord"},{"$f":"IF(AND(INTRO!$E$37=\"Non endémique\",INTRO!$E$41=\"Non endémique\"),0,COUNTRY_INFO!V13)","v":0},{"$f":"IF(AND(INTRO!$E$37=\"Non endémique\",INTRO!$E$41=\"Non endémique\"),0,COUNTRY_INFO!X13)","v":0},{"$f":"IF(INTRO!$E$39=\"Non endémique\",IF($D13=1,DEC!I13,0),IF($D13=1,IVM!G13,0))","v":0},null,{"$f":"IF(OR(COUNTRY_INFO!N13=\"Inconnu\",COUNTRY_INFO!N13=\"Surveillance\",COUNTRY_INFO!N13=\"Non requis\",COUNTRY_INFO!N13=0),0,IF(INTRO!$E$39=\"Non endémique\",IF(AND($E13<>0,$G13=\"\"),IF($F13=0,COUNTRY_INFO!N13*$E13,COUNTRY_INFO!N13*($E13-$D13)),IF(AND($E13<>0,$G13<>0),IF($F13=0,COUNTRY_INFO!N13*$G13,COUNTRY_INFO!N13*($G13-$D13)),0)),IF($G13=\"\",COUNTRY_INFO!N13*$E13,COUNTRY_INFO!N13*$G13)))","v":0},{"$f":"IF(OR(COUNTRY_INFO!O13=\"Inconnu\",COUNTRY_INFO!O13=\"Surveillance\",COUNTRY_INFO!O13=\"Non requis\",COUNTRY_INFO!O13=0),0,IF($E13<>0, IF($F13=0,COUNTRY_INFO!O13*$E13,COUNTRY_INFO!O13*($E13-$D13)),COUNTRY_INFO!O13*$E13))","v":0},null,{"$f":"IF(OR(COUNTRY_INFO!P13=\"Inconnu\",COUNTRY_INFO!P13=\"Surveillance\",COUNTRY_INFO!P13=\"Non requis\",COUNTRY_INFO!P13=0),0,IF(AND($E13<>0,$J13=\"\"),IF($F13=0,COUNTRY_INFO!P13*$E13,COUNTRY_INFO!P13*($E13-$D13)), IF(AND($E13<>0,$J13<>0),IF($F13=0,COUNTRY_INFO!P13*$J13,COUNTRY_INFO!P13*($J13-$D13)), COUNTRY_INFO!P13*$J13)))","v":0},0,0,null,0,0,null,0,0,null,0]
[{"$f":"IF(AND(INTRO!$E$37=\"Non endémique\",INTRO!$E$41=\"Non endémique\"),\" \",IF(COUNTRY_INFO!A14=0,\" \",COUNTRY_INFO!A14))","v":"SENEGAL"},{"$f":"IF(AND(INTRO!$E$37=\"Non endémique\",INTRO!$E$41=\"Non endémique\"),\" \",IF(COUNTRY_INFO!B14=0,\" \",COUNTRY_INFO!B14))","v":"Dakar"},{"$f":"IF(AND(INTRO!$E$37=\"Non endémique\",INTRO!$E$41=\"Non endémique\"),\" \",IF(COUNTRY_INFO!C14=0,\" \",COUNTRY_INFO!C14))","v":"Guédiawaye"},{"$f":"IF(AND(INTRO!$E$37=\"Non endémique\",INTRO!$E$41=\"Non endémique\"),0,COUNTRY_INFO!V14)","v":0},{"$f":"IF(AND(INTRO!$E$37=\"Non endémique\",INTRO!$E$41=\"Non endémique\"),0,COUNTRY_INFO!X14)","v":1},{"$f":"IF(INTRO!$E$39=\"Non endémique\",IF($D14=1,DEC!I14,0),IF($D14=1,IVM!G14,0))","v":0},null,{"$f":"IF(OR(COUNTRY_INFO!N14=\"Inconnu\",COUNTRY_INFO!N14=\"Surveillance\",COUNTRY_INFO!N14=\"Non requis\",COUNTRY_INFO!N14=0),0,IF(INTRO!$E$39=\"Non endémique\",IF(AND($E14<>0,$G14=\"\"),IF($F14=0,COUNTRY_INFO!N14*$E14,COUNTRY_INFO!N14*($E14-$D14)),IF(AND($E14<>0,$G14<>0),IF($F14=0,COUNTRY_INFO!N14*$G14,COUNTRY_INFO!N14*($G14-$D14)),0)),IF($G14=\"\",COUNTRY_INFO!N14*$E14,COUNTRY_INFO!N14*$G14)))","v":54074},{"$f":"IF(OR(COUNTRY_INFO!O14=\"Inconnu\",COUNTRY_INFO!O14=\"Surveillance\",COUNTRY_INFO!O14=\"Non requis\",COUNTRY_INFO!O14=0),0,IF($E14<>0, IF($F14=0,COUNTRY_INFO!O14*$E14,COUNTRY_INFO!O14*($E14-$D14)),COUNTRY_INFO!O14*$E14))","v":118856},null,{"$f":"IF(OR(COUNTRY_INFO!P14=\"Inconnu\",COUNTRY_INFO!P14=\"Surveillance\",COUNTRY_INFO!P14=\"Non requis\",COUNTRY_INFO!P14=0),0,IF(AND($E14<>0,$J14=\"\"),IF($F14=0,COUNTRY_INFO!P14*$E14,COUNTRY_INFO!P14*($E14-$D14)), IF(AND($E14<>0,$J14<>0),IF($F14=0,COUNTRY_INFO!P14*$J14,COUNTRY_INFO!P14*($J14-$D14)), COUNTRY_INFO!P14*$J14)))","v":110165},283095,0,null,0,118856,null,118856,0,null,0]
[{"$f":"IF(AND(INTRO!$E$37=\"Non endémique\",INTRO!$E$41=\"Non endémique\"),\" \",IF(COUNTRY_INFO!A15=0,\" \",COUNTRY_INFO!A15))","v":"SENEGAL"},{"$f":"IF(AND(INTRO!$E$37=\"Non endémique\",INTRO!$E$41=\"Non endémique\"),\" \",IF(COUNTRY_INFO!B15=0,\" \",COUNTRY_INFO!B15))","v":"Dakar"},{"$f":"IF(AND(INTRO!$E$37=\"Non endémique\",INTRO!$E$41=\"Non endémique\"),\" \",IF(COUNTRY_INFO!C15=0,\" \",COUNTRY_INFO!C15))","v":"Pikine"},{"$f":"IF(AND(INTRO!$E$37=\"Non endémique\",INTRO!$E$41=\"Non endémique\"),0,COUNTRY_INFO!V15)","v":0},{"$f":"IF(AND(INTRO!$E$37=\"Non endémique\",INTRO!$E$41=\"Non endémique\"),0,COUNTRY_INFO!X15)","v":1},{"$f":"IF(INTRO!$E$39=\"Non endémique\",IF($D15=1,DEC!I15,0),IF($D15=1,IVM!G15,0))","v":0},null,{"$f":"IF(OR(COUNTRY_INFO!N15=\"Inconnu\",COUNTRY_INFO!N15=\"Surveillance\",COUNTRY_INFO!N15=\"Non requis\",COUNTRY_INFO!N15=0),0,IF(INTRO!$E$39=\"Non endémique\",IF(AND($E15<>0,$G15=\"\"),IF($F15=0,COUNTRY_INFO!N15*$E15,COUNTRY_INFO!N15*($E15-$D15)),IF(AND($E15<>0,$G15<>0),IF($F15=0,COUNTRY_INFO!N15*$G15,COUNTRY_INFO!N15*($G15-$D15)),0)),IF($G15=\"\",COUNTRY_INFO!N15*$E15,COUNTRY_INFO!N15*$G15)))","v":53913},{"$f":"IF(OR(COUNTRY_INFO!O15=\"Inconnu\",COUNTRY_INFO!O15=\"Surveillance\",COUNTRY_INFO!O15=\"Non requis\",COUNTRY_INFO!O15=0),0,IF($E15<>0, IF($F15=0,COUNTRY_INFO!O15*$E15,COUNTRY_INFO!O15*($E15-$D15)),COUNTRY_INFO!O15*$E15))","v":118501},null,{"$f":"IF(OR(COUNTRY_INFO!P15=\"Inconnu\",COUNTRY_INFO!P15=\"Surveillance\",COUNTRY_INFO!P15=\"Non requis\",COUNTRY_INFO!P15=0),0,IF(AND($E15<>0,$J15=\"\"),IF($F15=0,COUNTRY_INFO!P15*$E15,COUNTRY_INFO!P15*($E15-$D15)), IF(AND($E15<>0,$J15<>0),IF($F15=0,COUNTRY_INFO!P15*$J15,COUNTRY_INFO!P15*($J15-$D15)), COUNTRY_INFO!P15*$J15)))","v":109835},282249,0,null,0,118501,null,118501,0,null,0]
[{"$f":"IF(AND(INTRO!$E$37=\"Non endémique\",INTRO!$E$41=\"Non endémique\"),\" \",IF(COUNTRY_INFO!A16=0,\" \",COUNTRY_INFO!A16))","v":"SENEGAL"},{"$f":"IF(AND(INTRO!$E$37=\"Non endémique\",INTRO!$E$41=\"Non endémique\"),\" \",IF(COUNTRY_INFO!B16=0,\" \",COUNTRY_INFO!B16))","v":"Dakar"},{"$f":"IF(AND(INTRO!$E$37=\"Non endémique\",INTRO!$E$41=\"Non endémique\"),\" \",IF(COUNTRY_INFO!C16=0,\" \",COUNTRY_INFO!C16))","v":"Keur  Massar"},{"$f":"IF(AND(INTRO!$E$37=\"Non endémique\",INTRO!$E$41=\"Non endémique\"),0,COUNTRY_INFO!V16)","v":0},{"$f":"IF(AND(INTRO!$E$37=\"Non endémique\",INTRO!$E$41=\"Non endémique\"),0,COUNTRY_INFO!X16)","v":0},{"$f":"IF(INTRO!$E$39=\"Non endémique\",IF($D16=1,DEC!I16,0),IF($D16=1,IVM!G16,0))","v":0},null,{"$f":"IF(OR(COUNTRY_INFO!N16=\"Inconnu\",COUNTRY_INFO!N16=\"Surveillance\",COUNTRY_INFO!N16=\"Non requis\",COUNTRY_INFO!N16=0),0,IF(INTRO!$E$39=\"Non endémique\",IF(AND($E16<>0,$G16=\"\"),IF($F16=0,COUNTRY_INFO!N16*$E16,COUNTRY_INFO!N16*($E16-$D16)),IF(AND($E16<>0,$G16<>0),IF($F16=0,COUNTRY_INFO!N16*$G16,COUNTRY_INFO!N16*($G16-$D16)),0)),IF($G16=\"\",COUNTRY_INFO!N16*$E16,COUNTRY_INFO!N16*$G16)))","v":0},{"$f":"IF(OR(COUNTRY_INFO!O16=\"Inconnu\",COUNTRY_INFO!O16=\"Surveillance\",COUNTRY_INFO!O16=\"Non requis\",COUNTRY_INFO!O16=0),0,IF($E16<>0, IF($F16=0,COUNTRY_INFO!O16*$E16,COUNTRY_INFO!O16*($E16-$D16)),COUNTRY_INFO!O16*$E16))","v":0},null,{"$f":"IF(OR(COUNTRY_INFO!P16=\"Inconnu\",COUNTRY_INFO!P16=\"Surveillance\",COUNTRY_INFO!P16=\"Non requis\",COUNTRY_INFO!P16=0),0,IF(AND($E16<>0,$J16=\"\"),IF($F16=0,COUNTRY_INFO!P16*$E16,COUNTRY_INFO!P16*($E16-$D16)), IF(AND($E16<>0,$J16<>0),IF($F16=0,COUNTRY_INFO!P16*$J16,COUNTRY_INFO!P16*($J16-$D16)), COUNTRY_INFO!P16*$J16)))","v":0},0,0,null,0,0,null,0,0,null,0]
[{"$f":"IF(AND(INTRO!$E$37=\"Non endémique\",INTRO!$E$41=\"Non endémique\"),\" \",IF(COUNTRY_INFO!A17=0,\" \",COUNTRY_INFO!A17))","v":"SENEGAL"},{"$f":"IF(AND(INTRO!$E$37=\"Non endémique\",INTRO!$E$41=\"Non endémique\"),\" \",IF(COUNTRY_INFO!B17=0,\" \",COUNTRY_INFO!B17))","v":"Dakar"},{"$f":"IF(AND(INTRO!$E$37=\"Non endémique\",INTRO!$E$41=\"Non endémique\"),\" \",IF(COUNTRY_INFO!C17=0,\" \",COUNTRY_INFO!C17))","v":"Yeumbeul"},{"$f":"IF(AND(INTRO!$E$37=\"Non endémique\",INTRO!$E$41=\"Non endémique\"),0,COUNTRY_INFO!V17)","v":0},{"$f":"IF(AND(INTRO!$E$37=\"Non endémique\",INTRO!$E$41=\"Non endémique\"),0,COUNTRY_INFO!X17)","v":0},{"$f":"IF(INTRO!$E$39=\"Non endémique\",IF($D17=1,DEC!I17,0),IF($D17=1,IVM!G17,0))","v":0},null,{"$f":"IF(OR(COUNTRY_INFO!N17=\"Inconnu\",COUNTRY_INFO!N17=\"Surveillance\",COUNTRY_INFO!N17=\"Non requis\",COUNTRY_INFO!N17=0),0,IF(INTRO!$E$39=\"Non endémique\",IF(AND($E17<>0,$G17=\"\"),IF($F17=0,COUNTRY_INFO!N17*$E17,COUNTRY_INFO!N17*($E17-$D17)),IF(AND($E17<>0,$G17<>0),IF($F17=0,COUNTRY_INFO!N17*$G17,COUNTRY_INFO!N17*($G17-$D17)),0)),IF($G17=\"\",COUNTRY_INFO!N17*$E17,COUNTRY_INFO!N17*$G17)))","v":0},{"$f":"IF(OR(COUNTRY_INFO!O17=\"Inconnu\",COUNTRY_INFO!O17=\"Surveillance\",COUNTRY_INFO!O17=\"Non requis\",COUNTRY_INFO!O17=0),0,IF($E17<>0, IF($F17=0,COUNTRY_INFO!O17*$E17,COUNTRY_INFO!O17*($E17-$D17)),COUNTRY_INFO!O17*$E17))","v":0},null,{"$f":"IF(OR(COUNTRY_INFO!P17=\"Inconnu\",COUNTRY_INFO!P17=\"Surveillance\",COUNTRY_INFO!P17=\"Non requis\",COUNTRY_INFO!P17=0),0,IF(AND($E17<>0,$J17=\"\"),IF($F17=0,COUNTRY_INFO!P17*$E17,COUNTRY_INFO!P17*($E17-$D17)), IF(AND($E17<>0,$J17<>0),IF($F17=0,COUNTRY_INFO!P17*$J17,COUNTRY_INFO!P17*($J17-$D17)), COUNTRY_INFO!P17*$J17)))","v":0},0,0,null,0,0,null,0,0,null,0]
[{"$f":"IF(AND(INTRO!$E$37=\"Non endémique\",INTRO!$E$41=\"Non endémique\"),\" \",IF(COUNTRY_INFO!A18=0,\" \",COUNTRY_INFO!A18))","v":"SENEGAL"},{"$f":"IF(AND(INTRO!$E$37=\"Non endémique\",INTRO!$E$41=\"Non endémique\"),\" \",IF(COUNTRY_INFO!B18=0,\" \",COUNTRY_INFO!B18))","v":"Dakar"},{"$f":"IF(AND(INTRO!$E$37=\"Non endémique\",INTRO!$E$41=\"Non endémique\"),\" \",IF(COUNTRY_INFO!C18=0,\" \",COUNTRY_INFO!C18))","v":"Mbao"},{"$f":"IF(AND(INTRO!$E$37=\"Non endémique\",INTRO!$E$41=\"Non endémique\"),0,COUNTRY_INFO!V18)","v":0},{"$f":"IF(AND(INTRO!$E$37=\"Non endémique\",INTRO!$E$41=\"Non endémique\"),0,COUNTRY_INFO!X18)","v":1},{"$f":"IF(INTRO!$E$39=\"Non endémique\",IF($D18=1,DEC!I18,0),IF($D18=1,IVM!G18,0))","v":0},null,{"$f":"IF(OR(COUNTRY_INFO!N18=\"Inconnu\",COUNTRY_INFO!N18=\"Surveillance\",COUNTRY_INFO!N18=\"Non requis\",COUNTRY_INFO!N18=0),0,IF(INTRO!$E$39=\"Non endémique\",IF(AND($E18<>0,$G18=\"\"),IF($F18=0,COUNTRY_INFO!N18*$E18,COUNTRY_INFO!N18*($E18-$D18)),IF(AND($E18<>0,$G18<>0),IF($F18=0,COUNTRY_INFO!N18*$G18,COUNTRY_INFO!N18*($G18-$D18)),0)),IF($G18=\"\",COUNTRY_INFO!N18*$E18,COUNTRY_INFO!N18*$G18)))","v":56263},{"$f":"IF(OR(COUNTRY_INFO!O18=\"Inconnu\",COUNTRY_INFO!O18=\"Surveillance\",COUNTRY_INFO!O18=\"Non requis\",COUNTRY_INFO!O18=0),0,IF($E18<>0, IF($F18=0,COUNTRY_INFO!O18*$E18,COUNTRY_INFO!O18*($E18-$D18)),COUNTRY_INFO!O18*$E18))","v":123666},null,{"$f":"IF(OR(COUNTRY_INFO!P18=\"Inconnu\",COUNTRY_INFO!P18=\"Surveillance\",COUNTRY_INFO!P18=\"Non requis\",COUNTRY_INFO!P18=0),0,IF(AND($E18<>0,$J18=\"\"),IF($F18=0,COUNTRY_INFO!P18*$E18,COUNTRY_INFO!P18*($E18-$D18)), IF(AND($E18<>0,$J18<>0),IF($F18=0,COUNTRY_INFO!P18*$J18,COUNTRY_INFO!P18*($J18-$D18)), COUNTRY_INFO!P18*$J18)))","v":114623},294552,0,null,0,123666,null,123666,0,null,0]
[{"$f":"IF(AND(INTRO!$E$37=\"Non endémique\",INTRO!$E$41=\"Non endémique\"),\" \",IF(COUNTRY_INFO!A19=0,\" \",COUNTRY_INFO!A19))","v":"SENEGAL"},{"$f":"IF(AND(INTRO!$E$37=\"Non endémique\",INTRO!$E$41=\"Non endémique\"),\" \",IF(COUNTRY_INFO!B19=0,\" \",COUNTRY_INFO!B19))","v":"Dakar"},{"$f":"IF(AND(INTRO!$E$37=\"Non endémique\",INTRO!$E$41=\"Non endémique\"),\" \",IF(COUNTRY_INFO!C19=0,\" \",COUNTRY_INFO!C19))","v":"Diamniadio"},{"$f":"IF(AND(INTRO!$E$37=\"Non endémique\",INTRO!$E$41=\"Non endémique\"),0,COUNTRY_INFO!V19)","v":0},{"$f":"IF(AND(INTRO!$E$37=\"Non endémique\",INTRO!$E$41=\"Non endémique\"),0,COUNTRY_INFO!X19)","v":0},{"$f":"IF(INTRO!$E$39=\"Non endémique\",IF($D19=1,DEC!I19,0),IF($D19=1,IVM!G19,0))","v":0},null,{"$f":"IF(OR(COUNTRY_INFO!N19=\"Inconnu\",COUNTRY_INFO!N19=\"Surveillance\",COUNTRY_INFO!N19=\"Non requis\",COUNTRY_INFO!N19=0),0,IF(INTRO!$E$39=\"Non endémique\",IF(AND($E19<>0,$G19=\"\"),IF($F19=0,COUNTRY_INFO!N19*$E19,COUNTRY_INFO!N19*($E19-$D19)),IF(AND($E19<>0,$G19<>0),IF($F19=0,COUNTRY_INFO!N19*$G19,COUNTRY_INFO!N19*($G19-$D19)),0)),IF($G19=\"\",COUNTRY_INFO!N19*$E19,COUNTRY_INFO!N19*$G19)))","v":0},{"$f":"IF(OR(COUNTRY_INFO!O19=\"Inconnu\",COUNTRY_INFO!O19=\"Surveillance\",COUNTRY_INFO!O19=\"Non requis\",COUNTRY_INFO!O19=0),0,IF($E19<>0, IF($F19=0,COUNTRY_INFO!O19*$E19,COUNTRY_INFO!O19*($E19-$D19)),COUNTRY_INFO!O19*$E19))","v":0},null,{"$f":"IF(OR(COUNTRY_INFO!P19=\"Inconnu\",COUNTRY_INFO!P19=\"Surveillance\",COUNTRY_INFO!P19=\"Non requis\",COUNTRY_INFO!P19=0),0,IF(AND($E19<>0,$J19=\"\"),IF($F19=0,COUNTRY_INFO!P19*$E19,COUNTRY_INFO!P19*($E19-$D19)), IF(AND($E19<>0,$J19<>0),IF($F19=0,COUNTRY_INFO!P19*$J19,COUNTRY_INFO!P19*($J19-$D19)), COUNTRY_INFO!P19*$J19)))","v":0},0,0,null,0,0,null,0,0,null,0]
[{"$f":"IF(AND(INTRO!$E$37=\"Non endémique\",INTRO!$E$41=\"Non endémique\"),\" \",IF(COUNTRY_INFO!A20=0,\" \",COUNTRY_INFO!A20))","v":"SENEGAL"},{"$f":"IF(AND(INTRO!$E$37=\"Non endémique\",INTRO!$E$41=\"Non endémique\"),\" \",IF(COUNTRY_INFO!B20=0,\" \",COUNTRY_INFO!B20))","v":"Dakar"},{"$f":"IF(AND(INTRO!$E$37=\"Non endémique\",INTRO!$E$41=\"Non endémique\"),\" \",IF(COUNTRY_INFO!C20=0,\" \",COUNTRY_INFO!C20))","v":"Sangalkam"},{"$f":"IF(AND(INTRO!$E$37=\"Non endémique\",INTRO!$E$41=\"Non endémique\"),0,COUNTRY_INFO!V20)","v":0},{"$f":"IF(AND(INTRO!$E$37=\"Non endémique\",INTRO!$E$41=\"Non endémique\"),0,COUNTRY_INFO!X20)","v":1},{"$f":"IF(INTRO!$E$39=\"Non endémique\",IF($D20=1,DEC!I20,0),IF($D20=1,IVM!G20,0))","v":0},null,{"$f":"IF(OR(COUNTRY_INFO!N20=\"Inconnu\",COUNTRY_INFO!N20=\"Surveillance\",COUNTRY_INFO!N20=\"Non requis\",COUNTRY_INFO!N20=0),0,IF(INTRO!$E$39=\"Non endémique\",IF(AND($E20<>0,$G20=\"\"),IF($F20=0,COUNTRY_INFO!N20*$E20,COUNTRY_INFO!N20*($E20-$D20)),IF(AND($E20<>0,$G20<>0),IF($F20=0,COUNTRY_INFO!N20*$G20,COUNTRY_INFO!N20*($G20-$D20)),0)),IF($G20=\"\",COUNTRY_INFO!N20*$E20,COUNTRY_INFO!N20*$G20)))","v":22894},{"$f":"IF(OR(COUNTRY_INFO!O20=\"Inconnu\",COUNTRY_INFO!O20=\"Surveillance\",COUNTRY_INFO!O20=\"Non requis\",COUNTRY_INFO!O20=0),0,IF($E20<>0, IF($F20=0,COUNTRY_INFO!O20*$E20,COUNTRY_INFO!O20*($E20-$D20)),COUNTRY_INFO!O20*$E20))","v":50321},null,{"$f":"IF(OR(COUNTRY_INFO!P20=\"Inconnu\",COUNTRY_INFO!P20=\"Surveillance\",COUNTRY_INFO!P20=\"Non requis\",COUNTRY_INFO!P20=0),0,IF(AND($E20<>0,$J20=\"\"),IF($F20=0,COUNTRY_INFO!P20*$E20,COUNTRY_INFO!P20*($E20-$D20)), IF(AND($E20<>0,$J20<>0),IF($F20=0,COUNTRY_INFO!P20*$J20,COUNTRY_INFO!P20*($J20-$D20)), COUNTRY_INFO!P20*$J20)))","v":46642},119857,0,null,0,50321,null,50321,0,null,0]
[{"$f":"IF(AND(INTRO!$E$37=\"Non endémique\",INTRO!$E$41=\"Non endémique\"),\" \",IF(COUNTRY_INFO!A21=0,\" \",COUNTRY_INFO!A21))","v":"SENEGAL"},{"$f":"IF(AND(INTRO!$E$37=\"Non endémique\",INTRO!$E$41=\"Non endémique\"),\" \",IF(COUNTRY_INFO!B21=0,\" \",COUNTRY_INFO!B21))","v":"Dakar"},{"$f":"IF(AND(INTRO!$E$37=\"Non endémique\",INTRO!$E$41=\"Non endémique\"),\" \",IF(COUNTRY_INFO!C21=0,\" \",COUNTRY_INFO!C21))","v":"Rufisque"},{"$f":"IF(AND(INTRO!$E$37=\"Non endémique\",INTRO!$E$41=\"Non endémique\"),0,COUNTRY_INFO!V21)","v":0},{"$f":"IF(AND(INTRO!$E$37=\"Non endémique\",INTRO!$E$41=\"Non endémique\"),0,COUNTRY_INFO!X21)","v":1},{"$f":"IF(INTRO!$E$39=\"Non endémique\",IF($D21=1,DEC!I21,0),IF($D21=1,IVM!G21,0))","v":0},null,{"$f":"IF(OR(COUNTRY_INFO!N21=\"Inconnu\",COUNTRY_INFO!N21=\"Surveillance\",COUNTRY_INFO!N21=\"Non requis\",COUNTRY_INFO!N21=0),0,IF(INTRO!$E$39=\"Non endémique\",IF(AND($E21<>0,$G21=\"\"),IF($F21=0,COUNTRY_INFO!N21*$E21,COUNTRY_INFO!N21*($E21-$D21)),IF(AND($E21<>0,$G21<>0),IF($F21=0,COUNTRY_INFO!N21*$G21,COUNTRY_INFO!N21*($G21-$D21)),0)),IF($G21=\"\",COUNTRY_INFO!N21*$E21,COUNTRY_INFO!N21*$G21)))","v":36262},{"$f":"IF(OR(COUNTRY_INFO!O21=\"Inconnu\",COUNTRY_INFO!O21=\"Surveillance\",COUNTRY_INFO!O21=\"Non requis\",COUNTRY_INFO!O21=0),0,IF($E21<>0, IF($F21=0,COUNTRY_INFO!O21*$E21,COUNTRY_INFO!O21*($E21-$D21)),COUNTRY_INFO!O21*$E21))","v":79704},null,{"$f":"IF(OR(COUNTRY_INFO!P21=\"Inconnu\",COUNTRY_INFO!P21=\"Surveillance\",COUNTRY_INFO!P21=\"Non requis\",COUNTRY_INFO!P21=0),0,IF(AND($E21<>0,$J21=\"\"),IF($F21=0,COUNTRY_INFO!P21*$E21,COUNTRY_INFO!P21*($E21-$D21)), IF(AND($E21<>0,$J21<>0),IF($F21=0,COUNTRY_INFO!P21*$J21,COUNTRY_INFO!P21*($J21-$D21)), COUNTRY_INFO!P21*$J21)))","v":73875},189841,0,null,0,79704,null,79704,0,null,0]
[{"$f":"IF(AND(INTRO!$E$37=\"Non endémique\",INTRO!$E$41=\"Non endémique\"),\" \",IF(COUNTRY_INFO!A22=0,\" \",COUNTRY_INFO!A22))","v":"SENEGAL"},{"$f":"IF(AND(INTRO!$E$37=\"Non endémique\",INTRO!$E$41=\"Non endémique\"),\" \",IF(COUNTRY_INFO!B22=0,\" \",COUNTRY_INFO!B22))","v":"Diourbel"},{"$f":"IF(AND(INTRO!$E$37=\"Non endémique\",INTRO!$E$41=\"Non endémique\"),\" \",IF(COUNTRY_INFO!C22=0,\" \",COUNTRY_INFO!C22))","v":"Bambéye"},{"$f":"IF(AND(INTRO!$E$37=\"Non endémique\",INTRO!$E$41=\"Non endémique\"),0,COUNTRY_INFO!V22)","v":0},{"$f":"IF(AND(INTRO!$E$37=\"Non endémique\",INTRO!$E$41=\"Non endémique\"),0,COUNTRY_INFO!X22)","v":0},{"$f":"IF(INTRO!$E$39=\"Non endémique\",IF($D22=1,DEC!I22,0),IF($D22=1,IVM!G22,0))","v":0},null,{"$f":"IF(OR(COUNTRY_INFO!N22=\"Inconnu\",COUNTRY_INFO!N22=\"Surveillance\",COUNTRY_INFO!N22=\"Non requis\",COUNTRY_INFO!N22=0),0,IF(INTRO!$E$39=\"Non endémique\",IF(AND($E22<>0,$G22=\"\"),IF($F22=0,COUNTRY_INFO!N22*$E22,COUNTRY_INFO!N22*($E22-$D22)),IF(AND($E22<>0,$G22<>0),IF($F22=0,COUNTRY_INFO!N22*$G22,COUNTRY_INFO!N22*($G22-$D22)),0)),IF($G22=\"\",COUNTRY_INFO!N22*$E22,COUNTRY_INFO!N22*$G22)))","v":0},{"$f":"IF(OR(COUNTRY_INFO!O22=\"Inconnu\",COUNTRY_INFO!O22=\"Surveillance\",COUNTRY_INFO!O22=\"Non requis\",COUNTRY_INFO!O22=0),0,IF($E22<>0, IF($F22=0,COUNTRY_INFO!O22*$E22,COUNTRY_INFO!O22*($E22-$D22)),COUNTRY_INFO!O22*$E22))","v":0},null,{"$f":"IF(OR(COUNTRY_INFO!P22=\"Inconnu\",COUNTRY_INFO!P22=\"Surveillance\",COUNTRY_INFO!P22=\"Non requis\",COUNTRY_INFO!P22=0),0,IF(AND($E22<>0,$J22=\"\"),IF($F22=0,COUNTRY_INFO!P22*$E22,COUNTRY_INFO!P22*($E22-$D22)), IF(AND($E22<>0,$J22<>0),IF($F22=0,COUNTRY_INFO!P22*$J22,COUNTRY_INFO!P22*($J22-$D22)), COUNTRY_INFO!P22*$J22)))","v":0},0,0,null,0,0,null,0,0,null,0]
[{"$f":"IF(AND(INTRO!$E$37=\"Non endémique\",INTRO!$E$41=\"Non endémique\"),\" \",IF(COUNTRY_INFO!A23=0,\" \",COUNTRY_INFO!A23))","v":"SENEGAL"},{"$f":"IF(AND(INTRO!$E$37=\"Non endémique\",INTRO!$E$41=\"Non endémique\"),\" \",IF(COUNTRY_INFO!B23=0,\" \",COUNTRY_INFO!B23))","v":"Diourbel"},{"$f":"IF(AND(INTRO!$E$37=\"Non endémique\",INTRO!$E$41=\"Non endémique\"),\" \",IF(COUNTRY_INFO!C23=0,\" \",COUNTRY_INFO!C23))","v":"Diourbel"},{"$f":"IF(AND(INTRO!$E$37=\"Non endémique\",INTRO!$E$41=\"Non endémique\"),0,COUNTRY_INFO!V23)","v":0},{"$f":"IF(AND(INTRO!$E$37=\"Non endémique\",INTRO!$E$41=\"Non endémique\"),0,COUNTRY_INFO!X23)","v":0},{"$f":"IF(INTRO!$E$39=\"Non endémique\",IF($D23=1,DEC!I23,0),IF($D23=1,IVM!G23,0))","v":0},null,{"$f":"IF(OR(COUNTRY_INFO!N23=\"Inconnu\",COUNTRY_INFO!N23=\"Surveillance\",COUNTRY_INFO!N23=\"Non requis\",COUNTRY_INFO!N23=0),0,IF(INTRO!$E$39=\"Non endémique\",IF(AND($E23<>0,$G23=\"\"),IF($F23=0,COUNTRY_INFO!N23*$E23,COUNTRY_INFO!N23*($E23-$D23)),IF(AND($E23<>0,$G23<>0),IF($F23=0,COUNTRY_INFO!N23*$G23,COUNTRY_INFO!N23*($G23-$D23)),0)),IF($G23=\"\",COUNTRY_INFO!N23*$E23,COUNTRY_INFO!N23*$G23)))","v":0},{"$f":"IF(OR(COUNTRY_INFO!O23=\"Inconnu\",COUNTRY_INFO!O23=\"Surveillance\",COUNTRY_INFO!O23=\"Non requis\",COUNTRY_INFO!O23=0),0,IF($E23<>0, IF($F23=0,COUNTRY_INFO!O23*$E23,COUNTRY_INFO!O23*($E23-$D23)),COUNTRY_INFO!O23*$E23))","v":0},null,{"$f":"IF(OR(COUNTRY_INFO!P23=\"Inconnu\",COUNTRY_INFO!P23=\"Surveillance\",COUNTRY_INFO!P23=\"Non requis\",COUNTRY_INFO!P23=0),0,IF(AND($E23<>0,$J23=\"\"),IF($F23=0,COUNTRY_INFO!P23*$E23,COUNTRY_INFO!P23*($E23-$D23)), IF(AND($E23<>0,$J23<>0),IF($F23=0,COUNTRY_INFO!P23*$J23,COUNTRY_INFO!P23*($J23-$D23)), COUNTRY_INFO!P23*$J23)))","v":0},0,0,null,0,0,null,0,0,null,0]
[{"$f":"IF(AND(INTRO!$E$37=\"Non endémique\",INTRO!$E$41=\"Non endémique\"),\" \",IF(COUNTRY_INFO!A24=0,\" \",COUNTRY_INFO!A24))","v":"SENEGAL"},{"$f":"IF(AND(INTRO!$E$37=\"Non endémique\",INTRO!$E$41=\"Non endémique\"),\" \",IF(COUNTRY_INFO!B24=0,\" \",COUNTRY_INFO!B24))","v":"Diourbel"},{"$f":"IF(AND(INTRO!$E$37=\"Non endémique\",INTRO!$E$41=\"Non endémique\"),\" \",IF(COUNTRY_INFO!C24=0,\" \",COUNTRY_INFO!C24))","v":"Mbacké"},{"$f":"IF(AND(INTRO!$E$37=\"Non endémique\",INTRO!$E$41=\"Non endémique\"),0,COUNTRY_INFO!V24)","v":0},{"$f":"IF(AND(INTRO!$E$37=\"Non endémique\",INTRO!$E$41=\"Non endémique\"),0,COUNTRY_INFO!X24)","v":0},{"$f":"IF(INTRO!$E$39=\"Non endémique\",IF($D24=1,DEC!I24,0),IF($D24=1,IVM!G24,0))","v":0},null,{"$f":"IF(OR(COUNTRY_INFO!N24=\"Inconnu\",COUNTRY_INFO!N24=\"Surveillance\",COUNTRY_INFO!N24=\"Non requis\",COUNTRY_INFO!N24=0),0,IF(INTRO!$E$39=\"Non endémique\",IF(AND($E24<>0,$G24=\"\"),IF($F24=0,COUNTRY_INFO!N24*$E24,COUNTRY_INFO!N24*($E24-$D24)),IF(AND($E24<>0,$G24<>0),IF($F24=0,COUNTRY_INFO!N24*$G24,COUNTRY_INFO!N24*($G24-$D24)),0)),IF($G24=\"\",COUNTRY_INFO!N24*$E24,COUNTRY_INFO!N24*$G24)))","v":0},{"$f":"IF(OR(COUNTRY_INFO!O24=\"Inconnu\",COUNTRY_INFO!O24=\"Surveillance\",COUNTRY_INFO!O24=\"Non requis\",COUNTRY_INFO!O24=0),0,IF($E24<>0, IF($F24=0,COUNTRY_INFO!O24*$E24,COUNTRY_INFO!O24*($E24-$D24)),COUNTRY_INFO!O24*$E24))","v":0},null,{"$f":"IF(OR(COUNTRY_INFO!P24=\"Inconnu\",COUNTRY_INFO!P24=\"Surveillance\",COUNTRY_INFO!P24=\"Non requis\",COUNTRY_INFO!P24=0),0,IF(AND($E24<>0,$J24=\"\"),IF($F24=0,COUNTRY_INFO!P24*$E24,COUNTRY_INFO!P24*($E24-$D24)), IF(AND($E24<>0,$J24<>0),IF($F24=0,COUNTRY_INFO!P24*$J24,COUNTRY_INFO!P24*($J24-$D24)), COUNTRY_INFO!P24*$J24)))","v":0},0,0,null,0,0,null,0,0,null,0]
[{"$f":"IF(AND(INTRO!$E$37=\"Non endémique\",INTRO!$E$41=\"Non endémique\"),\" \",IF(COUNTRY_INFO!A25=0,\" \",COUNTRY_INFO!A25))","v":"SENEGAL"},{"$f":"IF(AND(INTRO!$E$37=\"Non endémique\",INTRO!$E$41=\"Non endémique\"),\" \",IF(COUNTRY_INFO!B25=0,\" \",COUNTRY_INFO!B25))","v":"Diourbel"},{"$f":"IF(AND(INTRO!$E$37=\"Non endémique\",INTRO!$E$41=\"Non endémique\"),\" \",IF(COUNTRY_INFO!C25=0,\" \",COUNTRY_INFO!C25))","v":"Touba"},{"$f":"IF(AND(INTRO!$E$37=\"Non endémique\",INTRO!$E$41=\"Non endémique\"),0,COUNTRY_INFO!V25)","v":0},{"$f":"IF(AND(INTRO!$E$37=\"Non endémique\",INTRO!$E$41=\"Non endémique\"),0,COUNTRY_INFO!X25)","v":0},{"$f":"IF(INTRO!$E$39=\"Non endémique\",IF($D25=1,DEC!I25,0),IF($D25=1,IVM!G25,0))","v":0},null,{"$f":"IF(OR(COUNTRY_INFO!N25=\"Inconnu\",COUNTRY_INFO!N25=\"Surveillance\",COUNTRY_INFO!N25=\"Non requis\",COUNTRY_INFO!N25=0),0,IF(INTRO!$E$39=\"Non endémique\",IF(AND($E25<>0,$G25=\"\"),IF($F25=0,COUNTRY_INFO!N25*$E25,COUNTRY_INFO!N25*($E25-$D25)),IF(AND($E25<>0,$G25<>0),IF($F25=0,COUNTRY_INFO!N25*$G25,COUNTRY_INFO!N25*($G25-$D25)),0)),IF($G25=\"\",COUNTRY_INFO!N25*$E25,COUNTRY_INFO!N25*$G25)))","v":0},{"$f":"IF(OR(COUNTRY_INFO!O25=\"Inconnu\",COUNTRY_INFO!O25=\"Surveillance\",COUNTRY_INFO!O25=\"Non requis\",COUNTRY_INFO!O25=0),0,IF($E25<>0, IF($F25=0,COUNTRY_INFO!O25*$E25,COUNTRY_INFO!O25*($E25-$D25)),COUNTRY_INFO!O25*$E25))","v":0},null,{"$f":"IF(OR(COUNTRY_INFO!P25=\"Inconnu\",COUNTRY_INFO!P25=\"Surveillance\",COUNTRY_INFO!P25=\"Non requis\",COUNTRY_INFO!P25=0),0,IF(AND($E25<>0,$J25=\"\"),IF($F25=0,COUNTRY_INFO!P25*$E25,COUNTRY_INFO!P25*($E25-$D25)), IF(AND($E25<>0,$J25<>0),IF($F25=0,COUNTRY_INFO!P25*$J25,COUNTRY_INFO!P25*($J25-$D25)), COUNTRY_INFO!P25*$J25)))","v":0},0,0,null,0,0,null,0,0,null,0]
[{"$f":"IF(AND(INTRO!$E$37=\"Non endémique\",INTRO!$E$41=\"Non endémique\"),\" \",IF(COUNTRY_INFO!A26=0,\" \",COUNTRY_INFO!A26))","v":"SENEGAL"},{"$f":"IF(AND(INTRO!$E$37=\"Non endémique\",INTRO!$E$41=\"Non endémique\"),\" \",IF(COUNTRY_INFO!B26=0,\" \",COUNTRY_INFO!B26))","v":"Fatick"},{"$f":"IF(AND(INTRO!$E$37=\"Non endémique\",INTRO!$E$41=\"Non endémique\"),\" \",IF(COUNTRY_INFO!C26=0,\" \",COUNTRY_INFO!C26))","v":"Niakhar"},{"$f":"IF(AND(INTRO!$E$37=\"Non endémique\",INTRO!$E$41=\"Non endémique\"),0,COUNTRY_INFO!V26)","v":0},{"$f":"IF(AND(INTRO!$E$37=\"Non endémique\",INTRO!$E$41=\"Non endémique\"),0,COUNTRY_INFO!X26)","v":0},{"$f":"IF(INTRO!$E$39=\"Non endémique\",IF($D26=1,DEC!I26,0),IF($D26=1,IVM!G26,0))","v":0},null,{"$f":"IF(OR(COUNTRY_INFO!N26=\"Inconnu\",COUNTRY_INFO!N26=\"Surveillance\",COUNTRY_INFO!N26=\"Non requis\",COUNTRY_INFO!N26=0),0,IF(INTRO!$E$39=\"Non endémique\",IF(AND($E26<>0,$G26=\"\"),IF($F26=0,COUNTRY_INFO!N26*$E26,COUNTRY_INFO!N26*($E26-$D26)),IF(AND($E26<>0,$G26<>0),IF($F26=0,COUNTRY_INFO!N26*$G26,COUNTRY_INFO!N26*($G26-$D26)),0)),IF($G26=\"\",COUNTRY_INFO!N26*$E26,COUNTRY_INFO!N26*$G26)))","v":0},{"$f":"IF(OR(COUNTRY_INFO!O26=\"Inconnu\",COUNTRY_INFO!O26=\"Surveillance\",COUNTRY_INFO!O26=\"Non requis\",COUNTRY_INFO!O26=0),0,IF($E26<>0, IF($F26=0,COUNTRY_INFO!O26*$E26,COUNTRY_INFO!O26*($E26-$D26)),COUNTRY_INFO!O26*$E26))","v":0},null,{"$f":"IF(OR(COUNTRY_INFO!P26=\"Inconnu\",COUNTRY_INFO!P26=\"Surveillance\",COUNTRY_INFO!P26=\"Non requis\",COUNTRY_INFO!P26=0),0,IF(AND($E26<>0,$J26=\"\"),IF($F26=0,COUNTRY_INFO!P26*$E26,COUNTRY_INFO!P26*($E26-$D26)), IF(AND($E26<>0,$J26<>0),IF($F26=0,COUNTRY_INFO!P26*$J26,COUNTRY_INFO!P26*($J26-$D26)), COUNTRY_INFO!P26*$J26)))","v":0},0,0,null,0,0,null,0,0,null,0]
[{"$f":"IF(AND(INTRO!$E$37=\"Non endémique\",INTRO!$E$41=\"Non endémique\"),\" \",IF(COUNTRY_INFO!A27=0,\" \",COUNTRY_INFO!A27))","v":"SENEGAL"},{"$f":"IF(AND(INTRO!$E$37=\"Non endémique\",INTRO!$E$41=\"Non endémique\"),\" \",IF(COUNTRY_INFO!B27=0,\" \",COUNTRY_INFO!B27))","v":"Fatick"},{"$f":"IF(AND(INTRO!$E$37=\"Non endémique\",INTRO!$E$41=\"Non endémique\"),\" \",IF(COUNTRY_INFO!C27=0,\" \",COUNTRY_INFO!C27))","v":"Diakhao"},{"$f":"IF(AND(INTRO!$E$37=\"Non endémique\",INTRO!$E$41=\"Non endémique\"),0,COUNTRY_INFO!V27)","v":0},{"$f":"IF(AND(INTRO!$E$37=\"Non endémique\",INTRO!$E$41=\"Non endémique\"),0,COUNTRY_INFO!X27)","v":0},{"$f":"IF(INTRO!$E$39=\"Non endémique\",IF($D27=1,DEC!I27,0),IF($D27=1,IVM!G27,0))","v":0},null,{"$f":"IF(OR(COUNTRY_INFO!N27=\"Inconnu\",COUNTRY_INFO!N27=\"Surveillance\",COUNTRY_INFO!N27=\"Non requis\",COUNTRY_INFO!N27=0),0,IF(INTRO!$E$39=\"Non endémique\",IF(AND($E27<>0,$G27=\"\"),IF($F27=0,COUNTRY_INFO!N27*$E27,COUNTRY_INFO!N27*($E27-$D27)),IF(AND($E27<>0,$G27<>0),IF($F27=0,COUNTRY_INFO!N27*$G27,COUNTRY_INFO!N27*($G27-$D27)),0)),IF($G27=\"\",COUNTRY_INFO!N27*$E27,COUNTRY_INFO!N27*$G27)))","v":0},{"$f":"IF(OR(COUNTRY_INFO!O27=\"Inconnu\",COUNTRY_INFO!O27=\"Surveillance\",COUNTRY_INFO!O27=\"Non requis\",COUNTRY_INFO!O27=0),0,IF($E27<>0, IF($F27=0,COUNTRY_INFO!O27*$E27,COUNTRY_INFO!O27*($E27-$D27)),COUNTRY_INFO!O27*$E27))","v":0},null,{"$f":"IF(OR(COUNTRY_INFO!P27=\"Inconnu\",COUNTRY_INFO!P27=\"Surveillance\",COUNTRY_INFO!P27=\"Non requis\",COUNTRY_INFO!P27=0),0,IF(AND($E27<>0,$J27=\"\"),IF($F27=0,COUNTRY_INFO!P27*$E27,COUNTRY_INFO!P27*($E27-$D27)), IF(AND($E27<>0,$J27<>0),IF($F27=0,COUNTRY_INFO!P27*$J27,COUNTRY_INFO!P27*($J27-$D27)), COUNTRY_INFO!P27*$J27)))","v":0},0,0,null,0,0,null,0,0,null,0]
[{"$f":"IF(AND(INTRO!$E$37=\"Non endémique\",INTRO!$E$41=\"Non endémique\"),\" \",IF(COUNTRY_INFO!A28=0,\" \",COUNTRY_INFO!A28))","v":"SENEGAL"},{"$f":"IF(AND(INTRO!$E$37=\"Non endémique\",INTRO!$E$41=\"Non endémique\"),\" \",IF(COUNTRY_INFO!B28=0,\" \",COUNTRY_INFO!B28))","v":"Fatick"},{"$f":"IF(AND(INTRO!$E$37=\"Non endémique\",INTRO!$E$41=\"Non endémique\"),\" \",IF(COUNTRY_INFO!C28=0,\" \",COUNTRY_INFO!C28))","v":"Fatick"},{"$f":"IF(AND(INTRO!$E$37=\"Non endémique\",INTRO!$E$41=\"Non endémique\"),0,COUNTRY_INFO!V28)","v":0},{"$f":"IF(AND(INTRO!$E$37=\"Non endémique\",INTRO!$E$41=\"Non endémique\"),0,COUNTRY_INFO!X28)","v":1},{"$f":"IF(INTRO!$E$39=\"Non endémique\",IF($D28=1,DEC!I28,0),IF($D28=1,IVM!G28,0))","v":0},null,{"$f":"IF(OR(COUNTRY_INFO!N28=\"Inconnu\",COUNTRY_INFO!N28=\"Surveillance\",COUNTRY_INFO!N28=\"Non requis\",COUNTRY_INFO!N28=0),0,IF(INTRO!$E$39=\"Non endémique\",IF(AND($E28<>0,$G28=\"\"),IF($F28=0,COUNTRY_INFO!N28*$E28,COUNTRY_INFO!N28*($E28-$D28)),IF(AND($E28<>0,$G28<>0),IF($F28=0,COUNTRY_INFO!N28*$G28,COUNTRY_INFO!N28*($G28-$D28)),0)),IF($G28=\"\",COUNTRY_INFO!N28*$E28,COUNTRY_INFO!N28*$G28)))","v":18742},{"$f":"IF(OR(COUNTRY_INFO!O28=\"Inconnu\",COUNTRY_INFO!O28=\"Surveillance\",COUNTRY_INFO!O28=\"Non requis\",COUNTRY_INFO!O28=0),0,IF($E28<>0, IF($F28=0,COUNTRY_INFO!O28*$E28,COUNTRY_INFO!O28*($E28-$D28)),COUNTRY_INFO!O28*$E28))","v":41196},null,{"$f":"IF(OR(COUNTRY_INFO!P28=\"Inconnu\",COUNTRY_INFO!P28=\"Surveillance\",COUNTRY_INFO!P28=\"Non requis\",COUNTRY_INFO!P28=0),0,IF(AND($E28<>0,$J28=\"\"),IF($F28=0,COUNTRY_INFO!P28*$E28,COUNTRY_INFO!P28*($E28-$D28)), IF(AND($E28<>0,$J28<>0),IF($F28=0,COUNTRY_INFO!P28*$J28,COUNTRY_INFO!P28*($J28-$D28)), COUNTRY_INFO!P28*$J28)))","v":38183},98121,0,null,0,41196,null,41196,0,null,0]
[{"$f":"IF(AND(INTRO!$E$37=\"Non endémique\",INTRO!$E$41=\"Non endémique\"),\" \",IF(COUNTRY_INFO!A29=0,\" \",COUNTRY_INFO!A29))","v":"SENEGAL"},{"$f":"IF(AND(INTRO!$E$37=\"Non endémique\",INTRO!$E$41=\"Non endémique\"),\" \",IF(COUNTRY_INFO!B29=0,\" \",COUNTRY_INFO!B29))","v":"Fatick"},{"$f":"IF(AND(INTRO!$E$37=\"Non endémique\",INTRO!$E$41=\"Non endémique\"),\" \",IF(COUNTRY_INFO!C29=0,\" \",COUNTRY_INFO!C29))","v":"Dioffior"},{"$f":"IF(AND(INTRO!$E$37=\"Non endémique\",INTRO!$E$41=\"Non endémique\"),0,COUNTRY_INFO!V29)","v":0},{"$f":"IF(AND(INTRO!$E$37=\"Non endémique\",INTRO!$E$41=\"Non endémique\"),0,COUNTRY_INFO!X29)","v":0},{"$f":"IF(INTRO!$E$39=\"Non endémique\",IF($D29=1,DEC!I29,0),IF($D29=1,IVM!G29,0))","v":0},null,{"$f":"IF(OR(COUNTRY_INFO!N29=\"Inconnu\",COUNTRY_INFO!N29=\"Surveillance\",COUNTRY_INFO!N29=\"Non requis\",COUNTRY_INFO!N29=0),0,IF(INTRO!$E$39=\"Non endémique\",IF(AND($E29<>0,$G29=\"\"),IF($F29=0,COUNTRY_INFO!N29*$E29,COUNTRY_INFO!N29*($E29-$D29)),IF(AND($E29<>0,$G29<>0),IF($F29=0,COUNTRY_INFO!N29*$G29,COUNTRY_INFO!N29*($G29-$D29)),0)),IF($G29=\"\",COUNTRY_INFO!N29*$E29,COUNTRY_INFO!N29*$G29)))","v":0},{"$f":"IF(OR(COUNTRY_INFO!O29=\"Inconnu\",COUNTRY_INFO!O29=\"Surveillance\",COUNTRY_INFO!O29=\"Non requis\",COUNTRY_INFO!O29=0),0,IF($E29<>0, IF($F29=0,COUNTRY_INFO!O29*$E29,COUNTRY_INFO!O29*($E29-$D29)),COUNTRY_INFO!O29*$E29))","v":0},null,{"$f":"IF(OR(COUNTRY_INFO!P29=\"Inconnu\",COUNTRY_INFO!P29=\"Surveillance\",COUNTRY_INFO!P29=\"Non requis\",COUNTRY_INFO!P29=0),0,IF(AND($E29<>0,$J29=\"\"),IF($F29=0,COUNTRY_INFO!P29*$E29,COUNTRY_INFO!P29*($E29-$D29)), IF(AND($E29<>0,$J29<>0),IF($F29=0,COUNTRY_INFO!P29*$J29,COUNTRY_INFO!P29*($J29-$D29)), COUNTRY_INFO!P29*$J29)))","v":0},0,0,null,0,0,null,0,0,null,0]
[{"$f":"IF(AND(INTRO!$E$37=\"Non endémique\",INTRO!$E$41=\"Non endémique\"),\" \",IF(COUNTRY_INFO!A30=0,\" \",COUNTRY_INFO!A30))","v":"SENEGAL"},{"$f":"IF(AND(INTRO!$E$37=\"Non endémique\",INTRO!$E$41=\"Non endémique\"),\" \",IF(COUNTRY_INFO!B30=0,\" \",COUNTRY_INFO!B30))","v":"Fatick"},{"$f":"IF(AND(INTRO!$E$37=\"Non endémique\",INTRO!$E$41=\"Non endémique\"),\" \",IF(COUNTRY_INFO!C30=0,\" \",COUNTRY_INFO!C30))","v":"Passy"},{"$f":"IF(AND(INTRO!$E$37=\"Non endémique\",INTRO!$E$41=\"Non endémique\"),0,COUNTRY_INFO!V30)","v":0},{"$f":"IF(AND(INTRO!$E$37=\"Non endémique\",INTRO!$E$41=\"Non endémique\"),0,COUNTRY_INFO!X30)","v":0},{"$f":"IF(INTRO!$E$39=\"Non endémique\",IF($D30=1,DEC!I30,0),IF($D30=1,IVM!G30,0))","v":0},null,{"$f":"IF(OR(COUNTRY_INFO!N30=\"Inconnu\",COUNTRY_INFO!N30=\"Surveillance\",COUNTRY_INFO!N30=\"Non requis\",COUNTRY_INFO!N30=0),0,IF(INTRO!$E$39=\"Non endémique\",IF(AND($E30<>0,$G30=\"\"),IF($F30=0,COUNTRY_INFO!N30*$E30,COUNTRY_INFO!N30*($E30-$D30)),IF(AND($E30<>0,$G30<>0),IF($F30=0,COUNTRY_INFO!N30*$G30,COUNTRY_INFO!N30*($G30-$D30)),0)),IF($G30=\"\",COUNTRY_INFO!N30*$E30,COUNTRY_INFO!N30*$G30)))","v":0},{"$f":"IF(OR(COUNTRY_INFO!O30=\"Inconnu\",COUNTRY_INFO!O30=\"Surveillance\",COUNTRY_INFO!O30=\"Non requis\",COUNTRY_INFO!O30=0),0,IF($E30<>0, IF($F30=0,COUNTRY_INFO!O30*$E30,COUNTRY_INFO!O30*($E30-$D30)),COUNTRY_INFO!O30*$E30))","v":0},null,{"$f":"IF(OR(COUNTRY_INFO!P30=\"Inconnu\",COUNTRY_INFO!P30=\"Surveillance\",COUNTRY_INFO!P30=\"Non requis\",COUNTRY_INFO!P30=0),0,IF(AND($E30<>0,$J30=\"\"),IF($F30=0,COUNTRY_INFO!P30*$E30,COUNTRY_INFO!P30*($E30-$D30)), IF(AND($E30<>0,$J30<>0),IF($F30=0,COUNTRY_INFO!P30*$J30,COUNTRY_INFO!P30*($J30-$D30)), COUNTRY_INFO!P30*$J30)))","v":0},0,0,null,0,0,null,0,0,null,0]
[{"$f":"IF(AND(INTRO!$E$37=\"Non endémique\",INTRO!$E$41=\"Non endémique\"),\" \",IF(COUNTRY_INFO!A31=0,\" \",COUNTRY_INFO!A31))","v":"SENEGAL"},{"$f":"IF(AND(INTRO!$E$37=\"Non endémique\",INTRO!$E$41=\"Non endémique\"),\" \",IF(COUNTRY_INFO!B31=0,\" \",COUNTRY_INFO!B31))","v":"Fatick"},{"$f":"IF(AND(INTRO!$E$37=\"Non endémique\",INTRO!$E$41=\"Non endémique\"),\" \",IF(COUNTRY_INFO!C31=0,\" \",COUNTRY_INFO!C31))","v":"Foundiougne"},{"$f":"IF(AND(INTRO!$E$37=\"Non endémique\",INTRO!$E$41=\"Non endémique\"),0,COUNTRY_INFO!V31)","v":0},{"$f":"IF(AND(INTRO!$E$37=\"Non endémique\",INTRO!$E$41=\"Non endémique\"),0,COUNTRY_INFO!X31)","v":0},{"$f":"IF(INTRO!$E$39=\"Non endémique\",IF($D31=1,DEC!I31,0),IF($D31=1,IVM!G31,0))","v":0},null,{"$f":"IF(OR(COUNTRY_INFO!N31=\"Inconnu\",COUNTRY_INFO!N31=\"Surveillance\",COUNTRY_INFO!N31=\"Non requis\",COUNTRY_INFO!N31=0),0,IF(INTRO!$E$39=\"Non endémique\",IF(AND($E31<>0,$G31=\"\"),IF($F31=0,COUNTRY_INFO!N31*$E31,COUNTRY_INFO!N31*($E31-$D31)),IF(AND($E31<>0,$G31<>0),IF($F31=0,COUNTRY_INFO!N31*$G31,COUNTRY_INFO!N31*($G31-$D31)),0)),IF($G31=\"\",COUNTRY_INFO!N31*$E31,COUNTRY_INFO!N31*$G31)))","v":0},{"$f":"IF(OR(COUNTRY_INFO!O31=\"Inconnu\",COUNTRY_INFO!O31=\"Surveillance\",COUNTRY_INFO!O31=\"Non requis\",COUNTRY_INFO!O31=0),0,IF($E31<>0, IF($F31=0,COUNTRY_INFO!O31*$E31,COUNTRY_INFO!O31*($E31-$D31)),COUNTRY_INFO!O31*$E31))","v":0},null,{"$f":"IF(OR(COUNTRY_INFO!P31=\"Inconnu\",COUNTRY_INFO!P31=\"Surveillance\",COUNTRY_INFO!P31=\"Non requis\",COUNTRY_INFO!P31=0),0,IF(AND($E31<>0,$J31=\"\"),IF($F31=0,COUNTRY_INFO!P31*$E31,COUNTRY_INFO!P31*($E31-$D31)), IF(AND($E31<>0,$J31<>0),IF($F31=0,COUNTRY_INFO!P31*$J31,COUNTRY_INFO!P31*($J31-$D31)), COUNTRY_INFO!P31*$J31)))","v":0},0,0,null,0,0,null,0,0,null,0]
[{"$f":"IF(AND(INTRO!$E$37=\"Non endémique\",INTRO!$E$41=\"Non endémique\"),\" \",IF(COUNTRY_INFO!A32=0,\" \",COUNTRY_INFO!A32))","v":"SENEGAL"},{"$f":"IF(AND(INTRO!$E$37=\"Non endémique\",INTRO!$E$41=\"Non endémique\"),\" \",IF(COUNTRY_INFO!B32=0,\" \",COUNTRY_INFO!B32))","v":"Fatick"},{"$f":"IF(AND(INTRO!$E$37=\"Non endémique\",INTRO!$E$41=\"Non endémique\"),\" \",IF(COUNTRY_INFO!C32=0,\" \",COUNTRY_INFO!C32))","v":"Sokone"},{"$f":"IF(AND(INTRO!$E$37=\"Non endémique\",INTRO!$E$41=\"Non endémique\"),0,COUNTRY_INFO!V32)","v":0},{"$f":"IF(AND(INTRO!$E$37=\"Non endémique\",INTRO!$E$41=\"Non endémique\"),0,COUNTRY_INFO!X32)","v":0},{"$f":"IF(INTRO!$E$39=\"Non endémique\",IF($D32=1,DEC!I32,0),IF($D32=1,IVM!G32,0))","v":0},null,{"$f":"IF(OR(COUNTRY_INFO!N32=\"Inconnu\",COUNTRY_INFO!N32=\"Surveillance\",COUNTRY_INFO!N32=\"Non requis\",COUNTRY_INFO!N32=0),0,IF(INTRO!$E$39=\"Non endémique\",IF(AND($E32<>0,$G32=\"\"),IF($F32=0,COUNTRY_INFO!N32*$E32,COUNTRY_INFO!N32*($E32-$D32)),IF(AND($E32<>0,$G32<>0),IF($F32=0,COUNTRY_INFO!N32*$G32,COUNTRY_INFO!N32*($G32-$D32)),0)),IF($G32=\"\",COUNTRY_INFO!N32*$E32,COUNTRY_INFO!N32*$G32)))","v":0},{"$f":"IF(OR(COUNTRY_INFO!O32=\"Inconnu\",COUNTRY_INFO!O32=\"Surveillance\",COUNTRY_INFO!O32=\"Non requis\",COUNTRY_INFO!O32=0),0,IF($E32<>0, IF($F32=0,COUNTRY_INFO!O32*$E32,COUNTRY_INFO!O32*($E32-$D32)),COUNTRY_INFO!O32*$E32))","v":0},null,{"$f":"IF(OR(COUNTRY_INFO!P32=\"Inconnu\",COUNTRY_INFO!P32=\"Surveillance\",COUNTRY_INFO!P32=\"Non requis\",COUNTRY_INFO!P32=0),0,IF(AND($E32<>0,$J32=\"\"),IF($F32=0,COUNTRY_INFO!P32*$E32,COUNTRY_INFO!P32*($E32-$D32)), IF(AND($E32<>0,$J32<>0),IF($F32=0,COUNTRY_INFO!P32*$J32,COUNTRY_INFO!P32*($J32-$D32)), COUNTRY_INFO!P32*$J32)))","v":0},0,0,null,0,0,null,0,0,null,0]
[{"$f":"IF(AND(INTRO!$E$37=\"Non endémique\",INTRO!$E$41=\"Non endémique\"),\" \",IF(COUNTRY_INFO!A33=0,\" \",COUNTRY_INFO!A33))","v":"SENEGAL"},{"$f":"IF(AND(INTRO!$E$37=\"Non endémique\",INTRO!$E$41=\"Non endémique\"),\" \",IF(COUNTRY_INFO!B33=0,\" \",COUNTRY_INFO!B33))","v":"Fatick"},{"$f":"IF(AND(INTRO!$E$37=\"Non endémique\",INTRO!$E$41=\"Non endémique\"),\" \",IF(COUNTRY_INFO!C33=0,\" \",COUNTRY_INFO!C33))","v":"Gossas"},{"$f":"IF(AND(INTRO!$E$37=\"Non endémique\",INTRO!$E$41=\"Non endémique\"),0,COUNTRY_INFO!V33)","v":0},{"$f":"IF(AND(INTRO!$E$37=\"Non endémique\",INTRO!$E$41=\"Non endémique\"),0,COUNTRY_INFO!X33)","v":0},{"$f":"IF(INTRO!$E$39=\"Non endémique\",IF($D33=1,DEC!I33,0),IF($D33=1,IVM!G33,0))","v":0},null,{"$f":"IF(OR(COUNTRY_INFO!N33=\"Inconnu\",COUNTRY_INFO!N33=\"Surveillance\",COUNTRY_INFO!N33=\"Non requis\",COUNTRY_INFO!N33=0),0,IF(INTRO!$E$39=\"Non endémique\",IF(AND($E33<>0,$G33=\"\"),IF($F33=0,COUNTRY_INFO!N33*$E33,COUNTRY_INFO!N33*($E33-$D33)),IF(AND($E33<>0,$G33<>0),IF($F33=0,COUNTRY_INFO!N33*$G33,COUNTRY_INFO!N33*($G33-$D33)),0)),IF($G33=\"\",COUNTRY_INFO!N33*$E33,COUNTRY_INFO!N33*$G33)))","v":0},{"$f":"IF(OR(COUNTRY_INFO!O33=\"Inconnu\",COUNTRY_INFO!O33=\"Surveillance\",COUNTRY_INFO!O33=\"Non requis\",COUNTRY_INFO!O33=0),0,IF($E33<>0, IF($F33=0,COUNTRY_INFO!O33*$E33,COUNTRY_INFO!O33*($E33-$D33)),COUNTRY_INFO!O33*$E33))","v":0},null,{"$f":"IF(OR(COUNTRY_INFO!P33=\"Inconnu\",COUNTRY_INFO!P33=\"Surveillance\",COUNTRY_INFO!P33=\"Non requis\",COUNTRY_INFO!P33=0),0,IF(AND($E33<>0,$J33=\"\"),IF($F33=0,COUNTRY_INFO!P33*$E33,COUNTRY_INFO!P33*($E33-$D33)), IF(AND($E33<>0,$J33<>0),IF($F33=0,COUNTRY_INFO!P33*$J33,COUNTRY_INFO!P33*($J33-$D33)), COUNTRY_INFO!P33*$J33)))","v":0},0,0,null,0,0,null,0,0,null,0]
[{"$f":"IF(AND(INTRO!$E$37=\"Non endémique\",INTRO!$E$41=\"Non endémique\"),\" \",IF(COUNTRY_INFO!A34=0,\" \",COUNTRY_INFO!A34))","v":"SENEGAL"},{"$f":"IF(AND(INTRO!$E$37=\"Non endémique\",INTRO!$E$41=\"Non endémique\"),\" \",IF(COUNTRY_INFO!B34=0,\" \",COUNTRY_INFO!B34))","v":"Kaffrine"},{"$f":"IF(AND(INTRO!$E$37=\"Non endémique\",INTRO!$E$41=\"Non endémique\"),\" \",IF(COUNTRY_INFO!C34=0,\" \",COUNTRY_INFO!C34))","v":"Birkelane"},{"$f":"IF(AND(INTRO!$E$37=\"Non endémique\",INTRO!$E$41=\"Non endémique\"),0,COUNTRY_INFO!V34)","v":0},{"$f":"IF(AND(INTRO!$E$37=\"Non endémique\",INTRO!$E$41=\"Non endémique\"),0,COUNTRY_INFO!X34)","v":0},{"$f":"IF(INTRO!$E$39=\"Non endémique\",IF($D34=1,DEC!I34,0),IF($D34=1,IVM!G34,0))","v":0},null,{"$f":"IF(OR(COUNTRY_INFO!N34=\"Inconnu\",COUNTRY_INFO!N34=\"Surveillance\",COUNTRY_INFO!N34=\"Non requis\",COUNTRY_INFO!N34=0),0,IF(INTRO!$E$39=\"Non endémique\",IF(AND($E34<>0,$G34=\"\"),IF($F34=0,COUNTRY_INFO!N34*$E34,COUNTRY_INFO!N34*($E34-$D34)),IF(AND($E34<>0,$G34<>0),IF($F34=0,COUNTRY_INFO!N34*$G34,COUNTRY_INFO!N34*($G34-$D34)),0)),IF($G34=\"\",COUNTRY_INFO!N34*$E34,COUNTRY_INFO!N34*$G34)))","v":0},{"$f":"IF(OR(COUNTRY_INFO!O34=\"Inconnu\",COUNTRY_INFO!O34=\"Surveillance\",COUNTRY_INFO!O34=\"Non requis\",COUNTRY_INFO!O34=0),0,IF($E34<>0, IF($F34=0,COUNTRY_INFO!O34*$E34,COUNTRY_INFO!O34*($E34-$D34)),COUNTRY_INFO!O34*$E34))","v":0},null,{"$f":"IF(OR(COUNTRY_INFO!P34=\"Inconnu\",COUNTRY_INFO!P34=\"Surveillance\",COUNTRY_INFO!P34=\"Non requis\",COUNTRY_INFO!P34=0),0,IF(AND($E34<>0,$J34=\"\"),IF($F34=0,COUNTRY_INFO!P34*$E34,COUNTRY_INFO!P34*($E34-$D34)), IF(AND($E34<>0,$J34<>0),IF($F34=0,COUNTRY_INFO!P34*$J34,COUNTRY_INFO!P34*($J34-$D34)), COUNTRY_INFO!P34*$J34)))","v":0},0,0,null,0,0,null,0,0,null,0]
[{"$f":"IF(AND(INTRO!$E$37=\"Non endémique\",INTRO!$E$41=\"Non endémique\"),\" \",IF(COUNTRY_INFO!A35=0,\" \",COUNTRY_INFO!A35))","v":"SENEGAL"},{"$f":"IF(AND(INTRO!$E$37=\"Non endémique\",INTRO!$E$41=\"Non endémique\"),\" \",IF(COUNTRY_INFO!B35=0,\" \",COUNTRY_INFO!B35))","v":"Kaffrine"},{"$f":"IF(AND(INTRO!$E$37=\"Non endémique\",INTRO!$E$41=\"Non endémique\"),\" \",IF(COUNTRY_INFO!C35=0,\" \",COUNTRY_INFO!C35))","v":"Kaffrine"},{"$f":"IF(AND(INTRO!$E$37=\"Non endémique\",INTRO!$E$41=\"Non endémique\"),0,COUNTRY_INFO!V35)","v":0},{"$f":"IF(AND(INTRO!$E$37=\"Non endémique\",INTRO!$E$41=\"Non endémique\"),0,COUNTRY_INFO!X35)","v":0},{"$f":"IF(INTRO!$E$39=\"Non endémique\",IF($D35=1,DEC!I35,0),IF($D35=1,IVM!G35,0))","v":0},null,{"$f":"IF(OR(COUNTRY_INFO!N35=\"Inconnu\",COUNTRY_INFO!N35=\"Surveillance\",COUNTRY_INFO!N35=\"Non requis\",COUNTRY_INFO!N35=0),0,IF(INTRO!$E$39=\"Non endémique\",IF(AND($E35<>0,$G35=\"\"),IF($F35=0,COUNTRY_INFO!N35*$E35,COUNTRY_INFO!N35*($E35-$D35)),IF(AND($E35<>0,$G35<>0),IF($F35=0,COUNTRY_INFO!N35*$G35,COUNTRY_INFO!N35*($G35-$D35)),0)),IF($G35=\"\",COUNTRY_INFO!N35*$E35,COUNTRY_INFO!N35*$G35)))","v":0},{"$f":"IF(OR(COUNTRY_INFO!O35=\"Inconnu\",COUNTRY_INFO!O35=\"Surveillance\",COUNTRY_INFO!O35=\"Non requis\",COUNTRY_INFO!O35=0),0,IF($E35<>0, IF($F35=0,COUNTRY_INFO!O35*$E35,COUNTRY_INFO!O35*($E35-$D35)),COUNTRY_INFO!O35*$E35))","v":0},null,{"$f":"IF(OR(COUNTRY_INFO!P35=\"Inconnu\",COUNTRY_INFO!P35=\"Surveillance\",COUNTRY_INFO!P35=\"Non requis\",COUNTRY_INFO!P35=0),0,IF(AND($E35<>0,$J35=\"\"),IF($F35=0,COUNTRY_INFO!P35*$E35,COUNTRY_INFO!P35*($E35-$D35)), IF(AND($E35<>0,$J35<>0),IF($F35=0,COUNTRY_INFO!P35*$J35,COUNTRY_INFO!P35*($J35-$D35)), COUNTRY_INFO!P35*$J35)))","v":0},0,0,null,0,0,null,0,0,null,0]
[{"$f":"IF(AND(INTRO!$E$37=\"Non endémique\",INTRO!$E$41=\"Non endémique\"),\" \",IF(COUNTRY_INFO!A36=0,\" \",COUNTRY_INFO!A36))","v":"SENEGAL"},{"$f":"IF(AND(INTRO!$E$37=\"Non endémique\",INTRO!$E$41=\"Non endémique\"),\" \",IF(COUNTRY_INFO!B36=0,\" \",COUNTRY_INFO!B36))","v":"Kaffrine"},{"$f":"IF(AND(INTRO!$E$37=\"Non endémique\",INTRO!$E$41=\"Non endémique\"),\" \",IF(COUNTRY_INFO!C36=0,\" \",COUNTRY_INFO!C36))","v":"Koungheul"},{"$f":"IF(AND(INTRO!$E$37=\"Non endémique\",INTRO!$E$41=\"Non endémique\"),0,COUNTRY_INFO!V36)","v":0},{"$f":"IF(AND(INTRO!$E$37=\"Non endémique\",INTRO!$E$41=\"Non endémique\"),0,COUNTRY_INFO!X36)","v":0},{"$f":"IF(INTRO!$E$39=\"Non endémique\",IF($D36=1,DEC!I36,0),IF($D36=1,IVM!G36,0))","v":0},null,{"$f":"IF(OR(COUNTRY_INFO!N36=\"Inconnu\",COUNTRY_INFO!N36=\"Surveillance\",COUNTRY_INFO!N36=\"Non requis\",COUNTRY_INFO!N36=0),0,IF(INTRO!$E$39=\"Non endémique\",IF(AND($E36<>0,$G36=\"\"),IF($F36=0,COUNTRY_INFO!N36*$E36,COUNTRY_INFO!N36*($E36-$D36)),IF(AND($E36<>0,$G36<>0),IF($F36=0,COUNTRY_INFO!N36*$G36,COUNTRY_INFO!N36*($G36-$D36)),0)),IF($G36=\"\",COUNTRY_INFO!N36*$E36,COUNTRY_INFO!N36*$G36)))","v":0},{"$f":"IF(OR(COUNTRY_INFO!O36=\"Inconnu\",COUNTRY_INFO!O36=\"Surveillance\",COUNTRY_INFO!O36=\"Non requis\",COUNTRY_INFO!O36=0),0,IF($E36<>0, IF($F36=0,COUNTRY_INFO!O36*$E36,COUNTRY_INFO!O36*($E36-$D36)),COUNTRY_INFO!O36*$E36))","v":0},null,{"$f":"IF(OR(COUNTRY_INFO!P36=\"Inconnu\",COUNTRY_INFO!P36=\"Surveillance\",COUNTRY_INFO!P36=\"Non requis\",COUNTRY_INFO!P36=0),0,IF(AND($E36<>0,$J36=\"\"),IF($F36=0,COUNTRY_INFO!P36*$E36,COUNTRY_INFO!P36*($E36-$D36)), IF(AND($E36<>0,$J36<>0),IF($F36=0,COUNTRY_INFO!P36*$J36,COUNTRY_INFO!P36*($J36-$D36)), COUNTRY_INFO!P36*$J36)))","v":0},0,0,null,0,0,null,0,0,null,0]
[{"$f":"IF(AND(INTRO!$E$37=\"Non endémique\",INTRO!$E$41=\"Non endémique\"),\" \",IF(COUNTRY_INFO!A37=0,\" \",COUNTRY_INFO!A37))","v":"SENEGAL"},{"$f":"IF(AND(INTRO!$E$37=\"Non endémique\",INTRO!$E$41=\"Non endémique\"),\" \",IF(COUNTRY_INFO!B37=0,\" \",COUNTRY_INFO!B37))","v":"Kaffrine"},{"$f":"IF(AND(INTRO!$E$37=\"Non endémique\",INTRO!$E$41=\"Non endémique\"),\" \",IF(COUNTRY_INFO!C37=0,\" \",COUNTRY_INFO!C37))","v":"Malem Hodar"},{"$f":"IF(AND(INTRO!$E$37=\"Non endémique\",INTRO!$E$41=\"Non endémique\"),0,COUNTRY_INFO!V37)","v":0},{"$f":"IF(AND(INTRO!$E$37=\"Non endémique\",INTRO!$E$41=\"Non endémique\"),0,COUNTRY_INFO!X37)","v":1},{"$f":"IF(INTRO!$E$39=\"Non endémique\",IF($D37=1,DEC!I37,0),IF($D37=1,IVM!G37,0))","v":0},null,{"$f":"IF(OR(COUNTRY_INFO!N37=\"Inconnu\",COUNTRY_INFO!N37=\"Surveillance\",COUNTRY_INFO!N37=\"Non requis\",COUNTRY_INFO!N37=0),0,IF(INTRO!$E$39=\"Non endémique\",IF(AND($E37<>0,$G37=\"\"),IF($F37=0,COUNTRY_INFO!N37*$E37,COUNTRY_INFO!N37*($E37-$D37)),IF(AND($E37<>0,$G37<>0),IF($F37=0,COUNTRY_INFO!N37*$G37,COUNTRY_INFO!N37*($G37-$D37)),0)),IF($G37=\"\",COUNTRY_INFO!N37*$E37,COUNTRY_INFO!N37*$G37)))","v":16627},{"$f":"IF(OR(COUNTRY_INFO!O37=\"Inconnu\",COUNTRY_INFO!O37=\"Surveillance\",COUNTRY_INFO!O37=\"Non requis\",COUNTRY_INFO!O37=0),0,IF($E37<>0, IF($F37=0,COUNTRY_INFO!O37*$E37,COUNTRY_INFO!O37*($E37-$D37)),COUNTRY_INFO!O37*$E37))","v":36546},null,{"$f":"IF(OR(COUNTRY_INFO!P37=\"Inconnu\",COUNTRY_INFO!P37=\"Surveillance\",COUNTRY_INFO!P37=\"Non requis\",COUNTRY_INFO!P37=0),0,IF(AND($E37<>0,$J37=\"\"),IF($F37=0,COUNTRY_INFO!P37*$E37,COUNTRY_INFO!P37*($E37-$D37)), IF(AND($E37<>0,$J37<>0),IF($F37=0,COUNTRY_INFO!P37*$J37,COUNTRY_INFO!P37*($J37-$D37)), COUNTRY_INFO!P37*$J37)))","v":33874},87047,0,null,0,36546,null,36546,0,null,0]
[{"$f":"IF(AND(INTRO!$E$37=\"Non endémique\",INTRO!$E$41=\"Non endémique\"),\" \",IF(COUNTRY_INFO!A38=0,\" \",COUNTRY_INFO!A38))","v":"SENEGAL"},{"$f":"IF(AND(INTRO!$E$37=\"Non endémique\",INTRO!$E$41=\"Non endémique\"),\" \",IF(COUNTRY_INFO!B38=0,\" \",COUNTRY_INFO!B38))","v":"Kaolack"},{"$f":"IF(AND(INTRO!$E$37=\"Non endémique\",INTRO!$E$41=\"Non endémique\"),\" \",IF(COUNTRY_INFO!C38=0,\" \",COUNTRY_INFO!C38))","v":"Guinguineo"},{"$f":"IF(AND(INTRO!$E$37=\"Non endémique\",INTRO!$E$41=\"Non endémique\"),0,COUNTRY_INFO!V38)","v":0},{"$f":"IF(AND(INTRO!$E$37=\"Non endémique\",INTRO!$E$41=\"Non endémique\"),0,COUNTRY_INFO!X38)","v":0},{"$f":"IF(INTRO!$E$39=\"Non endémique\",IF($D38=1,DEC!I38,0),IF($D38=1,IVM!G38,0))","v":0},null,{"$f":"IF(OR(COUNTRY_INFO!N38=\"Inconnu\",COUNTRY_INFO!N38=\"Surveillance\",COUNTRY_INFO!N38=\"Non requis\",COUNTRY_INFO!N38=0),0,IF(INTRO!$E$39=\"Non endémique\",IF(AND($E38<>0,$G38=\"\"),IF($F38=0,COUNTRY_INFO!N38*$E38,COUNTRY_INFO!N38*($E38-$D38)),IF(AND($E38<>0,$G38<>0),IF($F38=0,COUNTRY_INFO!N38*$G38,COUNTRY_INFO!N38*($G38-$D38)),0)),IF($G38=\"\",COUNTRY_INFO!N38*$E38,COUNTRY_INFO!N38*$G38)))","v":0},{"$f":"IF(OR(COUNTRY_INFO!O38=\"Inconnu\",COUNTRY_INFO!O38=\"Surveillance\",COUNTRY_INFO!O38=\"Non requis\",COUNTRY_INFO!O38=0),0,IF($E38<>0, IF($F38=0,COUNTRY_INFO!O38*$E38,COUNTRY_INFO!O38*($E38-$D38)),COUNTRY_INFO!O38*$E38))","v":0},null,{"$f":"IF(OR(COUNTRY_INFO!P38=\"Inconnu\",COUNTRY_INFO!P38=\"Surveillance\",COUNTRY_INFO!P38=\"Non requis\",COUNTRY_INFO!P38=0),0,IF(AND($E38<>0,$J38=\"\"),IF($F38=0,COUNTRY_INFO!P38*$E38,COUNTRY_INFO!P38*($E38-$D38)), IF(AND($E38<>0,$J38<>0),IF($F38=0,COUNTRY_INFO!P38*$J38,COUNTRY_INFO!P38*($J38-$D38)), COUNTRY_INFO!P38*$J38)))","v":0},0,0,null,0,0,null,0,0,null,0]
[{"$f":"IF(AND(INTRO!$E$37=\"Non endémique\",INTRO!$E$41=\"Non endémique\"),\" \",IF(COUNTRY_INFO!A39=0,\" \",COUNTRY_INFO!A39))","v":"SENEGAL"},{"$f":"IF(AND(INTRO!$E$37=\"Non endémique\",INTRO!$E$41=\"Non endémique\"),\" \",IF(COUNTRY_INFO!B39=0,\" \",COUNTRY_INFO!B39))","v":"Kaolack"},{"$f":"IF(AND(INTRO!$E$37=\"Non endémique\",INTRO!$E$41=\"Non endémique\"),\" \",IF(COUNTRY_INFO!C39=0,\" \",COUNTRY_INFO!C39))","v":"Kaolack"},{"$f":"IF(AND(INTRO!$E$37=\"Non endémique\",INTRO!$E$41=\"Non endémique\"),0,COUNTRY_INFO!V39)","v":0},{"$f":"IF(AND(INTRO!$E$37=\"Non endémique\",INTRO!$E$41=\"Non endémique\"),0,COUNTRY_INFO!X39)","v":0},{"$f":"IF(INTRO!$E$39=\"Non endémique\",IF($D39=1,DEC!I39,0),IF($D39=1,IVM!G39,0))","v":0},null,{"$f":"IF(OR(COUNTRY_INFO!N39=\"Inconnu\",COUNTRY_INFO!N39=\"Surveillance\",COUNTRY_INFO!N39=\"Non requis\",COUNTRY_INFO!N39=0),0,IF(INTRO!$E$39=\"Non endémique\",IF(AND($E39<>0,$G39=\"\"),IF($F39=0,COUNTRY_INFO!N39*$E39,COUNTRY_INFO!N39*($E39-$D39)),IF(AND($E39<>0,$G39<>0),IF($F39=0,COUNTRY_INFO!N39*$G39,COUNTRY_INFO!N39*($G39-$D39)),0)),IF($G39=\"\",COUNTRY_INFO!N39*$E39,COUNTRY_INFO!N39*$G39)))","v":0},{"$f":"IF(OR(COUNTRY_INFO!O39=\"Inconnu\",COUNTRY_INFO!O39=\"Surveillance\",COUNTRY_INFO!O39=\"Non requis\",COUNTRY_INFO!O39=0),0,IF($E39<>0, IF($F39=0,COUNTRY_INFO!O39*$E39,COUNTRY_INFO!O39*($E39-$D39)),COUNTRY_INFO!O39*$E39))","v":0},null,{"$f":"IF(OR(COUNTRY_INFO!P39=\"Inconnu\",COUNTRY_INFO!P39=\"Surveillance\",COUNTRY_INFO!P39=\"Non requis\",COUNTRY_INFO!P39=0),0,IF(AND($E39<>0,$J39=\"\"),IF($F39=0,COUNTRY_INFO!P39*$E39,COUNTRY_INFO!P39*($E39-$D39)), IF(AND($E39<>0,$J39<>0),IF($F39=0,COUNTRY_INFO!P39*$J39,COUNTRY_INFO!P39*($J39-$D39)), COUNTRY_INFO!P39*$J39)))","v":0},0,0,null,0,0,null,0,0,null,0]
[{"$f":"IF(AND(INTRO!$E$37=\"Non endémique\",INTRO!$E$41=\"Non endémique\"),\" \",IF(COUNTRY_INFO!A40=0,\" \",COUNTRY_INFO!A40))","v":"SENEGAL"},{"$f":"IF(AND(INTRO!$E$37=\"Non endémique\",INTRO!$E$41=\"Non endémique\"),\" \",IF(COUNTRY_INFO!B40=0,\" \",COUNTRY_INFO!B40))","v":"Kaolack"},{"$f":"IF(AND(INTRO!$E$37=\"Non endémique\",INTRO!$E$41=\"Non endémique\"),\" \",IF(COUNTRY_INFO!C40=0,\" \",COUNTRY_INFO!C40))","v":"Ndoffane"},{"$f":"IF(AND(INTRO!$E$37=\"Non endémique\",INTRO!$E$41=\"Non endémique\"),0,COUNTRY_INFO!V40)","v":0},{"$f":"IF(AND(INTRO!$E$37=\"Non endémique\",INTRO!$E$41=\"Non endémique\"),0,COUNTRY_INFO!X40)","v":0},{"$f":"IF(INTRO!$E$39=\"Non endémique\",IF($D40=1,DEC!I40,0),IF($D40=1,IVM!G40,0))","v":0},null,{"$f":"IF(OR(COUNTRY_INFO!N40=\"Inconnu\",COUNTRY_INFO!N40=\"Surveillance\",COUNTRY_INFO!N40=\"Non requis\",COUNTRY_INFO!N40=0),0,IF(INTRO!$E$39=\"Non endémique\",IF(AND($E40<>0,$G40=\"\"),IF($F40=0,COUNTRY_INFO!N40*$E40,COUNTRY_INFO!N40*($E40-$D40)),IF(AND($E40<>0,$G40<>0),IF($F40=0,COUNTRY_INFO!N40*$G40,COUNTRY_INFO!N40*($G40-$D40)),0)),IF($G40=\"\",COUNTRY_INFO!N40*$E40,COUNTRY_INFO!N40*$G40)))","v":0},{"$f":"IF(OR(COUNTRY_INFO!O40=\"Inconnu\",COUNTRY_INFO!O40=\"Surveillance\",COUNTRY_INFO!O40=\"Non requis\",COUNTRY_INFO!O40=0),0,IF($E40<>0, IF($F40=0,COUNTRY_INFO!O40*$E40,COUNTRY_INFO!O40*($E40-$D40)),COUNTRY_INFO!O40*$E40))","v":0},null,{"$f":"IF(OR(COUNTRY_INFO!P40=\"Inconnu\",COUNTRY_INFO!P40=\"Surveillance\",COUNTRY_INFO!P40=\"Non requis\",COUNTRY_INFO!P40=0),0,IF(AND($E40<>0,$J40=\"\"),IF($F40=0,COUNTRY_INFO!P40*$E40,COUNTRY_INFO!P40*($E40-$D40)), IF(AND($E40<>0,$J40<>0),IF($F40=0,COUNTRY_INFO!P40*$J40,COUNTRY_INFO!P40*($J40-$D40)), COUNTRY_INFO!P40*$J40)))","v":0},0,0,null,0,0,null,0,0,null,0]
[{"$f":"IF(AND(INTRO!$E$37=\"Non endémique\",INTRO!$E$41=\"Non endémique\"),\" \",IF(COUNTRY_INFO!A41=0,\" \",COUNTRY_INFO!A41))","v":"SENEGAL"},{"$f":"IF(AND(INTRO!$E$37=\"Non endémique\",INTRO!$E$41=\"Non endémique\"),\" \",IF(COUNTRY_INFO!B41=0,\" \",COUNTRY_INFO!B41))","v":"Kaolack"},{"$f":"IF(AND(INTRO!$E$37=\"Non endémique\",INTRO!$E$41=\"Non endémique\"),\" \",IF(COUNTRY_INFO!C41=0,\" \",COUNTRY_INFO!C41))","v":"Nioro"},{"$f":"IF(AND(INTRO!$E$37=\"Non endémique\",INTRO!$E$41=\"Non endémique\"),0,COUNTRY_INFO!V41)","v":0},{"$f":"IF(AND(INTRO!$E$37=\"Non endémique\",INTRO!$E$41=\"Non endémique\"),0,COUNTRY_INFO!X41)","v":0},{"$f":"IF(INTRO!$E$39=\"Non endémique\",IF($D41=1,DEC!I41,0),IF($D41=1,IVM!G41,0))","v":0},null,{"$f":"IF(OR(COUNTRY_INFO!N41=\"Inconnu\",COUNTRY_INFO!N41=\"Surveillance\",COUNTRY_INFO!N41=\"Non requis\",COUNTRY_INFO!N41=0),0,IF(INTRO!$E$39=\"Non endémique\",IF(AND($E41<>0,$G41=\"\"),IF($F41=0,COUNTRY_INFO!N41*$E41,COUNTRY_INFO!N41*($E41-$D41)),IF(AND($E41<>0,$G41<>0),IF($F41=0,COUNTRY_INFO!N41*$G41,COUNTRY_INFO!N41*($G41-$D41)),0)),IF($G41=\"\",COUNTRY_INFO!N41*$E41,COUNTRY_INFO!N41*$G41)))","v":0},{"$f":"IF(OR(COUNTRY_INFO!O41=\"Inconnu\",COUNTRY_INFO!O41=\"Surveillance\",COUNTRY_INFO!O41=\"Non requis\",COUNTRY_INFO!O41=0),0,IF($E41<>0, IF($F41=0,COUNTRY_INFO!O41*$E41,COUNTRY_INFO!O41*($E41-$D41)),COUNTRY_INFO!O41*$E41))","v":0},null,{"$f":"IF(OR(COUNTRY_INFO!P41=\"Inconnu\",COUNTRY_INFO!P41=\"Surveillance\",COUNTRY_INFO!P41=\"Non requis\",COUNTRY_INFO!P41=0),0,IF(AND($E41<>0,$J41=\"\"),IF($F41=0,COUNTRY_INFO!P41*$E41,COUNTRY_INFO!P41*($E41-$D41)), IF(AND($E41<>0,$J41<>0),IF($F41=0,COUNTRY_INFO!P41*$J41,COUNTRY_INFO!P41*($J41-$D41)), COUNTRY_INFO!P41*$J41)))","v":0},0,0,null,0,0,null,0,0,null,0]
[{"$f":"IF(AND(INTRO!$E$37=\"Non endémique\",INTRO!$E$41=\"Non endémique\"),\" \",IF(COUNTRY_INFO!A42=0,\" \",COUNTRY_INFO!A42))","v":"SENEGAL"},{"$f":"IF(AND(INTRO!$E$37=\"Non endémique\",INTRO!$E$41=\"Non endémique\"),\" \",IF(COUNTRY_INFO!B42=0,\" \",COUNTRY_INFO!B42))","v":"Kédougou"},{"$f":"IF(AND(INTRO!$E$37=\"Non endémique\",INTRO!$E$41=\"Non endémique\"),\" \",IF(COUNTRY_INFO!C42=0,\" \",COUNTRY_INFO!C42))","v":"Kédougou"},{"$f":"IF(AND(INTRO!$E$37=\"Non endémique\",INTRO!$E$41=\"Non endémique\"),0,COUNTRY_INFO!V42)","v":0},{"$f":"IF(AND(INTRO!$E$37=\"Non endémique\",INTRO!$E$41=\"Non endémique\"),0,COUNTRY_INFO!X42)","v":0},{"$f":"IF(INTRO!$E$39=\"Non endémique\",IF($D42=1,DEC!I42,0),IF($D42=1,IVM!G42,0))","v":0},null,{"$f":"IF(OR(COUNTRY_INFO!N42=\"Inconnu\",COUNTRY_INFO!N42=\"Surveillance\",COUNTRY_INFO!N42=\"Non requis\",COUNTRY_INFO!N42=0),0,IF(INTRO!$E$39=\"Non endémique\",IF(AND($E42<>0,$G42=\"\"),IF($F42=0,COUNTRY_INFO!N42*$E42,COUNTRY_INFO!N42*($E42-$D42)),IF(AND($E42<>0,$G42<>0),IF($F42=0,COUNTRY_INFO!N42*$G42,COUNTRY_INFO!N42*($G42-$D42)),0)),IF($G42=\"\",COUNTRY_INFO!N42*$E42,COUNTRY_INFO!N42*$G42)))","v":0},{"$f":"IF(OR(COUNTRY_INFO!O42=\"Inconnu\",COUNTRY_INFO!O42=\"Surveillance\",COUNTRY_INFO!O42=\"Non requis\",COUNTRY_INFO!O42=0),0,IF($E42<>0, IF($F42=0,COUNTRY_INFO!O42*$E42,COUNTRY_INFO!O42*($E42-$D42)),COUNTRY_INFO!O42*$E42))","v":0},null,{"$f":"IF(OR(COUNTRY_INFO!P42=\"Inconnu\",COUNTRY_INFO!P42=\"Surveillance\",COUNTRY_INFO!P42=\"Non requis\",COUNTRY_INFO!P42=0),0,IF(AND($E42<>0,$J42=\"\"),IF($F42=0,COUNTRY_INFO!P42*$E42,COUNTRY_INFO!P42*($E42-$D42)), IF(AND($E42<>0,$J42<>0),IF($F42=0,COUNTRY_INFO!P42*$J42,COUNTRY_INFO!P42*($J42-$D42)), COUNTRY_INFO!P42*$J42)))","v":0},0,0,null,0,0,null,0,0,null,0]
[{"$f":"IF(AND(INTRO!$E$37=\"Non endémique\",INTRO!$E$41=\"Non endémique\"),\" \",IF(COUNTRY_INFO!A43=0,\" \",COUNTRY_INFO!A43))","v":"SENEGAL"},{"$f":"IF(AND(INTRO!$E$37=\"Non endémique\",INTRO!$E$41=\"Non endémique\"),\" \",IF(COUNTRY_INFO!B43=0,\" \",COUNTRY_INFO!B43))","v":"Kédougou"},{"$f":"IF(AND(INTRO!$E$37=\"Non endémique\",INTRO!$E$41=\"Non endémique\"),\" \",IF(COUNTRY_INFO!C43=0,\" \",COUNTRY_INFO!C43))","v":"Salemata"},{"$f":"IF(AND(INTRO!$E$37=\"Non endémique\",INTRO!$E$41=\"Non endémique\"),0,COUNTRY_INFO!V43)","v":0},{"$f":"IF(AND(INTRO!$E$37=\"Non endémique\",INTRO!$E$41=\"Non endémique\"),0,COUNTRY_INFO!X43)","v":0},{"$f":"IF(INTRO!$E$39=\"Non endémique\",IF($D43=1,DEC!I43,0),IF($D43=1,IVM!G43,0))","v":0},null,{"$f":"IF(OR(COUNTRY_INFO!N43=\"Inconnu\",COUNTRY_INFO!N43=\"Surveillance\",COUNTRY_INFO!N43=\"Non requis\",COUNTRY_INFO!N43=0),0,IF(INTRO!$E$39=\"Non endémique\",IF(AND($E43<>0,$G43=\"\"),IF($F43=0,COUNTRY_INFO!N43*$E43,COUNTRY_INFO!N43*($E43-$D43)),IF(AND($E43<>0,$G43<>0),IF($F43=0,COUNTRY_INFO!N43*$G43,COUNTRY_INFO!N43*($G43-$D43)),0)),IF($G43=\"\",COUNTRY_INFO!N43*$E43,COUNTRY_INFO!N43*$G43)))","v":0},{"$f":"IF(OR(COUNTRY_INFO!O43=\"Inconnu\",COUNTRY_INFO!O43=\"Surveillance\",COUNTRY_INFO!O43=\"Non requis\",COUNTRY_INFO!O43=0),0,IF($E43<>0, IF($F43=0,COUNTRY_INFO!O43*$E43,COUNTRY_INFO!O43*($E43-$D43)),COUNTRY_INFO!O43*$E43))","v":0},null,{"$f":"IF(OR(COUNTRY_INFO!P43=\"Inconnu\",COUNTRY_INFO!P43=\"Surveillance\",COUNTRY_INFO!P43=\"Non requis\",COUNTRY_INFO!P43=0),0,IF(AND($E43<>0,$J43=\"\"),IF($F43=0,COUNTRY_INFO!P43*$E43,COUNTRY_INFO!P43*($E43-$D43)), IF(AND($E43<>0,$J43<>0),IF($F43=0,COUNTRY_INFO!P43*$J43,COUNTRY_INFO!P43*($J43-$D43)), COUNTRY_INFO!P43*$J43)))","v":0},0,0,null,0,0,null,0,0,null,0]
[{"$f":"IF(AND(INTRO!$E$37=\"Non endémique\",INTRO!$E$41=\"Non endémique\"),\" \",IF(COUNTRY_INFO!A44=0,\" \",COUNTRY_INFO!A44))","v":"SENEGAL"},{"$f":"IF(AND(INTRO!$E$37=\"Non endémique\",INTRO!$E$41=\"Non endémique\"),\" \",IF(COUNTRY_INFO!B44=0,\" \",COUNTRY_INFO!B44))","v":"Kédougou"},{"$f":"IF(AND(INTRO!$E$37=\"Non endémique\",INTRO!$E$41=\"Non endémique\"),\" \",IF(COUNTRY_INFO!C44=0,\" \",COUNTRY_INFO!C44))","v":"Saraya"},{"$f":"IF(AND(INTRO!$E$37=\"Non endémique\",INTRO!$E$41=\"Non endémique\"),0,COUNTRY_INFO!V44)","v":0},{"$f":"IF(AND(INTRO!$E$37=\"Non endémique\",INTRO!$E$41=\"Non endémique\"),0,COUNTRY_INFO!X44)","v":0},{"$f":"IF(INTRO!$E$39=\"Non endémique\",IF($D44=1,DEC!I44,0),IF($D44=1,IVM!G44,0))","v":0},null,{"$f":"IF(OR(COUNTRY_INFO!N44=\"Inconnu\",COUNTRY_INFO!N44=\"Surveillance\",COUNTRY_INFO!N44=\"Non requis\",COUNTRY_INFO!N44=0),0,IF(INTRO!$E$39=\"Non endémique\",IF(AND($E44<>0,$G44=\"\"),IF($F44=0,COUNTRY_INFO!N44*$E44,COUNTRY_INFO!N44*($E44-$D44)),IF(AND($E44<>0,$G44<>0),IF($F44=0,COUNTRY_INFO!N44*$G44,COUNTRY_INFO!N44*($G44-$D44)),0)),IF($G44=\"\",COUNTRY_INFO!N44*$E44,COUNTRY_INFO!N44*$G44)))","v":0},{"$f":"IF(OR(COUNTRY_INFO!O44=\"Inconnu\",COUNTRY_INFO!O44=\"Surveillance\",COUNTRY_INFO!O44=\"Non requis\",COUNTRY_INFO!O44=0),0,IF($E44<>0, IF($F44=0,COUNTRY_INFO!O44*$E44,COUNTRY_INFO!O44*($E44-$D44)),COUNTRY_INFO!O44*$E44))","v":0},null,{"$f":"IF(OR(COUNTRY_INFO!P44=\"Inconnu\",COUNTRY_INFO!P44=\"Surveillance\",COUNTRY_INFO!P44=\"Non requis\",COUNTRY_INFO!P44=0),0,IF(AND($E44<>0,$J44=\"\"),IF($F44=0,COUNTRY_INFO!P44*$E44,COUNTRY_INFO!P44*($E44-$D44)), IF(AND($E44<>0,$J44<>0),IF($F44=0,COUNTRY_INFO!P44*$J44,COUNTRY_INFO!P44*($J44-$D44)), COUNTRY_INFO!P44*$J44)))","v":0},0,0,null,0,0,null,0,0,null,0]
[{"$f":"IF(AND(INTRO!$E$37=\"Non endémique\",INTRO!$E$41=\"Non endémique\"),\" \",IF(COUNTRY_INFO!A45=0,\" \",COUNTRY_INFO!A45))","v":"SENEGAL"},{"$f":"IF(AND(INTRO!$E$37=\"Non endémique\",INTRO!$E$41=\"Non endémique\"),\" \",IF(COUNTRY_INFO!B45=0,\" \",COUNTRY_INFO!B45))","v":"Kolda"},{"$f":"IF(AND(INTRO!$E$37=\"Non endémique\",INTRO!$E$41=\"Non endémique\"),\" \",IF(COUNTRY_INFO!C45=0,\" \",COUNTRY_INFO!C45))","v":"Kolda"},{"$f":"IF(AND(INTRO!$E$37=\"Non endémique\",INTRO!$E$41=\"Non endémique\"),0,COUNTRY_INFO!V45)","v":0},{"$f":"IF(AND(INTRO!$E$37=\"Non endémique\",INTRO!$E$41=\"Non endémique\"),0,COUNTRY_INFO!X45)","v":0},{"$f":"IF(INTRO!$E$39=\"Non endémique\",IF($D45=1,DEC!I45,0),IF($D45=1,IVM!G45,0))","v":0},null,{"$f":"IF(OR(COUNTRY_INFO!N45=\"Inconnu\",COUNTRY_INFO!N45=\"Surveillance\",COUNTRY_INFO!N45=\"Non requis\",COUNTRY_INFO!N45=0),0,IF(INTRO!$E$39=\"Non endémique\",IF(AND($E45<>0,$G45=\"\"),IF($F45=0,COUNTRY_INFO!N45*$E45,COUNTRY_INFO!N45*($E45-$D45)),IF(AND($E45<>0,$G45<>0),IF($F45=0,COUNTRY_INFO!N45*$G45,COUNTRY_INFO!N45*($G45-$D45)),0)),IF($G45=\"\",COUNTRY_INFO!N45*$E45,COUNTRY_INFO!N45*$G45)))","v":0},{"$f":"IF(OR(COUNTRY_INFO!O45=\"Inconnu\",COUNTRY_INFO!O45=\"Surveillance\",COUNTRY_INFO!O45=\"Non requis\",COUNTRY_INFO!O45=0),0,IF($E45<>0, IF($F45=0,COUNTRY_INFO!O45*$E45,COUNTRY_INFO!O45*($E45-$D45)),COUNTRY_INFO!O45*$E45))","v":0},null,{"$f":"IF(OR(COUNTRY_INFO!P45=\"Inconnu\",COUNTRY_INFO!P45=\"Surveillance\",COUNTRY_INFO!P45=\"Non requis\",COUNTRY_INFO!P45=0),0,IF(AND($E45<>0,$J45=\"\"),IF($F45=0,COUNTRY_INFO!P45*$E45,COUNTRY_INFO!P45*($E45-$D45)), IF(AND($E45<>0,$J45<>0),IF($F45=0,COUNTRY_INFO!P45*$J45,COUNTRY_INFO!P45*($J45-$D45)), COUNTRY_INFO!P45*$J45)))","v":0},0,0,null,0,0,null,0,0,null,0]
[{"$f":"IF(AND(INTRO!$E$37=\"Non endémique\",INTRO!$E$41=\"Non endémique\"),\" \",IF(COUNTRY_INFO!A46=0,\" \",COUNTRY_INFO!A46))","v":"SENEGAL"},{"$f":"IF(AND(INTRO!$E$37=\"Non endémique\",INTRO!$E$41=\"Non endémique\"),\" \",IF(COUNTRY_INFO!B46=0,\" \",COUNTRY_INFO!B46))","v":"Kolda"},{"$f":"IF(AND(INTRO!$E$37=\"Non endémique\",INTRO!$E$41=\"Non endémique\"),\" \",IF(COUNTRY_INFO!C46=0,\" \",COUNTRY_INFO!C46))","v":"Medina Yoro Foulah"},{"$f":"IF(AND(INTRO!$E$37=\"Non endémique\",INTRO!$E$41=\"Non endémique\"),0,COUNTRY_INFO!V46)","v":0},{"$f":"IF(AND(INTRO!$E$37=\"Non endémique\",INTRO!$E$41=\"Non endémique\"),0,COUNTRY_INFO!X46)","v":0},{"$f":"IF(INTRO!$E$39=\"Non endémique\",IF($D46=1,DEC!I46,0),IF($D46=1,IVM!G46,0))","v":0},null,{"$f":"IF(OR(COUNTRY_INFO!N46=\"Inconnu\",COUNTRY_INFO!N46=\"Surveillance\",COUNTRY_INFO!N46=\"Non requis\",COUNTRY_INFO!N46=0),0,IF(INTRO!$E$39=\"Non endémique\",IF(AND($E46<>0,$G46=\"\"),IF($F46=0,COUNTRY_INFO!N46*$E46,COUNTRY_INFO!N46*($E46-$D46)),IF(AND($E46<>0,$G46<>0),IF($F46=0,COUNTRY_INFO!N46*$G46,COUNTRY_INFO!N46*($G46-$D46)),0)),IF($G46=\"\",COUNTRY_INFO!N46*$E46,COUNTRY_INFO!N46*$G46)))","v":0},{"$f":"IF(OR(COUNTRY_INFO!O46=\"Inconnu\",COUNTRY_INFO!O46=\"Surveillance\",COUNTRY_INFO!O46=\"Non requis\",COUNTRY_INFO!O46=0),0,IF($E46<>0, IF($F46=0,COUNTRY_INFO!O46*$E46,COUNTRY_INFO!O46*($E46-$D46)),COUNTRY_INFO!O46*$E46))","v":0},null,{"$f":"IF(OR(COUNTRY_INFO!P46=\"Inconnu\",COUNTRY_INFO!P46=\"Surveillance\",COUNTRY_INFO!P46=\"Non requis\",COUNTRY_INFO!P46=0),0,IF(AND($E46<>0,$J46=\"\"),IF($F46=0,COUNTRY_INFO!P46*$E46,COUNTRY_INFO!P46*($E46-$D46)), IF(AND($E46<>0,$J46<>0),IF($F46=0,COUNTRY_INFO!P46*$J46,COUNTRY_INFO!P46*($J46-$D46)), COUNTRY_INFO!P46*$J46)))","v":0},0,0,null,0,0,null,0,0,null,0]
[{"$f":"IF(AND(INTRO!$E$37=\"Non endémique\",INTRO!$E$41=\"Non endémique\"),\" \",IF(COUNTRY_INFO!A47=0,\" \",COUNTRY_INFO!A47))","v":"SENEGAL"},{"$f":"IF(AND(INTRO!$E$37=\"Non endémique\",INTRO!$E$41=\"Non endémique\"),\" \",IF(COUNTRY_INFO!B47=0,\" \",COUNTRY_INFO!B47))","v":"Kolda"},{"$f":"IF(AND(INTRO!$E$37=\"Non endémique\",INTRO!$E$41=\"Non endémique\"),\" \",IF(COUNTRY_INFO!C47=0,\" \",COUNTRY_INFO!C47))","v":"Velingara"},{"$f":"IF(AND(INTRO!$E$37=\"Non endémique\",INTRO!$E$41=\"Non endémique\"),0,COUNTRY_INFO!V47)","v":0},{"$f":"IF(AND(INTRO!$E$37=\"Non endémique\",INTRO!$E$41=\"Non endémique\"),0,COUNTRY_INFO!X47)","v":0},{"$f":"IF(INTRO!$E$39=\"Non endémique\",IF($D47=1,DEC!I47,0),IF($D47=1,IVM!G47,0))","v":0},null,{"$f":"IF(OR(COUNTRY_INFO!N47=\"Inconnu\",COUNTRY_INFO!N47=\"Surveillance\",COUNTRY_INFO!N47=\"Non requis\",COUNTRY_INFO!N47=0),0,IF(INTRO!$E$39=\"Non endémique\",IF(AND($E47<>0,$G47=\"\"),IF($F47=0,COUNTRY_INFO!N47*$E47,COUNTRY_INFO!N47*($E47-$D47)),IF(AND($E47<>0,$G47<>0),IF($F47=0,COUNTRY_INFO!N47*$G47,COUNTRY_INFO!N47*($G47-$D47)),0)),IF($G47=\"\",COUNTRY_INFO!N47*$E47,COUNTRY_INFO!N47*$G47)))","v":0},{"$f":"IF(OR(COUNTRY_INFO!O47=\"Inconnu\",COUNTRY_INFO!O47=\"Surveillance\",COUNTRY_INFO!O47=\"Non requis\",COUNTRY_INFO!O47=0),0,IF($E47<>0, IF($F47=0,COUNTRY_INFO!O47*$E47,COUNTRY_INFO!O47*($E47-$D47)),COUNTRY_INFO!O47*$E47))","v":0},null,{"$f":"IF(OR(COUNTRY_INFO!P47=\"Inconnu\",COUNTRY_INFO!P47=\"Surveillance\",COUNTRY_INFO!P47=\"Non requis\",COUNTRY_INFO!P47=0),0,IF(AND($E47<>0,$J47=\"\"),IF($F47=0,COUNTRY_INFO!P47*$E47,COUNTRY_INFO!P47*($E47-$D47)), IF(AND($E47<>0,$J47<>0),IF($F47=0,COUNTRY_INFO!P47*$J47,COUNTRY_INFO!P47*($J47-$D47)), COUNTRY_INFO!P47*$J47)))","v":0},0,0,null,0,0,null,0,0,null,0]
[{"$f":"IF(AND(INTRO!$E$37=\"Non endémique\",INTRO!$E$41=\"Non endémique\"),\" \",IF(COUNTRY_INFO!A48=0,\" \",COUNTRY_INFO!A48))","v":"SENEGAL"},{"$f":"IF(AND(INTRO!$E$37=\"Non endémique\",INTRO!$E$41=\"Non endémique\"),\" \",IF(COUNTRY_INFO!B48=0,\" \",COUNTRY_INFO!B48))","v":"Louga"},{"$f":"IF(AND(INTRO!$E$37=\"Non endémique\",INTRO!$E$41=\"Non endémique\"),\" \",IF(COUNTRY_INFO!C48=0,\" \",COUNTRY_INFO!C48))","v":"Darou-Mousty"},{"$f":"IF(AND(INTRO!$E$37=\"Non endémique\",INTRO!$E$41=\"Non endémique\"),0,COUNTRY_INFO!V48)","v":0},{"$f":"IF(AND(INTRO!$E$37=\"Non endémique\",INTRO!$E$41=\"Non endémique\"),0,COUNTRY_INFO!X48)","v":0},{"$f":"IF(INTRO!$E$39=\"Non endémique\",IF($D48=1,DEC!I48,0),IF($D48=1,IVM!G48,0))","v":0},null,{"$f":"IF(OR(COUNTRY_INFO!N48=\"Inconnu\",COUNTRY_INFO!N48=\"Surveillance\",COUNTRY_INFO!N48=\"Non requis\",COUNTRY_INFO!N48=0),0,IF(INTRO!$E$39=\"Non endémique\",IF(AND($E48<>0,$G48=\"\"),IF($F48=0,COUNTRY_INFO!N48*$E48,COUNTRY_INFO!N48*($E48-$D48)),IF(AND($E48<>0,$G48<>0),IF($F48=0,COUNTRY_INFO!N48*$G48,COUNTRY_INFO!N48*($G48-$D48)),0)),IF($G48=\"\",COUNTRY_INFO!N48*$E48,COUNTRY_INFO!N48*$G48)))","v":0},{"$f":"IF(OR(COUNTRY_INFO!O48=\"Inconnu\",COUNTRY_INFO!O48=\"Surveillance\",COUNTRY_INFO!O48=\"Non requis\",COUNTRY_INFO!O48=0),0,IF($E48<>0, IF($F48=0,COUNTRY_INFO!O48*$E48,COUNTRY_INFO!O48*($E48-$D48)),COUNTRY_INFO!O48*$E48))","v":0},null,{"$f":"IF(OR(COUNTRY_INFO!P48=\"Inconnu\",COUNTRY_INFO!P48=\"Surveillance\",COUNTRY_INFO!P48=\"Non requis\",COUNTRY_INFO!P48=0),0,IF(AND($E48<>0,$J48=\"\"),IF($F48=0,COUNTRY_INFO!P48*$E48,COUNTRY_INFO!P48*($E48-$D48)), IF(AND($E48<>0,$J48<>0),IF($F48=0,COUNTRY_INFO!P48*$J48,COUNTRY_INFO!P48*($J48-$D48)), COUNTRY_INFO!P48*$J48)))","v":0},0,0,null,0,0,null,0,0,null,0]
[{"$f":"IF(AND(INTRO!$E$37=\"Non endémique\",INTRO!$E$41=\"Non endémique\"),\" \",IF(COUNTRY_INFO!A49=0,\" \",COUNTRY_INFO!A49))","v":"SENEGAL"},{"$f":"IF(AND(INTRO!$E$37=\"Non endémique\",INTRO!$E$41=\"Non endémique\"),\" \",IF(COUNTRY_INFO!B49=0,\" \",COUNTRY_INFO!B49))","v":"Louga"},{"$f":"IF(AND(INTRO!$E$37=\"Non endémique\",INTRO!$E$41=\"Non endémique\"),\" \",IF(COUNTRY_INFO!C49=0,\" \",COUNTRY_INFO!C49))","v":"Kébémer"},{"$f":"IF(AND(INTRO!$E$37=\"Non endémique\",INTRO!$E$41=\"Non endémique\"),0,COUNTRY_INFO!V49)","v":0},{"$f":"IF(AND(INTRO!$E$37=\"Non endémique\",INTRO!$E$41=\"Non endémique\"),0,COUNTRY_INFO!X49)","v":0},{"$f":"IF(INTRO!$E$39=\"Non endémique\",IF($D49=1,DEC!I49,0),IF($D49=1,IVM!G49,0))","v":0},null,{"$f":"IF(OR(COUNTRY_INFO!N49=\"Inconnu\",COUNTRY_INFO!N49=\"Surveillance\",COUNTRY_INFO!N49=\"Non requis\",COUNTRY_INFO!N49=0),0,IF(INTRO!$E$39=\"Non endémique\",IF(AND($E49<>0,$G49=\"\"),IF($F49=0,COUNTRY_INFO!N49*$E49,COUNTRY_INFO!N49*($E49-$D49)),IF(AND($E49<>0,$G49<>0),IF($F49=0,COUNTRY_INFO!N49*$G49,COUNTRY_INFO!N49*($G49-$D49)),0)),IF($G49=\"\",COUNTRY_INFO!N49*$E49,COUNTRY_INFO!N49*$G49)))","v":0},{"$f":"IF(OR(COUNTRY_INFO!O49=\"Inconnu\",COUNTRY_INFO!O49=\"Surveillance\",COUNTRY_INFO!O49=\"Non requis\",COUNTRY_INFO!O49=0),0,IF($E49<>0, IF($F49=0,COUNTRY_INFO!O49*$E49,COUNTRY_INFO!O49*($E49-$D49)),COUNTRY_INFO!O49*$E49))","v":0},null,{"$f":"IF(OR(COUNTRY_INFO!P49=\"Inconnu\",COUNTRY_INFO!P49=\"Surveillance\",COUNTRY_INFO!P49=\"Non requis\",COUNTRY_INFO!P49=0),0,IF(AND($E49<>0,$J49=\"\"),IF($F49=0,COUNTRY_INFO!P49*$E49,COUNTRY_INFO!P49*($E49-$D49)), IF(AND($E49<>0,$J49<>0),IF($F49=0,COUNTRY_INFO!P49*$J49,COUNTRY_INFO!P49*($J49-$D49)), COUNTRY_INFO!P49*$J49)))","v":0},0,0,null,0,0,null,0,0,null,0]
[{"$f":"IF(AND(INTRO!$E$37=\"Non endémique\",INTRO!$E$41=\"Non endémique\"),\" \",IF(COUNTRY_INFO!A50=0,\" \",COUNTRY_INFO!A50))","v":"SENEGAL"},{"$f":"IF(AND(INTRO!$E$37=\"Non endémique\",INTRO!$E$41=\"Non endémique\"),\" \",IF(COUNTRY_INFO!B50=0,\" \",COUNTRY_INFO!B50))","v":"Louga"},{"$f":"IF(AND(INTRO!$E$37=\"Non endémique\",INTRO!$E$41=\"Non endémique\"),\" \",IF(COUNTRY_INFO!C50=0,\" \",COUNTRY_INFO!C50))","v":"Linguère"},{"$f":"IF(AND(INTRO!$E$37=\"Non endémique\",INTRO!$E$41=\"Non endémique\"),0,COUNTRY_INFO!V50)","v":0},{"$f":"IF(AND(INTRO!$E$37=\"Non endémique\",INTRO!$E$41=\"Non endémique\"),0,COUNTRY_INFO!X50)","v":0},{"$f":"IF(INTRO!$E$39=\"Non endémique\",IF($D50=1,DEC!I50,0),IF($D50=1,IVM!G50,0))","v":0},null,{"$f":"IF(OR(COUNTRY_INFO!N50=\"Inconnu\",COUNTRY_INFO!N50=\"Surveillance\",COUNTRY_INFO!N50=\"Non requis\",COUNTRY_INFO!N50=0),0,IF(INTRO!$E$39=\"Non endémique\",IF(AND($E50<>0,$G50=\"\"),IF($F50=0,COUNTRY_INFO!N50*$E50,COUNTRY_INFO!N50*($E50-$D50)),IF(AND($E50<>0,$G50<>0),IF($F50=0,COUNTRY_INFO!N50*$G50,COUNTRY_INFO!N50*($G50-$D50)),0)),IF($G50=\"\",COUNTRY_INFO!N50*$E50,COUNTRY_INFO!N50*$G50)))","v":0},{"$f":"IF(OR(COUNTRY_INFO!O50=\"Inconnu\",COUNTRY_INFO!O50=\"Surveillance\",COUNTRY_INFO!O50=\"Non requis\",COUNTRY_INFO!O50=0),0,IF($E50<>0, IF($F50=0,COUNTRY_INFO!O50*$E50,COUNTRY_INFO!O50*($E50-$D50)),COUNTRY_INFO!O50*$E50))","v":0},null,{"$f":"IF(OR(COUNTRY_INFO!P50=\"Inconnu\",COUNTRY_INFO!P50=\"Surveillance\",COUNTRY_INFO!P50=\"Non requis\",COUNTRY_INFO!P50=0),0,IF(AND($E50<>0,$J50=\"\"),IF($F50=0,COUNTRY_INFO!P50*$E50,COUNTRY_INFO!P50*($E50-$D50)), IF(AND($E50<>0,$J50<>0),IF($F50=0,COUNTRY_INFO!P50*$J50,COUNTRY_INFO!P50*($J50-$D50)), COUNTRY_INFO!P50*$J50)))","v":0},0,0,null,0,0,null,0,0,null,0]
[{"$f":"IF(AND(INTRO!$E$37=\"Non endémique\",INTRO!$E$41=\"Non endémique\"),\" \",IF(COUNTRY_INFO!A51=0,\" \",COUNTRY_INFO!A51))","v":"SENEGAL"},{"$f":"IF(AND(INTRO!$E$37=\"Non endémique\",INTRO!$E$41=\"Non endémique\"),\" \",IF(COUNTRY_INFO!B51=0,\" \",COUNTRY_INFO!B51))","v":"Louga"},{"$f":"IF(AND(INTRO!$E$37=\"Non endémique\",INTRO!$E$41=\"Non endémique\"),\" \",IF(COUNTRY_INFO!C51=0,\" \",COUNTRY_INFO!C51))","v":"Dahra"},{"$f":"IF(AND(INTRO!$E$37=\"Non endémique\",INTRO!$E$41=\"Non endémique\"),0,COUNTRY_INFO!V51)","v":0},{"$f":"IF(AND(INTRO!$E$37=\"Non endémique\",INTRO!$E$41=\"Non endémique\"),0,COUNTRY_INFO!X51)","v":0},{"$f":"IF(INTRO!$E$39=\"Non endémique\",IF($D51=1,DEC!I51,0),IF($D51=1,IVM!G51,0))","v":0},null,{"$f":"IF(OR(COUNTRY_INFO!N51=\"Inconnu\",COUNTRY_INFO!N51=\"Surveillance\",COUNTRY_INFO!N51=\"Non requis\",COUNTRY_INFO!N51=0),0,IF(INTRO!$E$39=\"Non endémique\",IF(AND($E51<>0,$G51=\"\"),IF($F51=0,COUNTRY_INFO!N51*$E51,COUNTRY_INFO!N51*($E51-$D51)),IF(AND($E51<>0,$G51<>0),IF($F51=0,COUNTRY_INFO!N51*$G51,COUNTRY_INFO!N51*($G51-$D51)),0)),IF($G51=\"\",COUNTRY_INFO!N51*$E51,COUNTRY_INFO!N51*$G51)))","v":0},{"$f":"IF(OR(COUNTRY_INFO!O51=\"Inconnu\",COUNTRY_INFO!O51=\"Surveillance\",COUNTRY_INFO!O51=\"Non requis\",COUNTRY_INFO!O51=0),0,IF($E51<>0, IF($F51=0,COUNTRY_INFO!O51*$E51,COUNTRY_INFO!O51*($E51-$D51)),COUNTRY_INFO!O51*$E51))","v":0},null,{"$f":"IF(OR(COUNTRY_INFO!P51=\"Inconnu\",COUNTRY_INFO!P51=\"Surveillance\",COUNTRY_INFO!P51=\"Non requis\",COUNTRY_INFO!P51=0),0,IF(AND($E51<>0,$J51=\"\"),IF($F51=0,COUNTRY_INFO!P51*$E51,COUNTRY_INFO!P51*($E51-$D51)), IF(AND($E51<>0,$J51<>0),IF($F51=0,COUNTRY_INFO!P51*$J51,COUNTRY_INFO!P51*($J51-$D51)), COUNTRY_INFO!P51*$J51)))","v":0},0,0,null,0,0,null,0,0,null,0]
[{"$f":"IF(AND(INTRO!$E$37=\"Non endémique\",INTRO!$E$41=\"Non endémique\"),\" \",IF(COUNTRY_INFO!A52=0,\" \",COUNTRY_INFO!A52))","v":"SENEGAL"},{"$f":"IF(AND(INTRO!$E$37=\"Non endémique\",INTRO!$E$41=\"Non endémique\"),\" \",IF(COUNTRY_INFO!B52=0,\" \",COUNTRY_INFO!B52))","v":"Louga"},{"$f":"IF(AND(INTRO!$E$37=\"Non endémique\",INTRO!$E$41=\"Non endémique\"),\" \",IF(COUNTRY_INFO!C52=0,\" \",COUNTRY_INFO!C52))","v":"Coki"},{"$f":"IF(AND(INTRO!$E$37=\"Non endémique\",INTRO!$E$41=\"Non endémique\"),0,COUNTRY_INFO!V52)","v":1},{"$f":"IF(AND(INTRO!$E$37=\"Non endémique\",INTRO!$E$41=\"Non endémique\"),0,COUNTRY_INFO!X52)","v":0},{"$f":"IF(INTRO!$E$39=\"Non endémique\",IF($D52=1,DEC!I52,0),IF($D52=1,IVM!G52,0))","v":72781},null,{"$f":"IF(OR(COUNTRY_INFO!N52=\"Inconnu\",COUNTRY_INFO!N52=\"Surveillance\",COUNTRY_INFO!N52=\"Non requis\",COUNTRY_INFO!N52=0),0,IF(INTRO!$E$39=\"Non endémique\",IF(AND($E52<>0,$G52=\"\"),IF($F52=0,COUNTRY_INFO!N52*$E52,COUNTRY_INFO!N52*($E52-$D52)),IF(AND($E52<>0,$G52<>0),IF($F52=0,COUNTRY_INFO!N52*$G52,COUNTRY_INFO!N52*($G52-$D52)),0)),IF($G52=\"\",COUNTRY_INFO!N52*$E52,COUNTRY_INFO!N52*$G52)))","v":0},{"$f":"IF(OR(COUNTRY_INFO!O52=\"Inconnu\",COUNTRY_INFO!O52=\"Surveillance\",COUNTRY_INFO!O52=\"Non requis\",COUNTRY_INFO!O52=0),0,IF($E52<>0, IF($F52=0,COUNTRY_INFO!O52*$E52,COUNTRY_INFO!O52*($E52-$D52)),COUNTRY_INFO!O52*$E52))","v":0},null,{"$f":"IF(OR(COUNTRY_INFO!P52=\"Inconnu\",COUNTRY_INFO!P52=\"Surveillance\",COUNTRY_INFO!P52=\"Non requis\",COUNTRY_INFO!P52=0),0,IF(AND($E52<>0,$J52=\"\"),IF($F52=0,COUNTRY_INFO!P52*$E52,COUNTRY_INFO!P52*($E52-$D52)), IF(AND($E52<>0,$J52<>0),IF($F52=0,COUNTRY_INFO!P52*$J52,COUNTRY_INFO!P52*($J52-$D52)), COUNTRY_INFO!P52*$J52)))","v":0},0,72781,null,72781,0,null,0,0,null,0]
[{"$f":"IF(AND(INTRO!$E$37=\"Non endémique\",INTRO!$E$41=\"Non endémique\"),\" \",IF(COUNTRY_INFO!A53=0,\" \",COUNTRY_INFO!A53))","v":"SENEGAL"},{"$f":"IF(AND(INTRO!$E$37=\"Non endémique\",INTRO!$E$41=\"Non endémique\"),\" \",IF(COUNTRY_INFO!B53=0,\" \",COUNTRY_INFO!B53))","v":"Louga"},{"$f":"IF(AND(INTRO!$E$37=\"Non endémique\",INTRO!$E$41=\"Non endémique\"),\" \",IF(COUNTRY_INFO!C53=0,\" \",COUNTRY_INFO!C53))","v":"Keur Momar Sarr"},{"$f":"IF(AND(INTRO!$E$37=\"Non endémique\",INTRO!$E$41=\"Non endémique\"),0,COUNTRY_INFO!V53)","v":0},{"$f":"IF(AND(INTRO!$E$37=\"Non endémique\",INTRO!$E$41=\"Non endémique\"),0,COUNTRY_INFO!X53)","v":0},{"$f":"IF(INTRO!$E$39=\"Non endémique\",IF($D53=1,DEC!I53,0),IF($D53=1,IVM!G53,0))","v":0},null,{"$f":"IF(OR(COUNTRY_INFO!N53=\"Inconnu\",COUNTRY_INFO!N53=\"Surveillance\",COUNTRY_INFO!N53=\"Non requis\",COUNTRY_INFO!N53=0),0,IF(INTRO!$E$39=\"Non endémique\",IF(AND($E53<>0,$G53=\"\"),IF($F53=0,COUNTRY_INFO!N53*$E53,COUNTRY_INFO!N53*($E53-$D53)),IF(AND($E53<>0,$G53<>0),IF($F53=0,COUNTRY_INFO!N53*$G53,COUNTRY_INFO!N53*($G53-$D53)),0)),IF($G53=\"\",COUNTRY_INFO!N53*$E53,COUNTRY_INFO!N53*$G53)))","v":0},{"$f":"IF(OR(COUNTRY_INFO!O53=\"Inconnu\",COUNTRY_INFO!O53=\"Surveillance\",COUNTRY_INFO!O53=\"Non requis\",COUNTRY_INFO!O53=0),0,IF($E53<>0, IF($F53=0,COUNTRY_INFO!O53*$E53,COUNTRY_INFO!O53*($E53-$D53)),COUNTRY_INFO!O53*$E53))","v":0},null,{"$f":"IF(OR(COUNTRY_INFO!P53=\"Inconnu\",COUNTRY_INFO!P53=\"Surveillance\",COUNTRY_INFO!P53=\"Non requis\",COUNTRY_INFO!P53=0),0,IF(AND($E53<>0,$J53=\"\"),IF($F53=0,COUNTRY_INFO!P53*$E53,COUNTRY_INFO!P53*($E53-$D53)), IF(AND($E53<>0,$J53<>0),IF($F53=0,COUNTRY_INFO!P53*$J53,COUNTRY_INFO!P53*($J53-$D53)), COUNTRY_INFO!P53*$J53)))","v":0},0,0,null,0,0,null,0,0,null,0]
[{"$f":"IF(AND(INTRO!$E$37=\"Non endémique\",INTRO!$E$41=\"Non endémique\"),\" \",IF(COUNTRY_INFO!A54=0,\" \",COUNTRY_INFO!A54))","v":"SENEGAL"},{"$f":"IF(AND(INTRO!$E$37=\"Non endémique\",INTRO!$E$41=\"Non endémique\"),\" \",IF(COUNTRY_INFO!B54=0,\" \",COUNTRY_INFO!B54))","v":"Louga"},{"$f":"IF(AND(INTRO!$E$37=\"Non endémique\",INTRO!$E$41=\"Non endémique\"),\" \",IF(COUNTRY_INFO!C54=0,\" \",COUNTRY_INFO!C54))","v":"Sakal"},{"$f":"IF(AND(INTRO!$E$37=\"Non endémique\",INTRO!$E$41=\"Non endémique\"),0,COUNTRY_INFO!V54)","v":0},{"$f":"IF(AND(INTRO!$E$37=\"Non endémique\",INTRO!$E$41=\"Non endémique\"),0,COUNTRY_INFO!X54)","v":0},{"$f":"IF(INTRO!$E$39=\"Non endémique\",IF($D54=1,DEC!I54,0),IF($D54=1,IVM!G54,0))","v":0},null,{"$f":"IF(OR(COUNTRY_INFO!N54=\"Inconnu\",COUNTRY_INFO!N54=\"Surveillance\",COUNTRY_INFO!N54=\"Non requis\",COUNTRY_INFO!N54=0),0,IF(INTRO!$E$39=\"Non endémique\",IF(AND($E54<>0,$G54=\"\"),IF($F54=0,COUNTRY_INFO!N54*$E54,COUNTRY_INFO!N54*($E54-$D54)),IF(AND($E54<>0,$G54<>0),IF($F54=0,COUNTRY_INFO!N54*$G54,COUNTRY_INFO!N54*($G54-$D54)),0)),IF($G54=\"\",COUNTRY_INFO!N54*$E54,COUNTRY_INFO!N54*$G54)))","v":0},{"$f":"IF(OR(COUNTRY_INFO!O54=\"Inconnu\",COUNTRY_INFO!O54=\"Surveillance\",COUNTRY_INFO!O54=\"Non requis\",COUNTRY_INFO!O54=0),0,IF($E54<>0, IF($F54=0,COUNTRY_INFO!O54*$E54,COUNTRY_INFO!O54*($E54-$D54)),COUNTRY_INFO!O54*$E54))","v":0},null,{"$f":"IF(OR(COUNTRY_INFO!P54=\"Inconnu\",COUNTRY_INFO!P54=\"Surveillance\",COUNTRY_INFO!P54=\"Non requis\",COUNTRY_INFO!P54=0),0,IF(AND($E54<>0,$J54=\"\"),IF($F54=0,COUNTRY_INFO!P54*$E54,COUNTRY_INFO!P54*($E54-$D54)), IF(AND($E54<>0,$J54<>0),IF($F54=0,COUNTRY_INFO!P54*$J54,COUNTRY_INFO!P54*($J54-$D54)), COUNTRY_INFO!P54*$J54)))","v":0},0,0,null,0,0,null,0,0,null,0]
[{"$f":"IF(AND(INTRO!$E$37=\"Non endémique\",INTRO!$E$41=\"Non endémique\"),\" \",IF(COUNTRY_INFO!A55=0,\" \",COUNTRY_INFO!A55))","v":"SENEGAL"},{"$f":"IF(AND(INTRO!$E$37=\"Non endémique\",INTRO!$E$41=\"Non endémique\"),\" \",IF(COUNTRY_INFO!B55=0,\" \",COUNTRY_INFO!B55))","v":"Louga"},{"$f":"IF(AND(INTRO!$E$37=\"Non endémique\",INTRO!$E$41=\"Non endémique\"),\" \",IF(COUNTRY_INFO!C55=0,\" \",COUNTRY_INFO!C55))","v":"Louga"},{"$f":"IF(AND(INTRO!$E$37=\"Non endémique\",INTRO!$E$41=\"Non endémique\"),0,COUNTRY_INFO!V55)","v":1},{"$f":"IF(AND(INTRO!$E$37=\"Non endémique\",INTRO!$E$41=\"Non endémique\"),0,COUNTRY_INFO!X55)","v":0},{"$f":"IF(INTRO!$E$39=\"Non endémique\",IF($D55=1,DEC!I55,0),IF($D55=1,IVM!G55,0))","v":186314},null,{"$f":"IF(OR(COUNTRY_INFO!N55=\"Inconnu\",COUNTRY_INFO!N55=\"Surveillance\",COUNTRY_INFO!N55=\"Non requis\",COUNTRY_INFO!N55=0),0,IF(INTRO!$E$39=\"Non endémique\",IF(AND($E55<>0,$G55=\"\"),IF($F55=0,COUNTRY_INFO!N55*$E55,COUNTRY_INFO!N55*($E55-$D55)),IF(AND($E55<>0,$G55<>0),IF($F55=0,COUNTRY_INFO!N55*$G55,COUNTRY_INFO!N55*($G55-$D55)),0)),IF($G55=\"\",COUNTRY_INFO!N55*$E55,COUNTRY_INFO!N55*$G55)))","v":0},{"$f":"IF(OR(COUNTRY_INFO!O55=\"Inconnu\",COUNTRY_INFO!O55=\"Surveillance\",COUNTRY_INFO!O55=\"Non requis\",COUNTRY_INFO!O55=0),0,IF($E55<>0, IF($F55=0,COUNTRY_INFO!O55*$E55,COUNTRY_INFO!O55*($E55-$D55)),COUNTRY_INFO!O55*$E55))","v":0},null,{"$f":"IF(OR(COUNTRY_INFO!P55=\"Inconnu\",COUNTRY_INFO!P55=\"Surveillance\",COUNTRY_INFO!P55=\"Non requis\",COUNTRY_INFO!P55=0),0,IF(AND($E55<>0,$J55=\"\"),IF($F55=0,COUNTRY_INFO!P55*$E55,COUNTRY_INFO!P55*($E55-$D55)), IF(AND($E55<>0,$J55<>0),IF($F55=0,COUNTRY_INFO!P55*$J55,COUNTRY_INFO!P55*($J55-$D55)), COUNTRY_INFO!P55*$J55)))","v":0},0,186314,null,186314,0,null,0,0,null,0]
[{"$f":"IF(AND(INTRO!$E$37=\"Non endémique\",INTRO!$E$41=\"Non endémique\"),\" \",IF(COUNTRY_INFO!A56=0,\" \",COUNTRY_INFO!A56))","v":"SENEGAL"},{"$f":"IF(AND(INTRO!$E$37=\"Non endémique\",INTRO!$E$41=\"Non endémique\"),\" \",IF(COUNTRY_INFO!B56=0,\" \",COUNTRY_INFO!B56))","v":"Matam"},{"$f":"IF(AND(INTRO!$E$37=\"Non endémique\",INTRO!$E$41=\"Non endémique\"),\" \",IF(COUNTRY_INFO!C56=0,\" \",COUNTRY_INFO!C56))","v":"Kanel"},{"$f":"IF(AND(INTRO!$E$37=\"Non endémique\",INTRO!$E$41=\"Non endémique\"),0,COUNTRY_INFO!V56)","v":0},{"$f":"IF(AND(INTRO!$E$37=\"Non endémique\",INTRO!$E$41=\"Non endémique\"),0,COUNTRY_INFO!X56)","v":0},{"$f":"IF(INTRO!$E$39=\"Non endémique\",IF($D56=1,DEC!I56,0),IF($D56=1,IVM!G56,0))","v":0},null,{"$f":"IF(OR(COUNTRY_INFO!N56=\"Inconnu\",COUNTRY_INFO!N56=\"Surveillance\",COUNTRY_INFO!N56=\"Non requis\",COUNTRY_INFO!N56=0),0,IF(INTRO!$E$39=\"Non endémique\",IF(AND($E56<>0,$G56=\"\"),IF($F56=0,COUNTRY_INFO!N56*$E56,COUNTRY_INFO!N56*($E56-$D56)),IF(AND($E56<>0,$G56<>0),IF($F56=0,COUNTRY_INFO!N56*$G56,COUNTRY_INFO!N56*($G56-$D56)),0)),IF($G56=\"\",COUNTRY_INFO!N56*$E56,COUNTRY_INFO!N56*$G56)))","v":0},{"$f":"IF(OR(COUNTRY_INFO!O56=\"Inconnu\",COUNTRY_INFO!O56=\"Surveillance\",COUNTRY_INFO!O56=\"Non requis\",COUNTRY_INFO!O56=0),0,IF($E56<>0, IF($F56=0,COUNTRY_INFO!O56*$E56,COUNTRY_INFO!O56*($E56-$D56)),COUNTRY_INFO!O56*$E56))","v":0},null,{"$f":"IF(OR(COUNTRY_INFO!P56=\"Inconnu\",COUNTRY_INFO!P56=\"Surveillance\",COUNTRY_INFO!P56=\"Non requis\",COUNTRY_INFO!P56=0),0,IF(AND($E56<>0,$J56=\"\"),IF($F56=0,COUNTRY_INFO!P56*$E56,COUNTRY_INFO!P56*($E56-$D56)), IF(AND($E56<>0,$J56<>0),IF($F56=0,COUNTRY_INFO!P56*$J56,COUNTRY_INFO!P56*($J56-$D56)), COUNTRY_INFO!P56*$J56)))","v":0},0,0,null,0,0,null,0,0,null,0]
[{"$f":"IF(AND(INTRO!$E$37=\"Non endémique\",INTRO!$E$41=\"Non endémique\"),\" \",IF(COUNTRY_INFO!A57=0,\" \",COUNTRY_INFO!A57))","v":"SENEGAL"},{"$f":"IF(AND(INTRO!$E$37=\"Non endémique\",INTRO!$E$41=\"Non endémique\"),\" \",IF(COUNTRY_INFO!B57=0,\" \",COUNTRY_INFO!B57))","v":"Matam"},{"$f":"IF(AND(INTRO!$E$37=\"Non endémique\",INTRO!$E$41=\"Non endémique\"),\" \",IF(COUNTRY_INFO!C57=0,\" \",COUNTRY_INFO!C57))","v":"Matam"},{"$f":"IF(AND(INTRO!$E$37=\"Non endémique\",INTRO!$E$41=\"Non endémique\"),0,COUNTRY_INFO!V57)","v":0},{"$f":"IF(AND(INTRO!$E$37=\"Non endémique\",INTRO!$E$41=\"Non endémique\"),0,COUNTRY_INFO!X57)","v":0},{"$f":"IF(INTRO!$E$39=\"Non endémique\",IF($D57=1,DEC!I57,0),IF($D57=1,IVM!G57,0))","v":0},null,{"$f":"IF(OR(COUNTRY_INFO!N57=\"Inconnu\",COUNTRY_INFO!N57=\"Surveillance\",COUNTRY_INFO!N57=\"Non requis\",COUNTRY_INFO!N57=0),0,IF(INTRO!$E$39=\"Non endémique\",IF(AND($E57<>0,$G57=\"\"),IF($F57=0,COUNTRY_INFO!N57*$E57,COUNTRY_INFO!N57*($E57-$D57)),IF(AND($E57<>0,$G57<>0),IF($F57=0,COUNTRY_INFO!N57*$G57,COUNTRY_INFO!N57*($G57-$D57)),0)),IF($G57=\"\",COUNTRY_INFO!N57*$E57,COUNTRY_INFO!N57*$G57)))","v":0},{"$f":"IF(OR(COUNTRY_INFO!O57=\"Inconnu\",COUNTRY_INFO!O57=\"Surveillance\",COUNTRY_INFO!O57=\"Non requis\",COUNTRY_INFO!O57=0),0,IF($E57<>0, IF($F57=0,COUNTRY_INFO!O57*$E57,COUNTRY_INFO!O57*($E57-$D57)),COUNTRY_INFO!O57*$E57))","v":0},null,{"$f":"IF(OR(COUNTRY_INFO!P57=\"Inconnu\",COUNTRY_INFO!P57=\"Surveillance\",COUNTRY_INFO!P57=\"Non requis\",COUNTRY_INFO!P57=0),0,IF(AND($E57<>0,$J57=\"\"),IF($F57=0,COUNTRY_INFO!P57*$E57,COUNTRY_INFO!P57*($E57-$D57)), IF(AND($E57<>0,$J57<>0),IF($F57=0,COUNTRY_INFO!P57*$J57,COUNTRY_INFO!P57*($J57-$D57)), COUNTRY_INFO!P57*$J57)))","v":0},0,0,null,0,0,null,0,0,null,0]
[{"$f":"IF(AND(INTRO!$E$37=\"Non endémique\",INTRO!$E$41=\"Non endémique\"),\" \",IF(COUNTRY_INFO!A58=0,\" \",COUNTRY_INFO!A58))","v":"SENEGAL"},{"$f":"IF(AND(INTRO!$E$37=\"Non endémique\",INTRO!$E$41=\"Non endémique\"),\" \",IF(COUNTRY_INFO!B58=0,\" \",COUNTRY_INFO!B58))","v":"Matam"},{"$f":"IF(AND(INTRO!$E$37=\"Non endémique\",INTRO!$E$41=\"Non endémique\"),\" \",IF(COUNTRY_INFO!C58=0,\" \",COUNTRY_INFO!C58))","v":"Thilogne"},{"$f":"IF(AND(INTRO!$E$37=\"Non endémique\",INTRO!$E$41=\"Non endémique\"),0,COUNTRY_INFO!V58)","v":0},{"$f":"IF(AND(INTRO!$E$37=\"Non endémique\",INTRO!$E$41=\"Non endémique\"),0,COUNTRY_INFO!X58)","v":0},{"$f":"IF(INTRO!$E$39=\"Non endémique\",IF($D58=1,DEC!I58,0),IF($D58=1,IVM!G58,0))","v":0},null,{"$f":"IF(OR(COUNTRY_INFO!N58=\"Inconnu\",COUNTRY_INFO!N58=\"Surveillance\",COUNTRY_INFO!N58=\"Non requis\",COUNTRY_INFO!N58=0),0,IF(INTRO!$E$39=\"Non endémique\",IF(AND($E58<>0,$G58=\"\"),IF($F58=0,COUNTRY_INFO!N58*$E58,COUNTRY_INFO!N58*($E58-$D58)),IF(AND($E58<>0,$G58<>0),IF($F58=0,COUNTRY_INFO!N58*$G58,COUNTRY_INFO!N58*($G58-$D58)),0)),IF($G58=\"\",COUNTRY_INFO!N58*$E58,COUNTRY_INFO!N58*$G58)))","v":0},{"$f":"IF(OR(COUNTRY_INFO!O58=\"Inconnu\",COUNTRY_INFO!O58=\"Surveillance\",COUNTRY_INFO!O58=\"Non requis\",COUNTRY_INFO!O58=0),0,IF($E58<>0, IF($F58=0,COUNTRY_INFO!O58*$E58,COUNTRY_INFO!O58*($E58-$D58)),COUNTRY_INFO!O58*$E58))","v":0},null,{"$f":"IF(OR(COUNTRY_INFO!P58=\"Inconnu\",COUNTRY_INFO!P58=\"Surveillance\",COUNTRY_INFO!P58=\"Non requis\",COUNTRY_INFO!P58=0),0,IF(AND($E58<>0,$J58=\"\"),IF($F58=0,COUNTRY_INFO!P58*$E58,COUNTRY_INFO!P58*($E58-$D58)), IF(AND($E58<>0,$J58<>0),IF($F58=0,COUNTRY_INFO!P58*$J58,COUNTRY_INFO!P58*($J58-$D58)), COUNTRY_INFO!P58*$J58)))","v":0},0,0,null,0,0,null,0,0,null,0]
[{"$f":"IF(AND(INTRO!$E$37=\"Non endémique\",INTRO!$E$41=\"Non endémique\"),\" \",IF(COUNTRY_INFO!A59=0,\" \",COUNTRY_INFO!A59))","v":"SENEGAL"},{"$f":"IF(AND(INTRO!$E$37=\"Non endémique\",INTRO!$E$41=\"Non endémique\"),\" \",IF(COUNTRY_INFO!B59=0,\" \",COUNTRY_INFO!B59))","v":"Matam"},{"$f":"IF(AND(INTRO!$E$37=\"Non endémique\",INTRO!$E$41=\"Non endémique\"),\" \",IF(COUNTRY_INFO!C59=0,\" \",COUNTRY_INFO!C59))","v":"Ranerou"},{"$f":"IF(AND(INTRO!$E$37=\"Non endémique\",INTRO!$E$41=\"Non endémique\"),0,COUNTRY_INFO!V59)","v":0},{"$f":"IF(AND(INTRO!$E$37=\"Non endémique\",INTRO!$E$41=\"Non endémique\"),0,COUNTRY_INFO!X59)","v":0},{"$f":"IF(INTRO!$E$39=\"Non endémique\",IF($D59=1,DEC!I59,0),IF($D59=1,IVM!G59,0))","v":0},null,{"$f":"IF(OR(COUNTRY_INFO!N59=\"Inconnu\",COUNTRY_INFO!N59=\"Surveillance\",COUNTRY_INFO!N59=\"Non requis\",COUNTRY_INFO!N59=0),0,IF(INTRO!$E$39=\"Non endémique\",IF(AND($E59<>0,$G59=\"\"),IF($F59=0,COUNTRY_INFO!N59*$E59,COUNTRY_INFO!N59*($E59-$D59)),IF(AND($E59<>0,$G59<>0),IF($F59=0,COUNTRY_INFO!N59*$G59,COUNTRY_INFO!N59*($G59-$D59)),0)),IF($G59=\"\",COUNTRY_INFO!N59*$E59,COUNTRY_INFO!N59*$G59)))","v":0},{"$f":"IF(OR(COUNTRY_INFO!O59=\"Inconnu\",COUNTRY_INFO!O59=\"Surveillance\",COUNTRY_INFO!O59=\"Non requis\",COUNTRY_INFO!O59=0),0,IF($E59<>0, IF($F59=0,COUNTRY_INFO!O59*$E59,COUNTRY_INFO!O59*($E59-$D59)),COUNTRY_INFO!O59*$E59))","v":0},null,{"$f":"IF(OR(COUNTRY_INFO!P59=\"Inconnu\",COUNTRY_INFO!P59=\"Surveillance\",COUNTRY_INFO!P59=\"Non requis\",COUNTRY_INFO!P59=0),0,IF(AND($E59<>0,$J59=\"\"),IF($F59=0,COUNTRY_INFO!P59*$E59,COUNTRY_INFO!P59*($E59-$D59)), IF(AND($E59<>0,$J59<>0),IF($F59=0,COUNTRY_INFO!P59*$J59,COUNTRY_INFO!P59*($J59-$D59)), COUNTRY_INFO!P59*$J59)))","v":0},0,0,null,0,0,null,0,0,null,0]
[{"$f":"IF(AND(INTRO!$E$37=\"Non endémique\",INTRO!$E$41=\"Non endémique\"),\" \",IF(COUNTRY_INFO!A60=0,\" \",COUNTRY_INFO!A60))","v":"SENEGAL"},{"$f":"IF(AND(INTRO!$E$37=\"Non endémique\",INTRO!$E$41=\"Non endémique\"),\" \",IF(COUNTRY_INFO!B60=0,\" \",COUNTRY_INFO!B60))","v":"Saint Louis"},{"$f":"IF(AND(INTRO!$E$37=\"Non endémique\",INTRO!$E$41=\"Non endémique\"),\" \",IF(COUNTRY_INFO!C60=0,\" \",COUNTRY_INFO!C60))","v":"Dagana"},{"$f":"IF(AND(INTRO!$E$37=\"Non endémique\",INTRO!$E$41=\"Non endémique\"),0,COUNTRY_INFO!V60)","v":0},{"$f":"IF(AND(INTRO!$E$37=\"Non endémique\",INTRO!$E$41=\"Non endémique\"),0,COUNTRY_INFO!X60)","v":0},{"$f":"IF(INTRO!$E$39=\"Non endémique\",IF($D60=1,DEC!I60,0),IF($D60=1,IVM!G60,0))","v":0},null,{"$f":"IF(OR(COUNTRY_INFO!N60=\"Inconnu\",COUNTRY_INFO!N60=\"Surveillance\",COUNTRY_INFO!N60=\"Non requis\",COUNTRY_INFO!N60=0),0,IF(INTRO!$E$39=\"Non endémique\",IF(AND($E60<>0,$G60=\"\"),IF($F60=0,COUNTRY_INFO!N60*$E60,COUNTRY_INFO!N60*($E60-$D60)),IF(AND($E60<>0,$G60<>0),IF($F60=0,COUNTRY_INFO!N60*$G60,COUNTRY_INFO!N60*($G60-$D60)),0)),IF($G60=\"\",COUNTRY_INFO!N60*$E60,COUNTRY_INFO!N60*$G60)))","v":0},{"$f":"IF(OR(COUNTRY_INFO!O60=\"Inconnu\",COUNTRY_INFO!O60=\"Surveillance\",COUNTRY_INFO!O60=\"Non requis\",COUNTRY_INFO!O60=0),0,IF($E60<>0, IF($F60=0,COUNTRY_INFO!O60*$E60,COUNTRY_INFO!O60*($E60-$D60)),COUNTRY_INFO!O60*$E60))","v":0},null,{"$f":"IF(OR(COUNTRY_INFO!P60=\"Inconnu\",COUNTRY_INFO!P60=\"Surveillance\",COUNTRY_INFO!P60=\"Non requis\",COUNTRY_INFO!P60=0),0,IF(AND($E60<>0,$J60=\"\"),IF($F60=0,COUNTRY_INFO!P60*$E60,COUNTRY_INFO!P60*($E60-$D60)), IF(AND($E60<>0,$J60<>0),IF($F60=0,COUNTRY_INFO!P60*$J60,COUNTRY_INFO!P60*($J60-$D60)), COUNTRY_INFO!P60*$J60)))","v":0},0,0,null,0,0,null,0,0,null,0]
[{"$f":"IF(AND(INTRO!$E$37=\"Non endémique\",INTRO!$E$41=\"Non endémique\"),\" \",IF(COUNTRY_INFO!A61=0,\" \",COUNTRY_INFO!A61))","v":"SENEGAL"},{"$f":"IF(AND(INTRO!$E$37=\"Non endémique\",INTRO!$E$41=\"Non endémique\"),\" \",IF(COUNTRY_INFO!B61=0,\" \",COUNTRY_INFO!B61))","v":"Saint Louis"},{"$f":"IF(AND(INTRO!$E$37=\"Non endémique\",INTRO!$E$41=\"Non endémique\"),\" \",IF(COUNTRY_INFO!C61=0,\" \",COUNTRY_INFO!C61))","v":"Richard Toll"},{"$f":"IF(AND(INTRO!$E$37=\"Non endémique\",INTRO!$E$41=\"Non endémique\"),0,COUNTRY_INFO!V61)","v":0},{"$f":"IF(AND(INTRO!$E$37=\"Non endémique\",INTRO!$E$41=\"Non endémique\"),0,COUNTRY_INFO!X61)","v":0},{"$f":"IF(INTRO!$E$39=\"Non endémique\",IF($D61=1,DEC!I61,0),IF($D61=1,IVM!G61,0))","v":0},null,{"$f":"IF(OR(COUNTRY_INFO!N61=\"Inconnu\",COUNTRY_INFO!N61=\"Surveillance\",COUNTRY_INFO!N61=\"Non requis\",COUNTRY_INFO!N61=0),0,IF(INTRO!$E$39=\"Non endémique\",IF(AND($E61<>0,$G61=\"\"),IF($F61=0,COUNTRY_INFO!N61*$E61,COUNTRY_INFO!N61*($E61-$D61)),IF(AND($E61<>0,$G61<>0),IF($F61=0,COUNTRY_INFO!N61*$G61,COUNTRY_INFO!N61*($G61-$D61)),0)),IF($G61=\"\",COUNTRY_INFO!N61*$E61,COUNTRY_INFO!N61*$G61)))","v":0},{"$f":"IF(OR(COUNTRY_INFO!O61=\"Inconnu\",COUNTRY_INFO!O61=\"Surveillance\",COUNTRY_INFO!O61=\"Non requis\",COUNTRY_INFO!O61=0),0,IF($E61<>0, IF($F61=0,COUNTRY_INFO!O61*$E61,COUNTRY_INFO!O61*($E61-$D61)),COUNTRY_INFO!O61*$E61))","v":0},null,{"$f":"IF(OR(COUNTRY_INFO!P61=\"Inconnu\",COUNTRY_INFO!P61=\"Surveillance\",COUNTRY_INFO!P61=\"Non requis\",COUNTRY_INFO!P61=0),0,IF(AND($E61<>0,$J61=\"\"),IF($F61=0,COUNTRY_INFO!P61*$E61,COUNTRY_INFO!P61*($E61-$D61)), IF(AND($E61<>0,$J61<>0),IF($F61=0,COUNTRY_INFO!P61*$J61,COUNTRY_INFO!P61*($J61-$D61)), COUNTRY_INFO!P61*$J61)))","v":0},0,0,null,0,0,null,0,0,null,0]
[{"$f":"IF(AND(INTRO!$E$37=\"Non endémique\",INTRO!$E$41=\"Non endémique\"),\" \",IF(COUNTRY_INFO!A62=0,\" \",COUNTRY_INFO!A62))","v":"SENEGAL"},{"$f":"IF(AND(INTRO!$E$37=\"Non endémique\",INTRO!$E$41=\"Non endémique\"),\" \",IF(COUNTRY_INFO!B62=0,\" \",COUNTRY_INFO!B62))","v":"Saint Louis"},{"$f":"IF(AND(INTRO!$E$37=\"Non endémique\",INTRO!$E$41=\"Non endémique\"),\" \",IF(COUNTRY_INFO!C62=0,\" \",COUNTRY_INFO!C62))","v":"Peté"},{"$f":"IF(AND(INTRO!$E$37=\"Non endémique\",INTRO!$E$41=\"Non endémique\"),0,COUNTRY_INFO!V62)","v":1},{"$f":"IF(AND(INTRO!$E$37=\"Non endémique\",INTRO!$E$41=\"Non endémique\"),0,COUNTRY_INFO!X62)","v":0},{"$f":"IF(INTRO!$E$39=\"Non endémique\",IF($D62=1,DEC!I62,0),IF($D62=1,IVM!G62,0))","v":185944},null,{"$f":"IF(OR(COUNTRY_INFO!N62=\"Inconnu\",COUNTRY_INFO!N62=\"Surveillance\",COUNTRY_INFO!N62=\"Non requis\",COUNTRY_INFO!N62=0),0,IF(INTRO!$E$39=\"Non endémique\",IF(AND($E62<>0,$G62=\"\"),IF($F62=0,COUNTRY_INFO!N62*$E62,COUNTRY_INFO!N62*($E62-$D62)),IF(AND($E62<>0,$G62<>0),IF($F62=0,COUNTRY_INFO!N62*$G62,COUNTRY_INFO!N62*($G62-$D62)),0)),IF($G62=\"\",COUNTRY_INFO!N62*$E62,COUNTRY_INFO!N62*$G62)))","v":0},{"$f":"IF(OR(COUNTRY_INFO!O62=\"Inconnu\",COUNTRY_INFO!O62=\"Surveillance\",COUNTRY_INFO!O62=\"Non requis\",COUNTRY_INFO!O62=0),0,IF($E62<>0, IF($F62=0,COUNTRY_INFO!O62*$E62,COUNTRY_INFO!O62*($E62-$D62)),COUNTRY_INFO!O62*$E62))","v":0},null,{"$f":"IF(OR(COUNTRY_INFO!P62=\"Inconnu\",COUNTRY_INFO!P62=\"Surveillance\",COUNTRY_INFO!P62=\"Non requis\",COUNTRY_INFO!P62=0),0,IF(AND($E62<>0,$J62=\"\"),IF($F62=0,COUNTRY_INFO!P62*$E62,COUNTRY_INFO!P62*($E62-$D62)), IF(AND($E62<>0,$J62<>0),IF($F62=0,COUNTRY_INFO!P62*$J62,COUNTRY_INFO!P62*($J62-$D62)), COUNTRY_INFO!P62*$J62)))","v":0},0,185944,null,185944,0,null,0,0,null,0]
[{"$f":"IF(AND(INTRO!$E$37=\"Non endémique\",INTRO!$E$41=\"Non endémique\"),\" \",IF(COUNTRY_INFO!A63=0,\" \",COUNTRY_INFO!A63))","v":"SENEGAL"},{"$f":"IF(AND(INTRO!$E$37=\"Non endémique\",INTRO!$E$41=\"Non endémique\"),\" \",IF(COUNTRY_INFO!B63=0,\" \",COUNTRY_INFO!B63))","v":"Saint Louis"},{"$f":"IF(AND(INTRO!$E$37=\"Non endémique\",INTRO!$E$41=\"Non endémique\"),\" \",IF(COUNTRY_INFO!C63=0,\" \",COUNTRY_INFO!C63))","v":"Podor"},{"$f":"IF(AND(INTRO!$E$37=\"Non endémique\",INTRO!$E$41=\"Non endémique\"),0,COUNTRY_INFO!V63)","v":0},{"$f":"IF(AND(INTRO!$E$37=\"Non endémique\",INTRO!$E$41=\"Non endémique\"),0,COUNTRY_INFO!X63)","v":0},{"$f":"IF(INTRO!$E$39=\"Non endémique\",IF($D63=1,DEC!I63,0),IF($D63=1,IVM!G63,0))","v":0},null,{"$f":"IF(OR(COUNTRY_INFO!N63=\"Inconnu\",COUNTRY_INFO!N63=\"Surveillance\",COUNTRY_INFO!N63=\"Non requis\",COUNTRY_INFO!N63=0),0,IF(INTRO!$E$39=\"Non endémique\",IF(AND($E63<>0,$G63=\"\"),IF($F63=0,COUNTRY_INFO!N63*$E63,COUNTRY_INFO!N63*($E63-$D63)),IF(AND($E63<>0,$G63<>0),IF($F63=0,COUNTRY_INFO!N63*$G63,COUNTRY_INFO!N63*($G63-$D63)),0)),IF($G63=\"\",COUNTRY_INFO!N63*$E63,COUNTRY_INFO!N63*$G63)))","v":0},{"$f":"IF(OR(COUNTRY_INFO!O63=\"Inconnu\",COUNTRY_INFO!O63=\"Surveillance\",COUNTRY_INFO!O63=\"Non requis\",COUNTRY_INFO!O63=0),0,IF($E63<>0, IF($F63=0,COUNTRY_INFO!O63*$E63,COUNTRY_INFO!O63*($E63-$D63)),COUNTRY_INFO!O63*$E63))","v":0},null,{"$f":"IF(OR(COUNTRY_INFO!P63=\"Inconnu\",COUNTRY_INFO!P63=\"Surveillance\",COUNTRY_INFO!P63=\"Non requis\",COUNTRY_INFO!P63=0),0,IF(AND($E63<>0,$J63=\"\"),IF($F63=0,COUNTRY_INFO!P63*$E63,COUNTRY_INFO!P63*($E63-$D63)), IF(AND($E63<>0,$J63<>0),IF($F63=0,COUNTRY_INFO!P63*$J63,COUNTRY_INFO!P63*($J63-$D63)), COUNTRY_INFO!P63*$J63)))","v":0},0,0,null,0,0,null,0,0,null,0]
[{"$f":"IF(AND(INTRO!$E$37=\"Non endémique\",INTRO!$E$41=\"Non endémique\"),\" \",IF(COUNTRY_INFO!A64=0,\" \",COUNTRY_INFO!A64))","v":"SENEGAL"},{"$f":"IF(AND(INTRO!$E$37=\"Non endémique\",INTRO!$E$41=\"Non endémique\"),\" \",IF(COUNTRY_INFO!B64=0,\" \",COUNTRY_INFO!B64))","v":"Saint Louis"},{"$f":"IF(AND(INTRO!$E$37=\"Non endémique\",INTRO!$E$41=\"Non endémique\"),\" \",IF(COUNTRY_INFO!C64=0,\" \",COUNTRY_INFO!C64))","v":"Saint Louis"},{"$f":"IF(AND(INTRO!$E$37=\"Non endémique\",INTRO!$E$41=\"Non endémique\"),0,COUNTRY_INFO!V64)","v":0},{"$f":"IF(AND(INTRO!$E$37=\"Non endémique\",INTRO!$E$41=\"Non endémique\"),0,COUNTRY_INFO!X64)","v":0},{"$f":"IF(INTRO!$E$39=\"Non endémique\",IF($D64=1,DEC!I64,0),IF($D64=1,IVM!G64,0))","v":0},null,{"$f":"IF(OR(COUNTRY_INFO!N64=\"Inconnu\",COUNTRY_INFO!N64=\"Surveillance\",COUNTRY_INFO!N64=\"Non requis\",COUNTRY_INFO!N64=0),0,IF(INTRO!$E$39=\"Non endémique\",IF(AND($E64<>0,$G64=\"\"),IF($F64=0,COUNTRY_INFO!N64*$E64,COUNTRY_INFO!N64*($E64-$D64)),IF(AND($E64<>0,$G64<>0),IF($F64=0,COUNTRY_INFO!N64*$G64,COUNTRY_INFO!N64*($G64-$D64)),0)),IF($G64=\"\",COUNTRY_INFO!N64*$E64,COUNTRY_INFO!N64*$G64)))","v":0},{"$f":"IF(OR(COUNTRY_INFO!O64=\"Inconnu\",COUNTRY_INFO!O64=\"Surveillance\",COUNTRY_INFO!O64=\"Non requis\",COUNTRY_INFO!O64=0),0,IF($E64<>0, IF($F64=0,COUNTRY_INFO!O64*$E64,COUNTRY_INFO!O64*($E64-$D64)),COUNTRY_INFO!O64*$E64))","v":0},null,{"$f":"IF(OR(COUNTRY_INFO!P64=\"Inconnu\",COUNTRY_INFO!P64=\"Surveillance\",COUNTRY_INFO!P64=\"Non requis\",COUNTRY_INFO!P64=0),0,IF(AND($E64<>0,$J64=\"\"),IF($F64=0,COUNTRY_INFO!P64*$E64,COUNTRY_INFO!P64*($E64-$D64)), IF(AND($E64<>0,$J64<>0),IF($F64=0,COUNTRY_INFO!P64*$J64,COUNTRY_INFO!P64*($J64-$D64)), COUNTRY_INFO!P64*$J64)))","v":0},0,0,null,0,0,null,0,0,null,0]
[{"$f":"IF(AND(INTRO!$E$37=\"Non endémique\",INTRO!$E$41=\"Non endémique\"),\" \",IF(COUNTRY_INFO!A65=0,\" \",COUNTRY_INFO!A65))","v":"SENEGAL"},{"$f":"IF(AND(INTRO!$E$37=\"Non endémique\",INTRO!$E$41=\"Non endémique\"),\" \",IF(COUNTRY_INFO!B65=0,\" \",COUNTRY_INFO!B65))","v":"Sédhiou"},{"$f":"IF(AND(INTRO!$E$37=\"Non endémique\",INTRO!$E$41=\"Non endémique\"),\" \",IF(COUNTRY_INFO!C65=0,\" \",COUNTRY_INFO!C65))","v":"Bounkiling"},{"$f":"IF(AND(INTRO!$E$37=\"Non endémique\",INTRO!$E$41=\"Non endémique\"),0,COUNTRY_INFO!V65)","v":0},{"$f":"IF(AND(INTRO!$E$37=\"Non endémique\",INTRO!$E$41=\"Non endémique\"),0,COUNTRY_INFO!X65)","v":0},{"$f":"IF(INTRO!$E$39=\"Non endémique\",IF($D65=1,DEC!I65,0),IF($D65=1,IVM!G65,0))","v":0},null,{"$f":"IF(OR(COUNTRY_INFO!N65=\"Inconnu\",COUNTRY_INFO!N65=\"Surveillance\",COUNTRY_INFO!N65=\"Non requis\",COUNTRY_INFO!N65=0),0,IF(INTRO!$E$39=\"Non endémique\",IF(AND($E65<>0,$G65=\"\"),IF($F65=0,COUNTRY_INFO!N65*$E65,COUNTRY_INFO!N65*($E65-$D65)),IF(AND($E65<>0,$G65<>0),IF($F65=0,COUNTRY_INFO!N65*$G65,COUNTRY_INFO!N65*($G65-$D65)),0)),IF($G65=\"\",COUNTRY_INFO!N65*$E65,COUNTRY_INFO!N65*$G65)))","v":0},{"$f":"IF(OR(COUNTRY_INFO!O65=\"Inconnu\",COUNTRY_INFO!O65=\"Surveillance\",COUNTRY_INFO!O65=\"Non requis\",COUNTRY_INFO!O65=0),0,IF($E65<>0, IF($F65=0,COUNTRY_INFO!O65*$E65,COUNTRY_INFO!O65*($E65-$D65)),COUNTRY_INFO!O65*$E65))","v":0},null,{"$f":"IF(OR(COUNTRY_INFO!P65=\"Inconnu\",COUNTRY_INFO!P65=\"Surveillance\",COUNTRY_INFO!P65=\"Non requis\",COUNTRY_INFO!P65=0),0,IF(AND($E65<>0,$J65=\"\"),IF($F65=0,COUNTRY_INFO!P65*$E65,COUNTRY_INFO!P65*($E65-$D65)), IF(AND($E65<>0,$J65<>0),IF($F65=0,COUNTRY_INFO!P65*$J65,COUNTRY_INFO!P65*($J65-$D65)), COUNTRY_INFO!P65*$J65)))","v":0},0,0,null,0,0,null,0,0,null,0]
[{"$f":"IF(AND(INTRO!$E$37=\"Non endémique\",INTRO!$E$41=\"Non endémique\"),\" \",IF(COUNTRY_INFO!A66=0,\" \",COUNTRY_INFO!A66))","v":"SENEGAL"},{"$f":"IF(AND(INTRO!$E$37=\"Non endémique\",INTRO!$E$41=\"Non endémique\"),\" \",IF(COUNTRY_INFO!B66=0,\" \",COUNTRY_INFO!B66))","v":"Sédhiou"},{"$f":"IF(AND(INTRO!$E$37=\"Non endémique\",INTRO!$E$41=\"Non endémique\"),\" \",IF(COUNTRY_INFO!C66=0,\" \",COUNTRY_INFO!C66))","v":"Goudomp"},{"$f":"IF(AND(INTRO!$E$37=\"Non endémique\",INTRO!$E$41=\"Non endémique\"),0,COUNTRY_INFO!V66)","v":0},{"$f":"IF(AND(INTRO!$E$37=\"Non endémique\",INTRO!$E$41=\"Non endémique\"),0,COUNTRY_INFO!X66)","v":0},{"$f":"IF(INTRO!$E$39=\"Non endémique\",IF($D66=1,DEC!I66,0),IF($D66=1,IVM!G66,0))","v":0},null,{"$f":"IF(OR(COUNTRY_INFO!N66=\"Inconnu\",COUNTRY_INFO!N66=\"Surveillance\",COUNTRY_INFO!N66=\"Non requis\",COUNTRY_INFO!N66=0),0,IF(INTRO!$E$39=\"Non endémique\",IF(AND($E66<>0,$G66=\"\"),IF($F66=0,COUNTRY_INFO!N66*$E66,COUNTRY_INFO!N66*($E66-$D66)),IF(AND($E66<>0,$G66<>0),IF($F66=0,COUNTRY_INFO!N66*$G66,COUNTRY_INFO!N66*($G66-$D66)),0)),IF($G66=\"\",COUNTRY_INFO!N66*$E66,COUNTRY_INFO!N66*$G66)))","v":0},{"$f":"IF(OR(COUNTRY_INFO!O66=\"Inconnu\",COUNTRY_INFO!O66=\"Surveillance\",COUNTRY_INFO!O66=\"Non requis\",COUNTRY_INFO!O66=0),0,IF($E66<>0, IF($F66=0,COUNTRY_INFO!O66*$E66,COUNTRY_INFO!O66*($E66-$D66)),COUNTRY_INFO!O66*$E66))","v":0},null,{"$f":"IF(OR(COUNTRY_INFO!P66=\"Inconnu\",COUNTRY_INFO!P66=\"Surveillance\",COUNTRY_INFO!P66=\"Non requis\",COUNTRY_INFO!P66=0),0,IF(AND($E66<>0,$J66=\"\"),IF($F66=0,COUNTRY_INFO!P66*$E66,COUNTRY_INFO!P66*($E66-$D66)), IF(AND($E66<>0,$J66<>0),IF($F66=0,COUNTRY_INFO!P66*$J66,COUNTRY_INFO!P66*($J66-$D66)), COUNTRY_INFO!P66*$J66)))","v":0},0,0,null,0,0,null,0,0,null,0]
[{"$f":"IF(AND(INTRO!$E$37=\"Non endémique\",INTRO!$E$41=\"Non endémique\"),\" \",IF(COUNTRY_INFO!A67=0,\" \",COUNTRY_INFO!A67))","v":"SENEGAL"},{"$f":"IF(AND(INTRO!$E$37=\"Non endémique\",INTRO!$E$41=\"Non endémique\"),\" \",IF(COUNTRY_INFO!B67=0,\" \",COUNTRY_INFO!B67))","v":"Sédhiou"},{"$f":"IF(AND(INTRO!$E$37=\"Non endémique\",INTRO!$E$41=\"Non endémique\"),\" \",IF(COUNTRY_INFO!C67=0,\" \",COUNTRY_INFO!C67))","v":"Sedhiou"},{"$f":"IF(AND(INTRO!$E$37=\"Non endémique\",INTRO!$E$41=\"Non endémique\"),0,COUNTRY_INFO!V67)","v":0},{"$f":"IF(AND(INTRO!$E$37=\"Non endémique\",INTRO!$E$41=\"Non endémique\"),0,COUNTRY_INFO!X67)","v":0},{"$f":"IF(INTRO!$E$39=\"Non endémique\",IF($D67=1,DEC!I67,0),IF($D67=1,IVM!G67,0))","v":0},null,{"$f":"IF(OR(COUNTRY_INFO!N67=\"Inconnu\",COUNTRY_INFO!N67=\"Surveillance\",COUNTRY_INFO!N67=\"Non requis\",COUNTRY_INFO!N67=0),0,IF(INTRO!$E$39=\"Non endémique\",IF(AND($E67<>0,$G67=\"\"),IF($F67=0,COUNTRY_INFO!N67*$E67,COUNTRY_INFO!N67*($E67-$D67)),IF(AND($E67<>0,$G67<>0),IF($F67=0,COUNTRY_INFO!N67*$G67,COUNTRY_INFO!N67*($G67-$D67)),0)),IF($G67=\"\",COUNTRY_INFO!N67*$E67,COUNTRY_INFO!N67*$G67)))","v":0},{"$f":"IF(OR(COUNTRY_INFO!O67=\"Inconnu\",COUNTRY_INFO!O67=\"Surveillance\",COUNTRY_INFO!O67=\"Non requis\",COUNTRY_INFO!O67=0),0,IF($E67<>0, IF($F67=0,COUNTRY_INFO!O67*$E67,COUNTRY_INFO!O67*($E67-$D67)),COUNTRY_INFO!O67*$E67))","v":0},null,{"$f":"IF(OR(COUNTRY_INFO!P67=\"Inconnu\",COUNTRY_INFO!P67=\"Surveillance\",COUNTRY_INFO!P67=\"Non requis\",COUNTRY_INFO!P67=0),0,IF(AND($E67<>0,$J67=\"\"),IF($F67=0,COUNTRY_INFO!P67*$E67,COUNTRY_INFO!P67*($E67-$D67)), IF(AND($E67<>0,$J67<>0),IF($F67=0,COUNTRY_INFO!P67*$J67,COUNTRY_INFO!P67*($J67-$D67)), COUNTRY_INFO!P67*$J67)))","v":0},0,0,null,0,0,null,0,0,null,0]
[{"$f":"IF(AND(INTRO!$E$37=\"Non endémique\",INTRO!$E$41=\"Non endémique\"),\" \",IF(COUNTRY_INFO!A68=0,\" \",COUNTRY_INFO!A68))","v":"SENEGAL"},{"$f":"IF(AND(INTRO!$E$37=\"Non endémique\",INTRO!$E$41=\"Non endémique\"),\" \",IF(COUNTRY_INFO!B68=0,\" \",COUNTRY_INFO!B68))","v":"Tambacounda"},{"$f":"IF(AND(INTRO!$E$37=\"Non endémique\",INTRO!$E$41=\"Non endémique\"),\" \",IF(COUNTRY_INFO!C68=0,\" \",COUNTRY_INFO!C68))","v":"Bakel"},{"$f":"IF(AND(INTRO!$E$37=\"Non endémique\",INTRO!$E$41=\"Non endémique\"),0,COUNTRY_INFO!V68)","v":0},{"$f":"IF(AND(INTRO!$E$37=\"Non endémique\",INTRO!$E$41=\"Non endémique\"),0,COUNTRY_INFO!X68)","v":0},{"$f":"IF(INTRO!$E$39=\"Non endémique\",IF($D68=1,DEC!I68,0),IF($D68=1,IVM!G68,0))","v":0},null,{"$f":"IF(OR(COUNTRY_INFO!N68=\"Inconnu\",COUNTRY_INFO!N68=\"Surveillance\",COUNTRY_INFO!N68=\"Non requis\",COUNTRY_INFO!N68=0),0,IF(INTRO!$E$39=\"Non endémique\",IF(AND($E68<>0,$G68=\"\"),IF($F68=0,COUNTRY_INFO!N68*$E68,COUNTRY_INFO!N68*($E68-$D68)),IF(AND($E68<>0,$G68<>0),IF($F68=0,COUNTRY_INFO!N68*$G68,COUNTRY_INFO!N68*($G68-$D68)),0)),IF($G68=\"\",COUNTRY_INFO!N68*$E68,COUNTRY_INFO!N68*$G68)))","v":0},{"$f":"IF(OR(COUNTRY_INFO!O68=\"Inconnu\",COUNTRY_INFO!O68=\"Surveillance\",COUNTRY_INFO!O68=\"Non requis\",COUNTRY_INFO!O68=0),0,IF($E68<>0, IF($F68=0,COUNTRY_INFO!O68*$E68,COUNTRY_INFO!O68*($E68-$D68)),COUNTRY_INFO!O68*$E68))","v":0},null,{"$f":"IF(OR(COUNTRY_INFO!P68=\"Inconnu\",COUNTRY_INFO!P68=\"Surveillance\",COUNTRY_INFO!P68=\"Non requis\",COUNTRY_INFO!P68=0),0,IF(AND($E68<>0,$J68=\"\"),IF($F68=0,COUNTRY_INFO!P68*$E68,COUNTRY_INFO!P68*($E68-$D68)), IF(AND($E68<>0,$J68<>0),IF($F68=0,COUNTRY_INFO!P68*$J68,COUNTRY_INFO!P68*($J68-$D68)), COUNTRY_INFO!P68*$J68)))","v":0},0,0,null,0,0,null,0,0,null,0]
[{"$f":"IF(AND(INTRO!$E$37=\"Non endémique\",INTRO!$E$41=\"Non endémique\"),\" \",IF(COUNTRY_INFO!A69=0,\" \",COUNTRY_INFO!A69))","v":"SENEGAL"},{"$f":"IF(AND(INTRO!$E$37=\"Non endémique\",INTRO!$E$41=\"Non endémique\"),\" \",IF(COUNTRY_INFO!B69=0,\" \",COUNTRY_INFO!B69))","v":"Tambacounda"},{"$f":"IF(AND(INTRO!$E$37=\"Non endémique\",INTRO!$E$41=\"Non endémique\"),\" \",IF(COUNTRY_INFO!C69=0,\" \",COUNTRY_INFO!C69))","v":"Kidira"},{"$f":"IF(AND(INTRO!$E$37=\"Non endémique\",INTRO!$E$41=\"Non endémique\"),0,COUNTRY_INFO!V69)","v":0},{"$f":"IF(AND(INTRO!$E$37=\"Non endémique\",INTRO!$E$41=\"Non endémique\"),0,COUNTRY_INFO!X69)","v":0},{"$f":"IF(INTRO!$E$39=\"Non endémique\",IF($D69=1,DEC!I69,0),IF($D69=1,IVM!G69,0))","v":0},null,{"$f":"IF(OR(COUNTRY_INFO!N69=\"Inconnu\",COUNTRY_INFO!N69=\"Surveillance\",COUNTRY_INFO!N69=\"Non requis\",COUNTRY_INFO!N69=0),0,IF(INTRO!$E$39=\"Non endémique\",IF(AND($E69<>0,$G69=\"\"),IF($F69=0,COUNTRY_INFO!N69*$E69,COUNTRY_INFO!N69*($E69-$D69)),IF(AND($E69<>0,$G69<>0),IF($F69=0,COUNTRY_INFO!N69*$G69,COUNTRY_INFO!N69*($G69-$D69)),0)),IF($G69=\"\",COUNTRY_INFO!N69*$E69,COUNTRY_INFO!N69*$G69)))","v":0},{"$f":"IF(OR(COUNTRY_INFO!O69=\"Inconnu\",COUNTRY_INFO!O69=\"Surveillance\",COUNTRY_INFO!O69=\"Non requis\",COUNTRY_INFO!O69=0),0,IF($E69<>0, IF($F69=0,COUNTRY_INFO!O69*$E69,COUNTRY_INFO!O69*($E69-$D69)),COUNTRY_INFO!O69*$E69))","v":0},null,{"$f":"IF(OR(COUNTRY_INFO!P69=\"Inconnu\",COUNTRY_INFO!P69=\"Surveillance\",COUNTRY_INFO!P69=\"Non requis\",COUNTRY_INFO!P69=0),0,IF(AND($E69<>0,$J69=\"\"),IF($F69=0,COUNTRY_INFO!P69*$E69,COUNTRY_INFO!P69*($E69-$D69)), IF(AND($E69<>0,$J69<>0),IF($F69=0,COUNTRY_INFO!P69*$J69,COUNTRY_INFO!P69*($J69-$D69)), COUNTRY_INFO!P69*$J69)))","v":0},0,0,null,0,0,null,0,0,null,0]
[{"$f":"IF(AND(INTRO!$E$37=\"Non endémique\",INTRO!$E$41=\"Non endémique\"),\" \",IF(COUNTRY_INFO!A70=0,\" \",COUNTRY_INFO!A70))","v":"SENEGAL"},{"$f":"IF(AND(INTRO!$E$37=\"Non endémique\",INTRO!$E$41=\"Non endémique\"),\" \",IF(COUNTRY_INFO!B70=0,\" \",COUNTRY_INFO!B70))","v":"Tambacounda"},{"$f":"IF(AND(INTRO!$E$37=\"Non endémique\",INTRO!$E$41=\"Non endémique\"),\" \",IF(COUNTRY_INFO!C70=0,\" \",COUNTRY_INFO!C70))","v":"Goudiry"},{"$f":"IF(AND(INTRO!$E$37=\"Non endémique\",INTRO!$E$41=\"Non endémique\"),0,COUNTRY_INFO!V70)","v":0},{"$f":"IF(AND(INTRO!$E$37=\"Non endémique\",INTRO!$E$41=\"Non endémique\"),0,COUNTRY_INFO!X70)","v":0},{"$f":"IF(INTRO!$E$39=\"Non endémique\",IF($D70=1,DEC!I70,0),IF($D70=1,IVM!G70,0))","v":0},null,{"$f":"IF(OR(COUNTRY_INFO!N70=\"Inconnu\",COUNTRY_INFO!N70=\"Surveillance\",COUNTRY_INFO!N70=\"Non requis\",COUNTRY_INFO!N70=0),0,IF(INTRO!$E$39=\"Non endémique\",IF(AND($E70<>0,$G70=\"\"),IF($F70=0,COUNTRY_INFO!N70*$E70,COUNTRY_INFO!N70*($E70-$D70)),IF(AND($E70<>0,$G70<>0),IF($F70=0,COUNTRY_INFO!N70*$G70,COUNTRY_INFO!N70*($G70-$D70)),0)),IF($G70=\"\",COUNTRY_INFO!N70*$E70,COUNTRY_INFO!N70*$G70)))","v":0},{"$f":"IF(OR(COUNTRY_INFO!O70=\"Inconnu\",COUNTRY_INFO!O70=\"Surveillance\",COUNTRY_INFO!O70=\"Non requis\",COUNTRY_INFO!O70=0),0,IF($E70<>0, IF($F70=0,COUNTRY_INFO!O70*$E70,COUNTRY_INFO!O70*($E70-$D70)),COUNTRY_INFO!O70*$E70))","v":0},null,{"$f":"IF(OR(COUNTRY_INFO!P70=\"Inconnu\",COUNTRY_INFO!P70=\"Surveillance\",COUNTRY_INFO!P70=\"Non requis\",COUNTRY_INFO!P70=0),0,IF(AND($E70<>0,$J70=\"\"),IF($F70=0,COUNTRY_INFO!P70*$E70,COUNTRY_INFO!P70*($E70-$D70)), IF(AND($E70<>0,$J70<>0),IF($F70=0,COUNTRY_INFO!P70*$J70,COUNTRY_INFO!P70*($J70-$D70)), COUNTRY_INFO!P70*$J70)))","v":0},0,0,null,0,0,null,0,0,null,0]
[{"$f":"IF(AND(INTRO!$E$37=\"Non endémique\",INTRO!$E$41=\"Non endémique\"),\" \",IF(COUNTRY_INFO!A71=0,\" \",COUNTRY_INFO!A71))","v":"SENEGAL"},{"$f":"IF(AND(INTRO!$E$37=\"Non endémique\",INTRO!$E$41=\"Non endémique\"),\" \",IF(COUNTRY_INFO!B71=0,\" \",COUNTRY_INFO!B71))","v":"Tambacounda"},{"$f":"IF(AND(INTRO!$E$37=\"Non endémique\",INTRO!$E$41=\"Non endémique\"),\" \",IF(COUNTRY_INFO!C71=0,\" \",COUNTRY_INFO!C71))","v":"Dianke Makha"},{"$f":"IF(AND(INTRO!$E$37=\"Non endémique\",INTRO!$E$41=\"Non endémique\"),0,COUNTRY_INFO!V71)","v":0},{"$f":"IF(AND(INTRO!$E$37=\"Non endémique\",INTRO!$E$41=\"Non endémique\"),0,COUNTRY_INFO!X71)","v":0},{"$f":"IF(INTRO!$E$39=\"Non endémique\",IF($D71=1,DEC!I71,0),IF($D71=1,IVM!G71,0))","v":0},null,{"$f":"IF(OR(COUNTRY_INFO!N71=\"Inconnu\",COUNTRY_INFO!N71=\"Surveillance\",COUNTRY_INFO!N71=\"Non requis\",COUNTRY_INFO!N71=0),0,IF(INTRO!$E$39=\"Non endémique\",IF(AND($E71<>0,$G71=\"\"),IF($F71=0,COUNTRY_INFO!N71*$E71,COUNTRY_INFO!N71*($E71-$D71)),IF(AND($E71<>0,$G71<>0),IF($F71=0,COUNTRY_INFO!N71*$G71,COUNTRY_INFO!N71*($G71-$D71)),0)),IF($G71=\"\",COUNTRY_INFO!N71*$E71,COUNTRY_INFO!N71*$G71)))","v":0},{"$f":"IF(OR(COUNTRY_INFO!O71=\"Inconnu\",COUNTRY_INFO!O71=\"Surveillance\",COUNTRY_INFO!O71=\"Non requis\",COUNTRY_INFO!O71=0),0,IF($E71<>0, IF($F71=0,COUNTRY_INFO!O71*$E71,COUNTRY_INFO!O71*($E71-$D71)),COUNTRY_INFO!O71*$E71))","v":0},null,{"$f":"IF(OR(COUNTRY_INFO!P71=\"Inconnu\",COUNTRY_INFO!P71=\"Surveillance\",COUNTRY_INFO!P71=\"Non requis\",COUNTRY_INFO!P71=0),0,IF(AND($E71<>0,$J71=\"\"),IF($F71=0,COUNTRY_INFO!P71*$E71,COUNTRY_INFO!P71*($E71-$D71)), IF(AND($E71<>0,$J71<>0),IF($F71=0,COUNTRY_INFO!P71*$J71,COUNTRY_INFO!P71*($J71-$D71)), COUNTRY_INFO!P71*$J71)))","v":0},0,0,null,0,0,null,0,0,null,0]
[{"$f":"IF(AND(INTRO!$E$37=\"Non endémique\",INTRO!$E$41=\"Non endémique\"),\" \",IF(COUNTRY_INFO!A72=0,\" \",COUNTRY_INFO!A72))","v":"SENEGAL"},{"$f":"IF(AND(INTRO!$E$37=\"Non endémique\",INTRO!$E$41=\"Non endémique\"),\" \",IF(COUNTRY_INFO!B72=0,\" \",COUNTRY_INFO!B72))","v":"Tambacounda"},{"$f":"IF(AND(INTRO!$E$37=\"Non endémique\",INTRO!$E$41=\"Non endémique\"),\" \",IF(COUNTRY_INFO!C72=0,\" \",COUNTRY_INFO!C72))","v":"Koumpentoum"},{"$f":"IF(AND(INTRO!$E$37=\"Non endémique\",INTRO!$E$41=\"Non endémique\"),0,COUNTRY_INFO!V72)","v":0},{"$f":"IF(AND(INTRO!$E$37=\"Non endémique\",INTRO!$E$41=\"Non endémique\"),0,COUNTRY_INFO!X72)","v":0},{"$f":"IF(INTRO!$E$39=\"Non endémique\",IF($D72=1,DEC!I72,0),IF($D72=1,IVM!G72,0))","v":0},null,{"$f":"IF(OR(COUNTRY_INFO!N72=\"Inconnu\",COUNTRY_INFO!N72=\"Surveillance\",COUNTRY_INFO!N72=\"Non requis\",COUNTRY_INFO!N72=0),0,IF(INTRO!$E$39=\"Non endémique\",IF(AND($E72<>0,$G72=\"\"),IF($F72=0,COUNTRY_INFO!N72*$E72,COUNTRY_INFO!N72*($E72-$D72)),IF(AND($E72<>0,$G72<>0),IF($F72=0,COUNTRY_INFO!N72*$G72,COUNTRY_INFO!N72*($G72-$D72)),0)),IF($G72=\"\",COUNTRY_INFO!N72*$E72,COUNTRY_INFO!N72*$G72)))","v":0},{"$f":"IF(OR(COUNTRY_INFO!O72=\"Inconnu\",COUNTRY_INFO!O72=\"Surveillance\",COUNTRY_INFO!O72=\"Non requis\",COUNTRY_INFO!O72=0),0,IF($E72<>0, IF($F72=0,COUNTRY_INFO!O72*$E72,COUNTRY_INFO!O72*($E72-$D72)),COUNTRY_INFO!O72*$E72))","v":0},null,{"$f":"IF(OR(COUNTRY_INFO!P72=\"Inconnu\",COUNTRY_INFO!P72=\"Surveillance\",COUNTRY_INFO!P72=\"Non requis\",COUNTRY_INFO!P72=0),0,IF(AND($E72<>0,$J72=\"\"),IF($F72=0,COUNTRY_INFO!P72*$E72,COUNTRY_INFO!P72*($E72-$D72)), IF(AND($E72<>0,$J72<>0),IF($F72=0,COUNTRY_INFO!P72*$J72,COUNTRY_INFO!P72*($J72-$D72)), COUNTRY_INFO!P72*$J72)))","v":0},0,0,null,0,0,null,0,0,null,0]
[{"$f":"IF(AND(INTRO!$E$37=\"Non endémique\",INTRO!$E$41=\"Non endémique\"),\" \",IF(COUNTRY_INFO!A73=0,\" \",COUNTRY_INFO!A73))","v":"SENEGAL"},{"$f":"IF(AND(INTRO!$E$37=\"Non endémique\",INTRO!$E$41=\"Non endémique\"),\" \",IF(COUNTRY_INFO!B73=0,\" \",COUNTRY_INFO!B73))","v":"Tambacounda"},{"$f":"IF(AND(INTRO!$E$37=\"Non endémique\",INTRO!$E$41=\"Non endémique\"),\" \",IF(COUNTRY_INFO!C73=0,\" \",COUNTRY_INFO!C73))","v":"Tambacounda"},{"$f":"IF(AND(INTRO!$E$37=\"Non endémique\",INTRO!$E$41=\"Non endémique\"),0,COUNTRY_INFO!V73)","v":0},{"$f":"IF(AND(INTRO!$E$37=\"Non endémique\",INTRO!$E$41=\"Non endémique\"),0,COUNTRY_INFO!X73)","v":0},{"$f":"IF(INTRO!$E$39=\"Non endémique\",IF($D73=1,DEC!I73,0),IF($D73=1,IVM!G73,0))","v":0},null,{"$f":"IF(OR(COUNTRY_INFO!N73=\"Inconnu\",COUNTRY_INFO!N73=\"Surveillance\",COUNTRY_INFO!N73=\"Non requis\",COUNTRY_INFO!N73=0),0,IF(INTRO!$E$39=\"Non endémique\",IF(AND($E73<>0,$G73=\"\"),IF($F73=0,COUNTRY_INFO!N73*$E73,COUNTRY_INFO!N73*($E73-$D73)),IF(AND($E73<>0,$G73<>0),IF($F73=0,COUNTRY_INFO!N73*$G73,COUNTRY_INFO!N73*($G73-$D73)),0)),IF($G73=\"\",COUNTRY_INFO!N73*$E73,COUNTRY_INFO!N73*$G73)))","v":0},{"$f":"IF(OR(COUNTRY_INFO!O73=\"Inconnu\",COUNTRY_INFO!O73=\"Surveillance\",COUNTRY_INFO!O73=\"Non requis\",COUNTRY_INFO!O73=0),0,IF($E73<>0, IF($F73=0,COUNTRY_INFO!O73*$E73,COUNTRY_INFO!O73*($E73-$D73)),COUNTRY_INFO!O73*$E73))","v":0},null,{"$f":"IF(OR(COUNTRY_INFO!P73=\"Inconnu\",COUNTRY_INFO!P73=\"Surveillance\",COUNTRY_INFO!P73=\"Non requis\",COUNTRY_INFO!P73=0),0,IF(AND($E73<>0,$J73=\"\"),IF($F73=0,COUNTRY_INFO!P73*$E73,COUNTRY_INFO!P73*($E73-$D73)), IF(AND($E73<>0,$J73<>0),IF($F73=0,COUNTRY_INFO!P73*$J73,COUNTRY_INFO!P73*($J73-$D73)), COUNTRY_INFO!P73*$J73)))","v":0},0,0,null,0,0,null,0,0,null,0]
[{"$f":"IF(AND(INTRO!$E$37=\"Non endémique\",INTRO!$E$41=\"Non endémique\"),\" \",IF(COUNTRY_INFO!A74=0,\" \",COUNTRY_INFO!A74))","v":"SENEGAL"},{"$f":"IF(AND(INTRO!$E$37=\"Non endémique\",INTRO!$E$41=\"Non endémique\"),\" \",IF(COUNTRY_INFO!B74=0,\" \",COUNTRY_INFO!B74))","v":"Tambacounda"},{"$f":"IF(AND(INTRO!$E$37=\"Non endémique\",INTRO!$E$41=\"Non endémique\"),\" \",IF(COUNTRY_INFO!C74=0,\" \",COUNTRY_INFO!C74))","v":"Maka Colibantang"},{"$f":"IF(AND(INTRO!$E$37=\"Non endémique\",INTRO!$E$41=\"Non endémique\"),0,COUNTRY_INFO!V74)","v":0},{"$f":"IF(AND(INTRO!$E$37=\"Non endémique\",INTRO!$E$41=\"Non endémique\"),0,COUNTRY_INFO!X74)","v":0},{"$f":"IF(INTRO!$E$39=\"Non endémique\",IF($D74=1,DEC!I74,0),IF($D74=1,IVM!G74,0))","v":0},null,{"$f":"IF(OR(COUNTRY_INFO!N74=\"Inconnu\",COUNTRY_INFO!N74=\"Surveillance\",COUNTRY_INFO!N74=\"Non requis\",COUNTRY_INFO!N74=0),0,IF(INTRO!$E$39=\"Non endémique\",IF(AND($E74<>0,$G74=\"\"),IF($F74=0,COUNTRY_INFO!N74*$E74,COUNTRY_INFO!N74*($E74-$D74)),IF(AND($E74<>0,$G74<>0),IF($F74=0,COUNTRY_INFO!N74*$G74,COUNTRY_INFO!N74*($G74-$D74)),0)),IF($G74=\"\",COUNTRY_INFO!N74*$E74,COUNTRY_INFO!N74*$G74)))","v":0},{"$f":"IF(OR(COUNTRY_INFO!O74=\"Inconnu\",COUNTRY_INFO!O74=\"Surveillance\",COUNTRY_INFO!O74=\"Non requis\",COUNTRY_INFO!O74=0),0,IF($E74<>0, IF($F74=0,COUNTRY_INFO!O74*$E74,COUNTRY_INFO!O74*($E74-$D74)),COUNTRY_INFO!O74*$E74))","v":0},null,{"$f":"IF(OR(COUNTRY_INFO!P74=\"Inconnu\",COUNTRY_INFO!P74=\"Surveillance\",COUNTRY_INFO!P74=\"Non requis\",COUNTRY_INFO!P74=0),0,IF(AND($E74<>0,$J74=\"\"),IF($F74=0,COUNTRY_INFO!P74*$E74,COUNTRY_INFO!P74*($E74-$D74)), IF(AND($E74<>0,$J74<>0),IF($F74=0,COUNTRY_INFO!P74*$J74,COUNTRY_INFO!P74*($J74-$D74)), COUNTRY_INFO!P74*$J74)))","v":0},0,0,null,0,0,null,0,0,null,0]
[{"$f":"IF(AND(INTRO!$E$37=\"Non endémique\",INTRO!$E$41=\"Non endémique\"),\" \",IF(COUNTRY_INFO!A75=0,\" \",COUNTRY_INFO!A75))","v":"SENEGAL"},{"$f":"IF(AND(INTRO!$E$37=\"Non endémique\",INTRO!$E$41=\"Non endémique\"),\" \",IF(COUNTRY_INFO!B75=0,\" \",COUNTRY_INFO!B75))","v":"Thiès"},{"$f":"IF(AND(INTRO!$E$37=\"Non endémique\",INTRO!$E$41=\"Non endémique\"),\" \",IF(COUNTRY_INFO!C75=0,\" \",COUNTRY_INFO!C75))","v":"Joal-Fadhiouth"},{"$f":"IF(AND(INTRO!$E$37=\"Non endémique\",INTRO!$E$41=\"Non endémique\"),0,COUNTRY_INFO!V75)","v":0},{"$f":"IF(AND(INTRO!$E$37=\"Non endémique\",INTRO!$E$41=\"Non endémique\"),0,COUNTRY_INFO!X75)","v":0},{"$f":"IF(INTRO!$E$39=\"Non endémique\",IF($D75=1,DEC!I75,0),IF($D75=1,IVM!G75,0))","v":0},null,{"$f":"IF(OR(COUNTRY_INFO!N75=\"Inconnu\",COUNTRY_INFO!N75=\"Surveillance\",COUNTRY_INFO!N75=\"Non requis\",COUNTRY_INFO!N75=0),0,IF(INTRO!$E$39=\"Non endémique\",IF(AND($E75<>0,$G75=\"\"),IF($F75=0,COUNTRY_INFO!N75*$E75,COUNTRY_INFO!N75*($E75-$D75)),IF(AND($E75<>0,$G75<>0),IF($F75=0,COUNTRY_INFO!N75*$G75,COUNTRY_INFO!N75*($G75-$D75)),0)),IF($G75=\"\",COUNTRY_INFO!N75*$E75,COUNTRY_INFO!N75*$G75)))","v":0},{"$f":"IF(OR(COUNTRY_INFO!O75=\"Inconnu\",COUNTRY_INFO!O75=\"Surveillance\",COUNTRY_INFO!O75=\"Non requis\",COUNTRY_INFO!O75=0),0,IF($E75<>0, IF($F75=0,COUNTRY_INFO!O75*$E75,COUNTRY_INFO!O75*($E75-$D75)),COUNTRY_INFO!O75*$E75))","v":0},null,{"$f":"IF(OR(COUNTRY_INFO!P75=\"Inconnu\",COUNTRY_INFO!P75=\"Surveillance\",COUNTRY_INFO!P75=\"Non requis\",COUNTRY_INFO!P75=0),0,IF(AND($E75<>0,$J75=\"\"),IF($F75=0,COUNTRY_INFO!P75*$E75,COUNTRY_INFO!P75*($E75-$D75)), IF(AND($E75<>0,$J75<>0),IF($F75=0,COUNTRY_INFO!P75*$J75,COUNTRY_INFO!P75*($J75-$D75)), COUNTRY_INFO!P75*$J75)))","v":0},0,0,null,0,0,null,0,0,null,0]
[{"$f":"IF(AND(INTRO!$E$37=\"Non endémique\",INTRO!$E$41=\"Non endémique\"),\" \",IF(COUNTRY_INFO!A76=0,\" \",COUNTRY_INFO!A76))","v":"SENEGAL"},{"$f":"IF(AND(INTRO!$E$37=\"Non endémique\",INTRO!$E$41=\"Non endémique\"),\" \",IF(COUNTRY_INFO!B76=0,\" \",COUNTRY_INFO!B76))","v":"Thiès"},{"$f":"IF(AND(INTRO!$E$37=\"Non endémique\",INTRO!$E$41=\"Non endémique\"),\" \",IF(COUNTRY_INFO!C76=0,\" \",COUNTRY_INFO!C76))","v":"Mbour"},{"$f":"IF(AND(INTRO!$E$37=\"Non endémique\",INTRO!$E$41=\"Non endémique\"),0,COUNTRY_INFO!V76)","v":0},{"$f":"IF(AND(INTRO!$E$37=\"Non endémique\",INTRO!$E$41=\"Non endémique\"),0,COUNTRY_INFO!X76)","v":1},{"$f":"IF(INTRO!$E$39=\"Non endémique\",IF($D76=1,DEC!I76,0),IF($D76=1,IVM!G76,0))","v":0},null,{"$f":"IF(OR(COUNTRY_INFO!N76=\"Inconnu\",COUNTRY_INFO!N76=\"Surveillance\",COUNTRY_INFO!N76=\"Non requis\",COUNTRY_INFO!N76=0),0,IF(INTRO!$E$39=\"Non endémique\",IF(AND($E76<>0,$G76=\"\"),IF($F76=0,COUNTRY_INFO!N76*$E76,COUNTRY_INFO!N76*($E76-$D76)),IF(AND($E76<>0,$G76<>0),IF($F76=0,COUNTRY_INFO!N76*$G76,COUNTRY_INFO!N76*($G76-$D76)),0)),IF($G76=\"\",COUNTRY_INFO!N76*$E76,COUNTRY_INFO!N76*$G76)))","v":58872},{"$f":"IF(OR(COUNTRY_INFO!O76=\"Inconnu\",COUNTRY_INFO!O76=\"Surveillance\",COUNTRY_INFO!O76=\"Non requis\",COUNTRY_INFO!O76=0),0,IF($E76<>0, IF($F76=0,COUNTRY_INFO!O76*$E76,COUNTRY_INFO!O76*($E76-$D76)),COUNTRY_INFO!O76*$E76))","v":129402},null,{"$f":"IF(OR(COUNTRY_INFO!P76=\"Inconnu\",COUNTRY_INFO!P76=\"Surveillance\",COUNTRY_INFO!P76=\"Non requis\",COUNTRY_INFO!P76=0),0,IF(AND($E76<>0,$J76=\"\"),IF($F76=0,COUNTRY_INFO!P76*$E76,COUNTRY_INFO!P76*($E76-$D76)), IF(AND($E76<>0,$J76<>0),IF($F76=0,COUNTRY_INFO!P76*$J76,COUNTRY_INFO!P76*($J76-$D76)), COUNTRY_INFO!P76*$J76)))","v":119940},308214,0,null,0,129402,null,129402,0,null,0]
[{"$f":"IF(AND(INTRO!$E$37=\"Non endémique\",INTRO!$E$41=\"Non endémique\"),\" \",IF(COUNTRY_INFO!A77=0,\" \",COUNTRY_INFO!A77))","v":"SENEGAL"},{"$f":"IF(AND(INTRO!$E$37=\"Non endémique\",INTRO!$E$41=\"Non endémique\"),\" \",IF(COUNTRY_INFO!B77=0,\" \",COUNTRY_INFO!B77))","v":"Thiès"},{"$f":"IF(AND(INTRO!$E$37=\"Non endémique\",INTRO!$E$41=\"Non endémique\"),\" \",IF(COUNTRY_INFO!C77=0,\" \",COUNTRY_INFO!C77))","v":"Popenguine"},{"$f":"IF(AND(INTRO!$E$37=\"Non endémique\",INTRO!$E$41=\"Non endémique\"),0,COUNTRY_INFO!V77)","v":0},{"$f":"IF(AND(INTRO!$E$37=\"Non endémique\",INTRO!$E$41=\"Non endémique\"),0,COUNTRY_INFO!X77)","v":0},{"$f":"IF(INTRO!$E$39=\"Non endémique\",IF($D77=1,DEC!I77,0),IF($D77=1,IVM!G77,0))","v":0},null,{"$f":"IF(OR(COUNTRY_INFO!N77=\"Inconnu\",COUNTRY_INFO!N77=\"Surveillance\",COUNTRY_INFO!N77=\"Non requis\",COUNTRY_INFO!N77=0),0,IF(INTRO!$E$39=\"Non endémique\",IF(AND($E77<>0,$G77=\"\"),IF($F77=0,COUNTRY_INFO!N77*$E77,COUNTRY_INFO!N77*($E77-$D77)),IF(AND($E77<>0,$G77<>0),IF($F77=0,COUNTRY_INFO!N77*$G77,COUNTRY_INFO!N77*($G77-$D77)),0)),IF($G77=\"\",COUNTRY_INFO!N77*$E77,COUNTRY_INFO!N77*$G77)))","v":0},{"$f":"IF(OR(COUNTRY_INFO!O77=\"Inconnu\",COUNTRY_INFO!O77=\"Surveillance\",COUNTRY_INFO!O77=\"Non requis\",COUNTRY_INFO!O77=0),0,IF($E77<>0, IF($F77=0,COUNTRY_INFO!O77*$E77,COUNTRY_INFO!O77*($E77-$D77)),COUNTRY_INFO!O77*$E77))","v":0},null,{"$f":"IF(OR(COUNTRY_INFO!P77=\"Inconnu\",COUNTRY_INFO!P77=\"Surveillance\",COUNTRY_INFO!P77=\"Non requis\",COUNTRY_INFO!P77=0),0,IF(AND($E77<>0,$J77=\"\"),IF($F77=0,COUNTRY_INFO!P77*$E77,COUNTRY_INFO!P77*($E77-$D77)), IF(AND($E77<>0,$J77<>0),IF($F77=0,COUNTRY_INFO!P77*$J77,COUNTRY_INFO!P77*($J77-$D77)), COUNTRY_INFO!P77*$J77)))","v":0},0,0,null,0,0,null,0,0,null,0]
[{"$f":"IF(AND(INTRO!$E$37=\"Non endémique\",INTRO!$E$41=\"Non endémique\"),\" \",IF(COUNTRY_INFO!A78=0,\" \",COUNTRY_INFO!A78))","v":"SENEGAL"},{"$f":"IF(AND(INTRO!$E$37=\"Non endémique\",INTRO!$E$41=\"Non endémique\"),\" \",IF(COUNTRY_INFO!B78=0,\" \",COUNTRY_INFO!B78))","v":"Thiès"},{"$f":"IF(AND(INTRO!$E$37=\"Non endémique\",INTRO!$E$41=\"Non endémique\"),\" \",IF(COUNTRY_INFO!C78=0,\" \",COUNTRY_INFO!C78))","v":"Thiadiaye"},{"$f":"IF(AND(INTRO!$E$37=\"Non endémique\",INTRO!$E$41=\"Non endémique\"),0,COUNTRY_INFO!V78)","v":0},{"$f":"IF(AND(INTRO!$E$37=\"Non endémique\",INTRO!$E$41=\"Non endémique\"),0,COUNTRY_INFO!X78)","v":1},{"$f":"IF(INTRO!$E$39=\"Non endémique\",IF($D78=1,DEC!I78,0),IF($D78=1,IVM!G78,0))","v":0},null,{"$f":"IF(OR(COUNTRY_INFO!N78=\"Inconnu\",COUNTRY_INFO!N78=\"Surveillance\",COUNTRY_INFO!N78=\"Non requis\",COUNTRY_INFO!N78=0),0,IF(INTRO!$E$39=\"Non endémique\",IF(AND($E78<>0,$G78=\"\"),IF($F78=0,COUNTRY_INFO!N78*$E78,COUNTRY_INFO!N78*($E78-$D78)),IF(AND($E78<>0,$G78<>0),IF($F78=0,COUNTRY_INFO!N78*$G78,COUNTRY_INFO!N78*($G78-$D78)),0)),IF($G78=\"\",COUNTRY_INFO!N78*$E78,COUNTRY_INFO!N78*$G78)))","v":24835},{"$f":"IF(OR(COUNTRY_INFO!O78=\"Inconnu\",COUNTRY_INFO!O78=\"Surveillance\",COUNTRY_INFO!O78=\"Non requis\",COUNTRY_INFO!O78=0),0,IF($E78<>0, IF($F78=0,COUNTRY_INFO!O78*$E78,COUNTRY_INFO!O78*($E78-$D78)),COUNTRY_INFO!O78*$E78))","v":54588},null,{"$f":"IF(OR(COUNTRY_INFO!P78=\"Inconnu\",COUNTRY_INFO!P78=\"Surveillance\",COUNTRY_INFO!P78=\"Non requis\",COUNTRY_INFO!P78=0),0,IF(AND($E78<>0,$J78=\"\"),IF($F78=0,COUNTRY_INFO!P78*$E78,COUNTRY_INFO!P78*($E78-$D78)), IF(AND($E78<>0,$J78<>0),IF($F78=0,COUNTRY_INFO!P78*$J78,COUNTRY_INFO!P78*($J78-$D78)), COUNTRY_INFO!P78*$J78)))","v":50596},130019,0,null,0,54588,null,54588,0,null,0]
[{"$f":"IF(AND(INTRO!$E$37=\"Non endémique\",INTRO!$E$41=\"Non endémique\"),\" \",IF(COUNTRY_INFO!A79=0,\" \",COUNTRY_INFO!A79))","v":"SENEGAL"},{"$f":"IF(AND(INTRO!$E$37=\"Non endémique\",INTRO!$E$41=\"Non endémique\"),\" \",IF(COUNTRY_INFO!B79=0,\" \",COUNTRY_INFO!B79))","v":"Thiès"},{"$f":"IF(AND(INTRO!$E$37=\"Non endémique\",INTRO!$E$41=\"Non endémique\"),\" \",IF(COUNTRY_INFO!C79=0,\" \",COUNTRY_INFO!C79))","v":"Pout"},{"$f":"IF(AND(INTRO!$E$37=\"Non endémique\",INTRO!$E$41=\"Non endémique\"),0,COUNTRY_INFO!V79)","v":0},{"$f":"IF(AND(INTRO!$E$37=\"Non endémique\",INTRO!$E$41=\"Non endémique\"),0,COUNTRY_INFO!X79)","v":1},{"$f":"IF(INTRO!$E$39=\"Non endémique\",IF($D79=1,DEC!I79,0),IF($D79=1,IVM!G79,0))","v":0},null,{"$f":"IF(OR(COUNTRY_INFO!N79=\"Inconnu\",COUNTRY_INFO!N79=\"Surveillance\",COUNTRY_INFO!N79=\"Non requis\",COUNTRY_INFO!N79=0),0,IF(INTRO!$E$39=\"Non endémique\",IF(AND($E79<>0,$G79=\"\"),IF($F79=0,COUNTRY_INFO!N79*$E79,COUNTRY_INFO!N79*($E79-$D79)),IF(AND($E79<>0,$G79<>0),IF($F79=0,COUNTRY_INFO!N79*$G79,COUNTRY_INFO!N79*($G79-$D79)),0)),IF($G79=\"\",COUNTRY_INFO!N79*$E79,COUNTRY_INFO!N79*$G79)))","v":19552},{"$f":"IF(OR(COUNTRY_INFO!O79=\"Inconnu\",COUNTRY_INFO!O79=\"Surveillance\",COUNTRY_INFO!O79=\"Non requis\",COUNTRY_INFO!O79=0),0,IF($E79<>0, IF($F79=0,COUNTRY_INFO!O79*$E79,COUNTRY_INFO!O79*($E79-$D79)),COUNTRY_INFO!O79*$E79))","v":42975},null,{"$f":"IF(OR(COUNTRY_INFO!P79=\"Inconnu\",COUNTRY_INFO!P79=\"Surveillance\",COUNTRY_INFO!P79=\"Non requis\",COUNTRY_INFO!P79=0),0,IF(AND($E79<>0,$J79=\"\"),IF($F79=0,COUNTRY_INFO!P79*$E79,COUNTRY_INFO!P79*($E79-$D79)), IF(AND($E79<>0,$J79<>0),IF($F79=0,COUNTRY_INFO!P79*$J79,COUNTRY_INFO!P79*($J79-$D79)), COUNTRY_INFO!P79*$J79)))","v":39833},102360,0,null,0,42975,null,42975,0,null,0]
[{"$f":"IF(AND(INTRO!$E$37=\"Non endémique\",INTRO!$E$41=\"Non endémique\"),\" \",IF(COUNTRY_INFO!A80=0,\" \",COUNTRY_INFO!A80))","v":"SENEGAL"},{"$f":"IF(AND(INTRO!$E$37=\"Non endémique\",INTRO!$E$41=\"Non endémique\"),\" \",IF(COUNTRY_INFO!B80=0,\" \",COUNTRY_INFO!B80))","v":"Thiès"},{"$f":"IF(AND(INTRO!$E$37=\"Non endémique\",INTRO!$E$41=\"Non endémique\"),\" \",IF(COUNTRY_INFO!C80=0,\" \",COUNTRY_INFO!C80))","v":"Thiès"},{"$f":"IF(AND(INTRO!$E$37=\"Non endémique\",INTRO!$E$41=\"Non endémique\"),0,COUNTRY_INFO!V80)","v":0},{"$f":"IF(AND(INTRO!$E$37=\"Non endémique\",INTRO!$E$41=\"Non endémique\"),0,COUNTRY_INFO!X80)","v":1},{"$f":"IF(INTRO!$E$39=\"Non endémique\",IF($D80=1,DEC!I80,0),IF($D80=1,IVM!G80,0))","v":0},null,{"$f":"IF(OR(COUNTRY_INFO!N80=\"Inconnu\",COUNTRY_INFO!N80=\"Surveillance\",COUNTRY_INFO!N80=\"Non requis\",COUNTRY_INFO!N80=0),0,IF(INTRO!$E$39=\"Non endémique\",IF(AND($E80<>0,$G80=\"\"),IF($F80=0,COUNTRY_INFO!N80*$E80,COUNTRY_INFO!N80*($E80-$D80)),IF(AND($E80<>0,$G80<>0),IF($F80=0,COUNTRY_INFO!N80*$G80,COUNTRY_INFO!N80*($G80-$D80)),0)),IF($G80=\"\",COUNTRY_INFO!N80*$E80,COUNTRY_INFO!N80*$G80)))","v":66217},{"$f":"IF(OR(COUNTRY_INFO!O80=\"Inconnu\",COUNTRY_INFO!O80=\"Surveillance\",COUNTRY_INFO!O80=\"Non requis\",COUNTRY_INFO!O80=0),0,IF($E80<>0, IF($F80=0,COUNTRY_INFO!O80*$E80,COUNTRY_INFO!O80*($E80-$D80)),COUNTRY_INFO!O80*$E80))","v":145546},null,{"$f":"IF(OR(COUNTRY_INFO!P80=\"Inconnu\",COUNTRY_INFO!P80=\"Surveillance\",COUNTRY_INFO!P80=\"Non requis\",COUNTRY_INFO!P80=0),0,IF(AND($E80<>0,$J80=\"\"),IF($F80=0,COUNTRY_INFO!P80*$E80,COUNTRY_INFO!P80*($E80-$D80)), IF(AND($E80<>0,$J80<>0),IF($F80=0,COUNTRY_INFO!P80*$J80,COUNTRY_INFO!P80*($J80-$D80)), COUNTRY_INFO!P80*$J80)))","v":134903},346666,0,null,0,145546,null,145546,0,null,0]
[{"$f":"IF(AND(INTRO!$E$37=\"Non endémique\",INTRO!$E$41=\"Non endémique\"),\" \",IF(COUNTRY_INFO!A81=0,\" \",COUNTRY_INFO!A81))","v":"SENEGAL"},{"$f":"IF(AND(INTRO!$E$37=\"Non endémique\",INTRO!$E$41=\"Non endémique\"),\" \",IF(COUNTRY_INFO!B81=0,\" \",COUNTRY_INFO!B81))","v":"Thiès"},{"$f":"IF(AND(INTRO!$E$37=\"Non endémique\",INTRO!$E$41=\"Non endémique\"),\" \",IF(COUNTRY_INFO!C81=0,\" \",COUNTRY_INFO!C81))","v":"Khombole"},{"$f":"IF(AND(INTRO!$E$37=\"Non endémique\",INTRO!$E$41=\"Non endémique\"),0,COUNTRY_INFO!V81)","v":0},{"$f":"IF(AND(INTRO!$E$37=\"Non endémique\",INTRO!$E$41=\"Non endémique\"),0,COUNTRY_INFO!X81)","v":1},{"$f":"IF(INTRO!$E$39=\"Non endémique\",IF($D81=1,DEC!I81,0),IF($D81=1,IVM!G81,0))","v":0},null,{"$f":"IF(OR(COUNTRY_INFO!N81=\"Inconnu\",COUNTRY_INFO!N81=\"Surveillance\",COUNTRY_INFO!N81=\"Non requis\",COUNTRY_INFO!N81=0),0,IF(INTRO!$E$39=\"Non endémique\",IF(AND($E81<>0,$G81=\"\"),IF($F81=0,COUNTRY_INFO!N81*$E81,COUNTRY_INFO!N81*($E81-$D81)),IF(AND($E81<>0,$G81<>0),IF($F81=0,COUNTRY_INFO!N81*$G81,COUNTRY_INFO!N81*($G81-$D81)),0)),IF($G81=\"\",COUNTRY_INFO!N81*$E81,COUNTRY_INFO!N81*$G81)))","v":22611},{"$f":"IF(OR(COUNTRY_INFO!O81=\"Inconnu\",COUNTRY_INFO!O81=\"Surveillance\",COUNTRY_INFO!O81=\"Non requis\",COUNTRY_INFO!O81=0),0,IF($E81<>0, IF($F81=0,COUNTRY_INFO!O81*$E81,COUNTRY_INFO!O81*($E81-$D81)),COUNTRY_INFO!O81*$E81))","v":49698},null,{"$f":"IF(OR(COUNTRY_INFO!P81=\"Inconnu\",COUNTRY_INFO!P81=\"Surveillance\",COUNTRY_INFO!P81=\"Non requis\",COUNTRY_INFO!P81=0),0,IF(AND($E81<>0,$J81=\"\"),IF($F81=0,COUNTRY_INFO!P81*$E81,COUNTRY_INFO!P81*($E81-$D81)), IF(AND($E81<>0,$J81<>0),IF($F81=0,COUNTRY_INFO!P81*$J81,COUNTRY_INFO!P81*($J81-$D81)), COUNTRY_INFO!P81*$J81)))","v":46064},118373,0,null,0,49698,null,49698,0,null,0]
[{"$f":"IF(AND(INTRO!$E$37=\"Non endémique\",INTRO!$E$41=\"Non endémique\"),\" \",IF(COUNTRY_INFO!A82=0,\" \",COUNTRY_INFO!A82))","v":"SENEGAL"},{"$f":"IF(AND(INTRO!$E$37=\"Non endémique\",INTRO!$E$41=\"Non endémique\"),\" \",IF(COUNTRY_INFO!B82=0,\" \",COUNTRY_INFO!B82))","v":"Thiès"},{"$f":"IF(AND(INTRO!$E$37=\"Non endémique\",INTRO!$E$41=\"Non endémique\"),\" \",IF(COUNTRY_INFO!C82=0,\" \",COUNTRY_INFO!C82))","v":"Tivaouane"},{"$f":"IF(AND(INTRO!$E$37=\"Non endémique\",INTRO!$E$41=\"Non endémique\"),0,COUNTRY_INFO!V82)","v":0},{"$f":"IF(AND(INTRO!$E$37=\"Non endémique\",INTRO!$E$41=\"Non endémique\"),0,COUNTRY_INFO!X82)","v":0},{"$f":"IF(INTRO!$E$39=\"Non endémique\",IF($D82=1,DEC!I82,0),IF($D82=1,IVM!G82,0))","v":0},null,{"$f":"IF(OR(COUNTRY_INFO!N82=\"Inconnu\",COUNTRY_INFO!N82=\"Surveillance\",COUNTRY_INFO!N82=\"Non requis\",COUNTRY_INFO!N82=0),0,IF(INTRO!$E$39=\"Non endémique\",IF(AND($E82<>0,$G82=\"\"),IF($F82=0,COUNTRY_INFO!N82*$E82,COUNTRY_INFO!N82*($E82-$D82)),IF(AND($E82<>0,$G82<>0),IF($F82=0,COUNTRY_INFO!N82*$G82,COUNTRY_INFO!N82*($G82-$D82)),0)),IF($G82=\"\",COUNTRY_INFO!N82*$E82,COUNTRY_INFO!N82*$G82)))","v":0},{"$f":"IF(OR(COUNTRY_INFO!O82=\"Inconnu\",COUNTRY_INFO!O82=\"Surveillance\",COUNTRY_INFO!O82=\"Non requis\",COUNTRY_INFO!O82=0),0,IF($E82<>0, IF($F82=0,COUNTRY_INFO!O82*$E82,COUNTRY_INFO!O82*($E82-$D82)),COUNTRY_INFO!O82*$E82))","v":0},null,{"$f":"IF(OR(COUNTRY_INFO!P82=\"Inconnu\",COUNTRY_INFO!P82=\"Surveillance\",COUNTRY_INFO!P82=\"Non requis\",COUNTRY_INFO!P82=0),0,IF(AND($E82<>0,$J82=\"\"),IF($F82=0,COUNTRY_INFO!P82*$E82,COUNTRY_INFO!P82*($E82-$D82)), IF(AND($E82<>0,$J82<>0),IF($F82=0,COUNTRY_INFO!P82*$J82,COUNTRY_INFO!P82*($J82-$D82)), COUNTRY_INFO!P82*$J82)))","v":0},0,0,null,0,0,null,0,0,null,0]
[{"$f":"IF(AND(INTRO!$E$37=\"Non endémique\",INTRO!$E$41=\"Non endémique\"),\" \",IF(COUNTRY_INFO!A83=0,\" \",COUNTRY_INFO!A83))","v":"SENEGAL"},{"$f":"IF(AND(INTRO!$E$37=\"Non endémique\",INTRO!$E$41=\"Non endémique\"),\" \",IF(COUNTRY_INFO!B83=0,\" \",COUNTRY_INFO!B83))","v":"Thiès"},{"$f":"IF(AND(INTRO!$E$37=\"Non endémique\",INTRO!$E$41=\"Non endémique\"),\" \",IF(COUNTRY_INFO!C83=0,\" \",COUNTRY_INFO!C83))","v":"Mékhé"},{"$f":"IF(AND(INTRO!$E$37=\"Non endémique\",INTRO!$E$41=\"Non endémique\"),0,COUNTRY_INFO!V83)","v":0},{"$f":"IF(AND(INTRO!$E$37=\"Non endémique\",INTRO!$E$41=\"Non endémique\"),0,COUNTRY_INFO!X83)","v":0},{"$f":"IF(INTRO!$E$39=\"Non endémique\",IF($D83=1,DEC!I83,0),IF($D83=1,IVM!G83,0))","v":0},null,{"$f":"IF(OR(COUNTRY_INFO!N83=\"Inconnu\",COUNTRY_INFO!N83=\"Surveillance\",COUNTRY_INFO!N83=\"Non requis\",COUNTRY_INFO!N83=0),0,IF(INTRO!$E$39=\"Non endémique\",IF(AND($E83<>0,$G83=\"\"),IF($F83=0,COUNTRY_INFO!N83*$E83,COUNTRY_INFO!N83*($E83-$D83)),IF(AND($E83<>0,$G83<>0),IF($F83=0,COUNTRY_INFO!N83*$G83,COUNTRY_INFO!N83*($G83-$D83)),0)),IF($G83=\"\",COUNTRY_INFO!N83*$E83,COUNTRY_INFO!N83*$G83)))","v":0},{"$f":"IF(OR(COUNTRY_INFO!O83=\"Inconnu\",COUNTRY_INFO!O83=\"Surveillance\",COUNTRY_INFO!O83=\"Non requis\",COUNTRY_INFO!O83=0),0,IF($E83<>0, IF($F83=0,COUNTRY_INFO!O83*$E83,COUNTRY_INFO!O83*($E83-$D83)),COUNTRY_INFO!O83*$E83))","v":0},null,{"$f":"IF(OR(COUNTRY_INFO!P83=\"Inconnu\",COUNTRY_INFO!P83=\"Surveillance\",COUNTRY_INFO!P83=\"Non requis\",COUNTRY_INFO!P83=0),0,IF(AND($E83<>0,$J83=\"\"),IF($F83=0,COUNTRY_INFO!P83*$E83,COUNTRY_INFO!P83*($E83-$D83)), IF(AND($E83<>0,$J83<>0),IF($F83=0,COUNTRY_INFO!P83*$J83,COUNTRY_INFO!P83*($J83-$D83)), COUNTRY_INFO!P83*$J83)))","v":0},0,0,null,0,0,null,0,0,null,0]
[{"$f":"IF(AND(INTRO!$E$37=\"Non endémique\",INTRO!$E$41=\"Non endémique\"),\" \",IF(COUNTRY_INFO!A84=0,\" \",COUNTRY_INFO!A84))","v":"SENEGAL"},{"$f":"IF(AND(INTRO!$E$37=\"Non endémique\",INTRO!$E$41=\"Non endémique\"),\" \",IF(COUNTRY_INFO!B84=0,\" \",COUNTRY_INFO!B84))","v":"Ziguinchor"},{"$f":"IF(AND(INTRO!$E$37=\"Non endémique\",INTRO!$E$41=\"Non endémique\"),\" \",IF(COUNTRY_INFO!C84=0,\" \",COUNTRY_INFO!C84))","v":"Diouloulou"},{"$f":"IF(AND(INTRO!$E$37=\"Non endémique\",INTRO!$E$41=\"Non endémique\"),0,COUNTRY_INFO!V84)","v":0},{"$f":"IF(AND(INTRO!$E$37=\"Non endémique\",INTRO!$E$41=\"Non endémique\"),0,COUNTRY_INFO!X84)","v":0},{"$f":"IF(INTRO!$E$39=\"Non endémique\",IF($D84=1,DEC!I84,0),IF($D84=1,IVM!G84,0))","v":0},null,{"$f":"IF(OR(COUNTRY_INFO!N84=\"Inconnu\",COUNTRY_INFO!N84=\"Surveillance\",COUNTRY_INFO!N84=\"Non requis\",COUNTRY_INFO!N84=0),0,IF(INTRO!$E$39=\"Non endémique\",IF(AND($E84<>0,$G84=\"\"),IF($F84=0,COUNTRY_INFO!N84*$E84,COUNTRY_INFO!N84*($E84-$D84)),IF(AND($E84<>0,$G84<>0),IF($F84=0,COUNTRY_INFO!N84*$G84,COUNTRY_INFO!N84*($G84-$D84)),0)),IF($G84=\"\",COUNTRY_INFO!N84*$E84,COUNTRY_INFO!N84*$G84)))","v":0},{"$f":"IF(OR(COUNTRY_INFO!O84=\"Inconnu\",COUNTRY_INFO!O84=\"Surveillance\",COUNTRY_INFO!O84=\"Non requis\",COUNTRY_INFO!O84=0),0,IF($E84<>0, IF($F84=0,COUNTRY_INFO!O84*$E84,COUNTRY_INFO!O84*($E84-$D84)),COUNTRY_INFO!O84*$E84))","v":0},null,{"$f":"IF(OR(COUNTRY_INFO!P84=\"Inconnu\",COUNTRY_INFO!P84=\"Surveillance\",COUNTRY_INFO!P84=\"Non requis\",COUNTRY_INFO!P84=0),0,IF(AND($E84<>0,$J84=\"\"),IF($F84=0,COUNTRY_INFO!P84*$E84,COUNTRY_INFO!P84*($E84-$D84)), IF(AND($E84<>0,$J84<>0),IF($F84=0,COUNTRY_INFO!P84*$J84,COUNTRY_INFO!P84*($J84-$D84)), COUNTRY_INFO!P84*$J84)))","v":0},0,0,null,0,0,null,0,0,null,0]
[{"$f":"IF(AND(INTRO!$E$37=\"Non endémique\",INTRO!$E$41=\"Non endémique\"),\" \",IF(COUNTRY_INFO!A85=0,\" \",COUNTRY_INFO!A85))","v":"SENEGAL"},{"$f":"IF(AND(INTRO!$E$37=\"Non endémique\",INTRO!$E$41=\"Non endémique\"),\" \",IF(COUNTRY_INFO!B85=0,\" \",COUNTRY_INFO!B85))","v":"Ziguinchor"},{"$f":"IF(AND(INTRO!$E$37=\"Non endémique\",INTRO!$E$41=\"Non endémique\"),\" \",IF(COUNTRY_INFO!C85=0,\" \",COUNTRY_INFO!C85))","v":"Bignona"},{"$f":"IF(AND(INTRO!$E$37=\"Non endémique\",INTRO!$E$41=\"Non endémique\"),0,COUNTRY_INFO!V85)","v":0},{"$f":"IF(AND(INTRO!$E$37=\"Non endémique\",INTRO!$E$41=\"Non endémique\"),0,COUNTRY_INFO!X85)","v":0},{"$f":"IF(INTRO!$E$39=\"Non endémique\",IF($D85=1,DEC!I85,0),IF($D85=1,IVM!G85,0))","v":0},null,{"$f":"IF(OR(COUNTRY_INFO!N85=\"Inconnu\",COUNTRY_INFO!N85=\"Surveillance\",COUNTRY_INFO!N85=\"Non requis\",COUNTRY_INFO!N85=0),0,IF(INTRO!$E$39=\"Non endémique\",IF(AND($E85<>0,$G85=\"\"),IF($F85=0,COUNTRY_INFO!N85*$E85,COUNTRY_INFO!N85*($E85-$D85)),IF(AND($E85<>0,$G85<>0),IF($F85=0,COUNTRY_INFO!N85*$G85,COUNTRY_INFO!N85*($G85-$D85)),0)),IF($G85=\"\",COUNTRY_INFO!N85*$E85,COUNTRY_INFO!N85*$G85)))","v":0},{"$f":"IF(OR(COUNTRY_INFO!O85=\"Inconnu\",COUNTRY_INFO!O85=\"Surveillance\",COUNTRY_INFO!O85=\"Non requis\",COUNTRY_INFO!O85=0),0,IF($E85<>0, IF($F85=0,COUNTRY_INFO!O85*$E85,COUNTRY_INFO!O85*($E85-$D85)),COUNTRY_INFO!O85*$E85))","v":0},null,{"$f":"IF(OR(COUNTRY_INFO!P85=\"Inconnu\",COUNTRY_INFO!P85=\"Surveillance\",COUNTRY_INFO!P85=\"Non requis\",COUNTRY_INFO!P85=0),0,IF(AND($E85<>0,$J85=\"\"),IF($F85=0,COUNTRY_INFO!P85*$E85,COUNTRY_INFO!P85*($E85-$D85)), IF(AND($E85<>0,$J85<>0),IF($F85=0,COUNTRY_INFO!P85*$J85,COUNTRY_INFO!P85*($J85-$D85)), COUNTRY_INFO!P85*$J85)))","v":0},0,0,null,0,0,null,0,0,null,0]
[{"$f":"IF(AND(INTRO!$E$37=\"Non endémique\",INTRO!$E$41=\"Non endémique\"),\" \",IF(COUNTRY_INFO!A86=0,\" \",COUNTRY_INFO!A86))","v":"SENEGAL"},{"$f":"IF(AND(INTRO!$E$37=\"Non endémique\",INTRO!$E$41=\"Non endémique\"),\" \",IF(COUNTRY_INFO!B86=0,\" \",COUNTRY_INFO!B86))","v":"Ziguinchor"},{"$f":"IF(AND(INTRO!$E$37=\"Non endémique\",INTRO!$E$41=\"Non endémique\"),\" \",IF(COUNTRY_INFO!C86=0,\" \",COUNTRY_INFO!C86))","v":"Thionk Essyl"},{"$f":"IF(AND(INTRO!$E$37=\"Non endémique\",INTRO!$E$41=\"Non endémique\"),0,COUNTRY_INFO!V86)","v":0},{"$f":"IF(AND(INTRO!$E$37=\"Non endémique\",INTRO!$E$41=\"Non endémique\"),0,COUNTRY_INFO!X86)","v":0},{"$f":"IF(INTRO!$E$39=\"Non endémique\",IF($D86=1,DEC!I86,0),IF($D86=1,IVM!G86,0))","v":0},null,{"$f":"IF(OR(COUNTRY_INFO!N86=\"Inconnu\",COUNTRY_INFO!N86=\"Surveillance\",COUNTRY_INFO!N86=\"Non requis\",COUNTRY_INFO!N86=0),0,IF(INTRO!$E$39=\"Non endémique\",IF(AND($E86<>0,$G86=\"\"),IF($F86=0,COUNTRY_INFO!N86*$E86,COUNTRY_INFO!N86*($E86-$D86)),IF(AND($E86<>0,$G86<>0),IF($F86=0,COUNTRY_INFO!N86*$G86,COUNTRY_INFO!N86*($G86-$D86)),0)),IF($G86=\"\",COUNTRY_INFO!N86*$E86,COUNTRY_INFO!N86*$G86)))","v":0},{"$f":"IF(OR(COUNTRY_INFO!O86=\"Inconnu\",COUNTRY_INFO!O86=\"Surveillance\",COUNTRY_INFO!O86=\"Non requis\",COUNTRY_INFO!O86=0),0,IF($E86<>0, IF($F86=0,COUNTRY_INFO!O86*$E86,COUNTRY_INFO!O86*($E86-$D86)),COUNTRY_INFO!O86*$E86))","v":0},null,{"$f":"IF(OR(COUNTRY_INFO!P86=\"Inconnu\",COUNTRY_INFO!P86=\"Surveillance\",COUNTRY_INFO!P86=\"Non requis\",COUNTRY_INFO!P86=0),0,IF(AND($E86<>0,$J86=\"\"),IF($F86=0,COUNTRY_INFO!P86*$E86,COUNTRY_INFO!P86*($E86-$D86)), IF(AND($E86<>0,$J86<>0),IF($F86=0,COUNTRY_INFO!P86*$J86,COUNTRY_INFO!P86*($J86-$D86)), COUNTRY_INFO!P86*$J86)))","v":0},0,0,null,0,0,null,0,0,null,0]
[{"$f":"IF(AND(INTRO!$E$37=\"Non endémique\",INTRO!$E$41=\"Non endémique\"),\" \",IF(COUNTRY_INFO!A87=0,\" \",COUNTRY_INFO!A87))","v":"SENEGAL"},{"$f":"IF(AND(INTRO!$E$37=\"Non endémique\",INTRO!$E$41=\"Non endémique\"),\" \",IF(COUNTRY_INFO!B87=0,\" \",COUNTRY_INFO!B87))","v":"Ziguinchor"},{"$f":"IF(AND(INTRO!$E$37=\"Non endémique\",INTRO!$E$41=\"Non endémique\"),\" \",IF(COUNTRY_INFO!C87=0,\" \",COUNTRY_INFO!C87))","v":"Oussouye"},{"$f":"IF(AND(INTRO!$E$37=\"Non endémique\",INTRO!$E$41=\"Non endémique\"),0,COUNTRY_INFO!V87)","v":0},{"$f":"IF(AND(INTRO!$E$37=\"Non endémique\",INTRO!$E$41=\"Non endémique\"),0,COUNTRY_INFO!X87)","v":0},{"$f":"IF(INTRO!$E$39=\"Non endémique\",IF($D87=1,DEC!I87,0),IF($D87=1,IVM!G87,0))","v":0},null,{"$f":"IF(OR(COUNTRY_INFO!N87=\"Inconnu\",COUNTRY_INFO!N87=\"Surveillance\",COUNTRY_INFO!N87=\"Non requis\",COUNTRY_INFO!N87=0),0,IF(INTRO!$E$39=\"Non endémique\",IF(AND($E87<>0,$G87=\"\"),IF($F87=0,COUNTRY_INFO!N87*$E87,COUNTRY_INFO!N87*($E87-$D87)),IF(AND($E87<>0,$G87<>0),IF($F87=0,COUNTRY_INFO!N87*$G87,COUNTRY_INFO!N87*($G87-$D87)),0)),IF($G87=\"\",COUNTRY_INFO!N87*$E87,COUNTRY_INFO!N87*$G87)))","v":0},{"$f":"IF(OR(COUNTRY_INFO!O87=\"Inconnu\",COUNTRY_INFO!O87=\"Surveillance\",COUNTRY_INFO!O87=\"Non requis\",COUNTRY_INFO!O87=0),0,IF($E87<>0, IF($F87=0,COUNTRY_INFO!O87*$E87,COUNTRY_INFO!O87*($E87-$D87)),COUNTRY_INFO!O87*$E87))","v":0},null,{"$f":"IF(OR(COUNTRY_INFO!P87=\"Inconnu\",COUNTRY_INFO!P87=\"Surveillance\",COUNTRY_INFO!P87=\"Non requis\",COUNTRY_INFO!P87=0),0,IF(AND($E87<>0,$J87=\"\"),IF($F87=0,COUNTRY_INFO!P87*$E87,COUNTRY_INFO!P87*($E87-$D87)), IF(AND($E87<>0,$J87<>0),IF($F87=0,COUNTRY_INFO!P87*$J87,COUNTRY_INFO!P87*($J87-$D87)), COUNTRY_INFO!P87*$J87)))","v":0},0,0,null,0,0,null,0,0,null,0]
[{"$f":"IF(AND(INTRO!$E$37=\"Non endémique\",INTRO!$E$41=\"Non endémique\"),\" \",IF(COUNTRY_INFO!A88=0,\" \",COUNTRY_INFO!A88))","v":"SENEGAL"},{"$f":"IF(AND(INTRO!$E$37=\"Non endémique\",INTRO!$E$41=\"Non endémique\"),\" \",IF(COUNTRY_INFO!B88=0,\" \",COUNTRY_INFO!B88))","v":"Ziguinchor"},{"$f":"IF(AND(INTRO!$E$37=\"Non endémique\",INTRO!$E$41=\"Non endémique\"),\" \",IF(COUNTRY_INFO!C88=0,\" \",COUNTRY_INFO!C88))","v":"Ziguinchor"},{"$f":"IF(AND(INTRO!$E$37=\"Non endémique\",INTRO!$E$41=\"Non endémique\"),0,COUNTRY_INFO!V88)","v":0},{"$f":"IF(AND(INTRO!$E$37=\"Non endémique\",INTRO!$E$41=\"Non endémique\"),0,COUNTRY_INFO!X88)","v":0},{"$f":"IF(INTRO!$E$39=\"Non endémique\",IF($D88=1,DEC!I88,0),IF($D88=1,IVM!G88,0))","v":0},null,{"$f":"IF(OR(COUNTRY_INFO!N88=\"Inconnu\",COUNTRY_INFO!N88=\"Surveillance\",COUNTRY_INFO!N88=\"Non requis\",COUNTRY_INFO!N88=0),0,IF(INTRO!$E$39=\"Non endémique\",IF(AND($E88<>0,$G88=\"\"),IF($F88=0,COUNTRY_INFO!N88*$E88,COUNTRY_INFO!N88*($E88-$D88)),IF(AND($E88<>0,$G88<>0),IF($F88=0,COUNTRY_INFO!N88*$G88,COUNTRY_INFO!N88*($G88-$D88)),0)),IF($G88=\"\",COUNTRY_INFO!N88*$E88,COUNTRY_INFO!N88*$G88)))","v":0},{"$f":"IF(OR(COUNTRY_INFO!O88=\"Inconnu\",COUNTRY_INFO!O88=\"Surveillance\",COUNTRY_INFO!O88=\"Non requis\",COUNTRY_INFO!O88=0),0,IF($E88<>0, IF($F88=0,COUNTRY_INFO!O88*$E88,COUNTRY_INFO!O88*($E88-$D88)),COUNTRY_INFO!O88*$E88))","v":0},null,{"$f":"IF(OR(COUNTRY_INFO!P88=\"Inconnu\",COUNTRY_INFO!P88=\"Surveillance\",COUNTRY_INFO!P88=\"Non requis\",COUNTRY_INFO!P88=0),0,IF(AND($E88<>0,$J88=\"\"),IF($F88=0,COUNTRY_INFO!P88*$E88,COUNTRY_INFO!P88*($E88-$D88)), IF(AND($E88<>0,$J88<>0),IF($F88=0,COUNTRY_INFO!P88*$J88,COUNTRY_INFO!P88*($J88-$D88)), COUNTRY_INFO!P88*$J88)))","v":0},0,0,null,0,0,null,0,0,null,0]

{"sheet":"PZQ","index":4,"n_rows":88,"n_cols":18,"rows_kept":88,"cut":false,"hidden":false,"merged":[[3,0,3,2],[5,0,5,2],[5,4,5,7],[5,8,5,9],[6,17,7,17],[6,6,7,6],[6,7,7,7],[6,9,7,9],[6,0,7,0],[6,1,7,1],[6,2,7,2],[6,4,7,4],[5,3,7,3],[6,5,7,5],[6,8,7,8],[6,12,7,12],[5,12,5,17],[5,10,5,11],[6,10,7,10],[6,14,7,14],[6,15,7,15],[6,16,7,16],[6,13,7,13],[6,11,7,11]]}
["Praziquantel (PZQ)"]
["Structure administrative, population ciblée par groupe d'âge, plan de traitement et information sur les comprimés"]
[]
["TOTAL",null,null,null,{"$f":"SUBTOTAL(9,E$10:E$1010)","v":0},396613,870710,1267323,null,69801.333333333328,null,null,{"$f":"SUBTOTAL(9,M$10:M$1010)","v":0},830194,2733873,3564067,0,3564067]
[]
["Structure administrative du pays",null,null,"Plan de traitement\nSCH","Population cible pour SCH",null,null,null,"Hotspots",null,"Année précédent l’AMM",null,"Praziquantel (PZQ)"]
["Pays","Région/Département","District",null,"EAPréS","EAS","Adultes","Total","Prévue","Population","Tournées","Groupes d'âge","EAPréS","EAS","Adultes","Total requis","Reste en stock","Comprimés devant être fournis"]
[]
[]
[{"$f":"IF(INTRO!$E$43=\"Non endémique\",\" \", IF(COUNTRY_INFO!A10=0,\" \",COUNTRY_INFO!A10))","v":"SENEGAL"},{"$f":"IF(INTRO!$E$43=\"Non endémique\",\" \", IF(COUNTRY_INFO!B10=0,\" \",COUNTRY_INFO!B10))","v":"Dakar"},{"$f":"IF(INTRO!$E$43=\"Non endémique\",\" \", IF(COUNTRY_INFO!C10=0,\" \",COUNTRY_INFO!C10))","v":"Dakar sud"},{"$f":"IF(INTRO!$E$43=\"Non endémique\", \"Non requis\", COUNTRY_INFO!Y10)","v":0},0,0,0,{"$f":"SUM(E10:G10)","v":0},null,null,0,null,null,{"$f":"IF($I10<>\"Oui\",$F10*2,($F10+ROUND(J10*$F10/SUM(COUNTRY_INFO!$E10:$G10),0))*2)","v":0},{"$f":"IF($I10<>\"Oui\",$G10*3,($G10+ROUND(J10*$G10/SUM(COUNTRY_INFO!$E10:$G10),0))*3)","v":0},{"$f":"SUM(M10:O10)","v":0},null,{"$f":"IF($P10>$Q10,P10-Q10,0)","v":0}]
[{"$f":"IF(INTRO!$E$43=\"Non endémique\",\" \", IF(COUNTRY_INFO!A11=0,\" \",COUNTRY_INFO!A11))","v":"SENEGAL"},{"$f":"IF(INTRO!$E$43=\"Non endémique\",\" \", IF(COUNTRY_INFO!B11=0,\" \",COUNTRY_INFO!B11))","v":"Dakar"},{"$f":"IF(INTRO!$E$43=\"Non endémique\",\" \", IF(COUNTRY_INFO!C11=0,\" \",COUNTRY_INFO!C11))","v":"Dakar centre"},{"$f":"IF(INTRO!$E$43=\"Non endémique\", \"Non requis\", COUNTRY_INFO!Y11)","v":0},0,0,0,{"$f":"SUM(E11:G11)","v":0},null,null,0,null,null,{"$f":"IF($I11<>\"Oui\",$F11*2,($F11+ROUND(J11*$F11/SUM(COUNTRY_INFO!$E11:$G11),0))*2)","v":0},{"$f":"IF($I11<>\"Oui\",$G11*3,($G11+ROUND(J11*$G11/SUM(COUNTRY_INFO!$E11:$G11),0))*3)","v":0},{"$f":"SUM(M11:O11)","v":0},null,{"$f":"IF($P11>$Q11,P11-Q11,0)","v":0}]
[{"$f":"IF(INTRO!$E$43=\"Non endémique\",\" \", IF(COUNTRY_INFO!A12=0,\" \",COUNTRY_INFO!A12))","v":"SENEGAL"},{"$f":"IF(INTRO!$E$43=\"Non endémique\",\" \", IF(COUNTRY_INFO!B12=0,\" \",COUNTRY_INFO!B12))","v":"Dakar"},{"$f":"IF(INTRO!$E$43=\"Non endémique\",\" \", IF(COUNTRY_INFO!C12=0,\" \",COUNTRY_INFO!C12))","v":"Dakar ouest"},{"$f":"IF(INTRO!$E$43=\"Non endémique\", \"Non requis\", COUNTRY_INFO!Y12)","v":0},0,0,0,0,null,null,0,null,null,{"$f":"IF($I12<>\"Oui\",$F12*2,($F12+ROUND(J12*$F12/SUM(COUNTRY_INFO!$E12:$G12),0))*2)","v":0},{"$f":"IF($I12<>\"Oui\",$G12*3,($G12+ROUND(J12*$G12/SUM(COUNTRY_INFO!$E12:$G12),0))*3)","v":0},0,null,0]
[{"$f":"IF(INTRO!$E$43=\"Non endémique\",\" \", IF(COUNTRY_INFO!A13=0,\" \",COUNTRY_INFO!A13))","v":"SENEGAL"},{"$f":"IF(INTRO!$E$43=\"Non endémique\",\" \", IF(COUNTRY_INFO!B13=0,\" \",COUNTRY_INFO!B13))","v":"Dakar"},{"$f":"IF(INTRO!$E$43=\"Non endémique\",\" \", IF(COUNTRY_INFO!C13=0,\" \",COUNTRY_INFO!C13))","v":"Dakar nord"},{"$f":"IF(INTRO!$E$43=\"Non endémique\", \"Non requis\", COUNTRY_INFO!Y13)","v":0},0,0,0,0,null,null,0,null,null,{"$f":"IF($I13<>\"Oui\",$F13*2,($F13+ROUND(J13*$F13/SUM(COUNTRY_INFO!$E13:$G13),0))*2)","v":0},{"$f":"IF($I13<>\"Oui\",$G13*3,($G13+ROUND(J13*$G13/SUM(COUNTRY_INFO!$E13:$G13),0))*3)","v":0},0,null,0]
[{"$f":"IF(INTRO!$E$43=\"Non endémique\",\" \", IF(COUNTRY_INFO!A14=0,\" \",COUNTRY_INFO!A14))","v":"SENEGAL"},{"$f":"IF(INTRO!$E$43=\"Non endémique\",\" \", IF(COUNTRY_INFO!B14=0,\" \",COUNTRY_INFO!B14))","v":"Dakar"},{"$f":"IF(INTRO!$E$43=\"Non endémique\",\" \", IF(COUNTRY_INFO!C14=0,\" \",COUNTRY_INFO!C14))","v":"Guédiawaye"},{"$f":"IF(INTRO!$E$43=\"Non endémique\", \"Non requis\", COUNTRY_INFO!Y14)","v":0},0,0,0,0,null,null,0,null,null,{"$f":"IF($I14<>\"Oui\",$F14*2,($F14+ROUND(J14*$F14/SUM(COUNTRY_INFO!$E14:$G14),0))*2)","v":0},{"$f":"IF($I14<>\"Oui\",$G14*3,($G14+ROUND(J14*$G14/SUM(COUNTRY_INFO!$E14:$G14),0))*3)","v":0},0,null,0]
[{"$f":"IF(INTRO!$E$43=\"Non endémique\",\" \", IF(COUNTRY_INFO!A15=0,\" \",COUNTRY_INFO!A15))","v":"SENEGAL"},{"$f":"IF(INTRO!$E$43=\"Non endémique\",\" \", IF(COUNTRY_INFO!B15=0,\" \",COUNTRY_INFO!B15))","v":"Dakar"},{"$f":"IF(INTRO!$E$43=\"Non endémique\",\" \", IF(COUNTRY_INFO!C15=0,\" \",COUNTRY_INFO!C15))","v":"Pikine"},{"$f":"IF(INTRO!$E$43=\"Non endémique\", \"Non requis\", COUNTRY_INFO!Y15)","v":0},0,0,0,0,null,null,0,null,null,{"$f":"IF($I15<>\"Oui\",$F15*2,($F15+ROUND(J15*$F15/SUM(COUNTRY_INFO!$E15:$G15),0))*2)","v":0},{"$f":"IF($I15<>\"Oui\",$G15*3,($G15+ROUND(J15*$G15/SUM(COUNTRY_INFO!$E15:$G15),0))*3)","v":0},0,null,0]
[{"$f":"IF(INTRO!$E$43=\"Non endémique\",\" \", IF(COUNTRY_INFO!A16=0,\" \",COUNTRY_INFO!A16))","v":"SENEGAL"},{"$f":"IF(INTRO!$E$43=\"Non endémique\",\" \", IF(COUNTRY_INFO!B16=0,\" \",COUNTRY_INFO!B16))","v":"Dakar"},{"$f":"IF(INTRO!$E$43=\"Non endémique\",\" \", IF(COUNTRY_INFO!C16=0,\" \",COUNTRY_INFO!C16))","v":"Keur  Massar"},{"$f":"IF(INTRO!$E$43=\"Non endémique\", \"Non requis\", COUNTRY_INFO!Y16)","v":0},0,0,0,0,null,null,0,null,null,{"$f":"IF($I16<>\"Oui\",$F16*2,($F16+ROUND(J16*$F16/SUM(COUNTRY_INFO!$E16:$G16),0))*2)","v":0},{"$f":"IF($I16<>\"Oui\",$G16*3,($G16+ROUND(J16*$G16/SUM(COUNTRY_INFO!$E16:$G16),0))*3)","v":0},0,null,0]
[{"$f":"IF(INTRO!$E$43=\"Non endémique\",\" \", IF(COUNTRY_INFO!A17=0,\" \",COUNTRY_INFO!A17))","v":"SENEGAL"},{"$f":"IF(INTRO!$E$43=\"Non endémique\",\" \", IF(COUNTRY_INFO!B17=0,\" \",COUNTRY_INFO!B17))","v":"Dakar"},{"$f":"IF(INTRO!$E$43=\"Non endémique\",\" \", IF(COUNTRY_INFO!C17=0,\" \",COUNTRY_INFO!C17))","v":"Yeumbeul"},{"$f":"IF(INTRO!$E$43=\"Non endémique\", \"Non requis\", COUNTRY_INFO!Y17)","v":0},0,0,0,0,null,null,0,null,null,{"$f":"IF($I17<>\"Oui\",$F17*2,($F17+ROUND(J17*$F17/SUM(COUNTRY_INFO!$E17:$G17),0))*2)","v":0},{"$f":"IF($I17<>\"Oui\",$G17*3,($G17+ROUND(J17*$G17/SUM(COUNTRY_INFO!$E17:$G17),0))*3)","v":0},0,null,0]
[{"$f":"IF(INTRO!$E$43=\"Non endémique\",\" \", IF(COUNTRY_INFO!A18=0,\" \",COUNTRY_INFO!A18))","v":"SENEGAL"},{"$f":"IF(INTRO!$E$43=\"Non endémique\",\" \", IF(COUNTRY_INFO!B18=0,\" \",COUNTRY_INFO!B18))","v":"Dakar"},{"$f":"IF(INTRO!$E$43=\"Non endémique\",\" \", IF(COUNTRY_INFO!C18=0,\" \",COUNTRY_INFO!C18))","v":"Mbao"},{"$f":"IF(INTRO!$E$43=\"Non endémique\", \"Non requis\", COUNTRY_INFO!Y18)","v":0},0,0,0,0,null,null,0,null,null,{"$f":"IF($I18<>\"Oui\",$F18*2,($F18+ROUND(J18*$F18/SUM(COUNTRY_INFO!$E18:$G18),0))*2)","v":0},{"$f":"IF($I18<>\"Oui\",$G18*3,($G18+ROUND(J18*$G18/SUM(COUNTRY_INFO!$E18:$G18),0))*3)","v":0},0,null,0]
[{"$f":"IF(INTRO!$E$43=\"Non endémique\",\" \", IF(COUNTRY_INFO!A19=0,\" \",COUNTRY_INFO!A19))","v":"SENEGAL"},{"$f":"IF(INTRO!$E$43=\"Non endémique\",\" \", IF(COUNTRY_INFO!B19=0,\" \",COUNTRY_INFO!B19))","v":"Dakar"},{"$f":"IF(INTRO!$E$43=\"Non endémique\",\" \", IF(COUNTRY_INFO!C19=0,\" \",COUNTRY_INFO!C19))","v":"Diamniadio"},{"$f":"IF(INTRO!$E$43=\"Non endémique\", \"Non requis\", COUNTRY_INFO!Y19)","v":0},0,0,0,0,null,null,0,null,null,{"$f":"IF($I19<>\"Oui\",$F19*2,($F19+ROUND(J19*$F19/SUM(COUNTRY_INFO!$E19:$G19),0))*2)","v":0},{"$f":"IF($I19<>\"Oui\",$G19*3,($G19+ROUND(J19*$G19/SUM(COUNTRY_INFO!$E19:$G19),0))*3)","v":0},0,null,0]
[{"$f":"IF(INTRO!$E$43=\"Non endémique\",\" \", IF(COUNTRY_INFO!A20=0,\" \",COUNTRY_INFO!A20))","v":"SENEGAL"},{"$f":"IF(INTRO!$E$43=\"Non endémique\",\" \", IF(COUNTRY_INFO!B20=0,\" \",COUNTRY_INFO!B20))","v":"Dakar"},{"$f":"IF(INTRO!$E$43=\"Non endémique\",\" \", IF(COUNTRY_INFO!C20=0,\" \",COUNTRY_INFO!C20))","v":"Sangalkam"},{"$f":"IF(INTRO!$E$43=\"Non endémique\", \"Non requis\", COUNTRY_INFO!Y20)","v":0},0,0,0,0,null,null,0,null,null,{"$f":"IF($I20<>\"Oui\",$F20*2,($F20+ROUND(J20*$F20/SUM(COUNTRY_INFO!$E20:$G20),0))*2)","v":0},{"$f":"IF($I20<>\"Oui\",$G20*3,($G20+ROUND(J20*$G20/SUM(COUNTRY_INFO!$E20:$G20),0))*3)","v":0},0,null,0]
[{"$f":"IF(INTRO!$E$43=\"Non endémique\",\" \", IF(COUNTRY_INFO!A21=0,\" \",COUNTRY_INFO!A21))","v":"SENEGAL"},{"$f":"IF(INTRO!$E$43=\"Non endémique\",\" \", IF(COUNTRY_INFO!B21=0,\" \",COUNTRY_INFO!B21))","v":"Dakar"},{"$f":"IF(INTRO!$E$43=\"Non endémique\",\" \", IF(COUNTRY_INFO!C21=0,\" \",COUNTRY_INFO!C21))","v":"Rufisque"},{"$f":"IF(INTRO!$E$43=\"Non endémique\", \"Non requis\", COUNTRY_INFO!Y21)","v":0},0,0,0,0,null,null,0,null,null,{"$f":"IF($I21<>\"Oui\",$F21*2,($F21+ROUND(J21*$F21/SUM(COUNTRY_INFO!$E21:$G21),0))*2)","v":0},{"$f":"IF($I21<>\"Oui\",$G21*3,($G21+ROUND(J21*$G21/SUM(COUNTRY_INFO!$E21:$G21),0))*3)","v":0},0,null,0]
[{"$f":"IF(INTRO!$E$43=\"Non endémique\",\" \", IF(COUNTRY_INFO!A22=0,\" \",COUNTRY_INFO!A22))","v":"SENEGAL"},{"$f":"IF(INTRO!$E$43=\"Non endémique\",\" \", IF(COUNTRY_INFO!B22=0,\" \",COUNTRY_INFO!B22))","v":"Diourbel"},{"$f":"IF(INTRO!$E$43=\"Non endémique\",\" \", IF(COUNTRY_INFO!C22=0,\" \",COUNTRY_INFO!C22))","v":"Bambéye"},{"$f":"IF(INTRO!$E$43=\"Non endémique\", \"Non requis\", COUNTRY_INFO!Y22)","v":1},0,30642,67274,97916,null,null,1,"EAS et Adultes",null,{"$f":"IF($I22<>\"Oui\",$F22*2,($F22+ROUND(J22*$F22/SUM(COUNTRY_INFO!$E22:$G22),0))*2)","v":61284},{"$f":"IF($I22<>\"Oui\",$G22*3,($G22+ROUND(J22*$G22/SUM(COUNTRY_INFO!$E22:$G22),0))*3)","v":201822},263106,null,263106]
[{"$f":"IF(INTRO!$E$43=\"Non endémique\",\" \", IF(COUNTRY_INFO!A23=0,\" \",COUNTRY_INFO!A23))","v":"SENEGAL"},{"$f":"IF(INTRO!$E$43=\"Non endémique\",\" \", IF(COUNTRY_INFO!B23=0,\" \",COUNTRY_INFO!B23))","v":"Diourbel"},{"$f":"IF(INTRO!$E$43=\"Non endémique\",\" \", IF(COUNTRY_INFO!C23=0,\" \",COUNTRY_INFO!C23))","v":"Diourbel"},{"$f":"IF(INTRO!$E$43=\"Non endémique\", \"Non requis\", COUNTRY_INFO!Y23)","v":1},0,40994,90000,130994,null,null,0,null,null,{"$f":"IF($I23<>\"Oui\",$F23*2,($F23+ROUND(J23*$F23/SUM(COUNTRY_INFO!$E23:$G23),0))*2)","v":81988},{"$f":"IF($I23<>\"Oui\",$G23*3,($G23+ROUND(J23*$G23/SUM(COUNTRY_INFO!$E23:$G23),0))*3)","v":270000},351988,null,351988]
[{"$f":"IF(INTRO!$E$43=\"Non endémique\",\" \", IF(COUNTRY_INFO!A24=0,\" \",COUNTRY_INFO!A24))","v":"SENEGAL"},{"$f":"IF(INTRO!$E$43=\"Non endémique\",\" \", IF(COUNTRY_INFO!B24=0,\" \",COUNTRY_INFO!B24))","v":"Diourbel"},{"$f":"IF(INTRO!$E$43=\"Non endémique\",\" \", IF(COUNTRY_INFO!C24=0,\" \",COUNTRY_INFO!C24))","v":"Mbacké"},{"$f":"IF(INTRO!$E$43=\"Non endémique\", \"Non requis\", COUNTRY_INFO!Y24)","v":0},0,0,0,0,null,null,1,"EAS et Adultes",null,{"$f":"IF($I24<>\"Oui\",$F24*2,($F24+ROUND(J24*$F24/SUM(COUNTRY_INFO!$E24:$G24),0))*2)","v":0},{"$f":"IF($I24<>\"Oui\",$G24*3,($G24+ROUND(J24*$G24/SUM(COUNTRY_INFO!$E24:$G24),0))*3)","v":0},0,null,0]
[{"$f":"IF(INTRO!$E$43=\"Non endémique\",\" \", IF(COUNTRY_INFO!A25=0,\" \",COUNTRY_INFO!A25))","v":"SENEGAL"},{"$f":"IF(INTRO!$E$43=\"Non endémique\",\" \", IF(COUNTRY_INFO!B25=0,\" \",COUNTRY_INFO!B25))","v":"Diourbel"},{"$f":"IF(INTRO!$E$43=\"Non endémique\",\" \", IF(COUNTRY_INFO!C25=0,\" \",COUNTRY_INFO!C25))","v":"Touba"},{"$f":"IF(INTRO!$E$43=\"Non endémique\", \"Non requis\", COUNTRY_INFO!Y25)","v":0},0,0,0,0,null,null,1,"EAS et Adultes",null,{"$f":"IF($I25<>\"Oui\",$F25*2,($F25+ROUND(J25*$F25/SUM(COUNTRY_INFO!$E25:$G25),0))*2)","v":0},{"$f":"IF($I25<>\"Oui\",$G25*3,($G25+ROUND(J25*$G25/SUM(COUNTRY_INFO!$E25:$G25),0))*3)","v":0},0,null,0]
[{"$f":"IF(INTRO!$E$43=\"Non endémique\",\" \", IF(COUNTRY_INFO!A26=0,\" \",COUNTRY_INFO!A26))","v":"SENEGAL"},{"$f":"IF(INTRO!$E$43=\"Non endémique\",\" \", IF(COUNTRY_INFO!B26=0,\" \",COUNTRY_INFO!B26))","v":"Fatick"},{"$f":"IF(INTRO!$E$43=\"Non endémique\",\" \", IF(COUNTRY_INFO!C26=0,\" \",COUNTRY_INFO!C26))","v":"Niakhar"},{"$f":"IF(INTRO!$E$43=\"Non endémique\", \"Non requis\", COUNTRY_INFO!Y26)","v":1},0,10908,23948,34856,null,null,0,null,null,{"$f":"IF($I26<>\"Oui\",$F26*2,($F26+ROUND(J26*$F26/SUM(COUNTRY_INFO!$E26:$G26),0))*2)","v":21816},{"$f":"IF($I26<>\"Oui\",$G26*3,($G26+ROUND(J26*$G26/SUM(COUNTRY_INFO!$E26:$G26),0))*3)","v":71844},93660,null,93660]
[{"$f":"IF(INTRO!$E$43=\"Non endémique\",\" \", IF(COUNTRY_INFO!A27=0,\" \",COUNTRY_INFO!A27))","v":"SENEGAL"},{"$f":"IF(INTRO!$E$43=\"Non endémique\",\" \", IF(COUNTRY_INFO!B27=0,\" \",COUNTRY_INFO!B27))","v":"Fatick"},{"$f":"IF(INTRO!$E$43=\"Non endémique\",\" \", IF(COUNTRY_INFO!C27=0,\" \",COUNTRY_INFO!C27))","v":"Diakhao"},{"$f":"IF(INTRO!$E$43=\"Non endémique\", \"Non requis\", COUNTRY_INFO!Y27)","v":1},0,9861,21647,31508,null,null,0,null,null,{"$f":"IF($I27<>\"Oui\",$F27*2,($F27+ROUND(J27*$F27/SUM(COUNTRY_INFO!$E27:$G27),0))*2)","v":19722},{"$f":"IF($I27<>\"Oui\",$G27*3,($G27+ROUND(J27*$G27/SUM(COUNTRY_INFO!$E27:$G27),0))*3)","v":64941},84663,null,84663]
[{"$f":"IF(INTRO!$E$43=\"Non endémique\",\" \", IF(COUNTRY_INFO!A28=0,\" \",COUNTRY_INFO!A28))","v":"SENEGAL"},{"$f":"IF(INTRO!$E$43=\"Non endémique\",\" \", IF(COUNTRY_INFO!B28=0,\" \",COUNTRY_INFO!B28))","v":"Fatick"},{"$f":"IF(INTRO!$E$43=\"Non endémique\",\" \", IF(COUNTRY_INFO!C28=0,\" \",COUNTRY_INFO!C28))","v":"Fatick"},{"$f":"IF(INTRO!$E$43=\"Non endémique\", \"Non requis\", COUNTRY_INFO!Y28)","v":1},0,41196,90435,131631,null,null,0,null,null,{"$f":"IF($I28<>\"Oui\",$F28*2,($F28+ROUND(J28*$F28/SUM(COUNTRY_INFO!$E28:$G28),0))*2)","v":82392},{"$f":"IF($I28<>\"Oui\",$G28*3,($G28+ROUND(J28*$G28/SUM(COUNTRY_INFO!$E28:$G28),0))*3)","v":271305},353697,null,353697]
[{"$f":"IF(INTRO!$E$43=\"Non endémique\",\" \", IF(COUNTRY_INFO!A29=0,\" \",COUNTRY_INFO!A29))","v":"SENEGAL"},{"$f":"IF(INTRO!$E$43=\"Non endémique\",\" \", IF(COUNTRY_INFO!B29=0,\" \",COUNTRY_INFO!B29))","v":"Fatick"},{"$f":"IF(INTRO!$E$43=\"Non endémique\",\" \", IF(COUNTRY_INFO!C29=0,\" \",COUNTRY_INFO!C29))","v":"Dioffior"},{"$f":"IF(INTRO!$E$43=\"Non endémique\", \"Non requis\", COUNTRY_INFO!Y29)","v":1},0,2984,6551,9535,null,null,0,null,null,{"$f":"IF($I29<>\"Oui\",$F29*2,($F29+ROUND(J29*$F29/SUM(COUNTRY_INFO!$E29:$G29),0))*2)","v":5968},{"$f":"IF($I29<>\"Oui\",$G29*3,($G29+ROUND(J29*$G29/SUM(COUNTRY_INFO!$E29:$G29),0))*3)","v":19653},25621,null,25621]
[{"$f":"IF(INTRO!$E$43=\"Non endémique\",\" \", IF(COUNTRY_INFO!A30=0,\" \",COUNTRY_INFO!A30))","v":"SENEGAL"},{"$f":"IF(INTRO!$E$43=\"Non endémique\",\" \", IF(COUNTRY_INFO!B30=0,\" \",COUNTRY_INFO!B30))","v":"Fatick"},{"$f":"IF(INTRO!$E$43=\"Non endémique\",\" \", IF(COUNTRY_INFO!C30=0,\" \",COUNTRY_INFO!C30))","v":"Passy"},{"$f":"IF(INTRO!$E$43=\"Non endémique\", \"Non requis\", COUNTRY_INFO!Y30)","v":1},0,4723,10370,15093,null,null,0,null,null,{"$f":"IF($I30<>\"Oui\",$F30*2,($F30+ROUND(J30*$F30/SUM(COUNTRY_INFO!$E30:$G30),0))*2)","v":9446},{"$f":"IF($I30<>\"Oui\",$G30*3,($G30+ROUND(J30*$G30/SUM(COUNTRY_INFO!$E30:$G30),0))*3)","v":31110},40556,null,40556]
[{"$f":"IF(INTRO!$E$43=\"Non endémique\",\" \", IF(COUNTRY_INFO!A31=0,\" \",COUNTRY_INFO!A31))","v":"SENEGAL"},{"$f":"IF(INTRO!$E$43=\"Non endémique\",\" \", IF(COUNTRY_INFO!B31=0,\" \",COUNTRY_INFO!B31))","v":"Fatick"},{"$f":"IF(INTRO!$E$43=\"Non endémique\",\" \", IF(COUNTRY_INFO!C31=0,\" \",COUNTRY_INFO!C31))","v":"Foundiougne"},{"$f":"IF(INTRO!$E$43=\"Non endémique\", \"Non requis\", COUNTRY_INFO!Y31)","v":0},0,0,0,0,null,null,1,"EAS et Adultes",null,{"$f":"IF($I31<>\"Oui\",$F31*2,($F31+ROUND(J31*$F31/SUM(COUNTRY_INFO!$E31:$G31),0))*2)","v":0},{"$f":"IF($I31<>\"Oui\",$G31*3,($G31+ROUND(J31*$G31/SUM(COUNTRY_INFO!$E31:$G31),0))*3)","v":0},0,null,0]
[{"$f":"IF(INTRO!$E$43=\"Non endémique\",\" \", IF(COUNTRY_INFO!A32=0,\" \",COUNTRY_INFO!A32))","v":"SENEGAL"},{"$f":"IF(INTRO!$E$43=\"Non endémique\",\" \", IF(COUNTRY_INFO!B32=0,\" \",COUNTRY_INFO!B32))","v":"Fatick"},{"$f":"IF(INTRO!$E$43=\"Non endémique\",\" \", IF(COUNTRY_INFO!C32=0,\" \",COUNTRY_INFO!C32))","v":"Sokone"},{"$f":"IF(INTRO!$E$43=\"Non endémique\", \"Non requis\", COUNTRY_INFO!Y32)","v":0},0,0,0,0,null,null,1,"EAS et Adultes",null,{"$f":"IF($I32<>\"Oui\",$F32*2,($F32+ROUND(J32*$F32/SUM(COUNTRY_INFO!$E32:$G32),0))*2)","v":0},{"$f":"IF($I32<>\"Oui\",$G32*3,($G32+ROUND(J32*$G32/SUM(COUNTRY_INFO!$E32:$G32),0))*3)","v":0},0,null,0]
[{"$f":"IF(INTRO!$E$43=\"Non endémique\",\" \", IF(COUNTRY_INFO!A33=0,\" \",COUNTRY_INFO!A33))","v":"SENEGAL"},{"$f":"IF(INTRO!$E$43=\"Non endémique\",\" \", IF(COUNTRY_INFO!B33=0,\" \",COUNTRY_INFO!B33))","v":"Fatick"},{"$f":"IF(INTRO!$E$43=\"Non endémique\",\" \", IF(COUNTRY_INFO!C33=0,\" \",COUNTRY_INFO!C33))","v":"Gossas"},{"$f":"IF(INTRO!$E$43=\"Non endémique\", \"Non requis\", COUNTRY_INFO!Y33)","v":1},0,18410,40415,58825,null,null,1,"EAS et Adultes",null,{"$f":"IF($I33<>\"Oui\",$F33*2,($F33+ROUND(J33*$F33/SUM(COUNTRY_INFO!$E33:$G33),0))*2)","v":36820},{"$f":"IF($I33<>\"Oui\",$G33*3,($G33+ROUND(J33*$G33/SUM(COUNTRY_INFO!$E33:$G33),0))*3)","v":121245},158065,null,158065]
[{"$f":"IF(INTRO!$E$43=\"Non endémique\",\" \", IF(COUNTRY_INFO!A34=0,\" \",COUNTRY_INFO!A34))","v":"SENEGAL"},{"$f":"IF(INTRO!$E$43=\"Non endémique\",\" \", IF(COUNTRY_INFO!B34=0,\" \",COUNTRY_INFO!B34))","v":"Kaffrine"},{"$f":"IF(INTRO!$E$43=\"Non endémique\",\" \", IF(COUNTRY_INFO!C34=0,\" \",COUNTRY_INFO!C34))","v":"Birkelane"},{"$f":"IF(INTRO!$E$43=\"Non endémique\", \"Non requis\", COUNTRY_INFO!Y34)","v":1},0,6700,14711,21411,null,null,1,"EAS et Adultes",null,{"$f":"IF($I34<>\"Oui\",$F34*2,($F34+ROUND(J34*$F34/SUM(COUNTRY_INFO!$E34:$G34),0))*2)","v":13400},{"$f":"IF($I34<>\"Oui\",$G34*3,($G34+ROUND(J34*$G34/SUM(COUNTRY_INFO!$E34:$G34),0))*3)","v":44133},57533,null,57533]
[{"$f":"IF(INTRO!$E$43=\"Non endémique\",\" \", IF(COUNTRY_INFO!A35=0,\" \",COUNTRY_INFO!A35))","v":"SENEGAL"},{"$f":"IF(INTRO!$E$43=\"Non endémique\",\" \", IF(COUNTRY_INFO!B35=0,\" \",COUNTRY_INFO!B35))","v":"Kaffrine"},{"$f":"IF(INTRO!$E$43=\"Non endémique\",\" \", IF(COUNTRY_INFO!C35=0,\" \",COUNTRY_INFO!C35))","v":"Kaffrine"},{"$f":"IF(INTRO!$E$43=\"Non endémique\", \"Non requis\", COUNTRY_INFO!Y35)","v":1},0,3758,8251,12009,null,null,2,"EAS et Adultes",null,{"$f":"IF($I35<>\"Oui\",$F35*2,($F35+ROUND(J35*$F35/SUM(COUNTRY_INFO!$E35:$G35),0))*2)","v":7516},{"$f":"IF($I35<>\"Oui\",$G35*3,($G35+ROUND(J35*$G35/SUM(COUNTRY_INFO!$E35:$G35),0))*3)","v":24753},32269,null,32269]
[{"$f":"IF(INTRO!$E$43=\"Non endémique\",\" \", IF(COUNTRY_INFO!A36=0,\" \",COUNTRY_INFO!A36))","v":"SENEGAL"},{"$f":"IF(INTRO!$E$43=\"Non endémique\",\" \", IF(COUNTRY_INFO!B36=0,\" \",COUNTRY_INFO!B36))","v":"Kaffrine"},{"$f":"IF(INTRO!$E$43=\"Non endémique\",\" \", IF(COUNTRY_INFO!C36=0,\" \",COUNTRY_INFO!C36))","v":"Koungheul"},{"$f":"IF(INTRO!$E$43=\"Non endémique\", \"Non requis\", COUNTRY_INFO!Y36)","v":1},0,5897,12947,18844,null,null,1,"EAS et Adultes",null,{"$f":"IF($I36<>\"Oui\",$F36*2,($F36+ROUND(J36*$F36/SUM(COUNTRY_INFO!$E36:$G36),0))*2)","v":11794},{"$f":"IF($I36<>\"Oui\",$G36*3,($G36+ROUND(J36*$G36/SUM(COUNTRY_INFO!$E36:$G36),0))*3)","v":38841},50635,null,50635]
[{"$f":"IF(INTRO!$E$43=\"Non endémique\",\" \", IF(COUNTRY_INFO!A37=0,\" \",COUNTRY_INFO!A37))","v":"SENEGAL"},{"$f":"IF(INTRO!$E$43=\"Non endémique\",\" \", IF(COUNTRY_INFO!B37=0,\" \",COUNTRY_INFO!B37))","v":"Kaffrine"},{"$f":"IF(INTRO!$E$43=\"Non endémique\",\" \", IF(COUNTRY_INFO!C37=0,\" \",COUNTRY_INFO!C37))","v":"Malem Hodar"},{"$f":"IF(INTRO!$E$43=\"Non endémique\", \"Non requis\", COUNTRY_INFO!Y37)","v":1},0,12860,28235,41095,null,null,0,null,null,{"$f":"IF($I37<>\"Oui\",$F37*2,($F37+ROUND(J37*$F37/SUM(COUNTRY_INFO!$E37:$G37),0))*2)","v":25720},{"$f":"IF($I37<>\"Oui\",$G37*3,($G37+ROUND(J37*$G37/SUM(COUNTRY_INFO!$E37:$G37),0))*3)","v":84705},110425,null,110425]
[{"$f":"IF(INTRO!$E$43=\"Non endémique\",\" \", IF(COUNTRY_INFO!A38=0,\" \",COUNTRY_INFO!A38))","v":"SENEGAL"},{"$f":"IF(INTRO!$E$43=\"Non endémique\",\" \", IF(COUNTRY_INFO!B38=0,\" \",COUNTRY_INFO!B38))","v":"Kaolack"},{"$f":"IF(INTRO!$E$43=\"Non endémique\",\" \", IF(COUNTRY_INFO!C38=0,\" \",COUNTRY_INFO!C38))","v":"Guinguineo"},{"$f":"IF(INTRO!$E$43=\"Non endémique\", \"Non requis\", COUNTRY_INFO!Y38)","v":1},0,15471,33968,49439,null,null,0,null,null,{"$f":"IF($I38<>\"Oui\",$F38*2,($F38+ROUND(J38*$F38/SUM(COUNTRY_INFO!$E38:$G38),0))*2)","v":30942},{"$f":"IF($I38<>\"Oui\",$G38*3,($G38+ROUND(J38*$G38/SUM(COUNTRY_INFO!$E38:$G38),0))*3)","v":101904},132846,null,132846]
[{"$f":"IF(INTRO!$E$43=\"Non endémique\",\" \", IF(COUNTRY_INFO!A39=0,\" \",COUNTRY_INFO!A39))","v":"SENEGAL"},{"$f":"IF(INTRO!$E$43=\"Non endémique\",\" \", IF(COUNTRY_INFO!B39=0,\" \",COUNTRY_INFO!B39))","v":"Kaolack"},{"$f":"IF(INTRO!$E$43=\"Non endémique\",\" \", IF(COUNTRY_INFO!C39=0,\" \",COUNTRY_INFO!C39))","v":"Kaolack"},{"$f":"IF(INTRO!$E$43=\"Non endémique\", \"Non requis\", COUNTRY_INFO!Y39)","v":0},0,0,0,0,null,null,1,"EAS et Adultes",null,{"$f":"IF($I39<>\"Oui\",$F39*2,($F39+ROUND(J39*$F39/SUM(COUNTRY_INFO!$E39:$G39),0))*2)","v":0},{"$f":"IF($I39<>\"Oui\",$G39*3,($G39+ROUND(J39*$G39/SUM(COUNTRY_INFO!$E39:$G39),0))*3)","v":0},0,null,0]
[{"$f":"IF(INTRO!$E$43=\"Non endémique\",\" \", IF(COUNTRY_INFO!A40=0,\" \",COUNTRY_INFO!A40))","v":"SENEGAL"},{"$f":"IF(INTRO!$E$43=\"Non endémique\",\" \", IF(COUNTRY_INFO!B40=0,\" \",COUNTRY_INFO!B40))","v":"Kaolack"},{"$f":"IF(INTRO!$E$43=\"Non endémique\",\" \", IF(COUNTRY_INFO!C40=0,\" \",COUNTRY_INFO!C40))","v":"Ndoffane"},{"$f":"IF(INTRO!$E$43=\"Non endémique\", \"Non requis\", COUNTRY_INFO!Y40)","v":1},0,57318,125840,183158,null,null,1,"EAS et Adultes",null,{"$f":"IF($I40<>\"Oui\",$F40*2,($F40+ROUND(J40*$F40/SUM(COUNTRY_INFO!$E40:$G40),0))*2)","v":114636},{"$f":"IF($I40<>\"Oui\",$G40*3,($G40+ROUND(J40*$G40/SUM(COUNTRY_INFO!$E40:$G40),0))*3)","v":377520},492156,null,492156]
[{"$f":"IF(INTRO!$E$43=\"Non endémique\",\" \", IF(COUNTRY_INFO!A41=0,\" \",COUNTRY_INFO!A41))","v":"SENEGAL"},{"$f":"IF(INTRO!$E$43=\"Non endémique\",\" \", IF(COUNTRY_INFO!B41=0,\" \",COUNTRY_INFO!B41))","v":"Kaolack"},{"$f":"IF(INTRO!$E$43=\"Non endémique\",\" \", IF(COUNTRY_INFO!C41=0,\" \",COUNTRY_INFO!C41))","v":"Nioro"},{"$f":"IF(INTRO!$E$43=\"Non endémique\", \"Non requis\", COUNTRY_INFO!Y41)","v":1},0,975,2140,3115,null,null,1,"EAS et Adultes",null,{"$f":"IF($I41<>\"Oui\",$F41*2,($F41+ROUND(J41*$F41/SUM(COUNTRY_INFO!$E41:$G41),0))*2)","v":1950},{"$f":"IF($I41<>\"Oui\",$G41*3,($G41+ROUND(J41*$G41/SUM(COUNTRY_INFO!$E41:$G41),0))*3)","v":6420},8370,null,8370]
[{"$f":"IF(INTRO!$E$43=\"Non endémique\",\" \", IF(COUNTRY_INFO!A42=0,\" \",COUNTRY_INFO!A42))","v":"SENEGAL"},{"$f":"IF(INTRO!$E$43=\"Non endémique\",\" \", IF(COUNTRY_INFO!B42=0,\" \",COUNTRY_INFO!B42))","v":"Kédougou"},{"$f":"IF(INTRO!$E$43=\"Non endémique\",\" \", IF(COUNTRY_INFO!C42=0,\" \",COUNTRY_INFO!C42))","v":"Kédougou"},{"$f":"IF(INTRO!$E$43=\"Non endémique\", \"Non requis\", COUNTRY_INFO!Y42)","v":1},0,29190,64084,93274,"Oui",9730,1,"EAS et Adultes",null,{"$f":"IF($I42<>\"Oui\",$F42*2,($F42+ROUND(J42*$F42/SUM(COUNTRY_INFO!$E42:$G42),0))*2)","v":63642},{"$f":"IF($I42<>\"Oui\",$G42*3,($G42+ROUND(J42*$G42/SUM(COUNTRY_INFO!$E42:$G42),0))*3)","v":209580},273222,null,273222]
[{"$f":"IF(INTRO!$E$43=\"Non endémique\",\" \", IF(COUNTRY_INFO!A43=0,\" \",COUNTRY_INFO!A43))","v":"SENEGAL"},{"$f":"IF(INTRO!$E$43=\"Non endémique\",\" \", IF(COUNTRY_INFO!B43=0,\" \",COUNTRY_INFO!B43))","v":"Kédougou"},{"$f":"IF(INTRO!$E$43=\"Non endémique\",\" \", IF(COUNTRY_INFO!C43=0,\" \",COUNTRY_INFO!C43))","v":"Salemata"},{"$f":"IF(INTRO!$E$43=\"Non endémique\", \"Non requis\", COUNTRY_INFO!Y43)","v":1},0,8220,18045,26265,"Oui",2740,1,"EAS et Adultes",null,{"$f":"IF($I43<>\"Oui\",$F43*2,($F43+ROUND(J43*$F43/SUM(COUNTRY_INFO!$E43:$G43),0))*2)","v":17922},{"$f":"IF($I43<>\"Oui\",$G43*3,($G43+ROUND(J43*$G43/SUM(COUNTRY_INFO!$E43:$G43),0))*3)","v":59016},76938,null,76938]
[{"$f":"IF(INTRO!$E$43=\"Non endémique\",\" \", IF(COUNTRY_INFO!A44=0,\" \",COUNTRY_INFO!A44))","v":"SENEGAL"},{"$f":"IF(INTRO!$E$43=\"Non endémique\",\" \", IF(COUNTRY_INFO!B44=0,\" \",COUNTRY_INFO!B44))","v":"Kédougou"},{"$f":"IF(INTRO!$E$43=\"Non endémique\",\" \", IF(COUNTRY_INFO!C44=0,\" \",COUNTRY_INFO!C44))","v":"Saraya"},{"$f":"IF(INTRO!$E$43=\"Non endémique\", \"Non requis\", COUNTRY_INFO!Y44)","v":1},0,18856,41401,60257,"Oui",6285.333333333333,1,"EAS et Adultes",null,{"$f":"IF($I44<>\"Oui\",$F44*2,($F44+ROUND(J44*$F44/SUM(COUNTRY_INFO!$E44:$G44),0))*2)","v":41112},{"$f":"IF($I44<>\"Oui\",$G44*3,($G44+ROUND(J44*$G44/SUM(COUNTRY_INFO!$E44:$G44),0))*3)","v":135399},176511,null,176511]
[{"$f":"IF(INTRO!$E$43=\"Non endémique\",\" \", IF(COUNTRY_INFO!A45=0,\" \",COUNTRY_INFO!A45))","v":"SENEGAL"},{"$f":"IF(INTRO!$E$43=\"Non endémique\",\" \", IF(COUNTRY_INFO!B45=0,\" \",COUNTRY_INFO!B45))","v":"Kolda"},{"$f":"IF(INTRO!$E$43=\"Non endémique\",\" \", IF(COUNTRY_INFO!C45=0,\" \",COUNTRY_INFO!C45))","v":"Kolda"},{"$f":"IF(INTRO!$E$43=\"Non endémique\", \"Non requis\", COUNTRY_INFO!Y45)","v":1},0,3343,7340,10683,null,null,0,null,null,{"$f":"IF($I45<>\"Oui\",$F45*2,($F45+ROUND(J45*$F45/SUM(COUNTRY_INFO!$E45:$G45),0))*2)","v":6686},{"$f":"IF($I45<>\"Oui\",$G45*3,($G45+ROUND(J45*$G45/SUM(COUNTRY_INFO!$E45:$G45),0))*3)","v":22020},28706,null,28706]
[{"$f":"IF(INTRO!$E$43=\"Non endémique\",\" \", IF(COUNTRY_INFO!A46=0,\" \",COUNTRY_INFO!A46))","v":"SENEGAL"},{"$f":"IF(INTRO!$E$43=\"Non endémique\",\" \", IF(COUNTRY_INFO!B46=0,\" \",COUNTRY_INFO!B46))","v":"Kolda"},{"$f":"IF(INTRO!$E$43=\"Non endémique\",\" \", IF(COUNTRY_INFO!C46=0,\" \",COUNTRY_INFO!C46))","v":"Medina Yoro Foulah"},{"$f":"IF(INTRO!$E$43=\"Non endémique\", \"Non requis\", COUNTRY_INFO!Y46)","v":1},0,44505,97707,142212,null,null,1,"EAS et Adultes",null,{"$f":"IF($I46<>\"Oui\",$F46*2,($F46+ROUND(J46*$F46/SUM(COUNTRY_INFO!$E46:$G46),0))*2)","v":89010},{"$f":"IF($I46<>\"Oui\",$G46*3,($G46+ROUND(J46*$G46/SUM(COUNTRY_INFO!$E46:$G46),0))*3)","v":293121},382131,null,382131]
[{"$f":"IF(INTRO!$E$43=\"Non endémique\",\" \", IF(COUNTRY_INFO!A47=0,\" \",COUNTRY_INFO!A47))","v":"SENEGAL"},{"$f":"IF(INTRO!$E$43=\"Non endémique\",\" \", IF(COUNTRY_INFO!B47=0,\" \",COUNTRY_INFO!B47))","v":"Kolda"},{"$f":"IF(INTRO!$E$43=\"Non endémique\",\" \", IF(COUNTRY_INFO!C47=0,\" \",COUNTRY_INFO!C47))","v":"Velingara"},{"$f":"IF(INTRO!$E$43=\"Non endémique\", \"Non requis\", COUNTRY_INFO!Y47)","v":1},0,32107,70489,102596,null,null,2,"EAS et Adultes",null,{"$f":"IF($I47<>\"Oui\",$F47*2,($F47+ROUND(J47*$F47/SUM(COUNTRY_INFO!$E47:$G47),0))*2)","v":64214},{"$f":"IF($I47<>\"Oui\",$G47*3,($G47+ROUND(J47*$G47/SUM(COUNTRY_INFO!$E47:$G47),0))*3)","v":211467},275681,null,275681]
[{"$f":"IF(INTRO!$E$43=\"Non endémique\",\" \", IF(COUNTRY_INFO!A48=0,\" \",COUNTRY_INFO!A48))","v":"SENEGAL"},{"$f":"IF(INTRO!$E$43=\"Non endémique\",\" \", IF(COUNTRY_INFO!B48=0,\" \",COUNTRY_INFO!B48))","v":"Louga"},{"$f":"IF(INTRO!$E$43=\"Non endémique\",\" \", IF(COUNTRY_INFO!C48=0,\" \",COUNTRY_INFO!C48))","v":"Darou-Mousty"},{"$f":"IF(INTRO!$E$43=\"Non endémique\", \"Non requis\", COUNTRY_INFO!Y48)","v":0},0,0,0,0,null,null,0,null,null,{"$f":"IF($I48<>\"Oui\",$F48*2,($F48+ROUND(J48*$F48/SUM(COUNTRY_INFO!$E48:$G48),0))*2)","v":0},{"$f":"IF($I48<>\"Oui\",$G48*3,($G48+ROUND(J48*$G48/SUM(COUNTRY_INFO!$E48:$G48),0))*3)","v":0},0,null,0]
[{"$f":"IF(INTRO!$E$43=\"Non endémique\",\" \", IF(COUNTRY_INFO!A49=0,\" \",COUNTRY_INFO!A49))","v":"SENEGAL"},{"$f":"IF(INTRO!$E$43=\"Non endémique\",\" \", IF(COUNTRY_INFO!B49=0,\" \",COUNTRY_INFO!B49))","v":"Louga"},{"$f":"IF(INTRO!$E$43=\"Non endémique\",\" \", IF(COUNTRY_INFO!C49=0,\" \",COUNTRY_INFO!C49))","v":"Kébémer"},{"$f":"IF(INTRO!$E$43=\"Non endémique\", \"Non requis\", COUNTRY_INFO!Y49)","v":0},0,0,0,0,null,null,0,null,null,{"$f":"IF($I49<>\"Oui\",$F49*2,($F49+ROUND(J49*$F49/SUM(COUNTRY_INFO!$E49:$G49),0))*2)","v":0},{"$f":"IF($I49<>\"Oui\",$G49*3,($G49+ROUND(J49*$G49/SUM(COUNTRY_INFO!$E49:$G49),0))*3)","v":0},0,null,0]
[{"$f":"IF(INTRO!$E$43=\"Non endémique\",\" \", IF(COUNTRY_INFO!A50=0,\" \",COUNTRY_INFO!A50))","v":"SENEGAL"},{"$f":"IF(INTRO!$E$43=\"Non endémique\",\" \", IF(COUNTRY_INFO!B50=0,\" \",COUNTRY_INFO!B50))","v":"Louga"},{"$f":"IF(INTRO!$E$43=\"Non endémique\",\" \", IF(COUNTRY_INFO!C50=0,\" \",COUNTRY_INFO!C50))","v":"Linguère"},{"$f":"IF(INTRO!$E$43=\"Non endémique\", \"Non requis\", COUNTRY_INFO!Y50)","v":1},0,35255,77402,112657,null,null,2,"EAS et Adultes",null,{"$f":"IF($I50<>\"Oui\",$F50*2,($F50+ROUND(J50*$F50/SUM(COUNTRY_INFO!$E50:$G50),0))*2)","v":70510},{"$f":"IF($I50<>\"Oui\",$G50*3,($G50+ROUND(J50*$G50/SUM(COUNTRY_INFO!$E50:$G50),0))*3)","v":232206},302716,null,302716]
[{"$f":"IF(INTRO!$E$43=\"Non endémique\",\" \", IF(COUNTRY_INFO!A51=0,\" \",COUNTRY_INFO!A51))","v":"SENEGAL"},{"$f":"IF(INTRO!$E$43=\"Non endémique\",\" \", IF(COUNTRY_INFO!B51=0,\" \",COUNTRY_INFO!B51))","v":"Louga"},{"$f":"IF(INTRO!$E$43=\"Non endémique\",\" \", IF(COUNTRY_INFO!C51=0,\" \",COUNTRY_INFO!C51))","v":"Dahra"},{"$f":"IF(INTRO!$E$43=\"Non endémique\", \"Non requis\", COUNTRY_INFO!Y51)","v":0},0,0,0,0,null,null,0,null,null,{"$f":"IF($I51<>\"Oui\",$F51*2,($F51+ROUND(J51*$F51/SUM(COUNTRY_INFO!$E51:$G51),0))*2)","v":0},{"$f":"IF($I51<>\"Oui\",$G51*3,($G51+ROUND(J51*$G51/SUM(COUNTRY_INFO!$E51:$G51),0))*3)","v":0},0,null,0]
[{"$f":"IF(INTRO!$E$43=\"Non endémique\",\" \", IF(COUNTRY_INFO!A52=0,\" \",COUNTRY_INFO!A52))","v":"SENEGAL"},{"$f":"IF(INTRO!$E$43=\"Non endémique\",\" \", IF(COUNTRY_INFO!B52=0,\" \",COUNTRY_INFO!B52))","v":"Louga"},{"$f":"IF(INTRO!$E$43=\"Non endémique\",\" \", IF(COUNTRY_INFO!C52=0,\" \",COUNTRY_INFO!C52))","v":"Coki"},{"$f":"IF(INTRO!$E$43=\"Non endémique\", \"Non requis\", COUNTRY_INFO!Y52)","v":1},0,18595,40821,59416,null,null,1,"EAS et Adultes",null,{"$f":"IF($I52<>\"Oui\",$F52*2,($F52+ROUND(J52*$F52/SUM(COUNTRY_INFO!$E52:$G52),0))*2)","v":37190},{"$f":"IF($I52<>\"Oui\",$G52*3,($G52+ROUND(J52*$G52/SUM(COUNTRY_INFO!$E52:$G52),0))*3)","v":122463},159653,null,159653]
[{"$f":"IF(INTRO!$E$43=\"Non endémique\",\" \", IF(COUNTRY_INFO!A53=0,\" \",COUNTRY_INFO!A53))","v":"SENEGAL"},{"$f":"IF(INTRO!$E$43=\"Non endémique\",\" \", IF(COUNTRY_INFO!B53=0,\" \",COUNTRY_INFO!B53))","v":"Louga"},{"$f":"IF(INTRO!$E$43=\"Non endémique\",\" \", IF(COUNTRY_INFO!C53=0,\" \",COUNTRY_INFO!C53))","v":"Keur Momar Sarr"},{"$f":"IF(INTRO!$E$43=\"Non endémique\", \"Non requis\", COUNTRY_INFO!Y53)","v":1},0,27135,59570,86705,"Oui",9045,2,"EAS et Adultes",null,{"$f":"IF($I53<>\"Oui\",$F53*2,($F53+ROUND(J53*$F53/SUM(COUNTRY_INFO!$E53:$G53),0))*2)","v":59222},{"$f":"IF($I53<>\"Oui\",$G53*3,($G53+ROUND(J53*$G53/SUM(COUNTRY_INFO!$E53:$G53),0))*3)","v":195015},254237,null,254237]
[{"$f":"IF(INTRO!$E$43=\"Non endémique\",\" \", IF(COUNTRY_INFO!A54=0,\" \",COUNTRY_INFO!A54))","v":"SENEGAL"},{"$f":"IF(INTRO!$E$43=\"Non endémique\",\" \", IF(COUNTRY_INFO!B54=0,\" \",COUNTRY_INFO!B54))","v":"Louga"},{"$f":"IF(INTRO!$E$43=\"Non endémique\",\" \", IF(COUNTRY_INFO!C54=0,\" \",COUNTRY_INFO!C54))","v":"Sakal"},{"$f":"IF(INTRO!$E$43=\"Non endémique\", \"Non requis\", COUNTRY_INFO!Y54)","v":1},0,25713,56454,82167,null,null,1,"EAS et Adultes",null,{"$f":"IF($I54<>\"Oui\",$F54*2,($F54+ROUND(J54*$F54/SUM(COUNTRY_INFO!$E54:$G54),0))*2)","v":51426},{"$f":"IF($I54<>\"Oui\",$G54*3,($G54+ROUND(J54*$G54/SUM(COUNTRY_INFO!$E54:$G54),0))*3)","v":169362},220788,null,220788]
[{"$f":"IF(INTRO!$E$43=\"Non endémique\",\" \", IF(COUNTRY_INFO!A55=0,\" \",COUNTRY_INFO!A55))","v":"SENEGAL"},{"$f":"IF(INTRO!$E$43=\"Non endémique\",\" \", IF(COUNTRY_INFO!B55=0,\" \",COUNTRY_INFO!B55))","v":"Louga"},{"$f":"IF(INTRO!$E$43=\"Non endémique\",\" \", IF(COUNTRY_INFO!C55=0,\" \",COUNTRY_INFO!C55))","v":"Louga"},{"$f":"IF(INTRO!$E$43=\"Non endémique\", \"Non requis\", COUNTRY_INFO!Y55)","v":1},0,55988,122916,178904,null,null,2,"EAS et Adultes",null,{"$f":"IF($I55<>\"Oui\",$F55*2,($F55+ROUND(J55*$F55/SUM(COUNTRY_INFO!$E55:$G55),0))*2)","v":111976},{"$f":"IF($I55<>\"Oui\",$G55*3,($G55+ROUND(J55*$G55/SUM(COUNTRY_INFO!$E55:$G55),0))*3)","v":368748},480724,null,480724]
[{"$f":"IF(INTRO!$E$43=\"Non endémique\",\" \", IF(COUNTRY_INFO!A56=0,\" \",COUNTRY_INFO!A56))","v":"SENEGAL"},{"$f":"IF(INTRO!$E$43=\"Non endémique\",\" \", IF(COUNTRY_INFO!B56=0,\" \",COUNTRY_INFO!B56))","v":"Matam"},{"$f":"IF(INTRO!$E$43=\"Non endémique\",\" \", IF(COUNTRY_INFO!C56=0,\" \",COUNTRY_INFO!C56))","v":"Kanel"},{"$f":"IF(INTRO!$E$43=\"Non endémique\", \"Non requis\", COUNTRY_INFO!Y56)","v":1},0,89737,197013,286750,"Oui",29912.333333333332,1,"EAS et Adultes",null,{"$f":"IF($I56<>\"Oui\",$F56*2,($F56+ROUND(J56*$F56/SUM(COUNTRY_INFO!$E56:$G56),0))*2)","v":195176},{"$f":"IF($I56<>\"Oui\",$G56*3,($G56+ROUND(J56*$G56/SUM(COUNTRY_INFO!$E56:$G56),0))*3)","v":642747},837923,null,837923]
[{"$f":"IF(INTRO!$E$43=\"Non endémique\",\" \", IF(COUNTRY_INFO!A57=0,\" \",COUNTRY_INFO!A57))","v":"SENEGAL"},{"$f":"IF(INTRO!$E$43=\"Non endémique\",\" \", IF(COUNTRY_INFO!B57=0,\" \",COUNTRY_INFO!B57))","v":"Matam"},{"$f":"IF(INTRO!$E$43=\"Non endémique\",\" \", IF(COUNTRY_INFO!C57=0,\" \",COUNTRY_INFO!C57))","v":"Matam"},{"$f":"IF(INTRO!$E$43=\"Non endémique\", \"Non requis\", COUNTRY_INFO!Y57)","v":1},0,74473,163506,237979,"Oui",24824.333333333332,1,"EAS et Adultes",null,{"$f":"IF($I57<>\"Oui\",$F57*2,($F57+ROUND(J57*$F57/SUM(COUNTRY_INFO!$E57:$G57),0))*2)","v":162276},{"$f":"IF($I57<>\"Oui\",$G57*3,($G57+ROUND(J57*$G57/SUM(COUNTRY_INFO!$E57:$G57),0))*3)","v":534420},696696,null,696696]
[{"$f":"IF(INTRO!$E$43=\"Non endémique\",\" \", IF(COUNTRY_INFO!A58=0,\" \",COUNTRY_INFO!A58))","v":"SENEGAL"},{"$f":"IF(INTRO!$E$43=\"Non endémique\",\" \", IF(COUNTRY_INFO!B58=0,\" \",COUNTRY_INFO!B58))","v":"Matam"},{"$f":"IF(INTRO!$E$43=\"Non endémique\",\" \", IF(COUNTRY_INFO!C58=0,\" \",COUNTRY_INFO!C58))","v":"Thilogne"},{"$f":"IF(INTRO!$E$43=\"Non endémique\", \"Non requis\", COUNTRY_INFO!Y58)","v":1},0,23025,50553,73578,null,null,1,"EAS et Adultes",null,{"$f":"IF($I58<>\"Oui\",$F58*2,($F58+ROUND(J58*$F58/SUM(COUNTRY_INFO!$E58:$G58),0))*2)","v":46050},{"$f":"IF($I58<>\"Oui\",$G58*3,($G58+ROUND(J58*$G58/SUM(COUNTRY_INFO!$E58:$G58),0))*3)","v":151659},197709,null,197709]
[{"$f":"IF(INTRO!$E$43=\"Non endémique\",\" \", IF(COUNTRY_INFO!A59=0,\" \",COUNTRY_INFO!A59))","v":"SENEGAL"},{"$f":"IF(INTRO!$E$43=\"Non endémique\",\" \", IF(COUNTRY_INFO!B59=0,\" \",COUNTRY_INFO!B59))","v":"Matam"},{"$f":"IF(INTRO!$E$43=\"Non endémique\",\" \", IF(COUNTRY_INFO!C59=0,\" \",COUNTRY_INFO!C59))","v":"Ranerou"},{"$f":"IF(INTRO!$E$43=\"Non endémique\", \"Non requis\", COUNTRY_INFO!Y59)","v":1},0,1139,2500,3639,null,null,1,"EAS et Adultes",null,{"$f":"IF($I59<>\"Oui\",$F59*2,($F59+ROUND(J59*$F59/SUM(COUNTRY_INFO!$E59:$G59),0))*2)","v":2278},{"$f":"IF($I59<>\"Oui\",$G59*3,($G59+ROUND(J59*$G59/SUM(COUNTRY_INFO!$E59:$G59),0))*3)","v":7500},9778,null,9778]
[{"$f":"IF(INTRO!$E$43=\"Non endémique\",\" \", IF(COUNTRY_INFO!A60=0,\" \",COUNTRY_INFO!A60))","v":"SENEGAL"},{"$f":"IF(INTRO!$E$43=\"Non endémique\",\" \", IF(COUNTRY_INFO!B60=0,\" \",COUNTRY_INFO!B60))","v":"Saint Louis"},{"$f":"IF(INTRO!$E$43=\"Non endémique\",\" \", IF(COUNTRY_INFO!C60=0,\" \",COUNTRY_INFO!C60))","v":"Dagana"},{"$f":"IF(INTRO!$E$43=\"Non endémique\", \"Non requis\", COUNTRY_INFO!Y60)","v":1},0,24990,54865,79855,"Oui",8330,1,"EAS et Adultes",null,{"$f":"IF($I60<>\"Oui\",$F60*2,($F60+ROUND(J60*$F60/SUM(COUNTRY_INFO!$E60:$G60),0))*2)","v":54062},{"$f":"IF($I60<>\"Oui\",$G60*3,($G60+ROUND(J60*$G60/SUM(COUNTRY_INFO!$E60:$G60),0))*3)","v":178041},232103,null,232103]
[{"$f":"IF(INTRO!$E$43=\"Non endémique\",\" \", IF(COUNTRY_INFO!A61=0,\" \",COUNTRY_INFO!A61))","v":"SENEGAL"},{"$f":"IF(INTRO!$E$43=\"Non endémique\",\" \", IF(COUNTRY_INFO!B61=0,\" \",COUNTRY_INFO!B61))","v":"Saint Louis"},{"$f":"IF(INTRO!$E$43=\"Non endémique\",\" \", IF(COUNTRY_INFO!C61=0,\" \",COUNTRY_INFO!C61))","v":"Richard Toll"},{"$f":"IF(INTRO!$E$43=\"Non endémique\", \"Non requis\", COUNTRY_INFO!Y61)","v":1},0,53899,118329,172228,"Oui",17966.333333333332,1,"EAS et Adultes",null,{"$f":"IF($I61<>\"Oui\",$F61*2,($F61+ROUND(J61*$F61/SUM(COUNTRY_INFO!$E61:$G61),0))*2)","v":117004},{"$f":"IF($I61<>\"Oui\",$G61*3,($G61+ROUND(J61*$G61/SUM(COUNTRY_INFO!$E61:$G61),0))*3)","v":385302},502306,null,502306]
[{"$f":"IF(INTRO!$E$43=\"Non endémique\",\" \", IF(COUNTRY_INFO!A62=0,\" \",COUNTRY_INFO!A62))","v":"SENEGAL"},{"$f":"IF(INTRO!$E$43=\"Non endémique\",\" \", IF(COUNTRY_INFO!B62=0,\" \",COUNTRY_INFO!B62))","v":"Saint Louis"},{"$f":"IF(INTRO!$E$43=\"Non endémique\",\" \", IF(COUNTRY_INFO!C62=0,\" \",COUNTRY_INFO!C62))","v":"Peté"},{"$f":"IF(INTRO!$E$43=\"Non endémique\", \"Non requis\", COUNTRY_INFO!Y62)","v":1},0,58194,127750,185944,"Oui",19435.333333333332,1,"EAS et Adultes",null,{"$f":"IF($I62<>\"Oui\",$F62*2,($F62+ROUND(J62*$F62/SUM(COUNTRY_INFO!$E62:$G62),0))*2)","v":127036},{"$f":"IF($I62<>\"Oui\",$G62*3,($G62+ROUND(J62*$G62/SUM(COUNTRY_INFO!$E62:$G62),0))*3)","v":418314},545350,null,545350]
[{"$f":"IF(INTRO!$E$43=\"Non endémique\",\" \", IF(COUNTRY_INFO!A63=0,\" \",COUNTRY_INFO!A63))","v":"SENEGAL"},{"$f":"IF(INTRO!$E$43=\"Non endémique\",\" \", IF(COUNTRY_INFO!B63=0,\" \",COUNTRY_INFO!B63))","v":"Saint Louis"},{"$f":"IF(INTRO!$E$43=\"Non endémique\",\" \", IF(COUNTRY_INFO!C63=0,\" \",COUNTRY_INFO!C63))","v":"Podor"},{"$f":"IF(INTRO!$E$43=\"Non endémique\", \"Non requis\", COUNTRY_INFO!Y63)","v":1},0,72209,158531,230740,"Oui",24069.666666666668,1,"EAS et Adultes",null,{"$f":"IF($I63<>\"Oui\",$F63*2,($F63+ROUND(J63*$F63/SUM(COUNTRY_INFO!$E63:$G63),0))*2)","v":157450},{"$f":"IF($I63<>\"Oui\",$G63*3,($G63+ROUND(J63*$G63/SUM(COUNTRY_INFO!$E63:$G63),0))*3)","v":518511},675961,null,675961]
[{"$f":"IF(INTRO!$E$43=\"Non endémique\",\" \", IF(COUNTRY_INFO!A64=0,\" \",COUNTRY_INFO!A64))","v":"SENEGAL"},{"$f":"IF(INTRO!$E$43=\"Non endémique\",\" \", IF(COUNTRY_INFO!B64=0,\" \",COUNTRY_INFO!B64))","v":"Saint Louis"},{"$f":"IF(INTRO!$E$43=\"Non endémique\",\" \", IF(COUNTRY_INFO!C64=0,\" \",COUNTRY_INFO!C64))","v":"Saint Louis"},{"$f":"IF(INTRO!$E$43=\"Non endémique\", \"Non requis\", COUNTRY_INFO!Y64)","v":1},0,99239,217869,317108,null,null,1,"EAS et Adultes",null,{"$f":"IF($I64<>\"Oui\",$F64*2,($F64+ROUND(J64*$F64/SUM(COUNTRY_INFO!$E64:$G64),0))*2)","v":198478},{"$f":"IF($I64<>\"Oui\",$G64*3,($G64+ROUND(J64*$G64/SUM(COUNTRY_INFO!$E64:$G64),0))*3)","v":653607},852085,null,852085]
[{"$f":"IF(INTRO!$E$43=\"Non endémique\",\" \", IF(COUNTRY_INFO!A65=0,\" \",COUNTRY_INFO!A65))","v":"SENEGAL"},{"$f":"IF(INTRO!$E$43=\"Non endémique\",\" \", IF(COUNTRY_INFO!B65=0,\" \",COUNTRY_INFO!B65))","v":"Sédhiou"},{"$f":"IF(INTRO!$E$43=\"Non endémique\",\" \", IF(COUNTRY_INFO!C65=0,\" \",COUNTRY_INFO!C65))","v":"Bounkiling"},{"$f":"IF(INTRO!$E$43=\"Non endémique\", \"Non requis\", COUNTRY_INFO!Y65)","v":1},0,4629,10163,14792,null,10167.333333333334,2,"EAS et Adultes",null,{"$f":"IF($I65<>\"Oui\",$F65*2,($F65+ROUND(J65*$F65/SUM(COUNTRY_INFO!$E65:$G65),0))*2)","v":9258},{"$f":"IF($I65<>\"Oui\",$G65*3,($G65+ROUND(J65*$G65/SUM(COUNTRY_INFO!$E65:$G65),0))*3)","v":30489},39747,null,39747]
[{"$f":"IF(INTRO!$E$43=\"Non endémique\",\" \", IF(COUNTRY_INFO!A66=0,\" \",COUNTRY_INFO!A66))","v":"SENEGAL"},{"$f":"IF(INTRO!$E$43=\"Non endémique\",\" \", IF(COUNTRY_INFO!B66=0,\" \",COUNTRY_INFO!B66))","v":"Sédhiou"},{"$f":"IF(INTRO!$E$43=\"Non endémique\",\" \", IF(COUNTRY_INFO!C66=0,\" \",COUNTRY_INFO!C66))","v":"Goudomp"},{"$f":"IF(INTRO!$E$43=\"Non endémique\", \"Non requis\", COUNTRY_INFO!Y66)","v":0},0,0,0,0,null,6813.333333333333,2,"EAS et Adultes",null,{"$f":"IF($I66<>\"Oui\",$F66*2,($F66+ROUND(J66*$F66/SUM(COUNTRY_INFO!$E66:$G66),0))*2)","v":0},{"$f":"IF($I66<>\"Oui\",$G66*3,($G66+ROUND(J66*$G66/SUM(COUNTRY_INFO!$E66:$G66),0))*3)","v":0},0,null,0]
[{"$f":"IF(INTRO!$E$43=\"Non endémique\",\" \", IF(COUNTRY_INFO!A67=0,\" \",COUNTRY_INFO!A67))","v":"SENEGAL"},{"$f":"IF(INTRO!$E$43=\"Non endémique\",\" \", IF(COUNTRY_INFO!B67=0,\" \",COUNTRY_INFO!B67))","v":"Sédhiou"},{"$f":"IF(INTRO!$E$43=\"Non endémique\",\" \", IF(COUNTRY_INFO!C67=0,\" \",COUNTRY_INFO!C67))","v":"Sedhiou"},{"$f":"IF(INTRO!$E$43=\"Non endémique\", \"Non requis\", COUNTRY_INFO!Y67)","v":1},0,46617,102342,148959,null,8910.3333333333339,0,null,null,{"$f":"IF($I67<>\"Oui\",$F67*2,($F67+ROUND(J67*$F67/SUM(COUNTRY_INFO!$E67:$G67),0))*2)","v":93234},{"$f":"IF($I67<>\"Oui\",$G67*3,($G67+ROUND(J67*$G67/SUM(COUNTRY_INFO!$E67:$G67),0))*3)","v":307026},400260,null,400260]
[{"$f":"IF(INTRO!$E$43=\"Non endémique\",\" \", IF(COUNTRY_INFO!A68=0,\" \",COUNTRY_INFO!A68))","v":"SENEGAL"},{"$f":"IF(INTRO!$E$43=\"Non endémique\",\" \", IF(COUNTRY_INFO!B68=0,\" \",COUNTRY_INFO!B68))","v":"Tambacounda"},{"$f":"IF(INTRO!$E$43=\"Non endémique\",\" \", IF(COUNTRY_INFO!C68=0,\" \",COUNTRY_INFO!C68))","v":"Bakel"},{"$f":"IF(INTRO!$E$43=\"Non endémique\", \"Non requis\", COUNTRY_INFO!Y68)","v":1},0,30502,66959,97461,"Oui",10167.333333333334,2,"EAS et Adultes",null,{"$f":"IF($I68<>\"Oui\",$F68*2,($F68+ROUND(J68*$F68/SUM(COUNTRY_INFO!$E68:$G68),0))*2)","v":66210},{"$f":"IF($I68<>\"Oui\",$G68*3,($G68+ROUND(J68*$G68/SUM(COUNTRY_INFO!$E68:$G68),0))*3)","v":218019},284229,null,284229]
[{"$f":"IF(INTRO!$E$43=\"Non endémique\",\" \", IF(COUNTRY_INFO!A69=0,\" \",COUNTRY_INFO!A69))","v":"SENEGAL"},{"$f":"IF(INTRO!$E$43=\"Non endémique\",\" \", IF(COUNTRY_INFO!B69=0,\" \",COUNTRY_INFO!B69))","v":"Tambacounda"},{"$f":"IF(INTRO!$E$43=\"Non endémique\",\" \", IF(COUNTRY_INFO!C69=0,\" \",COUNTRY_INFO!C69))","v":"Kidira"},{"$f":"IF(INTRO!$E$43=\"Non endémique\", \"Non requis\", COUNTRY_INFO!Y69)","v":1},0,20440,44874,65314,"Oui",6813.333333333333,2,"EAS et Adultes",null,{"$f":"IF($I69<>\"Oui\",$F69*2,($F69+ROUND(J69*$F69/SUM(COUNTRY_INFO!$E69:$G69),0))*2)","v":44546},{"$f":"IF($I69<>\"Oui\",$G69*3,($G69+ROUND(J69*$G69/SUM(COUNTRY_INFO!$E69:$G69),0))*3)","v":146697},191243,null,191243]
[{"$f":"IF(INTRO!$E$43=\"Non endémique\",\" \", IF(COUNTRY_INFO!A70=0,\" \",COUNTRY_INFO!A70))","v":"SENEGAL"},{"$f":"IF(INTRO!$E$43=\"Non endémique\",\" \", IF(COUNTRY_INFO!B70=0,\" \",COUNTRY_INFO!B70))","v":"Tambacounda"},{"$f":"IF(INTRO!$E$43=\"Non endémique\",\" \", IF(COUNTRY_INFO!C70=0,\" \",COUNTRY_INFO!C70))","v":"Goudiry"},{"$f":"IF(INTRO!$E$43=\"Non endémique\", \"Non requis\", COUNTRY_INFO!Y70)","v":1},0,26731,58686,85417,"Oui",8910.3333333333339,2,"EAS et Adultes",null,{"$f":"IF($I70<>\"Oui\",$F70*2,($F70+ROUND(J70*$F70/SUM(COUNTRY_INFO!$E70:$G70),0))*2)","v":58090},{"$f":"IF($I70<>\"Oui\",$G70*3,($G70+ROUND(J70*$G70/SUM(COUNTRY_INFO!$E70:$G70),0))*3)","v":191298},249388,null,249388]
[{"$f":"IF(INTRO!$E$43=\"Non endémique\",\" \", IF(COUNTRY_INFO!A71=0,\" \",COUNTRY_INFO!A71))","v":"SENEGAL"},{"$f":"IF(INTRO!$E$43=\"Non endémique\",\" \", IF(COUNTRY_INFO!B71=0,\" \",COUNTRY_INFO!B71))","v":"Tambacounda"},{"$f":"IF(INTRO!$E$43=\"Non endémique\",\" \", IF(COUNTRY_INFO!C71=0,\" \",COUNTRY_INFO!C71))","v":"Dianke Makha"},{"$f":"IF(INTRO!$E$43=\"Non endémique\", \"Non requis\", COUNTRY_INFO!Y71)","v":1},0,15211,33393,48604,"Oui",5070.333333333333,2,"EAS et Adultes",null,{"$f":"IF($I71<>\"Oui\",$F71*2,($F71+ROUND(J71*$F71/SUM(COUNTRY_INFO!$E71:$G71),0))*2)","v":33062},{"$f":"IF($I71<>\"Oui\",$G71*3,($G71+ROUND(J71*$G71/SUM(COUNTRY_INFO!$E71:$G71),0))*3)","v":108873},141935,null,141935]
[{"$f":"IF(INTRO!$E$43=\"Non endémique\",\" \", IF(COUNTRY_INFO!A72=0,\" \",COUNTRY_INFO!A72))","v":"SENEGAL"},{"$f":"IF(INTRO!$E$43=\"Non endémique\",\" \", IF(COUNTRY_INFO!B72=0,\" \",COUNTRY_INFO!B72))","v":"Tambacounda"},{"$f":"IF(INTRO!$E$43=\"Non endémique\",\" \", IF(COUNTRY_INFO!C72=0,\" \",COUNTRY_INFO!C72))","v":"Koumpentoum"},{"$f":"IF(INTRO!$E$43=\"Non endémique\", \"Non requis\", COUNTRY_INFO!Y72)","v":1},0,2103,4617,6720,null,null,2,"EAS et Adultes",null,{"$f":"IF($I72<>\"Oui\",$F72*2,($F72+ROUND(J72*$F72/SUM(COUNTRY_INFO!$E72:$G72),0))*2)","v":4206},{"$f":"IF($I72<>\"Oui\",$G72*3,($G72+ROUND(J72*$G72/SUM(COUNTRY_INFO!$E72:$G72),0))*3)","v":13851},18057,null,18057]
[{"$f":"IF(INTRO!$E$43=\"Non endémique\",\" \", IF(COUNTRY_INFO!A73=0,\" \",COUNTRY_INFO!A73))","v":"SENEGAL"},{"$f":"IF(INTRO!$E$43=\"Non endémique\",\" \", IF(COUNTRY_INFO!B73=0,\" \",COUNTRY_INFO!B73))","v":"Tambacounda"},{"$f":"IF(INTRO!$E$43=\"Non endémique\",\" \", IF(COUNTRY_INFO!C73=0,\" \",COUNTRY_INFO!C73))","v":"Tambacounda"},{"$f":"IF(INTRO!$E$43=\"Non endémique\", \"Non requis\", COUNTRY_INFO!Y73)","v":1},0,75637,166053,241690,null,null,2,"EAS et Adultes",null,{"$f":"IF($I73<>\"Oui\",$F73*2,($F73+ROUND(J73*$F73/SUM(COUNTRY_INFO!$E73:$G73),0))*2)","v":151274},{"$f":"IF($I73<>\"Oui\",$G73*3,($G73+ROUND(J73*$G73/SUM(COUNTRY_INFO!$E73:$G73),0))*3)","v":498159},649433,null,649433]
[{"$f":"IF(INTRO!$E$43=\"Non endémique\",\" \", IF(COUNTRY_INFO!A74=0,\" \",COUNTRY_INFO!A74))","v":"SENEGAL"},{"$f":"IF(INTRO!$E$43=\"Non endémique\",\" \", IF(COUNTRY_INFO!B74=0,\" \",COUNTRY_INFO!B74))","v":"Tambacounda"},{"$f":"IF(INTRO!$E$43=\"Non endémique\",\" \", IF(COUNTRY_INFO!C74=0,\" \",COUNTRY_INFO!C74))","v":"Maka Colibantang"},{"$f":"IF(INTRO!$E$43=\"Non endémique\", \"Non requis\", COUNTRY_INFO!Y74)","v":1},0,23799,52248,76047,null,null,0,null,null,{"$f":"IF($I74<>\"Oui\",$F74*2,($F74+ROUND(J74*$F74/SUM(COUNTRY_INFO!$E74:$G74),0))*2)","v":47598},{"$f":"IF($I74<>\"Oui\",$G74*3,($G74+ROUND(J74*$G74/SUM(COUNTRY_INFO!$E74:$G74),0))*3)","v":156744},204342,null,204342]
[{"$f":"IF(INTRO!$E$43=\"Non endémique\",\" \", IF(COUNTRY_INFO!A75=0,\" \",COUNTRY_INFO!A75))","v":"SENEGAL"},{"$f":"IF(INTRO!$E$43=\"Non endémique\",\" \", IF(COUNTRY_INFO!B75=0,\" \",COUNTRY_INFO!B75))","v":"Thiès"},{"$f":"IF(INTRO!$E$43=\"Non endémique\",\" \", IF(COUNTRY_INFO!C75=0,\" \",COUNTRY_INFO!C75))","v":"Joal-Fadhiouth"},{"$f":"IF(INTRO!$E$43=\"Non endémique\", \"Non requis\", COUNTRY_INFO!Y75)","v":1},0,4591,10080,{"$f":"SUM(E75:G75)","v":14671},null,null,2,"EAS et Adultes",null,{"$f":"IF($I75<>\"Oui\",$F75*2,($F75+ROUND(J75*$F75/SUM(COUNTRY_INFO!$E75:$G75),0))*2)","v":9182},{"$f":"IF($I75<>\"Oui\",$G75*3,($G75+ROUND(J75*$G75/SUM(COUNTRY_INFO!$E75:$G75),0))*3)","v":30240},{"$f":"SUM(M75:O75)","v":39422},null,{"$f":"IF($P75>$Q75,P75-Q75,0)","v":39422}]
[{"$f":"IF(INTRO!$E$43=\"Non endémique\",\" \", IF(COUNTRY_INFO!A76=0,\" \",COUNTRY_INFO!A76))","v":"SENEGAL"},{"$f":"IF(INTRO!$E$43=\"Non endémique\",\" \", IF(COUNTRY_INFO!B76=0,\" \",COUNTRY_INFO!B76))","v":"Thiès"},{"$f":"IF(INTRO!$E$43=\"Non endémique\",\" \", IF(COUNTRY_INFO!C76=0,\" \",COUNTRY_INFO!C76))","v":"Mbour"},{"$f":"IF(INTRO!$E$43=\"Non endémique\", \"Non requis\", COUNTRY_INFO!Y76)","v":0},0,0,0,0,null,null,1,"EAS et Adultes",null,{"$f":"IF($I76<>\"Oui\",$F76*2,($F76+ROUND(J76*$F76/SUM(COUNTRY_INFO!$E76:$G76),0))*2)","v":0},{"$f":"IF($I76<>\"Oui\",$G76*3,($G76+ROUND(J76*$G76/SUM(COUNTRY_INFO!$E76:$G76),0))*3)","v":0},0,null,0]
[{"$f":"IF(INTRO!$E$43=\"Non endémique\",\" \", IF(COUNTRY_INFO!A77=0,\" \",COUNTRY_INFO!A77))","v":"SENEGAL"},{"$f":"IF(INTRO!$E$43=\"Non endémique\",\" \", IF(COUNTRY_INFO!B77=0,\" \",COUNTRY_INFO!B77))","v":"Thiès"},{"$f":"IF(INTRO!$E$43=\"Non endémique\",\" \", IF(COUNTRY_INFO!C77=0,\" \",COUNTRY_INFO!C77))","v":"Popenguine"},{"$f":"IF(INTRO!$E$43=\"Non endémique\", \"Non requis\", COUNTRY_INFO!Y77)","v":0},0,0,0,0,null,null,1,"EAS et Adultes",null,{"$f":"IF($I77<>\"Oui\",$F77*2,($F77+ROUND(J77*$F77/SUM(COUNTRY_INFO!$E77:$G77),0))*2)","v":0},{"$f":"IF($I77<>\"Oui\",$G77*3,($G77+ROUND(J77*$G77/SUM(COUNTRY_INFO!$E77:$G77),0))*3)","v":0},0,null,0]
[{"$f":"IF(INTRO!$E$43=\"Non endémique\",\" \", IF(COUNTRY_INFO!A78=0,\" \",COUNTRY_INFO!A78))","v":"SENEGAL"},{"$f":"IF(INTRO!$E$43=\"Non endémique\",\" \", IF(COUNTRY_INFO!B78=0,\" \",COUNTRY_INFO!B78))","v":"Thiès"},{"$f":"IF(INTRO!$E$43=\"Non endémique\",\" \", IF(COUNTRY_INFO!C78=0,\" \",COUNTRY_INFO!C78))","v":"Thiadiaye"},{"$f":"IF(INTRO!$E$43=\"Non endémique\", \"Non requis\", COUNTRY_INFO!Y78)","v":1},0,43498,95496,138994,null,null,0,null,null,{"$f":"IF($I78<>\"Oui\",$F78*2,($F78+ROUND(J78*$F78/SUM(COUNTRY_INFO!$E78:$G78),0))*2)","v":86996},{"$f":"IF($I78<>\"Oui\",$G78*3,($G78+ROUND(J78*$G78/SUM(COUNTRY_INFO!$E78:$G78),0))*3)","v":286488},373484,null,373484]
[{"$f":"IF(INTRO!$E$43=\"Non endémique\",\" \", IF(COUNTRY_INFO!A79=0,\" \",COUNTRY_INFO!A79))","v":"SENEGAL"},{"$f":"IF(INTRO!$E$43=\"Non endémique\",\" \", IF(COUNTRY_INFO!B79=0,\" \",COUNTRY_INFO!B79))","v":"Thiès"},{"$f":"IF(INTRO!$E$43=\"Non endémique\",\" \", IF(COUNTRY_INFO!C79=0,\" \",COUNTRY_INFO!C79))","v":"Pout"},{"$f":"IF(INTRO!$E$43=\"Non endémique\", \"Non requis\", COUNTRY_INFO!Y79)","v":0},0,0,0,0,null,null,1,"EAS et Adultes",null,{"$f":"IF($I79<>\"Oui\",$F79*2,($F79+ROUND(J79*$F79/SUM(COUNTRY_INFO!$E79:$G79),0))*2)","v":0},{"$f":"IF($I79<>\"Oui\",$G79*3,($G79+ROUND(J79*$G79/SUM(COUNTRY_INFO!$E79:$G79),0))*3)","v":0},0,null,0]
[{"$f":"IF(INTRO!$E$43=\"Non endémique\",\" \", IF(COUNTRY_INFO!A80=0,\" \",COUNTRY_INFO!A80))","v":"SENEGAL"},{"$f":"IF(INTRO!$E$43=\"Non endémique\",\" \", IF(COUNTRY_INFO!B80=0,\" \",COUNTRY_INFO!B80))","v":"Thiès"},{"$f":"IF(INTRO!$E$43=\"Non endémique\",\" \", IF(COUNTRY_INFO!C80=0,\" \",COUNTRY_INFO!C80))","v":"Thiès"},{"$f":"IF(INTRO!$E$43=\"Non endémique\", \"Non requis\", COUNTRY_INFO!Y80)","v":1},0,10444,22929,33373,null,null,1,"EAS et Adultes",null,{"$f":"IF($I80<>\"Oui\",$F80*2,($F80+ROUND(J80*$F80/SUM(COUNTRY_INFO!$E80:$G80),0))*2)","v":20888},{"$f":"IF($I80<>\"Oui\",$G80*3,($G80+ROUND(J80*$G80/SUM(COUNTRY_INFO!$E80:$G80),0))*3)","v":68787},89675,null,89675]
[{"$f":"IF(INTRO!$E$43=\"Non endémique\",\" \", IF(COUNTRY_INFO!A81=0,\" \",COUNTRY_INFO!A81))","v":"SENEGAL"},{"$f":"IF(INTRO!$E$43=\"Non endémique\",\" \", IF(COUNTRY_INFO!B81=0,\" \",COUNTRY_INFO!B81))","v":"Thiès"},{"$f":"IF(INTRO!$E$43=\"Non endémique\",\" \", IF(COUNTRY_INFO!C81=0,\" \",COUNTRY_INFO!C81))","v":"Khombole"},{"$f":"IF(INTRO!$E$43=\"Non endémique\", \"Non requis\", COUNTRY_INFO!Y81)","v":1},0,8170,17935,26105,null,null,1,"EAS et Adultes",null,{"$f":"IF($I81<>\"Oui\",$F81*2,($F81+ROUND(J81*$F81/SUM(COUNTRY_INFO!$E81:$G81),0))*2)","v":16340},{"$f":"IF($I81<>\"Oui\",$G81*3,($G81+ROUND(J81*$G81/SUM(COUNTRY_INFO!$E81:$G81),0))*3)","v":53805},70145,null,70145]
[{"$f":"IF(INTRO!$E$43=\"Non endémique\",\" \", IF(COUNTRY_INFO!A82=0,\" \",COUNTRY_INFO!A82))","v":"SENEGAL"},{"$f":"IF(INTRO!$E$43=\"Non endémique\",\" \", IF(COUNTRY_INFO!B82=0,\" \",COUNTRY_INFO!B82))","v":"Thiès"},{"$f":"IF(INTRO!$E$43=\"Non endémique\",\" \", IF(COUNTRY_INFO!C82=0,\" \",COUNTRY_INFO!C82))","v":"Tivaouane"},{"$f":"IF(INTRO!$E$43=\"Non endémique\", \"Non requis\", COUNTRY_INFO!Y82)","v":1},0,2976,6534,9510,null,null,1,"EAS et Adultes",null,{"$f":"IF($I82<>\"Oui\",$F82*2,($F82+ROUND(J82*$F82/SUM(COUNTRY_INFO!$E82:$G82),0))*2)","v":5952},{"$f":"IF($I82<>\"Oui\",$G82*3,($G82+ROUND(J82*$G82/SUM(COUNTRY_INFO!$E82:$G82),0))*3)","v":19602},25554,null,25554]
[{"$f":"IF(INTRO!$E$43=\"Non endémique\",\" \", IF(COUNTRY_INFO!A83=0,\" \",COUNTRY_INFO!A83))","v":"SENEGAL"},{"$f":"IF(INTRO!$E$43=\"Non endémique\",\" \", IF(COUNTRY_INFO!B83=0,\" \",COUNTRY_INFO!B83))","v":"Thiès"},{"$f":"IF(INTRO!$E$43=\"Non endémique\",\" \", IF(COUNTRY_INFO!C83=0,\" \",COUNTRY_INFO!C83))","v":"Mékhé"},{"$f":"IF(INTRO!$E$43=\"Non endémique\", \"Non requis\", COUNTRY_INFO!Y83)","v":0},0,0,0,0,null,null,0,null,null,{"$f":"IF($I83<>\"Oui\",$F83*2,($F83+ROUND(J83*$F83/SUM(COUNTRY_INFO!$E83:$G83),0))*2)","v":0},{"$f":"IF($I83<>\"Oui\",$G83*3,($G83+ROUND(J83*$G83/SUM(COUNTRY_INFO!$E83:$G83),0))*3)","v":0},0,null,0]
[{"$f":"IF(INTRO!$E$43=\"Non endémique\",\" \", IF(COUNTRY_INFO!A84=0,\" \",COUNTRY_INFO!A84))","v":"SENEGAL"},{"$f":"IF(INTRO!$E$43=\"Non endémique\",\" \", IF(COUNTRY_INFO!B84=0,\" \",COUNTRY_INFO!B84))","v":"Ziguinchor"},{"$f":"IF(INTRO!$E$43=\"Non endémique\",\" \", IF(COUNTRY_INFO!C84=0,\" \",COUNTRY_INFO!C84))","v":"Diouloulou"},{"$f":"IF(INTRO!$E$43=\"Non endémique\", \"Non requis\", COUNTRY_INFO!Y84)","v":1},0,2124,4664,6788,null,null,1,"EAS et Adultes",null,{"$f":"IF($I84<>\"Oui\",$F84*2,($F84+ROUND(J84*$F84/SUM(COUNTRY_INFO!$E84:$G84),0))*2)","v":4248},{"$f":"IF($I84<>\"Oui\",$G84*3,($G84+ROUND(J84*$G84/SUM(COUNTRY_INFO!$E84:$G84),0))*3)","v":13992},18240,null,18240]
[{"$f":"IF(INTRO!$E$43=\"Non endémique\",\" \", IF(COUNTRY_INFO!A85=0,\" \",COUNTRY_INFO!A85))","v":"SENEGAL"},{"$f":"IF(INTRO!$E$43=\"Non endémique\",\" \", IF(COUNTRY_INFO!B85=0,\" \",COUNTRY_INFO!B85))","v":"Ziguinchor"},{"$f":"IF(INTRO!$E$43=\"Non endémique\",\" \", IF(COUNTRY_INFO!C85=0,\" \",COUNTRY_INFO!C85))","v":"Bignona"},{"$f":"IF(INTRO!$E$43=\"Non endémique\", \"Non requis\", COUNTRY_INFO!Y85)","v":1},0,48345,106133,154478,null,null,0,null,null,{"$f":"IF($I85<>\"Oui\",$F85*2,($F85+ROUND(J85*$F85/SUM(COUNTRY_INFO!$E85:$G85),0))*2)","v":96690},{"$f":"IF($I85<>\"Oui\",$G85*3,($G85+ROUND(J85*$G85/SUM(COUNTRY_INFO!$E85:$G85),0))*3)","v":318399},415089,null,415089]
[{"$f":"IF(INTRO!$E$43=\"Non endémique\",\" \", IF(COUNTRY_INFO!A86=0,\" \",COUNTRY_INFO!A86))","v":"SENEGAL"},{"$f":"IF(INTRO!$E$43=\"Non endémique\",\" \", IF(COUNTRY_INFO!B86=0,\" \",COUNTRY_INFO!B86))","v":"Ziguinchor"},{"$f":"IF(INTRO!$E$43=\"Non endémique\",\" \", IF(COUNTRY_INFO!C86=0,\" \",COUNTRY_INFO!C86))","v":"Thionk Essyl"},{"$f":"IF(INTRO!$E$43=\"Non endémique\", \"Non requis\", COUNTRY_INFO!Y86)","v":0},0,0,0,0,null,null,0,null,null,{"$f":"IF($I86<>\"Oui\",$F86*2,($F86+ROUND(J86*$F86/SUM(COUNTRY_INFO!$E86:$G86),0))*2)","v":0},{"$f":"IF($I86<>\"Oui\",$G86*3,($G86+ROUND(J86*$G86/SUM(COUNTRY_INFO!$E86:$G86),0))*3)","v":0},0,null,0]
[{"$f":"IF(INTRO!$E$43=\"Non endémique\",\" \", IF(COUNTRY_INFO!A87=0,\" \",COUNTRY_INFO!A87))","v":"SENEGAL"},{"$f":"IF(INTRO!$E$43=\"Non endémique\",\" \", IF(COUNTRY_INFO!B87=0,\" \",COUNTRY_INFO!B87))","v":"Ziguinchor"},{"$f":"IF(INTRO!$E$43=\"Non endémique\",\" \", IF(COUNTRY_INFO!C87=0,\" \",COUNTRY_INFO!C87))","v":"Oussouye"},{"$f":"IF(INTRO!$E$43=\"Non endémique\", \"Non requis\", COUNTRY_INFO!Y87)","v":1},0,17780,39032,56812,null,null,1,"EAS et Adultes",null,{"$f":"IF($I87<>\"Oui\",$F87*2,($F87+ROUND(J87*$F87/SUM(COUNTRY_INFO!$E87:$G87),0))*2)","v":35560},{"$f":"IF($I87<>\"Oui\",$G87*3,($G87+ROUND(J87*$G87/SUM(COUNTRY_INFO!$E87:$G87),0))*3)","v":117096},152656,null,152656]
[{"$f":"IF(INTRO!$E$43=\"Non endémique\",\" \", IF(COUNTRY_INFO!A88=0,\" \",COUNTRY_INFO!A88))","v":"SENEGAL"},{"$f":"IF(INTRO!$E$43=\"Non endémique\",\" \", IF(COUNTRY_INFO!B88=0,\" \",COUNTRY_INFO!B88))","v":"Ziguinchor"},{"$f":"IF(INTRO!$E$43=\"Non endémique\",\" \", IF(COUNTRY_INFO!C88=0,\" \",COUNTRY_INFO!C88))","v":"Ziguinchor"},{"$f":"IF(INTRO!$E$43=\"Non endémique\", \"Non requis\", COUNTRY_INFO!Y88)","v":1},0,3100,6807,9907,null,null,1,"EAS et Adultes",null,{"$f":"IF($I88<>\"Oui\",$F88*2,($F88+ROUND(J88*$F88/SUM(COUNTRY_INFO!$E88:$G88),0))*2)","v":6200},{"$f":"IF($I88<>\"Oui\",$G88*3,($G88+ROUND(J88*$G88/SUM(COUNTRY_INFO!$E88:$G88),0))*3)","v":20421},26621,null,26621]

{"sheet":"IVM","index":5,"n_rows":88,"n_cols":14,"rows_kept":88,"cut":false,"hidden":false,"merged":[[3,0,3,2],[3,4,3,5],[6,4,7,4],[6,5,7,5],[5,8,5,13],[6,0,7,0],[6,1,7,1],[6,2,7,2],[5,0,5,2],[5,4,5,5],[5,6,5,7],[6,12,7,12],[5,3,7,3],[6,13,7,13],[6,8,7,8],[6,6,7,6],[6,7,7,7],[6,9,7,9],[6,10,7,10],[6,11,7,11]]}
["Ivermectine (IVM)"]
["Structure administrative, population ciblée par groupe d'âge, plan de traitement et information sur les comprimés"]
[]
["TOTAL",null,null,{"$f":"SUBTOTAL(9,D$10:D$1010)","v":445039},null,null,{"$f":"SUBTOTAL(9,G$10:G$1010)","v":445039},0,1246109.2,0,0,1246109.2,0,1246109.2]
[]
["Structure administrative du pays",null,null,"Population nécessitant un traitement avec IVM","Plan de traitement",null,"Population cible",null,"Ivermectine (IVM)"]
["Pays","Région/Département","District",null,"FL","Oncho","FL","Oncho","FL uniquement","Oncho uniquement","FL+Oncho","Total requis","Reste en stock","Comprimés devant être fournis"]
[]
[]
[{"$f":"IF(INTRO!$E$39=\"Non endémique\",\" \",IF(COUNTRY_INFO!A10=0,\" \",COUNTRY_INFO!A10))","v":"SENEGAL"},{"$f":"IF(INTRO!$E$39=\"Non endémique\",\" \",IF(COUNTRY_INFO!B10=0,\" \",COUNTRY_INFO!B10))","v":"Dakar"},{"$f":"IF(INTRO!$E$39=\"Non endémique\",\" \",IF(COUNTRY_INFO!C10=0,\" \",COUNTRY_INFO!C10))","v":"Dakar sud"},{"$f":"IF(INTRO!$E$39=\"Non endémique\",0,IF(INTRO!$E$39=\"Endémique mais pas de CP\",IF(COUNTRY_INFO!$H10=1,COUNTRY_INFO!F10+COUNTRY_INFO!G10,0),IF(COUNTRY_INFO!$H10=1,COUNTRY_INFO!F10+COUNTRY_INFO!G10,IF(COUNTRY_INFO!$I10=1,IF(COUNTRY_INFO!M10>=(COUNTRY_INFO!F10+COUNTRY_INFO!G10),COUNTRY_INFO!F10+COUNTRY_INFO!G10,COUNTRY_INFO!$M10),0))))","v":0},{"$f":"IF(AND(INTRO!$E$39=\"Non endémique\",INTRO!$E$37=\"Non endémique\"),\"Non requis\",IF(INTRO!$E$39=\"Non endémique\",\"Traiter avec DEC\",COUNTRY_INFO!V10))","v":0},{"$f":"IF(INTRO!$E$39<>\"Non endémique\",COUNTRY_INFO!W10,\"Non requis\")","v":0},{"$f":"IF(COUNTRY_INFO!H10=1, IF($E10=1,$D10, 0),0)","v":0},{"$f":"IF(COUNTRY_INFO!I10=1, IF(AND(COUNTRY_INFO!$I10=1,$F10<>0),IF(COUNTRY_INFO!M10>=(COUNTRY_INFO!F10+COUNTRY_INFO!G10),COUNTRY_INFO!F10+COUNTRY_INFO!G10,COUNTRY_INFO!$M10), 0),0)","v":0},{"$f":"IF(G10<H10,0,IF($E10=1, (G10-H10)*2.8, 0))","v":0},{"$f":"IF($E10<$F10, H10*(F10-E10)*2.8, 0)","v":0},{"$f":"IF(AND($E10=1, $F10<>0), H10*2.8, 0)","v":0},{"$f":"SUM(I10:K10)","v":0},null,{"$f":"IF($L10>$M10,$L10-$M10,0)","v":0}]
[{"$f":"IF(INTRO!$E$39=\"Non endémique\",\" \",IF(COUNTRY_INFO!A11=0,\" \",COUNTRY_INFO!A11))","v":"SENEGAL"},{"$f":"IF(INTRO!$E$39=\"Non endémique\",\" \",IF(COUNTRY_INFO!B11=0,\" \",COUNTRY_INFO!B11))","v":"Dakar"},{"$f":"IF(INTRO!$E$39=\"Non endémique\",\" \",IF(COUNTRY_INFO!C11=0,\" \",COUNTRY_INFO!C11))","v":"Dakar centre"},{"$f":"IF(INTRO!$E$39=\"Non endémique\",0,IF(INTRO!$E$39=\"Endémique mais pas de CP\",IF(COUNTRY_INFO!$H11=1,COUNTRY_INFO!F11+COUNTRY_INFO!G11,0),IF(COUNTRY_INFO!$H11=1,COUNTRY_INFO!F11+COUNTRY_INFO!G11,IF(COUNTRY_INFO!$I11=1,IF(COUNTRY_INFO!M11>=(COUNTRY_INFO!F11+COUNTRY_INFO!G11),COUNTRY_INFO!F11+COUNTRY_INFO!G11,COUNTRY_INFO!$M11),0))))","v":0},{"$f":"IF(AND(INTRO!$E$39=\"Non endémique\",INTRO!$E$37=\"Non endémique\"),\"Non requis\",IF(INTRO!$E$39=\"Non endémique\",\"Traiter avec DEC\",COUNTRY_INFO!V11))","v":0},{"$f":"IF(INTRO!$E$39<>\"Non endémique\",COUNTRY_INFO!W11,\"Non requis\")","v":0},{"$f":"IF(COUNTRY_INFO!H11=1, IF($E11=1,$D11, 0),0)","v":0},{"$f":"IF(COUNTRY_INFO!I11=1, IF(AND(COUNTRY_INFO!$I11=1,$F11<>0),IF(COUNTRY_INFO!M11>=(COUNTRY_INFO!F11+COUNTRY_INFO!G11),COUNTRY_INFO!F11+COUNTRY_INFO!G11,COUNTRY_INFO!$M11), 0),0)","v":0},0,0,{"$f":"IF(AND($E11=1, $F11<>0), H11*2.8, 0)","v":0},{"$f":"SUM(I11:K11)","v":0},null,0]
[{"$f":"IF(INTRO!$E$39=\"Non endémique\",\" \",IF(COUNTRY_INFO!A12=0,\" \",COUNTRY_INFO!A12))","v":"SENEGAL"},{"$f":"IF(INTRO!$E$39=\"Non endémique\",\" \",IF(COUNTRY_INFO!B12=0,\" \",COUNTRY_INFO!B12))","v":"Dakar"},{"$f":"IF(INTRO!$E$39=\"Non endémique\",\" \",IF(COUNTRY_INFO!C12=0,\" \",COUNTRY_INFO!C12))","v":"Dakar ouest"},{"$f":"IF(INTRO!$E$39=\"Non endémique\",0,IF(INTRO!$E$39=\"Endémique mais pas de CP\",IF(COUNTRY_INFO!$H12=1,COUNTRY_INFO!F12+COUNTRY_INFO!G12,0),IF(COUNTRY_INFO!$H12=1,COUNTRY_INFO!F12+COUNTRY_INFO!G12,IF(COUNTRY_INFO!$I12=1,IF(COUNTRY_INFO!M12>=(COUNTRY_INFO!F12+COUNTRY_INFO!G12),COUNTRY_INFO!F12+COUNTRY_INFO!G12,COUNTRY_INFO!$M12),0))))","v":0},{"$f":"IF(AND(INTRO!$E$39=\"Non endémique\",INTRO!$E$37=\"Non endémique\"),\"Non requis\",IF(INTRO!$E$39=\"Non endémique\",\"Traiter avec DEC\",COUNTRY_INFO!V12))","v":0},{"$f":"IF(INTRO!$E$39<>\"Non endémique\",COUNTRY_INFO!W12,\"Non requis\")","v":0},{"$f":"IF(COUNTRY_INFO!H12=1, IF($E12=1,$D12, 0),0)","v":0},{"$f":"IF(COUNTRY_INFO!I12=1, IF(AND(COUNTRY_INFO!$I12=1,$F12<>0),IF(COUNTRY_INFO!M12>=(COUNTRY_INFO!F12+COUNTRY_INFO!G12),COUNTRY_INFO!F12+COUNTRY_INFO!G12,COUNTRY_INFO!$M12), 0),0)","v":0},0,0,0,0,null,0]
[{"$f":"IF(INTRO!$E$39=\"Non endémique\",\" \",IF(COUNTRY_INFO!A13=0,\" \",COUNTRY_INFO!A13))","v":"SENEGAL"},{"$f":"IF(INTRO!$E$39=\"Non endémique\",\" \",IF(COUNTRY_INFO!B13=0,\" \",COUNTRY_INFO!B13))","v":"Dakar"},{"$f":"IF(INTRO!$E$39=\"Non endémique\",\" \",IF(COUNTRY_INFO!C13=0,\" \",COUNTRY_INFO!C13))","v":"Dakar nord"},{"$f":"IF(INTRO!$E$39=\"Non endémique\",0,IF(INTRO!$E$39=\"Endémique mais pas de CP\",IF(COUNTRY_INFO!$H13=1,COUNTRY_INFO!F13+COUNTRY_INFO!G13,0),IF(COUNTRY_INFO!$H13=1,COUNTRY_INFO!F13+COUNTRY_INFO!G13,IF(COUNTRY_INFO!$I13=1,IF(COUNTRY_INFO!M13>=(COUNTRY_INFO!F13+COUNTRY_INFO!G13),COUNTRY_INFO!F13+COUNTRY_INFO!G13,COUNTRY_INFO!$M13),0))))","v":0},{"$f":"IF(AND(INTRO!$E$39=\"Non endémique\",INTRO!$E$37=\"Non endémique\"),\"Non requis\",IF(INTRO!$E$39=\"Non endémique\",\"Traiter avec DEC\",COUNTRY_INFO!V13))","v":0},{"$f":"IF(INTRO!$E$39<>\"Non endémique\",COUNTRY_INFO!W13,\"Non requis\")","v":0},{"$f":"IF(COUNTRY_INFO!H13=1, IF($E13=1,$D13, 0),0)","v":0},{"$f":"IF(COUNTRY_INFO!I13=1, IF(AND(COUNTRY_INFO!$I13=1,$F13<>0),IF(COUNTRY_INFO!M13>=(COUNTRY_INFO!F13+COUNTRY_INFO!G13),COUNTRY_INFO!F13+COUNTRY_INFO!G13,COUNTRY_INFO!$M13), 0),0)","v":0},0,0,0,0,null,0]
[{"$f":"IF(INTRO!$E$39=\"Non endémique\",\" \",IF(COUNTRY_INFO!A14=0,\" \",COUNTRY_INFO!A14))","v":"SENEGAL"},{"$f":"IF(INTRO!$E$39=\"Non endémique\",\" \",IF(COUNTRY_INFO!B14=0,\" \",COUNTRY_INFO!B14))","v":"Dakar"},{"$f":"IF(INTRO!$E$39=\"Non endémique\",\" \",IF(COUNTRY_INFO!C14=0,\" \",COUNTRY_INFO!C14))","v":"Guédiawaye"},{"$f":"IF(INTRO!$E$39=\"Non endémique\",0,IF(INTRO!$E$39=\"Endémique mais pas de CP\",IF(COUNTRY_INFO!$H14=1,COUNTRY_INFO!F14+COUNTRY_INFO!G14,0),IF(COUNTRY_INFO!$H14=1,COUNTRY_INFO!F14+COUNTRY_INFO!G14,IF(COUNTRY_INFO!$I14=1,IF(COUNTRY_INFO!M14>=(COUNTRY_INFO!F14+COUNTRY_INFO!G14),COUNTRY_INFO!F14+COUNTRY_INFO!G14,COUNTRY_INFO!$M14),0))))","v":0},{"$f":"IF(AND(INTRO!$E$39=\"Non endémique\",INTRO!$E$37=\"Non endémique\"),\"Non requis\",IF(INTRO!$E$39=\"Non endémique\",\"Traiter avec DEC\",COUNTRY_INFO!V14))","v":0},{"$f":"IF(INTRO!$E$39<>\"Non endémique\",COUNTRY_INFO!W14,\"Non requis\")","v":0},{"$f":"IF(COUNTRY_INFO!H14=1, IF($E14=1,$D14, 0),0)","v":0},{"$f":"IF(COUNTRY_INFO!I14=1, IF(AND(COUNTRY_INFO!$I14=1,$F14<>0),IF(COUNTRY_INFO!M14>=(COUNTRY_INFO!F14+COUNTRY_INFO!G14),COUNTRY_INFO!F14+COUNTRY_INFO!G14,COUNTRY_INFO!$M14), 0),0)","v":0},0,0,0,0,null,0]
[{"$f":"IF(INTRO!$E$39=\"Non endémique\",\" \",IF(COUNTRY_INFO!A15=0,\" \",COUNTRY_INFO!A15))","v":"SENEGAL"},{"$f":"IF(INTRO!$E$39=\"Non endémique\",\" \",IF(COUNTRY_INFO!B15=0,\" \",COUNTRY_INFO!B15))","v":"Dakar"},{"$f":"IF(INTRO!$E$39=\"Non endémique\",\" \",IF(COUNTRY_INFO!C15=0,\" \",COUNTRY_INFO!C15))","v":"Pikine"},{"$f":"IF(INTRO!$E$39=\"Non endémique\",0,IF(INTRO!$E$39=\"Endémique mais pas de CP\",IF(COUNTRY_INFO!$H15=1,COUNTRY_INFO!F15+COUNTRY_INFO!G15,0),IF(COUNTRY_INFO!$H15=1,COUNTRY_INFO!F15+COUNTRY_INFO!G15,IF(COUNTRY_INFO!$I15=1,IF(COUNTRY_INFO!M15>=(COUNTRY_INFO!F15+COUNTRY_INFO!G15),COUNTRY_INFO!F15+COUNTRY_INFO!G15,COUNTRY_INFO!$M15),0))))","v":0},{"$f":"IF(AND(INTRO!$E$39=\"Non endémique\",INTRO!$E$37=\"Non endémique\"),\"Non requis\",IF(INTRO!$E$39=\"Non endémique\",\"Traiter avec DEC\",COUNTRY_INFO!V15))","v":0},{"$f":"IF(INTRO!$E$39<>\"Non endémique\",COUNTRY_INFO!W15,\"Non requis\")","v":0},{"$f":"IF(COUNTRY_INFO!H15=1, IF($E15=1,$D15, 0),0)","v":0},{"$f":"IF(COUNTRY_INFO!I15=1, IF(AND(COUNTRY_INFO!$I15=1,$F15<>0),IF(COUNTRY_INFO!M15>=(COUNTRY_INFO!F15+COUNTRY_INFO!G15),COUNTRY_INFO!F15+COUNTRY_INFO!G15,COUNTRY_INFO!$M15), 0),0)","v":0},0,0,0,0,null,0]
[{"$f":"IF(INTRO!$E$39=\"Non endémique\",\" \",IF(COUNTRY_INFO!A16=0,\" \",COUNTRY_INFO!A16))","v":"SENEGAL"},{"$f":"IF(INTRO!$E$39=\"Non endémique\",\" \",IF(COUNTRY_INFO!B16=0,\" \",COUNTRY_INFO!B16))","v":"Dakar"},{"$f":"IF(INTRO!$E$39=\"Non endémique\",\" \",IF(COUNTRY_INFO!C16=0,\" \",COUNTRY_INFO!C16))","v":"Keur  Massar"},{"$f":"IF(INTRO!$E$39=\"Non endémique\",0,IF(INTRO!$E$39=\"Endémique mais pas de CP\",IF(COUNTRY_INFO!$H16=1,COUNTRY_INFO!F16+COUNTRY_INFO!G16,0),IF(COUNTRY_INFO!$H16=1,COUNTRY_INFO!F16+COUNTRY_INFO!G16,IF(COUNTRY_INFO!$I16=1,IF(COUNTRY_INFO!M16>=(COUNTRY_INFO!F16+COUNTRY_INFO!G16),COUNTRY_INFO!F16+COUNTRY_INFO!G16,COUNTRY_INFO!$M16),0))))","v":0},{"$f":"IF(AND(INTRO!$E$39=\"Non endémique\",INTRO!$E$37=\"Non endémique\"),\"Non requis\",IF(INTRO!$E$39=\"Non endémique\",\"Traiter avec DEC\",COUNTRY_INFO!V16))","v":0},{"$f":"IF(INTRO!$E$39<>\"Non endémique\",COUNTRY_INFO!W16,\"Non requis\")","v":0},{"$f":"IF(COUNTRY_INFO!H16=1, IF($E16=1,$D16, 0),0)","v":0},{"$f":"IF(COUNTRY_INFO!I16=1, IF(AND(COUNTRY_INFO!$I16=1,$F16<>0),IF(COUNTRY_INFO!M16>=(COUNTRY_INFO!F16+COUNTRY_INFO!G16),COUNTRY_INFO!F16+COUNTRY_INFO!G16,COUNTRY_INFO!$M16), 0),0)","v":0},0,0,0,0,null,0]
[{"$f":"IF(INTRO!$E$39=\"Non endémique\",\" \",IF(COUNTRY_INFO!A17=0,\" \",COUNTRY_INFO!A17))","v":"SENEGAL"},{"$f":"IF(INTRO!$E$39=\"Non endémique\",\" \",IF(COUNTRY_INFO!B17=0,\" \",COUNTRY_INFO!B17))","v":"Dakar"},{"$f":"IF(INTRO!$E$39=\"Non endémique\",\" \",IF(COUNTRY_INFO!C17=0,\" \",COUNTRY_INFO!C17))","v":"Yeumbeul"},{"$f":"IF(INTRO!$E$39=\"Non endémique\",0,IF(INTRO!$E$39=\"Endémique mais pas de CP\",IF(COUNTRY_INFO!$H17=1,COUNTRY_INFO!F17+COUNTRY_INFO!G17,0),IF(COUNTRY_INFO!$H17=1,COUNTRY_INFO!F17+COUNTRY_INFO!G17,IF(COUNTRY_INFO!$I17=1,IF(COUNTRY_INFO!M17>=(COUNTRY_INFO!F17+COUNTRY_INFO!G17),COUNTRY_INFO!F17+COUNTRY_INFO!G17,COUNTRY_INFO!$M17),0))))","v":0},{"$f":"IF(AND(INTRO!$E$39=\"Non endémique\",INTRO!$E$37=\"Non endémique\"),\"Non requis\",IF(INTRO!$E$39=\"Non endémique\",\"Traiter avec DEC\",COUNTRY_INFO!V17))","v":0},{"$f":"IF(INTRO!$E$39<>\"Non endémique\",COUNTRY_INFO!W17,\"Non requis\")","v":0},{"$f":"IF(COUNTRY_INFO!H17=1, IF($E17=1,$D17, 0),0)","v":0},{"$f":"IF(COUNTRY_INFO!I17=1, IF(AND(COUNTRY_INFO!$I17=1,$F17<>0),IF(COUNTRY_INFO!M17>=(COUNTRY_INFO!F17+COUNTRY_INFO!G17),COUNTRY_INFO!F17+COUNTRY_INFO!G17,COUNTRY_INFO!$M17), 0),0)","v":0},0,0,0,0,null,0]
[{"$f":"IF(INTRO!$E$39=\"Non endémique\",\" \",IF(COUNTRY_INFO!A18=0,\" \",COUNTRY_INFO!A18))","v":"SENEGAL"},{"$f":"IF(INTRO!$E$39=\"Non endémique\",\" \",IF(COUNTRY_INFO!B18=0,\" \",COUNTRY_INFO!B18))","v":"Dakar"},{"$f":"IF(INTRO!$E$39=\"Non endémique\",\" \",IF(COUNTRY_INFO!C18=0,\" \",COUNTRY_INFO!C18))","v":"Mbao"},{"$f":"IF(INTRO!$E$39=\"Non endémique\",0,IF(INTRO!$E$39=\"Endémique mais pas de CP\",IF(COUNTRY_INFO!$H18=1,COUNTRY_INFO!F18+COUNTRY_INFO!G18,0),IF(COUNTRY_INFO!$H18=1,COUNTRY_INFO!F18+COUNTRY_INFO!G18,IF(COUNTRY_INFO!$I18=1,IF(COUNTRY_INFO!M18>=(COUNTRY_INFO!F18+COUNTRY_INFO!G18),COUNTRY_INFO!F18+COUNTRY_INFO!G18,COUNTRY_INFO!$M18),0))))","v":0},{"$f":"IF(AND(INTRO!$E$39=\"Non endémique\",INTRO!$E$37=\"Non endémique\"),\"Non requis\",IF(INTRO!$E$39=\"Non endémique\",\"Traiter avec DEC\",COUNTRY_INFO!V18))","v":0},{"$f":"IF(INTRO!$E$39<>\"Non endémique\",COUNTRY_INFO!W18,\"Non requis\")","v":0},{"$f":"IF(COUNTRY_INFO!H18=1, IF($E18=1,$D18, 0),0)","v":0},{"$f":"IF(COUNTRY_INFO!I18=1, IF(AND(COUNTRY_INFO!$I18=1,$F18<>0),IF(COUNTRY_INFO!M18>=(COUNTRY_INFO!F18+COUNTRY_INFO!G18),COUNTRY_INFO!F18+COUNTRY_INFO!G18,COUNTRY_INFO!$M18), 0),0)","v":0},0,0,0,0,null,0]
[{"$f":"IF(INTRO!$E$39=\"Non endémique\",\" \",IF(COUNTRY_INFO!A19=0,\" \",COUNTRY_INFO!A19))","v":"SENEGAL"},{"$f":"IF(INTRO!$E$39=\"Non endémique\",\" \",IF(COUNTRY_INFO!B19=0,\" \",COUNTRY_INFO!B19))","v":"Dakar"},{"$f":"IF(INTRO!$E$39=\"Non endémique\",\" \",IF(COUNTRY_INFO!C19=0,\" \",COUNTRY_INFO!C19))","v":"Diamniadio"},{"$f":"IF(INTRO!$E$39=\"Non endémique\",0,IF(INTRO!$E$39=\"Endémique mais pas de CP\",IF(COUNTRY_INFO!$H19=1,COUNTRY_INFO!F19+COUNTRY_INFO!G19,0),IF(COUNTRY_INFO!$H19=1,COUNTRY_INFO!F19+COUNTRY_INFO!G19,IF(COUNTRY_INFO!$I19=1,IF(COUNTRY_INFO!M19>=(COUNTRY_INFO!F19+COUNTRY_INFO!G19),COUNTRY_INFO!F19+COUNTRY_INFO!G19,COUNTRY_INFO!$M19),0))))","v":0},{"$f":"IF(AND(INTRO!$E$39=\"Non endémique\",INTRO!$E$37=\"Non endémique\"),\"Non requis\",IF(INTRO!$E$39=\"Non endémique\",\"Traiter avec DEC\",COUNTRY_INFO!V19))","v":0},{"$f":"IF(INTRO!$E$39<>\"Non endémique\",COUNTRY_INFO!W19,\"Non requis\")","v":0},{"$f":"IF(COUNTRY_INFO!H19=1, IF($E19=1,$D19, 0),0)","v":0},{"$f":"IF(COUNTRY_INFO!I19=1, IF(AND(COUNTRY_INFO!$I19=1,$F19<>0),IF(COUNTRY_INFO!M19>=(COUNTRY_INFO!F19+COUNTRY_INFO!G19),COUNTRY_INFO!F19+COUNTRY_INFO!G19,COUNTRY_INFO!$M19), 0),0)","v":0},0,0,0,0,null,0]
[{"$f":"IF(INTRO!$E$39=\"Non endémique\",\" \",IF(COUNTRY_INFO!A20=0,\" \",COUNTRY_INFO!A20))","v":"SENEGAL"},{"$f":"IF(INTRO!$E$39=\"Non endémique\",\" \",IF(COUNTRY_INFO!B20=0,\" \",COUNTRY_INFO!B20))","v":"Dakar"},{"$f":"IF(INTRO!$E$39=\"Non endémique\",\" \",IF(COUNTRY_INFO!C20=0,\" \",COUNTRY_INFO!C20))","v":"Sangalkam"},{"$f":"IF(INTRO!$E$39=\"Non endémique\",0,IF(INTRO!$E$39=\"Endémique mais pas de CP\",IF(COUNTRY_INFO!$H20=1,COUNTRY_INFO!F20+COUNTRY_INFO!G20,0),IF(COUNTRY_INFO!$H20=1,COUNTRY_INFO!F20+COUNTRY_INFO!G20,IF(COUNTRY_INFO!$I20=1,IF(COUNTRY_INFO!M20>=(COUNTRY_INFO!F20+COUNTRY_INFO!G20),COUNTRY_INFO!F20+COUNTRY_INFO!G20,COUNTRY_INFO!$M20),0))))","v":0},{"$f":"IF(AND(INTRO!$E$39=\"Non endémique\",INTRO!$E$37=\"Non endémique\"),\"Non requis\",IF(INTRO!$E$39=\"Non endémique\",\"Traiter avec DEC\",COUNTRY_INFO!V20))","v":0},{"$f":"IF(INTRO!$E$39<>\"Non endémique\",COUNTRY_INFO!W20,\"Non requis\")","v":0},{"$f":"IF(COUNTRY_INFO!H20=1, IF($E20=1,$D20, 0),0)","v":0},{"$f":"IF(COUNTRY_INFO!I20=1, IF(AND(COUNTRY_INFO!$I20=1,$F20<>0),IF(COUNTRY_INFO!M20>=(COUNTRY_INFO!F20+COUNTRY_INFO!G20),COUNTRY_INFO!F20+COUNTRY_INFO!G20,COUNTRY_INFO!$M20), 0),0)","v":0},0,0,0,0,null,0]
[{"$f":"IF(INTRO!$E$39=\"Non endémique\",\" \",IF(COUNTRY_INFO!A21=0,\" \",COUNTRY_INFO!A21))","v":"SENEGAL"},{"$f":"IF(INTRO!$E$39=\"Non endémique\",\" \",IF(COUNTRY_INFO!B21=0,\" \",COUNTRY_INFO!B21))","v":"Dakar"},{"$f":"IF(INTRO!$E$39=\"Non endémique\",\" \",IF(COUNTRY_INFO!C21=0,\" \",COUNTRY_INFO!C21))","v":"Rufisque"},{"$f":"IF(INTRO!$E$39=\"Non endémique\",0,IF(INTRO!$E$39=\"Endémique mais pas de CP\",IF(COUNTRY_INFO!$H21=1,COUNTRY_INFO!F21+COUNTRY_INFO!G21,0),IF(COUNTRY_INFO!$H21=1,COUNTRY_INFO!F21+COUNTRY_INFO!G21,IF(COUNTRY_INFO!$I21=1,IF(COUNTRY_INFO!M21>=(COUNTRY_INFO!F21+COUNTRY_INFO!G21),COUNTRY_INFO!F21+COUNTRY_INFO!G21,COUNTRY_INFO!$M21),0))))","v":0},{"$f":"IF(AND(INTRO!$E$39=\"Non endémique\",INTRO!$E$37=\"Non endémique\"),\"Non requis\",IF(INTRO!$E$39=\"Non endémique\",\"Traiter avec DEC\",COUNTRY_INFO!V21))","v":0},{"$f":"IF(INTRO!$E$39<>\"Non endémique\",COUNTRY_INFO!W21,\"Non requis\")","v":0},{"$f":"IF(COUNTRY_INFO!H21=1, IF($E21=1,$D21, 0),0)","v":0},{"$f":"IF(COUNTRY_INFO!I21=1, IF(AND(COUNTRY_INFO!$I21=1,$F21<>0),IF(COUNTRY_INFO!M21>=(COUNTRY_INFO!F21+COUNTRY_INFO!G21),COUNTRY_INFO!F21+COUNTRY_INFO!G21,COUNTRY_INFO!$M21), 0),0)","v":0},0,0,0,0,null,0]
[{"$f":"IF(INTRO!$E$39=\"Non endémique\",\" \",IF(COUNTRY_INFO!A22=0,\" \",COUNTRY_INFO!A22))","v":"SENEGAL"},{"$f":"IF(INTRO!$E$39=\"Non endémique\",\" \",IF(COUNTRY_INFO!B22=0,\" \",COUNTRY_INFO!B22))","v":"Diourbel"},{"$f":"IF(INTRO!$E$39=\"Non endémique\",\" \",IF(COUNTRY_INFO!C22=0,\" \",COUNTRY_INFO!C22))","v":"Bambéye"},{"$f":"IF(INTRO!$E$39=\"Non endémique\",0,IF(INTRO!$E$39=\"Endémique mais pas de CP\",IF(COUNTRY_INFO!$H22=1,COUNTRY_INFO!F22+COUNTRY_INFO!G22,0),IF(COUNTRY_INFO!$H22=1,COUNTRY_INFO!F22+COUNTRY_INFO!G22,IF(COUNTRY_INFO!$I22=1,IF(COUNTRY_INFO!M22>=(COUNTRY_INFO!F22+COUNTRY_INFO!G22),COUNTRY_INFO!F22+COUNTRY_INFO!G22,COUNTRY_INFO!$M22),0))))","v":0},{"$f":"IF(AND(INTRO!$E$39=\"Non endémique\",INTRO!$E$37=\"Non endémique\"),\"Non requis\",IF(INTRO!$E$39=\"Non endémique\",\"Traiter avec DEC\",COUNTRY_INFO!V22))","v":0},{"$f":"IF(INTRO!$E$39<>\"Non endémique\",COUNTRY_INFO!W22,\"Non requis\")","v":0},{"$f":"IF(COUNTRY_INFO!H22=1, IF($E22=1,$D22, 0),0)","v":0},{"$f":"IF(COUNTRY_INFO!I22=1, IF(AND(COUNTRY_INFO!$I22=1,$F22<>0),IF(COUNTRY_INFO!M22>=(COUNTRY_INFO!F22+COUNTRY_INFO!G22),COUNTRY_INFO!F22+COUNTRY_INFO!G22,COUNTRY_INFO!$M22), 0),0)","v":0},0,0,0,0,null,0]
[{"$f":"IF(INTRO!$E$39=\"Non endémique\",\" \",IF(COUNTRY_INFO!A23=0,\" \",COUNTRY_INFO!A23))","v":"SENEGAL"},{"$f":"IF(INTRO!$E$39=\"Non endémique\",\" \",IF(COUNTRY_INFO!B23=0,\" \",COUNTRY_INFO!B23))","v":"Diourbel"},{"$f":"IF(INTRO!$E$39=\"Non endémique\",\" \",IF(COUNTRY_INFO!C23=0,\" \",COUNTRY_INFO!C23))","v":"Diourbel"},{"$f":"IF(INTRO!$E$39=\"Non endémique\",0,IF(INTRO!$E$39=\"Endémique mais pas de CP\",IF(COUNTRY_INFO!$H23=1,COUNTRY_INFO!F23+COUNTRY_INFO!G23,0),IF(COUNTRY_INFO!$H23=1,COUNTRY_INFO!F23+COUNTRY_INFO!G23,IF(COUNTRY_INFO!$I23=1,IF(COUNTRY_INFO!M23>=(COUNTRY_INFO!F23+COUNTRY_INFO!G23),COUNTRY_INFO!F23+COUNTRY_INFO!G23,COUNTRY_INFO!$M23),0))))","v":0},{"$f":"IF(AND(INTRO!$E$39=\"Non endémique\",INTRO!$E$37=\"Non endémique\"),\"Non requis\",IF(INTRO!$E$39=\"Non endémique\",\"Traiter avec DEC\",COUNTRY_INFO!V23))","v":0},{"$f":"IF(INTRO!$E$39<>\"Non endémique\",COUNTRY_INFO!W23,\"Non requis\")","v":0},{"$f":"IF(COUNTRY_INFO!H23=1, IF($E23=1,$D23, 0),0)","v":0},{"$f":"IF(COUNTRY_INFO!I23=1, IF(AND(COUNTRY_INFO!$I23=1,$F23<>0),IF(COUNTRY_INFO!M23>=(COUNTRY_INFO!F23+COUNTRY_INFO!G23),COUNTRY_INFO!F23+COUNTRY_INFO!G23,COUNTRY_INFO!$M23), 0),0)","v":0},0,0,0,0,null,0]
[{"$f":"IF(INTRO!$E$39=\"Non endémique\",\" \",IF(COUNTRY_INFO!A24=0,\" \",COUNTRY_INFO!A24))","v":"SENEGAL"},{"$f":"IF(INTRO!$E$39=\"Non endémique\",\" \",IF(COUNTRY_INFO!B24=0,\" \",COUNTRY_INFO!B24))","v":"Diourbel"},{"$f":"IF(INTRO!$E$39=\"Non endémique\",\" \",IF(COUNTRY_INFO!C24=0,\" \",COUNTRY_INFO!C24))","v":"Mbacké"},{"$f":"IF(INTRO!$E$39=\"Non endémique\",0,IF(INTRO!$E$39=\"Endémique mais pas de CP\",IF(COUNTRY_INFO!$H24=1,COUNTRY_INFO!F24+COUNTRY_INFO!G24,0),IF(COUNTRY_INFO!$H24=1,COUNTRY_INFO!F24+COUNTRY_INFO!G24,IF(COUNTRY_INFO!$I24=1,IF(COUNTRY_INFO!M24>=(COUNTRY_INFO!F24+COUNTRY_INFO!G24),COUNTRY_INFO!F24+COUNTRY_INFO!G24,COUNTRY_INFO!$M24),0))))","v":0},{"$f":"IF(AND(INTRO!$E$39=\"Non endémique\",INTRO!$E$37=\"Non endémique\"),\"Non requis\",IF(INTRO!$E$39=\"Non endémique\",\"Traiter avec DEC\",COUNTRY_INFO!V24))","v":0},{"$f":"IF(INTRO!$E$39<>\"Non endémique\",COUNTRY_INFO!W24,\"Non requis\")","v":0},{"$f":"IF(COUNTRY_INFO!H24=1, IF($E24=1,$D24, 0),0)","v":0},{"$f":"IF(COUNTRY_INFO!I24=1, IF(AND(COUNTRY_INFO!$I24=1,$F24<>0),IF(COUNTRY_INFO!M24>=(COUNTRY_INFO!F24+COUNTRY_INFO!G24),COUNTRY_INFO!F24+COUNTRY_INFO!G24,COUNTRY_INFO!$M24), 0),0)","v":0},0,0,0,0,null,0]
[{"$f":"IF(INTRO!$E$39=\"Non endémique\",\" \",IF(COUNTRY_INFO!A25=0,\" \",COUNTRY_INFO!A25))","v":"SENEGAL"},{"$f":"IF(INTRO!$E$39=\"Non endémique\",\" \",IF(COUNTRY_INFO!B25=0,\" \",COUNTRY_INFO!B25))","v":"Diourbel"},{"$f":"IF(INTRO!$E$39=\"Non endémique\",\" \",IF(COUNTRY_INFO!C25=0,\" \",COUNTRY_INFO!C25))","v":"Touba"},{"$f":"IF(INTRO!$E$39=\"Non endémique\",0,IF(INTRO!$E$39=\"Endémique mais pas de CP\",IF(COUNTRY_INFO!$H25=1,COUNTRY_INFO!F25+COUNTRY_INFO!G25,0),IF(COUNTRY_INFO!$H25=1,COUNTRY_INFO!F25+COUNTRY_INFO!G25,IF(COUNTRY_INFO!$I25=1,IF(COUNTRY_INFO!M25>=(COUNTRY_INFO!F25+COUNTRY_INFO!G25),COUNTRY_INFO!F25+COUNTRY_INFO!G25,COUNTRY_INFO!$M25),0))))","v":0},{"$f":"IF(AND(INTRO!$E$39=\"Non endémique\",INTRO!$E$37=\"Non endémique\"),\"Non requis\",IF(INTRO!$E$39=\"Non endémique\",\"Traiter avec DEC\",COUNTRY_INFO!V25))","v":0},{"$f":"IF(INTRO!$E$39<>\"Non endémique\",COUNTRY_INFO!W25,\"Non requis\")","v":0},{"$f":"IF(COUNTRY_INFO!H25=1, IF($E25=1,$D25, 0),0)","v":0},{"$f":"IF(COUNTRY_INFO!I25=1, IF(AND(COUNTRY_INFO!$I25=1,$F25<>0),IF(COUNTRY_INFO!M25>=(COUNTRY_INFO!F25+COUNTRY_INFO!G25),COUNTRY_INFO!F25+COUNTRY_INFO!G25,COUNTRY_INFO!$M25), 0),0)","v":0},0,0,0,0,null,0]
[{"$f":"IF(INTRO!$E$39=\"Non endémique\",\" \",IF(COUNTRY_INFO!A26=0,\" \",COUNTRY_INFO!A26))","v":"SENEGAL"},{"$f":"IF(INTRO!$E$39=\"Non endémique\",\" \",IF(COUNTRY_INFO!B26=0,\" \",COUNTRY_INFO!B26))","v":"Fatick"},{"$f":"IF(INTRO!$E$39=\"Non endémique\",\" \",IF(COUNTRY_INFO!C26=0,\" \",COUNTRY_INFO!C26))","v":"Niakhar"},{"$f":"IF(INTRO!$E$39=\"Non endémique\",0,IF(INTRO!$E$39=\"Endémique mais pas de CP\",IF(COUNTRY_INFO!$H26=1,COUNTRY_INFO!F26+COUNTRY_INFO!G26,0),IF(COUNTRY_INFO!$H26=1,COUNTRY_INFO!F26+COUNTRY_INFO!G26,IF(COUNTRY_INFO!$I26=1,IF(COUNTRY_INFO!M26>=(COUNTRY_INFO!F26+COUNTRY_INFO!G26),COUNTRY_INFO!F26+COUNTRY_INFO!G26,COUNTRY_INFO!$M26),0))))","v":0},{"$f":"IF(AND(INTRO!$E$39=\"Non endémique\",INTRO!$E$37=\"Non endémique\"),\"Non requis\",IF(INTRO!$E$39=\"Non endémique\",\"Traiter avec DEC\",COUNTRY_INFO!V26))","v":0},{"$f":"IF(INTRO!$E$39<>\"Non endémique\",COUNTRY_INFO!W26,\"Non requis\")","v":0},{"$f":"IF(COUNTRY_INFO!H26=1, IF($E26=1,$D26, 0),0)","v":0},{"$f":"IF(COUNTRY_INFO!I26=1, IF(AND(COUNTRY_INFO!$I26=1,$F26<>0),IF(COUNTRY_INFO!M26>=(COUNTRY_INFO!F26+COUNTRY_INFO!G26),COUNTRY_INFO!F26+COUNTRY_INFO!G26,COUNTRY_INFO!$M26), 0),0)","v":0},0,0,0,0,null,0]
[{"$f":"IF(INTRO!$E$39=\"Non endémique\",\" \",IF(COUNTRY_INFO!A27=0,\" \",COUNTRY_INFO!A27))","v":"SENEGAL"},{"$f":"IF(INTRO!$E$39=\"Non endémique\",\" \",IF(COUNTRY_INFO!B27=0,\" \",COUNTRY_INFO!B27))","v":"Fatick"},{"$f":"IF(INTRO!$E$39=\"Non endémique\",\" \",IF(COUNTRY_INFO!C27=0,\" \",COUNTRY_INFO!C27))","v":"Diakhao"},{"$f":"IF(INTRO!$E$39=\"Non endémique\",0,IF(INTRO!$E$39=\"Endémique mais pas de CP\",IF(COUNTRY_INFO!$H27=1,COUNTRY_INFO!F27+COUNTRY_INFO!G27,0),IF(COUNTRY_INFO!$H27=1,COUNTRY_INFO!F27+COUNTRY_INFO!G27,IF(COUNTRY_INFO!$I27=1,IF(COUNTRY_INFO!M27>=(COUNTRY_INFO!F27+COUNTRY_INFO!G27),COUNTRY_INFO!F27+COUNTRY_INFO!G27,COUNTRY_INFO!$M27),0))))","v":0},{"$f":"IF(AND(INTRO!$E$39=\"Non endémique\",INTRO!$E$37=\"Non endémique\"),\"Non requis\",IF(INTRO!$E$39=\"Non endémique\",\"Traiter avec DEC\",COUNTRY_INFO!V27))","v":0},{"$f":"IF(INTRO!$E$39<>\"Non endémique\",COUNTRY_INFO!W27,\"Non requis\")","v":0},{"$f":"IF(COUNTRY_INFO!H27=1, IF($E27=1,$D27, 0),0)","v":0},{"$f":"IF(COUNTRY_INFO!I27=1, IF(AND(COUNTRY_INFO!$I27=1,$F27<>0),IF(COUNTRY_INFO!M27>=(COUNTRY_INFO!F27+COUNTRY_INFO!G27),COUNTRY_INFO!F27+COUNTRY_INFO!G27,COUNTRY_INFO!$M27), 0),0)","v":0},0,0,0,0,null,0]
[{"$f":"IF(INTRO!$E$39=\"Non endémique\",\" \",IF(COUNTRY_INFO!A28=0,\" \",COUNTRY_INFO!A28))","v":"SENEGAL"},{"$f":"IF(INTRO!$E$39=\"Non endémique\",\" \",IF(COUNTRY_INFO!B28=0,\" \",COUNTRY_INFO!B28))","v":"Fatick"},{"$f":"IF(INTRO!$E$39=\"Non endémique\",\" \",IF(COUNTRY_INFO!C28=0,\" \",COUNTRY_INFO!C28))","v":"Fatick"},{"$f":"IF(INTRO!$E$39=\"Non endémique\",0,IF(INTRO!$E$39=\"Endémique mais pas de CP\",IF(COUNTRY_INFO!$H28=1,COUNTRY_INFO!F28+COUNTRY_INFO!G28,0),IF(COUNTRY_INFO!$H28=1,COUNTRY_INFO!F28+COUNTRY_INFO!G28,IF(COUNTRY_INFO!$I28=1,IF(COUNTRY_INFO!M28>=(COUNTRY_INFO!F28+COUNTRY_INFO!G28),COUNTRY_INFO!F28+COUNTRY_INFO!G28,COUNTRY_INFO!$M28),0))))","v":0},{"$f":"IF(AND(INTRO!$E$39=\"Non endémique\",INTRO!$E$37=\"Non endémique\"),\"Non requis\",IF(INTRO!$E$39=\"Non endémique\",\"Traiter avec DEC\",COUNTRY_INFO!V28))","v":0},{"$f":"IF(INTRO!$E$39<>\"Non endémique\",COUNTRY_INFO!W28,\"Non requis\")","v":0},{"$f":"IF(COUNTRY_INFO!H28=1, IF($E28=1,$D28, 0),0)","v":0},{"$f":"IF(COUNTRY_INFO!I28=1, IF(AND(COUNTRY_INFO!$I28=1,$F28<>0),IF(COUNTRY_INFO!M28>=(COUNTRY_INFO!F28+COUNTRY_INFO!G28),COUNTRY_INFO!F28+COUNTRY_INFO!G28,COUNTRY_INFO!$M28), 0),0)","v":0},0,0,0,0,null,0]
[{"$f":"IF(INTRO!$E$39=\"Non endémique\",\" \",IF(COUNTRY_INFO!A29=0,\" \",COUNTRY_INFO!A29))","v":"SENEGAL"},{"$f":"IF(INTRO!$E$39=\"Non endémique\",\" \",IF(COUNTRY_INFO!B29=0,\" \",COUNTRY_INFO!B29))","v":"Fatick"},{"$f":"IF(INTRO!$E$39=\"Non endémique\",\" \",IF(COUNTRY_INFO!C29=0,\" \",COUNTRY_INFO!C29))","v":"Dioffior"},{"$f":"IF(INTRO!$E$39=\"Non endémique\",0,IF(INTRO!$E$39=\"Endémique mais pas de CP\",IF(COUNTRY_INFO!$H29=1,COUNTRY_INFO!F29+COUNTRY_INFO!G29,0),IF(COUNTRY_INFO!$H29=1,COUNTRY_INFO!F29+COUNTRY_INFO!G29,IF(COUNTRY_INFO!$I29=1,IF(COUNTRY_INFO!M29>=(COUNTRY_INFO!F29+COUNTRY_INFO!G29),COUNTRY_INFO!F29+COUNTRY_INFO!G29,COUNTRY_INFO!$M29),0))))","v":0},{"$f":"IF(AND(INTRO!$E$39=\"Non endémique\",INTRO!$E$37=\"Non endémique\"),\"Non requis\",IF(INTRO!$E$39=\"Non endémique\",\"Traiter avec DEC\",COUNTRY_INFO!V29))","v":0},{"$f":"IF(INTRO!$E$39<>\"Non endémique\",COUNTRY_INFO!W29,\"Non requis\")","v":0},{"$f":"IF(COUNTRY_INFO!H29=1, IF($E29=1,$D29, 0),0)","v":0},{"$f":"IF(COUNTRY_INFO!I29=1, IF(AND(COUNTRY_INFO!$I29=1,$F29<>0),IF(COUNTRY_INFO!M29>=(COUNTRY_INFO!F29+COUNTRY_INFO!G29),COUNTRY_INFO!F29+COUNTRY_INFO!G29,COUNTRY_INFO!$M29), 0),0)","v":0},0,0,0,0,null,0]
[{"$f":"IF(INTRO!$E$39=\"Non endémique\",\" \",IF(COUNTRY_INFO!A30=0,\" \",COUNTRY_INFO!A30))","v":"SENEGAL"},{"$f":"IF(INTRO!$E$39=\"Non endémique\",\" \",IF(COUNTRY_INFO!B30=0,\" \",COUNTRY_INFO!B30))","v":"Fatick"},{"$f":"IF(INTRO!$E$39=\"Non endémique\",\" \",IF(COUNTRY_INFO!C30=0,\" \",COUNTRY_INFO!C30))","v":"Passy"},{"$f":"IF(INTRO!$E$39=\"Non endémique\",0,IF(INTRO!$E$39=\"Endémique mais pas de CP\",IF(COUNTRY_INFO!$H30=1,COUNTRY_INFO!F30+COUNTRY_INFO!G30,0),IF(COUNTRY_INFO!$H30=1,COUNTRY_INFO!F30+COUNTRY_INFO!G30,IF(COUNTRY_INFO!$I30=1,IF(COUNTRY_INFO!M30>=(COUNTRY_INFO!F30+COUNTRY_INFO!G30),COUNTRY_INFO!F30+COUNTRY_INFO!G30,COUNTRY_INFO!$M30),0))))","v":0},{"$f":"IF(AND(INTRO!$E$39=\"Non endémique\",INTRO!$E$37=\"Non endémique\"),\"Non requis\",IF(INTRO!$E$39=\"Non endémique\",\"Traiter avec DEC\",COUNTRY_INFO!V30))","v":0},{"$f":"IF(INTRO!$E$39<>\"Non endémique\",COUNTRY_INFO!W30,\"Non requis\")","v":0},{"$f":"IF(COUNTRY_INFO!H30=1, IF($E30=1,$D30, 0),0)","v":0},{"$f":"IF(COUNTRY_INFO!I30=1, IF(AND(COUNTRY_INFO!$I30=1,$F30<>0),IF(COUNTRY_INFO!M30>=(COUNTRY_INFO!F30+COUNTRY_INFO!G30),COUNTRY_INFO!F30+COUNTRY_INFO!G30,COUNTRY_INFO!$M30), 0),0)","v":0},0,0,0,0,null,0]
[{"$f":"IF(INTRO!$E$39=\"Non endémique\",\" \",IF(COUNTRY_INFO!A31=0,\" \",COUNTRY_INFO!A31))","v":"SENEGAL"},{"$f":"IF(INTRO!$E$39=\"Non endémique\",\" \",IF(COUNTRY_INFO!B31=0,\" \",COUNTRY_INFO!B31))","v":"Fatick"},{"$f":"IF(INTRO!$E$39=\"Non endémique\",\" \",IF(COUNTRY_INFO!C31=0,\" \",COUNTRY_INFO!C31))","v":"Foundiougne"},{"$f":"IF(INTRO!$E$39=\"Non endémique\",0,IF(INTRO!$E$39=\"Endémique mais pas de CP\",IF(COUNTRY_INFO!$H31=1,COUNTRY_INFO!F31+COUNTRY_INFO!G31,0),IF(COUNTRY_INFO!$H31=1,COUNTRY_INFO!F31+COUNTRY_INFO!G31,IF(COUNTRY_INFO!$I31=1,IF(COUNTRY_INFO!M31>=(COUNTRY_INFO!F31+COUNTRY_INFO!G31),COUNTRY_INFO!F31+COUNTRY_INFO!G31,COUNTRY_INFO!$M31),0))))","v":0},{"$f":"IF(AND(INTRO!$E$39=\"Non endémique\",INTRO!$E$37=\"Non endémique\"),\"Non requis\",IF(INTRO!$E$39=\"Non endémique\",\"Traiter avec DEC\",COUNTRY_INFO!V31))","v":0},{"$f":"IF(INTRO!$E$39<>\"Non endémique\",COUNTRY_INFO!W31,\"Non requis\")","v":0},{"$f":"IF(COUNTRY_INFO!H31=1, IF($E31=1,$D31, 0),0)","v":0},{"$f":"IF(COUNTRY_INFO!I31=1, IF(AND(COUNTRY_INFO!$I31=1,$F31<>0),IF(COUNTRY_INFO!M31>=(COUNTRY_INFO!F31+COUNTRY_INFO!G31),COUNTRY_INFO!F31+COUNTRY_INFO!G31,COUNTRY_INFO!$M31), 0),0)","v":0},0,0,0,0,null,0]
[{"$f":"IF(INTRO!$E$39=\"Non endémique\",\" \",IF(COUNTRY_INFO!A32=0,\" \",COUNTRY_INFO!A32))","v":"SENEGAL"},{"$f":"IF(INTRO!$E$39=\"Non endémique\",\" \",IF(COUNTRY_INFO!B32=0,\" \",COUNTRY_INFO!B32))","v":"Fatick"},{"$f":"IF(INTRO!$E$39=\"Non endémique\",\" \",IF(COUNTRY_INFO!C32=0,\" \",COUNTRY_INFO!C32))","v":"Sokone"},{"$f":"IF(INTRO!$E$39=\"Non endémique\",0,IF(INTRO!$E$39=\"Endémique mais pas de CP\",IF(COUNTRY_INFO!$H32=1,COUNTRY_INFO!F32+COUNTRY_INFO!G32,0),IF(COUNTRY_INFO!$H32=1,COUNTRY_INFO!F32+COUNTRY_INFO!G32,IF(COUNTRY_INFO!$I32=1,IF(COUNTRY_INFO!M32>=(COUNTRY_INFO!F32+COUNTRY_INFO!G32),COUNTRY_INFO!F32+COUNTRY_INFO!G32,COUNTRY_INFO!$M32),0))))","v":0},{"$f":"IF(AND(INTRO!$E$39=\"Non endémique\",INTRO!$E$37=\"Non endémique\"),\"Non requis\",IF(INTRO!$E$39=\"Non endémique\",\"Traiter avec DEC\",COUNTRY_INFO!V32))","v":0},{"$f":"IF(INTRO!$E$39<>\"Non endémique\",COUNTRY_INFO!W32,\"Non requis\")","v":0},{"$f":"IF(COUNTRY_INFO!H32=1, IF($E32=1,$D32, 0),0)","v":0},{"$f":"IF(COUNTRY_INFO!I32=1, IF(AND(COUNTRY_INFO!$I32=1,$F32<>0),IF(COUNTRY_INFO!M32>=(COUNTRY_INFO!F32+COUNTRY_INFO!G32),COUNTRY_INFO!F32+COUNTRY_INFO!G32,COUNTRY_INFO!$M32), 0),0)","v":0},0,0,0,0,null,0]
[{"$f":"IF(INTRO!$E$39=\"Non endémique\",\" \",IF(COUNTRY_INFO!A33=0,\" \",COUNTRY_INFO!A33))","v":"SENEGAL"},{"$f":"IF(INTRO!$E$39=\"Non endémique\",\" \",IF(COUNTRY_INFO!B33=0,\" \",COUNTRY_INFO!B33))","v":"Fatick"},{"$f":"IF(INTRO!$E$39=\"Non endémique\",\" \",IF(COUNTRY_INFO!C33=0,\" \",COUNTRY_INFO!C33))","v":"Gossas"},{"$f":"IF(INTRO!$E$39=\"Non endémique\",0,IF(INTRO!$E$39=\"Endémique mais pas de CP\",IF(COUNTRY_INFO!$H33=1,COUNTRY_INFO!F33+COUNTRY_INFO!G33,0),IF(COUNTRY_INFO!$H33=1,COUNTRY_INFO!F33+COUNTRY_INFO!G33,IF(COUNTRY_INFO!$I33=1,IF(COUNTRY_INFO!M33>=(COUNTRY_INFO!F33+COUNTRY_INFO!G33),COUNTRY_INFO!F33+COUNTRY_INFO!G33,COUNTRY_INFO!$M33),0))))","v":0},{"$f":"IF(AND(INTRO!$E$39=\"Non endémique\",INTRO!$E$37=\"Non endémique\"),\"Non requis\",IF(INTRO!$E$39=\"Non endémique\",\"Traiter avec DEC\",COUNTRY_INFO!V33))","v":0},{"$f":"IF(INTRO!$E$39<>\"Non endémique\",COUNTRY_INFO!W33,\"Non requis\")","v":0},{"$f":"IF(COUNTRY_INFO!H33=1, IF($E33=1,$D33, 0),0)","v":0},{"$f":"IF(COUNTRY_INFO!I33=1, IF(AND(COUNTRY_INFO!$I33=1,$F33<>0),IF(COUNTRY_INFO!M33>=(COUNTRY_INFO!F33+COUNTRY_INFO!G33),COUNTRY_INFO!F33+COUNTRY_INFO!G33,COUNTRY_INFO!$M33), 0),0)","v":0},0,0,0,0,null,0]
[{"$f":"IF(INTRO!$E$39=\"Non endémique\",\" \",IF(COUNTRY_INFO!A34=0,\" \",COUNTRY_INFO!A34))","v":"SENEGAL"},{"$f":"IF(INTRO!$E$39=\"Non endémique\",\" \",IF(COUNTRY_INFO!B34=0,\" \",COUNTRY_INFO!B34))","v":"Kaffrine"},{"$f":"IF(INTRO!$E$39=\"Non endémique\",\" \",IF(COUNTRY_INFO!C34=0,\" \",COUNTRY_INFO!C34))","v":"Birkelane"},{"$f":"IF(INTRO!$E$39=\"Non endémique\",0,IF(INTRO!$E$39=\"Endémique mais pas de CP\",IF(COUNTRY_INFO!$H34=1,COUNTRY_INFO!F34+COUNTRY_INFO!G34,0),IF(COUNTRY_INFO!$H34=1,COUNTRY_INFO!F34+COUNTRY_INFO!G34,IF(COUNTRY_INFO!$I34=1,IF(COUNTRY_INFO!M34>=(COUNTRY_INFO!F34+COUNTRY_INFO!G34),COUNTRY_INFO!F34+COUNTRY_INFO!G34,COUNTRY_INFO!$M34),0))))","v":0},{"$f":"IF(AND(INTRO!$E$39=\"Non endémique\",INTRO!$E$37=\"Non endémique\"),\"Non requis\",IF(INTRO!$E$39=\"Non endémique\",\"Traiter avec DEC\",COUNTRY_INFO!V34))","v":0},{"$f":"IF(INTRO!$E$39<>\"Non endémique\",COUNTRY_INFO!W34,\"Non requis\")","v":0},{"$f":"IF(COUNTRY_INFO!H34=1, IF($E34=1,$D34, 0),0)","v":0},{"$f":"IF(COUNTRY_INFO!I34=1, IF(AND(COUNTRY_INFO!$I34=1,$F34<>0),IF(COUNTRY_INFO!M34>=(COUNTRY_INFO!F34+COUNTRY_INFO!G34),COUNTRY_INFO!F34+COUNTRY_INFO!G34,COUNTRY_INFO!$M34), 0),0)","v":0},0,0,0,0,null,0]
[{"$f":"IF(INTRO!$E$39=\"Non endémique\",\" \",IF(COUNTRY_INFO!A35=0,\" \",COUNTRY_INFO!A35))","v":"SENEGAL"},{"$f":"IF(INTRO!$E$39=\"Non endémique\",\" \",IF(COUNTRY_INFO!B35=0,\" \",COUNTRY_INFO!B35))","v":"Kaffrine"},{"$f":"IF(INTRO!$E$39=\"Non endémique\",\" \",IF(COUNTRY_INFO!C35=0,\" \",COUNTRY_INFO!C35))","v":"Kaffrine"},{"$f":"IF(INTRO!$E$39=\"Non endémique\",0,IF(INTRO!$E$39=\"Endémique mais pas de CP\",IF(COUNTRY_INFO!$H35=1,COUNTRY_INFO!F35+COUNTRY_INFO!G35,0),IF(COUNTRY_INFO!$H35=1,COUNTRY_INFO!F35+COUNTRY_INFO!G35,IF(COUNTRY_INFO!$I35=1,IF(COUNTRY_INFO!M35>=(COUNTRY_INFO!F35+COUNTRY_INFO!G35),COUNTRY_INFO!F35+COUNTRY_INFO!G35,COUNTRY_INFO!$M35),0))))","v":0},{"$f":"IF(AND(INTRO!$E$39=\"Non endémique\",INTRO!$E$37=\"Non endémique\"),\"Non requis\",IF(INTRO!$E$39=\"Non endémique\",\"Traiter avec DEC\",COUNTRY_INFO!V35))","v":0},{"$f":"IF(INTRO!$E$39<>\"Non endémique\",COUNTRY_INFO!W35,\"Non requis\")","v":0},{"$f":"IF(COUNTRY_INFO!H35=1, IF($E35=1,$D35, 0),0)","v":0},{"$f":"IF(COUNTRY_INFO!I35=1, IF(AND(COUNTRY_INFO!$I35=1,$F35<>0),IF(COUNTRY_INFO!M35>=(COUNTRY_INFO!F35+COUNTRY_INFO!G35),COUNTRY_INFO!F35+COUNTRY_INFO!G35,COUNTRY_INFO!$M35), 0),0)","v":0},0,0,0,0,null,0]
[{"$f":"IF(INTRO!$E$39=\"Non endémique\",\" \",IF(COUNTRY_INFO!A36=0,\" \",COUNTRY_INFO!A36))","v":"SENEGAL"},{"$f":"IF(INTRO!$E$39=\"Non endémique\",\" \",IF(COUNTRY_INFO!B36=0,\" \",COUNTRY_INFO!B36))","v":"Kaffrine"},{"$f":"IF(INTRO!$E$39=\"Non endémique\",\" \",IF(COUNTRY_INFO!C36=0,\" \",COUNTRY_INFO!C36))","v":"Koungheul"},{"$f":"IF(INTRO!$E$39=\"Non endémique\",0,IF(INTRO!$E$39=\"Endémique mais pas de CP\",IF(COUNTRY_INFO!$H36=1,COUNTRY_INFO!F36+COUNTRY_INFO!G36,0),IF(COUNTRY_INFO!$H36=1,COUNTRY_INFO!F36+COUNTRY_INFO!G36,IF(COUNTRY_INFO!$I36=1,IF(COUNTRY_INFO!M36>=(COUNTRY_INFO!F36+COUNTRY_INFO!G36),COUNTRY_INFO!F36+COUNTRY_INFO!G36,COUNTRY_INFO!$M36),0))))","v":0},{"$f":"IF(AND(INTRO!$E$39=\"Non endémique\",INTRO!$E$37=\"Non endémique\"),\"Non requis\",IF(INTRO!$E$39=\"Non endémique\",\"Traiter avec DEC\",COUNTRY_INFO!V36))","v":0},{"$f":"IF(INTRO!$E$39<>\"Non endémique\",COUNTRY_INFO!W36,\"Non requis\")","v":0},{"$f":"IF(COUNTRY_INFO!H36=1, IF($E36=1,$D36, 0),0)","v":0},{"$f":"IF(COUNTRY_INFO!I36=1, IF(AND(COUNTRY_INFO!$I36=1,$F36<>0),IF(COUNTRY_INFO!M36>=(COUNTRY_INFO!F36+COUNTRY_INFO!G36),COUNTRY_INFO!F36+COUNTRY_INFO!G36,COUNTRY_INFO!$M36), 0),0)","v":0},0,0,0,0,null,0]
[{"$f":"IF(INTRO!$E$39=\"Non endémique\",\" \",IF(COUNTRY_INFO!A37=0,\" \",COUNTRY_INFO!A37))","v":"SENEGAL"},{"$f":"IF(INTRO!$E$39=\"Non endémique\",\" \",IF(COUNTRY_INFO!B37=0,\" \",COUNTRY_INFO!B37))","v":"Kaffrine"},{"$f":"IF(INTRO!$E$39=\"Non endémique\",\" \",IF(COUNTRY_INFO!C37=0,\" \",COUNTRY_INFO!C37))","v":"Malem Hodar"},{"$f":"IF(INTRO!$E$39=\"Non endémique\",0,IF(INTRO!$E$39=\"Endémique mais pas de CP\",IF(COUNTRY_INFO!$H37=1,COUNTRY_INFO!F37+COUNTRY_INFO!G37,0),IF(COUNTRY_INFO!$H37=1,COUNTRY_INFO!F37+COUNTRY_INFO!G37,IF(COUNTRY_INFO!$I37=1,IF(COUNTRY_INFO!M37>=(COUNTRY_INFO!F37+COUNTRY_INFO!G37),COUNTRY_INFO!F37+COUNTRY_INFO!G37,COUNTRY_INFO!$M37),0))))","v":0},{"$f":"IF(AND(INTRO!$E$39=\"Non endémique\",INTRO!$E$37=\"Non endémique\"),\"Non requis\",IF(INTRO!$E$39=\"Non endémique\",\"Traiter avec DEC\",COUNTRY_INFO!V37))","v":0},{"$f":"IF(INTRO!$E$39<>\"Non endémique\",COUNTRY_INFO!W37,\"Non requis\")","v":0},{"$f":"IF(COUNTRY_INFO!H37=1, IF($E37=1,$D37, 0),0)","v":0},{"$f":"IF(COUNTRY_INFO!I37=1, IF(AND(COUNTRY_INFO!$I37=1,$F37<>0),IF(COUNTRY_INFO!M37>=(COUNTRY_INFO!F37+COUNTRY_INFO!G37),COUNTRY_INFO!F37+COUNTRY_INFO!G37,COUNTRY_INFO!$M37), 0),0)","v":0},0,0,0,0,null,0]
[{"$f":"IF(INTRO!$E$39=\"Non endémique\",\" \",IF(COUNTRY_INFO!A38=0,\" \",COUNTRY_INFO!A38))","v":"SENEGAL"},{"$f":"IF(INTRO!$E$39=\"Non endémique\",\" \",IF(COUNTRY_INFO!B38=0,\" \",COUNTRY_INFO!B38))","v":"Kaolack"},{"$f":"IF(INTRO!$E$39=\"Non endémique\",\" \",IF(COUNTRY_INFO!C38=0,\" \",COUNTRY_INFO!C38))","v":"Guinguineo"},{"$f":"IF(INTRO!$E$39=\"Non endémique\",0,IF(INTRO!$E$39=\"Endémique mais pas de CP\",IF(COUNTRY_INFO!$H38=1,COUNTRY_INFO!F38+COUNTRY_INFO!G38,0),IF(COUNTRY_INFO!$H38=1,COUNTRY_INFO!F38+COUNTRY_INFO!G38,IF(COUNTRY_INFO!$I38=1,IF(COUNTRY_INFO!M38>=(COUNTRY_INFO!F38+COUNTRY_INFO!G38),COUNTRY_INFO!F38+COUNTRY_INFO!G38,COUNTRY_INFO!$M38),0))))","v":0},{"$f":"IF(AND(INTRO!$E$39=\"Non endémique\",INTRO!$E$37=\"Non endémique\"),\"Non requis\",IF(INTRO!$E$39=\"Non endémique\",\"Traiter avec DEC\",COUNTRY_INFO!V38))","v":0},{"$f":"IF(INTRO!$E$39<>\"Non endémique\",COUNTRY_INFO!W38,\"Non requis\")","v":0},{"$f":"IF(COUNTRY_INFO!H38=1, IF($E38=1,$D38, 0),0)","v":0},{"$f":"IF(COUNTRY_INFO!I38=1, IF(AND(COUNTRY_INFO!$I38=1,$F38<>0),IF(COUNTRY_INFO!M38>=(COUNTRY_INFO!F38+COUNTRY_INFO!G38),COUNTRY_INFO!F38+COUNTRY_INFO!G38,COUNTRY_INFO!$M38), 0),0)","v":0},0,0,0,0,null,0]
[{"$f":"IF(INTRO!$E$39=\"Non endémique\",\" \",IF(COUNTRY_INFO!A39=0,\" \",COUNTRY_INFO!A39))","v":"SENEGAL"},{"$f":"IF(INTRO!$E$39=\"Non endémique\",\" \",IF(COUNTRY_INFO!B39=0,\" \",COUNTRY_INFO!B39))","v":"Kaolack"},{"$f":"IF(INTRO!$E$39=\"Non endémique\",\" \",IF(COUNTRY_INFO!C39=0,\" \",COUNTRY_INFO!C39))","v":"Kaolack"},{"$f":"IF(INTRO!$E$39=\"Non endémique\",0,IF(INTRO!$E$39=\"Endémique mais pas de CP\",IF(COUNTRY_INFO!$H39=1,COUNTRY_INFO!F39+COUNTRY_INFO!G39,0),IF(COUNTRY_INFO!$H39=1,COUNTRY_INFO!F39+COUNTRY_INFO!G39,IF(COUNTRY_INFO!$I39=1,IF(COUNTRY_INFO!M39>=(COUNTRY_INFO!F39+COUNTRY_INFO!G39),COUNTRY_INFO!F39+COUNTRY_INFO!G39,COUNTRY_INFO!$M39),0))))","v":0},{"$f":"IF(AND(INTRO!$E$39=\"Non endémique\",INTRO!$E$37=\"Non endémique\"),\"Non requis\",IF(INTRO!$E$39=\"Non endémique\",\"Traiter avec DEC\",COUNTRY_INFO!V39))","v":0},{"$f":"IF(INTRO!$E$39<>\"Non endémique\",COUNTRY_INFO!W39,\"Non requis\")","v":0},{"$f":"IF(COUNTRY_INFO!H39=1, IF($E39=1,$D39, 0),0)","v":0},{"$f":"IF(COUNTRY_INFO!I39=1, IF(AND(COUNTRY_INFO!$I39=1,$F39<>0),IF(COUNTRY_INFO!M39>=(COUNTRY_INFO!F39+COUNTRY_INFO!G39),COUNTRY_INFO!F39+COUNTRY_INFO!G39,COUNTRY_INFO!$M39), 0),0)","v":0},0,0,0,0,null,0]
[{"$f":"IF(INTRO!$E$39=\"Non endémique\",\" \",IF(COUNTRY_INFO!A40=0,\" \",COUNTRY_INFO!A40))","v":"SENEGAL"},{"$f":"IF(INTRO!$E$39=\"Non endémique\",\" \",IF(COUNTRY_INFO!B40=0,\" \",COUNTRY_INFO!B40))","v":"Kaolack"},{"$f":"IF(INTRO!$E$39=\"Non endémique\",\" \",IF(COUNTRY_INFO!C40=0,\" \",COUNTRY_INFO!C40))","v":"Ndoffane"},{"$f":"IF(INTRO!$E$39=\"Non endémique\",0,IF(INTRO!$E$39=\"Endémique mais pas de CP\",IF(COUNTRY_INFO!$H40=1,COUNTRY_INFO!F40+COUNTRY_INFO!G40,0),IF(COUNTRY_INFO!$H40=1,COUNTRY_INFO!F40+COUNTRY_INFO!G40,IF(COUNTRY_INFO!$I40=1,IF(COUNTRY_INFO!M40>=(COUNTRY_INFO!F40+COUNTRY_INFO!G40),COUNTRY_INFO!F40+COUNTRY_INFO!G40,COUNTRY_INFO!$M40),0))))","v":0},{"$f":"IF(AND(INTRO!$E$39=\"Non endémique\",INTRO!$E$37=\"Non endémique\"),\"Non requis\",IF(INTRO!$E$39=\"Non endémique\",\"Traiter avec DEC\",COUNTRY_INFO!V40))","v":0},{"$f":"IF(INTRO!$E$39<>\"Non endémique\",COUNTRY_INFO!W40,\"Non requis\")","v":0},{"$f":"IF(COUNTRY_INFO!H40=1, IF($E40=1,$D40, 0),0)","v":0},{"$f":"IF(COUNTRY_INFO!I40=1, IF(AND(COUNTRY_INFO!$I40=1,$F40<>0),IF(COUNTRY_INFO!M40>=(COUNTRY_INFO!F40+COUNTRY_INFO!G40),COUNTRY_INFO!F40+COUNTRY_INFO!G40,COUNTRY_INFO!$M40), 0),0)","v":0},0,0,0,0,null,0]
[{"$f":"IF(INTRO!$E$39=\"Non endémique\",\" \",IF(COUNTRY_INFO!A41=0,\" \",COUNTRY_INFO!A41))","v":"SENEGAL"},{"$f":"IF(INTRO!$E$39=\"Non endémique\",\" \",IF(COUNTRY_INFO!B41=0,\" \",COUNTRY_INFO!B41))","v":"Kaolack"},{"$f":"IF(INTRO!$E$39=\"Non endémique\",\" \",IF(COUNTRY_INFO!C41=0,\" \",COUNTRY_INFO!C41))","v":"Nioro"},{"$f":"IF(INTRO!$E$39=\"Non endémique\",0,IF(INTRO!$E$39=\"Endémique mais pas de CP\",IF(COUNTRY_INFO!$H41=1,COUNTRY_INFO!F41+COUNTRY_INFO!G41,0),IF(COUNTRY_INFO!$H41=1,COUNTRY_INFO!F41+COUNTRY_INFO!G41,IF(COUNTRY_INFO!$I41=1,IF(COUNTRY_INFO!M41>=(COUNTRY_INFO!F41+COUNTRY_INFO!G41),COUNTRY_INFO!F41+COUNTRY_INFO!G41,COUNTRY_INFO!$M41),0))))","v":0},{"$f":"IF(AND(INTRO!$E$39=\"Non endémique\",INTRO!$E$37=\"Non endémique\"),\"Non requis\",IF(INTRO!$E$39=\"Non endémique\",\"Traiter avec DEC\",COUNTRY_INFO!V41))","v":0},{"$f":"IF(INTRO!$E$39<>\"Non endémique\",COUNTRY_INFO!W41,\"Non requis\")","v":0},{"$f":"IF(COUNTRY_INFO!H41=1, IF($E41=1,$D41, 0),0)","v":0},{"$f":"IF(COUNTRY_INFO!I41=1, IF(AND(COUNTRY_INFO!$I41=1,$F41<>0),IF(COUNTRY_INFO!M41>=(COUNTRY_INFO!F41+COUNTRY_INFO!G41),COUNTRY_INFO!F41+COUNTRY_INFO!G41,COUNTRY_INFO!$M41), 0),0)","v":0},0,0,0,0,null,0]
[{"$f":"IF(INTRO!$E$39=\"Non endémique\",\" \",IF(COUNTRY_INFO!A42=0,\" \",COUNTRY_INFO!A42))","v":"SENEGAL"},{"$f":"IF(INTRO!$E$39=\"Non endémique\",\" \",IF(COUNTRY_INFO!B42=0,\" \",COUNTRY_INFO!B42))","v":"Kédougou"},{"$f":"IF(INTRO!$E$39=\"Non endémique\",\" \",IF(COUNTRY_INFO!C42=0,\" \",COUNTRY_INFO!C42))","v":"Kédougou"},{"$f":"IF(INTRO!$E$39=\"Non endémique\",0,IF(INTRO!$E$39=\"Endémique mais pas de CP\",IF(COUNTRY_INFO!$H42=1,COUNTRY_INFO!F42+COUNTRY_INFO!G42,0),IF(COUNTRY_INFO!$H42=1,COUNTRY_INFO!F42+COUNTRY_INFO!G42,IF(COUNTRY_INFO!$I42=1,IF(COUNTRY_INFO!M42>=(COUNTRY_INFO!F42+COUNTRY_INFO!G42),COUNTRY_INFO!F42+COUNTRY_INFO!G42,COUNTRY_INFO!$M42),0))))","v":0},{"$f":"IF(AND(INTRO!$E$39=\"Non endémique\",INTRO!$E$37=\"Non endémique\"),\"Non requis\",IF(INTRO!$E$39=\"Non endémique\",\"Traiter avec DEC\",COUNTRY_INFO!V42))","v":0},{"$f":"IF(INTRO!$E$39<>\"Non endémique\",COUNTRY_INFO!W42,\"Non requis\")","v":0},{"$f":"IF(COUNTRY_INFO!H42=1, IF($E42=1,$D42, 0),0)","v":0},{"$f":"IF(COUNTRY_INFO!I42=1, IF(AND(COUNTRY_INFO!$I42=1,$F42<>0),IF(COUNTRY_INFO!M42>=(COUNTRY_INFO!F42+COUNTRY_INFO!G42),COUNTRY_INFO!F42+COUNTRY_INFO!G42,COUNTRY_INFO!$M42), 0),0)","v":0},{"$f":"IF(G42<H42,0,IF($E42=1, (G42-H42)*2.8, 0))","v":0},{"$f":"IF($E42<$F42, H42*(F42-E42)*2.8, 0)","v":0},0,0,null,0]
[{"$f":"IF(INTRO!$E$39=\"Non endémique\",\" \",IF(COUNTRY_INFO!A43=0,\" \",COUNTRY_INFO!A43))","v":"SENEGAL"},{"$f":"IF(INTRO!$E$39=\"Non endémique\",\" \",IF(COUNTRY_INFO!B43=0,\" \",COUNTRY_INFO!B43))","v":"Kédougou"},{"$f":"IF(INTRO!$E$39=\"Non endémique\",\" \",IF(COUNTRY_INFO!C43=0,\" \",COUNTRY_INFO!C43))","v":"Salemata"},{"$f":"IF(INTRO!$E$39=\"Non endémique\",0,IF(INTRO!$E$39=\"Endémique mais pas de CP\",IF(COUNTRY_INFO!$H43=1,COUNTRY_INFO!F43+COUNTRY_INFO!G43,0),IF(COUNTRY_INFO!$H43=1,COUNTRY_INFO!F43+COUNTRY_INFO!G43,IF(COUNTRY_INFO!$I43=1,IF(COUNTRY_INFO!M43>=(COUNTRY_INFO!F43+COUNTRY_INFO!G43),COUNTRY_INFO!F43+COUNTRY_INFO!G43,COUNTRY_INFO!$M43),0))))","v":0},{"$f":"IF(AND(INTRO!$E$39=\"Non endémique\",INTRO!$E$37=\"Non endémique\"),\"Non requis\",IF(INTRO!$E$39=\"Non endémique\",\"Traiter avec DEC\",COUNTRY_INFO!V43))","v":0},{"$f":"IF(INTRO!$E$39<>\"Non endémique\",COUNTRY_INFO!W43,\"Non requis\")","v":0},{"$f":"IF(COUNTRY_INFO!H43=1, IF($E43=1,$D43, 0),0)","v":0},{"$f":"IF(COUNTRY_INFO!I43=1, IF(AND(COUNTRY_INFO!$I43=1,$F43<>0),IF(COUNTRY_INFO!M43>=(COUNTRY_INFO!F43+COUNTRY_INFO!G43),COUNTRY_INFO!F43+COUNTRY_INFO!G43,COUNTRY_INFO!$M43), 0),0)","v":0},0,0,0,0,null,0]
[{"$f":"IF(INTRO!$E$39=\"Non endémique\",\" \",IF(COUNTRY_INFO!A44=0,\" \",COUNTRY_INFO!A44))","v":"SENEGAL"},{"$f":"IF(INTRO!$E$39=\"Non endémique\",\" \",IF(COUNTRY_INFO!B44=0,\" \",COUNTRY_INFO!B44))","v":"Kédougou"},{"$f":"IF(INTRO!$E$39=\"Non endémique\",\" \",IF(COUNTRY_INFO!C44=0,\" \",COUNTRY_INFO!C44))","v":"Saraya"},{"$f":"IF(INTRO!$E$39=\"Non endémique\",0,IF(INTRO!$E$39=\"Endémique mais pas de CP\",IF(COUNTRY_INFO!$H44=1,COUNTRY_INFO!F44+COUNTRY_INFO!G44,0),IF(COUNTRY_INFO!$H44=1,COUNTRY_INFO!F44+COUNTRY_INFO!G44,IF(COUNTRY_INFO!$I44=1,IF(COUNTRY_INFO!M44>=(COUNTRY_INFO!F44+COUNTRY_INFO!G44),COUNTRY_INFO!F44+COUNTRY_INFO!G44,COUNTRY_INFO!$M44),0))))","v":0},{"$f":"IF(AND(INTRO!$E$39=\"Non endémique\",INTRO!$E$37=\"Non endémique\"),\"Non requis\",IF(INTRO!$E$39=\"Non endémique\",\"Traiter avec DEC\",COUNTRY_INFO!V44))","v":0},{"$f":"IF(INTRO!$E$39<>\"Non endémique\",COUNTRY_INFO!W44,\"Non requis\")","v":0},{"$f":"IF(COUNTRY_INFO!H44=1, IF($E44=1,$D44, 0),0)","v":0},{"$f":"IF(COUNTRY_INFO!I44=1, IF(AND(COUNTRY_INFO!$I44=1,$F44<>0),IF(COUNTRY_INFO!M44>=(COUNTRY_INFO!F44+COUNTRY_INFO!G44),COUNTRY_INFO!F44+COUNTRY_INFO!G44,COUNTRY_INFO!$M44), 0),0)","v":0},0,0,0,0,null,0]
[{"$f":"IF(INTRO!$E$39=\"Non endémique\",\" \",IF(COUNTRY_INFO!A45=0,\" \",COUNTRY_INFO!A45))","v":"SENEGAL"},{"$f":"IF(INTRO!$E$39=\"Non endémique\",\" \",IF(COUNTRY_INFO!B45=0,\" \",COUNTRY_INFO!B45))","v":"Kolda"},{"$f":"IF(INTRO!$E$39=\"Non endémique\",\" \",IF(COUNTRY_INFO!C45=0,\" \",COUNTRY_INFO!C45))","v":"Kolda"},{"$f":"IF(INTRO!$E$39=\"Non endémique\",0,IF(INTRO!$E$39=\"Endémique mais pas de CP\",IF(COUNTRY_INFO!$H45=1,COUNTRY_INFO!F45+COUNTRY_INFO!G45,0),IF(COUNTRY_INFO!$H45=1,COUNTRY_INFO!F45+COUNTRY_INFO!G45,IF(COUNTRY_INFO!$I45=1,IF(COUNTRY_INFO!M45>=(COUNTRY_INFO!F45+COUNTRY_INFO!G45),COUNTRY_INFO!F45+COUNTRY_INFO!G45,COUNTRY_INFO!$M45),0))))","v":0},{"$f":"IF(AND(INTRO!$E$39=\"Non endémique\",INTRO!$E$37=\"Non endémique\"),\"Non requis\",IF(INTRO!$E$39=\"Non endémique\",\"Traiter avec DEC\",COUNTRY_INFO!V45))","v":0},{"$f":"IF(INTRO!$E$39<>\"Non endémique\",COUNTRY_INFO!W45,\"Non requis\")","v":0},{"$f":"IF(COUNTRY_INFO!H45=1, IF($E45=1,$D45, 0),0)","v":0},{"$f":"IF(COUNTRY_INFO!I45=1, IF(AND(COUNTRY_INFO!$I45=1,$F45<>0),IF(COUNTRY_INFO!M45>=(COUNTRY_INFO!F45+COUNTRY_INFO!G45),COUNTRY_INFO!F45+COUNTRY_INFO!G45,COUNTRY_INFO!$M45), 0),0)","v":0},0,0,0,0,null,0]
[{"$f":"IF(INTRO!$E$39=\"Non endémique\",\" \",IF(COUNTRY_INFO!A46=0,\" \",COUNTRY_INFO!A46))","v":"SENEGAL"},{"$f":"IF(INTRO!$E$39=\"Non endémique\",\" \",IF(COUNTRY_INFO!B46=0,\" \",COUNTRY_INFO!B46))","v":"Kolda"},{"$f":"IF(INTRO!$E$39=\"Non endémique\",\" \",IF(COUNTRY_INFO!C46=0,\" \",COUNTRY_INFO!C46))","v":"Medina Yoro Foulah"},{"$f":"IF(INTRO!$E$39=\"Non endémique\",0,IF(INTRO!$E$39=\"Endémique mais pas de CP\",IF(COUNTRY_INFO!$H46=1,COUNTRY_INFO!F46+COUNTRY_INFO!G46,0),IF(COUNTRY_INFO!$H46=1,COUNTRY_INFO!F46+COUNTRY_INFO!G46,IF(COUNTRY_INFO!$I46=1,IF(COUNTRY_INFO!M46>=(COUNTRY_INFO!F46+COUNTRY_INFO!G46),COUNTRY_INFO!F46+COUNTRY_INFO!G46,COUNTRY_INFO!$M46),0))))","v":0},{"$f":"IF(AND(INTRO!$E$39=\"Non endémique\",INTRO!$E$37=\"Non endémique\"),\"Non requis\",IF(INTRO!$E$39=\"Non endémique\",\"Traiter avec DEC\",COUNTRY_INFO!V46))","v":0},{"$f":"IF(INTRO!$E$39<>\"Non endémique\",COUNTRY_INFO!W46,\"Non requis\")","v":0},{"$f":"IF(COUNTRY_INFO!H46=1, IF($E46=1,$D46, 0),0)","v":0},{"$f":"IF(COUNTRY_INFO!I46=1, IF(AND(COUNTRY_INFO!$I46=1,$F46<>0),IF(COUNTRY_INFO!M46>=(COUNTRY_INFO!F46+COUNTRY_INFO!G46),COUNTRY_INFO!F46+COUNTRY_INFO!G46,COUNTRY_INFO!$M46), 0),0)","v":0},0,0,0,0,null,0]
[{"$f":"IF(INTRO!$E$39=\"Non endémique\",\" \",IF(COUNTRY_INFO!A47=0,\" \",COUNTRY_INFO!A47))","v":"SENEGAL"},{"$f":"IF(INTRO!$E$39=\"Non endémique\",\" \",IF(COUNTRY_INFO!B47=0,\" \",COUNTRY_INFO!B47))","v":"Kolda"},{"$f":"IF(INTRO!$E$39=\"Non endémique\",\" \",IF(COUNTRY_INFO!C47=0,\" \",COUNTRY_INFO!C47))","v":"Velingara"},{"$f":"IF(INTRO!$E$39=\"Non endémique\",0,IF(INTRO!$E$39=\"Endémique mais pas de CP\",IF(COUNTRY_INFO!$H47=1,COUNTRY_INFO!F47+COUNTRY_INFO!G47,0),IF(COUNTRY_INFO!$H47=1,COUNTRY_INFO!F47+COUNTRY_INFO!G47,IF(COUNTRY_INFO!$I47=1,IF(COUNTRY_INFO!M47>=(COUNTRY_INFO!F47+COUNTRY_INFO!G47),COUNTRY_INFO!F47+COUNTRY_INFO!G47,COUNTRY_INFO!$M47),0))))","v":0},{"$f":"IF(AND(INTRO!$E$39=\"Non endémique\",INTRO!$E$37=\"Non endémique\"),\"Non requis\",IF(INTRO!$E$39=\"Non endémique\",\"Traiter avec DEC\",COUNTRY_INFO!V47))","v":0},{"$f":"IF(INTRO!$E$39<>\"Non endémique\",COUNTRY_INFO!W47,\"Non requis\")","v":0},{"$f":"IF(COUNTRY_INFO!H47=1, IF($E47=1,$D47, 0),0)","v":0},{"$f":"IF(COUNTRY_INFO!I47=1, IF(AND(COUNTRY_INFO!$I47=1,$F47<>0),IF(COUNTRY_INFO!M47>=(COUNTRY_INFO!F47+COUNTRY_INFO!G47),COUNTRY_INFO!F47+COUNTRY_INFO!G47,COUNTRY_INFO!$M47), 0),0)","v":0},0,0,0,0,null,0]
[{"$f":"IF(INTRO!$E$39=\"Non endémique\",\" \",IF(COUNTRY_INFO!A48=0,\" \",COUNTRY_INFO!A48))","v":"SENEGAL"},{"$f":"IF(INTRO!$E$39=\"Non endémique\",\" \",IF(COUNTRY_INFO!B48=0,\" \",COUNTRY_INFO!B48))","v":"Louga"},{"$f":"IF(INTRO!$E$39=\"Non endémique\",\" \",IF(COUNTRY_INFO!C48=0,\" \",COUNTRY_INFO!C48))","v":"Darou-Mousty"},{"$f":"IF(INTRO!$E$39=\"Non endémique\",0,IF(INTRO!$E$39=\"Endémique mais pas de CP\",IF(COUNTRY_INFO!$H48=1,COUNTRY_INFO!F48+COUNTRY_INFO!G48,0),IF(COUNTRY_INFO!$H48=1,COUNTRY_INFO!F48+COUNTRY_INFO!G48,IF(COUNTRY_INFO!$I48=1,IF(COUNTRY_INFO!M48>=(COUNTRY_INFO!F48+COUNTRY_INFO!G48),COUNTRY_INFO!F48+COUNTRY_INFO!G48,COUNTRY_INFO!$M48),0))))","v":0},{"$f":"IF(AND(INTRO!$E$39=\"Non endémique\",INTRO!$E$37=\"Non endémique\"),\"Non requis\",IF(INTRO!$E$39=\"Non endémique\",\"Traiter avec DEC\",COUNTRY_INFO!V48))","v":0},{"$f":"IF(INTRO!$E$39<>\"Non endémique\",COUNTRY_INFO!W48,\"Non requis\")","v":0},{"$f":"IF(COUNTRY_INFO!H48=1, IF($E48=1,$D48, 0),0)","v":0},{"$f":"IF(COUNTRY_INFO!I48=1, IF(AND(COUNTRY_INFO!$I48=1,$F48<>0),IF(COUNTRY_INFO!M48>=(COUNTRY_INFO!F48+COUNTRY_INFO!G48),COUNTRY_INFO!F48+COUNTRY_INFO!G48,COUNTRY_INFO!$M48), 0),0)","v":0},0,0,0,0,null,0]
[{"$f":"IF(INTRO!$E$39=\"Non endémique\",\" \",IF(COUNTRY_INFO!A49=0,\" \",COUNTRY_INFO!A49))","v":"SENEGAL"},{"$f":"IF(INTRO!$E$39=\"Non endémique\",\" \",IF(COUNTRY_INFO!B49=0,\" \",COUNTRY_INFO!B49))","v":"Louga"},{"$f":"IF(INTRO!$E$39=\"Non endémique\",\" \",IF(COUNTRY_INFO!C49=0,\" \",COUNTRY_INFO!C49))","v":"Kébémer"},{"$f":"IF(INTRO!$E$39=\"Non endémique\",0,IF(INTRO!$E$39=\"Endémique mais pas de CP\",IF(COUNTRY_INFO!$H49=1,COUNTRY_INFO!F49+COUNTRY_INFO!G49,0),IF(COUNTRY_INFO!$H49=1,COUNTRY_INFO!F49+COUNTRY_INFO!G49,IF(COUNTRY_INFO!$I49=1,IF(COUNTRY_INFO!M49>=(COUNTRY_INFO!F49+COUNTRY_INFO!G49),COUNTRY_INFO!F49+COUNTRY_INFO!G49,COUNTRY_INFO!$M49),0))))","v":0},{"$f":"IF(AND(INTRO!$E$39=\"Non endémique\",INTRO!$E$37=\"Non endémique\"),\"Non requis\",IF(INTRO!$E$39=\"Non endémique\",\"Traiter avec DEC\",COUNTRY_INFO!V49))","v":0},{"$f":"IF(INTRO!$E$39<>\"Non endémique\",COUNTRY_INFO!W49,\"Non requis\")","v":0},{"$f":"IF(COUNTRY_INFO!H49=1, IF($E49=1,$D49, 0),0)","v":0},{"$f":"IF(COUNTRY_INFO!I49=1, IF(AND(COUNTRY_INFO!$I49=1,$F49<>0),IF(COUNTRY_INFO!M49>=(COUNTRY_INFO!F49+COUNTRY_INFO!G49),COUNTRY_INFO!F49+COUNTRY_INFO!G49,COUNTRY_INFO!$M49), 0),0)","v":0},0,0,0,0,null,0]
[{"$f":"IF(INTRO!$E$39=\"Non endémique\",\" \",IF(COUNTRY_INFO!A50=0,\" \",COUNTRY_INFO!A50))","v":"SENEGAL"},{"$f":"IF(INTRO!$E$39=\"Non endémique\",\" \",IF(COUNTRY_INFO!B50=0,\" \",COUNTRY_INFO!B50))","v":"Louga"},{"$f":"IF(INTRO!$E$39=\"Non endémique\",\" \",IF(COUNTRY_INFO!C50=0,\" \",COUNTRY_INFO!C50))","v":"Linguère"},{"$f":"IF(INTRO!$E$39=\"Non endémique\",0,IF(INTRO!$E$39=\"Endémique mais pas de CP\",IF(COUNTRY_INFO!$H50=1,COUNTRY_INFO!F50+COUNTRY_INFO!G50,0),IF(COUNTRY_INFO!$H50=1,COUNTRY_INFO!F50+COUNTRY_INFO!G50,IF(COUNTRY_INFO!$I50=1,IF(COUNTRY_INFO!M50>=(COUNTRY_INFO!F50+COUNTRY_INFO!G50),COUNTRY_INFO!F50+COUNTRY_INFO!G50,COUNTRY_INFO!$M50),0))))","v":0},{"$f":"IF(AND(INTRO!$E$39=\"Non endémique\",INTRO!$E$37=\"Non endémique\"),\"Non requis\",IF(INTRO!$E$39=\"Non endémique\",\"Traiter avec DEC\",COUNTRY_INFO!V50))","v":0},{"$f":"IF(INTRO!$E$39<>\"Non endémique\",COUNTRY_INFO!W50,\"Non requis\")","v":0},{"$f":"IF(COUNTRY_INFO!H50=1, IF($E50=1,$D50, 0),0)","v":0},{"$f":"IF(COUNTRY_INFO!I50=1, IF(AND(COUNTRY_INFO!$I50=1,$F50<>0),IF(COUNTRY_INFO!M50>=(COUNTRY_INFO!F50+COUNTRY_INFO!G50),COUNTRY_INFO!F50+COUNTRY_INFO!G50,COUNTRY_INFO!$M50), 0),0)","v":0},0,0,0,0,null,0]
[{"$f":"IF(INTRO!$E$39=\"Non endémique\",\" \",IF(COUNTRY_INFO!A51=0,\" \",COUNTRY_INFO!A51))","v":"SENEGAL"},{"$f":"IF(INTRO!$E$39=\"Non endémique\",\" \",IF(COUNTRY_INFO!B51=0,\" \",COUNTRY_INFO!B51))","v":"Louga"},{"$f":"IF(INTRO!$E$39=\"Non endémique\",\" \",IF(COUNTRY_INFO!C51=0,\" \",COUNTRY_INFO!C51))","v":"Dahra"},{"$f":"IF(INTRO!$E$39=\"Non endémique\",0,IF(INTRO!$E$39=\"Endémique mais pas de CP\",IF(COUNTRY_INFO!$H51=1,COUNTRY_INFO!F51+COUNTRY_INFO!G51,0),IF(COUNTRY_INFO!$H51=1,COUNTRY_INFO!F51+COUNTRY_INFO!G51,IF(COUNTRY_INFO!$I51=1,IF(COUNTRY_INFO!M51>=(COUNTRY_INFO!F51+COUNTRY_INFO!G51),COUNTRY_INFO!F51+COUNTRY_INFO!G51,COUNTRY_INFO!$M51),0))))","v":0},{"$f":"IF(AND(INTRO!$E$39=\"Non endémique\",INTRO!$E$37=\"Non endémique\"),\"Non requis\",IF(INTRO!$E$39=\"Non endémique\",\"Traiter avec DEC\",COUNTRY_INFO!V51))","v":0},{"$f":"IF(INTRO!$E$39<>\"Non endémique\",COUNTRY_INFO!W51,\"Non requis\")","v":0},{"$f":"IF(COUNTRY_INFO!H51=1, IF($E51=1,$D51, 0),0)","v":0},{"$f":"IF(COUNTRY_INFO!I51=1, IF(AND(COUNTRY_INFO!$I51=1,$F51<>0),IF(COUNTRY_INFO!M51>=(COUNTRY_INFO!F51+COUNTRY_INFO!G51),COUNTRY_INFO!F51+COUNTRY_INFO!G51,COUNTRY_INFO!$M51), 0),0)","v":0},0,0,0,0,null,0]
[{"$f":"IF(INTRO!$E$39=\"Non endémique\",\" \",IF(COUNTRY_INFO!A52=0,\" \",COUNTRY_INFO!A52))","v":"SENEGAL"},{"$f":"IF(INTRO!$E$39=\"Non endémique\",\" \",IF(COUNTRY_INFO!B52=0,\" \",COUNTRY_INFO!B52))","v":"Louga"},{"$f":"IF(INTRO!$E$39=\"Non endémique\",\" \",IF(COUNTRY_INFO!C52=0,\" \",COUNTRY_INFO!C52))","v":"Coki"},{"$f":"IF(INTRO!$E$39=\"Non endémique\",0,IF(INTRO!$E$39=\"Endémique mais pas de CP\",IF(COUNTRY_INFO!$H52=1,COUNTRY_INFO!F52+COUNTRY_INFO!G52,0),IF(COUNTRY_INFO!$H52=1,COUNTRY_INFO!F52+COUNTRY_INFO!G52,IF(COUNTRY_INFO!$I52=1,IF(COUNTRY_INFO!M52>=(COUNTRY_INFO!F52+COUNTRY_INFO!G52),COUNTRY_INFO!F52+COUNTRY_INFO!G52,COUNTRY_INFO!$M52),0))))","v":72781},{"$f":"IF(AND(INTRO!$E$39=\"Non endémique\",INTRO!$E$37=\"Non endémique\"),\"Non requis\",IF(INTRO!$E$39=\"Non endémique\",\"Traiter avec DEC\",COUNTRY_INFO!V52))","v":1},{"$f":"IF(INTRO!$E$39<>\"Non endémique\",COUNTRY_INFO!W52,\"Non requis\")","v":0},{"$f":"IF(COUNTRY_INFO!H52=1, IF($E52=1,$D52, 0),0)","v":72781},{"$f":"IF(COUNTRY_INFO!I52=1, IF(AND(COUNTRY_INFO!$I52=1,$F52<>0),IF(COUNTRY_INFO!M52>=(COUNTRY_INFO!F52+COUNTRY_INFO!G52),COUNTRY_INFO!F52+COUNTRY_INFO!G52,COUNTRY_INFO!$M52), 0),0)","v":0},203786.8,0,0,203786.8,null,203786.8]
[{"$f":"IF(INTRO!$E$39=\"Non endémique\",\" \",IF(COUNTRY_INFO!A53=0,\" \",COUNTRY_INFO!A53))","v":"SENEGAL"},{"$f":"IF(INTRO!$E$39=\"Non endémique\",\" \",IF(COUNTRY_INFO!B53=0,\" \",COUNTRY_INFO!B53))","v":"Louga"},{"$f":"IF(INTRO!$E$39=\"Non endémique\",\" \",IF(COUNTRY_INFO!C53=0,\" \",COUNTRY_INFO!C53))","v":"Keur Momar Sarr"},{"$f":"IF(INTRO!$E$39=\"Non endémique\",0,IF(INTRO!$E$39=\"Endémique mais pas de CP\",IF(COUNTRY_INFO!$H53=1,COUNTRY_INFO!F53+COUNTRY_INFO!G53,0),IF(COUNTRY_INFO!$H53=1,COUNTRY_INFO!F53+COUNTRY_INFO!G53,IF(COUNTRY_INFO!$I53=1,IF(COUNTRY_INFO!M53>=(COUNTRY_INFO!F53+COUNTRY_INFO!G53),COUNTRY_INFO!F53+COUNTRY_INFO!G53,COUNTRY_INFO!$M53),0))))","v":0},{"$f":"IF(AND(INTRO!$E$39=\"Non endémique\",INTRO!$E$37=\"Non endémique\"),\"Non requis\",IF(INTRO!$E$39=\"Non endémique\",\"Traiter avec DEC\",COUNTRY_INFO!V53))","v":0},{"$f":"IF(INTRO!$E$39<>\"Non endémique\",COUNTRY_INFO!W53,\"Non requis\")","v":0},{"$f":"IF(COUNTRY_INFO!H53=1, IF($E53=1,$D53, 0),0)","v":0},{"$f":"IF(COUNTRY_INFO!I53=1, IF(AND(COUNTRY_INFO!$I53=1,$F53<>0),IF(COUNTRY_INFO!M53>=(COUNTRY_INFO!F53+COUNTRY_INFO!G53),COUNTRY_INFO!F53+COUNTRY_INFO!G53,COUNTRY_INFO!$M53), 0),0)","v":0},0,0,0,0,null,0]
[{"$f":"IF(INTRO!$E$39=\"Non endémique\",\" \",IF(COUNTRY_INFO!A54=0,\" \",COUNTRY_INFO!A54))","v":"SENEGAL"},{"$f":"IF(INTRO!$E$39=\"Non endémique\",\" \",IF(COUNTRY_INFO!B54=0,\" \",COUNTRY_INFO!B54))","v":"Louga"},{"$f":"IF(INTRO!$E$39=\"Non endémique\",\" \",IF(COUNTRY_INFO!C54=0,\" \",COUNTRY_INFO!C54))","v":"Sakal"},{"$f":"IF(INTRO!$E$39=\"Non endémique\",0,IF(INTRO!$E$39=\"Endémique mais pas de CP\",IF(COUNTRY_INFO!$H54=1,COUNTRY_INFO!F54+COUNTRY_INFO!G54,0),IF(COUNTRY_INFO!$H54=1,COUNTRY_INFO!F54+COUNTRY_INFO!G54,IF(COUNTRY_INFO!$I54=1,IF(COUNTRY_INFO!M54>=(COUNTRY_INFO!F54+COUNTRY_INFO!G54),COUNTRY_INFO!F54+COUNTRY_INFO!G54,COUNTRY_INFO!$M54),0))))","v":0},{"$f":"IF(AND(INTRO!$E$39=\"Non endémique\",INTRO!$E$37=\"Non endémique\"),\"Non requis\",IF(INTRO!$E$39=\"Non endémique\",\"Traiter avec DEC\",COUNTRY_INFO!V54))","v":0},{"$f":"IF(INTRO!$E$39<>\"Non endémique\",COUNTRY_INFO!W54,\"Non requis\")","v":0},{"$f":"IF(COUNTRY_INFO!H54=1, IF($E54=1,$D54, 0),0)","v":0},{"$f":"IF(COUNTRY_INFO!I54=1, IF(AND(COUNTRY_INFO!$I54=1,$F54<>0),IF(COUNTRY_INFO!M54>=(COUNTRY_INFO!F54+COUNTRY_INFO!G54),COUNTRY_INFO!F54+COUNTRY_INFO!G54,COUNTRY_INFO!$M54), 0),0)","v":0},0,0,0,0,null,0]
[{"$f":"IF(INTRO!$E$39=\"Non endémique\",\" \",IF(COUNTRY_INFO!A55=0,\" \",COUNTRY_INFO!A55))","v":"SENEGAL"},{"$f":"IF(INTRO!$E$39=\"Non endémique\",\" \",IF(COUNTRY_INFO!B55=0,\" \",COUNTRY_INFO!B55))","v":"Louga"},{"$f":"IF(INTRO!$E$39=\"Non endémique\",\" \",IF(COUNTRY_INFO!C55=0,\" \",COUNTRY_INFO!C55))","v":"Louga"},{"$f":"IF(INTRO!$E$39=\"Non endémique\",0,IF(INTRO!$E$39=\"Endémique mais pas de CP\",IF(COUNTRY_INFO!$H55=1,COUNTRY_INFO!F55+COUNTRY_INFO!G55,0),IF(COUNTRY_INFO!$H55=1,COUNTRY_INFO!F55+COUNTRY_INFO!G55,IF(COUNTRY_INFO!$I55=1,IF(COUNTRY_INFO!M55>=(COUNTRY_INFO!F55+COUNTRY_INFO!G55),COUNTRY_INFO!F55+COUNTRY_INFO!G55,COUNTRY_INFO!$M55),0))))","v":186314},{"$f":"IF(AND(INTRO!$E$39=\"Non endémique\",INTRO!$E$37=\"Non endémique\"),\"Non requis\",IF(INTRO!$E$39=\"Non endémique\",\"Traiter avec DEC\",COUNTRY_INFO!V55))","v":1},{"$f":"IF(INTRO!$E$39<>\"Non endémique\",COUNTRY_INFO!W55,\"Non requis\")","v":0},{"$f":"IF(COUNTRY_INFO!H55=1, IF($E55=1,$D55, 0),0)","v":186314},{"$f":"IF(COUNTRY_INFO!I55=1, IF(AND(COUNTRY_INFO!$I55=1,$F55<>0),IF(COUNTRY_INFO!M55>=(COUNTRY_INFO!F55+COUNTRY_INFO!G55),COUNTRY_INFO!F55+COUNTRY_INFO!G55,COUNTRY_INFO!$M55), 0),0)","v":0},521679.19999999995,0,0,521679.19999999995,null,521679.19999999995]
[{"$f":"IF(INTRO!$E$39=\"Non endémique\",\" \",IF(COUNTRY_INFO!A56=0,\" \",COUNTRY_INFO!A56))","v":"SENEGAL"},{"$f":"IF(INTRO!$E$39=\"Non endémique\",\" \",IF(COUNTRY_INFO!B56=0,\" \",COUNTRY_INFO!B56))","v":"Matam"},{"$f":"IF(INTRO!$E$39=\"Non endémique\",\" \",IF(COUNTRY_INFO!C56=0,\" \",COUNTRY_INFO!C56))","v":"Kanel"},{"$f":"IF(INTRO!$E$39=\"Non endémique\",0,IF(INTRO!$E$39=\"Endémique mais pas de CP\",IF(COUNTRY_INFO!$H56=1,COUNTRY_INFO!F56+COUNTRY_INFO!G56,0),IF(COUNTRY_INFO!$H56=1,COUNTRY_INFO!F56+COUNTRY_INFO!G56,IF(COUNTRY_INFO!$I56=1,IF(COUNTRY_INFO!M56>=(COUNTRY_INFO!F56+COUNTRY_INFO!G56),COUNTRY_INFO!F56+COUNTRY_INFO!G56,COUNTRY_INFO!$M56),0))))","v":0},{"$f":"IF(AND(INTRO!$E$39=\"Non endémique\",INTRO!$E$37=\"Non endémique\"),\"Non requis\",IF(INTRO!$E$39=\"Non endémique\",\"Traiter avec DEC\",COUNTRY_INFO!V56))","v":0},{"$f":"IF(INTRO!$E$39<>\"Non endémique\",COUNTRY_INFO!W56,\"Non requis\")","v":0},{"$f":"IF(COUNTRY_INFO!H56=1, IF($E56=1,$D56, 0),0)","v":0},{"$f":"IF(COUNTRY_INFO!I56=1, IF(AND(COUNTRY_INFO!$I56=1,$F56<>0),IF(COUNTRY_INFO!M56>=(COUNTRY_INFO!F56+COUNTRY_INFO!G56),COUNTRY_INFO!F56+COUNTRY_INFO!G56,COUNTRY_INFO!$M56), 0),0)","v":0},0,0,0,0,null,0]
[{"$f":"IF(INTRO!$E$39=\"Non endémique\",\" \",IF(COUNTRY_INFO!A57=0,\" \",COUNTRY_INFO!A57))","v":"SENEGAL"},{"$f":"IF(INTRO!$E$39=\"Non endémique\",\" \",IF(COUNTRY_INFO!B57=0,\" \",COUNTRY_INFO!B57))","v":"Matam"},{"$f":"IF(INTRO!$E$39=\"Non endémique\",\" \",IF(COUNTRY_INFO!C57=0,\" \",COUNTRY_INFO!C57))","v":"Matam"},{"$f":"IF(INTRO!$E$39=\"Non endémique\",0,IF(INTRO!$E$39=\"Endémique mais pas de CP\",IF(COUNTRY_INFO!$H57=1,COUNTRY_INFO!F57+COUNTRY_INFO!G57,0),IF(COUNTRY_INFO!$H57=1,COUNTRY_INFO!F57+COUNTRY_INFO!G57,IF(COUNTRY_INFO!$I57=1,IF(COUNTRY_INFO!M57>=(COUNTRY_INFO!F57+COUNTRY_INFO!G57),COUNTRY_INFO!F57+COUNTRY_INFO!G57,COUNTRY_INFO!$M57),0))))","v":0},{"$f":"IF(AND(INTRO!$E$39=\"Non endémique\",INTRO!$E$37=\"Non endémique\"),\"Non requis\",IF(INTRO!$E$39=\"Non endémique\",\"Traiter avec DEC\",COUNTRY_INFO!V57))","v":0},{"$f":"IF(INTRO!$E$39<>\"Non endémique\",COUNTRY_INFO!W57,\"Non requis\")","v":0},{"$f":"IF(COUNTRY_INFO!H57=1, IF($E57=1,$D57, 0),0)","v":0},{"$f":"IF(COUNTRY_INFO!I57=1, IF(AND(COUNTRY_INFO!$I57=1,$F57<>0),IF(COUNTRY_INFO!M57>=(COUNTRY_INFO!F57+COUNTRY_INFO!G57),COUNTRY_INFO!F57+COUNTRY_INFO!G57,COUNTRY_INFO!$M57), 0),0)","v":0},0,0,0,0,null,0]
[{"$f":"IF(INTRO!$E$39=\"Non endémique\",\" \",IF(COUNTRY_INFO!A58=0,\" \",COUNTRY_INFO!A58))","v":"SENEGAL"},{"$f":"IF(INTRO!$E$39=\"Non endémique\",\" \",IF(COUNTRY_INFO!B58=0,\" \",COUNTRY_INFO!B58))","v":"Matam"},{"$f":"IF(INTRO!$E$39=\"Non endémique\",\" \",IF(COUNTRY_INFO!C58=0,\" \",COUNTRY_INFO!C58))","v":"Thilogne"},{"$f":"IF(INTRO!$E$39=\"Non endémique\",0,IF(INTRO!$E$39=\"Endémique mais pas de CP\",IF(COUNTRY_INFO!$H58=1,COUNTRY_INFO!F58+COUNTRY_INFO!G58,0),IF(COUNTRY_INFO!$H58=1,COUNTRY_INFO!F58+COUNTRY_INFO!G58,IF(COUNTRY_INFO!$I58=1,IF(COUNTRY_INFO!M58>=(COUNTRY_INFO!F58+COUNTRY_INFO!G58),COUNTRY_INFO!F58+COUNTRY_INFO!G58,COUNTRY_INFO!$M58),0))))","v":0},{"$f":"IF(AND(INTRO!$E$39=\"Non endémique\",INTRO!$E$37=\"Non endémique\"),\"Non requis\",IF(INTRO!$E$39=\"Non endémique\",\"Traiter avec DEC\",COUNTRY_INFO!V58))","v":0},{"$f":"IF(INTRO!$E$39<>\"Non endémique\",COUNTRY_INFO!W58,\"Non requis\")","v":0},{"$f":"IF(COUNTRY_INFO!H58=1, IF($E58=1,$D58, 0),0)","v":0},{"$f":"IF(COUNTRY_INFO!I58=1, IF(AND(COUNTRY_INFO!$I58=1,$F58<>0),IF(COUNTRY_INFO!M58>=(COUNTRY_INFO!F58+COUNTRY_INFO!G58),COUNTRY_INFO!F58+COUNTRY_INFO!G58,COUNTRY_INFO!$M58), 0),0)","v":0},0,0,0,0,null,0]
[{"$f":"IF(INTRO!$E$39=\"Non endémique\",\" \",IF(COUNTRY_INFO!A59=0,\" \",COUNTRY_INFO!A59))","v":"SENEGAL"},{"$f":"IF(INTRO!$E$39=\"Non endémique\",\" \",IF(COUNTRY_INFO!B59=0,\" \",COUNTRY_INFO!B59))","v":"Matam"},{"$f":"IF(INTRO!$E$39=\"Non endémique\",\" \",IF(COUNTRY_INFO!C59=0,\" \",COUNTRY_INFO!C59))","v":"Ranerou"},{"$f":"IF(INTRO!$E$39=\"Non endémique\",0,IF(INTRO!$E$39=\"Endémique mais pas de CP\",IF(COUNTRY_INFO!$H59=1,COUNTRY_INFO!F59+COUNTRY_INFO!G59,0),IF(COUNTRY_INFO!$H59=1,COUNTRY_INFO!F59+COUNTRY_INFO!G59,IF(COUNTRY_INFO!$I59=1,IF(COUNTRY_INFO!M59>=(COUNTRY_INFO!F59+COUNTRY_INFO!G59),COUNTRY_INFO!F59+COUNTRY_INFO!G59,COUNTRY_INFO!$M59),0))))","v":0},{"$f":"IF(AND(INTRO!$E$39=\"Non endémique\",INTRO!$E$37=\"Non endémique\"),\"Non requis\",IF(INTRO!$E$39=\"Non endémique\",\"Traiter avec DEC\",COUNTRY_INFO!V59))","v":0},{"$f":"IF(INTRO!$E$39<>\"Non endémique\",COUNTRY_INFO!W59,\"Non requis\")","v":0},{"$f":"IF(COUNTRY_INFO!H59=1, IF($E59=1,$D59, 0),0)","v":0},{"$f":"IF(COUNTRY_INFO!I59=1, IF(AND(COUNTRY_INFO!$I59=1,$F59<>0),IF(COUNTRY_INFO!M59>=(COUNTRY_INFO!F59+COUNTRY_INFO!G59),COUNTRY_INFO!F59+COUNTRY_INFO!G59,COUNTRY_INFO!$M59), 0),0)","v":0},0,0,0,0,null,0]
[{"$f":"IF(INTRO!$E$39=\"Non endémique\",\" \",IF(COUNTRY_INFO!A60=0,\" \",COUNTRY_INFO!A60))","v":"SENEGAL"},{"$f":"IF(INTRO!$E$39=\"Non endémique\",\" \",IF(COUNTRY_INFO!B60=0,\" \",COUNTRY_INFO!B60))","v":"Saint Louis"},{"$f":"IF(INTRO!$E$39=\"Non endémique\",\" \",IF(COUNTRY_INFO!C60=0,\" \",COUNTRY_INFO!C60))","v":"Dagana"},{"$f":"IF(INTRO!$E$39=\"Non endémique\",0,IF(INTRO!$E$39=\"Endémique mais pas de CP\",IF(COUNTRY_INFO!$H60=1,COUNTRY_INFO!F60+COUNTRY_INFO!G60,0),IF(COUNTRY_INFO!$H60=1,COUNTRY_INFO!F60+COUNTRY_INFO!G60,IF(COUNTRY_INFO!$I60=1,IF(COUNTRY_INFO!M60>=(COUNTRY_INFO!F60+COUNTRY_INFO!G60),COUNTRY_INFO!F60+COUNTRY_INFO!G60,COUNTRY_INFO!$M60),0))))","v":0},{"$f":"IF(AND(INTRO!$E$39=\"Non endémique\",INTRO!$E$37=\"Non endémique\"),\"Non requis\",IF(INTRO!$E$39=\"Non endémique\",\"Traiter avec DEC\",COUNTRY_INFO!V60))","v":0},{"$f":"IF(INTRO!$E$39<>\"Non endémique\",COUNTRY_INFO!W60,\"Non requis\")","v":0},{"$f":"IF(COUNTRY_INFO!H60=1, IF($E60=1,$D60, 0),0)","v":0},{"$f":"IF(COUNTRY_INFO!I60=1, IF(AND(COUNTRY_INFO!$I60=1,$F60<>0),IF(COUNTRY_INFO!M60>=(COUNTRY_INFO!F60+COUNTRY_INFO!G60),COUNTRY_INFO!F60+COUNTRY_INFO!G60,COUNTRY_INFO!$M60), 0),0)","v":0},0,0,0,0,null,0]
[{"$f":"IF(INTRO!$E$39=\"Non endémique\",\" \",IF(COUNTRY_INFO!A61=0,\" \",COUNTRY_INFO!A61))","v":"SENEGAL"},{"$f":"IF(INTRO!$E$39=\"Non endémique\",\" \",IF(COUNTRY_INFO!B61=0,\" \",COUNTRY_INFO!B61))","v":"Saint Louis"},{"$f":"IF(INTRO!$E$39=\"Non endémique\",\" \",IF(COUNTRY_INFO!C61=0,\" \",COUNTRY_INFO!C61))","v":"Richard Toll"},{"$f":"IF(INTRO!$E$39=\"Non endémique\",0,IF(INTRO!$E$39=\"Endémique mais pas de CP\",IF(COUNTRY_INFO!$H61=1,COUNTRY_INFO!F61+COUNTRY_INFO!G61,0),IF(COUNTRY_INFO!$H61=1,COUNTRY_INFO!F61+COUNTRY_INFO!G61,IF(COUNTRY_INFO!$I61=1,IF(COUNTRY_INFO!M61>=(COUNTRY_INFO!F61+COUNTRY_INFO!G61),COUNTRY_INFO!F61+COUNTRY_INFO!G61,COUNTRY_INFO!$M61),0))))","v":0},{"$f":"IF(AND(INTRO!$E$39=\"Non endémique\",INTRO!$E$37=\"Non endémique\"),\"Non requis\",IF(INTRO!$E$39=\"Non endémique\",\"Traiter avec DEC\",COUNTRY_INFO!V61))","v":0},{"$f":"IF(INTRO!$E$39<>\"Non endémique\",COUNTRY_INFO!W61,\"Non requis\")","v":0},{"$f":"IF(COUNTRY_INFO!H61=1, IF($E61=1,$D61, 0),0)","v":0},{"$f":"IF(COUNTRY_INFO!I61=1, IF(AND(COUNTRY_INFO!$I61=1,$F61<>0),IF(COUNTRY_INFO!M61>=(COUNTRY_INFO!F61+COUNTRY_INFO!G61),COUNTRY_INFO!F61+COUNTRY_INFO!G61,COUNTRY_INFO!$M61), 0),0)","v":0},0,0,0,0,null,0]
[{"$f":"IF(INTRO!$E$39=\"Non endémique\",\" \",IF(COUNTRY_INFO!A62=0,\" \",COUNTRY_INFO!A62))","v":"SENEGAL"},{"$f":"IF(INTRO!$E$39=\"Non endémique\",\" \",IF(COUNTRY_INFO!B62=0,\" \",COUNTRY_INFO!B62))","v":"Saint Louis"},{"$f":"IF(INTRO!$E$39=\"Non endémique\",\" \",IF(COUNTRY_INFO!C62=0,\" \",COUNTRY_INFO!C62))","v":"Peté"},{"$f":"IF(INTRO!$E$39=\"Non endémique\",0,IF(INTRO!$E$39=\"Endémique mais pas de CP\",IF(COUNTRY_INFO!$H62=1,COUNTRY_INFO!F62+COUNTRY_INFO!G62,0),IF(COUNTRY_INFO!$H62=1,COUNTRY_INFO!F62+COUNTRY_INFO!G62,IF(COUNTRY_INFO!$I62=1,IF(COUNTRY_INFO!M62>=(COUNTRY_INFO!F62+COUNTRY_INFO!G62),COUNTRY_INFO!F62+COUNTRY_INFO!G62,COUNTRY_INFO!$M62),0))))","v":185944},{"$f":"IF(AND(INTRO!$E$39=\"Non endémique\",INTRO!$E$37=\"Non endémique\"),\"Non requis\",IF(INTRO!$E$39=\"Non endémique\",\"Traiter avec DEC\",COUNTRY_INFO!V62))","v":1},{"$f":"IF(INTRO!$E$39<>\"Non endémique\",COUNTRY_INFO!W62,\"Non requis\")","v":0},{"$f":"IF(COUNTRY_INFO!H62=1, IF($E62=1,$D62, 0),0)","v":185944},{"$f":"IF(COUNTRY_INFO!I62=1, IF(AND(COUNTRY_INFO!$I62=1,$F62<>0),IF(COUNTRY_INFO!M62>=(COUNTRY_INFO!F62+COUNTRY_INFO!G62),COUNTRY_INFO!F62+COUNTRY_INFO!G62,COUNTRY_INFO!$M62), 0),0)","v":0},520643.19999999995,0,0,520643.19999999995,null,520643.19999999995]
[{"$f":"IF(INTRO!$E$39=\"Non endémique\",\" \",IF(COUNTRY_INFO!A63=0,\" \",COUNTRY_INFO!A63))","v":"SENEGAL"},{"$f":"IF(INTRO!$E$39=\"Non endémique\",\" \",IF(COUNTRY_INFO!B63=0,\" \",COUNTRY_INFO!B63))","v":"Saint Louis"},{"$f":"IF(INTRO!$E$39=\"Non endémique\",\" \",IF(COUNTRY_INFO!C63=0,\" \",COUNTRY_INFO!C63))","v":"Podor"},{"$f":"IF(INTRO!$E$39=\"Non endémique\",0,IF(INTRO!$E$39=\"Endémique mais pas de CP\",IF(COUNTRY_INFO!$H63=1,COUNTRY_INFO!F63+COUNTRY_INFO!G63,0),IF(COUNTRY_INFO!$H63=1,COUNTRY_INFO!F63+COUNTRY_INFO!G63,IF(COUNTRY_INFO!$I63=1,IF(COUNTRY_INFO!M63>=(COUNTRY_INFO!F63+COUNTRY_INFO!G63),COUNTRY_INFO!F63+COUNTRY_INFO!G63,COUNTRY_INFO!$M63),0))))","v":0},{"$f":"IF(AND(INTRO!$E$39=\"Non endémique\",INTRO!$E$37=\"Non endémique\"),\"Non requis\",IF(INTRO!$E$39=\"Non endémique\",\"Traiter avec DEC\",COUNTRY_INFO!V63))","v":0},{"$f":"IF(INTRO!$E$39<>\"Non endémique\",COUNTRY_INFO!W63,\"Non requis\")","v":0},{"$f":"IF(COUNTRY_INFO!H63=1, IF($E63=1,$D63, 0),0)","v":0},{"$f":"IF(COUNTRY_INFO!I63=1, IF(AND(COUNTRY_INFO!$I63=1,$F63<>0),IF(COUNTRY_INFO!M63>=(COUNTRY_INFO!F63+COUNTRY_INFO!G63),COUNTRY_INFO!F63+COUNTRY_INFO!G63,COUNTRY_INFO!$M63), 0),0)","v":0},0,0,0,0,null,0]
[{"$f":"IF(INTRO!$E$39=\"Non endémique\",\" \",IF(COUNTRY_INFO!A64=0,\" \",COUNTRY_INFO!A64))","v":"SENEGAL"},{"$f":"IF(INTRO!$E$39=\"Non endémique\",\" \",IF(COUNTRY_INFO!B64=0,\" \",COUNTRY_INFO!B64))","v":"Saint Louis"},{"$f":"IF(INTRO!$E$39=\"Non endémique\",\" \",IF(COUNTRY_INFO!C64=0,\" \",COUNTRY_INFO!C64))","v":"Saint Louis"},{"$f":"IF(INTRO!$E$39=\"Non endémique\",0,IF(INTRO!$E$39=\"Endémique mais pas de CP\",IF(COUNTRY_INFO!$H64=1,COUNTRY_INFO!F64+COUNTRY_INFO!G64,0),IF(COUNTRY_INFO!$H64=1,COUNTRY_INFO!F64+COUNTRY_INFO!G64,IF(COUNTRY_INFO!$I64=1,IF(COUNTRY_INFO!M64>=(COUNTRY_INFO!F64+COUNTRY_INFO!G64),COUNTRY_INFO!F64+COUNTRY_INFO!G64,COUNTRY_INFO!$M64),0))))","v":0},{"$f":"IF(AND(INTRO!$E$39=\"Non endémique\",INTRO!$E$37=\"Non endémique\"),\"Non requis\",IF(INTRO!$E$39=\"Non endémique\",\"Traiter avec DEC\",COUNTRY_INFO!V64))","v":0},{"$f":"IF(INTRO!$E$39<>\"Non endémique\",COUNTRY_INFO!W64,\"Non requis\")","v":0},{"$f":"IF(COUNTRY_INFO!H64=1, IF($E64=1,$D64, 0),0)","v":0},{"$f":"IF(COUNTRY_INFO!I64=1, IF(AND(COUNTRY_INFO!$I64=1,$F64<>0),IF(COUNTRY_INFO!M64>=(COUNTRY_INFO!F64+COUNTRY_INFO!G64),COUNTRY_INFO!F64+COUNTRY_INFO!G64,COUNTRY_INFO!$M64), 0),0)","v":0},0,0,0,0,null,0]
[{"$f":"IF(INTRO!$E$39=\"Non endémique\",\" \",IF(COUNTRY_INFO!A65=0,\" \",COUNTRY_INFO!A65))","v":"SENEGAL"},{"$f":"IF(INTRO!$E$39=\"Non endémique\",\" \",IF(COUNTRY_INFO!B65=0,\" \",COUNTRY_INFO!B65))","v":"Sédhiou"},{"$f":"IF(INTRO!$E$39=\"Non endémique\",\" \",IF(COUNTRY_INFO!C65=0,\" \",COUNTRY_INFO!C65))","v":"Bounkiling"},{"$f":"IF(INTRO!$E$39=\"Non endémique\",0,IF(INTRO!$E$39=\"Endémique mais pas de CP\",IF(COUNTRY_INFO!$H65=1,COUNTRY_INFO!F65+COUNTRY_INFO!G65,0),IF(COUNTRY_INFO!$H65=1,COUNTRY_INFO!F65+COUNTRY_INFO!G65,IF(COUNTRY_INFO!$I65=1,IF(COUNTRY_INFO!M65>=(COUNTRY_INFO!F65+COUNTRY_INFO!G65),COUNTRY_INFO!F65+COUNTRY_INFO!G65,COUNTRY_INFO!$M65),0))))","v":0},{"$f":"IF(AND(INTRO!$E$39=\"Non endémique\",INTRO!$E$37=\"Non endémique\"),\"Non requis\",IF(INTRO!$E$39=\"Non endémique\",\"Traiter avec DEC\",COUNTRY_INFO!V65))","v":0},{"$f":"IF(INTRO!$E$39<>\"Non endémique\",COUNTRY_INFO!W65,\"Non requis\")","v":0},{"$f":"IF(COUNTRY_INFO!H65=1, IF($E65=1,$D65, 0),0)","v":0},{"$f":"IF(COUNTRY_INFO!I65=1, IF(AND(COUNTRY_INFO!$I65=1,$F65<>0),IF(COUNTRY_INFO!M65>=(COUNTRY_INFO!F65+COUNTRY_INFO!G65),COUNTRY_INFO!F65+COUNTRY_INFO!G65,COUNTRY_INFO!$M65), 0),0)","v":0},0,0,0,0,null,0]
[{"$f":"IF(INTRO!$E$39=\"Non endémique\",\" \",IF(COUNTRY_INFO!A66=0,\" \",COUNTRY_INFO!A66))","v":"SENEGAL"},{"$f":"IF(INTRO!$E$39=\"Non endémique\",\" \",IF(COUNTRY_INFO!B66=0,\" \",COUNTRY_INFO!B66))","v":"Sédhiou"},{"$f":"IF(INTRO!$E$39=\"Non endémique\",\" \",IF(COUNTRY_INFO!C66=0,\" \",COUNTRY_INFO!C66))","v":"Goudomp"},{"$f":"IF(INTRO!$E$39=\"Non endémique\",0,IF(INTRO!$E$39=\"Endémique mais pas de CP\",IF(COUNTRY_INFO!$H66=1,COUNTRY_INFO!F66+COUNTRY_INFO!G66,0),IF(COUNTRY_INFO!$H66=1,COUNTRY_INFO!F66+COUNTRY_INFO!G66,IF(COUNTRY_INFO!$I66=1,IF(COUNTRY_INFO!M66>=(COUNTRY_INFO!F66+COUNTRY_INFO!G66),COUNTRY_INFO!F66+COUNTRY_INFO!G66,COUNTRY_INFO!$M66),0))))","v":0},{"$f":"IF(AND(INTRO!$E$39=\"Non endémique\",INTRO!$E$37=\"Non endémique\"),\"Non requis\",IF(INTRO!$E$39=\"Non endémique\",\"Traiter avec DEC\",COUNTRY_INFO!V66))","v":0},{"$f":"IF(INTRO!$E$39<>\"Non endémique\",COUNTRY_INFO!W66,\"Non requis\")","v":0},{"$f":"IF(COUNTRY_INFO!H66=1, IF($E66=1,$D66, 0),0)","v":0},{"$f":"IF(COUNTRY_INFO!I66=1, IF(AND(COUNTRY_INFO!$I66=1,$F66<>0),IF(COUNTRY_INFO!M66>=(COUNTRY_INFO!F66+COUNTRY_INFO!G66),COUNTRY_INFO!F66+COUNTRY_INFO!G66,COUNTRY_INFO!$M66), 0),0)","v":0},0,0,0,0,null,0]
[{"$f":"IF(INTRO!$E$39=\"Non endémique\",\" \",IF(COUNTRY_INFO!A67=0,\" \",COUNTRY_INFO!A67))","v":"SENEGAL"},{"$f":"IF(INTRO!$E$39=\"Non endémique\",\" \",IF(COUNTRY_INFO!B67=0,\" \",COUNTRY_INFO!B67))","v":"Sédhiou"},{"$f":"IF(INTRO!$E$39=\"Non endémique\",\" \",IF(COUNTRY_INFO!C67=0,\" \",COUNTRY_INFO!C67))","v":"Sedhiou"},{"$f":"IF(INTRO!$E$39=\"Non endémique\",0,IF(INTRO!$E$39=\"Endémique mais pas de CP\",IF(COUNTRY_INFO!$H67=1,COUNTRY_INFO!F67+COUNTRY_INFO!G67,0),IF(COUNTRY_INFO!$H67=1,COUNTRY_INFO!F67+COUNTRY_INFO!G67,IF(COUNTRY_INFO!$I67=1,IF(COUNTRY_INFO!M67>=(COUNTRY_INFO!F67+COUNTRY_INFO!G67),COUNTRY_INFO!F67+COUNTRY_INFO!G67,COUNTRY_INFO!$M67),0))))","v":0},{"$f":"IF(AND(INTRO!$E$39=\"Non endémique\",INTRO!$E$37=\"Non endémique\"),\"Non requis\",IF(INTRO!$E$39=\"Non endémique\",\"Traiter avec DEC\",COUNTRY_INFO!V67))","v":0},{"$f":"IF(INTRO!$E$39<>\"Non endémique\",COUNTRY_INFO!W67,\"Non requis\")","v":0},{"$f":"IF(COUNTRY_INFO!H67=1, IF($E67=1,$D67, 0),0)","v":0},{"$f":"IF(COUNTRY_INFO!I67=1, IF(AND(COUNTRY_INFO!$I67=1,$F67<>0),IF(COUNTRY_INFO!M67>=(COUNTRY_INFO!F67+COUNTRY_INFO!G67),COUNTRY_INFO!F67+COUNTRY_INFO!G67,COUNTRY_INFO!$M67), 0),0)","v":0},0,0,0,0,null,0]
[{"$f":"IF(INTRO!$E$39=\"Non endémique\",\" \",IF(COUNTRY_INFO!A68=0,\" \",COUNTRY_INFO!A68))","v":"SENEGAL"},{"$f":"IF(INTRO!$E$39=\"Non endémique\",\" \",IF(COUNTRY_INFO!B68=0,\" \",COUNTRY_INFO!B68))","v":"Tambacounda"},{"$f":"IF(INTRO!$E$39=\"Non endémique\",\" \",IF(COUNTRY_INFO!C68=0,\" \",COUNTRY_INFO!C68))","v":"Bakel"},{"$f":"IF(INTRO!$E$39=\"Non endémique\",0,IF(INTRO!$E$39=\"Endémique mais pas de CP\",IF(COUNTRY_INFO!$H68=1,COUNTRY_INFO!F68+COUNTRY_INFO!G68,0),IF(COUNTRY_INFO!$H68=1,COUNTRY_INFO!F68+COUNTRY_INFO!G68,IF(COUNTRY_INFO!$I68=1,IF(COUNTRY_INFO!M68>=(COUNTRY_INFO!F68+COUNTRY_INFO!G68),COUNTRY_INFO!F68+COUNTRY_INFO!G68,COUNTRY_INFO!$M68),0))))","v":0},{"$f":"IF(AND(INTRO!$E$39=\"Non endémique\",INTRO!$E$37=\"Non endémique\"),\"Non requis\",IF(INTRO!$E$39=\"Non endémique\",\"Traiter avec DEC\",COUNTRY_INFO!V68))","v":0},{"$f":"IF(INTRO!$E$39<>\"Non endémique\",COUNTRY_INFO!W68,\"Non requis\")","v":0},{"$f":"IF(COUNTRY_INFO!H68=1, IF($E68=1,$D68, 0),0)","v":0},{"$f":"IF(COUNTRY_INFO!I68=1, IF(AND(COUNTRY_INFO!$I68=1,$F68<>0),IF(COUNTRY_INFO!M68>=(COUNTRY_INFO!F68+COUNTRY_INFO!G68),COUNTRY_INFO!F68+COUNTRY_INFO!G68,COUNTRY_INFO!$M68), 0),0)","v":0},0,0,0,0,null,0]
[{"$f":"IF(INTRO!$E$39=\"Non endémique\",\" \",IF(COUNTRY_INFO!A69=0,\" \",COUNTRY_INFO!A69))","v":"SENEGAL"},{"$f":"IF(INTRO!$E$39=\"Non endémique\",\" \",IF(COUNTRY_INFO!B69=0,\" \",COUNTRY_INFO!B69))","v":"Tambacounda"},{"$f":"IF(INTRO!$E$39=\"Non endémique\",\" \",IF(COUNTRY_INFO!C69=0,\" \",COUNTRY_INFO!C69))","v":"Kidira"},{"$f":"IF(INTRO!$E$39=\"Non endémique\",0,IF(INTRO!$E$39=\"Endémique mais pas de CP\",IF(COUNTRY_INFO!$H69=1,COUNTRY_INFO!F69+COUNTRY_INFO!G69,0),IF(COUNTRY_INFO!$H69=1,COUNTRY_INFO!F69+COUNTRY_INFO!G69,IF(COUNTRY_INFO!$I69=1,IF(COUNTRY_INFO!M69>=(COUNTRY_INFO!F69+COUNTRY_INFO!G69),COUNTRY_INFO!F69+COUNTRY_INFO!G69,COUNTRY_INFO!$M69),0))))","v":0},{"$f":"IF(AND(INTRO!$E$39=\"Non endémique\",INTRO!$E$37=\"Non endémique\"),\"Non requis\",IF(INTRO!$E$39=\"Non endémique\",\"Traiter avec DEC\",COUNTRY_INFO!V69))","v":0},{"$f":"IF(INTRO!$E$39<>\"Non endémique\",COUNTRY_INFO!W69,\"Non requis\")","v":0},{"$f":"IF(COUNTRY_INFO!H69=1, IF($E69=1,$D69, 0),0)","v":0},{"$f":"IF(COUNTRY_INFO!I69=1, IF(AND(COUNTRY_INFO!$I69=1,$F69<>0),IF(COUNTRY_INFO!M69>=(COUNTRY_INFO!F69+COUNTRY_INFO!G69),COUNTRY_INFO!F69+COUNTRY_INFO!G69,COUNTRY_INFO!$M69), 0),0)","v":0},0,0,0,0,null,0]
[{"$f":"IF(INTRO!$E$39=\"Non endémique\",\" \",IF(COUNTRY_INFO!A70=0,\" \",COUNTRY_INFO!A70))","v":"SENEGAL"},{"$f":"IF(INTRO!$E$39=\"Non endémique\",\" \",IF(COUNTRY_INFO!B70=0,\" \",COUNTRY_INFO!B70))","v":"Tambacounda"},{"$f":"IF(INTRO!$E$39=\"Non endémique\",\" \",IF(COUNTRY_INFO!C70=0,\" \",COUNTRY_INFO!C70))","v":"Goudiry"},{"$f":"IF(INTRO!$E$39=\"Non endémique\",0,IF(INTRO!$E$39=\"Endémique mais pas de CP\",IF(COUNTRY_INFO!$H70=1,COUNTRY_INFO!F70+COUNTRY_INFO!G70,0),IF(COUNTRY_INFO!$H70=1,COUNTRY_INFO!F70+COUNTRY_INFO!G70,IF(COUNTRY_INFO!$I70=1,IF(COUNTRY_INFO!M70>=(COUNTRY_INFO!F70+COUNTRY_INFO!G70),COUNTRY_INFO!F70+COUNTRY_INFO!G70,COUNTRY_INFO!$M70),0))))","v":0},{"$f":"IF(AND(INTRO!$E$39=\"Non endémique\",INTRO!$E$37=\"Non endémique\"),\"Non requis\",IF(INTRO!$E$39=\"Non endémique\",\"Traiter avec DEC\",COUNTRY_INFO!V70))","v":0},{"$f":"IF(INTRO!$E$39<>\"Non endémique\",COUNTRY_INFO!W70,\"Non requis\")","v":0},{"$f":"IF(COUNTRY_INFO!H70=1, IF($E70=1,$D70, 0),0)","v":0},{"$f":"IF(COUNTRY_INFO!I70=1, IF(AND(COUNTRY_INFO!$I70=1,$F70<>0),IF(COUNTRY_INFO!M70>=(COUNTRY_INFO!F70+COUNTRY_INFO!G70),COUNTRY_INFO!F70+COUNTRY_INFO!G70,COUNTRY_INFO!$M70), 0),0)","v":0},0,0,0,0,null,0]
[{"$f":"IF(INTRO!$E$39=\"Non endémique\",\" \",IF(COUNTRY_INFO!A71=0,\" \",COUNTRY_INFO!A71))","v":"SENEGAL"},{"$f":"IF(INTRO!$E$39=\"Non endémique\",\" \",IF(COUNTRY_INFO!B71=0,\" \",COUNTRY_INFO!B71))","v":"Tambacounda"},{"$f":"IF(INTRO!$E$39=\"Non endémique\",\" \",IF(COUNTRY_INFO!C71=0,\" \",COUNTRY_INFO!C71))","v":"Dianke Makha"},{"$f":"IF(INTRO!$E$39=\"Non endémique\",0,IF(INTRO!$E$39=\"Endémique mais pas de CP\",IF(COUNTRY_INFO!$H71=1,COUNTRY_INFO!F71+COUNTRY_INFO!G71,0),IF(COUNTRY_INFO!$H71=1,COUNTRY_INFO!F71+COUNTRY_INFO!G71,IF(COUNTRY_INFO!$I71=1,IF(COUNTRY_INFO!M71>=(COUNTRY_INFO!F71+COUNTRY_INFO!G71),COUNTRY_INFO!F71+COUNTRY_INFO!G71,COUNTRY_INFO!$M71),0))))","v":0},{"$f":"IF(AND(INTRO!$E$39=\"Non endémique\",INTRO!$E$37=\"Non endémique\"),\"Non requis\",IF(INTRO!$E$39=\"Non endémique\",\"Traiter avec DEC\",COUNTRY_INFO!V71))","v":0},{"$f":"IF(INTRO!$E$39<>\"Non endémique\",COUNTRY_INFO!W71,\"Non requis\")","v":0},{"$f":"IF(COUNTRY_INFO!H71=1, IF($E71=1,$D71, 0),0)","v":0},{"$f":"IF(COUNTRY_INFO!I71=1, IF(AND(COUNTRY_INFO!$I71=1,$F71<>0),IF(COUNTRY_INFO!M71>=(COUNTRY_INFO!F71+COUNTRY_INFO!G71),COUNTRY_INFO!F71+COUNTRY_INFO!G71,COUNTRY_INFO!$M71), 0),0)","v":0},0,0,0,0,null,0]
[{"$f":"IF(INTRO!$E$39=\"Non endémique\",\" \",IF(COUNTRY_INFO!A72=0,\" \",COUNTRY_INFO!A72))","v":"SENEGAL"},{"$f":"IF(INTRO!$E$39=\"Non endémique\",\" \",IF(COUNTRY_INFO!B72=0,\" \",COUNTRY_INFO!B72))","v":"Tambacounda"},{"$f":"IF(INTRO!$E$39=\"Non endémique\",\" \",IF(COUNTRY_INFO!C72=0,\" \",COUNTRY_INFO!C72))","v":"Koumpentoum"},{"$f":"IF(INTRO!$E$39=\"Non endémique\",0,IF(INTRO!$E$39=\"Endémique mais pas de CP\",IF(COUNTRY_INFO!$H72=1,COUNTRY_INFO!F72+COUNTRY_INFO!G72,0),IF(COUNTRY_INFO!$H72=1,COUNTRY_INFO!F72+COUNTRY_INFO!G72,IF(COUNTRY_INFO!$I72=1,IF(COUNTRY_INFO!M72>=(COUNTRY_INFO!F72+COUNTRY_INFO!G72),COUNTRY_INFO!F72+COUNTRY_INFO!G72,COUNTRY_INFO!$M72),0))))","v":0},{"$f":"IF(AND(INTRO!$E$39=\"Non endémique\",INTRO!$E$37=\"Non endémique\"),\"Non requis\",IF(INTRO!$E$39=\"Non endémique\",\"Traiter avec DEC\",COUNTRY_INFO!V72))","v":0},{"$f":"IF(INTRO!$E$39<>\"Non endémique\",COUNTRY_INFO!W72,\"Non requis\")","v":0},{"$f":"IF(COUNTRY_INFO!H72=1, IF($E72=1,$D72, 0),0)","v":0},{"$f":"IF(COUNTRY_INFO!I72=1, IF(AND(COUNTRY_INFO!$I72=1,$F72<>0),IF(COUNTRY_INFO!M72>=(COUNTRY_INFO!F72+COUNTRY_INFO!G72),COUNTRY_INFO!F72+COUNTRY_INFO!G72,COUNTRY_INFO!$M72), 0),0)","v":0},0,0,0,0,null,0]
[{"$f":"IF(INTRO!$E$39=\"Non endémique\",\" \",IF(COUNTRY_INFO!A73=0,\" \",COUNTRY_INFO!A73))","v":"SENEGAL"},{"$f":"IF(INTRO!$E$39=\"Non endémique\",\" \",IF(COUNTRY_INFO!B73=0,\" \",COUNTRY_INFO!B73))","v":"Tambacounda"},{"$f":"IF(INTRO!$E$39=\"Non endémique\",\" \",IF(COUNTRY_INFO!C73=0,\" \",COUNTRY_INFO!C73))","v":"Tambacounda"},{"$f":"IF(INTRO!$E$39=\"Non endémique\",0,IF(INTRO!$E$39=\"Endémique mais pas de CP\",IF(COUNTRY_INFO!$H73=1,COUNTRY_INFO!F73+COUNTRY_INFO!G73,0),IF(COUNTRY_INFO!$H73=1,COUNTRY_INFO!F73+COUNTRY_INFO!G73,IF(COUNTRY_INFO!$I73=1,IF(COUNTRY_INFO!M73>=(COUNTRY_INFO!F73+COUNTRY_INFO!G73),COUNTRY_INFO!F73+COUNTRY_INFO!G73,COUNTRY_INFO!$M73),0))))","v":0},{"$f":"IF(AND(INTRO!$E$39=\"Non endémique\",INTRO!$E$37=\"Non endémique\"),\"Non requis\",IF(INTRO!$E$39=\"Non endémique\",\"Traiter avec DEC\",COUNTRY_INFO!V73))","v":0},{"$f":"IF(INTRO!$E$39<>\"Non endémique\",COUNTRY_INFO!W73,\"Non requis\")","v":0},{"$f":"IF(COUNTRY_INFO!H73=1, IF($E73=1,$D73, 0),0)","v":0},{"$f":"IF(COUNTRY_INFO!I73=1, IF(AND(COUNTRY_INFO!$I73=1,$F73<>0),IF(COUNTRY_INFO!M73>=(COUNTRY_INFO!F73+COUNTRY_INFO!G73),COUNTRY_INFO!F73+COUNTRY_INFO!G73,COUNTRY_INFO!$M73), 0),0)","v":0},0,0,0,0,null,0]
[{"$f":"IF(INTRO!$E$39=\"Non endémique\",\" \",IF(COUNTRY_INFO!A74=0,\" \",COUNTRY_INFO!A74))","v":"SENEGAL"},{"$f":"IF(INTRO!$E$39=\"Non endémique\",\" \",IF(COUNTRY_INFO!B74=0,\" \",COUNTRY_INFO!B74))","v":"Tambacounda"},{"$f":"IF(INTRO!$E$39=\"Non endémique\",\" \",IF(COUNTRY_INFO!C74=0,\" \",COUNTRY_INFO!C74))","v":"Maka Colibantang"},{"$f":"IF(INTRO!$E$39=\"Non endémique\",0,IF(INTRO!$E$39=\"Endémique mais pas de CP\",IF(COUNTRY_INFO!$H74=1,COUNTRY_INFO!F74+COUNTRY_INFO!G74,0),IF(COUNTRY_INFO!$H74=1,COUNTRY_INFO!F74+COUNTRY_INFO!G74,IF(COUNTRY_INFO!$I74=1,IF(COUNTRY_INFO!M74>=(COUNTRY_INFO!F74+COUNTRY_INFO!G74),COUNTRY_INFO!F74+COUNTRY_INFO!G74,COUNTRY_INFO!$M74),0))))","v":0},{"$f":"IF(AND(INTRO!$E$39=\"Non endémique\",INTRO!$E$37=\"Non endémique\"),\"Non requis\",IF(INTRO!$E$39=\"Non endémique\",\"Traiter avec DEC\",COUNTRY_INFO!V74))","v":0},{"$f":"IF(INTRO!$E$39<>\"Non endémique\",COUNTRY_INFO!W74,\"Non requis\")","v":0},{"$f":"IF(COUNTRY_INFO!H74=1, IF($E74=1,$D74, 0),0)","v":0},{"$f":"IF(COUNTRY_INFO!I74=1, IF(AND(COUNTRY_INFO!$I74=1,$F74<>0),IF(COUNTRY_INFO!M74>=(COUNTRY_INFO!F74+COUNTRY_INFO!G74),COUNTRY_INFO!F74+COUNTRY_INFO!G74,COUNTRY_INFO!$M74), 0),0)","v":0},{"$f":"IF(G74<H74,0,IF($E74=1, (G74-H74)*2.8, 0))","v":0},{"$f":"IF($E74<$F74, H74*(F74-E74)*2.8, 0)","v":0},0,0,null,0]
[{"$f":"IF(INTRO!$E$39=\"Non endémique\",\" \",IF(COUNTRY_INFO!A75=0,\" \",COUNTRY_INFO!A75))","v":"SENEGAL"},{"$f":"IF(INTRO!$E$39=\"Non endémique\",\" \",IF(COUNTRY_INFO!B75=0,\" \",COUNTRY_INFO!B75))","v":"Thiès"},{"$f":"IF(INTRO!$E$39=\"Non endémique\",\" \",IF(COUNTRY_INFO!C75=0,\" \",COUNTRY_INFO!C75))","v":"Joal-Fadhiouth"},{"$f":"IF(INTRO!$E$39=\"Non endémique\",0,IF(INTRO!$E$39=\"Endémique mais pas de CP\",IF(COUNTRY_INFO!$H75=1,COUNTRY_INFO!F75+COUNTRY_INFO!G75,0),IF(COUNTRY_INFO!$H75=1,COUNTRY_INFO!F75+COUNTRY_INFO!G75,IF(COUNTRY_INFO!$I75=1,IF(COUNTRY_INFO!M75>=(COUNTRY_INFO!F75+COUNTRY_INFO!G75),COUNTRY_INFO!F75+COUNTRY_INFO!G75,COUNTRY_INFO!$M75),0))))","v":0},{"$f":"IF(AND(INTRO!$E$39=\"Non endémique\",INTRO!$E$37=\"Non endémique\"),\"Non requis\",IF(INTRO!$E$39=\"Non endémique\",\"Traiter avec DEC\",COUNTRY_INFO!V75))","v":0},{"$f":"IF(INTRO!$E$39<>\"Non endémique\",COUNTRY_INFO!W75,\"Non requis\")","v":0},{"$f":"IF(COUNTRY_INFO!H75=1, IF($E75=1,$D75, 0),0)","v":0},{"$f":"IF(COUNTRY_INFO!I75=1, IF(AND(COUNTRY_INFO!$I75=1,$F75<>0),IF(COUNTRY_INFO!M75>=(COUNTRY_INFO!F75+COUNTRY_INFO!G75),COUNTRY_INFO!F75+COUNTRY_INFO!G75,COUNTRY_INFO!$M75), 0),0)","v":0},0,0,{"$f":"IF(AND($E75=1, $F75<>0), H75*2.8, 0)","v":0},{"$f":"SUM(I75:K75)","v":0},null,0]
[{"$f":"IF(INTRO!$E$39=\"Non endémique\",\" \",IF(COUNTRY_INFO!A76=0,\" \",COUNTRY_INFO!A76))","v":"SENEGAL"},{"$f":"IF(INTRO!$E$39=\"Non endémique\",\" \",IF(COUNTRY_INFO!B76=0,\" \",COUNTRY_INFO!B76))","v":"Thiès"},{"$f":"IF(INTRO!$E$39=\"Non endémique\",\" \",IF(COUNTRY_INFO!C76=0,\" \",COUNTRY_INFO!C76))","v":"Mbour"},{"$f":"IF(INTRO!$E$39=\"Non endémique\",0,IF(INTRO!$E$39=\"Endémique mais pas de CP\",IF(COUNTRY_INFO!$H76=1,COUNTRY_INFO!F76+COUNTRY_INFO!G76,0),IF(COUNTRY_INFO!$H76=1,COUNTRY_INFO!F76+COUNTRY_INFO!G76,IF(COUNTRY_INFO!$I76=1,IF(COUNTRY_INFO!M76>=(COUNTRY_INFO!F76+COUNTRY_INFO!G76),COUNTRY_INFO!F76+COUNTRY_INFO!G76,COUNTRY_INFO!$M76),0))))","v":0},{"$f":"IF(AND(INTRO!$E$39=\"Non endémique\",INTRO!$E$37=\"Non endémique\"),\"Non requis\",IF(INTRO!$E$39=\"Non endémique\",\"Traiter avec DEC\",COUNTRY_INFO!V76))","v":0},{"$f":"IF(INTRO!$E$39<>\"Non endémique\",COUNTRY_INFO!W76,\"Non requis\")","v":0},{"$f":"IF(COUNTRY_INFO!H76=1, IF($E76=1,$D76, 0),0)","v":0},{"$f":"IF(COUNTRY_INFO!I76=1, IF(AND(COUNTRY_INFO!$I76=1,$F76<>0),IF(COUNTRY_INFO!M76>=(COUNTRY_INFO!F76+COUNTRY_INFO!G76),COUNTRY_INFO!F76+COUNTRY_INFO!G76,COUNTRY_INFO!$M76), 0),0)","v":0},0,0,0,0,null,0]
[{"$f":"IF(INTRO!$E$39=\"Non endémique\",\" \",IF(COUNTRY_INFO!A77=0,\" \",COUNTRY_INFO!A77))","v":"SENEGAL"},{"$f":"IF(INTRO!$E$39=\"Non endémique\",\" \",IF(COUNTRY_INFO!B77=0,\" \",COUNTRY_INFO!B77))","v":"Thiès"},{"$f":"IF(INTRO!$E$39=\"Non endémique\",\" \",IF(COUNTRY_INFO!C77=0,\" \",COUNTRY_INFO!C77))","v":"Popenguine"},{"$f":"IF(INTRO!$E$39=\"Non endémique\",0,IF(INTRO!$E$39=\"Endémique mais pas de CP\",IF(COUNTRY_INFO!$H77=1,COUNTRY_INFO!F77+COUNTRY_INFO!G77,0),IF(COUNTRY_INFO!$H77=1,COUNTRY_INFO!F77+COUNTRY_INFO!G77,IF(COUNTRY_INFO!$I77=1,IF(COUNTRY_INFO!M77>=(COUNTRY_INFO!F77+COUNTRY_INFO!G77),COUNTRY_INFO!F77+COUNTRY_INFO!G77,COUNTRY_INFO!$M77),0))))","v":0},{"$f":"IF(AND(INTRO!$E$39=\"Non endémique\",INTRO!$E$37=\"Non endémique\"),\"Non requis\",IF(INTRO!$E$39=\"Non endémique\",\"Traiter avec DEC\",COUNTRY_INFO!V77))","v":0},{"$f":"IF(INTRO!$E$39<>\"Non endémique\",COUNTRY_INFO!W77,\"Non requis\")","v":0},{"$f":"IF(COUNTRY_INFO!H77=1, IF($E77=1,$D77, 0),0)","v":0},{"$f":"IF(COUNTRY_INFO!I77=1, IF(AND(COUNTRY_INFO!$I77=1,$F77<>0),IF(COUNTRY_INFO!M77>=(COUNTRY_INFO!F77+COUNTRY_INFO!G77),COUNTRY_INFO!F77+COUNTRY_INFO!G77,COUNTRY_INFO!$M77), 0),0)","v":0},0,0,0,0,null,0]
[{"$f":"IF(INTRO!$E$39=\"Non endémique\",\" \",IF(COUNTRY_INFO!A78=0,\" \",COUNTRY_INFO!A78))","v":"SENEGAL"},{"$f":"IF(INTRO!$E$39=\"Non endémique\",\" \",IF(COUNTRY_INFO!B78=0,\" \",COUNTRY_INFO!B78))","v":"Thiès"},{"$f":"IF(INTRO!$E$39=\"Non endémique\",\" \",IF(COUNTRY_INFO!C78=0,\" \",COUNTRY_INFO!C78))","v":"Thiadiaye"},{"$f":"IF(INTRO!$E$39=\"Non endémique\",0,IF(INTRO!$E$39=\"Endémique mais pas de CP\",IF(COUNTRY_INFO!$H78=1,COUNTRY_INFO!F78+COUNTRY_INFO!G78,0),IF(COUNTRY_INFO!$H78=1,COUNTRY_INFO!F78+COUNTRY_INFO!G78,IF(COUNTRY_INFO!$I78=1,IF(COUNTRY_INFO!M78>=(COUNTRY_INFO!F78+COUNTRY_INFO!G78),COUNTRY_INFO!F78+COUNTRY_INFO!G78,COUNTRY_INFO!$M78),0))))","v":0},{"$f":"IF(AND(INTRO!$E$39=\"Non endémique\",INTRO!$E$37=\"Non endémique\"),\"Non requis\",IF(INTRO!$E$39=\"Non endémique\",\"Traiter avec DEC\",COUNTRY_INFO!V78))","v":0},{"$f":"IF(INTRO!$E$39<>\"Non endémique\",COUNTRY_INFO!W78,\"Non requis\")","v":0},{"$f":"IF(COUNTRY_INFO!H78=1, IF($E78=1,$D78, 0),0)","v":0},{"$f":"IF(COUNTRY_INFO!I78=1, IF(AND(COUNTRY_INFO!$I78=1,$F78<>0),IF(COUNTRY_INFO!M78>=(COUNTRY_INFO!F78+COUNTRY_INFO!G78),COUNTRY_INFO!F78+COUNTRY_INFO!G78,COUNTRY_INFO!$M78), 0),0)","v":0},0,0,0,0,null,0]
[{"$f":"IF(INTRO!$E$39=\"Non endémique\",\" \",IF(COUNTRY_INFO!A79=0,\" \",COUNTRY_INFO!A79))","v":"SENEGAL"},{"$f":"IF(INTRO!$E$39=\"Non endémique\",\" \",IF(COUNTRY_INFO!B79=0,\" \",COUNTRY_INFO!B79))","v":"Thiès"},{"$f":"IF(INTRO!$E$39=\"Non endémique\",\" \",IF(COUNTRY_INFO!C79=0,\" \",COUNTRY_INFO!C79))","v":"Pout"},{"$f":"IF(INTRO!$E$39=\"Non endémique\",0,IF(INTRO!$E$39=\"Endémique mais pas de CP\",IF(COUNTRY_INFO!$H79=1,COUNTRY_INFO!F79+COUNTRY_INFO!G79,0),IF(COUNTRY_INFO!$H79=1,COUNTRY_INFO!F79+COUNTRY_INFO!G79,IF(COUNTRY_INFO!$I79=1,IF(COUNTRY_INFO!M79>=(COUNTRY_INFO!F79+COUNTRY_INFO!G79),COUNTRY_INFO!F79+COUNTRY_INFO!G79,COUNTRY_INFO!$M79),0))))","v":0},{"$f":"IF(AND(INTRO!$E$39=\"Non endémique\",INTRO!$E$37=\"Non endémique\"),\"Non requis\",IF(INTRO!$E$39=\"Non endémique\",\"Traiter avec DEC\",COUNTRY_INFO!V79))","v":0},{"$f":"IF(INTRO!$E$39<>\"Non endémique\",COUNTRY_INFO!W79,\"Non requis\")","v":0},{"$f":"IF(COUNTRY_INFO!H79=1, IF($E79=1,$D79, 0),0)","v":0},{"$f":"IF(COUNTRY_INFO!I79=1, IF(AND(COUNTRY_INFO!$I79=1,$F79<>0),IF(COUNTRY_INFO!M79>=(COUNTRY_INFO!F79+COUNTRY_INFO!G79),COUNTRY_INFO!F79+COUNTRY_INFO!G79,COUNTRY_INFO!$M79), 0),0)","v":0},0,0,0,0,null,0]
[{"$f":"IF(INTRO!$E$39=\"Non endémique\",\" \",IF(COUNTRY_INFO!A80=0,\" \",COUNTRY_INFO!A80))","v":"SENEGAL"},{"$f":"IF(INTRO!$E$39=\"Non endémique\",\" \",IF(COUNTRY_INFO!B80=0,\" \",COUNTRY_INFO!B80))","v":"Thiès"},{"$f":"IF(INTRO!$E$39=\"Non endémique\",\" \",IF(COUNTRY_INFO!C80=0,\" \",COUNTRY_INFO!C80))","v":"Thiès"},{"$f":"IF(INTRO!$E$39=\"Non endémique\",0,IF(INTRO!$E$39=\"Endémique mais pas de CP\",IF(COUNTRY_INFO!$H80=1,COUNTRY_INFO!F80+COUNTRY_INFO!G80,0),IF(COUNTRY_INFO!$H80=1,COUNTRY_INFO!F80+COUNTRY_INFO!G80,IF(COUNTRY_INFO!$I80=1,IF(COUNTRY_INFO!M80>=(COUNTRY_INFO!F80+COUNTRY_INFO!G80),COUNTRY_INFO!F80+COUNTRY_INFO!G80,COUNTRY_INFO!$M80),0))))","v":0},{"$f":"IF(AND(INTRO!$E$39=\"Non endémique\",INTRO!$E$37=\"Non endémique\"),\"Non requis\",IF(INTRO!$E$39=\"Non endémique\",\"Traiter avec DEC\",COUNTRY_INFO!V80))","v":0},{"$f":"IF(INTRO!$E$39<>\"Non endémique\",COUNTRY_INFO!W80,\"Non requis\")","v":0},{"$f":"IF(COUNTRY_INFO!H80=1, IF($E80=1,$D80, 0),0)","v":0},{"$f":"IF(COUNTRY_INFO!I80=1, IF(AND(COUNTRY_INFO!$I80=1,$F80<>0),IF(COUNTRY_INFO!M80>=(COUNTRY_INFO!F80+COUNTRY_INFO!G80),COUNTRY_INFO!F80+COUNTRY_INFO!G80,COUNTRY_INFO!$M80), 0),0)","v":0},0,0,0,0,null,0]
[{"$f":"IF(INTRO!$E$39=\"Non endémique\",\" \",IF(COUNTRY_INFO!A81=0,\" \",COUNTRY_INFO!A81))","v":"SENEGAL"},{"$f":"IF(INTRO!$E$39=\"Non endémique\",\" \",IF(COUNTRY_INFO!B81=0,\" \",COUNTRY_INFO!B81))","v":"Thiès"},{"$f":"IF(INTRO!$E$39=\"Non endémique\",\" \",IF(COUNTRY_INFO!C81=0,\" \",COUNTRY_INFO!C81))","v":"Khombole"},{"$f":"IF(INTRO!$E$39=\"Non endémique\",0,IF(INTRO!$E$39=\"Endémique mais pas de CP\",IF(COUNTRY_INFO!$H81=1,COUNTRY_INFO!F81+COUNTRY_INFO!G81,0),IF(COUNTRY_INFO!$H81=1,COUNTRY_INFO!F81+COUNTRY_INFO!G81,IF(COUNTRY_INFO!$I81=1,IF(COUNTRY_INFO!M81>=(COUNTRY_INFO!F81+COUNTRY_INFO!G81),COUNTRY_INFO!F81+COUNTRY_INFO!G81,COUNTRY_INFO!$M81),0))))","v":0},{"$f":"IF(AND(INTRO!$E$39=\"Non endémique\",INTRO!$E$37=\"Non endémique\"),\"Non requis\",IF(INTRO!$E$39=\"Non endémique\",\"Traiter avec DEC\",COUNTRY_INFO!V81))","v":0},{"$f":"IF(INTRO!$E$39<>\"Non endémique\",COUNTRY_INFO!W81,\"Non requis\")","v":0},{"$f":"IF(COUNTRY_INFO!H81=1, IF($E81=1,$D81, 0),0)","v":0},{"$f":"IF(COUNTRY_INFO!I81=1, IF(AND(COUNTRY_INFO!$I81=1,$F81<>0),IF(COUNTRY_INFO!M81>=(COUNTRY_INFO!F81+COUNTRY_INFO!G81),COUNTRY_INFO!F81+COUNTRY_INFO!G81,COUNTRY_INFO!$M81), 0),0)","v":0},0,0,0,0,null,0]
[{"$f":"IF(INTRO!$E$39=\"Non endémique\",\" \",IF(COUNTRY_INFO!A82=0,\" \",COUNTRY_INFO!A82))","v":"SENEGAL"},{"$f":"IF(INTRO!$E$39=\"Non endémique\",\" \",IF(COUNTRY_INFO!B82=0,\" \",COUNTRY_INFO!B82))","v":"Thiès"},{"$f":"IF(INTRO!$E$39=\"Non endémique\",\" \",IF(COUNTRY_INFO!C82=0,\" \",COUNTRY_INFO!C82))","v":"Tivaouane"},{"$f":"IF(INTRO!$E$39=\"Non endémique\",0,IF(INTRO!$E$39=\"Endémique mais pas de CP\",IF(COUNTRY_INFO!$H82=1,COUNTRY_INFO!F82+COUNTRY_INFO!G82,0),IF(COUNTRY_INFO!$H82=1,COUNTRY_INFO!F82+COUNTRY_INFO!G82,IF(COUNTRY_INFO!$I82=1,IF(COUNTRY_INFO!M82>=(COUNTRY_INFO!F82+COUNTRY_INFO!G82),COUNTRY_INFO!F82+COUNTRY_INFO!G82,COUNTRY_INFO!$M82),0))))","v":0},{"$f":"IF(AND(INTRO!$E$39=\"Non endémique\",INTRO!$E$37=\"Non endémique\"),\"Non requis\",IF(INTRO!$E$39=\"Non endémique\",\"Traiter avec DEC\",COUNTRY_INFO!V82))","v":0},{"$f":"IF(INTRO!$E$39<>\"Non endémique\",COUNTRY_INFO!W82,\"Non requis\")","v":0},{"$f":"IF(COUNTRY_INFO!H82=1, IF($E82=1,$D82, 0),0)","v":0},{"$f":"IF(COUNTRY_INFO!I82=1, IF(AND(COUNTRY_INFO!$I82=1,$F82<>0),IF(COUNTRY_INFO!M82>=(COUNTRY_INFO!F82+COUNTRY_INFO!G82),COUNTRY_INFO!F82+COUNTRY_INFO!G82,COUNTRY_INFO!$M82), 0),0)","v":0},0,0,0,0,null,0]
[{"$f":"IF(INTRO!$E$39=\"Non endémique\",\" \",IF(COUNTRY_INFO!A83=0,\" \",COUNTRY_INFO!A83))","v":"SENEGAL"},{"$f":"IF(INTRO!$E$39=\"Non endémique\",\" \",IF(COUNTRY_INFO!B83=0,\" \",COUNTRY_INFO!B83))","v":"Thiès"},{"$f":"IF(INTRO!$E$39=\"Non endémique\",\" \",IF(COUNTRY_INFO!C83=0,\" \",COUNTRY_INFO!C83))","v":"Mékhé"},{"$f":"IF(INTRO!$E$39=\"Non endémique\",0,IF(INTRO!$E$39=\"Endémique mais pas de CP\",IF(COUNTRY_INFO!$H83=1,COUNTRY_INFO!F83+COUNTRY_INFO!G83,0),IF(COUNTRY_INFO!$H83=1,COUNTRY_INFO!F83+COUNTRY_INFO!G83,IF(COUNTRY_INFO!$I83=1,IF(COUNTRY_INFO!M83>=(COUNTRY_INFO!F83+COUNTRY_INFO!G83),COUNTRY_INFO!F83+COUNTRY_INFO!G83,COUNTRY_INFO!$M83),0))))","v":0},{"$f":"IF(AND(INTRO!$E$39=\"Non endémique\",INTRO!$E$37=\"Non endémique\"),\"Non requis\",IF(INTRO!$E$39=\"Non endémique\",\"Traiter avec DEC\",COUNTRY_INFO!V83))","v":0},{"$f":"IF(INTRO!$E$39<>\"Non endémique\",COUNTRY_INFO!W83,\"Non requis\")","v":0},{"$f":"IF(COUNTRY_INFO!H83=1, IF($E83=1,$D83, 0),0)","v":0},{"$f":"IF(COUNTRY_INFO!I83=1, IF(AND(COUNTRY_INFO!$I83=1,$F83<>0),IF(COUNTRY_INFO!M83>=(COUNTRY_INFO!F83+COUNTRY_INFO!G83),COUNTRY_INFO!F83+COUNTRY_INFO!G83,COUNTRY_INFO!$M83), 0),0)","v":0},0,0,0,0,null,0]
[{"$f":"IF(INTRO!$E$39=\"Non endémique\",\" \",IF(COUNTRY_INFO!A84=0,\" \",COUNTRY_INFO!A84))","v":"SENEGAL"},{"$f":"IF(INTRO!$E$39=\"Non endémique\",\" \",IF(COUNTRY_INFO!B84=0,\" \",COUNTRY_INFO!B84))","v":"Ziguinchor"},{"$f":"IF(INTRO!$E$39=\"Non endémique\",\" \",IF(COUNTRY_INFO!C84=0,\" \",COUNTRY_INFO!C84))","v":"Diouloulou"},{"$f":"IF(INTRO!$E$39=\"Non endémique\",0,IF(INTRO!$E$39=\"Endémique mais pas de CP\",IF(COUNTRY_INFO!$H84=1,COUNTRY_INFO!F84+COUNTRY_INFO!G84,0),IF(COUNTRY_INFO!$H84=1,COUNTRY_INFO!F84+COUNTRY_INFO!G84,IF(COUNTRY_INFO!$I84=1,IF(COUNTRY_INFO!M84>=(COUNTRY_INFO!F84+COUNTRY_INFO!G84),COUNTRY_INFO!F84+COUNTRY_INFO!G84,COUNTRY_INFO!$M84),0))))","v":0},{"$f":"IF(AND(INTRO!$E$39=\"Non endémique\",INTRO!$E$37=\"Non endémique\"),\"Non requis\",IF(INTRO!$E$39=\"Non endémique\",\"Traiter avec DEC\",COUNTRY_INFO!V84))","v":0},{"$f":"IF(INTRO!$E$39<>\"Non endémique\",COUNTRY_INFO!W84,\"Non requis\")","v":0},{"$f":"IF(COUNTRY_INFO!H84=1, IF($E84=1,$D84, 0),0)","v":0},{"$f":"IF(COUNTRY_INFO!I84=1, IF(AND(COUNTRY_INFO!$I84=1,$F84<>0),IF(COUNTRY_INFO!M84>=(COUNTRY_INFO!F84+COUNTRY_INFO!G84),COUNTRY_INFO!F84+COUNTRY_INFO!G84,COUNTRY_INFO!$M84), 0),0)","v":0},0,0,0,0,null,0]
[{"$f":"IF(INTRO!$E$39=\"Non endémique\",\" \",IF(COUNTRY_INFO!A85=0,\" \",COUNTRY_INFO!A85))","v":"SENEGAL"},{"$f":"IF(INTRO!$E$39=\"Non endémique\",\" \",IF(COUNTRY_INFO!B85=0,\" \",COUNTRY_INFO!B85))","v":"Ziguinchor"},{"$f":"IF(INTRO!$E$39=\"Non endémique\",\" \",IF(COUNTRY_INFO!C85=0,\" \",COUNTRY_INFO!C85))","v":"Bignona"},{"$f":"IF(INTRO!$E$39=\"Non endémique\",0,IF(INTRO!$E$39=\"Endémique mais pas de CP\",IF(COUNTRY_INFO!$H85=1,COUNTRY_INFO!F85+COUNTRY_INFO!G85,0),IF(COUNTRY_INFO!$H85=1,COUNTRY_INFO!F85+COUNTRY_INFO!G85,IF(COUNTRY_INFO!$I85=1,IF(COUNTRY_INFO!M85>=(COUNTRY_INFO!F85+COUNTRY_INFO!G85),COUNTRY_INFO!F85+COUNTRY_INFO!G85,COUNTRY_INFO!$M85),0))))","v":0},{"$f":"IF(AND(INTRO!$E$39=\"Non endémique\",INTRO!$E$37=\"Non endémique\"),\"Non requis\",IF(INTRO!$E$39=\"Non endémique\",\"Traiter avec DEC\",COUNTRY_INFO!V85))","v":0},{"$f":"IF(INTRO!$E$39<>\"Non endémique\",COUNTRY_INFO!W85,\"Non requis\")","v":0},{"$f":"IF(COUNTRY_INFO!H85=1, IF($E85=1,$D85, 0),0)","v":0},{"$f":"IF(COUNTRY_INFO!I85=1, IF(AND(COUNTRY_INFO!$I85=1,$F85<>0),IF(COUNTRY_INFO!M85>=(COUNTRY_INFO!F85+COUNTRY_INFO!G85),COUNTRY_INFO!F85+COUNTRY_INFO!G85,COUNTRY_INFO!$M85), 0),0)","v":0},0,0,0,0,null,0]
[{"$f":"IF(INTRO!$E$39=\"Non endémique\",\" \",IF(COUNTRY_INFO!A86=0,\" \",COUNTRY_INFO!A86))","v":"SENEGAL"},{"$f":"IF(INTRO!$E$39=\"Non endémique\",\" \",IF(COUNTRY_INFO!B86=0,\" \",COUNTRY_INFO!B86))","v":"Ziguinchor"},{"$f":"IF(INTRO!$E$39=\"Non endémique\",\" \",IF(COUNTRY_INFO!C86=0,\" \",COUNTRY_INFO!C86))","v":"Thionk Essyl"},{"$f":"IF(INTRO!$E$39=\"Non endémique\",0,IF(INTRO!$E$39=\"Endémique mais pas de CP\",IF(COUNTRY_INFO!$H86=1,COUNTRY_INFO!F86+COUNTRY_INFO!G86,0),IF(COUNTRY_INFO!$H86=1,COUNTRY_INFO!F86+COUNTRY_INFO!G86,IF(COUNTRY_INFO!$I86=1,IF(COUNTRY_INFO!M86>=(COUNTRY_INFO!F86+COUNTRY_INFO!G86),COUNTRY_INFO!F86+COUNTRY_INFO!G86,COUNTRY_INFO!$M86),0))))","v":0},{"$f":"IF(AND(INTRO!$E$39=\"Non endémique\",INTRO!$E$37=\"Non endémique\"),\"Non requis\",IF(INTRO!$E$39=\"Non endémique\",\"Traiter avec DEC\",COUNTRY_INFO!V86))","v":0},{"$f":"IF(INTRO!$E$39<>\"Non endémique\",COUNTRY_INFO!W86,\"Non requis\")","v":0},{"$f":"IF(COUNTRY_INFO!H86=1, IF($E86=1,$D86, 0),0)","v":0},{"$f":"IF(COUNTRY_INFO!I86=1, IF(AND(COUNTRY_INFO!$I86=1,$F86<>0),IF(COUNTRY_INFO!M86>=(COUNTRY_INFO!F86+COUNTRY_INFO!G86),COUNTRY_INFO!F86+COUNTRY_INFO!G86,COUNTRY_INFO!$M86), 0),0)","v":0},0,0,0,0,null,0]
[{"$f":"IF(INTRO!$E$39=\"Non endémique\",\" \",IF(COUNTRY_INFO!A87=0,\" \",COUNTRY_INFO!A87))","v":"SENEGAL"},{"$f":"IF(INTRO!$E$39=\"Non endémique\",\" \",IF(COUNTRY_INFO!B87=0,\" \",COUNTRY_INFO!B87))","v":"Ziguinchor"},{"$f":"IF(INTRO!$E$39=\"Non endémique\",\" \",IF(COUNTRY_INFO!C87=0,\" \",COUNTRY_INFO!C87))","v":"Oussouye"},{"$f":"IF(INTRO!$E$39=\"Non endémique\",0,IF(INTRO!$E$39=\"Endémique mais pas de CP\",IF(COUNTRY_INFO!$H87=1,COUNTRY_INFO!F87+COUNTRY_INFO!G87,0),IF(COUNTRY_INFO!$H87=1,COUNTRY_INFO!F87+COUNTRY_INFO!G87,IF(COUNTRY_INFO!$I87=1,IF(COUNTRY_INFO!M87>=(COUNTRY_INFO!F87+COUNTRY_INFO!G87),COUNTRY_INFO!F87+COUNTRY_INFO!G87,COUNTRY_INFO!$M87),0))))","v":0},{"$f":"IF(AND(INTRO!$E$39=\"Non endémique\",INTRO!$E$37=\"Non endémique\"),\"Non requis\",IF(INTRO!$E$39=\"Non endémique\",\"Traiter avec DEC\",COUNTRY_INFO!V87))","v":0},{"$f":"IF(INTRO!$E$39<>\"Non endémique\",COUNTRY_INFO!W87,\"Non requis\")","v":0},{"$f":"IF(COUNTRY_INFO!H87=1, IF($E87=1,$D87, 0),0)","v":0},{"$f":"IF(COUNTRY_INFO!I87=1, IF(AND(COUNTRY_INFO!$I87=1,$F87<>0),IF(COUNTRY_INFO!M87>=(COUNTRY_INFO!F87+COUNTRY_INFO!G87),COUNTRY_INFO!F87+COUNTRY_INFO!G87,COUNTRY_INFO!$M87), 0),0)","v":0},0,0,0,0,null,0]
[{"$f":"IF(INTRO!$E$39=\"Non endémique\",\" \",IF(COUNTRY_INFO!A88=0,\" \",COUNTRY_INFO!A88))","v":"SENEGAL"},{"$f":"IF(INTRO!$E$39=\"Non endémique\",\" \",IF(COUNTRY_INFO!B88=0,\" \",COUNTRY_INFO!B88))","v":"Ziguinchor"},{"$f":"IF(INTRO!$E$39=\"Non endémique\",\" \",IF(COUNTRY_INFO!C88=0,\" \",COUNTRY_INFO!C88))","v":"Ziguinchor"},{"$f":"IF(INTRO!$E$39=\"Non endémique\",0,IF(INTRO!$E$39=\"Endémique mais pas de CP\",IF(COUNTRY_INFO!$H88=1,COUNTRY_INFO!F88+COUNTRY_INFO!G88,0),IF(COUNTRY_INFO!$H88=1,COUNTRY_INFO!F88+COUNTRY_INFO!G88,IF(COUNTRY_INFO!$I88=1,IF(COUNTRY_INFO!M88>=(COUNTRY_INFO!F88+COUNTRY_INFO!G88),COUNTRY_INFO!F88+COUNTRY_INFO!G88,COUNTRY_INFO!$M88),0))))","v":0},{"$f":"IF(AND(INTRO!$E$39=\"Non endémique\",INTRO!$E$37=\"Non endémique\"),\"Non requis\",IF(INTRO!$E$39=\"Non endémique\",\"Traiter avec DEC\",COUNTRY_INFO!V88))","v":0},{"$f":"IF(INTRO!$E$39<>\"Non endémique\",COUNTRY_INFO!W88,\"Non requis\")","v":0},{"$f":"IF(COUNTRY_INFO!H88=1, IF($E88=1,$D88, 0),0)","v":0},{"$f":"IF(COUNTRY_INFO!I88=1, IF(AND(COUNTRY_INFO!$I88=1,$F88<>0),IF(COUNTRY_INFO!M88>=(COUNTRY_INFO!F88+COUNTRY_INFO!G88),COUNTRY_INFO!F88+COUNTRY_INFO!G88,COUNTRY_INFO!$M88), 0),0)","v":0},0,0,0,0,null,0]

{"sheet":"IVM+","index":6,"n_rows":88,"n_cols":8,"rows_kept":88,"cut":false,"hidden":true,"merged":[[6,0,7,0],[6,1,7,1],[6,2,7,2],[6,3,7,3],[3,0,3,2],[5,0,5,2],[6,5,7,5],[6,6,7,6],[6,7,7,7],[5,4,7,4],[5,5,5,7]]}
["Ivermectine (IVM) pour IDA thérapie"]
["Structure administrative, population ciblée par groupe d'âge, plan de traitement et information sur les comprimés"]
[]
["TOTAL",null,null,null,{"$f":"SUBTOTAL(9,E$10:E$1010)","v":0},0,0,0]
[]
["Structure administrative du pays",null,null,"Plan de traitement","Population nécessitant un traitement avec IVM\n(IDA thérapie)","Ivermectine (IVM)"]
["Pays","Région/Département","District","FL",null,"Total requis","Reste en stock","Comprimés devant être fournis"]
[]
[]
[{"$f":"IF(AND(INTRO!$E$37=\"Endémique\",INTRO!$E$39=\"Non endémique\"),IF(COUNTRY_INFO!A10=0,\" \",COUNTRY_INFO!A10),\" \")","v":" "},{"$f":"IF(AND(INTRO!$E$37=\"Endémique\",INTRO!$E$39=\"Non endémique\"),IF(COUNTRY_INFO!B10=0,\" \",COUNTRY_INFO!B10),\" \")","v":" "},{"$f":"IF(AND(INTRO!$E$37=\"Endémique\",INTRO!$E$39=\"Non endémique\"),IF(COUNTRY_INFO!C10=0,\" \",COUNTRY_INFO!C10),\" \")","v":" "},{"$f":"IF(COUNTRY_INFO!Z10<>\"\",COUNTRY_INFO!V10,0)","v":0},{"$f":"IF(AND(COUNTRY_INFO!Z10<>\"\",COUNTRY_INFO!$H10=1),COUNTRY_INFO!F10+COUNTRY_INFO!G10,0)","v":0},{"$f":"E10*2.8","v":0},null,{"$f":"IF($F10>$G10,$F10-$G10,0)","v":0}]
[{"$f":"IF(AND(INTRO!$E$37=\"Endémique\",INTRO!$E$39=\"Non endémique\"),IF(COUNTRY_INFO!A11=0,\" \",COUNTRY_INFO!A11),\" \")","v":" "},{"$f":"IF(AND(INTRO!$E$37=\"Endémique\",INTRO!$E$39=\"Non endémique\"),IF(COUNTRY_INFO!B11=0,\" \",COUNTRY_INFO!B11),\" \")","v":" "},{"$f":"IF(AND(INTRO!$E$37=\"Endémique\",INTRO!$E$39=\"Non endémique\"),IF(COUNTRY_INFO!C11=0,\" \",COUNTRY_INFO!C11),\" \")","v":" "},{"$f":"IF(COUNTRY_INFO!Z11<>\"\",COUNTRY_INFO!V11,0)","v":0},{"$f":"IF(AND(COUNTRY_INFO!Z11<>\"\",COUNTRY_INFO!$H11=1),COUNTRY_INFO!F11+COUNTRY_INFO!G11,0)","v":0},{"$f":"E11*2.8","v":0},null,0]
[{"$f":"IF(AND(INTRO!$E$37=\"Endémique\",INTRO!$E$39=\"Non endémique\"),IF(COUNTRY_INFO!A12=0,\" \",COUNTRY_INFO!A12),\" \")","v":" "},{"$f":"IF(AND(INTRO!$E$37=\"Endémique\",INTRO!$E$39=\"Non endémique\"),IF(COUNTRY_INFO!B12=0,\" \",COUNTRY_INFO!B12),\" \")","v":" "},{"$f":"IF(AND(INTRO!$E$37=\"Endémique\",INTRO!$E$39=\"Non endémique\"),IF(COUNTRY_INFO!C12=0,\" \",COUNTRY_INFO!C12),\" \")","v":" "},{"$f":"IF(COUNTRY_INFO!Z12<>\"\",COUNTRY_INFO!V12,0)","v":0},{"$f":"IF(AND(COUNTRY_INFO!Z12<>\"\",COUNTRY_INFO!$H12=1),COUNTRY_INFO!F12+COUNTRY_INFO!G12,0)","v":0},0,null,0]
[{"$f":"IF(AND(INTRO!$E$37=\"Endémique\",INTRO!$E$39=\"Non endémique\"),IF(COUNTRY_INFO!A13=0,\" \",COUNTRY_INFO!A13),\" \")","v":" "},{"$f":"IF(AND(INTRO!$E$37=\"Endémique\",INTRO!$E$39=\"Non endémique\"),IF(COUNTRY_INFO!B13=0,\" \",COUNTRY_INFO!B13),\" \")","v":" "},{"$f":"IF(AND(INTRO!$E$37=\"Endémique\",INTRO!$E$39=\"Non endémique\"),IF(COUNTRY_INFO!C13=0,\" \",COUNTRY_INFO!C13),\" \")","v":" "},{"$f":"IF(COUNTRY_INFO!Z13<>\"\",COUNTRY_INFO!V13,0)","v":0},{"$f":"IF(AND(COUNTRY_INFO!Z13<>\"\",COUNTRY_INFO!$H13=1),COUNTRY_INFO!F13+COUNTRY_INFO!G13,0)","v":0},0,null,0]
[{"$f":"IF(AND(INTRO!$E$37=\"Endémique\",INTRO!$E$39=\"Non endémique\"),IF(COUNTRY_INFO!A14=0,\" \",COUNTRY_INFO!A14),\" \")","v":" "},{"$f":"IF(AND(INTRO!$E$37=\"Endémique\",INTRO!$E$39=\"Non endémique\"),IF(COUNTRY_INFO!B14=0,\" \",COUNTRY_INFO!B14),\" \")","v":" "},{"$f":"IF(AND(INTRO!$E$37=\"Endémique\",INTRO!$E$39=\"Non endémique\"),IF(COUNTRY_INFO!C14=0,\" \",COUNTRY_INFO!C14),\" \")","v":" "},{"$f":"IF(COUNTRY_INFO!Z14<>\"\",COUNTRY_INFO!V14,0)","v":0},{"$f":"IF(AND(COUNTRY_INFO!Z14<>\"\",COUNTRY_INFO!$H14=1),COUNTRY_INFO!F14+COUNTRY_INFO!G14,0)","v":0},0,null,0]
[{"$f":"IF(AND(INTRO!$E$37=\"Endémique\",INTRO!$E$39=\"Non endémique\"),IF(COUNTRY_INFO!A15=0,\" \",COUNTRY_INFO!A15),\" \")","v":" "},{"$f":"IF(AND(INTRO!$E$37=\"Endémique\",INTRO!$E$39=\"Non endémique\"),IF(COUNTRY_INFO!B15=0,\" \",COUNTRY_INFO!B15),\" \")","v":" "},{"$f":"IF(AND(INTRO!$E$37=\"Endémique\",INTRO!$E$39=\"Non endémique\"),IF(COUNTRY_INFO!C15=0,\" \",COUNTRY_INFO!C15),\" \")","v":" "},{"$f":"IF(COUNTRY_INFO!Z15<>\"\",COUNTRY_INFO!V15,0)","v":0},{"$f":"IF(AND(COUNTRY_INFO!Z15<>\"\",COUNTRY_INFO!$H15=1),COUNTRY_INFO!F15+COUNTRY_INFO!G15,0)","v":0},0,null,0]
[{"$f":"IF(AND(INTRO!$E$37=\"Endémique\",INTRO!$E$39=\"Non endémique\"),IF(COUNTRY_INFO!A16=0,\" \",COUNTRY_INFO!A16),\" \")","v":" "},{"$f":"IF(AND(INTRO!$E$37=\"Endémique\",INTRO!$E$39=\"Non endémique\"),IF(COUNTRY_INFO!B16=0,\" \",COUNTRY_INFO!B16),\" \")","v":" "},{"$f":"IF(AND(INTRO!$E$37=\"Endémique\",INTRO!$E$39=\"Non endémique\"),IF(COUNTRY_INFO!C16=0,\" \",COUNTRY_INFO!C16),\" \")","v":" "},{"$f":"IF(COUNTRY_INFO!Z16<>\"\",COUNTRY_INFO!V16,0)","v":0},{"$f":"IF(AND(COUNTRY_INFO!Z16<>\"\",COUNTRY_INFO!$H16=1),COUNTRY_INFO!F16+COUNTRY_INFO!G16,0)","v":0},0,null,0]
[{"$f":"IF(AND(INTRO!$E$37=\"Endémique\",INTRO!$E$39=\"Non endémique\"),IF(COUNTRY_INFO!A17=0,\" \",COUNTRY_INFO!A17),\" \")","v":" "},{"$f":"IF(AND(INTRO!$E$37=\"Endémique\",INTRO!$E$39=\"Non endémique\"),IF(COUNTRY_INFO!B17=0,\" \",COUNTRY_INFO!B17),\" \")","v":" "},{"$f":"IF(AND(INTRO!$E$37=\"Endémique\",INTRO!$E$39=\"Non endémique\"),IF(COUNTRY_INFO!C17=0,\" \",COUNTRY_INFO!C17),\" \")","v":" "},{"$f":"IF(COUNTRY_INFO!Z17<>\"\",COUNTRY_INFO!V17,0)","v":0},{"$f":"IF(AND(COUNTRY_INFO!Z17<>\"\",COUNTRY_INFO!$H17=1),COUNTRY_INFO!F17+COUNTRY_INFO!G17,0)","v":0},0,null,0]
[{"$f":"IF(AND(INTRO!$E$37=\"Endémique\",INTRO!$E$39=\"Non endémique\"),IF(COUNTRY_INFO!A18=0,\" \",COUNTRY_INFO!A18),\" \")","v":" "},{"$f":"IF(AND(INTRO!$E$37=\"Endémique\",INTRO!$E$39=\"Non endémique\"),IF(COUNTRY_INFO!B18=0,\" \",COUNTRY_INFO!B18),\" \")","v":" "},{"$f":"IF(AND(INTRO!$E$37=\"Endémique\",INTRO!$E$39=\"Non endémique\"),IF(COUNTRY_INFO!C18=0,\" \",COUNTRY_INFO!C18),\" \")","v":" "},{"$f":"IF(COUNTRY_INFO!Z18<>\"\",COUNTRY_INFO!V18,0)","v":0},{"$f":"IF(AND(COUNTRY_INFO!Z18<>\"\",COUNTRY_INFO!$H18=1),COUNTRY_INFO!F18+COUNTRY_INFO!G18,0)","v":0},0,null,0]
[{"$f":"IF(AND(INTRO!$E$37=\"Endémique\",INTRO!$E$39=\"Non endémique\"),IF(COUNTRY_INFO!A19=0,\" \",COUNTRY_INFO!A19),\" \")","v":" "},{"$f":"IF(AND(INTRO!$E$37=\"Endémique\",INTRO!$E$39=\"Non endémique\"),IF(COUNTRY_INFO!B19=0,\" \",COUNTRY_INFO!B19),\" \")","v":" "},{"$f":"IF(AND(INTRO!$E$37=\"Endémique\",INTRO!$E$39=\"Non endémique\"),IF(COUNTRY_INFO!C19=0,\" \",COUNTRY_INFO!C19),\" \")","v":" "},{"$f":"IF(COUNTRY_INFO!Z19<>\"\",COUNTRY_INFO!V19,0)","v":0},{"$f":"IF(AND(COUNTRY_INFO!Z19<>\"\",COUNTRY_INFO!$H19=1),COUNTRY_INFO!F19+COUNTRY_INFO!G19,0)","v":0},0,null,0]
[{"$f":"IF(AND(INTRO!$E$37=\"Endémique\",INTRO!$E$39=\"Non endémique\"),IF(COUNTRY_INFO!A20=0,\" \",COUNTRY_INFO!A20),\" \")","v":" "},{"$f":"IF(AND(INTRO!$E$37=\"Endémique\",INTRO!$E$39=\"Non endémique\"),IF(COUNTRY_INFO!B20=0,\" \",COUNTRY_INFO!B20),\" \")","v":" "},{"$f":"IF(AND(INTRO!$E$37=\"Endémique\",INTRO!$E$39=\"Non endémique\"),IF(COUNTRY_INFO!C20=0,\" \",COUNTRY_INFO!C20),\" \")","v":" "},{"$f":"IF(COUNTRY_INFO!Z20<>\"\",COUNTRY_INFO!V20,0)","v":0},{"$f":"IF(AND(COUNTRY_INFO!Z20<>\"\",COUNTRY_INFO!$H20=1),COUNTRY_INFO!F20+COUNTRY_INFO!G20,0)","v":0},0,null,0]
[{"$f":"IF(AND(INTRO!$E$37=\"Endémique\",INTRO!$E$39=\"Non endémique\"),IF(COUNTRY_INFO!A21=0,\" \",COUNTRY_INFO!A21),\" \")","v":" "},{"$f":"IF(AND(INTRO!$E$37=\"Endémique\",INTRO!$E$39=\"Non endémique\"),IF(COUNTRY_INFO!B21=0,\" \",COUNTRY_INFO!B21),\" \")","v":" "},{"$f":"IF(AND(INTRO!$E$37=\"Endémique\",INTRO!$E$39=\"Non endémique\"),IF(COUNTRY_INFO!C21=0,\" \",COUNTRY_INFO!C21),\" \")","v":" "},{"$f":"IF(COUNTRY_INFO!Z21<>\"\",COUNTRY_INFO!V21,0)","v":0},{"$f":"IF(AND(COUNTRY_INFO!Z21<>\"\",COUNTRY_INFO!$H21=1),COUNTRY_INFO!F21+COUNTRY_INFO!G21,0)","v":0},0,null,0]
[{"$f":"IF(AND(INTRO!$E$37=\"Endémique\",INTRO!$E$39=\"Non endémique\"),IF(COUNTRY_INFO!A22=0,\" \",COUNTRY_INFO!A22),\" \")","v":" "},{"$f":"IF(AND(INTRO!$E$37=\"Endémique\",INTRO!$E$39=\"Non endémique\"),IF(COUNTRY_INFO!B22=0,\" \",COUNTRY_INFO!B22),\" \")","v":" "},{"$f":"IF(AND(INTRO!$E$37=\"Endémique\",INTRO!$E$39=\"Non endémique\"),IF(COUNTRY_INFO!C22=0,\" \",COUNTRY_INFO!C22),\" \")","v":" "},{"$f":"IF(COUNTRY_INFO!Z22<>\"\",COUNTRY_INFO!V22,0)","v":0},{"$f":"IF(AND(COUNTRY_INFO!Z22<>\"\",COUNTRY_INFO!$H22=1),COUNTRY_INFO!F22+COUNTRY_INFO!G22,0)","v":0},0,null,0]
[{"$f":"IF(AND(INTRO!$E$37=\"Endémique\",INTRO!$E$39=\"Non endémique\"),IF(COUNTRY_INFO!A23=0,\" \",COUNTRY_INFO!A23),\" \")","v":" "},{"$f":"IF(AND(INTRO!$E$37=\"Endémique\",INTRO!$E$39=\"Non endémique\"),IF(COUNTRY_INFO!B23=0,\" \",COUNTRY_INFO!B23),\" \")","v":" "},{"$f":"IF(AND(INTRO!$E$37=\"Endémique\",INTRO!$E$39=\"Non endémique\"),IF(COUNTRY_INFO!C23=0,\" \",COUNTRY_INFO!C23),\" \")","v":" "},{"$f":"IF(COUNTRY_INFO!Z23<>\"\",COUNTRY_INFO!V23,0)","v":0},{"$f":"IF(AND(COUNTRY_INFO!Z23<>\"\",COUNTRY_INFO!$H23=1),COUNTRY_INFO!F23+COUNTRY_INFO!G23,0)","v":0},0,null,0]
[{"$f":"IF(AND(INTRO!$E$37=\"Endémique\",INTRO!$E$39=\"Non endémique\"),IF(COUNTRY_INFO!A24=0,\" \",COUNTRY_INFO!A24),\" \")","v":" "},{"$f":"IF(AND(INTRO!$E$37=\"Endémique\",INTRO!$E$39=\"Non endémique\"),IF(COUNTRY_INFO!B24=0,\" \",COUNTRY_INFO!B24),\" \")","v":" "},{"$f":"IF(AND(INTRO!$E$37=\"Endémique\",INTRO!$E$39=\"Non endémique\"),IF(COUNTRY_INFO!C24=0,\" \",COUNTRY_INFO!C24),\" \")","v":" "},{"$f":"IF(COUNTRY_INFO!Z24<>\"\",COUNTRY_INFO!V24,0)","v":0},{"$f":"IF(AND(COUNTRY_INFO!Z24<>\"\",COUNTRY_INFO!$H24=1),COUNTRY_INFO!F24+COUNTRY_INFO!G24,0)","v":0},0,null,0]
[{"$f":"IF(AND(INTRO!$E$37=\"Endémique\",INTRO!$E$39=\"Non endémique\"),IF(COUNTRY_INFO!A25=0,\" \",COUNTRY_INFO!A25),\" \")","v":" "},{"$f":"IF(AND(INTRO!$E$37=\"Endémique\",INTRO!$E$39=\"Non endémique\"),IF(COUNTRY_INFO!B25=0,\" \",COUNTRY_INFO!B25),\" \")","v":" "},{"$f":"IF(AND(INTRO!$E$37=\"Endémique\",INTRO!$E$39=\"Non endémique\"),IF(COUNTRY_INFO!C25=0,\" \",COUNTRY_INFO!C25),\" \")","v":" "},{"$f":"IF(COUNTRY_INFO!Z25<>\"\",COUNTRY_INFO!V25,0)","v":0},{"$f":"IF(AND(COUNTRY_INFO!Z25<>\"\",COUNTRY_INFO!$H25=1),COUNTRY_INFO!F25+COUNTRY_INFO!G25,0)","v":0},0,null,0]
[{"$f":"IF(AND(INTRO!$E$37=\"Endémique\",INTRO!$E$39=\"Non endémique\"),IF(COUNTRY_INFO!A26=0,\" \",COUNTRY_INFO!A26),\" \")","v":" "},{"$f":"IF(AND(INTRO!$E$37=\"Endémique\",INTRO!$E$39=\"Non endémique\"),IF(COUNTRY_INFO!B26=0,\" \",COUNTRY_INFO!B26),\" \")","v":" "},{"$f":"IF(AND(INTRO!$E$37=\"Endémique\",INTRO!$E$39=\"Non endémique\"),IF(COUNTRY_INFO!C26=0,\" \",COUNTRY_INFO!C26),\" \")","v":" "},{"$f":"IF(COUNTRY_INFO!Z26<>\"\",COUNTRY_INFO!V26,0)","v":0},{"$f":"IF(AND(COUNTRY_INFO!Z26<>\"\",COUNTRY_INFO!$H26=1),COUNTRY_INFO!F26+COUNTRY_INFO!G26,0)","v":0},0,null,0]
[{"$f":"IF(AND(INTRO!$E$37=\"Endémique\",INTRO!$E$39=\"Non endémique\"),IF(COUNTRY_INFO!A27=0,\" \",COUNTRY_INFO!A27),\" \")","v":" "},{"$f":"IF(AND(INTRO!$E$37=\"Endémique\",INTRO!$E$39=\"Non endémique\"),IF(COUNTRY_INFO!B27=0,\" \",COUNTRY_INFO!B27),\" \")","v":" "},{"$f":"IF(AND(INTRO!$E$37=\"Endémique\",INTRO!$E$39=\"Non endémique\"),IF(COUNTRY_INFO!C27=0,\" \",COUNTRY_INFO!C27),\" \")","v":" "},{"$f":"IF(COUNTRY_INFO!Z27<>\"\",COUNTRY_INFO!V27,0)","v":0},{"$f":"IF(AND(COUNTRY_INFO!Z27<>\"\",COUNTRY_INFO!$H27=1),COUNTRY_INFO!F27+COUNTRY_INFO!G27,0)","v":0},0,null,0]
[{"$f":"IF(AND(INTRO!$E$37=\"Endémique\",INTRO!$E$39=\"Non endémique\"),IF(COUNTRY_INFO!A28=0,\" \",COUNTRY_INFO!A28),\" \")","v":" "},{"$f":"IF(AND(INTRO!$E$37=\"Endémique\",INTRO!$E$39=\"Non endémique\"),IF(COUNTRY_INFO!B28=0,\" \",COUNTRY_INFO!B28),\" \")","v":" "},{"$f":"IF(AND(INTRO!$E$37=\"Endémique\",INTRO!$E$39=\"Non endémique\"),IF(COUNTRY_INFO!C28=0,\" \",COUNTRY_INFO!C28),\" \")","v":" "},{"$f":"IF(COUNTRY_INFO!Z28<>\"\",COUNTRY_INFO!V28,0)","v":0},{"$f":"IF(AND(COUNTRY_INFO!Z28<>\"\",COUNTRY_INFO!$H28=1),COUNTRY_INFO!F28+COUNTRY_INFO!G28,0)","v":0},0,null,0]
[{"$f":"IF(AND(INTRO!$E$37=\"Endémique\",INTRO!$E$39=\"Non endémique\"),IF(COUNTRY_INFO!A29=0,\" \",COUNTRY_INFO!A29),\" \")","v":" "},{"$f":"IF(AND(INTRO!$E$37=\"Endémique\",INTRO!$E$39=\"Non endémique\"),IF(COUNTRY_INFO!B29=0,\" \",COUNTRY_INFO!B29),\" \")","v":" "},{"$f":"IF(AND(INTRO!$E$37=\"Endémique\",INTRO!$E$39=\"Non endémique\"),IF(COUNTRY_INFO!C29=0,\" \",COUNTRY_INFO!C29),\" \")","v":" "},{"$f":"IF(COUNTRY_INFO!Z29<>\"\",COUNTRY_INFO!V29,0)","v":0},{"$f":"IF(AND(COUNTRY_INFO!Z29<>\"\",COUNTRY_INFO!$H29=1),COUNTRY_INFO!F29+COUNTRY_INFO!G29,0)","v":0},0,null,0]
[{"$f":"IF(AND(INTRO!$E$37=\"Endémique\",INTRO!$E$39=\"Non endémique\"),IF(COUNTRY_INFO!A30=0,\" \",COUNTRY_INFO!A30),\" \")","v":" "},{"$f":"IF(AND(INTRO!$E$37=\"Endémique\",INTRO!$E$39=\"Non endémique\"),IF(COUNTRY_INFO!B30=0,\" \",COUNTRY_INFO!B30),\" \")","v":" "},{"$f":"IF(AND(INTRO!$E$37=\"Endémique\",INTRO!$E$39=\"Non endémique\"),IF(COUNTRY_INFO!C30=0,\" \",COUNTRY_INFO!C30),\" \")","v":" "},{"$f":"IF(COUNTRY_INFO!Z30<>\"\",COUNTRY_INFO!V30,0)","v":0},{"$f":"IF(AND(COUNTRY_INFO!Z30<>\"\",COUNTRY_INFO!$H30=1),COUNTRY_INFO!F30+COUNTRY_INFO!G30,0)","v":0},0,null,0]
[{"$f":"IF(AND(INTRO!$E$37=\"Endémique\",INTRO!$E$39=\"Non endémique\"),IF(COUNTRY_INFO!A31=0,\" \",COUNTRY_INFO!A31),\" \")","v":" "},{"$f":"IF(AND(INTRO!$E$37=\"Endémique\",INTRO!$E$39=\"Non endémique\"),IF(COUNTRY_INFO!B31=0,\" \",COUNTRY_INFO!B31),\" \")","v":" "},{"$f":"IF(AND(INTRO!$E$37=\"Endémique\",INTRO!$E$39=\"Non endémique\"),IF(COUNTRY_INFO!C31=0,\" \",COUNTRY_INFO!C31),\" \")","v":" "},{"$f":"IF(COUNTRY_INFO!Z31<>\"\",COUNTRY_INFO!V31,0)","v":0},{"$f":"IF(AND(COUNTRY_INFO!Z31<>\"\",COUNTRY_INFO!$H31=1),COUNTRY_INFO!F31+COUNTRY_INFO!G31,0)","v":0},0,null,0]
[{"$f":"IF(AND(INTRO!$E$37=\"Endémique\",INTRO!$E$39=\"Non endémique\"),IF(COUNTRY_INFO!A32=0,\" \",COUNTRY_INFO!A32),\" \")","v":" "},{"$f":"IF(AND(INTRO!$E$37=\"Endémique\",INTRO!$E$39=\"Non endémique\"),IF(COUNTRY_INFO!B32=0,\" \",COUNTRY_INFO!B32),\" \")","v":" "},{"$f":"IF(AND(INTRO!$E$37=\"Endémique\",INTRO!$E$39=\"Non endémique\"),IF(COUNTRY_INFO!C32=0,\" \",COUNTRY_INFO!C32),\" \")","v":" "},{"$f":"IF(COUNTRY_INFO!Z32<>\"\",COUNTRY_INFO!V32,0)","v":0},{"$f":"IF(AND(COUNTRY_INFO!Z32<>\"\",COUNTRY_INFO!$H32=1),COUNTRY_INFO!F32+COUNTRY_INFO!G32,0)","v":0},0,null,0]
[{"$f":"IF(AND(INTRO!$E$37=\"Endémique\",INTRO!$E$39=\"Non endémique\"),IF(COUNTRY_INFO!A33=0,\" \",COUNTRY_INFO!A33),\" \")","v":" "},{"$f":"IF(AND(INTRO!$E$37=\"Endémique\",INTRO!$E$39=\"Non endémique\"),IF(COUNTRY_INFO!B33=0,\" \",COUNTRY_INFO!B33),\" \")","v":" "},{"$f":"IF(AND(INTRO!$E$37=\"Endémique\",INTRO!$E$39=\"Non endémique\"),IF(COUNTRY_INFO!C33=0,\" \",COUNTRY_INFO!C33),\" \")","v":" "},{"$f":"IF(COUNTRY_INFO!Z33<>\"\",COUNTRY_INFO!V33,0)","v":0},{"$f":"IF(AND(COUNTRY_INFO!Z33<>\"\",COUNTRY_INFO!$H33=1),COUNTRY_INFO!F33+COUNTRY_INFO!G33,0)","v":0},0,null,0]
[{"$f":"IF(AND(INTRO!$E$37=\"Endémique\",INTRO!$E$39=\"Non endémique\"),IF(COUNTRY_INFO!A34=0,\" \",COUNTRY_INFO!A34),\" \")","v":" "},{"$f":"IF(AND(INTRO!$E$37=\"Endémique\",INTRO!$E$39=\"Non endémique\"),IF(COUNTRY_INFO!B34=0,\" \",COUNTRY_INFO!B34),\" \")","v":" "},{"$f":"IF(AND(INTRO!$E$37=\"Endémique\",INTRO!$E$39=\"Non endémique\"),IF(COUNTRY_INFO!C34=0,\" \",COUNTRY_INFO!C34),\" \")","v":" "},{"$f":"IF(COUNTRY_INFO!Z34<>\"\",COUNTRY_INFO!V34,0)","v":0},{"$f":"IF(AND(COUNTRY_INFO!Z34<>\"\",COUNTRY_INFO!$H34=1),COUNTRY_INFO!F34+COUNTRY_INFO!G34,0)","v":0},0,null,0]
[{"$f":"IF(AND(INTRO!$E$37=\"Endémique\",INTRO!$E$39=\"Non endémique\"),IF(COUNTRY_INFO!A35=0,\" \",COUNTRY_INFO!A35),\" \")","v":" "},{"$f":"IF(AND(INTRO!$E$37=\"Endémique\",INTRO!$E$39=\"Non endémique\"),IF(COUNTRY_INFO!B35=0,\" \",COUNTRY_INFO!B35),\" \")","v":" "},{"$f":"IF(AND(INTRO!$E$37=\"Endémique\",INTRO!$E$39=\"Non endémique\"),IF(COUNTRY_INFO!C35=0,\" \",COUNTRY_INFO!C35),\" \")","v":" "},{"$f":"IF(COUNTRY_INFO!Z35<>\"\",COUNTRY_INFO!V35,0)","v":0},{"$f":"IF(AND(COUNTRY_INFO!Z35<>\"\",COUNTRY_INFO!$H35=1),COUNTRY_INFO!F35+COUNTRY_INFO!G35,0)","v":0},0,null,0]
[{"$f":"IF(AND(INTRO!$E$37=\"Endémique\",INTRO!$E$39=\"Non endémique\"),IF(COUNTRY_INFO!A36=0,\" \",COUNTRY_INFO!A36),\" \")","v":" "},{"$f":"IF(AND(INTRO!$E$37=\"Endémique\",INTRO!$E$39=\"Non endémique\"),IF(COUNTRY_INFO!B36=0,\" \",COUNTRY_INFO!B36),\" \")","v":" "},{"$f":"IF(AND(INTRO!$E$37=\"Endémique\",INTRO!$E$39=\"Non endémique\"),IF(COUNTRY_INFO!C36=0,\" \",COUNTRY_INFO!C36),\" \")","v":" "},{"$f":"IF(COUNTRY_INFO!Z36<>\"\",COUNTRY_INFO!V36,0)","v":0},{"$f":"IF(AND(COUNTRY_INFO!Z36<>\"\",COUNTRY_INFO!$H36=1),COUNTRY_INFO!F36+COUNTRY_INFO!G36,0)","v":0},0,null,0]
[{"$f":"IF(AND(INTRO!$E$37=\"Endémique\",INTRO!$E$39=\"Non endémique\"),IF(COUNTRY_INFO!A37=0,\" \",COUNTRY_INFO!A37),\" \")","v":" "},{"$f":"IF(AND(INTRO!$E$37=\"Endémique\",INTRO!$E$39=\"Non endémique\"),IF(COUNTRY_INFO!B37=0,\" \",COUNTRY_INFO!B37),\" \")","v":" "},{"$f":"IF(AND(INTRO!$E$37=\"Endémique\",INTRO!$E$39=\"Non endémique\"),IF(COUNTRY_INFO!C37=0,\" \",COUNTRY_INFO!C37),\" \")","v":" "},{"$f":"IF(COUNTRY_INFO!Z37<>\"\",COUNTRY_INFO!V37,0)","v":0},{"$f":"IF(AND(COUNTRY_INFO!Z37<>\"\",COUNTRY_INFO!$H37=1),COUNTRY_INFO!F37+COUNTRY_INFO!G37,0)","v":0},0,null,0]
[{"$f":"IF(AND(INTRO!$E$37=\"Endémique\",INTRO!$E$39=\"Non endémique\"),IF(COUNTRY_INFO!A38=0,\" \",COUNTRY_INFO!A38),\" \")","v":" "},{"$f":"IF(AND(INTRO!$E$37=\"Endémique\",INTRO!$E$39=\"Non endémique\"),IF(COUNTRY_INFO!B38=0,\" \",COUNTRY_INFO!B38),\" \")","v":" "},{"$f":"IF(AND(INTRO!$E$37=\"Endémique\",INTRO!$E$39=\"Non endémique\"),IF(COUNTRY_INFO!C38=0,\" \",COUNTRY_INFO!C38),\" \")","v":" "},{"$f":"IF(COUNTRY_INFO!Z38<>\"\",COUNTRY_INFO!V38,0)","v":0},{"$f":"IF(AND(COUNTRY_INFO!Z38<>\"\",COUNTRY_INFO!$H38=1),COUNTRY_INFO!F38+COUNTRY_INFO!G38,0)","v":0},0,null,0]
[{"$f":"IF(AND(INTRO!$E$37=\"Endémique\",INTRO!$E$39=\"Non endémique\"),IF(COUNTRY_INFO!A39=0,\" \",COUNTRY_INFO!A39),\" \")","v":" "},{"$f":"IF(AND(INTRO!$E$37=\"Endémique\",INTRO!$E$39=\"Non endémique\"),IF(COUNTRY_INFO!B39=0,\" \",COUNTRY_INFO!B39),\" \")","v":" "},{"$f":"IF(AND(INTRO!$E$37=\"Endémique\",INTRO!$E$39=\"Non endémique\"),IF(COUNTRY_INFO!C39=0,\" \",COUNTRY_INFO!C39),\" \")","v":" "},{"$f":"IF(COUNTRY_INFO!Z39<>\"\",COUNTRY_INFO!V39,0)","v":0},{"$f":"IF(AND(COUNTRY_INFO!Z39<>\"\",COUNTRY_INFO!$H39=1),COUNTRY_INFO!F39+COUNTRY_INFO!G39,0)","v":0},0,null,0]
[{"$f":"IF(AND(INTRO!$E$37=\"Endémique\",INTRO!$E$39=\"Non endémique\"),IF(COUNTRY_INFO!A40=0,\" \",COUNTRY_INFO!A40),\" \")","v":" "},{"$f":"IF(AND(INTRO!$E$37=\"Endémique\",INTRO!$E$39=\"Non endémique\"),IF(COUNTRY_INFO!B40=0,\" \",COUNTRY_INFO!B40),\" \")","v":" "},{"$f":"IF(AND(INTRO!$E$37=\"Endémique\",INTRO!$E$39=\"Non endémique\"),IF(COUNTRY_INFO!C40=0,\" \",COUNTRY_INFO!C40),\" \")","v":" "},{"$f":"IF(COUNTRY_INFO!Z40<>\"\",COUNTRY_INFO!V40,0)","v":0},{"$f":"IF(AND(COUNTRY_INFO!Z40<>\"\",COUNTRY_INFO!$H40=1),COUNTRY_INFO!F40+COUNTRY_INFO!G40,0)","v":0},0,null,0]
[{"$f":"IF(AND(INTRO!$E$37=\"Endémique\",INTRO!$E$39=\"Non endémique\"),IF(COUNTRY_INFO!A41=0,\" \",COUNTRY_INFO!A41),\" \")","v":" "},{"$f":"IF(AND(INTRO!$E$37=\"Endémique\",INTRO!$E$39=\"Non endémique\"),IF(COUNTRY_INFO!B41=0,\" \",COUNTRY_INFO!B41),\" \")","v":" "},{"$f":"IF(AND(INTRO!$E$37=\"Endémique\",INTRO!$E$39=\"Non endémique\"),IF(COUNTRY_INFO!C41=0,\" \",COUNTRY_INFO!C41),\" \")","v":" "},{"$f":"IF(COUNTRY_INFO!Z41<>\"\",COUNTRY_INFO!V41,0)","v":0},{"$f":"IF(AND(COUNTRY_INFO!Z41<>\"\",COUNTRY_INFO!$H41=1),COUNTRY_INFO!F41+COUNTRY_INFO!G41,0)","v":0},0,null,0]
[{"$f":"IF(AND(INTRO!$E$37=\"Endémique\",INTRO!$E$39=\"Non endémique\"),IF(COUNTRY_INFO!A42=0,\" \",COUNTRY_INFO!A42),\" \")","v":" "},{"$f":"IF(AND(INTRO!$E$37=\"Endémique\",INTRO!$E$39=\"Non endémique\"),IF(COUNTRY_INFO!B42=0,\" \",COUNTRY_INFO!B42),\" \")","v":" "},{"$f":"IF(AND(INTRO!$E$37=\"Endémique\",INTRO!$E$39=\"Non endémique\"),IF(COUNTRY_INFO!C42=0,\" \",COUNTRY_INFO!C42),\" \")","v":" "},{"$f":"IF(COUNTRY_INFO!Z42<>\"\",COUNTRY_INFO!V42,0)","v":0},{"$f":"IF(AND(COUNTRY_INFO!Z42<>\"\",COUNTRY_INFO!$H42=1),COUNTRY_INFO!F42+COUNTRY_INFO!G42,0)","v":0},0,null,0]
[{"$f":"IF(AND(INTRO!$E$37=\"Endémique\",INTRO!$E$39=\"Non endémique\"),IF(COUNTRY_INFO!A43=0,\" \",COUNTRY_INFO!A43),\" \")","v":" "},{"$f":"IF(AND(INTRO!$E$37=\"Endémique\",INTRO!$E$39=\"Non endémique\"),IF(COUNTRY_INFO!B43=0,\" \",COUNTRY_INFO!B43),\" \")","v":" "},{"$f":"IF(AND(INTRO!$E$37=\"Endémique\",INTRO!$E$39=\"Non endémique\"),IF(COUNTRY_INFO!C43=0,\" \",COUNTRY_INFO!C43),\" \")","v":" "},{"$f":"IF(COUNTRY_INFO!Z43<>\"\",COUNTRY_INFO!V43,0)","v":0},{"$f":"IF(AND(COUNTRY_INFO!Z43<>\"\",COUNTRY_INFO!$H43=1),COUNTRY_INFO!F43+COUNTRY_INFO!G43,0)","v":0},0,null,0]
[{"$f":"IF(AND(INTRO!$E$37=\"Endémique\",INTRO!$E$39=\"Non endémique\"),IF(COUNTRY_INFO!A44=0,\" \",COUNTRY_INFO!A44),\" \")","v":" "},{"$f":"IF(AND(INTRO!$E$37=\"Endémique\",INTRO!$E$39=\"Non endémique\"),IF(COUNTRY_INFO!B44=0,\" \",COUNTRY_INFO!B44),\" \")","v":" "},{"$f":"IF(AND(INTRO!$E$37=\"Endémique\",INTRO!$E$39=\"Non endémique\"),IF(COUNTRY_INFO!C44=0,\" \",COUNTRY_INFO!C44),\" \")","v":" "},{"$f":"IF(COUNTRY_INFO!Z44<>\"\",COUNTRY_INFO!V44,0)","v":0},{"$f":"IF(AND(COUNTRY_INFO!Z44<>\"\",COUNTRY_INFO!$H44=1),COUNTRY_INFO!F44+COUNTRY_INFO!G44,0)","v":0},0,null,0]
[{"$f":"IF(AND(INTRO!$E$37=\"Endémique\",INTRO!$E$39=\"Non endémique\"),IF(COUNTRY_INFO!A45=0,\" \",COUNTRY_INFO!A45),\" \")","v":" "},{"$f":"IF(AND(INTRO!$E$37=\"Endémique\",INTRO!$E$39=\"Non endémique\"),IF(COUNTRY_INFO!B45=0,\" \",COUNTRY_INFO!B45),\" \")","v":" "},{"$f":"IF(AND(INTRO!$E$37=\"Endémique\",INTRO!$E$39=\"Non endémique\"),IF(COUNTRY_INFO!C45=0,\" \",COUNTRY_INFO!C45),\" \")","v":" "},{"$f":"IF(COUNTRY_INFO!Z45<>\"\",COUNTRY_INFO!V45,0)","v":0},{"$f":"IF(AND(COUNTRY_INFO!Z45<>\"\",COUNTRY_INFO!$H45=1),COUNTRY_INFO!F45+COUNTRY_INFO!G45,0)","v":0},0,null,0]
[{"$f":"IF(AND(INTRO!$E$37=\"Endémique\",INTRO!$E$39=\"Non endémique\"),IF(COUNTRY_INFO!A46=0,\" \",COUNTRY_INFO!A46),\" \")","v":" "},{"$f":"IF(AND(INTRO!$E$37=\"Endémique\",INTRO!$E$39=\"Non endémique\"),IF(COUNTRY_INFO!B46=0,\" \",COUNTRY_INFO!B46),\" \")","v":" "},{"$f":"IF(AND(INTRO!$E$37=\"Endémique\",INTRO!$E$39=\"Non endémique\"),IF(COUNTRY_INFO!C46=0,\" \",COUNTRY_INFO!C46),\" \")","v":" "},{"$f":"IF(COUNTRY_INFO!Z46<>\"\",COUNTRY_INFO!V46,0)","v":0},{"$f":"IF(AND(COUNTRY_INFO!Z46<>\"\",COUNTRY_INFO!$H46=1),COUNTRY_INFO!F46+COUNTRY_INFO!G46,0)","v":0},0,null,0]
[{"$f":"IF(AND(INTRO!$E$37=\"Endémique\",INTRO!$E$39=\"Non endémique\"),IF(COUNTRY_INFO!A47=0,\" \",COUNTRY_INFO!A47),\" \")","v":" "},{"$f":"IF(AND(INTRO!$E$37=\"Endémique\",INTRO!$E$39=\"Non endémique\"),IF(COUNTRY_INFO!B47=0,\" \",COUNTRY_INFO!B47),\" \")","v":" "},{"$f":"IF(AND(INTRO!$E$37=\"Endémique\",INTRO!$E$39=\"Non endémique\"),IF(COUNTRY_INFO!C47=0,\" \",COUNTRY_INFO!C47),\" \")","v":" "},{"$f":"IF(COUNTRY_INFO!Z47<>\"\",COUNTRY_INFO!V47,0)","v":0},{"$f":"IF(AND(COUNTRY_INFO!Z47<>\"\",COUNTRY_INFO!$H47=1),COUNTRY_INFO!F47+COUNTRY_INFO!G47,0)","v":0},0,null,0]
[{"$f":"IF(AND(INTRO!$E$37=\"Endémique\",INTRO!$E$39=\"Non endémique\"),IF(COUNTRY_INFO!A48=0,\" \",COUNTRY_INFO!A48),\" \")","v":" "},{"$f":"IF(AND(INTRO!$E$37=\"Endémique\",INTRO!$E$39=\"Non endémique\"),IF(COUNTRY_INFO!B48=0,\" \",COUNTRY_INFO!B48),\" \")","v":" "},{"$f":"IF(AND(INTRO!$E$37=\"Endémique\",INTRO!$E$39=\"Non endémique\"),IF(COUNTRY_INFO!C48=0,\" \",COUNTRY_INFO!C48),\" \")","v":" "},{"$f":"IF(COUNTRY_INFO!Z48<>\"\",COUNTRY_INFO!V48,0)","v":0},{"$f":"IF(AND(COUNTRY_INFO!Z48<>\"\",COUNTRY_INFO!$H48=1),COUNTRY_INFO!F48+COUNTRY_INFO!G48,0)","v":0},0,null,0]
[{"$f":"IF(AND(INTRO!$E$37=\"Endémique\",INTRO!$E$39=\"Non endémique\"),IF(COUNTRY_INFO!A49=0,\" \",COUNTRY_INFO!A49),\" \")","v":" "},{"$f":"IF(AND(INTRO!$E$37=\"Endémique\",INTRO!$E$39=\"Non endémique\"),IF(COUNTRY_INFO!B49=0,\" \",COUNTRY_INFO!B49),\" \")","v":" "},{"$f":"IF(AND(INTRO!$E$37=\"Endémique\",INTRO!$E$39=\"Non endémique\"),IF(COUNTRY_INFO!C49=0,\" \",COUNTRY_INFO!C49),\" \")","v":" "},{"$f":"IF(COUNTRY_INFO!Z49<>\"\",COUNTRY_INFO!V49,0)","v":0},{"$f":"IF(AND(COUNTRY_INFO!Z49<>\"\",COUNTRY_INFO!$H49=1),COUNTRY_INFO!F49+COUNTRY_INFO!G49,0)","v":0},0,null,0]
[{"$f":"IF(AND(INTRO!$E$37=\"Endémique\",INTRO!$E$39=\"Non endémique\"),IF(COUNTRY_INFO!A50=0,\" \",COUNTRY_INFO!A50),\" \")","v":" "},{"$f":"IF(AND(INTRO!$E$37=\"Endémique\",INTRO!$E$39=\"Non endémique\"),IF(COUNTRY_INFO!B50=0,\" \",COUNTRY_INFO!B50),\" \")","v":" "},{"$f":"IF(AND(INTRO!$E$37=\"Endémique\",INTRO!$E$39=\"Non endémique\"),IF(COUNTRY_INFO!C50=0,\" \",COUNTRY_INFO!C50),\" \")","v":" "},{"$f":"IF(COUNTRY_INFO!Z50<>\"\",COUNTRY_INFO!V50,0)","v":0},{"$f":"IF(AND(COUNTRY_INFO!Z50<>\"\",COUNTRY_INFO!$H50=1),COUNTRY_INFO!F50+COUNTRY_INFO!G50,0)","v":0},0,null,0]
[{"$f":"IF(AND(INTRO!$E$37=\"Endémique\",INTRO!$E$39=\"Non endémique\"),IF(COUNTRY_INFO!A51=0,\" \",COUNTRY_INFO!A51),\" \")","v":" "},{"$f":"IF(AND(INTRO!$E$37=\"Endémique\",INTRO!$E$39=\"Non endémique\"),IF(COUNTRY_INFO!B51=0,\" \",COUNTRY_INFO!B51),\" \")","v":" "},{"$f":"IF(AND(INTRO!$E$37=\"Endémique\",INTRO!$E$39=\"Non endémique\"),IF(COUNTRY_INFO!C51=0,\" \",COUNTRY_INFO!C51),\" \")","v":" "},{"$f":"IF(COUNTRY_INFO!Z51<>\"\",COUNTRY_INFO!V51,0)","v":0},{"$f":"IF(AND(COUNTRY_INFO!Z51<>\"\",COUNTRY_INFO!$H51=1),COUNTRY_INFO!F51+COUNTRY_INFO!G51,0)","v":0},0,null,0]
[{"$f":"IF(AND(INTRO!$E$37=\"Endémique\",INTRO!$E$39=\"Non endémique\"),IF(COUNTRY_INFO!A52=0,\" \",COUNTRY_INFO!A52),\" \")","v":" "},{"$f":"IF(AND(INTRO!$E$37=\"Endémique\",INTRO!$E$39=\"Non endémique\"),IF(COUNTRY_INFO!B52=0,\" \",COUNTRY_INFO!B52),\" \")","v":" "},{"$f":"IF(AND(INTRO!$E$37=\"Endémique\",INTRO!$E$39=\"Non endémique\"),IF(COUNTRY_INFO!C52=0,\" \",COUNTRY_INFO!C52),\" \")","v":" "},{"$f":"IF(COUNTRY_INFO!Z52<>\"\",COUNTRY_INFO!V52,0)","v":0},{"$f":"IF(AND(COUNTRY_INFO!Z52<>\"\",COUNTRY_INFO!$H52=1),COUNTRY_INFO!F52+COUNTRY_INFO!G52,0)","v":0},0,null,0]
[{"$f":"IF(AND(INTRO!$E$37=\"Endémique\",INTRO!$E$39=\"Non endémique\"),IF(COUNTRY_INFO!A53=0,\" \",COUNTRY_INFO!A53),\" \")","v":" "},{"$f":"IF(AND(INTRO!$E$37=\"Endémique\",INTRO!$E$39=\"Non endémique\"),IF(COUNTRY_INFO!B53=0,\" \",COUNTRY_INFO!B53),\" \")","v":" "},{"$f":"IF(AND(INTRO!$E$37=\"Endémique\",INTRO!$E$39=\"Non endémique\"),IF(COUNTRY_INFO!C53=0,\" \",COUNTRY_INFO!C53),\" \")","v":" "},{"$f":"IF(COUNTRY_INFO!Z53<>\"\",COUNTRY_INFO!V53,0)","v":0},{"$f":"IF(AND(COUNTRY_INFO!Z53<>\"\",COUNTRY_INFO!$H53=1),COUNTRY_INFO!F53+COUNTRY_INFO!G53,0)","v":0},0,null,0]
[{"$f":"IF(AND(INTRO!$E$37=\"Endémique\",INTRO!$E$39=\"Non endémique\"),IF(COUNTRY_INFO!A54=0,\" \",COUNTRY_INFO!A54),\" \")","v":" "},{"$f":"IF(AND(INTRO!$E$37=\"Endémique\",INTRO!$E$39=\"Non endémique\"),IF(COUNTRY_INFO!B54=0,\" \",COUNTRY_INFO!B54),\" \")","v":" "},{"$f":"IF(AND(INTRO!$E$37=\"Endémique\",INTRO!$E$39=\"Non endémique\"),IF(COUNTRY_INFO!C54=0,\" \",COUNTRY_INFO!C54),\" \")","v":" "},{"$f":"IF(COUNTRY_INFO!Z54<>\"\",COUNTRY_INFO!V54,0)","v":0},{"$f":"IF(AND(COUNTRY_INFO!Z54<>\"\",COUNTRY_INFO!$H54=1),COUNTRY_INFO!F54+COUNTRY_INFO!G54,0)","v":0},0,null,0]
[{"$f":"IF(AND(INTRO!$E$37=\"Endémique\",INTRO!$E$39=\"Non endémique\"),IF(COUNTRY_INFO!A55=0,\" \",COUNTRY_INFO!A55),\" \")","v":" "},{"$f":"IF(AND(INTRO!$E$37=\"Endémique\",INTRO!$E$39=\"Non endémique\"),IF(COUNTRY_INFO!B55=0,\" \",COUNTRY_INFO!B55),\" \")","v":" "},{"$f":"IF(AND(INTRO!$E$37=\"Endémique\",INTRO!$E$39=\"Non endémique\"),IF(COUNTRY_INFO!C55=0,\" \",COUNTRY_INFO!C55),\" \")","v":" "},{"$f":"IF(COUNTRY_INFO!Z55<>\"\",COUNTRY_INFO!V55,0)","v":0},{"$f":"IF(AND(COUNTRY_INFO!Z55<>\"\",COUNTRY_INFO!$H55=1),COUNTRY_INFO!F55+COUNTRY_INFO!G55,0)","v":0},0,null,0]
[{"$f":"IF(AND(INTRO!$E$37=\"Endémique\",INTRO!$E$39=\"Non endémique\"),IF(COUNTRY_INFO!A56=0,\" \",COUNTRY_INFO!A56),\" \")","v":" "},{"$f":"IF(AND(INTRO!$E$37=\"Endémique\",INTRO!$E$39=\"Non endémique\"),IF(COUNTRY_INFO!B56=0,\" \",COUNTRY_INFO!B56),\" \")","v":" "},{"$f":"IF(AND(INTRO!$E$37=\"Endémique\",INTRO!$E$39=\"Non endémique\"),IF(COUNTRY_INFO!C56=0,\" \",COUNTRY_INFO!C56),\" \")","v":" "},{"$f":"IF(COUNTRY_INFO!Z56<>\"\",COUNTRY_INFO!V56,0)","v":0},{"$f":"IF(AND(COUNTRY_INFO!Z56<>\"\",COUNTRY_INFO!$H56=1),COUNTRY_INFO!F56+COUNTRY_INFO!G56,0)","v":0},0,null,0]
[{"$f":"IF(AND(INTRO!$E$37=\"Endémique\",INTRO!$E$39=\"Non endémique\"),IF(COUNTRY_INFO!A57=0,\" \",COUNTRY_INFO!A57),\" \")","v":" "},{"$f":"IF(AND(INTRO!$E$37=\"Endémique\",INTRO!$E$39=\"Non endémique\"),IF(COUNTRY_INFO!B57=0,\" \",COUNTRY_INFO!B57),\" \")","v":" "},{"$f":"IF(AND(INTRO!$E$37=\"Endémique\",INTRO!$E$39=\"Non endémique\"),IF(COUNTRY_INFO!C57=0,\" \",COUNTRY_INFO!C57),\" \")","v":" "},{"$f":"IF(COUNTRY_INFO!Z57<>\"\",COUNTRY_INFO!V57,0)","v":0},{"$f":"IF(AND(COUNTRY_INFO!Z57<>\"\",COUNTRY_INFO!$H57=1),COUNTRY_INFO!F57+COUNTRY_INFO!G57,0)","v":0},0,null,0]
[{"$f":"IF(AND(INTRO!$E$37=\"Endémique\",INTRO!$E$39=\"Non endémique\"),IF(COUNTRY_INFO!A58=0,\" \",COUNTRY_INFO!A58),\" \")","v":" "},{"$f":"IF(AND(INTRO!$E$37=\"Endémique\",INTRO!$E$39=\"Non endémique\"),IF(COUNTRY_INFO!B58=0,\" \",COUNTRY_INFO!B58),\" \")","v":" "},{"$f":"IF(AND(INTRO!$E$37=\"Endémique\",INTRO!$E$39=\"Non endémique\"),IF(COUNTRY_INFO!C58=0,\" \",COUNTRY_INFO!C58),\" \")","v":" "},{"$f":"IF(COUNTRY_INFO!Z58<>\"\",COUNTRY_INFO!V58,0)","v":0},{"$f":"IF(AND(COUNTRY_INFO!Z58<>\"\",COUNTRY_INFO!$H58=1),COUNTRY_INFO!F58+COUNTRY_INFO!G58,0)","v":0},0,null,0]
[{"$f":"IF(AND(INTRO!$E$37=\"Endémique\",INTRO!$E$39=\"Non endémique\"),IF(COUNTRY_INFO!A59=0,\" \",COUNTRY_INFO!A59),\" \")","v":" "},{"$f":"IF(AND(INTRO!$E$37=\"Endémique\",INTRO!$E$39=\"Non endémique\"),IF(COUNTRY_INFO!B59=0,\" \",COUNTRY_INFO!B59),\" \")","v":" "},{"$f":"IF(AND(INTRO!$E$37=\"Endémique\",INTRO!$E$39=\"Non endémique\"),IF(COUNTRY_INFO!C59=0,\" \",COUNTRY_INFO!C59),\" \")","v":" "},{"$f":"IF(COUNTRY_INFO!Z59<>\"\",COUNTRY_INFO!V59,0)","v":0},{"$f":"IF(AND(COUNTRY_INFO!Z59<>\"\",COUNTRY_INFO!$H59=1),COUNTRY_INFO!F59+COUNTRY_INFO!G59,0)","v":0},0,null,0]
[{"$f":"IF(AND(INTRO!$E$37=\"Endémique\",INTRO!$E$39=\"Non endémique\"),IF(COUNTRY_INFO!A60=0,\" \",COUNTRY_INFO!A60),\" \")","v":" "},{"$f":"IF(AND(INTRO!$E$37=\"Endémique\",INTRO!$E$39=\"Non endémique\"),IF(COUNTRY_INFO!B60=0,\" \",COUNTRY_INFO!B60),\" \")","v":" "},{"$f":"IF(AND(INTRO!$E$37=\"Endémique\",INTRO!$E$39=\"Non endémique\"),IF(COUNTRY_INFO!C60=0,\" \",COUNTRY_INFO!C60),\" \")","v":" "},{"$f":"IF(COUNTRY_INFO!Z60<>\"\",COUNTRY_INFO!V60,0)","v":0},{"$f":"IF(AND(COUNTRY_INFO!Z60<>\"\",COUNTRY_INFO!$H60=1),COUNTRY_INFO!F60+COUNTRY_INFO!G60,0)","v":0},0,null,0]
[{"$f":"IF(AND(INTRO!$E$37=\"Endémique\",INTRO!$E$39=\"Non endémique\"),IF(COUNTRY_INFO!A61=0,\" \",COUNTRY_INFO!A61),\" \")","v":" "},{"$f":"IF(AND(INTRO!$E$37=\"Endémique\",INTRO!$E$39=\"Non endémique\"),IF(COUNTRY_INFO!B61=0,\" \",COUNTRY_INFO!B61),\" \")","v":" "},{"$f":"IF(AND(INTRO!$E$37=\"Endémique\",INTRO!$E$39=\"Non endémique\"),IF(COUNTRY_INFO!C61=0,\" \",COUNTRY_INFO!C61),\" \")","v":" "},{"$f":"IF(COUNTRY_INFO!Z61<>\"\",COUNTRY_INFO!V61,0)","v":0},{"$f":"IF(AND(COUNTRY_INFO!Z61<>\"\",COUNTRY_INFO!$H61=1),COUNTRY_INFO!F61+COUNTRY_INFO!G61,0)","v":0},0,null,0]
[{"$f":"IF(AND(INTRO!$E$37=\"Endémique\",INTRO!$E$39=\"Non endémique\"),IF(COUNTRY_INFO!A62=0,\" \",COUNTRY_INFO!A62),\" \")","v":" "},{"$f":"IF(AND(INTRO!$E$37=\"Endémique\",INTRO!$E$39=\"Non endémique\"),IF(COUNTRY_INFO!B62=0,\" \",COUNTRY_INFO!B62),\" \")","v":" "},{"$f":"IF(AND(INTRO!$E$37=\"Endémique\",INTRO!$E$39=\"Non endémique\"),IF(COUNTRY_INFO!C62=0,\" \",COUNTRY_INFO!C62),\" \")","v":" "},{"$f":"IF(COUNTRY_INFO!Z62<>\"\",COUNTRY_INFO!V62,0)","v":0},{"$f":"IF(AND(COUNTRY_INFO!Z62<>\"\",COUNTRY_INFO!$H62=1),COUNTRY_INFO!F62+COUNTRY_INFO!G62,0)","v":0},0,null,0]
[{"$f":"IF(AND(INTRO!$E$37=\"Endémique\",INTRO!$E$39=\"Non endémique\"),IF(COUNTRY_INFO!A63=0,\" \",COUNTRY_INFO!A63),\" \")","v":" "},{"$f":"IF(AND(INTRO!$E$37=\"Endémique\",INTRO!$E$39=\"Non endémique\"),IF(COUNTRY_INFO!B63=0,\" \",COUNTRY_INFO!B63),\" \")","v":" "},{"$f":"IF(AND(INTRO!$E$37=\"Endémique\",INTRO!$E$39=\"Non endémique\"),IF(COUNTRY_INFO!C63=0,\" \",COUNTRY_INFO!C63),\" \")","v":" "},{"$f":"IF(COUNTRY_INFO!Z63<>\"\",COUNTRY_INFO!V63,0)","v":0},{"$f":"IF(AND(COUNTRY_INFO!Z63<>\"\",COUNTRY_INFO!$H63=1),COUNTRY_INFO!F63+COUNTRY_INFO!G63,0)","v":0},0,null,0]
[{"$f":"IF(AND(INTRO!$E$37=\"Endémique\",INTRO!$E$39=\"Non endémique\"),IF(COUNTRY_INFO!A64=0,\" \",COUNTRY_INFO!A64),\" \")","v":" "},{"$f":"IF(AND(INTRO!$E$37=\"Endémique\",INTRO!$E$39=\"Non endémique\"),IF(COUNTRY_INFO!B64=0,\" \",COUNTRY_INFO!B64),\" \")","v":" "},{"$f":"IF(AND(INTRO!$E$37=\"Endémique\",INTRO!$E$39=\"Non endémique\"),IF(COUNTRY_INFO!C64=0,\" \",COUNTRY_INFO!C64),\" \")","v":" "},{"$f":"IF(COUNTRY_INFO!Z64<>\"\",COUNTRY_INFO!V64,0)","v":0},{"$f":"IF(AND(COUNTRY_INFO!Z64<>\"\",COUNTRY_INFO!$H64=1),COUNTRY_INFO!F64+COUNTRY_INFO!G64,0)","v":0},0,null,0]
[{"$f":"IF(AND(INTRO!$E$37=\"Endémique\",INTRO!$E$39=\"Non endémique\"),IF(COUNTRY_INFO!A65=0,\" \",COUNTRY_INFO!A65),\" \")","v":" "},{"$f":"IF(AND(INTRO!$E$37=\"Endémique\",INTRO!$E$39=\"Non endémique\"),IF(COUNTRY_INFO!B65=0,\" \",COUNTRY_INFO!B65),\" \")","v":" "},{"$f":"IF(AND(INTRO!$E$37=\"Endémique\",INTRO!$E$39=\"Non endémique\"),IF(COUNTRY_INFO!C65=0,\" \",COUNTRY_INFO!C65),\" \")","v":" "},{"$f":"IF(COUNTRY_INFO!Z65<>\"\",COUNTRY_INFO!V65,0)","v":0},{"$f":"IF(AND(COUNTRY_INFO!Z65<>\"\",COUNTRY_INFO!$H65=1),COUNTRY_INFO!F65+COUNTRY_INFO!G65,0)","v":0},0,null,0]
[{"$f":"IF(AND(INTRO!$E$37=\"Endémique\",INTRO!$E$39=\"Non endémique\"),IF(COUNTRY_INFO!A66=0,\" \",COUNTRY_INFO!A66),\" \")","v":" "},{"$f":"IF(AND(INTRO!$E$37=\"Endémique\",INTRO!$E$39=\"Non endémique\"),IF(COUNTRY_INFO!B66=0,\" \",COUNTRY_INFO!B66),\" \")","v":" "},{"$f":"IF(AND(INTRO!$E$37=\"Endémique\",INTRO!$E$39=\"Non endémique\"),IF(COUNTRY_INFO!C66=0,\" \",COUNTRY_INFO!C66),\" \")","v":" "},{"$f":"IF(COUNTRY_INFO!Z66<>\"\",COUNTRY_INFO!V66,0)","v":0},{"$f":"IF(AND(COUNTRY_INFO!Z66<>\"\",COUNTRY_INFO!$H66=1),COUNTRY_INFO!F66+COUNTRY_INFO!G66,0)","v":0},0,null,0]
[{"$f":"IF(AND(INTRO!$E$37=\"Endémique\",INTRO!$E$39=\"Non endémique\"),IF(COUNTRY_INFO!A67=0,\" \",COUNTRY_INFO!A67),\" \")","v":" "},{"$f":"IF(AND(INTRO!$E$37=\"Endémique\",INTRO!$E$39=\"Non endémique\"),IF(COUNTRY_INFO!B67=0,\" \",COUNTRY_INFO!B67),\" \")","v":" "},{"$f":"IF(AND(INTRO!$E$37=\"Endémique\",INTRO!$E$39=\"Non endémique\"),IF(COUNTRY_INFO!C67=0,\" \",COUNTRY_INFO!C67),\" \")","v":" "},{"$f":"IF(COUNTRY_INFO!Z67<>\"\",COUNTRY_INFO!V67,0)","v":0},{"$f":"IF(AND(COUNTRY_INFO!Z67<>\"\",COUNTRY_INFO!$H67=1),COUNTRY_INFO!F67+COUNTRY_INFO!G67,0)","v":0},0,null,0]
[{"$f":"IF(AND(INTRO!$E$37=\"Endémique\",INTRO!$E$39=\"Non endémique\"),IF(COUNTRY_INFO!A68=0,\" \",COUNTRY_INFO!A68),\" \")","v":" "},{"$f":"IF(AND(INTRO!$E$37=\"Endémique\",INTRO!$E$39=\"Non endémique\"),IF(COUNTRY_INFO!B68=0,\" \",COUNTRY_INFO!B68),\" \")","v":" "},{"$f":"IF(AND(INTRO!$E$37=\"Endémique\",INTRO!$E$39=\"Non endémique\"),IF(COUNTRY_INFO!C68=0,\" \",COUNTRY_INFO!C68),\" \")","v":" "},{"$f":"IF(COUNTRY_INFO!Z68<>\"\",COUNTRY_INFO!V68,0)","v":0},{"$f":"IF(AND(COUNTRY_INFO!Z68<>\"\",COUNTRY_INFO!$H68=1),COUNTRY_INFO!F68+COUNTRY_INFO!G68,0)","v":0},0,null,0]
[{"$f":"IF(AND(INTRO!$E$37=\"Endémique\",INTRO!$E$39=\"Non endémique\"),IF(COUNTRY_INFO!A69=0,\" \",COUNTRY_INFO!A69),\" \")","v":" "},{"$f":"IF(AND(INTRO!$E$37=\"Endémique\",INTRO!$E$39=\"Non endémique\"),IF(COUNTRY_INFO!B69=0,\" \",COUNTRY_INFO!B69),\" \")","v":" "},{"$f":"IF(AND(INTRO!$E$37=\"Endémique\",INTRO!$E$39=\"Non endémique\"),IF(COUNTRY_INFO!C69=0,\" \",COUNTRY_INFO!C69),\" \")","v":" "},{"$f":"IF(COUNTRY_INFO!Z69<>\"\",COUNTRY_INFO!V69,0)","v":0},{"$f":"IF(AND(COUNTRY_INFO!Z69<>\"\",COUNTRY_INFO!$H69=1),COUNTRY_INFO!F69+COUNTRY_INFO!G69,0)","v":0},0,null,0]
[{"$f":"IF(AND(INTRO!$E$37=\"Endémique\",INTRO!$E$39=\"Non endémique\"),IF(COUNTRY_INFO!A70=0,\" \",COUNTRY_INFO!A70),\" \")","v":" "},{"$f":"IF(AND(INTRO!$E$37=\"Endémique\",INTRO!$E$39=\"Non endémique\"),IF(COUNTRY_INFO!B70=0,\" \",COUNTRY_INFO!B70),\" \")","v":" "},{"$f":"IF(AND(INTRO!$E$37=\"Endémique\",INTRO!$E$39=\"Non endémique\"),IF(COUNTRY_INFO!C70=0,\" \",COUNTRY_INFO!C70),\" \")","v":" "},{"$f":"IF(COUNTRY_INFO!Z70<>\"\",COUNTRY_INFO!V70,0)","v":0},{"$f":"IF(AND(COUNTRY_INFO!Z70<>\"\",COUNTRY_INFO!$H70=1),COUNTRY_INFO!F70+COUNTRY_INFO!G70,0)","v":0},0,null,0]
[{"$f":"IF(AND(INTRO!$E$37=\"Endémique\",INTRO!$E$39=\"Non endémique\"),IF(COUNTRY_INFO!A71=0,\" \",COUNTRY_INFO!A71),\" \")","v":" "},{"$f":"IF(AND(INTRO!$E$37=\"Endémique\",INTRO!$E$39=\"Non endémique\"),IF(COUNTRY_INFO!B71=0,\" \",COUNTRY_INFO!B71),\" \")","v":" "},{"$f":"IF(AND(INTRO!$E$37=\"Endémique\",INTRO!$E$39=\"Non endémique\"),IF(COUNTRY_INFO!C71=0,\" \",COUNTRY_INFO!C71),\" \")","v":" "},{"$f":"IF(COUNTRY_INFO!Z71<>\"\",COUNTRY_INFO!V71,0)","v":0},{"$f":"IF(AND(COUNTRY_INFO!Z71<>\"\",COUNTRY_INFO!$H71=1),COUNTRY_INFO!F71+COUNTRY_INFO!G71,0)","v":0},0,null,0]
[{"$f":"IF(AND(INTRO!$E$37=\"Endémique\",INTRO!$E$39=\"Non endémique\"),IF(COUNTRY_INFO!A72=0,\" \",COUNTRY_INFO!A72),\" \")","v":" "},{"$f":"IF(AND(INTRO!$E$37=\"Endémique\",INTRO!$E$39=\"Non endémique\"),IF(COUNTRY_INFO!B72=0,\" \",COUNTRY_INFO!B72),\" \")","v":" "},{"$f":"IF(AND(INTRO!$E$37=\"Endémique\",INTRO!$E$39=\"Non endémique\"),IF(COUNTRY_INFO!C72=0,\" \",COUNTRY_INFO!C72),\" \")","v":" "},{"$f":"IF(COUNTRY_INFO!Z72<>\"\",COUNTRY_INFO!V72,0)","v":0},{"$f":"IF(AND(COUNTRY_INFO!Z72<>\"\",COUNTRY_INFO!$H72=1),COUNTRY_INFO!F72+COUNTRY_INFO!G72,0)","v":0},0,null,0]
[{"$f":"IF(AND(INTRO!$E$37=\"Endémique\",INTRO!$E$39=\"Non endémique\"),IF(COUNTRY_INFO!A73=0,\" \",COUNTRY_INFO!A73),\" \")","v":" "},{"$f":"IF(AND(INTRO!$E$37=\"Endémique\",INTRO!$E$39=\"Non endémique\"),IF(COUNTRY_INFO!B73=0,\" \",COUNTRY_INFO!B73),\" \")","v":" "},{"$f":"IF(AND(INTRO!$E$37=\"Endémique\",INTRO!$E$39=\"Non endémique\"),IF(COUNTRY_INFO!C73=0,\" \",COUNTRY_INFO!C73),\" \")","v":" "},{"$f":"IF(COUNTRY_INFO!Z73<>\"\",COUNTRY_INFO!V73,0)","v":0},{"$f":"IF(AND(COUNTRY_INFO!Z73<>\"\",COUNTRY_INFO!$H73=1),COUNTRY_INFO!F73+COUNTRY_INFO!G73,0)","v":0},0,null,0]
[{"$f":"IF(AND(INTRO!$E$37=\"Endémique\",INTRO!$E$39=\"Non endémique\"),IF(COUNTRY_INFO!A74=0,\" \",COUNTRY_INFO!A74),\" \")","v":" "},{"$f":"IF(AND(INTRO!$E$37=\"Endémique\",INTRO!$E$39=\"Non endémique\"),IF(COUNTRY_INFO!B74=0,\" \",COUNTRY_INFO!B74),\" \")","v":" "},{"$f":"IF(AND(INTRO!$E$37=\"Endémique\",INTRO!$E$39=\"Non endémique\"),IF(COUNTRY_INFO!C74=0,\" \",COUNTRY_INFO!C74),\" \")","v":" "},{"$f":"IF(COUNTRY_INFO!Z74<>\"\",COUNTRY_INFO!V74,0)","v":0},{"$f":"IF(AND(COUNTRY_INFO!Z74<>\"\",COUNTRY_INFO!$H74=1),COUNTRY_INFO!F74+COUNTRY_INFO!G74,0)","v":0},0,null,0]
[{"$f":"IF(AND(INTRO!$E$37=\"Endémique\",INTRO!$E$39=\"Non endémique\"),IF(COUNTRY_INFO!A75=0,\" \",COUNTRY_INFO!A75),\" \")","v":" "},{"$f":"IF(AND(INTRO!$E$37=\"Endémique\",INTRO!$E$39=\"Non endémique\"),IF(COUNTRY_INFO!B75=0,\" \",COUNTRY_INFO!B75),\" \")","v":" "},{"$f":"IF(AND(INTRO!$E$37=\"Endémique\",INTRO!$E$39=\"Non endémique\"),IF(COUNTRY_INFO!C75=0,\" \",COUNTRY_INFO!C75),\" \")","v":" "},{"$f":"IF(COUNTRY_INFO!Z75<>\"\",COUNTRY_INFO!V75,0)","v":0},{"$f":"IF(AND(COUNTRY_INFO!Z75<>\"\",COUNTRY_INFO!$H75=1),COUNTRY_INFO!F75+COUNTRY_INFO!G75,0)","v":0},{"$f":"E75*2.8","v":0},null,0]
[{"$f":"IF(AND(INTRO!$E$37=\"Endémique\",INTRO!$E$39=\"Non endémique\"),IF(COUNTRY_INFO!A76=0,\" \",COUNTRY_INFO!A76),\" \")","v":" "},{"$f":"IF(AND(INTRO!$E$37=\"Endémique\",INTRO!$E$39=\"Non endémique\"),IF(COUNTRY_INFO!B76=0,\" \",COUNTRY_INFO!B76),\" \")","v":" "},{"$f":"IF(AND(INTRO!$E$37=\"Endémique\",INTRO!$E$39=\"Non endémique\"),IF(COUNTRY_INFO!C76=0,\" \",COUNTRY_INFO!C76),\" \")","v":" "},{"$f":"IF(COUNTRY_INFO!Z76<>\"\",COUNTRY_INFO!V76,0)","v":0},{"$f":"IF(AND(COUNTRY_INFO!Z76<>\"\",COUNTRY_INFO!$H76=1),COUNTRY_INFO!F76+COUNTRY_INFO!G76,0)","v":0},0,null,0]
[{"$f":"IF(AND(INTRO!$E$37=\"Endémique\",INTRO!$E$39=\"Non endémique\"),IF(COUNTRY_INFO!A77=0,\" \",COUNTRY_INFO!A77),\" \")","v":" "},{"$f":"IF(AND(INTRO!$E$37=\"Endémique\",INTRO!$E$39=\"Non endémique\"),IF(COUNTRY_INFO!B77=0,\" \",COUNTRY_INFO!B77),\" \")","v":" "},{"$f":"IF(AND(INTRO!$E$37=\"Endémique\",INTRO!$E$39=\"Non endémique\"),IF(COUNTRY_INFO!C77=0,\" \",COUNTRY_INFO!C77),\" \")","v":" "},{"$f":"IF(COUNTRY_INFO!Z77<>\"\",COUNTRY_INFO!V77,0)","v":0},{"$f":"IF(AND(COUNTRY_INFO!Z77<>\"\",COUNTRY_INFO!$H77=1),COUNTRY_INFO!F77+COUNTRY_INFO!G77,0)","v":0},0,null,0]
[{"$f":"IF(AND(INTRO!$E$37=\"Endémique\",INTRO!$E$39=\"Non endémique\"),IF(COUNTRY_INFO!A78=0,\" \",COUNTRY_INFO!A78),\" \")","v":" "},{"$f":"IF(AND(INTRO!$E$37=\"Endémique\",INTRO!$E$39=\"Non endémique\"),IF(COUNTRY_INFO!B78=0,\" \",COUNTRY_INFO!B78),\" \")","v":" "},{"$f":"IF(AND(INTRO!$E$37=\"Endémique\",INTRO!$E$39=\"Non endémique\"),IF(COUNTRY_INFO!C78=0,\" \",COUNTRY_INFO!C78),\" \")","v":" "},{"$f":"IF(COUNTRY_INFO!Z78<>\"\",COUNTRY_INFO!V78,0)","v":0},{"$f":"IF(AND(COUNTRY_INFO!Z78<>\"\",COUNTRY_INFO!$H78=1),COUNTRY_INFO!F78+COUNTRY_INFO!G78,0)","v":0},0,null,0]
[{"$f":"IF(AND(INTRO!$E$37=\"Endémique\",INTRO!$E$39=\"Non endémique\"),IF(COUNTRY_INFO!A79=0,\" \",COUNTRY_INFO!A79),\" \")","v":" "},{"$f":"IF(AND(INTRO!$E$37=\"Endémique\",INTRO!$E$39=\"Non endémique\"),IF(COUNTRY_INFO!B79=0,\" \",COUNTRY_INFO!B79),\" \")","v":" "},{"$f":"IF(AND(INTRO!$E$37=\"Endémique\",INTRO!$E$39=\"Non endémique\"),IF(COUNTRY_INFO!C79=0,\" \",COUNTRY_INFO!C79),\" \")","v":" "},{"$f":"IF(COUNTRY_INFO!Z79<>\"\",COUNTRY_INFO!V79,0)","v":0},{"$f":"IF(AND(COUNTRY_INFO!Z79<>\"\",COUNTRY_INFO!$H79=1),COUNTRY_INFO!F79+COUNTRY_INFO!G79,0)","v":0},0,null,0]
[{"$f":"IF(AND(INTRO!$E$37=\"Endémique\",INTRO!$E$39=\"Non endémique\"),IF(COUNTRY_INFO!A80=0,\" \",COUNTRY_INFO!A80),\" \")","v":" "},{"$f":"IF(AND(INTRO!$E$37=\"Endémique\",INTRO!$E$39=\"Non endémique\"),IF(COUNTRY_INFO!B80=0,\" \",COUNTRY_INFO!B80),\" \")","v":" "},{"$f":"IF(AND(INTRO!$E$37=\"Endémique\",INTRO!$E$39=\"Non endémique\"),IF(COUNTRY_INFO!C80=0,\" \",COUNTRY_INFO!C80),\" \")","v":" "},{"$f":"IF(COUNTRY_INFO!Z80<>\"\",COUNTRY_INFO!V80,0)","v":0},{"$f":"IF(AND(COUNTRY_INFO!Z80<>\"\",COUNTRY_INFO!$H80=1),COUNTRY_INFO!F80+COUNTRY_INFO!G80,0)","v":0},0,null,0]
[{"$f":"IF(AND(INTRO!$E$37=\"Endémique\",INTRO!$E$39=\"Non endémique\"),IF(COUNTRY_INFO!A81=0,\" \",COUNTRY_INFO!A81),\" \")","v":" "},{"$f":"IF(AND(INTRO!$E$37=\"Endémique\",INTRO!$E$39=\"Non endémique\"),IF(COUNTRY_INFO!B81=0,\" \",COUNTRY_INFO!B81),\" \")","v":" "},{"$f":"IF(AND(INTRO!$E$37=\"Endémique\",INTRO!$E$39=\"Non endémique\"),IF(COUNTRY_INFO!C81=0,\" \",COUNTRY_INFO!C81),\" \")","v":" "},{"$f":"IF(COUNTRY_INFO!Z81<>\"\",COUNTRY_INFO!V81,0)","v":0},{"$f":"IF(AND(COUNTRY_INFO!Z81<>\"\",COUNTRY_INFO!$H81=1),COUNTRY_INFO!F81+COUNTRY_INFO!G81,0)","v":0},0,null,0]
[{"$f":"IF(AND(INTRO!$E$37=\"Endémique\",INTRO!$E$39=\"Non endémique\"),IF(COUNTRY_INFO!A82=0,\" \",COUNTRY_INFO!A82),\" \")","v":" "},{"$f":"IF(AND(INTRO!$E$37=\"Endémique\",INTRO!$E$39=\"Non endémique\"),IF(COUNTRY_INFO!B82=0,\" \",COUNTRY_INFO!B82),\" \")","v":" "},{"$f":"IF(AND(INTRO!$E$37=\"Endémique\",INTRO!$E$39=\"Non endémique\"),IF(COUNTRY_INFO!C82=0,\" \",COUNTRY_INFO!C82),\" \")","v":" "},{"$f":"IF(COUNTRY_INFO!Z82<>\"\",COUNTRY_INFO!V82,0)","v":0},{"$f":"IF(AND(COUNTRY_INFO!Z82<>\"\",COUNTRY_INFO!$H82=1),COUNTRY_INFO!F82+COUNTRY_INFO!G82,0)","v":0},0,null,0]
[{"$f":"IF(AND(INTRO!$E$37=\"Endémique\",INTRO!$E$39=\"Non endémique\"),IF(COUNTRY_INFO!A83=0,\" \",COUNTRY_INFO!A83),\" \")","v":" "},{"$f":"IF(AND(INTRO!$E$37=\"Endémique\",INTRO!$E$39=\"Non endémique\"),IF(COUNTRY_INFO!B83=0,\" \",COUNTRY_INFO!B83),\" \")","v":" "},{"$f":"IF(AND(INTRO!$E$37=\"Endémique\",INTRO!$E$39=\"Non endémique\"),IF(COUNTRY_INFO!C83=0,\" \",COUNTRY_INFO!C83),\" \")","v":" "},{"$f":"IF(COUNTRY_INFO!Z83<>\"\",COUNTRY_INFO!V83,0)","v":0},{"$f":"IF(AND(COUNTRY_INFO!Z83<>\"\",COUNTRY_INFO!$H83=1),COUNTRY_INFO!F83+COUNTRY_INFO!G83,0)","v":0},0,null,0]
[{"$f":"IF(AND(INTRO!$E$37=\"Endémique\",INTRO!$E$39=\"Non endémique\"),IF(COUNTRY_INFO!A84=0,\" \",COUNTRY_INFO!A84),\" \")","v":" "},{"$f":"IF(AND(INTRO!$E$37=\"Endémique\",INTRO!$E$39=\"Non endémique\"),IF(COUNTRY_INFO!B84=0,\" \",COUNTRY_INFO!B84),\" \")","v":" "},{"$f":"IF(AND(INTRO!$E$37=\"Endémique\",INTRO!$E$39=\"Non endémique\"),IF(COUNTRY_INFO!C84=0,\" \",COUNTRY_INFO!C84),\" \")","v":" "},{"$f":"IF(COUNTRY_INFO!Z84<>\"\",COUNTRY_INFO!V84,0)","v":0},{"$f":"IF(AND(COUNTRY_INFO!Z84<>\"\",COUNTRY_INFO!$H84=1),COUNTRY_INFO!F84+COUNTRY_INFO!G84,0)","v":0},0,null,0]
[{"$f":"IF(AND(INTRO!$E$37=\"Endémique\",INTRO!$E$39=\"Non endémique\"),IF(COUNTRY_INFO!A85=0,\" \",COUNTRY_INFO!A85),\" \")","v":" "},{"$f":"IF(AND(INTRO!$E$37=\"Endémique\",INTRO!$E$39=\"Non endémique\"),IF(COUNTRY_INFO!B85=0,\" \",COUNTRY_INFO!B85),\" \")","v":" "},{"$f":"IF(AND(INTRO!$E$37=\"Endémique\",INTRO!$E$39=\"Non endémique\"),IF(COUNTRY_INFO!C85=0,\" \",COUNTRY_INFO!C85),\" \")","v":" "},{"$f":"IF(COUNTRY_INFO!Z85<>\"\",COUNTRY_INFO!V85,0)","v":0},{"$f":"IF(AND(COUNTRY_INFO!Z85<>\"\",COUNTRY_INFO!$H85=1),COUNTRY_INFO!F85+COUNTRY_INFO!G85,0)","v":0},0,null,0]
[{"$f":"IF(AND(INTRO!$E$37=\"Endémique\",INTRO!$E$39=\"Non endémique\"),IF(COUNTRY_INFO!A86=0,\" \",COUNTRY_INFO!A86),\" \")","v":" "},{"$f":"IF(AND(INTRO!$E$37=\"Endémique\",INTRO!$E$39=\"Non endémique\"),IF(COUNTRY_INFO!B86=0,\" \",COUNTRY_INFO!B86),\" \")","v":" "},{"$f":"IF(AND(INTRO!$E$37=\"Endémique\",INTRO!$E$39=\"Non endémique\"),IF(COUNTRY_INFO!C86=0,\" \",COUNTRY_INFO!C86),\" \")","v":" "},{"$f":"IF(COUNTRY_INFO!Z86<>\"\",COUNTRY_INFO!V86,0)","v":0},{"$f":"IF(AND(COUNTRY_INFO!Z86<>\"\",COUNTRY_INFO!$H86=1),COUNTRY_INFO!F86+COUNTRY_INFO!G86,0)","v":0},0,null,0]
[{"$f":"IF(AND(INTRO!$E$37=\"Endémique\",INTRO!$E$39=\"Non endémique\"),IF(COUNTRY_INFO!A87=0,\" \",COUNTRY_INFO!A87),\" \")","v":" "},{"$f":"IF(AND(INTRO!$E$37=\"Endémique\",INTRO!$E$39=\"Non endémique\"),IF(COUNTRY_INFO!B87=0,\" \",COUNTRY_INFO!B87),\" \")","v":" "},{"$f":"IF(AND(INTRO!$E$37=\"Endémique\",INTRO!$E$39=\"Non endémique\"),IF(COUNTRY_INFO!C87=0,\" \",COUNTRY_INFO!C87),\" \")","v":" "},{"$f":"IF(COUNTRY_INFO!Z87<>\"\",COUNTRY_INFO!V87,0)","v":0},{"$f":"IF(AND(COUNTRY_INFO!Z87<>\"\",COUNTRY_INFO!$H87=1),COUNTRY_INFO!F87+COUNTRY_INFO!G87,0)","v":0},0,null,0]
[{"$f":"IF(AND(INTRO!$E$37=\"Endémique\",INTRO!$E$39=\"Non endémique\"),IF(COUNTRY_INFO!A88=0,\" \",COUNTRY_INFO!A88),\" \")","v":" "},{"$f":"IF(AND(INTRO!$E$37=\"Endémique\",INTRO!$E$39=\"Non endémique\"),IF(COUNTRY_INFO!B88=0,\" \",COUNTRY_INFO!B88),\" \")","v":" "},{"$f":"IF(AND(INTRO!$E$37=\"Endémique\",INTRO!$E$39=\"Non endémique\"),IF(COUNTRY_INFO!C88=0,\" \",COUNTRY_INFO!C88),\" \")","v":" "},{"$f":"IF(COUNTRY_INFO!Z88<>\"\",COUNTRY_INFO!V88,0)","v":0},{"$f":"IF(AND(COUNTRY_INFO!Z88<>\"\",COUNTRY_INFO!$H88=1),COUNTRY_INFO!F88+COUNTRY_INFO!G88,0)","v":0},0,null,0]

{"sheet":"SUMMARY","index":7,"n_rows":93,"n_cols":8,"rows_kept":93,"cut":false,"hidden":false,"merged":[[73,4,73,5],[60,4,60,6],[61,4,61,6],[62,4,62,6],[72,2,72,3],[72,4,72,5],[72,6,72,7],[81,2,81,7],[83,3,83,7],[59,4,59,6],[50,1,50,7],[56,1,56,7],[51,1,51,7],[52,1,52,7],[80,1,80,7],[58,1,58,7],[78,1,78,7],[79,1,79,7],[66,1,66,7],[76,2,76,3],[74,2,74,3],[74,4,74,5],[73,2,73,3],[55,1,55,7],[9,1,10,1],[9,3,9,6],[9,2,10,2],[17,1,19,1],[21,1,23,1],[25,1,27,1],[9,7,10,7],[32,2,35,4],[84,3,84,7],[83,1,83,2],[0,1,0,7],[1,1,1,7],[2,1,2,5],[3,1,3,7],[4,1,4,7],[6,1,6,7],[5,2,5,5],[65,1,65,7],[54,1,54,7],[53,1,53,7],[36,1,36,7],[41,2,41,3],[41,4,41,5],[41,6,41,7],[57,1,57,7],[82,2,82,6],[63,4,63,6],[75,2,75,3],[97,1,97,7],[75,4,75,5],[70,4,70,5],[71,4,71,5],[70,2,70,3],[71,2,71,3],[92,1,92,7],[76,4,76,5],[87,1,87,7],[91,1,91,7],[86,1,86,7],[84,1,84,2]]}
[]
[null,"Formulaire de demande commune de médicaments pour CP v.4.1"]
[]
[null,"Ce formulaire constitue une demande officielle du Gouvernement à l'OMS pour l'approvisionnement des médicaments mentionnés ci-dessus. Pour garantir la livraison des médicaments à temps, la demande de médicaments CP doit être soumise au moins 9 mois avant la première date d'administration massive de médicaments prévue dans l'année civile de la demande."]
[]
[null,"Pays",{"$f":"IF(INTRO!$E$33<>0,INTRO!$E$33,\" \")","v":"SENEGAL"},null,null,null,"Année",{"$f":"IF(INTRO!$E$35<>0,INTRO!$E$35,\" \")","v":2024}]
[]
[null,"Information on PC medicines requested to WHO"]
[]
[null,"Le médicament","Groupe ciblé","Nombre de comprimés",null,null,null,"Préciser l’origine"]
[null,null,null,"Requis","En stock","En cours de demande","Demandés"]
[null,"Diethylcarbamazine","TOUTE",0,0,null,{"$f":"IF(D12>(E12+F12),D12-E12-F12, 0)","v":0}]
[null,null,null,null,null,null,0]
[null,"Ivermectine","TOUTE",1246109.2,0,null,1246109.2,"OMS"]
[]
[null,"Albendazole pour FL","TOUTE",445039,0,null,445039,"OMS"]
[null,null,null,null,null,null,0]
[null,"Albendazole pour STH","EAPréS",null,null,null,0]
[null,null,"EAS",990999,null,null,990999,"OMS"]
[null,null,"Adultes",null,null,null,0]
[]
[null,"Mebendazole","EAPréS",null,null,null,0]
[null,null,"EAS",null,null,null,0]
[null,null,"Adultes",null,null,null,0]
[]
[null,"Praziquantel","EAPréS",0,null,null,0]
[null,null,"EAS",2988698,null,null,2988698,"OMS"]
[null,null,"Adultes",9842205,null,null,{"$f":"IF(D28>(E28+F28),D28-E28-F28, 0)","v":9842205},"OMS"]
[]
[null,"Nombre de personnes devant être traitées avec le médicament donné"]
[]
[null,"La maladie",null,null,null,"1er tour","2ème tour","3ème tour"]
[null,"Filariose lymphatique","Ces chiffres sont estimés uniquement pour les goupes d'âge ciblés pour le traitement avec les médicaments donnés, dans les régions où le traitement de maladies spécifiques est requis",null,null,445039]
[null,"Onchocercose",null,null,null,0,0]
[null,"Schistosomiase",null,null,null,4619693,209190.66666666672]
[null,"Géohelminthiases",null,null,null,2360394,0,0]
[]
[]
[]
[null,"Informations sur les interventions CP planifiées "]
[]
[null,"Le médicament","Veuillez sélectionner une date (mois et année) pour la 1ère tournée de CP",null,"Veuillez sélectionner une date (mois et année) pour la 2ème tournée de CP",null,"Date à laquelle les médicaments devraient atteindre l’entrepôt national"]
[null,"Diethylcarbamazine"]
[null,"Ivermectine","Mai",2024,null,null,"Janvier",2024]
[null,"Albendazole pour FL","Mai",2024,null,null,"Janvier",2024]
[null,"Albendazole pour STH","Mai",2024,null,null,"Janvier",2024]
[null,"Mebendazole"]
[null,"Praziquantel","Mai",2024,"Novembre",2024,"Janvier",2024]
[]
[null,"Récapitulatif - Checklist"]
[null,"Submission"]
[null,"Que faut-il soumettre ?"]
[null,"L'approvisionnement des médicaments demandés doit être basé sur des données épidémiologiques à jour, des plans d'utilisation des médicaments spécifiques et sur la capacité de mise en oeuvre. La liste suivante permet d'assurer que tous les formulaires et toutes les informations sont fournis à l'OMS (en format électronique)."]
[null,"Formulaire de demande commune de médicaments pour chimioprévention"]
[null,"Formulaire de rapport commun"]
[null,"Déclaration des données épidémiologiques pour la CP"]
[]
[null,"Disponibilité de financement pour la mise en oeuvre de tournées pendant l’année pour laquelle les medicaments ont été demandés"]
[]
[null,"Maladies ciblées pour la mise en oeuvre","# de traitements ","Financement assuré pour","Origine",null,null,"Montant"]
[null,"Filariose lymphatique",{"$f":"SUM(F33:H33)","v":445039},"Tous","FHI360"]
[null,"Onchocercose",{"$f":"SUM(F34:H34)","v":0}]
[null,"Schistosomiase",{"$f":"SUM(F35:H35)","v":4828883.666666667},"Tous","ARISE et FHI360"]
[null,"Géohelminthiases",{"$f":"SUM(F36:H36)","v":2360394},"Tous","ARISE et FHI360"]
[]
[null,"Qui doit remplir le formulaire ?"]
[null,"Le Coordonnateur national MTN doit compiler toutes les informations nécessaires pour compléter le formulaire de demande.  En l'absence d'un coordonnateur, les gestionnaires de programmes spécifiques devraient coordonner leurs sections respectives. Une fois finalisée, chaque demande individuelle doit être approuvée par le Ministère de la Santé."]
[]
[null,"Informations concernant la (les) personne(s) ayant rempli le formulaire"]
[]
[null,"Titre/fonction ","Nom",null,"Téléphone",null,"Email","Date"]
[null,"Gestionnaire de programme SCH","DR BOUBACAR DIOP",null,221774126467,null,"docbocardiop@yahoo.fr","2023-03-01"]
[null,"Coordonnateur MTN/CP","Dr Ndeye Mbacké Kane",null,221776575837,null,"mbackekane2007@yahoo.fr",44767]
[null,"Gestionnaire de Programme FL","Dr Ngayo SY",null,776570322,null,"ngayosy50@hotmail.com","2023-03-01"]
[]
[]
[]
[]
[null,"L’OMS recommende que tous les effets secondaires graves suspectés d’être associés à l’ingestion de médicaments de CP soient rapportés en suivant les lignes directrices nationales de pharmacovigilance.  En l’absence d’un système de pharmacovigilance national, contactez le département de Contrôle des Maladies Tropicales Négligées pour être conseillé."]
[null,"L’OMS s’est engagée à rendre possible la donation de médicaments en fournissant gratuitement: a) albendazole, mebendazole et praziquantel à l’entrepôt national du Ministère de la Santé et b) diethylcarbamazine au port d’entrée du pays receveur."]
[null,"L’institution soumettant la présente requête est responsable de: a) l’organisation du déchargement des médicaments du camion, du stockage dans l’entrepôt national et de l’expédition vers les centres où aura lieu la distribution finale; b) de l’enregistrement, si nécessaire, des médicaments donnés, auprès des autorités nationales en charge; et de c) de l’information de n’importe quels changements ayant trait à leurs campagnes de traitement (par exemple le report d’une date planifiée de distribution en masse de médicaments, le remplacement d’un coordonateur MTN, etc.)."]
[null,null,"J’ai pris connaissance et accepté la politique de la communication \nde données de l’OMS"]
[null,null,"Je confirme que toutes les informations fournies dans ce formulaire sont complètes et correctes"]
[null,"Nom et signature \ndu Coordonnateur MTN ou du \nReprésentant du Ministère de la Santé",null,"Dr Ndeye Mbacké Kane"]
[null,"Date",null,"2023-03-25"]
[]
[null,"Si vous avez plus d'un destinataire final pour les médicaments de chimioprévention demandés, veuillez compléter les informations de la rubrique \"Informations concernant l'envoi et le destinataire\" dans la feuille de travail SHIPMENT."]
[null,"Veuillez envoyer le rapport national (signé et sous format électronique) au représentant de I'OMS du pays en mettant en copie:"]
[null,"Siège de l'OMS ","PC_JointForms@who.int"]
[null,"Bureau régional de l'OMS","Conseiller régional MTN"]
[null,"Mectizan donation programme","Dr Yao Sodahlon, email: ysodahlon@taskforce.org"]
[]
[null,"Veuillez noter que votre demande sera examinée par un panel d'experts indépendants (Comité ad hoc d’évaluation conjointe). Les informations contenues dans ce formulaire, le rapport commun d'activités (ou rapport national d'activités) et le plan d'action annuel sont essentiels à l'OMS pour assurer un usage optimal des médicaments. Dans le cadre de ses activités courantes de suivi et d'évaluation, et afin d'honorer ses obligations contractuelles envers les bailleurs de fonds  et autres partenaires, l'OMS et ses agents affiliés se réservent le droit d'inspecter, périodiquement, les stocks de médicaments au niveau national. "]

{"sheet":"SHIPMENT","index":8,"n_rows":48,"n_cols":8,"rows_kept":48,"cut":false,"hidden":false,"merged":[[34,1,34,7],[36,1,36,7],[0,1,0,7],[1,1,1,7],[2,1,2,5],[17,5,17,7],[18,5,18,7],[19,2,19,4],[19,5,19,7],[21,2,21,4],[3,2,3,5],[4,1,4,7],[22,2,22,4],[22,5,22,7],[15,2,15,4],[20,5,20,7],[15,5,15,7],[20,2,20,4],[18,2,18,4],[16,2,16,4],[47,1,54,7],[45,1,45,7],[37,1,37,6],[38,1,38,5],[40,1,40,7],[41,1,41,6],[39,1,39,6],[42,1,42,6],[43,1,43,7],[25,2,25,4],[25,5,25,7],[24,1,24,7],[6,1,6,7],[7,2,7,4],[7,5,7,7],[8,2,8,4],[8,5,8,7],[9,2,9,4],[9,5,9,7],[10,2,10,4],[10,5,10,7],[11,2,11,4],[11,5,11,7],[12,2,12,4],[12,5,12,7],[13,2,13,4],[13,5,13,7],[14,2,14,4],[14,5,14,7],[23,2,23,4],[23,5,23,7],[21,5,21,7],[16,5,16,7],[17,2,17,4],[26,2,26,4],[26,5,26,7],[27,2,27,4],[27,5,27,7],[28,2,28,4],[28,5,28,7],[32,2,32,4],[32,5,32,7],[29,2,29,4],[29,5,29,7],[30,2,30,4],[30,5,30,7],[31,2,31,4],[31,5,31,7]]}
[]
[null,"Formulaire de demande commune de médicaments pour CP v.4.1"]
[]
[null,"Pays",{"$f":"IF(INTRO!$E$33<>0,INTRO!$E$33,\" \")","v":"SENEGAL"},null,null,null,"Année",{"$f":"IF(INTRO!$E$35<>0,INTRO!$E$35,\" \")","v":2024}]
[]
[null,"Information on shipment and consignee "]
[]
[null,null,"Destinataire",null,null,"Destinataire final\nsi différent du destinaire précédent"]
[null,"Nom","Dr Deo Nshissirimana",null,null,"Dr Boubacar DIOP"]
[null,"Département/Unité","WR",null,null,"Direction de la Lutte contre la Maladie"]
[null,"Organisation","OMS",null,null,"Maladies Tropicales Négligées"]
[null,"Téléphone","00 221 33 869 59 32",null,null,"00 221 77 412 64 67"]
[null,"Fax","00 221 33 820 43 14"]
[null,"E-mail","nshissirimanad@who.int ",null,null,"docbocardiop@yahoo.fr"]
[null,"Adresse postale","Almadies, Zone10, Lot 19, Dakar",null,null,"Rue A. Césaire, Fann résidence, Dakar"]
[]
[null,null,"Destinataire",null,null,"Destinataire final\nsi différent du destinaire précédent"]
[null,"Nom","Dr Mady Ba",null,null,"Dr Boubacar DIOP"]
[null,"Département/Unité","DPC",null,null,"Direction de la Lutte contre la Maladie"]
[null,"Organisation","OMS",null,null,"Maladies Tropicales Négligées"]
[null,"Téléphone","00 221 77 659 40 05",null,null,"00 221 77 412 64 67"]
[null,"Fax","00 221 33 820 43 14"]
[null,"E-mail","mba@who.int",null,null,"docbocardiop@yahoo.fr"]
[null,"Adresse postale","Almadies, Zone10, Lot 19, Dakar",null,null,"Rue A. Césaire, Fann résidence, Dakar"]
[]
[null,null,"Destinataire",null,null,"Destinataire final\nsi différent du destinaire précédent"]
[null,"Nom","Ndèye Ngom Diaw",null,null,"Dr Boubacar DIOP"]
[null,"Département/Unité","Assistante logistique",null,null,"Direction de la Lutte contre la Maladie"]
[null,"Organisation","OMS",null,null,"Maladies Tropicales Négligées"]
[null,"Téléphone","00 221 33 869 59 42",null,null,"00 221 77 412 64 67"]
[null,"Fax","00 221 33 869 57 42 "]
[null,"E-mail","diawn@who.int",null,null,"docbocardiop@yahoo.fr"]
[null,"Adresse postale","Almadies, Zone10, Lot 19, Dakar",null,null,"Rue A. Césaire, Fann résidence, Dakar"]
[]
[]
[null,"Information concernant les obligations légales d’importation"]
[]
[null,"Est le permis d'importation nécessaire?",null,null,null,null,null,"Oui"]
[null,"Combien de temps cela prend-il pour obtenir le permis d’importation?",null,null,null,null,null,"Semaines"]
[null,"Avez vous besoin que certains documents soient remis en même temps que la demande de permis d’importation?",null,null,null,null,null,"No"]
[]
[null,"Est-ce que le destinataire doit procéder au dédouanement avant que l’expédition puisse avoir lieu?",null,null,null,null,null,"No"]
[null,"Y a-t-il des informations supplémentaires qui pourraient être utiles afin d’assurer un dédouanement et une livraison rapide des médicaments dans votre pays?",null,null,null,null,null,"No"]
[]
[]
[null,"Remarques supplémentaires éventuelles liées à cette requête"]
[]
[null,"Pour  l'onchocercose l'AMM ne sera faite en 2023 suite à la validation des critères \"arrêt AMM\" par le comité d'experts nationaux et internationaux sur l'élimination de l'onchocercose au Sénégal en octobre 2022. Pour les SCH et STH, le programme avait méné des évualations d'impact en 2016 (24UI), 2017 (8UI), 2018 (6UI), 2019 (3UI), 2022 (8UI). Juste preciser qu'en 2019, c'etait une enquete d'évaluation d'impact des STH et le programme en a profité pour recartographier les SCH, c'est le meme cas en 2018 dans 3UI ( Sédhiou, Goudomp et Boukiling). Toutes ces informations sont partagées avec l'OMS à travers les EPIRF de 2016, 2017, 2018, 2019 et 2022. Le programme a utilisé ces données d'enquete pour remplir le JRSM2024 en tenant compte des nouvelles directves de l'OMS. Nous avons mis à jour manuellement les populations necessitant le traitement en utilisation les données sous districts les plus actuelles. "]

{"sheet":"DATA_POLICY","index":9,"n_rows":39,"n_cols":8,"rows_kept":39,"cut":false,"hidden":true,"merged":[[55,1,55,2],[0,1,0,5],[1,1,1,7],[3,3,3,5],[6,1,6,7],[8,1,12,7],[13,1,16,7],[17,1,21,7],[22,1,25,7],[26,2,36,7],[38,1,45,7]]}
[]
[null,"Formulaire de demande commune de médicaments pour CP v.4.1"]
[]
[null,"Pays",null,{"$f":"IF(INTRO!$E$33<>0,INTRO!$E$33,\" \")","v":"SENEGAL"},null,null,"Année",{"$f":"IF(INTRO!$E$35<>0,INTRO!$E$35,\" \")","v":2024}]
[]
[]
[null,"Déclaration de principe sur la communication de données par l’OMS"]
[]
[null,"Les données sont le fondement de toutes les mesures rationnelles de santé publique et les avantages de la communication de données, y compris pour la science et la santé publique, sont largement reconnus. L’OMS souhaite promouvoir autant que possible la communication de données sanitaires, y compris, mais pas uniquement, de données épidémiologiques et de surveillance."]
[]
[]
[]
[]
[null,{"$f":"\"À cet égard, et sans préjudice des instruments juridiquement contraignants régissant la communication et la publication d’informations, le Ministère de la santé de \" & D4 & \", en fournissant des données à l’OMS :\"","v":"À cet égard, et sans préjudice des instruments juridiquement contraignants régissant la communication et la publication d’informations, le Ministère de la santé de SENEGAL, en fournissant des données à l’OMS :"}]
[]
[]
[]
[null,"confirme que toutes les données à fournir à l’OMS, ont été collectées conformément à la législation nationale applicable, y compris aux lois de protection des données visant à préserver l’anonymat des personnes identifiables ;"]
[]
[]
[]
[]
[null,{"$f":"\"convient que l’OMS aura le droit, toujours sous réserve des mesures visant à garantir l’utilisation éthique et sécurisée des données et toujours sous réserve d’une reconnaissance appropriée de la part de \"&D4&\":\"","v":"convient que l’OMS aura le droit, toujours sous réserve des mesures visant à garantir l’utilisation éthique et sécurisée des données et toujours sous réserve d’une reconnaissance appropriée de la part de SENEGAL:"}]
[]
[]
[]
[null,null,"de publier les données, dépourvues de tout élément d’identification personnelle (ci-après dénommées « les données ») et de les mettre à la disposition de toute partie intéressée, sur demande (dans la mesure où elles n’ont pas, ou pas encore, été publiées par l’OMS), selon des modalités autorisant leur utilisation non commerciale et sans but lucratif à des fins de santé publique (pour autant que l’OMS garde la maîtrise de la publication des données) ;\nd’utiliser, de compiler, d’agréger, d’évaluer et d’analyser les données et de publier et de diffuser les résultats obtenus grâce à ces données en rapport avec des travaux de l’OMS et conformément aux politiques et pratiques de l’Organisation."]
[]
[]
[]
[]
[]
[]
[]
[]
[]
[]
[]
[null,{"$f":"CONCATENATE(\"Sauf lorsque des instruments juridiquement contraignants (RSI, Règlement de Nomenclature de l’OMS, de 1967, etc.) disposent que les données doivent être communiquées et publiées, le Ministère de la santé de \", D4,\" peut, pour certaines données, décider de ne pas appliquer (tout ou partie des) (les) dispositions qui précèdent,\" & \" en informant l’OMS par écrit à l’adresse suivante, à condition que cette notification précise clairement les données, \" & \"dont il s’agit et indique clairement lesquelles des dispositions qui précèdent ne seront pas appliquées, et pour quels motifs.\")","v":"Sauf lorsque des instruments juridiquement contraignants (RSI, Règlement de Nomenclature de l’OMS, de 1967, etc.) disposent que les données doivent être communiquées et publiées, le Ministère de la santé de SENEGAL peut, pour certaines données, décider de ne pas appliquer (tout ou partie des) (les) dispositions qui précèdent, en informant l’OMS par écrit à l’adresse suivante, à condition que cette notification précise clairement les données, dont il s’agit et indique clairement lesquelles des dispositions qui précèdent ne seront pas appliquées, et pour quels motifs."}]