{"text_format":"1","workbook":"xlsx","n_sheets":14,"sheets":["INTRO","COUNTRY_INFO","MDA1","MDA2","MDA3","MDA5","T1","T2","T3_R1","T3_R2","DISTRICT","SUMMARY","PROFILE","DATA_POLICY"],"not_rendered":{"charts":8,"images":3,"macros":1,"external_links":0,"defined_names":9,"comments":12,"pivot_tables":0},"unopened":[],"bounds":{"document_bytes":16777216,"sheet_cells":100000,"rows_first":2000,"rows_last":500,"rows_between":2000,"halvings":0,"cell_chars":16384,"cell_head_chars":4096},"cells_cut":0,"cells_raw":0,"read":"whole","date_system":"1900"}

{"sheet":"INTRO","index":0,"n_rows":50,"n_cols":5,"rows_kept":50,"cut":false,"hidden":false,"merged":[[7,2,7,4],[8,2,8,4],[0,1,0,4],[1,1,1,4],[2,1,2,4],[3,1,3,4],[4,1,4,4],[5,1,5,4],[9,2,9,4],[11,2,11,4],[12,1,12,4],[13,1,13,4],[14,1,14,4],[22,1,22,4],[23,2,24,4],[25,1,25,4],[15,1,15,4],[16,1,16,4],[17,1,17,4],[18,1,18,4],[19,2,19,4],[45,1,45,2],[10,2,10,4],[41,1,41,2],[43,1,43,2],[46,1,46,4],[33,1,33,2],[35,1,35,2],[26,2,27,4],[37,1,37,2],[39,1,39,2],[28,1,28,4],[29,2,29,4],[30,1,30,4],[31,1,31,4],[20,1,20,4],[21,2,21,4]]}
[]
[null,"PC Joint Reporting Form v.3.1"]
[]
[null,"The purpose of this template Joint Reporting Form (JRF) - available as an Excel file - is to provide national health authorities and data managers with a standardized tool to address these reporting challenges, facilitate  integration and thereby further contribute to improving overall programme management. This template aims to standardize national reporting of programme implementation outcomes, improve availability and coordination of preventive chemotherapy data across the World Health Organization regions. \nNational authorities are requested to complete this form for submission to the World Health Organization any time before 15 August of the current year for reporting data on PC interventions implemented during the previous year."]
[]
[null,"Structure of the application (worksheets):"]
[]
[null,"INTRO","This worksheet includes guides on how to complete the joint reporting form and information about status of PC for endemic diseases in the country"]
[null,"COUNTRY_INFO","This worksheet includes information about administrative structure of the country, population by age group, status of endemicity for each disease, population requiring PC, planned interventions and interventions implemented"]
[null,"MDA1, MDA2, MDA3, T1, T2 and T3","These worksheets include information about endemic districts targeted for treatment with specified PC medicines, treatment plan, and number of people who received treatment by age group"]
[null,"DISTRICT","This worksheet includes summary of people treated by disease at the level of implementation. If data by gender is available, it requires to enter."]
[null,"SUMMARY","This worksheet includes summary of people treated by disease and by PC intervention. Before generating the report (run macros) please select the disease for which you need the report. Follow the same rule to generate various reports.\nThis worksheet should be printed and submitted as a Joint Report (see the instruction for submission in the SUMMARY worksheet)."]
[]
[null,"Instruction for data entry"]
[]
[null,"Most of the cells in the above-mentioned worksheets include formula that are calculated automatically according to the treatment policy recommended by WHO for each disease.\nSee the link http://www.who.int/neglected_diseases/preventive_chemotherapy/pct_manual/en/index.html"]
[]
[null,"Please enter your data into the cells according to their colour code:"]
[]
[null,null,"White - cell is not protected. Please enter the value of the requested indicator."]
[]
[null,null,"Yellow - cell is protected and includes name of indicator. No data entry required."]
[]
[null,null,"Orange - cell is not protected and includes a drop-down menu. Please select the value from the drop-down list."]
[]
[]
[null,null,"Green - cell is not protected and includes formula. Please change the value only if your data are different from those that are calculated automatically."]
[]
[]
[null,null,"Blue - cell is protected and includes formula. No data entry required."]
[]
[null,"Country data"]
[]
[null,"COUNTRY",null,null,"Rwanda"]
[]
[null,"Year of reporting data",null,null,2021]
[]
[null,"Is country endemic for lymphatic filariasis (LF)?",null,null,"Non-endemic"]
[]
[null,"Is country endemic for onchocerciasis (ONCHO)?",null,null,"Non-endemic"]
[]
[null,"Is country endemic for soil-transmitted helminthiases (STH)?",null,null,"Endemic"]
[]
[null,"Is country endemic for schistosomiasis (SCH)?",null,null,"Endemic"]
[]
[null,"How many administrative units in the country?",null,null,30]
[null,"If demographical data at the second administrative level are not available by age group, please enter the proportion (%) of population by age group in the country. If data are available, please leave these cells blank."]
[null,"1-4 years age","Preschool-age children (PreSAC)",null,0.11700000000000001]
[null,"5-15 years age","School-age children (SAC)",null,0.28799999999999998]
[null,"16 years +","Adults",null,0.56599999999999995]

{"sheet":"COUNTRY_INFO","index":1,"n_rows":38,"n_cols":46,"rows_kept":38,"cut":false,"hidden":false,"merged":[[3,21,3,22],[5,21,5,22],[5,3,5,6],[5,7,5,10],[5,11,5,14],[5,19,5,20],[3,0,3,2],[3,7,3,10],[3,19,3,20],[5,0,5,2],[3,15,3,18],[5,15,5,18]]}
["COUNTRY INFORMATION"]
["Administrative structure, population by age group, endemicity status, planned interventions and interventions implemented",null,null,null,null,null,null,null,null,null,null,null,null,null,null,null,null,null,null,null,1.0233000000000001]
[]
["TOTAL",null,null,{"$f":"SUM(D$9:D$1000)","v":13231595.191860002},{"$f":"SUM(E$9:E$1000)","v":1562018.4470284558},{"$f":"SUM(F$9:F$1000)","v":3766445.6541415555},{"$f":"SUM(G$9:G$1000)","v":7470502.0103026796},null,null,null,null,{"$f":"SUM(L$9:L$1000)","v":0},{"$f":"SUM(M$9:M$1000)","v":0},{"$f":"SUM(N$9:N$1000)","v":4199615.6299852673},{"$f":"SUM(O$9:O$1000)","v":1480813}]
[]
["Country administrative structure",null,null,"Population",null,null,null,"Endemicity",null,null,null,"Population requiring PC",null,null,null,"Number of treatment\nrounds planned for the year",null,null,null,"PC implemented",null,"Click to see the recommended strategy",null,null,null,null,null,null,null,"t2","t3r1","t3r2",null,null,null,"EPIRF 2021"]
["Country","Province/State","District","Total","PreSAC","SAC","Adults","LF","Oncho","STH","SCH","LF","Oncho","STH","SCH","LF","Oncho","STH","SCH","ROUND 1","ROUND2",null,null,null,"IU_ID","IU_Name","x","x","x","x","x","x","x","x",null,"Prev SAC","Endemicity","x","x","x","x","x","x","x","x","x"]
[]
[{"$f":"IF(INTRO!$E$34<>0,INTRO!$E$34,\"\")","v":"Rwanda"},"Eastern","Bugesera",455965.55672400002,60187.453487568004,129038.25255289199,251237.02175492403,0,0,1,2,0,0,{"$f":"IF(INTRO!$E$42=\"Endemic\", IF(AND($J9>1,$J9<5), IF($J9=4, \"Unknown\", E9+F9), 0),\"Not required\")","v":0},69225,0,0,2,1,"T3 (ALB/MBD)","T2 (PZQ)",null,null,null,38111,"Bugesera",null,null,null,{"$f":"'T2'!K9","v":55601},{"$f":"T3_R1!L9","v":84309},{"$f":"T3_R2!L9","v":144904},null,null,null,15.040935672514621,1]
[{"$f":"IF(INTRO!$E$34<>0,INTRO!$E$34,\"\")","v":"Rwanda"},"Northern","Burera",424050.52575600002,45797.456781648005,137816.42087070001,228563.23338248403,0,0,3,2,0,0,{"$f":"IF(INTRO!$E$42=\"Endemic\", IF(AND($J10>1,$J10<5), IF($J10=4, \"Unknown\", E10+F10), 0),\"Not required\")","v":183613.87765234802},87749,0,0,2,1,"T3 (ALB/MBD)","T2 (PZQ)",null,null,null,38121,"Burera",null,null,null,{"$f":"'T2'!K10","v":72584},{"$f":"T3_R1!L10","v":116984},{"$f":"T3_R2!L10","v":107288},null,null,null,73.900432900432904,3]
[{"$f":"IF(INTRO!$E$34<>0,INTRO!$E$34,\"\")","v":"Rwanda"},"Northern","Gakenke",448035.74841599999,47043.753583679994,131722.510034304,258068.59108761596,0,0,2,2,0,0,{"$f":"IF(INTRO!$E$42=\"Endemic\", IF(AND($J11>1,$J11<5), IF($J11=4, \"Unknown\", E11+F11), 0),\"Not required\")","v":178766.26361798399},48990,0,0,2,1,"T3 (ALB/MBD)","T2 (PZQ)",null,null,null,38122,"Gakenke",null,null,null,{"$f":"'T2'!K11","v":36283},{"$f":"T3_R1!L11","v":100548},{"$f":"T3_R2!L11","v":95173},null,null,null,34.5309582631564,2]
[{"$f":"IF(INTRO!$E$34<>0,INTRO!$E$34,\"\")","v":"Rwanda"},"Kigali","Gasabo",667178.68006799999,75391.190847684004,145444.95225482399,424992.819203316,0,0,2,1,0,0,{"$f":"IF(INTRO!$E$42=\"Endemic\", IF(AND($J12>1,$J12<5), IF($J12=4, \"Unknown\", E12+F12), 0),\"Not required\")","v":220836.14310250798},47979,0,0,2,1,"T3 (ALB/MBD)",null,null,null,null,38118,"Gasabo",null,null,null,{"$f":"'T2'!K12","v":0},{"$f":"T3_R1!L12","v":115350},{"$f":"T3_R2!L12","v":197626},null,null,null,20.606719367588934,2]
[{"$f":"IF(INTRO!$E$34<>0,INTRO!$E$34,\"\")","v":"Rwanda"},"Eastern","Gatsibo",512853.22044,63593.799334559997,157445.93867507999,276940.7390376,0,0,2,2,0,0,{"$f":"IF(INTRO!$E$42=\"Endemic\", IF(AND($J13>1,$J13<5), IF($J13=4, \"Unknown\", E13+F13), 0),\"Not required\")","v":221039.73800963999},45277,0,0,2,1,"T3 (ALB/MBD)","T2 (PZQ)",null,null,null,38112,"Gatsibo",null,null,null,{"$f":"'T2'!K13","v":21485},{"$f":"T3_R1!L13","v":153663},{"$f":"T3_R2!L13","v":161816},null,null,null,33.365123165971191,2]
[{"$f":"IF(INTRO!$E$34<>0,INTRO!$E$34,\"\")","v":"Rwanda"},"Northern","Gicumbi",498413.66374800005,52333.434693540003,154009.82209813202,278613.23803513206,0,0,2,2,0,0,{"$f":"IF(INTRO!$E$42=\"Endemic\", IF(AND($J14>1,$J14<5), IF($J14=4, \"Unknown\", E14+F14), 0),\"Not required\")","v":206343.25679167203},24456,0,0,2,1,"T3 (ALB/MBD)","T2 (PZQ)",null,null,null,38123,"Gicumbi",null,null,null,{"$f":"'T2'!K14","v":21296},{"$f":"T3_R1!L14","v":130079},{"$f":"T3_R2!L14","v":107251},null,null,null,41.528822055137837,2]
[{"$f":"IF(INTRO!$E$34<>0,INTRO!$E$34,\"\")","v":"Rwanda"},"Southern","Gisagara",406317.14585999999,53633.863253520001,116206.70371595999,223880.74736886,0,0,2,2,0,0,{"$f":"IF(INTRO!$E$42=\"Endemic\", IF(AND($J15>1,$J15<5), IF($J15=4, \"Unknown\", E15+F15), 0),\"Not required\")","v":169840.56696947999},77780,0,0,2,1,"T3 (ALB/MBD)","T2 (PZQ)",null,null,null,38126,"Gisagara",null,null,null,{"$f":"'T2'!K15","v":78212},{"$f":"T3_R1!L15","v":106381},{"$f":"T3_R2!L15","v":100822},null,null,null,46.947596263385741,2]
[{"$f":"IF(INTRO!$E$34<>0,INTRO!$E$34,\"\")","v":"Rwanda"},"Southern","Huye",413739.56433600001,46752.570769968006,108813.505420368,246588.780344256,0,0,2,1,0,0,{"$f":"IF(INTRO!$E$42=\"Endemic\", IF(AND($J16>1,$J16<5), IF($J16=4, \"Unknown\", E16+F16), 0),\"Not required\")","v":155566.07619033603},35895,0,0,2,1,"T3 (ALB/MBD)",null,null,null,null,38127,"Huye",null,null,null,{"$f":"'T2'!K16","v":0},{"$f":"T3_R1!L16","v":94695},{"$f":"T3_R2!L16","v":96677},null,null,null,47.057092665788311,2]
[{"$f":"IF(INTRO!$E$34<>0,INTRO!$E$34,\"\")","v":"Rwanda"},"Southern","Kamonyi",428987.57619600004,48904.583686344005,120116.52133488002,236801.14206019204,0,0,1,2,0,0,{"$f":"IF(INTRO!$E$42=\"Endemic\", IF(AND($J17>1,$J17<5), IF($J17=4, \"Unknown\", E17+F17), 0),\"Not required\")","v":0},41971,0,0,2,1,"T3 (ALB/MBD)","T2 (PZQ)",null,null,null,38128,"Kamonyi",null,null,null,{"$f":"'T2'!K17","v":41174},{"$f":"T3_R1!L17","v":105353},{"$f":"T3_R2!L17","v":108208},null,null,null,17.868837112544206,1]
[{"$f":"IF(INTRO!$E$34<>0,INTRO!$E$34,\"\")","v":"Rwanda"},"Western","Karongi",425789.54650800006,49391.587394928007,126459.49531287601,237590.56695146405,0,0,3,2,0,0,{"$f":"IF(INTRO!$E$42=\"Endemic\", IF(AND($J18>1,$J18<5), IF($J18=4, \"Unknown\", E18+F18), 0),\"Not required\")","v":175851.08270780402},28801,0,0,2,1,"T3 (ALB/MBD)","T2 (PZQ)",null,null,null,38134,"Karongi",null,null,null,{"$f":"'T2'!K18","v":23019},{"$f":"T3_R1!L18","v":110295},{"$f":"T3_R2!L18","v":93328},null,null,null,53.202586505790158,3]
[{"$f":"IF(INTRO!$E$34<>0,INTRO!$E$34,\"\")","v":"Rwanda"},"Eastern","Kayonza",437264.76758400002,54658.095948000002,131179.43027519999,237434.76879811203,0,0,2,2,0,0,{"$f":"IF(INTRO!$E$42=\"Endemic\", IF(AND($J19>1,$J19<5), IF($J19=4, \"Unknown\", E19+F19), 0),\"Not required\")","v":185837.5262232},52810,0,0,2,1,"T3 (ALB/MBD)","T2 (PZQ)",null,null,null,38113,"Kayonza",null,null,null,{"$f":"'T2'!K19","v":46722},{"$f":"T3_R1!L19","v":73013},{"$f":"T3_R2!L19","v":116123},null,null,null,35.430592485243174,2]
[{"$f":"IF(INTRO!$E$34<>0,INTRO!$E$34,\"\")","v":"Rwanda"},"Kigali","Kicukiro",401350.62049200002,40536.412669692007,88698.487128731998,260877.90331980001,0,0,1,1,0,0,{"$f":"IF(INTRO!$E$42=\"Endemic\", IF(AND($J20>1,$J20<5), IF($J20=4, \"Unknown\", E20+F20), 0),\"Not required\")","v":0},37998,0,0,2,1,"T3 (ALB/MBD)",null,null,null,null,38119,"Kicukiro",null,null,null,{"$f":"'T2'!K20","v":0},{"$f":"T3_R1!L20","v":49350},{"$f":"T3_R2!L20","v":109313},null,null,null,9.5579925750204389,1]
[{"$f":"IF(INTRO!$E$34<>0,INTRO!$E$34,\"\")","v":"Rwanda"},"Eastern","Kirehe",428820.20071200002,53602.525089000002,129503.700615024,233278.18918732804,0,0,1,1,0,0,{"$f":"IF(INTRO!$E$42=\"Endemic\", IF(AND($J21>1,$J21<5), IF($J21=4, \"Unknown\", E21+F21), 0),\"Not required\")","v":0},42721,0,0,2,1,"T3 (ALB/MBD)",null,null,null,null,38114,"Kirehe",null,null,null,{"$f":"'T2'!K21","v":0},{"$f":"T3_R1!L21","v":107278},{"$f":"T3_R2!L21","v":121294},null,null,null,16.839719619905381,1]
[{"$f":"IF(INTRO!$E$34<>0,INTRO!$E$34,\"\")","v":"Rwanda"},"Southern","Muhanga",402076.96693200001,41413.927593995999,112179.47377402801,228781.79418430798,0,0,2,2,0,0,{"$f":"IF(INTRO!$E$42=\"Endemic\", IF(AND($J22>1,$J22<5), IF($J22=4, \"Unknown\", E22+F22), 0),\"Not required\")","v":153593.401368024},22840,0,0,2,1,"T3 (ALB/MBD)","T2 (PZQ)",null,null,null,38129,"Muhanga",null,null,null,{"$f":"'T2'!K22","v":15908},{"$f":"T3_R1!L22","v":98055},{"$f":"T3_R2!L22","v":94806},null,null,null,26.031328320802004,2]
[{"$f":"IF(INTRO!$E$34<>0,INTRO!$E$34,\"\")","v":"Rwanda"},"Northern","Musanze",463969.05235200003,51036.595758720003,136870.87044383999,263070.45268358401,0,0,3,2,0,0,{"$f":"IF(INTRO!$E$42=\"Endemic\", IF(AND($J23>1,$J23<5), IF($J23=4, \"Unknown\", E23+F23), 0),\"Not required\")","v":187907.46620256},19130,0,0,2,1,"T3 (ALB/MBD)","T2 (PZQ)",null,null,null,38124,"Musanze",null,null,null,{"$f":"'T2'!K23","v":2967},{"$f":"T3_R1!L23","v":89405},{"$f":"T3_R2!L23","v":108575},null,null,null,54.27615717615717,3]
[{"$f":"IF(INTRO!$E$34<>0,INTRO!$E$34,\"\")","v":"Rwanda"},"Eastern","Ngoma",424486.33361999999,68342.299712819993,119705.14608083999,223279.81148412,0,0,1,2,0,0,{"$f":"IF(INTRO!$E$42=\"Endemic\", IF(AND($J24>1,$J24<5), IF($J24=4, \"Unknown\", E24+F24), 0),\"Not required\")","v":0},50770,0,0,2,1,"T3 (ALB/MBD)","T2 (PZQ)",null,null,null,38115,"Ngoma",null,null,null,{"$f":"'T2'!K24","v":37616},{"$f":"T3_R1!L24","v":90141},{"$f":"T3_R2!L24","v":95824},null,null,null,15.680678970152654,1]
[{"$f":"IF(INTRO!$E$34<>0,INTRO!$E$34,\"\")","v":"Rwanda"},"Western","Ngororero",427231.71262800001,51267.80551536,131587.36748942401,231132.35653174802,0,0,2,2,0,0,{"$f":"IF(INTRO!$E$42=\"Endemic\", IF(AND($J25>1,$J25<5), IF($J25=4, \"Unknown\", E25+F25), 0),\"Not required\")","v":182855.17300478401},8795,0,0,2,1,"T3 (ALB/MBD)","T2 (PZQ)",null,null,null,38136,"Ngororero",null,null,null,{"$f":"'T2'!K25","v":7737},{"$f":"T3_R1!L25","v":113173},{"$f":"T3_R2!L25","v":105850},null,null,null,48.910457963089534,2]
[{"$f":"IF(INTRO!$E$34<>0,INTRO!$E$34,\"\")","v":"Rwanda"},"Western","Nyabihu",371334.61702800001,43817.484809303998,116970.40436382001,199406.68934403601,0,0,3,1,0,0,{"$f":"IF(INTRO!$E$42=\"Endemic\", IF(AND($J26>1,$J26<5), IF($J26=4, \"Unknown\", E26+F26), 0),\"Not required\")","v":160787.88917312401},38587,0,0,2,1,"T3 (ALB/MBD)",null,null,null,null,38137,"Nyabihu",null,null,null,{"$f":"'T2'!K26","v":0},{"$f":"T3_R1!L26","v":69578},{"$f":"T3_R2!L26","v":103696},null,null,null,82.038961038961048,3]
[{"$f":"IF(INTRO!$E$34<>0,INTRO!$E$34,\"\")","v":"Rwanda"},"Eastern","Nyagatare",586917.39844800008,73364.67480600001,180770.55872198401,314587.72556812805,0,0,2,2,0,0,{"$f":"IF(INTRO!$E$42=\"Endemic\", IF(AND($J27>1,$J27<5), IF($J27=4, \"Unknown\", E27+F27), 0),\"Not required\")","v":254135.233527984},154567,0,0,2,1,"T3 (ALB/MBD)","T2 (PZQ)",null,null,null,38116,"Nyagatare",null,null,null,{"$f":"'T2'!K27","v":164499},{"$f":"T3_R1!L27","v":186514},{"$f":"T3_R2!L27","v":170502},null,null,null,21.969459633933322,2]
[{"$f":"IF(INTRO!$E$34<>0,INTRO!$E$34,\"\")","v":"Rwanda"},"Southern","Nyamagabe",424824.242616,47580.315172991999,130421.042483112,224732.024343864,0,0,3,1,0,0,{"$f":"IF(INTRO!$E$42=\"Endemic\", IF(AND($J28>1,$J28<5), IF($J28=4, \"Unknown\", E28+F28), 0),\"Not required\")","v":178001.357656104},41575,0,0,2,1,"T3 (ALB/MBD)",null,null,null,null,38130,"Nyamagabe",null,null,null,{"$f":"'T2'!K28","v":0},{"$f":"T3_R1!L28","v":94243},{"$f":"T3_R2!L28","v":100557},null,null,null,59.461038961038959,3]
[{"$f":"IF(INTRO!$E$34<>0,INTRO!$E$34,\"\")","v":"Rwanda"},"Western","Nyamasheke",492658.68405600003,59611.700770775999,129076.57522267201,288697.98885681602,0,0,3,2,0,0,{"$f":"IF(INTRO!$E$42=\"Endemic\", IF(AND($J29>1,$J29<5), IF($J29=4, \"Unknown\", E29+F29), 0),\"Not required\")","v":188688.27599344801},87346,0,0,2,1,"T3 (ALB/MBD)","T2 (PZQ)",null,null,null,38138,"Nyamasheke",null,null,null,{"$f":"'T2'!K29","v":73388},{"$f":"T3_R1!L29","v":122463},{"$f":"T3_R2!L29","v":119392},null,null,null,52.46365914786967,3]
[{"$f":"IF(INTRO!$E$34<>0,INTRO!$E$34,\"\")","v":"Rwanda"},"Southern","Nyanza",407843.52606,48941.223127199999,108078.53440590001,238588.4627451,0,0,2,2,0,0,{"$f":"IF(INTRO!$E$42=\"Endemic\", IF(AND($J30>1,$J30<5), IF($J30=4, \"Unknown\", E30+F30), 0),\"Not required\")","v":157019.7575331},49773,0,0,2,1,"T3 (ALB/MBD)","T2 (PZQ)",null,null,null,38131,"Nyanza",null,null,null,{"$f":"'T2'!K30","v":42350},{"$f":"T3_R1!L30","v":93026},{"$f":"T3_R2!L30","v":99069},null,null,null,24.911255411255407,2]
[{"$f":"IF(INTRO!$E$34<>0,INTRO!$E$34,\"\")","v":"Rwanda"},"Kigali","Nyarugenge",358510.91799600003,37285.135471583999,78513.891041124007,232673.58577940403,0,0,1,2,0,0,{"$f":"IF(INTRO!$E$42=\"Endemic\", IF(AND($J31>1,$J31<5), IF($J31=4, \"Unknown\", E31+F31), 0),\"Not required\")","v":0},6463,0,0,2,1,"T3 (ALB/MBD)","T2 (PZQ)",null,null,null,38120,"Nyarugenge",null,null,null,{"$f":"'T2'!K31","v":12786},{"$f":"T3_R1!L31","v":41901},{"$f":"T3_R2!L31","v":102690},null,null,null,19.5993277000142,1]
[{"$f":"IF(INTRO!$E$34<>0,INTRO!$E$34,\"\")","v":"Rwanda"},"Southern","Nyaruguru",370823.01649199997,43386.292929563999,118663.36527744,198019.49080672799,0,0,3,1,0,0,{"$f":"IF(INTRO!$E$42=\"Endemic\", IF(AND($J32>1,$J32<5), IF($J32=4, \"Unknown\", E32+F32), 0),\"Not required\")","v":162049.65820700399},39145,0,0,2,1,"T3 (ALB/MBD)",null,null,null,null,38132,"Nyaruguru",null,null,null,{"$f":"'T2'!K32","v":0},{"$f":"T3_R1!L32","v":74834},{"$f":"T3_R2!L32","v":111393},null,null,null,74.284651021493119,3]
[{"$f":"IF(INTRO!$E$34<>0,INTRO!$E$34,\"\")","v":"Rwanda"},"Western","Rubavu",508561.46038800001,65095.866929664,137311.59430476002,289371.47096077196,0,0,3,2,0,0,{"$f":"IF(INTRO!$E$42=\"Endemic\", IF(AND($J33>1,$J33<5), IF($J33=4, \"Unknown\", E33+F33), 0),\"Not required\")","v":202407.46123442403},45365,0,0,2,1,"T3 (ALB/MBD)","T2 (PZQ)",null,null,null,38139,"Rubavu",null,null,null,{"$f":"'T2'!K33","v":34895},{"$f":"T3_R1!L33","v":126626},{"$f":"T3_R2!L33","v":146058},null,null,null,87.075396825396822,3]
[{"$f":"IF(INTRO!$E$34<>0,INTRO!$E$34,\"\")","v":"Rwanda"},"Southern","Ruhango",361281.56122799998,41908.661102448001,103687.80807243599,196175.88774680402,0,0,2,2,0,0,{"$f":"IF(INTRO!$E$42=\"Endemic\", IF(AND($J34>1,$J34<5), IF($J34=4, \"Unknown\", E34+F34), 0),\"Not required\")","v":145596.469174884},16902,0,0,2,1,"T3 (ALB/MBD)","T2 (PZQ)",null,null,null,38133,"Ruhango",null,null,null,{"$f":"'T2'!K34","v":16456},{"$f":"T3_R1!L34","v":70325},{"$f":"T3_R2!L34","v":101793},null,null,null,29.542796384901649,2]
[{"$f":"IF(INTRO!$E$34<>0,INTRO!$E$34,\"\")","v":"Rwanda"},"Northern","Rulindo",356908.74512400007,37475.418238020007,102789.71859571201,206650.16342679603,0,0,3,2,0,0,{"$f":"IF(INTRO!$E$42=\"Endemic\", IF(AND($J35>1,$J35<5), IF($J35=4, \"Unknown\", E35+F35), 0),\"Not required\")","v":140265.13683373202},11953,0,0,2,1,"T3 (ALB/MBD)","T2 (PZQ)",null,null,null,38125,"Rulindo",null,null,null,{"$f":"'T2'!K35","v":5037},{"$f":"T3_R1!L35","v":93240},{"$f":"T3_R2!L35","v":98704},null,null,null,60.356409799201558,3]
[{"$f":"IF(INTRO!$E$34<>0,INTRO!$E$34,\"\")","v":"Rwanda"},"Western","Rusizi",506910.86442,62350.036323660002,144976.50722412,283870.08407520002,0,0,2,2,0,0,{"$f":"IF(INTRO!$E$42=\"Endemic\", IF(AND($J36>1,$J36<5), IF($J36=4, \"Unknown\", E36+F36), 0),\"Not required\")","v":207326.54354777999},132522,0,0,2,1,"T3 (ALB/MBD)","T2 (PZQ)",null,null,null,38140,"Rusizi",null,null,null,{"$f":"'T2'!K36","v":107852},{"$f":"T3_R1!L36","v":113951},{"$f":"T3_R2!L36","v":100296},null,null,null,38.904903067946542,2]
[{"$f":"IF(INTRO!$E$34<>0,INTRO!$E$34,\"\")","v":"Rwanda"},"Western","Rutsiro",423568.40014800004,49133.934417168006,132153.34084617603,228726.93607992004,0,0,3,2,0,0,{"$f":"IF(INTRO!$E$42=\"Endemic\", IF(AND($J37>1,$J37<5), IF($J37=4, \"Unknown\", E37+F37), 0),\"Not required\")","v":181287.27526334403},50377,0,0,2,1,"T3 (ALB/MBD)","T2 (PZQ)",null,null,null,38141,"Rutsiro",null,null,null,{"$f":"'T2'!K37","v":36579},{"$f":"T3_R1!L37","v":81483},{"$f":"T3_R2!L37","v":117390},null,null,null,71.402711323763953,3]
[{"$f":"IF(INTRO!$E$34<>0,INTRO!$E$34,\"\")","v":"Rwanda"},"Eastern","Rwamagana",394920.87548400002,48180.346809048002,106233.71550519601,227869.345154268,0,0,1,2,0,0,{"$f":"IF(INTRO!$E$42=\"Endemic\", IF(AND($J38>1,$J38<5), IF($J38=4, \"Unknown\", E38+F38), 0),\"Not required\")","v":0},63051,0,0,2,1,"T3 (ALB/MBD)","T2 (PZQ)",null,null,null,38117,"Rwamagana",null,null,null,{"$f":"'T2'!K38","v":72564},{"$f":"T3_R1!L38","v":100401},{"$f":"T3_R2!L38","v":122410},null,null,null,12.917293233082711,1]

{"sheet":"MDA1","index":2,"n_rows":38,"n_cols":17,"rows_kept":38,"cut":false,"hidden":true,"merged":[[5,13,5,16],[3,0,3,2],[5,0,5,2],[5,5,5,8],[5,9,5,12],[5,3,6,3],[5,4,6,4]]}
["MDA 1 - Ivermectin (IVM) and Albendazole (ALB)"]
["Administrative structure, population requiring PC by age group, population treated by age group and coverage"]
[]
["TOTAL",null,null,null,null,null,{"$f":"SUM(G$9:G$1000)","v":0},{"$f":"SUM(H$9:H$1000)","v":0},{"$f":"SUM(I$9:I$1000)","v":0},null,{"$f":"SUM(K$9:K$1000)","v":0},{"$f":"SUM(L$9:L$1000)","v":0},{"$f":"SUM(M$9:M$1000)","v":0},null,{"$f":"IF(G4<>0, IF(K4/G4*100=0, \"-\", K4/G4*100), \" \")","v":" "},{"$f":"IF(H4<>0, IF(L4/H4*100=0, \"-\", L4/H4*100), \" \")","v":" "},{"$f":"IF(I4<>0, IF(M4/I4*100=0, \"-\", M4/I4*100), \" \")","v":" "}]
[]
[null,null,null,"PC implemented","Date","Population targeted for MDA 1",null,null,null,"Population treated",null,null,null,"Programme coverage (%)"]
["Country","Province/State","District",null,null,"PreSAC","SAC","Adults","Total","PreSAC","SAC","Adults","Total","PreSAC","SAC","Adults","Total"]
[]
[{"$f":"IF(COUNTRY_INFO!A9=0,\" \",COUNTRY_INFO!A9)","v":"Rwanda"},{"$f":"IF(COUNTRY_INFO!B9=0,\" \",COUNTRY_INFO!B9)","v":"Eastern"},{"$f":"IF(COUNTRY_INFO!C9=0,\" \",COUNTRY_INFO!C9)","v":"Bugesera"},{"$f":"IF(COUNTRY_INFO!$T$9:$T$1000=\"MDA1 (IVM+ALB)\", COUNTRY_INFO!$T$9:$T$1000, \" \")","v":" "},null,null,null,null,{"$f":"SUM(F9:H9)","v":0},null,null,null,{"$f":"SUM(J9:L9)","v":0},null,{"$f":"IF(G9<>0, IF(K9/G9*100=0, \"-\", K9/G9*100), \" \")","v":" "},{"$f":"IF(H9<>0, IF(L9/H9*100=0, \"-\", L9/H9*100), \" \")","v":" "},{"$f":"IF(I9<>0, IF(M9/I9*100=0, \"-\", M9/I9*100), \" \")","v":" "}]
[{"$f":"IF(COUNTRY_INFO!A10=0,\" \",COUNTRY_INFO!A10)","v":"Rwanda"},{"$f":"IF(COUNTRY_INFO!B10=0,\" \",COUNTRY_INFO!B10)","v":"Northern"},{"$f":"IF(COUNTRY_INFO!C10=0,\" \",COUNTRY_INFO!C10)","v":"Burera"},{"$f":"IF(COUNTRY_INFO!$T$9:$T$1000=\"MDA1 (IVM+ALB)\", COUNTRY_INFO!$T$9:$T$1000, \" \")","v":" "},null,null,null,null,{"$f":"SUM(F10:H10)","v":0},null,null,null,{"$f":"SUM(J10:L10)","v":0},null,{"$f":"IF(G10<>0, IF(K10/G10*100=0, \"-\", K10/G10*100), \" \")","v":" "},{"$f":"IF(H10<>0, IF(L10/H10*100=0, \"-\", L10/H10*100), \" \")","v":" "},{"$f":"IF(I10<>0, IF(M10/I10*100=0, \"-\", M10/I10*100), \" \")","v":" "}]
[{"$f":"IF(COUNTRY_INFO!A11=0,\" \",COUNTRY_INFO!A11)","v":"Rwanda"},{"$f":"IF(COUNTRY_INFO!B11=0,\" \",COUNTRY_INFO!B11)","v":"Northern"},{"$f":"IF(COUNTRY_INFO!C11=0,\" \",COUNTRY_INFO!C11)","v":"Gakenke"},{"$f":"IF(COUNTRY_INFO!$T$9:$T$1000=\"MDA1 (IVM+ALB)\", COUNTRY_INFO!$T$9:$T$1000, \" \")","v":" "},null,null,null,null,0,null,null,null,0,null," "," "," "]
[{"$f":"IF(COUNTRY_INFO!A12=0,\" \",COUNTRY_INFO!A12)","v":"Rwanda"},{"$f":"IF(COUNTRY_INFO!B12=0,\" \",COUNTRY_INFO!B12)","v":"Kigali"},{"$f":"IF(COUNTRY_INFO!C12=0,\" \",COUNTRY_INFO!C12)","v":"Gasabo"},{"$f":"IF(COUNTRY_INFO!$T$9:$T$1000=\"MDA1 (IVM+ALB)\", COUNTRY_INFO!$T$9:$T$1000, \" \")","v":" "},null,null,null,null,0,null,null,null,0,null," "," "," "]
[{"$f":"IF(COUNTRY_INFO!A13=0,\" \",COUNTRY_INFO!A13)","v":"Rwanda"},{"$f":"IF(COUNTRY_INFO!B13=0,\" \",COUNTRY_INFO!B13)","v":"Eastern"},{"$f":"IF(COUNTRY_INFO!C13=0,\" \",COUNTRY_INFO!C13)","v":"Gatsibo"},{"$f":"IF(COUNTRY_INFO!$T$9:$T$1000=\"MDA1 (IVM+ALB)\", COUNTRY_INFO!$T$9:$T$1000, \" \")","v":" "},null,null,null,null,0,null,null,null,0,null," "," "," "]
[{"$f":"IF(COUNTRY_INFO!A14=0,\" \",COUNTRY_INFO!A14)","v":"Rwanda"},{"$f":"IF(COUNTRY_INFO!B14=0,\" \",COUNTRY_INFO!B14)","v":"Northern"},{"$f":"IF(COUNTRY_INFO!C14=0,\" \",COUNTRY_INFO!C14)","v":"Gicumbi"},{"$f":"IF(COUNTRY_INFO!$T$9:$T$1000=\"MDA1 (IVM+ALB)\", COUNTRY_INFO!$T$9:$T$1000, \" \")","v":" "},null,null,null,null,0,null,null,null,0,null," "," "," "]
[{"$f":"IF(COUNTRY_INFO!A15=0,\" \",COUNTRY_INFO!A15)","v":"Rwanda"},{"$f":"IF(COUNTRY_INFO!B15=0,\" \",COUNTRY_INFO!B15)","v":"Southern"},{"$f":"IF(COUNTRY_INFO!C15=0,\" \",COUNTRY_INFO!C15)","v":"Gisagara"},{"$f":"IF(COUNTRY_INFO!$T$9:$T$1000=\"MDA1 (IVM+ALB)\", COUNTRY_INFO!$T$9:$T$1000, \" \")","v":" "},null,null,null,null,0,null,null,null,0,null," "," "," "]
[{"$f":"IF(COUNTRY_INFO!A16=0,\" \",COUNTRY_INFO!A16)","v":"Rwanda"},{"$f":"IF(COUNTRY_INFO!B16=0,\" \",COUNTRY_INFO!B16)","v":"Southern"},{"$f":"IF(COUNTRY_INFO!C16=0,\" \",COUNTRY_INFO!C16)","v":"Huye"},{"$f":"IF(COUNTRY_INFO!$T$9:$T$1000=\"MDA1 (IVM+ALB)\", COUNTRY_INFO!$T$9:$T$1000, \" \")","v":" "},null,null,null,null,0,null,null,null,0,null," "," "," "]
[{"$f":"IF(COUNTRY_INFO!A17=0,\" \",COUNTRY_INFO!A17)","v":"Rwanda"},{"$f":"IF(COUNTRY_INFO!B17=0,\" \",COUNTRY_INFO!B17)","v":"Southern"},{"$f":"IF(COUNTRY_INFO!C17=0,\" \",COUNTRY_INFO!C17)","v":"Kamonyi"},{"$f":"IF(COUNTRY_INFO!$T$9:$T$1000=\"MDA1 (IVM+ALB)\", COUNTRY_INFO!$T$9:$T$1000, \" \")","v":" "},null,null,null,null,0,null,null,null,0,null," "," "," "]
[{"$f":"IF(COUNTRY_INFO!A18=0,\" \",COUNTRY_INFO!A18)","v":"Rwanda"},{"$f":"IF(COUNTRY_INFO!B18=0,\" \",COUNTRY_INFO!B18)","v":"Western"},{"$f":"IF(COUNTRY_INFO!C18=0,\" \",COUNTRY_INFO!C18)","v":"Karongi"},{"$f":"IF(COUNTRY_INFO!$T$9:$T$1000=\"MDA1 (IVM+ALB)\", COUNTRY_INFO!$T$9:$T$1000, \" \")","v":" "},null,null,null,null,0,null,null,null,0,null," "," "," "]
[{"$f":"IF(COUNTRY_INFO!A19=0,\" \",COUNTRY_INFO!A19)","v":"Rwanda"},{"$f":"IF(COUNTRY_INFO!B19=0,\" \",COUNTRY_INFO!B19)","v":"Eastern"},{"$f":"IF(COUNTRY_INFO!C19=0,\" \",COUNTRY_INFO!C19)","v":"Kayonza"},{"$f":"IF(COUNTRY_INFO!$T$9:$T$1000=\"MDA1 (IVM+ALB)\", COUNTRY_INFO!$T$9:$T$1000, \" \")","v":" "},null,null,null,null,0,null,null,null,0,null," "," "," "]
[{"$f":"IF(COUNTRY_INFO!A20=0,\" \",COUNTRY_INFO!A20)","v":"Rwanda"},{"$f":"IF(COUNTRY_INFO!B20=0,\" \",COUNTRY_INFO!B20)","v":"Kigali"},{"$f":"IF(COUNTRY_INFO!C20=0,\" \",COUNTRY_INFO!C20)","v":"Kicukiro"},{"$f":"IF(COUNTRY_INFO!$T$9:$T$1000=\"MDA1 (IVM+ALB)\", COUNTRY_INFO!$T$9:$T$1000, \" \")","v":" "},null,null,null,null,0,null,null,null,0,null," "," "," "]
[{"$f":"IF(COUNTRY_INFO!A21=0,\" \",COUNTRY_INFO!A21)","v":"Rwanda"},{"$f":"IF(COUNTRY_INFO!B21=0,\" \",COUNTRY_INFO!B21)","v":"Eastern"},{"$f":"IF(COUNTRY_INFO!C21=0,\" \",COUNTRY_INFO!C21)","v":"Kirehe"},{"$f":"IF(COUNTRY_INFO!$T$9:$T$1000=\"MDA1 (IVM+ALB)\", COUNTRY_INFO!$T$9:$T$1000, \" \")","v":" "},null,null,null,null,0,null,null,null,0,null," "," "," "]
[{"$f":"IF(COUNTRY_INFO!A22=0,\" \",COUNTRY_INFO!A22)","v":"Rwanda"},{"$f":"IF(COUNTRY_INFO!B22=0,\" \",COUNTRY_INFO!B22)","v":"Southern"},{"$f":"IF(COUNTRY_INFO!C22=0,\" \",COUNTRY_INFO!C22)","v":"Muhanga"},{"$f":"IF(COUNTRY_INFO!$T$9:$T$1000=\"MDA1 (IVM+ALB)\", COUNTRY_INFO!$T$9:$T$1000, \" \")","v":" "},null,null,null,null,0,null,null,null,0,null," "," "," "]
[{"$f":"IF(COUNTRY_INFO!A23=0,\" \",COUNTRY_INFO!A23)","v":"Rwanda"},{"$f":"IF(COUNTRY_INFO!B23=0,\" \",COUNTRY_INFO!B23)","v":"Northern"},{"$f":"IF(COUNTRY_INFO!C23=0,\" \",COUNTRY_INFO!C23)","v":"Musanze"},{"$f":"IF(COUNTRY_INFO!$T$9:$T$1000=\"MDA1 (IVM+ALB)\", COUNTRY_INFO!$T$9:$T$1000, \" \")","v":" "},null,null,null,null,0,null,null,null,0,null," "," "," "]
[{"$f":"IF(COUNTRY_INFO!A24=0,\" \",COUNTRY_INFO!A24)","v":"Rwanda"},{"$f":"IF(COUNTRY_INFO!B24=0,\" \",COUNTRY_INFO!B24)","v":"Eastern"},{"$f":"IF(COUNTRY_INFO!C24=0,\" \",COUNTRY_INFO!C24)","v":"Ngoma"},{"$f":"IF(COUNTRY_INFO!$T$9:$T$1000=\"MDA1 (IVM+ALB)\", COUNTRY_INFO!$T$9:$T$1000, \" \")","v":" "},null,null,null,null,0,null,null,null,0,null," "," "," "]
[{"$f":"IF(COUNTRY_INFO!A25=0,\" \",COUNTRY_INFO!A25)","v":"Rwanda"},{"$f":"IF(COUNTRY_INFO!B25=0,\" \",COUNTRY_INFO!B25)","v":"Western"},{"$f":"IF(COUNTRY_INFO!C25=0,\" \",COUNTRY_INFO!C25)","v":"Ngororero"},{"$f":"IF(COUNTRY_INFO!$T$9:$T$1000=\"MDA1 (IVM+ALB)\", COUNTRY_INFO!$T$9:$T$1000, \" \")","v":" "},null,null,null,null,0,null,null,null,0,null," "," "," "]
[{"$f":"IF(COUNTRY_INFO!A26=0,\" \",COUNTRY_INFO!A26)","v":"Rwanda"},{"$f":"IF(COUNTRY_INFO!B26=0,\" \",COUNTRY_INFO!B26)","v":"Western"},{"$f":"IF(COUNTRY_INFO!C26=0,\" \",COUNTRY_INFO!C26)","v":"Nyabihu"},{"$f":"IF(COUNTRY_INFO!$T$9:$T$1000=\"MDA1 (IVM+ALB)\", COUNTRY_INFO!$T$9:$T$1000, \" \")","v":" "},null,null,null,null,0,null,null,null,0,null," "," "," "]
[{"$f":"IF(COUNTRY_INFO!A27=0,\" \",COUNTRY_INFO!A27)","v":"Rwanda"},{"$f":"IF(COUNTRY_INFO!B27=0,\" \",COUNTRY_INFO!B27)","v":"Eastern"},{"$f":"IF(COUNTRY_INFO!C27=0,\" \",COUNTRY_INFO!C27)","v":"Nyagatare"},{"$f":"IF(COUNTRY_INFO!$T$9:$T$1000=\"MDA1 (IVM+ALB)\", COUNTRY_INFO!$T$9:$T$1000, \" \")","v":" "},null,null,null,null,0,null,null,null,0,null," "," "," "]
[{"$f":"IF(COUNTRY_INFO!A28=0,\" \",COUNTRY_INFO!A28)","v":"Rwanda"},{"$f":"IF(COUNTRY_INFO!B28=0,\" \",COUNTRY_INFO!B28)","v":"Southern"},{"$f":"IF(COUNTRY_INFO!C28=0,\" \",COUNTRY_INFO!C28)","v":"Nyamagabe"},{"$f":"IF(COUNTRY_INFO!$T$9:$T$1000=\"MDA1 (IVM+ALB)\", COUNTRY_INFO!$T$9:$T$1000, \" \")","v":" "},null,null,null,null,0,null,null,null,0,null," "," "," "]
[{"$f":"IF(COUNTRY_INFO!A29=0,\" \",COUNTRY_INFO!A29)","v":"Rwanda"},{"$f":"IF(COUNTRY_INFO!B29=0,\" \",COUNTRY_INFO!B29)","v":"Western"},{"$f":"IF(COUNTRY_INFO!C29=0,\" \",COUNTRY_INFO!C29)","v":"Nyamasheke"},{"$f":"IF(COUNTRY_INFO!$T$9:$T$1000=\"MDA1 (IVM+ALB)\", COUNTRY_INFO!$T$9:$T$1000, \" \")","v":" "},null,null,null,null,0,null,null,null,0,null," "," "," "]
[{"$f":"IF(COUNTRY_INFO!A30=0,\" \",COUNTRY_INFO!A30)","v":"Rwanda"},{"$f":"IF(COUNTRY_INFO!B30=0,\" \",COUNTRY_INFO!B30)","v":"Southern"},{"$f":"IF(COUNTRY_INFO!C30=0,\" \",COUNTRY_INFO!C30)","v":"Nyanza"},{"$f":"IF(COUNTRY_INFO!$T$9:$T$1000=\"MDA1 (IVM+ALB)\", COUNTRY_INFO!$T$9:$T$1000, \" \")","v":" "},null,null,null,null,0,null,null,null,0,null," "," "," "]
[{"$f":"IF(COUNTRY_INFO!A31=0,\" \",COUNTRY_INFO!A31)","v":"Rwanda"},{"$f":"IF(COUNTRY_INFO!B31=0,\" \",COUNTRY_INFO!B31)","v":"Kigali"},{"$f":"IF(COUNTRY_INFO!C31=0,\" \",COUNTRY_INFO!C31)","v":"Nyarugenge"},{"$f":"IF(COUNTRY_INFO!$T$9:$T$1000=\"MDA1 (IVM+ALB)\", COUNTRY_INFO!$T$9:$T$1000, \" \")","v":" "},null,null,null,null,0,null,null,null,0,null," "," "," "]
[{"$f":"IF(COUNTRY_INFO!A32=0,\" \",COUNTRY_INFO!A32)","v":"Rwanda"},{"$f":"IF(COUNTRY_INFO!B32=0,\" \",COUNTRY_INFO!B32)","v":"Southern"},{"$f":"IF(COUNTRY_INFO!C32=0,\" \",COUNTRY_INFO!C32)","v":"Nyaruguru"},{"$f":"IF(COUNTRY_INFO!$T$9:$T$1000=\"MDA1 (IVM+ALB)\", COUNTRY_INFO!$T$9:$T$1000, \" \")","v":" "},null,null,null,null,0,null,null,null,0,null," "," "," "]
[{"$f":"IF(COUNTRY_INFO!A33=0,\" \",COUNTRY_INFO!A33)","v":"Rwanda"},{"$f":"IF(COUNTRY_INFO!B33=0,\" \",COUNTRY_INFO!B33)","v":"Western"},{"$f":"IF(COUNTRY_INFO!C33=0,\" \",COUNTRY_INFO!C33)","v":"Rubavu"},{"$f":"IF(COUNTRY_INFO!$T$9:$T$1000=\"MDA1 (IVM+ALB)\", COUNTRY_INFO!$T$9:$T$1000, \" \")","v":" "},null,null,null,null,0,null,null,null,0,null," "," "," "]
[{"$f":"IF(COUNTRY_INFO!A34=0,\" \",COUNTRY_INFO!A34)","v":"Rwanda"},{"$f":"IF(COUNTRY_INFO!B34=0,\" \",COUNTRY_INFO!B34)","v":"Southern"},{"$f":"IF(COUNTRY_INFO!C34=0,\" \",COUNTRY_INFO!C34)","v":"Ruhango"},{"$f":"IF(COUNTRY_INFO!$T$9:$T$1000=\"MDA1 (IVM+ALB)\", COUNTRY_INFO!$T$9:$T$1000, \" \")","v":" "},null,null,null,null,0,null,null,null,0,null," "," "," "]
[{"$f":"IF(COUNTRY_INFO!A35=0,\" \",COUNTRY_INFO!A35)","v":"Rwanda"},{"$f":"IF(COUNTRY_INFO!B35=0,\" \",COUNTRY_INFO!B35)","v":"Northern"},{"$f":"IF(COUNTRY_INFO!C35=0,\" \",COUNTRY_INFO!C35)","v":"Rulindo"},{"$f":"IF(COUNTRY_INFO!$T$9:$T$1000=\"MDA1 (IVM+ALB)\", COUNTRY_INFO!$T$9:$T$1000, \" \")","v":" "},null,null,null,null,0,null,null,null,0,null," "," "," "]
[{"$f":"IF(COUNTRY_INFO!A36=0,\" \",COUNTRY_INFO!A36)","v":"Rwanda"},{"$f":"IF(COUNTRY_INFO!B36=0,\" \",COUNTRY_INFO!B36)","v":"Western"},{"$f":"IF(COUNTRY_INFO!C36=0,\" \",COUNTRY_INFO!C36)","v":"Rusizi"},{"$f":"IF(COUNTRY_INFO!$T$9:$T$1000=\"MDA1 (IVM+ALB)\", COUNTRY_INFO!$T$9:$T$1000, \" \")","v":" "},null,null,null,null,0,null,null,null,0,null," "," "," "]
[{"$f":"IF(COUNTRY_INFO!A37=0,\" \",COUNTRY_INFO!A37)","v":"Rwanda"},{"$f":"IF(COUNTRY_INFO!B37=0,\" \",COUNTRY_INFO!B37)","v":"Western"},{"$f":"IF(COUNTRY_INFO!C37=0,\" \",COUNTRY_INFO!C37)","v":"Rutsiro"},{"$f":"IF(COUNTRY_INFO!$T$9:$T$1000=\"MDA1 (IVM+ALB)\", COUNTRY_INFO!$T$9:$T$1000, \" \")","v":" "},null,null,null,null,0,null,null,null,0,null," "," "," "]
[{"$f":"IF(COUNTRY_INFO!A38=0,\" \",COUNTRY_INFO!A38)","v":"Rwanda"},{"$f":"IF(COUNTRY_INFO!B38=0,\" \",COUNTRY_INFO!B38)","v":"Eastern"},{"$f":"IF(COUNTRY_INFO!C38=0,\" \",COUNTRY_INFO!C38)","v":"Rwamagana"},{"$f":"IF(COUNTRY_INFO!$T$9:$T$1000=\"MDA1 (IVM+ALB)\", COUNTRY_INFO!$T$9:$T$1000, \" \")","v":" "},null,null,null,null,0,null,null,null,0,null," "," "," "]

{"sheet":"MDA2","index":3,"n_rows":38,"n_cols":17,"rows_kept":38,"cut":false,"hidden":true,"merged":[[5,5,5,8],[5,9,5,12],[5,13,5,16],[3,0,3,2],[5,0,5,2],[5,3,6,3],[5,4,6,4]]}
["MDA 2 - Diethylcarbamazine citrate (DEC) + Albendazole (ALB)"]
["Administrative structure, population requiring PC by age group, population treated by age group and coverage"]
[]
["TOTAL",null,null,null,null,{"$f":"SUM(F$9:F$1000)","v":0},{"$f":"SUM(G$9:G$1000)","v":0},0,0,0,0,0,0,{"$f":"IF(F4<>0, IF(J4/F4*100=0, \"-\", J4/F4*100), \" \")","v":" "},{"$f":"IF(G4<>0, IF(K4/G4*100=0, \"-\", K4/G4*100), \" \")","v":" "},{"$f":"IF(H4<>0, IF(L4/H4*100=0, \"-\", L4/H4*100), \" \")","v":" "},{"$f":"IF(I4<>0, IF(M4/I4*100=0, \"-\", M4/I4*100), \" \")","v":" "}]
[]
[null,null,null,"PC implemented","Date","Population targeted for MDA 2",null,null,null,"Population treated",null,null,null,"Programme coverage (%)"]
["Country","Province/State","District",null,null,"PreSAC","SAC","Adults","Total","PreSAC","SAC","Adults","Total","PreSAC","SAC","Adults","Total"]
[]
[{"$f":"IF(COUNTRY_INFO!A9=0,\" \",COUNTRY_INFO!A9)","v":"Rwanda"},{"$f":"IF(COUNTRY_INFO!B9=0,\" \",COUNTRY_INFO!B9)","v":"Eastern"},{"$f":"IF(COUNTRY_INFO!C9=0,\" \",COUNTRY_INFO!C9)","v":"Bugesera"},{"$f":"IF(COUNTRY_INFO!$T$9:$T$1000=\"MDA2 (DEC+ALB)\", COUNTRY_INFO!$T$9:$T$1000, \" \")","v":" "},null,null,null,null,{"$f":"SUM(F9:H9)","v":0},null,null,null,{"$f":"SUM(J9:L9)","v":0},{"$f":"IF(F9<>0, IF(J9/F9*100=0, \"-\", J9/F9*100), \" \")","v":" "},{"$f":"IF(G9<>0, IF(K9/G9*100=0, \"-\", K9/G9*100), \" \")","v":" "},{"$f":"IF(H9<>0, IF(L9/H9*100=0, \"-\", L9/H9*100), \" \")","v":" "},{"$f":"IF(I9<>0, IF(M9/I9*100=0, \"-\", M9/I9*100), \" \")","v":" "}]
[{"$f":"IF(COUNTRY_INFO!A10=0,\" \",COUNTRY_INFO!A10)","v":"Rwanda"},{"$f":"IF(COUNTRY_INFO!B10=0,\" \",COUNTRY_INFO!B10)","v":"Northern"},{"$f":"IF(COUNTRY_INFO!C10=0,\" \",COUNTRY_INFO!C10)","v":"Burera"},{"$f":"IF(COUNTRY_INFO!$T$9:$T$1000=\"MDA2 (DEC+ALB)\", COUNTRY_INFO!$T$9:$T$1000, \" \")","v":" "},null,null,null,null,{"$f":"SUM(F10:H10)","v":0},null,null,null,{"$f":"SUM(J10:L10)","v":0},{"$f":"IF(F10<>0, IF(J10/F10*100=0, \"-\", J10/F10*100), \" \")","v":" "},{"$f":"IF(G10<>0, IF(K10/G10*100=0, \"-\", K10/G10*100), \" \")","v":" "},{"$f":"IF(H10<>0, IF(L10/H10*100=0, \"-\", L10/H10*100), \" \")","v":" "},{"$f":"IF(I10<>0, IF(M10/I10*100=0, \"-\", M10/I10*100), \" \")","v":" "}]
[{"$f":"IF(COUNTRY_INFO!A11=0,\" \",COUNTRY_INFO!A11)","v":"Rwanda"},{"$f":"IF(COUNTRY_INFO!B11=0,\" \",COUNTRY_INFO!B11)","v":"Northern"},{"$f":"IF(COUNTRY_INFO!C11=0,\" \",COUNTRY_INFO!C11)","v":"Gakenke"},{"$f":"IF(COUNTRY_INFO!$T$9:$T$1000=\"MDA2 (DEC+ALB)\", COUNTRY_INFO!$T$9:$T$1000, \" \")","v":" "},null,null,null,null,0,null,null,null,0," "," "," "," "]
[{"$f":"IF(COUNTRY_INFO!A12=0,\" \",COUNTRY_INFO!A12)","v":"Rwanda"},{"$f":"IF(COUNTRY_INFO!B12=0,\" \",COUNTRY_INFO!B12)","v":"Kigali"},{"$f":"IF(COUNTRY_INFO!C12=0,\" \",COUNTRY_INFO!C12)","v":"Gasabo"},{"$f":"IF(COUNTRY_INFO!$T$9:$T$1000=\"MDA2 (DEC+ALB)\", COUNTRY_INFO!$T$9:$T$1000, \" \")","v":" "},null,null,null,null,0,null,null,null,0," "," "," "," "]
[{"$f":"IF(COUNTRY_INFO!A13=0,\" \",COUNTRY_INFO!A13)","v":"Rwanda"},{"$f":"IF(COUNTRY_INFO!B13=0,\" \",COUNTRY_INFO!B13)","v":"Eastern"},{"$f":"IF(COUNTRY_INFO!C13=0,\" \",COUNTRY_INFO!C13)","v":"Gatsibo"},{"$f":"IF(COUNTRY_INFO!$T$9:$T$1000=\"MDA2 (DEC+ALB)\", COUNTRY_INFO!$T$9:$T$1000, \" \")","v":" "},null,null,null,null,0,null,null,null,0," "," "," "," "]
[{"$f":"IF(COUNTRY_INFO!A14=0,\" \",COUNTRY_INFO!A14)","v":"Rwanda"},{"$f":"IF(COUNTRY_INFO!B14=0,\" \",COUNTRY_INFO!B14)","v":"Northern"},{"$f":"IF(COUNTRY_INFO!C14=0,\" \",COUNTRY_INFO!C14)","v":"Gicumbi"},{"$f":"IF(COUNTRY_INFO!$T$9:$T$1000=\"MDA2 (DEC+ALB)\", COUNTRY_INFO!$T$9:$T$1000, \" \")","v":" "},null,null,null,null,0,null,null,null,0," "," "," "," "]
[{"$f":"IF(COUNTRY_INFO!A15=0,\" \",COUNTRY_INFO!A15)","v":"Rwanda"},{"$f":"IF(COUNTRY_INFO!B15=0,\" \",COUNTRY_INFO!B15)","v":"Southern"},{"$f":"IF(COUNTRY_INFO!C15=0,\" \",COUNTRY_INFO!C15)","v":"Gisagara"},{"$f":"IF(COUNTRY_INFO!$T$9:$T$1000=\"MDA2 (DEC+ALB)\", COUNTRY_INFO!$T$9:$T$1000, \" \")","v":" "},null,null,null,null,0,null,null,null,0," "," "," "," "]
[{"$f":"IF(COUNTRY_INFO!A16=0,\" \",COUNTRY_INFO!A16)","v":"Rwanda"},{"$f":"IF(COUNTRY_INFO!B16=0,\" \",COUNTRY_INFO!B16)","v":"Southern"},{"$f":"IF(COUNTRY_INFO!C16=0,\" \",COUNTRY_INFO!C16)","v":"Huye"},{"$f":"IF(COUNTRY_INFO!$T$9:$T$1000=\"MDA2 (DEC+ALB)\", COUNTRY_INFO!$T$9:$T$1000, \" \")","v":" "},null,null,null,null,0,null,null,null,0," "," "," "," "]
[{"$f":"IF(COUNTRY_INFO!A17=0,\" \",COUNTRY_INFO!A17)","v":"Rwanda"},{"$f":"IF(COUNTRY_INFO!B17=0,\" \",COUNTRY_INFO!B17)","v":"Southern"},{"$f":"IF(COUNTRY_INFO!C17=0,\" \",COUNTRY_INFO!C17)","v":"Kamonyi"},{"$f":"IF(COUNTRY_INFO!$T$9:$T$1000=\"MDA2 (DEC+ALB)\", COUNTRY_INFO!$T$9:$T$1000, \" \")","v":" "},null,null,null,null,0,null,null,null,0," "," "," "," "]
[{"$f":"IF(COUNTRY_INFO!A18=0,\" \",COUNTRY_INFO!A18)","v":"Rwanda"},{"$f":"IF(COUNTRY_INFO!B18=0,\" \",COUNTRY_INFO!B18)","v":"Western"},{"$f":"IF(COUNTRY_INFO!C18=0,\" \",COUNTRY_INFO!C18)","v":"Karongi"},{"$f":"IF(COUNTRY_INFO!$T$9:$T$1000=\"MDA2 (DEC+ALB)\", COUNTRY_INFO!$T$9:$T$1000, \" \")","v":" "},null,null,null,null,0,null,null,null,0," "," "," "," "]
[{"$f":"IF(COUNTRY_INFO!A19=0,\" \",COUNTRY_INFO!A19)","v":"Rwanda"},{"$f":"IF(COUNTRY_INFO!B19=0,\" \",COUNTRY_INFO!B19)","v":"Eastern"},{"$f":"IF(COUNTRY_INFO!C19=0,\" \",COUNTRY_INFO!C19)","v":"Kayonza"},{"$f":"IF(COUNTRY_INFO!$T$9:$T$1000=\"MDA2 (DEC+ALB)\", COUNTRY_INFO!$T$9:$T$1000, \" \")","v":" "},null,null,null,null,0,null,null,null,0," "," "," "," "]
[{"$f":"IF(COUNTRY_INFO!A20=0,\" \",COUNTRY_INFO!A20)","v":"Rwanda"},{"$f":"IF(COUNTRY_INFO!B20=0,\" \",COUNTRY_INFO!B20)","v":"Kigali"},{"$f":"IF(COUNTRY_INFO!C20=0,\" \",COUNTRY_INFO!C20)","v":"Kicukiro"},{"$f":"IF(COUNTRY_INFO!$T$9:$T$1000=\"MDA2 (DEC+ALB)\", COUNTRY_INFO!$T$9:$T$1000, \" \")","v":" "},null,null,null,null,0,null,null,null,0," "," "," "," "]
[{"$f":"IF(COUNTRY_INFO!A21=0,\" \",COUNTRY_INFO!A21)","v":"Rwanda"},{"$f":"IF(COUNTRY_INFO!B21=0,\" \",COUNTRY_INFO!B21)","v":"Eastern"},{"$f":"IF(COUNTRY_INFO!C21=0,\" \",COUNTRY_INFO!C21)","v":"Kirehe"},{"$f":"IF(COUNTRY_INFO!$T$9:$T$1000=\"MDA2 (DEC+ALB)\", COUNTRY_INFO!$T$9:$T$1000, \" \")","v":" "},null,null,null,null,0,null,null,null,0," "," "," "," "]
[{"$f":"IF(COUNTRY_INFO!A22=0,\" \",COUNTRY_INFO!A22)","v":"Rwanda"},{"$f":"IF(COUNTRY_INFO!B22=0,\" \",COUNTRY_INFO!B22)","v":"Southern"},{"$f":"IF(COUNTRY_INFO!C22=0,\" \",COUNTRY_INFO!C22)","v":"Muhanga"},{"$f":"IF(COUNTRY_INFO!$T$9:$T$1000=\"MDA2 (DEC+ALB)\", COUNTRY_INFO!$T$9:$T$1000, \" \")","v":" "},null,null,null,null,0,null,null,null,0," "," "," "," "]
[{"$f":"IF(COUNTRY_INFO!A23=0,\" \",COUNTRY_INFO!A23)","v":"Rwanda"},{"$f":"IF(COUNTRY_INFO!B23=0,\" \",COUNTRY_INFO!B23)","v":"Northern"},{"$f":"IF(COUNTRY_INFO!C23=0,\" \",COUNTRY_INFO!C23)","v":"Musanze"},{"$f":"IF(COUNTRY_INFO!$T$9:$T$1000=\"MDA2 (DEC+ALB)\", COUNTRY_INFO!$T$9:$T$1000, \" \")","v":" "},null,null,null,null,0,null,null,null,0," "," "," "," "]
[{"$f":"IF(COUNTRY_INFO!A24=0,\" \",COUNTRY_INFO!A24)","v":"Rwanda"},{"$f":"IF(COUNTRY_INFO!B24=0,\" \",COUNTRY_INFO!B24)","v":"Eastern"},{"$f":"IF(COUNTRY_INFO!C24=0,\" \",COUNTRY_INFO!C24)","v":"Ngoma"},{"$f":"IF(COUNTRY_INFO!$T$9:$T$1000=\"MDA2 (DEC+ALB)\", COUNTRY_INFO!$T$9:$T$1000, \" \")","v":" "},null,null,null,null,0,null,null,null,0," "," "," "," "]
[{"$f":"IF(COUNTRY_INFO!A25=0,\" \",COUNTRY_INFO!A25)","v":"Rwanda"},{"$f":"IF(COUNTRY_INFO!B25=0,\" \",COUNTRY_INFO!B25)","v":"Western"},{"$f":"IF(COUNTRY_INFO!C25=0,\" \",COUNTRY_INFO!C25)","v":"Ngororero"},{"$f":"IF(COUNTRY_INFO!$T$9:$T$1000=\"MDA2 (DEC+ALB)\", COUNTRY_INFO!$T$9:$T$1000, \" \")","v":" "},null,null,null,null,0,null,null,null,0," "," "," "," "]
[{"$f":"IF(COUNTRY_INFO!A26=0,\" \",COUNTRY_INFO!A26)","v":"Rwanda"},{"$f":"IF(COUNTRY_INFO!B26=0,\" \",COUNTRY_INFO!B26)","v":"Western"},{"$f":"IF(COUNTRY_INFO!C26=0,\" \",COUNTRY_INFO!C26)","v":"Nyabihu"},{"$f":"IF(COUNTRY_INFO!$T$9:$T$1000=\"MDA2 (DEC+ALB)\", COUNTRY_INFO!$T$9:$T$1000, \" \")","v":" "},null,null,null,null,0,null,null,null,0," "," "," "," "]
[{"$f":"IF(COUNTRY_INFO!A27=0,\" \",COUNTRY_INFO!A27)","v":"Rwanda"},{"$f":"IF(COUNTRY_INFO!B27=0,\" \",COUNTRY_INFO!B27)","v":"Eastern"},{"$f":"IF(COUNTRY_INFO!C27=0,\" \",COUNTRY_INFO!C27)","v":"Nyagatare"},{"$f":"IF(COUNTRY_INFO!$T$9:$T$1000=\"MDA2 (DEC+ALB)\", COUNTRY_INFO!$T$9:$T$1000, \" \")","v":" "},null,null,null,null,0,null,null,null,0," "," "," "," "]
[{"$f":"IF(COUNTRY_INFO!A28=0,\" \",COUNTRY_INFO!A28)","v":"Rwanda"},{"$f":"IF(COUNTRY_INFO!B28=0,\" \",COUNTRY_INFO!B28)","v":"Southern"},{"$f":"IF(COUNTRY_INFO!C28=0,\" \",COUNTRY_INFO!C28)","v":"Nyamagabe"},{"$f":"IF(COUNTRY_INFO!$T$9:$T$1000=\"MDA2 (DEC+ALB)\", COUNTRY_INFO!$T$9:$T$1000, \" \")","v":" "},null,null,null,null,0,null,null,null,0," "," "," "," "]
[{"$f":"IF(COUNTRY_INFO!A29=0,\" \",COUNTRY_INFO!A29)","v":"Rwanda"},{"$f":"IF(COUNTRY_INFO!B29=0,\" \",COUNTRY_INFO!B29)","v":"Western"},{"$f":"IF(COUNTRY_INFO!C29=0,\" \",COUNTRY_INFO!C29)","v":"Nyamasheke"},{"$f":"IF(COUNTRY_INFO!$T$9:$T$1000=\"MDA2 (DEC+ALB)\", COUNTRY_INFO!$T$9:$T$1000, \" \")","v":" "},null,null,null,null,0,null,null,null,0," "," "," "," "]
[{"$f":"IF(COUNTRY_INFO!A30=0,\" \",COUNTRY_INFO!A30)","v":"Rwanda"},{"$f":"IF(COUNTRY_INFO!B30=0,\" \",COUNTRY_INFO!B30)","v":"Southern"},{"$f":"IF(COUNTRY_INFO!C30=0,\" \",COUNTRY_INFO!C30)","v":"Nyanza"},{"$f":"IF(COUNTRY_INFO!$T$9:$T$1000=\"MDA2 (DEC+ALB)\", COUNTRY_INFO!$T$9:$T$1000, \" \")","v":" "},null,null,null,null,0,null,null,null,0," "," "," "," "]
[{"$f":"IF(COUNTRY_INFO!A31=0,\" \",COUNTRY_INFO!A31)","v":"Rwanda"},{"$f":"IF(COUNTRY_INFO!B31=0,\" \",COUNTRY_INFO!B31)","v":"Kigali"},{"$f":"IF(COUNTRY_INFO!C31=0,\" \",COUNTRY_INFO!C31)","v":"Nyarugenge"},{"$f":"IF(COUNTRY_INFO!$T$9:$T$1000=\"MDA2 (DEC+ALB)\", COUNTRY_INFO!$T$9:$T$1000, \" \")","v":" "},null,null,null,null,0,null,null,null,0," "," "," "," "]
[{"$f":"IF(COUNTRY_INFO!A32=0,\" \",COUNTRY_INFO!A32)","v":"Rwanda"},{"$f":"IF(COUNTRY_INFO!B32=0,\" \",COUNTRY_INFO!B32)","v":"Southern"},{"$f":"IF(COUNTRY_INFO!C32=0,\" \",COUNTRY_INFO!C32)","v":"Nyaruguru"},{"$f":"IF(COUNTRY_INFO!$T$9:$T$1000=\"MDA2 (DEC+ALB)\", COUNTRY_INFO!$T$9:$T$1000, \" \")","v":" "},null,null,null,null,0,null,null,null,0," "," "," "," "]
[{"$f":"IF(COUNTRY_INFO!A33=0,\" \",COUNTRY_INFO!A33)","v":"Rwanda"},{"$f":"IF(COUNTRY_INFO!B33=0,\" \",COUNTRY_INFO!B33)","v":"Western"},{"$f":"IF(COUNTRY_INFO!C33=0,\" \",COUNTRY_INFO!C33)","v":"Rubavu"},{"$f":"IF(COUNTRY_INFO!$T$9:$T$1000=\"MDA2 (DEC+ALB)\", COUNTRY_INFO!$T$9:$T$1000, \" \")","v":" "},null,null,null,null,0,null,null,null,0," "," "," "," "]
[{"$f":"IF(COUNTRY_INFO!A34=0,\" \",COUNTRY_INFO!A34)","v":"Rwanda"},{"$f":"IF(COUNTRY_INFO!B34=0,\" \",COUNTRY_INFO!B34)","v":"Southern"},{"$f":"IF(COUNTRY_INFO!C34=0,\" \",COUNTRY_INFO!C34)","v":"Ruhango"},{"$f":"IF(COUNTRY_INFO!$T$9:$T$1000=\"MDA2 (DEC+ALB)\", COUNTRY_INFO!$T$9:$T$1000, \" \")","v":" "},null,null,null,null,0,null,null,null,0," "," "," "," "]
[{"$f":"IF(COUNTRY_INFO!A35=0,\" \",COUNTRY_INFO!A35)","v":"Rwanda"},{"$f":"IF(COUNTRY_INFO!B35=0,\" \",COUNTRY_INFO!B35)","v":"Northern"},{"$f":"IF(COUNTRY_INFO!C35=0,\" \",COUNTRY_INFO!C35)","v":"Rulindo"},{"$f":"IF(COUNTRY_INFO!$T$9:$T$1000=\"MDA2 (DEC+ALB)\", COUNTRY_INFO!$T$9:$T$1000, \" \")","v":" "},null,null,null,null,0,null,null,null,0," "," "," "," "]
[{"$f":"IF(COUNTRY_INFO!A36=0,\" \",COUNTRY_INFO!A36)","v":"Rwanda"},{"$f":"IF(COUNTRY_INFO!B36=0,\" \",COUNTRY_INFO!B36)","v":"Western"},{"$f":"IF(COUNTRY_INFO!C36=0,\" \",COUNTRY_INFO!C36)","v":"Rusizi"},{"$f":"IF(COUNTRY_INFO!$T$9:$T$1000=\"MDA2 (DEC+ALB)\", COUNTRY_INFO!$T$9:$T$1000, \" \")","v":" "},null,null,null,null,0,null,null,null,0," "," "," "," "]
[{"$f":"IF(COUNTRY_INFO!A37=0,\" \",COUNTRY_INFO!A37)","v":"Rwanda"},{"$f":"IF(COUNTRY_INFO!B37=0,\" \",COUNTRY_INFO!B37)","v":"Western"},{"$f":"IF(COUNTRY_INFO!C37=0,\" \",COUNTRY_INFO!C37)","v":"Rutsiro"},{"$f":"IF(COUNTRY_INFO!$T$9:$T$1000=\"MDA2 (DEC+ALB)\", COUNTRY_INFO!$T$9:$T$1000, \" \")","v":" "},null,null,null,null,0,null,null,null,0," "," "," "," "]
[{"$f":"IF(COUNTRY_INFO!A38=0,\" \",COUNTRY_INFO!A38)","v":"Rwanda"},{"$f":"IF(COUNTRY_INFO!B38=0,\" \",COUNTRY_INFO!B38)","v":"Eastern"},{"$f":"IF(COUNTRY_INFO!C38=0,\" \",COUNTRY_INFO!C38)","v":"Rwamagana"},{"$f":"IF(COUNTRY_INFO!$T$9:$T$1000=\"MDA2 (DEC+ALB)\", COUNTRY_INFO!$T$9:$T$1000, \" \")","v":" "},null,null,null,null,0,null,null,null,0," "," "," "," "]

{"sheet":"MDA3","index":4,"n_rows":38,"n_cols":20,"rows_kept":38,"cut":false,"hidden":true,"merged":[[5,5,5,7],[5,17,5,19],[3,0,3,2],[5,0,5,2],[5,3,6,3],[5,4,6,4],[5,8,5,10],[5,11,5,13],[5,14,5,16]]}
["MDA 3 - Ivermectin (IVM) "]
["Administrative structure, population requiring PC by age group, population treated by age group and coverage"]
[]
["TOTAL",null,null,null,null,{"$f":"SUM(F$9:F$1000)","v":0},0,0,0,0,0,0,0,0,0,0,0,{"$f":"IF(F4<>0, IF(O4/F4*100=0, \"-\", O4/F4*100), \" \")","v":" "},{"$f":"IF(G4<>0, IF(P4/G4*100=0, \"-\", P4/G4*100), \" \")","v":" "},{"$f":"IF(H4<>0, IF(Q4/H4*100=0, \"-\", Q4/H4*100), \" \")","v":" "}]
[]
[null,null,null,"PC implemented","Date","Population targeted for MDA 3",null,null,"Population treated - 1st round",null,null,"Population treated - 2nd round",null,null,"Population treated",null,null,"Programme coverage (%)"]
["Country","Province/State","District",null,null,"SAC","Adults","Total","SAC","Adults","Total","SAC","Adults","Total","SAC","Adults","Total","SAC","Adults","Total"]
[]
[{"$f":"IF(COUNTRY_INFO!A9=0,\" \",COUNTRY_INFO!A9)","v":"Rwanda"},{"$f":"IF(COUNTRY_INFO!B9=0,\" \",COUNTRY_INFO!B9)","v":"Eastern"},{"$f":"IF(COUNTRY_INFO!C9=0,\" \",COUNTRY_INFO!C9)","v":"Bugesera"},{"$f":"IF(COUNTRY_INFO!$T$9:$T$1000=\"MDA3 (IVM)\", COUNTRY_INFO!$T$9:$T$1000, \" \")","v":" "},null,null,null,{"$f":"SUM(F9:G9)","v":0},null,null,{"$f":"SUM(I9:J9)","v":0},null,null,{"$f":"SUM(L9:M9)","v":0},{"$f":"MAX(I9,L9)","v":0},{"$f":"MAX(J9,M9)","v":0},{"$f":"SUM(O9:P9)","v":0},{"$f":"IF(F9<>0, IF(MAX(I9,L9)/F9*100=0, \"-\", MAX(I9,L9)/F9*100), \" \")","v":" "},{"$f":"IF(G9<>0, IF(MAX(J9,M9)/G9*100=0, \"-\", MAX(J9,M9)/G9*100), \" \")","v":" "},{"$f":"IF(H9<>0, IF((MAX(I9,L9)+MAX(J9,M9))/H9*100=0, \"-\",(MAX(I9,L9)+MAX(J9,M9))/H9*100), \" \")","v":" "}]
[{"$f":"IF(COUNTRY_INFO!A10=0,\" \",COUNTRY_INFO!A10)","v":"Rwanda"},{"$f":"IF(COUNTRY_INFO!B10=0,\" \",COUNTRY_INFO!B10)","v":"Northern"},{"$f":"IF(COUNTRY_INFO!C10=0,\" \",COUNTRY_INFO!C10)","v":"Burera"},{"$f":"IF(COUNTRY_INFO!$T$9:$T$1000=\"MDA3 (IVM)\", COUNTRY_INFO!$T$9:$T$1000, \" \")","v":" "},null,null,null,{"$f":"SUM(F10:G10)","v":0},null,null,{"$f":"SUM(I10:J10)","v":0},null,null,{"$f":"SUM(L10:M10)","v":0},{"$f":"MAX(I10,L10)","v":0},{"$f":"MAX(J10,M10)","v":0},{"$f":"SUM(O10:P10)","v":0},{"$f":"IF(F10<>0, IF(MAX(I10,L10)/F10*100=0, \"-\", MAX(I10,L10)/F10*100), \" \")","v":" "},{"$f":"IF(G10<>0, IF(MAX(J10,M10)/G10*100=0, \"-\", MAX(J10,M10)/G10*100), \" \")","v":" "},{"$f":"IF(H10<>0, IF((MAX(I10,L10)+MAX(J10,M10))/H10*100=0, \"-\",(MAX(I10,L10)+MAX(J10,M10))/H10*100), \" \")","v":" "}]
[{"$f":"IF(COUNTRY_INFO!A11=0,\" \",COUNTRY_INFO!A11)","v":"Rwanda"},{"$f":"IF(COUNTRY_INFO!B11=0,\" \",COUNTRY_INFO!B11)","v":"Northern"},{"$f":"IF(COUNTRY_INFO!C11=0,\" \",COUNTRY_INFO!C11)","v":"Gakenke"},{"$f":"IF(COUNTRY_INFO!$T$9:$T$1000=\"MDA3 (IVM)\", COUNTRY_INFO!$T$9:$T$1000, \" \")","v":" "},null,null,null,0,null,null,0,null,null,0,0,0,0," "," "," "]
[{"$f":"IF(COUNTRY_INFO!A12=0,\" \",COUNTRY_INFO!A12)","v":"Rwanda"},{"$f":"IF(COUNTRY_INFO!B12=0,\" \",COUNTRY_INFO!B12)","v":"Kigali"},{"$f":"IF(COUNTRY_INFO!C12=0,\" \",COUNTRY_INFO!C12)","v":"Gasabo"},{"$f":"IF(COUNTRY_INFO!$T$9:$T$1000=\"MDA3 (IVM)\", COUNTRY_INFO!$T$9:$T$1000, \" \")","v":" "},null,null,null,0,null,null,0,null,null,0,0,0,0," "," "," "]
[{"$f":"IF(COUNTRY_INFO!A13=0,\" \",COUNTRY_INFO!A13)","v":"Rwanda"},{"$f":"IF(COUNTRY_INFO!B13=0,\" \",COUNTRY_INFO!B13)","v":"Eastern"},{"$f":"IF(COUNTRY_INFO!C13=0,\" \",COUNTRY_INFO!C13)","v":"Gatsibo"},{"$f":"IF(COUNTRY_INFO!$T$9:$T$1000=\"MDA3 (IVM)\", COUNTRY_INFO!$T$9:$T$1000, \" \")","v":" "},null,null,null,0,null,null,0,null,null,0,0,0,0," "," "," "]
[{"$f":"IF(COUNTRY_INFO!A14=0,\" \",COUNTRY_INFO!A14)","v":"Rwanda"},{"$f":"IF(COUNTRY_INFO!B14=0,\" \",COUNTRY_INFO!B14)","v":"Northern"},{"$f":"IF(COUNTRY_INFO!C14=0,\" \",COUNTRY_INFO!C14)","v":"Gicumbi"},{"$f":"IF(COUNTRY_INFO!$T$9:$T$1000=\"MDA3 (IVM)\", COUNTRY_INFO!$T$9:$T$1000, \" \")","v":" "},null,null,null,0,null,null,0,null,null,0,0,0,0," "," "," "]
[{"$f":"IF(COUNTRY_INFO!A15=0,\" \",COUNTRY_INFO!A15)","v":"Rwanda"},{"$f":"IF(COUNTRY_INFO!B15=0,\" \",COUNTRY_INFO!B15)","v":"Southern"},{"$f":"IF(COUNTRY_INFO!C15=0,\" \",COUNTRY_INFO!C15)","v":"Gisagara"},{"$f":"IF(COUNTRY_INFO!$T$9:$T$1000=\"MDA3 (IVM)\", COUNTRY_INFO!$T$9:$T$1000, \" \")","v":" "},null,null,null,0,null,null,0,null,null,0,0,0,0," "," "," "]
[{"$f":"IF(COUNTRY_INFO!A16=0,\" \",COUNTRY_INFO!A16)","v":"Rwanda"},{"$f":"IF(COUNTRY_INFO!B16=0,\" \",COUNTRY_INFO!B16)","v":"Southern"},{"$f":"IF(COUNTRY_INFO!C16=0,\" \",COUNTRY_INFO!C16)","v":"Huye"},{"$f":"IF(COUNTRY_INFO!$T$9:$T$1000=\"MDA3 (IVM)\", COUNTRY_INFO!$T$9:$T$1000, \" \")","v":" "},null,null,null,0,null,null,0,null,null,0,0,0,0," "," "," "]
[{"$f":"IF(COUNTRY_INFO!A17=0,\" \",COUNTRY_INFO!A17)","v":"Rwanda"},{"$f":"IF(COUNTRY_INFO!B17=0,\" \",COUNTRY_INFO!B17)","v":"Southern"},{"$f":"IF(COUNTRY_INFO!C17=0,\" \",COUNTRY_INFO!C17)","v":"Kamonyi"},{"$f":"IF(COUNTRY_INFO!$T$9:$T$1000=\"MDA3 (IVM)\", COUNTRY_INFO!$T$9:$T$1000, \" \")","v":" "},null,null,null,0,null,null,0,null,null,0,0,0,0," "," "," "]
[{"$f":"IF(COUNTRY_INFO!A18=0,\" \",COUNTRY_INFO!A18)","v":"Rwanda"},{"$f":"IF(COUNTRY_INFO!B18=0,\" \",COUNTRY_INFO!B18)","v":"Western"},{"$f":"IF(COUNTRY_INFO!C18=0,\" \",COUNTRY_INFO!C18)","v":"Karongi"},{"$f":"IF(COUNTRY_INFO!$T$9:$T$1000=\"MDA3 (IVM)\", COUNTRY_INFO!$T$9:$T$1000, \" \")","v":" "},null,null,null,0,null,null,0,null,null,0,0,0,0," "," "," "]
[{"$f":"IF(COUNTRY_INFO!A19=0,\" \",COUNTRY_INFO!A19)","v":"Rwanda"},{"$f":"IF(COUNTRY_INFO!B19=0,\" \",COUNTRY_INFO!B19)","v":"Eastern"},{"$f":"IF(COUNTRY_INFO!C19=0,\" \",COUNTRY_INFO!C19)","v":"Kayonza"},{"$f":"IF(COUNTRY_INFO!$T$9:$T$1000=\"MDA3 (IVM)\", COUNTRY_INFO!$T$9:$T$1000, \" \")","v":" "},null,null,null,0,null,null,0,null,null,0,0,0,0," "," "," "]
[{"$f":"IF(COUNTRY_INFO!A20=0,\" \",COUNTRY_INFO!A20)","v":"Rwanda"},{"$f":"IF(COUNTRY_INFO!B20=0,\" \",COUNTRY_INFO!B20)","v":"Kigali"},{"$f":"IF(COUNTRY_INFO!C20=0,\" \",COUNTRY_INFO!C20)","v":"Kicukiro"},{"$f":"IF(COUNTRY_INFO!$T$9:$T$1000=\"MDA3 (IVM)\", COUNTRY_INFO!$T$9:$T$1000, \" \")","v":" "},null,null,null,0,null,null,0,null,null,0,0,0,0," "," "," "]
[{"$f":"IF(COUNTRY_INFO!A21=0,\" \",COUNTRY_INFO!A21)","v":"Rwanda"},{"$f":"IF(COUNTRY_INFO!B21=0,\" \",COUNTRY_INFO!B21)","v":"Eastern"},{"$f":"IF(COUNTRY_INFO!C21=0,\" \",COUNTRY_INFO!C21)","v":"Kirehe"},{"$f":"IF(COUNTRY_INFO!$T$9:$T$1000=\"MDA3 (IVM)\", COUNTRY_INFO!$T$9:$T$1000, \" \")","v":" "},null,null,null,0,null,null,0,null,null,0,0,0,0," "," "," "]
[{"$f":"IF(COUNTRY_INFO!A22=0,\" \",COUNTRY_INFO!A22)","v":"Rwanda"},{"$f":"IF(COUNTRY_INFO!B22=0,\" \",COUNTRY_INFO!B22)","v":"Southern"},{"$f":"IF(COUNTRY_INFO!C22=0,\" \",COUNTRY_INFO!C22)","v":"Muhanga"},{"$f":"IF(COUNTRY_INFO!$T$9:$T$1000=\"MDA3 (IVM)\", COUNTRY_INFO!$T$9:$T$1000, \" \")","v":" "},null,null,null,0,null,null,0,null,null,0,0,0,0," "," "," "]
[{"$f":"IF(COUNTRY_INFO!A23=0,\" \",COUNTRY_INFO!A23)","v":"Rwanda"},{"$f":"IF(COUNTRY_INFO!B23=0,\" \",COUNTRY_INFO!B23)","v":"Northern"},{"$f":"IF(COUNTRY_INFO!C23=0,\" \",COUNTRY_INFO!C23)","v":"Musanze"},{"$f":"IF(COUNTRY_INFO!$T$9:$T$1000=\"MDA3 (IVM)\", COUNTRY_INFO!$T$9:$T$1000, \" \")","v":" "},null,null,null,0,null,null,0,null,null,0,0,0,0," "," "," "]
[{"$f":"IF(COUNTRY_INFO!A24=0,\" \",COUNTRY_INFO!A24)","v":"Rwanda"},{"$f":"IF(COUNTRY_INFO!B24=0,\" \",COUNTRY_INFO!B24)","v":"Eastern"},{"$f":"IF(COUNTRY_INFO!C24=0,\" \",COUNTRY_INFO!C24)","v":"Ngoma"},{"$f":"IF(COUNTRY_INFO!$T$9:$T$1000=\"MDA3 (IVM)\", COUNTRY_INFO!$T$9:$T$1000, \" \")","v":" "},null,null,null,0,null,null,0,null,null,0,0,0,0," "," "," "]
[{"$f":"IF(COUNTRY_INFO!A25=0,\" \",COUNTRY_INFO!A25)","v":"Rwanda"},{"$f":"IF(COUNTRY_INFO!B25=0,\" \",COUNTRY_INFO!B25)","v":"Western"},{"$f":"IF(COUNTRY_INFO!C25=0,\" \",COUNTRY_INFO!C25)","v":"Ngororero"},{"$f":"IF(COUNTRY_INFO!$T$9:$T$1000=\"MDA3 (IVM)\", COUNTRY_INFO!$T$9:$T$1000, \" \")","v":" "},null,null,null,0,null,null,0,null,null,0,0,0,0," "," "," "]
[{"$f":"IF(COUNTRY_INFO!A26=0,\" \",COUNTRY_INFO!A26)","v":"Rwanda"},{"$f":"IF(COUNTRY_INFO!B26=0,\" \",COUNTRY_INFO!B26)","v":"Western"},{"$f":"IF(COUNTRY_INFO!C26=0,\" \",COUNTRY_INFO!C26)","v":"Nyabihu"},{"$f":"IF(COUNTRY_INFO!$T$9:$T$1000=\"MDA3 (IVM)\", COUNTRY_INFO!$T$9:$T$1000, \" \")","v":" "},null,null,null,0,null,null,0,null,null,0,0,0,0," "," "," "]
[{"$f":"IF(COUNTRY_INFO!A27=0,\" \",COUNTRY_INFO!A27)","v":"Rwanda"},{"$f":"IF(COUNTRY_INFO!B27=0,\" \",COUNTRY_INFO!B27)","v":"Eastern"},{"$f":"IF(COUNTRY_INFO!C27=0,\" \",COUNTRY_INFO!C27)","v":"Nyagatare"},{"$f":"IF(COUNTRY_INFO!$T$9:$T$1000=\"MDA3 (IVM)\", COUNTRY_INFO!$T$9:$T$1000, \" \")","v":" "},null,null,null,0,null,null,0,null,null,0,0,0,0," "," "," "]
[{"$f":"IF(COUNTRY_INFO!A28=0,\" \",COUNTRY_INFO!A28)","v":"Rwanda"},{"$f":"IF(COUNTRY_INFO!B28=0,\" \",COUNTRY_INFO!B28)","v":"Southern"},{"$f":"IF(COUNTRY_INFO!C28=0,\" \",COUNTRY_INFO!C28)","v":"Nyamagabe"},{"$f":"IF(COUNTRY_INFO!$T$9:$T$1000=\"MDA3 (IVM)\", COUNTRY_INFO!$T$9:$T$1000, \" \")","v":" "},null,null,null,0,null,null,0,null,null,0,0,0,0," "," "," "]
[{"$f":"IF(COUNTRY_INFO!A29=0,\" \",COUNTRY_INFO!A29)","v":"Rwanda"},{"$f":"IF(COUNTRY_INFO!B29=0,\" \",COUNTRY_INFO!B29)","v":"Western"},{"$f":"IF(COUNTRY_INFO!C29=0,\" \",COUNTRY_INFO!C29)","v":"Nyamasheke"},{"$f":"IF(COUNTRY_INFO!$T$9:$T$1000=\"MDA3 (IVM)\", COUNTRY_INFO!$T$9:$T$1000, \" \")","v":" "},null,null,null,0,null,null,0,null,null,0,0,0,0," "," "," "]
[{"$f":"IF(COUNTRY_INFO!A30=0,\" \",COUNTRY_INFO!A30)","v":"Rwanda"},{"$f":"IF(COUNTRY_INFO!B30=0,\" \",COUNTRY_INFO!B30)","v":"Southern"},{"$f":"IF(COUNTRY_INFO!C30=0,\" \",COUNTRY_INFO!C30)","v":"Nyanza"},{"$f":"IF(COUNTRY_INFO!$T$9:$T$1000=\"MDA3 (IVM)\", COUNTRY_INFO!$T$9:$T$1000, \" \")","v":" "},null,null,null,0,null,null,0,null,null,0,0,0,0," "," "," "]
[{"$f":"IF(COUNTRY_INFO!A31=0,\" \",COUNTRY_INFO!A31)","v":"Rwanda"},{"$f":"IF(COUNTRY_INFO!B31=0,\" \",COUNTRY_INFO!B31)","v":"Kigali"},{"$f":"IF(COUNTRY_INFO!C31=0,\" \",COUNTRY_INFO!C31)","v":"Nyarugenge"},{"$f":"IF(COUNTRY_INFO!$T$9:$T$1000=\"MDA3 (IVM)\", COUNTRY_INFO!$T$9:$T$1000, \" \")","v":" "},null,null,null,0,null,null,0,null,null,0,0,0,0," "," "," "]
[{"$f":"IF(COUNTRY_INFO!A32=0,\" \",COUNTRY_INFO!A32)","v":"Rwanda"},{"$f":"IF(COUNTRY_INFO!B32=0,\" \",COUNTRY_INFO!B32)","v":"Southern"},{"$f":"IF(COUNTRY_INFO!C32=0,\" \",COUNTRY_INFO!C32)","v":"Nyaruguru"},{"$f":"IF(COUNTRY_INFO!$T$9:$T$1000=\"MDA3 (IVM)\", COUNTRY_INFO!$T$9:$T$1000, \" \")","v":" "},null,null,null,0,null,null,0,null,null,0,0,0,0," "," "," "]
[{"$f":"IF(COUNTRY_INFO!A33=0,\" \",COUNTRY_INFO!A33)","v":"Rwanda"},{"$f":"IF(COUNTRY_INFO!B33=0,\" \",COUNTRY_INFO!B33)","v":"Western"},{"$f":"IF(COUNTRY_INFO!C33=0,\" \",COUNTRY_INFO!C33)","v":"Rubavu"},{"$f":"IF(COUNTRY_INFO!$T$9:$T$1000=\"MDA3 (IVM)\", COUNTRY_INFO!$T$9:$T$1000, \" \")","v":" "},null,null,null,0,null,null,0,null,null,0,0,0,0," "," "," "]
[{"$f":"IF(COUNTRY_INFO!A34=0,\" \",COUNTRY_INFO!A34)","v":"Rwanda"},{"$f":"IF(COUNTRY_INFO!B34=0,\" \",COUNTRY_INFO!B34)","v":"Southern"},{"$f":"IF(COUNTRY_INFO!C34=0,\" \",COUNTRY_INFO!C34)","v":"Ruhango"},{"$f":"IF(COUNTRY_INFO!$T$9:$T$1000=\"MDA3 (IVM)\", COUNTRY_INFO!$T$9:$T$1000, \" \")","v":" "},null,null,null,0,null,null,0,null,null,0,0,0,0," "," "," "]
[{"$f":"IF(COUNTRY_INFO!A35=0,\" \",COUNTRY_INFO!A35)","v":"Rwanda"},{"$f":"IF(COUNTRY_INFO!B35=0,\" \",COUNTRY_INFO!B35)","v":"Northern"},{"$f":"IF(COUNTRY_INFO!C35=0,\" \",COUNTRY_INFO!C35)","v":"Rulindo"},{"$f":"IF(COUNTRY_INFO!$T$9:$T$1000=\"MDA3 (IVM)\", COUNTRY_INFO!$T$9:$T$1000, \" \")","v":" "},null,null,null,0,null,null,0,null,null,0,0,0,0," "," "," "]
[{"$f":"IF(COUNTRY_INFO!A36=0,\" \",COUNTRY_INFO!A36)","v":"Rwanda"},{"$f":"IF(COUNTRY_INFO!B36=0,\" \",COUNTRY_INFO!B36)","v":"Western"},{"$f":"IF(COUNTRY_INFO!C36=0,\" \",COUNTRY_INFO!C36)","v":"Rusizi"},{"$f":"IF(COUNTRY_INFO!$T$9:$T$1000=\"MDA3 (IVM)\", COUNTRY_INFO!$T$9:$T$1000, \" \")","v":" "},null,null,null,0,null,null,0,null,null,0,0,0,0," "," "," "]
[{"$f":"IF(COUNTRY_INFO!A37=0,\" \",COUNTRY_INFO!A37)","v":"Rwanda"},{"$f":"IF(COUNTRY_INFO!B37=0,\" \",COUNTRY_INFO!B37)","v":"Western"},{"$f":"IF(COUNTRY_INFO!C37=0,\" \",COUNTRY_INFO!C37)","v":"Rutsiro"},{"$f":"IF(COUNTRY_INFO!$T$9:$T$1000=\"MDA3 (IVM)\", COUNTRY_INFO!$T$9:$T$1000, \" \")","v":" "},null,null,null,0,null,null,0,null,null,0,0,0,0," "," "," "]
[{"$f":"IF(COUNTRY_INFO!A38=0,\" \",COUNTRY_INFO!A38)","v":"Rwanda"},{"$f":"IF(COUNTRY_INFO!B38=0,\" \",COUNTRY_INFO!B38)","v":"Eastern"},{"$f":"IF(COUNTRY_INFO!C38=0,\" \",COUNTRY_INFO!C38)","v":"Rwamagana"},{"$f":"IF(COUNTRY_INFO!$T$9:$T$1000=\"MDA3 (IVM)\", COUNTRY_INFO!$T$9:$T$1000, \" \")","v":" "},null,null,null,0,null,null,0,null,null,0,0,0,0," "," "," "]

{"sheet":"MDA5","index":5,"n_rows":38,"n_cols":17,"rows_kept":38,"cut":false,"hidden":true,"merged":[[5,13,5,16],[3,0,3,2],[5,0,5,2],[5,3,6,3],[5,4,6,4],[5,5,5,8],[5,9,5,12]]}
["MDA 5 - Ivermectin (IVM) + Diethylcarbamazine citrate (DEC) + Albendazole (ALB)"]
["Administrative structure, population requiring PC by age group, population treated by age group and coverage"]
[]
["TOTAL",null,null,null,null,{"$f":"SUM(F$9:F$1000)","v":0},0,0,0,0,0,0,0,{"$f":"IF(F4<>0, IF(J4/F4*100=0, \"-\", J4/F4*100), \" \")","v":" "},{"$f":"IF(G4<>0, IF(K4/G4*100=0, \"-\", K4/G4*100), \" \")","v":" "},{"$f":"IF(H4<>0, IF(L4/H4*100=0, \"-\", L4/H4*100), \" \")","v":" "},{"$f":"IF(I4<>0, IF(M4/I4*100=0, \"-\", M4/I4*100), \" \")","v":" "}]
[]
[null,null,null,"PC implemented","Date","Population targeted for MDA 5",null,null,null,"Population treated",null,null,null,"Programme coverage (%)"]
["Country","Province/State","District",null,null,"PreSAC","SAC","Adults","Total","PreSAC","SAC","Adults","Total","PreSAC","SAC","Adults","Total"]
[]
[{"$f":"IF(COUNTRY_INFO!A9=0,\" \",COUNTRY_INFO!A9)","v":"Rwanda"},{"$f":"IF(COUNTRY_INFO!B9=0,\" \",COUNTRY_INFO!B9)","v":"Eastern"},{"$f":"IF(COUNTRY_INFO!C9=0,\" \",COUNTRY_INFO!C9)","v":"Bugesera"},{"$f":"IF(COUNTRY_INFO!$T$9:$T$1000=\"MDA5 (IDA)\", COUNTRY_INFO!$T$9:$T$1000, \" \")","v":" "},null,null,null,null,{"$f":"SUM(F9:H9)","v":0},null,null,null,{"$f":"SUM(J9:L9)","v":0},{"$f":"IF(F9<>0, IF(J9/F9*100=0, \"-\", J9/F9*100), \" \")","v":" "},{"$f":"IF(G9<>0, IF(K9/G9*100=0, \"-\", K9/G9*100), \" \")","v":" "},{"$f":"IF(H9<>0, IF(L9/H9*100=0, \"-\", L9/H9*100), \" \")","v":" "},{"$f":"IF(I9<>0, IF(M9/I9*100=0, \"-\", M9/I9*100), \" \")","v":" "}]
[{"$f":"IF(COUNTRY_INFO!A10=0,\" \",COUNTRY_INFO!A10)","v":"Rwanda"},{"$f":"IF(COUNTRY_INFO!B10=0,\" \",COUNTRY_INFO!B10)","v":"Northern"},{"$f":"IF(COUNTRY_INFO!C10=0,\" \",COUNTRY_INFO!C10)","v":"Burera"},{"$f":"IF(COUNTRY_INFO!$T$9:$T$1000=\"MDA5 (IDA)\", COUNTRY_INFO!$T$9:$T$1000, \" \")","v":" "},null,null,null,null,{"$f":"SUM(F10:H10)","v":0},null,null,null,{"$f":"SUM(J10:L10)","v":0},{"$f":"IF(F10<>0, IF(J10/F10*100=0, \"-\", J10/F10*100), \" \")","v":" "},{"$f":"IF(G10<>0, IF(K10/G10*100=0, \"-\", K10/G10*100), \" \")","v":" "},{"$f":"IF(H10<>0, IF(L10/H10*100=0, \"-\", L10/H10*100), \" \")","v":" "},{"$f":"IF(I10<>0, IF(M10/I10*100=0, \"-\", M10/I10*100), \" \")","v":" "}]
[{"$f":"IF(COUNTRY_INFO!A11=0,\" \",COUNTRY_INFO!A11)","v":"Rwanda"},{"$f":"IF(COUNTRY_INFO!B11=0,\" \",COUNTRY_INFO!B11)","v":"Northern"},{"$f":"IF(COUNTRY_INFO!C11=0,\" \",COUNTRY_INFO!C11)","v":"Gakenke"},{"$f":"IF(COUNTRY_INFO!$T$9:$T$1000=\"MDA5 (IDA)\", COUNTRY_INFO!$T$9:$T$1000, \" \")","v":" "},null,null,null,null,0,null,null,null,0," "," "," "," "]
[{"$f":"IF(COUNTRY_INFO!A12=0,\" \",COUNTRY_INFO!A12)","v":"Rwanda"},{"$f":"IF(COUNTRY_INFO!B12=0,\" \",COUNTRY_INFO!B12)","v":"Kigali"},{"$f":"IF(COUNTRY_INFO!C12=0,\" \",COUNTRY_INFO!C12)","v":"Gasabo"},{"$f":"IF(COUNTRY_INFO!$T$9:$T$1000=\"MDA5 (IDA)\", COUNTRY_INFO!$T$9:$T$1000, \" \")","v":" "},null,null,null,null,0,null,null,null,0," "," "," "," "]
[{"$f":"IF(COUNTRY_INFO!A13=0,\" \",COUNTRY_INFO!A13)","v":"Rwanda"},{"$f":"IF(COUNTRY_INFO!B13=0,\" \",COUNTRY_INFO!B13)","v":"Eastern"},{"$f":"IF(COUNTRY_INFO!C13=0,\" \",COUNTRY_INFO!C13)","v":"Gatsibo"},{"$f":"IF(COUNTRY_INFO!$T$9:$T$1000=\"MDA5 (IDA)\", COUNTRY_INFO!$T$9:$T$1000, \" \")","v":" "},null,null,null,null,0,null,null,null,0," "," "," "," "]
[{"$f":"IF(COUNTRY_INFO!A14=0,\" \",COUNTRY_INFO!A14)","v":"Rwanda"},{"$f":"IF(COUNTRY_INFO!B14=0,\" \",COUNTRY_INFO!B14)","v":"Northern"},{"$f":"IF(COUNTRY_INFO!C14=0,\" \",COUNTRY_INFO!C14)","v":"Gicumbi"},{"$f":"IF(COUNTRY_INFO!$T$9:$T$1000=\"MDA5 (IDA)\", COUNTRY_INFO!$T$9:$T$1000, \" \")","v":" "},null,null,null,null,0,null,null,null,0," "," "," "," "]
[{"$f":"IF(COUNTRY_INFO!A15=0,\" \",COUNTRY_INFO!A15)","v":"Rwanda"},{"$f":"IF(COUNTRY_INFO!B15=0,\" \",COUNTRY_INFO!B15)","v":"Southern"},{"$f":"IF(COUNTRY_INFO!C15=0,\" \",COUNTRY_INFO!C15)","v":"Gisagara"},{"$f":"IF(COUNTRY_INFO!$T$9:$T$1000=\"MDA5 (IDA)\", COUNTRY_INFO!$T$9:$T$1000, \" \")","v":" "},null,null,null,null,0,null,null,null,0," "," "," "," "]
[{"$f":"IF(COUNTRY_INFO!A16=0,\" \",COUNTRY_INFO!A16)","v":"Rwanda"},{"$f":"IF(COUNTRY_INFO!B16=0,\" \",COUNTRY_INFO!B16)","v":"Southern"},{"$f":"IF(COUNTRY_INFO!C16=0,\" \",COUNTRY_INFO!C16)","v":"Huye"},{"$f":"IF(COUNTRY_INFO!$T$9:$T$1000=\"MDA5 (IDA)\", COUNTRY_INFO!$T$9:$T$1000, \" \")","v":" "},null,null,null,null,0,null,null,null,0," "," "," "," "]
[{"$f":"IF(COUNTRY_INFO!A17=0,\" \",COUNTRY_INFO!A17)","v":"Rwanda"},{"$f":"IF(COUNTRY_INFO!B17=0,\" \",COUNTRY_INFO!B17)","v":"Southern"},{"$f":"IF(COUNTRY_INFO!C17=0,\" \",COUNTRY_INFO!C17)","v":"Kamonyi"},{"$f":"IF(COUNTRY_INFO!$T$9:$T$1000=\"MDA5 (IDA)\", COUNTRY_INFO!$T$9:$T$1000, \" \")","v":" "},null,null,null,null,0,null,null,null,0," "," "," "," "]
[{"$f":"IF(COUNTRY_INFO!A18=0,\" \",COUNTRY_INFO!A18)","v":"Rwanda"},{"$f":"IF(COUNTRY_INFO!B18=0,\" \",COUNTRY_INFO!B18)","v":"Western"},{"$f":"IF(COUNTRY_INFO!C18=0,\" \",COUNTRY_INFO!C18)","v":"Karongi"},{"$f":"IF(COUNTRY_INFO!$T$9:$T$1000=\"MDA5 (IDA)\", COUNTRY_INFO!$T$9:$T$1000, \" \")","v":" "},null,null,null,null,0,null,null,null,0," "," "," "," "]
[{"$f":"IF(COUNTRY_INFO!A19=0,\" \",COUNTRY_INFO!A19)","v":"Rwanda"},{"$f":"IF(COUNTRY_INFO!B19=0,\" \",COUNTRY_INFO!B19)","v":"Eastern"},{"$f":"IF(COUNTRY_INFO!C19=0,\" \",COUNTRY_INFO!C19)","v":"Kayonza"},{"$f":"IF(COUNTRY_INFO!$T$9:$T$1000=\"MDA5 (IDA)\", COUNTRY_INFO!$T$9:$T$1000, \" \")","v":" "},null,null,null,null,0,null,null,null,0," "," "," "," "]
[{"$f":"IF(COUNTRY_INFO!A20=0,\" \",COUNTRY_INFO!A20)","v":"Rwanda"},{"$f":"IF(COUNTRY_INFO!B20=0,\" \",COUNTRY_INFO!B20)","v":"Kigali"},{"$f":"IF(COUNTRY_INFO!C20=0,\" \",COUNTRY_INFO!C20)","v":"Kicukiro"},{"$f":"IF(COUNTRY_INFO!$T$9:$T$1000=\"MDA5 (IDA)\", COUNTRY_INFO!$T$9:$T$1000, \" \")","v":" "},null,null,null,null,0,null,null,null,0," "," "," "," "]
[{"$f":"IF(COUNTRY_INFO!A21=0,\" \",COUNTRY_INFO!A21)","v":"Rwanda"},{"$f":"IF(COUNTRY_INFO!B21=0,\" \",COUNTRY_INFO!B21)","v":"Eastern"},{"$f":"IF(COUNTRY_INFO!C21=0,\" \",COUNTRY_INFO!C21)","v":"Kirehe"},{"$f":"IF(COUNTRY_INFO!$T$9:$T$1000=\"MDA5 (IDA)\", COUNTRY_INFO!$T$9:$T$1000, \" \")","v":" "},null,null,null,null,0,null,null,null,0," "," "," "," "]
[{"$f":"IF(COUNTRY_INFO!A22=0,\" \",COUNTRY_INFO!A22)","v":"Rwanda"},{"$f":"IF(COUNTRY_INFO!B22=0,\" \",COUNTRY_INFO!B22)","v":"Southern"},{"$f":"IF(COUNTRY_INFO!C22=0,\" \",COUNTRY_INFO!C22)","v":"Muhanga"},{"$f":"IF(COUNTRY_INFO!$T$9:$T$1000=\"MDA5 (IDA)\", COUNTRY_INFO!$T$9:$T$1000, \" \")","v":" "},null,null,null,null,0,null,null,null,0," "," "," "," "]
[{"$f":"IF(COUNTRY_INFO!A23=0,\" \",COUNTRY_INFO!A23)","v":"Rwanda"},{"$f":"IF(COUNTRY_INFO!B23=0,\" \",COUNTRY_INFO!B23)","v":"Northern"},{"$f":"IF(COUNTRY_INFO!C23=0,\" \",COUNTRY_INFO!C23)","v":"Musanze"},{"$f":"IF(COUNTRY_INFO!$T$9:$T$1000=\"MDA5 (IDA)\", COUNTRY_INFO!$T$9:$T$1000, \" \")","v":" "},null,null,null,null,0,null,null,null,0," "," "," "," "]
[{"$f":"IF(COUNTRY_INFO!A24=0,\" \",COUNTRY_INFO!A24)","v":"Rwanda"},{"$f":"IF(COUNTRY_INFO!B24=0,\" \",COUNTRY_INFO!B24)","v":"Eastern"},{"$f":"IF(COUNTRY_INFO!C24=0,\" \",COUNTRY_INFO!C24)","v":"Ngoma"},{"$f":"IF(COUNTRY_INFO!$T$9:$T$1000=\"MDA5 (IDA)\", COUNTRY_INFO!$T$9:$T$1000, \" \")","v":" "},null,null,null,null,0,null,null,null,0," "," "," "," "]
[{"$f":"IF(COUNTRY_INFO!A25=0,\" \",COUNTRY_INFO!A25)","v":"Rwanda"},{"$f":"IF(COUNTRY_INFO!B25=0,\" \",COUNTRY_INFO!B25)","v":"Western"},{"$f":"IF(COUNTRY_INFO!C25=0,\" \",COUNTRY_INFO!C25)","v":"Ngororero"},{"$f":"IF(COUNTRY_INFO!$T$9:$T$1000=\"MDA5 (IDA)\", COUNTRY_INFO!$T$9:$T$1000, \" \")","v":" "},null,null,null,null,0,null,null,null,0," "," "," "," "]
[{"$f":"IF(COUNTRY_INFO!A26=0,\" \",COUNTRY_INFO!A26)","v":"Rwanda"},{"$f":"IF(COUNTRY_INFO!B26=0,\" \",COUNTRY_INFO!B26)","v":"Western"},{"$f":"IF(COUNTRY_INFO!C26=0,\" \",COUNTRY_INFO!C26)","v":"Nyabihu"},{"$f":"IF(COUNTRY_INFO!$T$9:$T$1000=\"MDA5 (IDA)\", COUNTRY_INFO!$T$9:$T$1000, \" \")","v":" "},null,null,null,null,0,null,null,null,0," "," "," "," "]
[{"$f":"IF(COUNTRY_INFO!A27=0,\" \",COUNTRY_INFO!A27)","v":"Rwanda"},{"$f":"IF(COUNTRY_INFO!B27=0,\" \",COUNTRY_INFO!B27)","v":"Eastern"},{"$f":"IF(COUNTRY_INFO!C27=0,\" \",COUNTRY_INFO!C27)","v":"Nyagatare"},{"$f":"IF(COUNTRY_INFO!$T$9:$T$1000=\"MDA5 (IDA)\", COUNTRY_INFO!$T$9:$T$1000, \" \")","v":" "},null,null,null,null,0,null,null,null,0," "," "," "," "]
[{"$f":"IF(COUNTRY_INFO!A28=0,\" \",COUNTRY_INFO!A28)","v":"Rwanda"},{"$f":"IF(COUNTRY_INFO!B28=0,\" \",COUNTRY_INFO!B28)","v":"Southern"},{"$f":"IF(COUNTRY_INFO!C28=0,\" \",COUNTRY_INFO!C28)","v":"Nyamagabe"},{"$f":"IF(COUNTRY_INFO!$T$9:$T$1000=\"MDA5 (IDA)\", COUNTRY_INFO!$T$9:$T$1000, \" \")","v":" "},null,null,null,null,0,null,null,null,0," "," "," "," "]
[{"$f":"IF(COUNTRY_INFO!A29=0,\" \",COUNTRY_INFO!A29)","v":"Rwanda"},{"$f":"IF(COUNTRY_INFO!B29=0,\" \",COUNTRY_INFO!B29)","v":"Western"},{"$f":"IF(COUNTRY_INFO!C29=0,\" \",COUNTRY_INFO!C29)","v":"Nyamasheke"},{"$f":"IF(COUNTRY_INFO!$T$9:$T$1000=\"MDA5 (IDA)\", COUNTRY_INFO!$T$9:$T$1000, \" \")","v":" "},null,null,null,null,0,null,null,null,0," "," "," "," "]
[{"$f":"IF(COUNTRY_INFO!A30=0,\" \",COUNTRY_INFO!A30)","v":"Rwanda"},{"$f":"IF(COUNTRY_INFO!B30=0,\" \",COUNTRY_INFO!B30)","v":"Southern"},{"$f":"IF(COUNTRY_INFO!C30=0,\" \",COUNTRY_INFO!C30)","v":"Nyanza"},{"$f":"IF(COUNTRY_INFO!$T$9:$T$1000=\"MDA5 (IDA)\", COUNTRY_INFO!$T$9:$T$1000, \" \")","v":" "},null,null,null,null,0,null,null,null,0," "," "," "," "]
[{"$f":"IF(COUNTRY_INFO!A31=0,\" \",COUNTRY_INFO!A31)","v":"Rwanda"},{"$f":"IF(COUNTRY_INFO!B31=0,\" \",COUNTRY_INFO!B31)","v":"Kigali"},{"$f":"IF(COUNTRY_INFO!C31=0,\" \",COUNTRY_INFO!C31)","v":"Nyarugenge"},{"$f":"IF(COUNTRY_INFO!$T$9:$T$1000=\"MDA5 (IDA)\", COUNTRY_INFO!$T$9:$T$1000, \" \")","v":" "},null,null,null,null,0,null,null,null,0," "," "," "," "]
[{"$f":"IF(COUNTRY_INFO!A32=0,\" \",COUNTRY_INFO!A32)","v":"Rwanda"},{"$f":"IF(COUNTRY_INFO!B32=0,\" \",COUNTRY_INFO!B32)","v":"Southern"},{"$f":"IF(COUNTRY_INFO!C32=0,\" \",COUNTRY_INFO!C32)","v":"Nyaruguru"},{"$f":"IF(COUNTRY_INFO!$T$9:$T$1000=\"MDA5 (IDA)\", COUNTRY_INFO!$T$9:$T$1000, \" \")","v":" "},null,null,null,null,0,null,null,null,0," "," "," "," "]
[{"$f":"IF(COUNTRY_INFO!A33=0,\" \",COUNTRY_INFO!A33)","v":"Rwanda"},{"$f":"IF(COUNTRY_INFO!B33=0,\" \",COUNTRY_INFO!B33)","v":"Western"},{"$f":"IF(COUNTRY_INFO!C33=0,\" \",COUNTRY_INFO!C33)","v":"Rubavu"},{"$f":"IF(COUNTRY_INFO!$T$9:$T$1000=\"MDA5 (IDA)\", COUNTRY_INFO!$T$9:$T$1000, \" \")","v":" "},null,null,null,null,0,null,null,null,0," "," "," "," "]
[{"$f":"IF(COUNTRY_INFO!A34=0,\" \",COUNTRY_INFO!A34)","v":"Rwanda"},{"$f":"IF(COUNTRY_INFO!B34=0,\" \",COUNTRY_INFO!B34)","v":"Southern"},{"$f":"IF(COUNTRY_INFO!C34=0,\" \",COUNTRY_INFO!C34)","v":"Ruhango"},{"$f":"IF(COUNTRY_INFO!$T$9:$T$1000=\"MDA5 (IDA)\", COUNTRY_INFO!$T$9:$T$1000, \" \")","v":" "},null,null,null,null,0,null,null,null,0," "," "," "," "]
[{"$f":"IF(COUNTRY_INFO!A35=0,\" \",COUNTRY_INFO!A35)","v":"Rwanda"},{"$f":"IF(COUNTRY_INFO!B35=0,\" \",COUNTRY_INFO!B35)","v":"Northern"},{"$f":"IF(COUNTRY_INFO!C35=0,\" \",COUNTRY_INFO!C35)","v":"Rulindo"},{"$f":"IF(COUNTRY_INFO!$T$9:$T$1000=\"MDA5 (IDA)\", COUNTRY_INFO!$T$9:$T$1000, \" \")","v":" "},null,null,null,null,0,null,null,null,0," "," "," "," "]
[{"$f":"IF(COUNTRY_INFO!A36=0,\" \",COUNTRY_INFO!A36)","v":"Rwanda"},{"$f":"IF(COUNTRY_INFO!B36=0,\" \",COUNTRY_INFO!B36)","v":"Western"},{"$f":"IF(COUNTRY_INFO!C36=0,\" \",COUNTRY_INFO!C36)","v":"Rusizi"},{"$f":"IF(COUNTRY_INFO!$T$9:$T$1000=\"MDA5 (IDA)\", COUNTRY_INFO!$T$9:$T$1000, \" \")","v":" "},null,null,null,null,0,null,null,null,0," "," "," "," "]
[{"$f":"IF(COUNTRY_INFO!A37=0,\" \",COUNTRY_INFO!A37)","v":"Rwanda"},{"$f":"IF(COUNTRY_INFO!B37=0,\" \",COUNTRY_INFO!B37)","v":"Western"},{"$f":"IF(COUNTRY_INFO!C37=0,\" \",COUNTRY_INFO!C37)","v":"Rutsiro"},{"$f":"IF(COUNTRY_INFO!$T$9:$T$1000=\"MDA5 (IDA)\", COUNTRY_INFO!$T$9:$T$1000, \" \")","v":" "},null,null,null,null,0,null,null,null,0," "," "," "," "]
[{"$f":"IF(COUNTRY_INFO!A38=0,\" \",COUNTRY_INFO!A38)","v":"Rwanda"},{"$f":"IF(COUNTRY_INFO!B38=0,\" \",COUNTRY_INFO!B38)","v":"Eastern"},{"$f":"IF(COUNTRY_INFO!C38=0,\" \",COUNTRY_INFO!C38)","v":"Rwamagana"},{"$f":"IF(COUNTRY_INFO!$T$9:$T$1000=\"MDA5 (IDA)\", COUNTRY_INFO!$T$9:$T$1000, \" \")","v":" "},null,null,null,null,0,null,null,null,0," "," "," "," "]

{"sheet":"T1","index":6,"n_rows":38,"n_cols":30,"rows_kept":38,"cut":false,"hidden":false,"merged":[[5,6,5,10],[5,11,5,14],[5,15,5,18],[3,0,3,2],[5,0,5,2],[5,3,6,3],[5,5,6,5],[5,4,6,4]]}
["T 1 - Praziquantel (PZQ) and Albendazole (ALB) or Mebendazole (MBD)"]
["Administrative structure, population requiring PC by age group, population treated by age group and coverage"]
[]
["TOTAL",null,null,null,null,null,{"$f":"SUM(G$9:G$1000)","v":0},0,0,0,{"$f":"SUM(K$9:K$1000)","v":0},0,0,0,0,{"$f":"IF(G4<>0, IF(L4/G4*100=0, \"-\", L4/G4*100), \" \")","v":" "},{"$f":"IF(OR(I4<>0,H4<>0), IF(M4/MAX(H4,I4)*100=0, \"-\", M4/MAX(H4,I4)*100), \" \")","v":" "},{"$f":"IF(J4<>0, IF(N4/J4*100=0, \"-\", N4/J4*100), \" \")","v":" "},{"$f":"IF(K4<>0, IF(O4/K4*100=0, \"-\", O4/K4*100), \" \")","v":" "}]
[]
[null,null,null,"PC implemented","Medicine","Date","Population targeted for T1",null,null,null,null,"Population treated",null,null,null,"Programme coverage (%)"]
["Country","Province/State","District",null,null,null,"PreSAC (ALB)","SAC (ALB)","SAC (PZQ)","Adults (PZQ)","Total","PreSAC","SAC","Adults","Total","PreSAC","SAC","Adults","Total"]
[]
[{"$f":"IF(COUNTRY_INFO!A9=0,\" \",COUNTRY_INFO!A9)","v":"Rwanda"},{"$f":"IF(COUNTRY_INFO!B9=0,\" \",COUNTRY_INFO!B9)","v":"Eastern"},{"$f":"IF(COUNTRY_INFO!C9=0,\" \",COUNTRY_INFO!C9)","v":"Bugesera"},{"$f":"IF(OR(COUNTRY_INFO!$T$9:$T$1000=\"T1 (PZQ+ALB/MBD)\",COUNTRY_INFO!$U$9:$U$1000=\"T1 (PZQ+ALB/MBD)\"), \"T1 (PZQ+ALB/MBD)\", \" \")","v":" "},null,null,null,null,null,null,{"$f":"MAX(H9:I9)+G9+J9","v":0},null,null,null,null,{"$f":"IF(G9<>0, IF(L9/G9*100=0, \"-\", L9/G9*100), \" \")","v":" "},{"$f":"IF(OR(I9<>0,H9<>0), IF(M9/MAX(H9,I9)*100=0, \"-\", M9/MAX(H9,I9)*100), \" \")","v":" "},{"$f":"IF(J9<>0, IF(N9/J9*100=0, \"-\", N9/J9*100), \" \")","v":" "},{"$f":"IF(K9<>0, IF(O9/K9*100=0, \"-\", O9/K9*100), \" \")","v":" "},null,null,null,null,null,null,null,65883,134412,70926,111182]
[{"$f":"IF(COUNTRY_INFO!A10=0,\" \",COUNTRY_INFO!A10)","v":"Rwanda"},{"$f":"IF(COUNTRY_INFO!B10=0,\" \",COUNTRY_INFO!B10)","v":"Northern"},{"$f":"IF(COUNTRY_INFO!C10=0,\" \",COUNTRY_INFO!C10)","v":"Burera"},{"$f":"IF(OR(COUNTRY_INFO!$T$9:$T$1000=\"T1 (PZQ+ALB/MBD)\",COUNTRY_INFO!$U$9:$U$1000=\"T1 (PZQ+ALB/MBD)\"), \"T1 (PZQ+ALB/MBD)\", \" \")","v":" "},null,null,null,null,null,null,{"$f":"MAX(H10:I10)+G10+J10","v":0},null,null,null,null,{"$f":"IF(G10<>0, IF(L10/G10*100=0, \"-\", L10/G10*100), \" \")","v":" "},{"$f":"IF(OR(I10<>0,H10<>0), IF(M10/MAX(H10,I10)*100=0, \"-\", M10/MAX(H10,I10)*100), \" \")","v":" "},{"$f":"IF(J10<>0, IF(N10/J10*100=0, \"-\", N10/J10*100), \" \")","v":" "},{"$f":"IF(K10<>0, IF(O10/K10*100=0, \"-\", O10/K10*100), \" \")","v":" "},null,null,null,null,null,null,null,45514,97765,76665,164975]
[{"$f":"IF(COUNTRY_INFO!A11=0,\" \",COUNTRY_INFO!A11)","v":"Rwanda"},{"$f":"IF(COUNTRY_INFO!B11=0,\" \",COUNTRY_INFO!B11)","v":"Northern"},{"$f":"IF(COUNTRY_INFO!C11=0,\" \",COUNTRY_INFO!C11)","v":"Gakenke"},{"$f":"IF(OR(COUNTRY_INFO!$T$9:$T$1000=\"T1 (PZQ+ALB/MBD)\",COUNTRY_INFO!$U$9:$U$1000=\"T1 (PZQ+ALB/MBD)\"), \"T1 (PZQ+ALB/MBD)\", \" \")","v":" "},null,null,null,null,null,null,0,null,null,null,null," "," "," "," ",null,null,null,null,null,null,null,40600,93808,44430,111731]
[{"$f":"IF(COUNTRY_INFO!A12=0,\" \",COUNTRY_INFO!A12)","v":"Rwanda"},{"$f":"IF(COUNTRY_INFO!B12=0,\" \",COUNTRY_INFO!B12)","v":"Kigali"},{"$f":"IF(COUNTRY_INFO!C12=0,\" \",COUNTRY_INFO!C12)","v":"Gasabo"},{"$f":"IF(OR(COUNTRY_INFO!$T$9:$T$1000=\"T1 (PZQ+ALB/MBD)\",COUNTRY_INFO!$U$9:$U$1000=\"T1 (PZQ+ALB/MBD)\"), \"T1 (PZQ+ALB/MBD)\", \" \")","v":" "},null,null,null,null,null,null,0,null,null,null,null," "," "," "," ",null,null,null,null,null,null,null,69045,144774,0,0]
[{"$f":"IF(COUNTRY_INFO!A13=0,\" \",COUNTRY_INFO!A13)","v":"Rwanda"},{"$f":"IF(COUNTRY_INFO!B13=0,\" \",COUNTRY_INFO!B13)","v":"Eastern"},{"$f":"IF(COUNTRY_INFO!C13=0,\" \",COUNTRY_INFO!C13)","v":"Gatsibo"},{"$f":"IF(OR(COUNTRY_INFO!$T$9:$T$1000=\"T1 (PZQ+ALB/MBD)\",COUNTRY_INFO!$U$9:$U$1000=\"T1 (PZQ+ALB/MBD)\"), \"T1 (PZQ+ALB/MBD)\", \" \")","v":" "},null,null,null,null,null,null,0,null,null,null,null," "," "," "," ",null,null,null,null,null,null,null,63710,147542,18426,39735]
[{"$f":"IF(COUNTRY_INFO!A14=0,\" \",COUNTRY_INFO!A14)","v":"Rwanda"},{"$f":"IF(COUNTRY_INFO!B14=0,\" \",COUNTRY_INFO!B14)","v":"Northern"},{"$f":"IF(COUNTRY_INFO!C14=0,\" \",COUNTRY_INFO!C14)","v":"Gicumbi"},{"$f":"IF(OR(COUNTRY_INFO!$T$9:$T$1000=\"T1 (PZQ+ALB/MBD)\",COUNTRY_INFO!$U$9:$U$1000=\"T1 (PZQ+ALB/MBD)\"), \"T1 (PZQ+ALB/MBD)\", \" \")","v":" "},null,null,null,null,null,null,0,null,null,null,null," "," "," "," ",null,null,null,null,null,null,null,54621,108434,16361,31331]
[{"$f":"IF(COUNTRY_INFO!A15=0,\" \",COUNTRY_INFO!A15)","v":"Rwanda"},{"$f":"IF(COUNTRY_INFO!B15=0,\" \",COUNTRY_INFO!B15)","v":"Southern"},{"$f":"IF(COUNTRY_INFO!C15=0,\" \",COUNTRY_INFO!C15)","v":"Gisagara"},{"$f":"IF(OR(COUNTRY_INFO!$T$9:$T$1000=\"T1 (PZQ+ALB/MBD)\",COUNTRY_INFO!$U$9:$U$1000=\"T1 (PZQ+ALB/MBD)\"), \"T1 (PZQ+ALB/MBD)\", \" \")","v":" "},null,null,null,null,null,null,0,null,null,null,null," "," "," "," ",null,null,null,null,null,null,null,45512,102470,66569,137739]
[{"$f":"IF(COUNTRY_INFO!A16=0,\" \",COUNTRY_INFO!A16)","v":"Rwanda"},{"$f":"IF(COUNTRY_INFO!B16=0,\" \",COUNTRY_INFO!B16)","v":"Southern"},{"$f":"IF(COUNTRY_INFO!C16=0,\" \",COUNTRY_INFO!C16)","v":"Huye"},{"$f":"IF(OR(COUNTRY_INFO!$T$9:$T$1000=\"T1 (PZQ+ALB/MBD)\",COUNTRY_INFO!$U$9:$U$1000=\"T1 (PZQ+ALB/MBD)\"), \"T1 (PZQ+ALB/MBD)\", \" \")","v":" "},null,null,null,null,null,null,0,null,null,null,null," "," "," "," ",null,null,null,null,null,null,null,42496,96755,0,0]
[{"$f":"IF(COUNTRY_INFO!A17=0,\" \",COUNTRY_INFO!A17)","v":"Rwanda"},{"$f":"IF(COUNTRY_INFO!B17=0,\" \",COUNTRY_INFO!B17)","v":"Southern"},{"$f":"IF(COUNTRY_INFO!C17=0,\" \",COUNTRY_INFO!C17)","v":"Kamonyi"},{"$f":"IF(OR(COUNTRY_INFO!$T$9:$T$1000=\"T1 (PZQ+ALB/MBD)\",COUNTRY_INFO!$U$9:$U$1000=\"T1 (PZQ+ALB/MBD)\"), \"T1 (PZQ+ALB/MBD)\", \" \")","v":" "},null,null,null,null,null,null,0,null,null,null,null," "," "," "," ",null,null,null,null,null,null,null,49326,107265,37951,73403]
[{"$f":"IF(COUNTRY_INFO!A18=0,\" \",COUNTRY_INFO!A18)","v":"Rwanda"},{"$f":"IF(COUNTRY_INFO!B18=0,\" \",COUNTRY_INFO!B18)","v":"Western"},{"$f":"IF(COUNTRY_INFO!C18=0,\" \",COUNTRY_INFO!C18)","v":"Karongi"},{"$f":"IF(OR(COUNTRY_INFO!$T$9:$T$1000=\"T1 (PZQ+ALB/MBD)\",COUNTRY_INFO!$U$9:$U$1000=\"T1 (PZQ+ALB/MBD)\"), \"T1 (PZQ+ALB/MBD)\", \" \")","v":" "},null,null,null,null,null,null,0,null,null,null,null," "," "," "," ",null,null,null,null,null,null,null,47439,98150,19571,48306]
[{"$f":"IF(COUNTRY_INFO!A19=0,\" \",COUNTRY_INFO!A19)","v":"Rwanda"},{"$f":"IF(COUNTRY_INFO!B19=0,\" \",COUNTRY_INFO!B19)","v":"Eastern"},{"$f":"IF(COUNTRY_INFO!C19=0,\" \",COUNTRY_INFO!C19)","v":"Kayonza"},{"$f":"IF(OR(COUNTRY_INFO!$T$9:$T$1000=\"T1 (PZQ+ALB/MBD)\",COUNTRY_INFO!$U$9:$U$1000=\"T1 (PZQ+ALB/MBD)\"), \"T1 (PZQ+ALB/MBD)\", \" \")","v":" "},null,null,null,null,null,null,0,null,null,null,null," "," "," "," ",null,null,null,null,null,null,null,49690,118397,46416,77250]
[{"$f":"IF(COUNTRY_INFO!A20=0,\" \",COUNTRY_INFO!A20)","v":"Rwanda"},{"$f":"IF(COUNTRY_INFO!B20=0,\" \",COUNTRY_INFO!B20)","v":"Kigali"},{"$f":"IF(COUNTRY_INFO!C20=0,\" \",COUNTRY_INFO!C20)","v":"Kicukiro"},{"$f":"IF(OR(COUNTRY_INFO!$T$9:$T$1000=\"T1 (PZQ+ALB/MBD)\",COUNTRY_INFO!$U$9:$U$1000=\"T1 (PZQ+ALB/MBD)\"), \"T1 (PZQ+ALB/MBD)\", \" \")","v":" "},null,null,null,null,null,null,0,null,null,null,null," "," "," "," ",null,null,null,null,null,null,null,38790,93776,0,0]
[{"$f":"IF(COUNTRY_INFO!A21=0,\" \",COUNTRY_INFO!A21)","v":"Rwanda"},{"$f":"IF(COUNTRY_INFO!B21=0,\" \",COUNTRY_INFO!B21)","v":"Eastern"},{"$f":"IF(COUNTRY_INFO!C21=0,\" \",COUNTRY_INFO!C21)","v":"Kirehe"},{"$f":"IF(OR(COUNTRY_INFO!$T$9:$T$1000=\"T1 (PZQ+ALB/MBD)\",COUNTRY_INFO!$U$9:$U$1000=\"T1 (PZQ+ALB/MBD)\"), \"T1 (PZQ+ALB/MBD)\", \" \")","v":" "},null,null,null,null,null,null,0,null,null,null,null," "," "," "," ",null,null,null,null,null,null,null,51958,118267,0,0]
[{"$f":"IF(COUNTRY_INFO!A22=0,\" \",COUNTRY_INFO!A22)","v":"Rwanda"},{"$f":"IF(COUNTRY_INFO!B22=0,\" \",COUNTRY_INFO!B22)","v":"Southern"},{"$f":"IF(COUNTRY_INFO!C22=0,\" \",COUNTRY_INFO!C22)","v":"Muhanga"},{"$f":"IF(OR(COUNTRY_INFO!$T$9:$T$1000=\"T1 (PZQ+ALB/MBD)\",COUNTRY_INFO!$U$9:$U$1000=\"T1 (PZQ+ALB/MBD)\"), \"T1 (PZQ+ALB/MBD)\", \" \")","v":" "},null,null,null,null,null,null,0,null,null,null,null," "," "," "," ",null,null,null,null,null,null,null,37168,95135,17684,26371]
[{"$f":"IF(COUNTRY_INFO!A23=0,\" \",COUNTRY_INFO!A23)","v":"Rwanda"},{"$f":"IF(COUNTRY_INFO!B23=0,\" \",COUNTRY_INFO!B23)","v":"Northern"},{"$f":"IF(COUNTRY_INFO!C23=0,\" \",COUNTRY_INFO!C23)","v":"Musanze"},{"$f":"IF(OR(COUNTRY_INFO!$T$9:$T$1000=\"T1 (PZQ+ALB/MBD)\",COUNTRY_INFO!$U$9:$U$1000=\"T1 (PZQ+ALB/MBD)\"), \"T1 (PZQ+ALB/MBD)\", \" \")","v":" "},null,null,null,null,null,null,0,null,null,null,null," "," "," "," ",null,null,null,null,null,null,null,38443,97548,11342,18872]
[{"$f":"IF(COUNTRY_INFO!A24=0,\" \",COUNTRY_INFO!A24)","v":"Rwanda"},{"$f":"IF(COUNTRY_INFO!B24=0,\" \",COUNTRY_INFO!B24)","v":"Eastern"},{"$f":"IF(COUNTRY_INFO!C24=0,\" \",COUNTRY_INFO!C24)","v":"Ngoma"},{"$f":"IF(OR(COUNTRY_INFO!$T$9:$T$1000=\"T1 (PZQ+ALB/MBD)\",COUNTRY_INFO!$U$9:$U$1000=\"T1 (PZQ+ALB/MBD)\"), \"T1 (PZQ+ALB/MBD)\", \" \")","v":" "},null,null,null,null,null,null,0,null,null,null,null," "," "," "," ",null,null,null,null,null,null,null,42420,105077,45376,86804]
[{"$f":"IF(COUNTRY_INFO!A25=0,\" \",COUNTRY_INFO!A25)","v":"Rwanda"},{"$f":"IF(COUNTRY_INFO!B25=0,\" \",COUNTRY_INFO!B25)","v":"Western"},{"$f":"IF(COUNTRY_INFO!C25=0,\" \",COUNTRY_INFO!C25)","v":"Ngororero"},{"$f":"IF(OR(COUNTRY_INFO!$T$9:$T$1000=\"T1 (PZQ+ALB/MBD)\",COUNTRY_INFO!$U$9:$U$1000=\"T1 (PZQ+ALB/MBD)\"), \"T1 (PZQ+ALB/MBD)\", \" \")","v":" "},null,null,null,null,null,null,0,null,null,null,null," "," "," "," ",null,null,null,null,null,null,null,46892,108488,6257,10916]
[{"$f":"IF(COUNTRY_INFO!A26=0,\" \",COUNTRY_INFO!A26)","v":"Rwanda"},{"$f":"IF(COUNTRY_INFO!B26=0,\" \",COUNTRY_INFO!B26)","v":"Western"},{"$f":"IF(COUNTRY_INFO!C26=0,\" \",COUNTRY_INFO!C26)","v":"Nyabihu"},{"$f":"IF(OR(COUNTRY_INFO!$T$9:$T$1000=\"T1 (PZQ+ALB/MBD)\",COUNTRY_INFO!$U$9:$U$1000=\"T1 (PZQ+ALB/MBD)\"), \"T1 (PZQ+ALB/MBD)\", \" \")","v":" "},null,null,null,null,null,null,0,null,null,null,null," "," "," "," ",null,null,null,null,null,null,null,33068,94061,0,0]
[{"$f":"IF(COUNTRY_INFO!A27=0,\" \",COUNTRY_INFO!A27)","v":"Rwanda"},{"$f":"IF(COUNTRY_INFO!B27=0,\" \",COUNTRY_INFO!B27)","v":"Eastern"},{"$f":"IF(COUNTRY_INFO!C27=0,\" \",COUNTRY_INFO!C27)","v":"Nyagatare"},{"$f":"IF(OR(COUNTRY_INFO!$T$9:$T$1000=\"T1 (PZQ+ALB/MBD)\",COUNTRY_INFO!$U$9:$U$1000=\"T1 (PZQ+ALB/MBD)\"), \"T1 (PZQ+ALB/MBD)\", \" \")","v":" "},null,null,null,null,null,null,0,null,null,null,null," "," "," "," ",null,null,null,null,null,null,null,81396,172796,149678,395016]
[{"$f":"IF(COUNTRY_INFO!A28=0,\" \",COUNTRY_INFO!A28)","v":"Rwanda"},{"$f":"IF(COUNTRY_INFO!B28=0,\" \",COUNTRY_INFO!B28)","v":"Southern"},{"$f":"IF(COUNTRY_INFO!C28=0,\" \",COUNTRY_INFO!C28)","v":"Nyamagabe"},{"$f":"IF(OR(COUNTRY_INFO!$T$9:$T$1000=\"T1 (PZQ+ALB/MBD)\",COUNTRY_INFO!$U$9:$U$1000=\"T1 (PZQ+ALB/MBD)\"), \"T1 (PZQ+ALB/MBD)\", \" \")","v":" "},null,null,null,null,null,null,0,null,null,null,null," "," "," "," ",null,null,null,null,null,null,null,45924,100214,0,0]
[{"$f":"IF(COUNTRY_INFO!A29=0,\" \",COUNTRY_INFO!A29)","v":"Rwanda"},{"$f":"IF(COUNTRY_INFO!B29=0,\" \",COUNTRY_INFO!B29)","v":"Western"},{"$f":"IF(COUNTRY_INFO!C29=0,\" \",COUNTRY_INFO!C29)","v":"Nyamasheke"},{"$f":"IF(OR(COUNTRY_INFO!$T$9:$T$1000=\"T1 (PZQ+ALB/MBD)\",COUNTRY_INFO!$U$9:$U$1000=\"T1 (PZQ+ALB/MBD)\"), \"T1 (PZQ+ALB/MBD)\", \" \")","v":" "},null,null,null,null,null,null,0,null,null,null,null," "," "," "," ",null,null,null,null,null,null,null,57041,123582,0,150519]
[{"$f":"IF(COUNTRY_INFO!A30=0,\" \",COUNTRY_INFO!A30)","v":"Rwanda"},{"$f":"IF(COUNTRY_INFO!B30=0,\" \",COUNTRY_INFO!B30)","v":"Southern"},{"$f":"IF(COUNTRY_INFO!C30=0,\" \",COUNTRY_INFO!C30)","v":"Nyanza"},{"$f":"IF(OR(COUNTRY_INFO!$T$9:$T$1000=\"T1 (PZQ+ALB/MBD)\",COUNTRY_INFO!$U$9:$U$1000=\"T1 (PZQ+ALB/MBD)\"), \"T1 (PZQ+ALB/MBD)\", \" \")","v":" "},null,null,null,null,null,null,0,null,null,null,null," "," "," "," ",null,null,null,null,null,null,null,34950,102404,41370,70144]
[{"$f":"IF(COUNTRY_INFO!A31=0,\" \",COUNTRY_INFO!A31)","v":"Rwanda"},{"$f":"IF(COUNTRY_INFO!B31=0,\" \",COUNTRY_INFO!B31)","v":"Kigali"},{"$f":"IF(COUNTRY_INFO!C31=0,\" \",COUNTRY_INFO!C31)","v":"Nyarugenge"},{"$f":"IF(OR(COUNTRY_INFO!$T$9:$T$1000=\"T1 (PZQ+ALB/MBD)\",COUNTRY_INFO!$U$9:$U$1000=\"T1 (PZQ+ALB/MBD)\"), \"T1 (PZQ+ALB/MBD)\", \" \")","v":" "},null,null,null,null,null,null,0,null,null,null,null," "," "," "," ",null,null,null,null,null,null,null,43696,80158,8805,12861]
[{"$f":"IF(COUNTRY_INFO!A32=0,\" \",COUNTRY_INFO!A32)","v":"Rwanda"},{"$f":"IF(COUNTRY_INFO!B32=0,\" \",COUNTRY_INFO!B32)","v":"Southern"},{"$f":"IF(COUNTRY_INFO!C32=0,\" \",COUNTRY_INFO!C32)","v":"Nyaruguru"},{"$f":"IF(OR(COUNTRY_INFO!$T$9:$T$1000=\"T1 (PZQ+ALB/MBD)\",COUNTRY_INFO!$U$9:$U$1000=\"T1 (PZQ+ALB/MBD)\"), \"T1 (PZQ+ALB/MBD)\", \" \")","v":" "},null,null,null,null,null,null,0,null,null,null,null," "," "," "," ",null,null,null,null,null,null,null,41169,109355,0,0]
[{"$f":"IF(COUNTRY_INFO!A33=0,\" \",COUNTRY_INFO!A33)","v":"Rwanda"},{"$f":"IF(COUNTRY_INFO!B33=0,\" \",COUNTRY_INFO!B33)","v":"Western"},{"$f":"IF(COUNTRY_INFO!C33=0,\" \",COUNTRY_INFO!C33)","v":"Rubavu"},{"$f":"IF(OR(COUNTRY_INFO!$T$9:$T$1000=\"T1 (PZQ+ALB/MBD)\",COUNTRY_INFO!$U$9:$U$1000=\"T1 (PZQ+ALB/MBD)\"), \"T1 (PZQ+ALB/MBD)\", \" \")","v":" "},null,null,null,null,null,null,0,null,null,null,null," "," "," "," ",null,null,null,null,null,null,null,70442,131555,28902,63189]
[{"$f":"IF(COUNTRY_INFO!A34=0,\" \",COUNTRY_INFO!A34)","v":"Rwanda"},{"$f":"IF(COUNTRY_INFO!B34=0,\" \",COUNTRY_INFO!B34)","v":"Southern"},{"$f":"IF(COUNTRY_INFO!C34=0,\" \",COUNTRY_INFO!C34)","v":"Ruhango"},{"$f":"IF(OR(COUNTRY_INFO!$T$9:$T$1000=\"T1 (PZQ+ALB/MBD)\",COUNTRY_INFO!$U$9:$U$1000=\"T1 (PZQ+ALB/MBD)\"), \"T1 (PZQ+ALB/MBD)\", \" \")","v":" "},null,null,null,null,null,null,0,null,null,null,null," "," "," "," ",null,null,null,null,null,null,null,40111,90762,9448,25825]
[{"$f":"IF(COUNTRY_INFO!A35=0,\" \",COUNTRY_INFO!A35)","v":"Rwanda"},{"$f":"IF(COUNTRY_INFO!B35=0,\" \",COUNTRY_INFO!B35)","v":"Northern"},{"$f":"IF(COUNTRY_INFO!C35=0,\" \",COUNTRY_INFO!C35)","v":"Rulindo"},{"$f":"IF(OR(COUNTRY_INFO!$T$9:$T$1000=\"T1 (PZQ+ALB/MBD)\",COUNTRY_INFO!$U$9:$U$1000=\"T1 (PZQ+ALB/MBD)\"), \"T1 (PZQ+ALB/MBD)\", \" \")","v":" "},null,null,null,null,null,null,0,null,null,null,null," "," "," "," ",null,null,null,null,null,null,null,41936,88007,8307,19705]
[{"$f":"IF(COUNTRY_INFO!A36=0,\" \",COUNTRY_INFO!A36)","v":"Rwanda"},{"$f":"IF(COUNTRY_INFO!B36=0,\" \",COUNTRY_INFO!B36)","v":"Western"},{"$f":"IF(COUNTRY_INFO!C36=0,\" \",COUNTRY_INFO!C36)","v":"Rusizi"},{"$f":"IF(OR(COUNTRY_INFO!$T$9:$T$1000=\"T1 (PZQ+ALB/MBD)\",COUNTRY_INFO!$U$9:$U$1000=\"T1 (PZQ+ALB/MBD)\"), \"T1 (PZQ+ALB/MBD)\", \" \")","v":" "},null,null,null,null,null,null,0,null,null,null,null," "," "," "," ",null,null,null,null,null,null,null,62387,146026,124779,234926]
[{"$f":"IF(COUNTRY_INFO!A37=0,\" \",COUNTRY_INFO!A37)","v":"Rwanda"},{"$f":"IF(COUNTRY_INFO!B37=0,\" \",COUNTRY_INFO!B37)","v":"Western"},{"$f":"IF(COUNTRY_INFO!C37=0,\" \",COUNTRY_INFO!C37)","v":"Rutsiro"},{"$f":"IF(OR(COUNTRY_INFO!$T$9:$T$1000=\"T1 (PZQ+ALB/MBD)\",COUNTRY_INFO!$U$9:$U$1000=\"T1 (PZQ+ALB/MBD)\"), \"T1 (PZQ+ALB/MBD)\", \" \")","v":" "},null,null,null,null,null,null,0,null,null,null,null," "," "," "," ",null,null,null,null,null,null,null,44946,105237,42379,81393]
[{"$f":"IF(COUNTRY_INFO!A38=0,\" \",COUNTRY_INFO!A38)","v":"Rwanda"},{"$f":"IF(COUNTRY_INFO!B38=0,\" \",COUNTRY_INFO!B38)","v":"Eastern"},{"$f":"IF(COUNTRY_INFO!C38=0,\" \",COUNTRY_INFO!C38)","v":"Rwamagana"},{"$f":"IF(OR(COUNTRY_INFO!$T$9:$T$1000=\"T1 (PZQ+ALB/MBD)\",COUNTRY_INFO!$U$9:$U$1000=\"T1 (PZQ+ALB/MBD)\"), \"T1 (PZQ+ALB/MBD)\", \" \")","v":" "},null,null,null,null,null,null,0,null,null,null,null," "," "," "," ",null,null,null,null,null,null,null,49093,118433,63455,87797]

{"sheet":"T2","index":7,"n_rows":38,"n_cols":17,"rows_kept":38,"cut":false,"hidden":false,"merged":[[5,5,5,8],[5,9,5,12],[5,13,5,16],[3,0,3,2],[5,0,5,2],[5,3,6,3],[5,4,6,4]]}
["T 2 - Praziquantel (PZQ) "]
["Administrative structure, population requiring PC by age group, population treated by age group and coverage"]
[]
["TOTAL",null,null,null,null,{"$f":"SUM(F$9:F$1000)","v":0},1043943,1967924,3011867,0,1027010,1829289,2856299,{"$f":"IF(F4<>0, IF(J4/F4*100=0, \"-\", J4/F4*100), \" \")","v":" "},{"$f":"IF(G4<>0, IF(K4/G4*100=0, \"-\", K4/G4*100), \" \")","v":98.377976575349422},{"$f":"IF(H4<>0, IF(L4/H4*100=0, \"-\", L4/H4*100), \" \")","v":92.955266565172238},{"$f":"IF(I4<>0, IF(M4/I4*100=0, \"-\", M4/I4*100), \" \")","v":94.834831684134784}]
[]
[null,null,null,"PC implemented","Date","Population targeted for T2",null,null,null,"Population treated",null,null,null,"Programme coverage (%)"]
["Country","Province/State","District",null,null,"PreSAC","SAC","Adults","Total","PreSAC","SAC","Adults","Total","PreSAC","SAC","Adults","Total"]
[]
[{"$f":"IF(COUNTRY_INFO!A9=0,\" \",COUNTRY_INFO!A9)","v":"Rwanda"},{"$f":"IF(COUNTRY_INFO!B9=0,\" \",COUNTRY_INFO!B9)","v":"Eastern"},{"$f":"IF(COUNTRY_INFO!C9=0,\" \",COUNTRY_INFO!C9)","v":"Bugesera"},{"$f":"IF(OR(COUNTRY_INFO!$T$9:$T$1000=\"T2 (PZQ)\",COUNTRY_INFO!$U$9:$U$1000=\"T2 (PZQ)\"), \"T2 (PZQ)\", \" \")","v":"T2 (PZQ)"},"15-28/11/2021",null,70926,111182,{"$f":"SUM(F9:H9)","v":182108},null,55601,107028,{"$f":"SUM(J9:L9)","v":162629},{"$f":"IF(F9<>0, IF(J9/F9*100=0, \"-\", J9/F9*100), \" \")","v":" "},{"$f":"IF(G9<>0, IF(K9/G9*100=0, \"-\", K9/G9*100), \" \")","v":78.392972957730592},{"$f":"IF(H9<>0, IF(L9/H9*100=0, \"-\", L9/H9*100), \" \")","v":96.263783705995579},{"$f":"IF(I9<>0, IF(M9/I9*100=0, \"-\", M9/I9*100), \" \")","v":89.303600061501967}]
[{"$f":"IF(COUNTRY_INFO!A10=0,\" \",COUNTRY_INFO!A10)","v":"Rwanda"},{"$f":"IF(COUNTRY_INFO!B10=0,\" \",COUNTRY_INFO!B10)","v":"Northern"},{"$f":"IF(COUNTRY_INFO!C10=0,\" \",COUNTRY_INFO!C10)","v":"Burera"},{"$f":"IF(OR(COUNTRY_INFO!$T$9:$T$1000=\"T2 (PZQ)\",COUNTRY_INFO!$U$9:$U$1000=\"T2 (PZQ)\"), \"T2 (PZQ)\", \" \")","v":"T2 (PZQ)"},"15-28/11/2021",null,76665,164975,{"$f":"SUM(F10:H10)","v":241640},null,72584,134103,{"$f":"SUM(J10:L10)","v":206687},{"$f":"IF(F10<>0, IF(J10/F10*100=0, \"-\", J10/F10*100), \" \")","v":" "},{"$f":"IF(G10<>0, IF(K10/G10*100=0, \"-\", K10/G10*100), \" \")","v":94.676840800886978},{"$f":"IF(H10<>0, IF(L10/H10*100=0, \"-\", L10/H10*100), \" \")","v":81.286861645703894},{"$f":"IF(I10<>0, IF(M10/I10*100=0, \"-\", M10/I10*100), \" \")","v":85.535093527561671}]
[{"$f":"IF(COUNTRY_INFO!A11=0,\" \",COUNTRY_INFO!A11)","v":"Rwanda"},{"$f":"IF(COUNTRY_INFO!B11=0,\" \",COUNTRY_INFO!B11)","v":"Northern"},{"$f":"IF(COUNTRY_INFO!C11=0,\" \",COUNTRY_INFO!C11)","v":"Gakenke"},{"$f":"IF(OR(COUNTRY_INFO!$T$9:$T$1000=\"T2 (PZQ)\",COUNTRY_INFO!$U$9:$U$1000=\"T2 (PZQ)\"), \"T2 (PZQ)\", \" \")","v":"T2 (PZQ)"},"15-28/11/2021",null,44430,111731,156161,null,36283,71254,107537," ",81.663290569435063,63.772811484726709,68.86290431029515]
[{"$f":"IF(COUNTRY_INFO!A12=0,\" \",COUNTRY_INFO!A12)","v":"Rwanda"},{"$f":"IF(COUNTRY_INFO!B12=0,\" \",COUNTRY_INFO!B12)","v":"Kigali"},{"$f":"IF(COUNTRY_INFO!C12=0,\" \",COUNTRY_INFO!C12)","v":"Gasabo"},{"$f":"IF(OR(COUNTRY_INFO!$T$9:$T$1000=\"T2 (PZQ)\",COUNTRY_INFO!$U$9:$U$1000=\"T2 (PZQ)\"), \"T2 (PZQ)\", \" \")","v":" "},null,null,0,0,0,null,0,0,0," "," "," "," "]
[{"$f":"IF(COUNTRY_INFO!A13=0,\" \",COUNTRY_INFO!A13)","v":"Rwanda"},{"$f":"IF(COUNTRY_INFO!B13=0,\" \",COUNTRY_INFO!B13)","v":"Eastern"},{"$f":"IF(COUNTRY_INFO!C13=0,\" \",COUNTRY_INFO!C13)","v":"Gatsibo"},{"$f":"IF(OR(COUNTRY_INFO!$T$9:$T$1000=\"T2 (PZQ)\",COUNTRY_INFO!$U$9:$U$1000=\"T2 (PZQ)\"), \"T2 (PZQ)\", \" \")","v":"T2 (PZQ)"},"15-28/11/2021",null,18426,39735,58161,null,21485,35824,57309," ",116.60154130033649,90.157292059896818,98.535100840769587]
[{"$f":"IF(COUNTRY_INFO!A14=0,\" \",COUNTRY_INFO!A14)","v":"Rwanda"},{"$f":"IF(COUNTRY_INFO!B14=0,\" \",COUNTRY_INFO!B14)","v":"Northern"},{"$f":"IF(COUNTRY_INFO!C14=0,\" \",COUNTRY_INFO!C14)","v":"Gicumbi"},{"$f":"IF(OR(COUNTRY_INFO!$T$9:$T$1000=\"T2 (PZQ)\",COUNTRY_INFO!$U$9:$U$1000=\"T2 (PZQ)\"), \"T2 (PZQ)\", \" \")","v":"T2 (PZQ)"},"15-28/11/2021",null,22967,46231,69198,null,21296,43735,65031," ",92.724343623459745,94.601025286063461,93.978149657504545]
[{"$f":"IF(COUNTRY_INFO!A15=0,\" \",COUNTRY_INFO!A15)","v":"Rwanda"},{"$f":"IF(COUNTRY_INFO!B15=0,\" \",COUNTRY_INFO!B15)","v":"Southern"},{"$f":"IF(COUNTRY_INFO!C15=0,\" \",COUNTRY_INFO!C15)","v":"Gisagara"},{"$f":"IF(OR(COUNTRY_INFO!$T$9:$T$1000=\"T2 (PZQ)\",COUNTRY_INFO!$U$9:$U$1000=\"T2 (PZQ)\"), \"T2 (PZQ)\", \" \")","v":"T2 (PZQ)"},"15-28/11/2021",null,66569,137739,204308,null,78212,134367,212579," ",117.49012303023929,97.55189162110949,104.04829962605477]
[{"$f":"IF(COUNTRY_INFO!A16=0,\" \",COUNTRY_INFO!A16)","v":"Rwanda"},{"$f":"IF(COUNTRY_INFO!B16=0,\" \",COUNTRY_INFO!B16)","v":"Southern"},{"$f":"IF(COUNTRY_INFO!C16=0,\" \",COUNTRY_INFO!C16)","v":"Huye"},{"$f":"IF(OR(COUNTRY_INFO!$T$9:$T$1000=\"T2 (PZQ)\",COUNTRY_INFO!$U$9:$U$1000=\"T2 (PZQ)\"), \"T2 (PZQ)\", \" \")","v":" "},null,null,0,0,0,null,0,0,0," "," "," "," "]
[{"$f":"IF(COUNTRY_INFO!A17=0,\" \",COUNTRY_INFO!A17)","v":"Rwanda"},{"$f":"IF(COUNTRY_INFO!B17=0,\" \",COUNTRY_INFO!B17)","v":"Southern"},{"$f":"IF(COUNTRY_INFO!C17=0,\" \",COUNTRY_INFO!C17)","v":"Kamonyi"},{"$f":"IF(OR(COUNTRY_INFO!$T$9:$T$1000=\"T2 (PZQ)\",COUNTRY_INFO!$U$9:$U$1000=\"T2 (PZQ)\"), \"T2 (PZQ)\", \" \")","v":"T2 (PZQ)"},"15-28/11/2021",null,37951,73403,111354,null,41174,67474,108648," ",108.49252984111091,91.922673460212806,97.56991217199203]
[{"$f":"IF(COUNTRY_INFO!A18=0,\" \",COUNTRY_INFO!A18)","v":"Rwanda"},{"$f":"IF(COUNTRY_INFO!B18=0,\" \",COUNTRY_INFO!B18)","v":"Western"},{"$f":"IF(COUNTRY_INFO!C18=0,\" \",COUNTRY_INFO!C18)","v":"Karongi"},{"$f":"IF(OR(COUNTRY_INFO!$T$9:$T$1000=\"T2 (PZQ)\",COUNTRY_INFO!$U$9:$U$1000=\"T2 (PZQ)\"), \"T2 (PZQ)\", \" \")","v":"T2 (PZQ)"},"15-28/11/2021",null,19571,48306,67877,null,23019,54749,77768," ",117.61790404169435,113.33788763300625,114.5719463146574]
[{"$f":"IF(COUNTRY_INFO!A19=0,\" \",COUNTRY_INFO!A19)","v":"Rwanda"},{"$f":"IF(COUNTRY_INFO!B19=0,\" \",COUNTRY_INFO!B19)","v":"Eastern"},{"$f":"IF(COUNTRY_INFO!C19=0,\" \",COUNTRY_INFO!C19)","v":"Kayonza"},{"$f":"IF(OR(COUNTRY_INFO!$T$9:$T$1000=\"T2 (PZQ)\",COUNTRY_INFO!$U$9:$U$1000=\"T2 (PZQ)\"), \"T2 (PZQ)\", \" \")","v":"T2 (PZQ)"},"15-28/11/2021",null,46416,77250,123666,null,46722,66449,113171," ",100.65925542916236,86.01812297734628,91.513431339252506]
[{"$f":"IF(COUNTRY_INFO!A20=0,\" \",COUNTRY_INFO!A20)","v":"Rwanda"},{"$f":"IF(COUNTRY_INFO!B20=0,\" \",COUNTRY_INFO!B20)","v":"Kigali"},{"$f":"IF(COUNTRY_INFO!C20=0,\" \",COUNTRY_INFO!C20)","v":"Kicukiro"},{"$f":"IF(OR(COUNTRY_INFO!$T$9:$T$1000=\"T2 (PZQ)\",COUNTRY_INFO!$U$9:$U$1000=\"T2 (PZQ)\"), \"T2 (PZQ)\", \" \")","v":" "},null,null,0,0,0,null,0,0,0," "," "," "," "]
[{"$f":"IF(COUNTRY_INFO!A21=0,\" \",COUNTRY_INFO!A21)","v":"Rwanda"},{"$f":"IF(COUNTRY_INFO!B21=0,\" \",COUNTRY_INFO!B21)","v":"Eastern"},{"$f":"IF(COUNTRY_INFO!C21=0,\" \",COUNTRY_INFO!C21)","v":"Kirehe"},{"$f":"IF(OR(COUNTRY_INFO!$T$9:$T$1000=\"T2 (PZQ)\",COUNTRY_INFO!$U$9:$U$1000=\"T2 (PZQ)\"), \"T2 (PZQ)\", \" \")","v":" "},null,null,0,0,0,null,0,0,0," "," "," "," "]
[{"$f":"IF(COUNTRY_INFO!A22=0,\" \",COUNTRY_INFO!A22)","v":"Rwanda"},{"$f":"IF(COUNTRY_INFO!B22=0,\" \",COUNTRY_INFO!B22)","v":"Southern"},{"$f":"IF(COUNTRY_INFO!C22=0,\" \",COUNTRY_INFO!C22)","v":"Muhanga"},{"$f":"IF(OR(COUNTRY_INFO!$T$9:$T$1000=\"T2 (PZQ)\",COUNTRY_INFO!$U$9:$U$1000=\"T2 (PZQ)\"), \"T2 (PZQ)\", \" \")","v":"T2 (PZQ)"},"15-28/11/2021",null,17684,26371,44055,null,15908,25657,41565," ",89.957023297896399,97.292480376170801,94.347974123255014]
[{"$f":"IF(COUNTRY_INFO!A23=0,\" \",COUNTRY_INFO!A23)","v":"Rwanda"},{"$f":"IF(COUNTRY_INFO!B23=0,\" \",COUNTRY_INFO!B23)","v":"Northern"},{"$f":"IF(COUNTRY_INFO!C23=0,\" \",COUNTRY_INFO!C23)","v":"Musanze"},{"$f":"IF(OR(COUNTRY_INFO!$T$9:$T$1000=\"T2 (PZQ)\",COUNTRY_INFO!$U$9:$U$1000=\"T2 (PZQ)\"), \"T2 (PZQ)\", \" \")","v":"T2 (PZQ)"},"15-28/11/2021",null,11342,18872,30214,null,2967,12220,15187," ",26.159407511902661,64.752013565069944,50.264777917521677]
[{"$f":"IF(COUNTRY_INFO!A24=0,\" \",COUNTRY_INFO!A24)","v":"Rwanda"},{"$f":"IF(COUNTRY_INFO!B24=0,\" \",COUNTRY_INFO!B24)","v":"Eastern"},{"$f":"IF(COUNTRY_INFO!C24=0,\" \",COUNTRY_INFO!C24)","v":"Ngoma"},{"$f":"IF(OR(COUNTRY_INFO!$T$9:$T$1000=\"T2 (PZQ)\",COUNTRY_INFO!$U$9:$U$1000=\"T2 (PZQ)\"), \"T2 (PZQ)\", \" \")","v":"T2 (PZQ)"},"15-28/11/2021",null,45376,86804,132180,null,37616,80532,118148," ",82.898448519040898,92.774526519515234,89.38417309729158]
[{"$f":"IF(COUNTRY_INFO!A25=0,\" \",COUNTRY_INFO!A25)","v":"Rwanda"},{"$f":"IF(COUNTRY_INFO!B25=0,\" \",COUNTRY_INFO!B25)","v":"Western"},{"$f":"IF(COUNTRY_INFO!C25=0,\" \",COUNTRY_INFO!C25)","v":"Ngororero"},{"$f":"IF(OR(COUNTRY_INFO!$T$9:$T$1000=\"T2 (PZQ)\",COUNTRY_INFO!$U$9:$U$1000=\"T2 (PZQ)\"), \"T2 (PZQ)\", \" \")","v":"T2 (PZQ)"},"15-28/11/2021",null,6257,10916,17173,null,7737,10131,17868," ",123.65350807096051,92.808721143275932,104.04705060269026]
[{"$f":"IF(COUNTRY_INFO!A26=0,\" \",COUNTRY_INFO!A26)","v":"Rwanda"},{"$f":"IF(COUNTRY_INFO!B26=0,\" \",COUNTRY_INFO!B26)","v":"Western"},{"$f":"IF(COUNTRY_INFO!C26=0,\" \",COUNTRY_INFO!C26)","v":"Nyabihu"},{"$f":"IF(OR(COUNTRY_INFO!$T$9:$T$1000=\"T2 (PZQ)\",COUNTRY_INFO!$U$9:$U$1000=\"T2 (PZQ)\"), \"T2 (PZQ)\", \" \")","v":" "},null,null,0,0,0,null,0,0,0," "," "," "," "]
[{"$f":"IF(COUNTRY_INFO!A27=0,\" \",COUNTRY_INFO!A27)","v":"Rwanda"},{"$f":"IF(COUNTRY_INFO!B27=0,\" \",COUNTRY_INFO!B27)","v":"Eastern"},{"$f":"IF(COUNTRY_INFO!C27=0,\" \",COUNTRY_INFO!C27)","v":"Nyagatare"},{"$f":"IF(OR(COUNTRY_INFO!$T$9:$T$1000=\"T2 (PZQ)\",COUNTRY_INFO!$U$9:$U$1000=\"T2 (PZQ)\"), \"T2 (PZQ)\", \" \")","v":"T2 (PZQ)"},"15-28/11/2021",null,149678,268050,417728,null,164499,248815,413314," ",109.90192279426503,92.824099981346762,98.943331545886309]
[{"$f":"IF(COUNTRY_INFO!A28=0,\" \",COUNTRY_INFO!A28)","v":"Rwanda"},{"$f":"IF(COUNTRY_INFO!B28=0,\" \",COUNTRY_INFO!B28)","v":"Southern"},{"$f":"IF(COUNTRY_INFO!C28=0,\" \",COUNTRY_INFO!C28)","v":"Nyamagabe"},{"$f":"IF(OR(COUNTRY_INFO!$T$9:$T$1000=\"T2 (PZQ)\",COUNTRY_INFO!$U$9:$U$1000=\"T2 (PZQ)\"), \"T2 (PZQ)\", \" \")","v":" "},null,null,0,0,0,null,0,0,0," "," "," "," "]
[{"$f":"IF(COUNTRY_INFO!A29=0,\" \",COUNTRY_INFO!A29)","v":"Rwanda"},{"$f":"IF(COUNTRY_INFO!B29=0,\" \",COUNTRY_INFO!B29)","v":"Western"},{"$f":"IF(COUNTRY_INFO!C29=0,\" \",COUNTRY_INFO!C29)","v":"Nyamasheke"},{"$f":"IF(OR(COUNTRY_INFO!$T$9:$T$1000=\"T2 (PZQ)\",COUNTRY_INFO!$U$9:$U$1000=\"T2 (PZQ)\"), \"T2 (PZQ)\", \" \")","v":"T2 (PZQ)"},null,null,73388,150519,223907,null,73388,139450,212838," ",100,92.64611112218391,95.056429678393258]
[{"$f":"IF(COUNTRY_INFO!A30=0,\" \",COUNTRY_INFO!A30)","v":"Rwanda"},{"$f":"IF(COUNTRY_INFO!B30=0,\" \",COUNTRY_INFO!B30)","v":"Southern"},{"$f":"IF(COUNTRY_INFO!C30=0,\" \",COUNTRY_INFO!C30)","v":"Nyanza"},{"$f":"IF(OR(COUNTRY_INFO!$T$9:$T$1000=\"T2 (PZQ)\",COUNTRY_INFO!$U$9:$U$1000=\"T2 (PZQ)\"), \"T2 (PZQ)\", \" \")","v":"T2 (PZQ)"},"15-28/11/2021",null,41370,70144,111514,null,42350,70797,113147," ",102.36886632825718,100.93094206204381,101.46439012141973]
[{"$f":"IF(COUNTRY_INFO!A31=0,\" \",COUNTRY_INFO!A31)","v":"Rwanda"},{"$f":"IF(COUNTRY_INFO!B31=0,\" \",COUNTRY_INFO!B31)","v":"Kigali"},{"$f":"IF(COUNTRY_INFO!C31=0,\" \",COUNTRY_INFO!C31)","v":"Nyarugenge"},{"$f":"IF(OR(COUNTRY_INFO!$T$9:$T$1000=\"T2 (PZQ)\",COUNTRY_INFO!$U$9:$U$1000=\"T2 (PZQ)\"), \"T2 (PZQ)\", \" \")","v":"T2 (PZQ)"},"15-28/11/2021",null,17657,12861,30518,null,12786,14791,27577," ",72.413207226595688,115.00660912837259,90.363064420997446]
[{"$f":"IF(COUNTRY_INFO!A32=0,\" \",COUNTRY_INFO!A32)","v":"Rwanda"},{"$f":"IF(COUNTRY_INFO!B32=0,\" \",COUNTRY_INFO!B32)","v":"Southern"},{"$f":"IF(COUNTRY_INFO!C32=0,\" \",COUNTRY_INFO!C32)","v":"Nyaruguru"},{"$f":"IF(OR(COUNTRY_INFO!$T$9:$T$1000=\"T2 (PZQ)\",COUNTRY_INFO!$U$9:$U$1000=\"T2 (PZQ)\"), \"T2 (PZQ)\", \" \")","v":" "},null,null,0,0,0,null,0,0,0," "," "," "," "]
[{"$f":"IF(COUNTRY_INFO!A33=0,\" \",COUNTRY_INFO!A33)","v":"Rwanda"},{"$f":"IF(COUNTRY_INFO!B33=0,\" \",COUNTRY_INFO!B33)","v":"Western"},{"$f":"IF(COUNTRY_INFO!C33=0,\" \",COUNTRY_INFO!C33)","v":"Rubavu"},{"$f":"IF(OR(COUNTRY_INFO!$T$9:$T$1000=\"T2 (PZQ)\",COUNTRY_INFO!$U$9:$U$1000=\"T2 (PZQ)\"), \"T2 (PZQ)\", \" \")","v":"T2 (PZQ)"},"15-28/11/2021",null,28902,63189,92091,null,34895,64107,99002," ",120.73558923257906,101.45278450363196,107.50453355919689]
[{"$f":"IF(COUNTRY_INFO!A34=0,\" \",COUNTRY_INFO!A34)","v":"Rwanda"},{"$f":"IF(COUNTRY_INFO!B34=0,\" \",COUNTRY_INFO!B34)","v":"Southern"},{"$f":"IF(COUNTRY_INFO!C34=0,\" \",COUNTRY_INFO!C34)","v":"Ruhango"},{"$f":"IF(OR(COUNTRY_INFO!$T$9:$T$1000=\"T2 (PZQ)\",COUNTRY_INFO!$U$9:$U$1000=\"T2 (PZQ)\"), \"T2 (PZQ)\", \" \")","v":"T2 (PZQ)"},"15-28/11/2021",null,9448,25825,35273,null,16456,24154,40610," ",174.17442845046571,93.529525653436593,115.13055311428005]
[{"$f":"IF(COUNTRY_INFO!A35=0,\" \",COUNTRY_INFO!A35)","v":"Rwanda"},{"$f":"IF(COUNTRY_INFO!B35=0,\" \",COUNTRY_INFO!B35)","v":"Northern"},{"$f":"IF(COUNTRY_INFO!C35=0,\" \",COUNTRY_INFO!C35)","v":"Rulindo"},{"$f":"IF(OR(COUNTRY_INFO!$T$9:$T$1000=\"T2 (PZQ)\",COUNTRY_INFO!$U$9:$U$1000=\"T2 (PZQ)\"), \"T2 (PZQ)\", \" \")","v":"T2 (PZQ)"},"15-28/11/2021",null,8307,19705,28012,null,5037,17962,22999," ",60.635608522932472,91.154529307282417,82.104098243609883]
[{"$f":"IF(COUNTRY_INFO!A36=0,\" \",COUNTRY_INFO!A36)","v":"Rwanda"},{"$f":"IF(COUNTRY_INFO!B36=0,\" \",COUNTRY_INFO!B36)","v":"Western"},{"$f":"IF(COUNTRY_INFO!C36=0,\" \",COUNTRY_INFO!C36)","v":"Rusizi"},{"$f":"IF(OR(COUNTRY_INFO!$T$9:$T$1000=\"T2 (PZQ)\",COUNTRY_INFO!$U$9:$U$1000=\"T2 (PZQ)\"), \"T2 (PZQ)\", \" \")","v":"T2 (PZQ)"},"15-28/11/2021",null,124779,234926,359705,null,107852,241630,349482," ",86.4344160475721,102.8536645582013,97.157948874772387]
[{"$f":"IF(COUNTRY_INFO!A37=0,\" \",COUNTRY_INFO!A37)","v":"Rwanda"},{"$f":"IF(COUNTRY_INFO!B37=0,\" \",COUNTRY_INFO!B37)","v":"Western"},{"$f":"IF(COUNTRY_INFO!C37=0,\" \",COUNTRY_INFO!C37)","v":"Rutsiro"},{"$f":"IF(OR(COUNTRY_INFO!$T$9:$T$1000=\"T2 (PZQ)\",COUNTRY_INFO!$U$9:$U$1000=\"T2 (PZQ)\"), \"T2 (PZQ)\", \" \")","v":"T2 (PZQ)"},"15-28/11/2021",null,42379,81393,123772,null,36579,72053,108632," ",86.31397626182779,88.524811715995227,87.767831173447945]
[{"$f":"IF(COUNTRY_INFO!A38=0,\" \",COUNTRY_INFO!A38)","v":"Rwanda"},{"$f":"IF(COUNTRY_INFO!B38=0,\" \",COUNTRY_INFO!B38)","v":"Eastern"},{"$f":"IF(COUNTRY_INFO!C38=0,\" \",COUNTRY_INFO!C38)","v":"Rwamagana"},{"$f":"IF(OR(COUNTRY_INFO!$T$9:$T$1000=\"T2 (PZQ)\",COUNTRY_INFO!$U$9:$U$1000=\"T2 (PZQ)\"), \"T2 (PZQ)\", \" \")","v":"T2 (PZQ)"},"15-28/11/2021",null,63455,87797,151252,null,72564,92007,164571," ",114.35505476321804,104.79515245395628,108.80583397244334]

{"sheet":"T3_R1","index":8,"n_rows":38,"n_cols":18,"rows_kept":38,"cut":false,"hidden":false,"merged":[[5,6,5,9],[5,10,5,13],[5,14,5,17],[3,0,3,2],[5,0,5,2],[5,3,6,3],[5,5,6,5],[5,4,6,4]]}
["T 3 - Albendazole (ALB) or Mebendazole (MBD) - Round 1"]
["Administrative structure, population requiring PC by age group, population treated by age group and coverage"]
[]
["TOTAL",null,null,null,null,null,{"$f":"SUM(G$9:G$1000)","v":1358771.3214913441},3180166.312900472,6232821.2013390316,10771758.835730849,1359742,3006657,5033961,9400360,{"$f":"IF(G4<>0, IF(K4/G4*100=0, \"-\", K4/G4*100), \" \")","v":100.07143795967011},{"$f":"IF(H4<>0, IF(L4/H4*100=0, \"-\", L4/H4*100), \" \")","v":94.544017644717997},{"$f":"IF(I4<>0, IF(M4/I4*100=0, \"-\", M4/I4*100), \" \")","v":80.765368320184223},{"$f":"IF(J4<>0, IF(N4/J4*100=0, \"-\", N4/J4*100), \" \")","v":87.268570930294118}]
[]
[null,null,null,"PC implemented","Medicine","Date","Population targeted for T3",null,null,null,"Population treated",null,null,null,"Programme coverage (%)"]
["Country","Province/State","District",null,null,null,"PreSAC","SAC","Adults","Total","PreSAC","SAC","Adults","Total","PreSAC","SAC","Adults","Total"]
[]
[{"$f":"IF(COUNTRY_INFO!A9=0,\" \",COUNTRY_INFO!A9)","v":"Rwanda"},{"$f":"IF(COUNTRY_INFO!B9=0,\" \",COUNTRY_INFO!B9)","v":"Eastern"},{"$f":"IF(COUNTRY_INFO!C9=0,\" \",COUNTRY_INFO!C9)","v":"Bugesera"},{"$f":"IF(OR(COUNTRY_INFO!$T$9:$T$1000=\"T3 (ALB/MBD)\",COUNTRY_INFO!$U$9:$U$1000=\"T3 (ALB/MBD)\"), \"T3 (ALB/MBD)\", \" \")","v":"T3 (ALB/MBD)"},"ALB","15-30 June 2021",64565,106503,201379,{"$f":"SUM(G9:I9)","v":372447},43401,84309,94056,{"$f":"SUM(K9:M9)","v":221766},{"$f":"IF(G9<>0, IF(K9/G9*100=0, \"-\", K9/G9*100), \" \")","v":67.220630372492835},{"$f":"IF(H9<>0, IF(L9/H9*100=0, \"-\", L9/H9*100), \" \")","v":79.161150390129848},{"$f":"IF(I9<>0, IF(M9/I9*100=0, \"-\", M9/I9*100), \" \")","v":46.705962389325599},{"$f":"IF(J9<>0, IF(N9/J9*100=0, \"-\", N9/J9*100), \" \")","v":59.542968529750539}]
[{"$f":"IF(COUNTRY_INFO!A10=0,\" \",COUNTRY_INFO!A10)","v":"Rwanda"},{"$f":"IF(COUNTRY_INFO!B10=0,\" \",COUNTRY_INFO!B10)","v":"Northern"},{"$f":"IF(COUNTRY_INFO!C10=0,\" \",COUNTRY_INFO!C10)","v":"Burera"},{"$f":"IF(OR(COUNTRY_INFO!$T$9:$T$1000=\"T3 (ALB/MBD)\",COUNTRY_INFO!$U$9:$U$1000=\"T3 (ALB/MBD)\"), \"T3 (ALB/MBD)\", \" \")","v":"T3 (ALB/MBD)"},"ALB","15-30 June 2021",51403,125248,242143,{"$f":"SUM(G10:I10)","v":418794},49984,116984,165087,{"$f":"SUM(K10:M10)","v":332055},{"$f":"IF(G10<>0, IF(K10/G10*100=0, \"-\", K10/G10*100), \" \")","v":97.2394607318639},{"$f":"IF(H10<>0, IF(L10/H10*100=0, \"-\", L10/H10*100), \" \")","v":93.401890648952474},{"$f":"IF(I10<>0, IF(M10/I10*100=0, \"-\", M10/I10*100), \" \")","v":68.177481901190617},{"$f":"IF(J10<>0, IF(N10/J10*100=0, \"-\", N10/J10*100), \" \")","v":79.288385220418633}]
[{"$f":"IF(COUNTRY_INFO!A11=0,\" \",COUNTRY_INFO!A11)","v":"Rwanda"},{"$f":"IF(COUNTRY_INFO!B11=0,\" \",COUNTRY_INFO!B11)","v":"Northern"},{"$f":"IF(COUNTRY_INFO!C11=0,\" \",COUNTRY_INFO!C11)","v":"Gakenke"},{"$f":"IF(OR(COUNTRY_INFO!$T$9:$T$1000=\"T3 (ALB/MBD)\",COUNTRY_INFO!$U$9:$U$1000=\"T3 (ALB/MBD)\"), \"T3 (ALB/MBD)\", \" \")","v":"T3 (ALB/MBD)"},"ALB","15-30 June 2021",43926,122417,215957,382300,43676,100548,219219,363443,99.430860993489048,82.135651094210772,101.51048588376391,95.067486267329329]
[{"$f":"IF(COUNTRY_INFO!A12=0,\" \",COUNTRY_INFO!A12)","v":"Rwanda"},{"$f":"IF(COUNTRY_INFO!B12=0,\" \",COUNTRY_INFO!B12)","v":"Kigali"},{"$f":"IF(COUNTRY_INFO!C12=0,\" \",COUNTRY_INFO!C12)","v":"Gasabo"},{"$f":"IF(OR(COUNTRY_INFO!$T$9:$T$1000=\"T3 (ALB/MBD)\",COUNTRY_INFO!$U$9:$U$1000=\"T3 (ALB/MBD)\"), \"T3 (ALB/MBD)\", \" \")","v":"T3 (ALB/MBD)"},"ALB","15-30 June 2021",58918,120766,120350,300034,61529,115350,101016,277895,104.43158287789809,95.515294039713154,83.935189031990035,92.621169600778572]
[{"$f":"IF(COUNTRY_INFO!A13=0,\" \",COUNTRY_INFO!A13)","v":"Rwanda"},{"$f":"IF(COUNTRY_INFO!B13=0,\" \",COUNTRY_INFO!B13)","v":"Eastern"},{"$f":"IF(COUNTRY_INFO!C13=0,\" \",COUNTRY_INFO!C13)","v":"Gatsibo"},{"$f":"IF(OR(COUNTRY_INFO!$T$9:$T$1000=\"T3 (ALB/MBD)\",COUNTRY_INFO!$U$9:$U$1000=\"T3 (ALB/MBD)\"), \"T3 (ALB/MBD)\", \" \")","v":"T3 (ALB/MBD)"},"ALB","15-30 June 2021",68639,139919,277211,485769,74530,153663,170494,398687,108.58258424510848,109.82282606365111,61.503331397383221,82.073372323058905]
[{"$f":"IF(COUNTRY_INFO!A14=0,\" \",COUNTRY_INFO!A14)","v":"Rwanda"},{"$f":"IF(COUNTRY_INFO!B14=0,\" \",COUNTRY_INFO!B14)","v":"Northern"},{"$f":"IF(COUNTRY_INFO!C14=0,\" \",COUNTRY_INFO!C14)","v":"Gicumbi"},{"$f":"IF(OR(COUNTRY_INFO!$T$9:$T$1000=\"T3 (ALB/MBD)\",COUNTRY_INFO!$U$9:$U$1000=\"T3 (ALB/MBD)\"), \"T3 (ALB/MBD)\", \" \")","v":"T3 (ALB/MBD)"},"ALB","15-30 June 2021",60637,128420,300594,489651,59988,130079,280073,470140,98.929696389992898,101.29185485126928,93.173183762816294,96.015325201010512]
[{"$f":"IF(COUNTRY_INFO!A15=0,\" \",COUNTRY_INFO!A15)","v":"Rwanda"},{"$f":"IF(COUNTRY_INFO!B15=0,\" \",COUNTRY_INFO!B15)","v":"Southern"},{"$f":"IF(COUNTRY_INFO!C15=0,\" \",COUNTRY_INFO!C15)","v":"Gisagara"},{"$f":"IF(OR(COUNTRY_INFO!$T$9:$T$1000=\"T3 (ALB/MBD)\",COUNTRY_INFO!$U$9:$U$1000=\"T3 (ALB/MBD)\"), \"T3 (ALB/MBD)\", \" \")","v":"T3 (ALB/MBD)"},"ALB","15-30 June 2021",40508,98516,188723,327747,42441,106381,189877,338699,104.7718969092525,107.98347476552033,100.61147819820584,103.34160190634849]
[{"$f":"IF(COUNTRY_INFO!A16=0,\" \",COUNTRY_INFO!A16)","v":"Rwanda"},{"$f":"IF(COUNTRY_INFO!B16=0,\" \",COUNTRY_INFO!B16)","v":"Southern"},{"$f":"IF(COUNTRY_INFO!C16=0,\" \",COUNTRY_INFO!C16)","v":"Huye"},{"$f":"IF(OR(COUNTRY_INFO!$T$9:$T$1000=\"T3 (ALB/MBD)\",COUNTRY_INFO!$U$9:$U$1000=\"T3 (ALB/MBD)\"), \"T3 (ALB/MBD)\", \" \")","v":"T3 (ALB/MBD)"},"ALB","15-30 June 2021",43621,109334,228011,380966,42654,94695,204462,341811,97.783177827193327,86.610752373461139,89.671989509278063,89.722179932067419]
[{"$f":"IF(COUNTRY_INFO!A17=0,\" \",COUNTRY_INFO!A17)","v":"Rwanda"},{"$f":"IF(COUNTRY_INFO!B17=0,\" \",COUNTRY_INFO!B17)","v":"Southern"},{"$f":"IF(COUNTRY_INFO!C17=0,\" \",COUNTRY_INFO!C17)","v":"Kamonyi"},{"$f":"IF(OR(COUNTRY_INFO!$T$9:$T$1000=\"T3 (ALB/MBD)\",COUNTRY_INFO!$U$9:$U$1000=\"T3 (ALB/MBD)\"), \"T3 (ALB/MBD)\", \" \")","v":"T3 (ALB/MBD)"},"ALB","15-30 June 2021",36894,107046,212844,356784,30749,105353,162367,298469,83.344175204640322,98.418436933654689,76.284508842156697,83.655376922731961]
[{"$f":"IF(COUNTRY_INFO!A18=0,\" \",COUNTRY_INFO!A18)","v":"Rwanda"},{"$f":"IF(COUNTRY_INFO!B18=0,\" \",COUNTRY_INFO!B18)","v":"Western"},{"$f":"IF(COUNTRY_INFO!C18=0,\" \",COUNTRY_INFO!C18)","v":"Karongi"},{"$f":"IF(OR(COUNTRY_INFO!$T$9:$T$1000=\"T3 (ALB/MBD)\",COUNTRY_INFO!$U$9:$U$1000=\"T3 (ALB/MBD)\"), \"T3 (ALB/MBD)\", \" \")","v":"T3 (ALB/MBD)"},"ALB","15-30 June 2021",40651,90751,237590.56695146405,368992.56695146405,50981,110295,233034,394310,125.41142899313671,121.53585084461879,98.082176826323717,106.86123117809746]
[{"$f":"IF(COUNTRY_INFO!A19=0,\" \",COUNTRY_INFO!A19)","v":"Rwanda"},{"$f":"IF(COUNTRY_INFO!B19=0,\" \",COUNTRY_INFO!B19)","v":"Eastern"},{"$f":"IF(COUNTRY_INFO!C19=0,\" \",COUNTRY_INFO!C19)","v":"Kayonza"},{"$f":"IF(OR(COUNTRY_INFO!$T$9:$T$1000=\"T3 (ALB/MBD)\",COUNTRY_INFO!$U$9:$U$1000=\"T3 (ALB/MBD)\"), \"T3 (ALB/MBD)\", \" \")","v":"T3 (ALB/MBD)"},"ALB","15-30 June 2021",32749,81526,166598,280873,36913,73013,96877,206803,112.71489205777276,89.5579324387312,58.150157865040399,73.628650671299852]
[{"$f":"IF(COUNTRY_INFO!A20=0,\" \",COUNTRY_INFO!A20)","v":"Rwanda"},{"$f":"IF(COUNTRY_INFO!B20=0,\" \",COUNTRY_INFO!B20)","v":"Kigali"},{"$f":"IF(COUNTRY_INFO!C20=0,\" \",COUNTRY_INFO!C20)","v":"Kicukiro"},{"$f":"IF(OR(COUNTRY_INFO!$T$9:$T$1000=\"T3 (ALB/MBD)\",COUNTRY_INFO!$U$9:$U$1000=\"T3 (ALB/MBD)\"), \"T3 (ALB/MBD)\", \" \")","v":"T3 (ALB/MBD)"},"ALB","15-30 June 2021",35626,79257,149794,264677,21956,49350,66511,137817,61.629147252006966,62.265793557666825,44.401644925697958,52.069881402615259]
[{"$f":"IF(COUNTRY_INFO!A21=0,\" \",COUNTRY_INFO!A21)","v":"Rwanda"},{"$f":"IF(COUNTRY_INFO!B21=0,\" \",COUNTRY_INFO!B21)","v":"Eastern"},{"$f":"IF(COUNTRY_INFO!C21=0,\" \",COUNTRY_INFO!C21)","v":"Kirehe"},{"$f":"IF(OR(COUNTRY_INFO!$T$9:$T$1000=\"T3 (ALB/MBD)\",COUNTRY_INFO!$U$9:$U$1000=\"T3 (ALB/MBD)\"), \"T3 (ALB/MBD)\", \" \")","v":"T3 (ALB/MBD)"},"ALB","15-30 June 2021",52141,129346,282151,463638,58095,107278,206536,371909,111.41903684240808,82.938784345863041,73.200520288781533,80.21538355354825]
[{"$f":"IF(COUNTRY_INFO!A22=0,\" \",COUNTRY_INFO!A22)","v":"Rwanda"},{"$f":"IF(COUNTRY_INFO!B22=0,\" \",COUNTRY_INFO!B22)","v":"Southern"},{"$f":"IF(COUNTRY_INFO!C22=0,\" \",COUNTRY_INFO!C22)","v":"Muhanga"},{"$f":"IF(OR(COUNTRY_INFO!$T$9:$T$1000=\"T3 (ALB/MBD)\",COUNTRY_INFO!$U$9:$U$1000=\"T3 (ALB/MBD)\"), \"T3 (ALB/MBD)\", \" \")","v":"T3 (ALB/MBD)"},"ALB","15-30 June 2021",41250,105175,263894,410319,37679,98055,207840,343574,91.343030303030304,93.230330401711441,78.758895617179618,83.733387925004692]
[{"$f":"IF(COUNTRY_INFO!A23=0,\" \",COUNTRY_INFO!A23)","v":"Rwanda"},{"$f":"IF(COUNTRY_INFO!B23=0,\" \",COUNTRY_INFO!B23)","v":"Northern"},{"$f":"IF(COUNTRY_INFO!C23=0,\" \",COUNTRY_INFO!C23)","v":"Musanze"},{"$f":"IF(OR(COUNTRY_INFO!$T$9:$T$1000=\"T3 (ALB/MBD)\",COUNTRY_INFO!$U$9:$U$1000=\"T3 (ALB/MBD)\"), \"T3 (ALB/MBD)\", \" \")","v":"T3 (ALB/MBD)"},"ALB","15-30 June 2021",39022,90102,185761,314885,33575,89405,133437,256417,86.041207523960836,99.226432265654481,71.832623640053612,81.43195134731728]
[{"$f":"IF(COUNTRY_INFO!A24=0,\" \",COUNTRY_INFO!A24)","v":"Rwanda"},{"$f":"IF(COUNTRY_INFO!B24=0,\" \",COUNTRY_INFO!B24)","v":"Eastern"},{"$f":"IF(COUNTRY_INFO!C24=0,\" \",COUNTRY_INFO!C24)","v":"Ngoma"},{"$f":"IF(OR(COUNTRY_INFO!$T$9:$T$1000=\"T3 (ALB/MBD)\",COUNTRY_INFO!$U$9:$U$1000=\"T3 (ALB/MBD)\"), \"T3 (ALB/MBD)\", \" \")","v":"T3 (ALB/MBD)"},"ALB","15-30 June 2021",39020,95951,196292,331263,41037,90141,178297,309475,105.16914402870323,93.944826004940012,90.832535202657255,93.422748692126802]
[{"$f":"IF(COUNTRY_INFO!A25=0,\" \",COUNTRY_INFO!A25)","v":"Rwanda"},{"$f":"IF(COUNTRY_INFO!B25=0,\" \",COUNTRY_INFO!B25)","v":"Western"},{"$f":"IF(COUNTRY_INFO!C25=0,\" \",COUNTRY_INFO!C25)","v":"Ngororero"},{"$f":"IF(OR(COUNTRY_INFO!$T$9:$T$1000=\"T3 (ALB/MBD)\",COUNTRY_INFO!$U$9:$U$1000=\"T3 (ALB/MBD)\"), \"T3 (ALB/MBD)\", \" \")","v":"T3 (ALB/MBD)"},"ALB","15-30 June 2021",48396,119517,230112,398025,49197,113173,194254,356624,101.65509546243491,94.691968506572294,84.417153386177162,89.598392060800208]
[{"$f":"IF(COUNTRY_INFO!A26=0,\" \",COUNTRY_INFO!A26)","v":"Rwanda"},{"$f":"IF(COUNTRY_INFO!B26=0,\" \",COUNTRY_INFO!B26)","v":"Western"},{"$f":"IF(COUNTRY_INFO!C26=0,\" \",COUNTRY_INFO!C26)","v":"Nyabihu"},{"$f":"IF(OR(COUNTRY_INFO!$T$9:$T$1000=\"T3 (ALB/MBD)\",COUNTRY_INFO!$U$9:$U$1000=\"T3 (ALB/MBD)\"), \"T3 (ALB/MBD)\", \" \")","v":"T3 (ALB/MBD)"},"ALB","15-30 June 2021",35068,83100,179048,297216,41283,69578,146089,256950,117.72271016311167,83.728038507821907,81.59208703811268,86.452277131782949]
[{"$f":"IF(COUNTRY_INFO!A27=0,\" \",COUNTRY_INFO!A27)","v":"Rwanda"},{"$f":"IF(COUNTRY_INFO!B27=0,\" \",COUNTRY_INFO!B27)","v":"Eastern"},{"$f":"IF(COUNTRY_INFO!C27=0,\" \",COUNTRY_INFO!C27)","v":"Nyagatare"},{"$f":"IF(OR(COUNTRY_INFO!$T$9:$T$1000=\"T3 (ALB/MBD)\",COUNTRY_INFO!$U$9:$U$1000=\"T3 (ALB/MBD)\"), \"T3 (ALB/MBD)\", \" \")","v":"T3 (ALB/MBD)"},"ALB","15-30 June 2021",72319,163001,300622,535942,75677,186514,225899,488090,104.64331641753897,114.42506487690261,75.143868379559706,91.07142190759447]
[{"$f":"IF(COUNTRY_INFO!A28=0,\" \",COUNTRY_INFO!A28)","v":"Rwanda"},{"$f":"IF(COUNTRY_INFO!B28=0,\" \",COUNTRY_INFO!B28)","v":"Southern"},{"$f":"IF(COUNTRY_INFO!C28=0,\" \",COUNTRY_INFO!C28)","v":"Nyamagabe"},{"$f":"IF(OR(COUNTRY_INFO!$T$9:$T$1000=\"T3 (ALB/MBD)\",COUNTRY_INFO!$U$9:$U$1000=\"T3 (ALB/MBD)\"), \"T3 (ALB/MBD)\", \" \")","v":"T3 (ALB/MBD)"},"ALB","15-30 June 2021",24871,105302,240592,370765,37808,94243,197875,329926,152.01640464798359,89.497825302463397,82.245045554299395,88.985206262727061]
[{"$f":"IF(COUNTRY_INFO!A29=0,\" \",COUNTRY_INFO!A29)","v":"Rwanda"},{"$f":"IF(COUNTRY_INFO!B29=0,\" \",COUNTRY_INFO!B29)","v":"Western"},{"$f":"IF(COUNTRY_INFO!C29=0,\" \",COUNTRY_INFO!C29)","v":"Nyamasheke"},{"$f":"IF(OR(COUNTRY_INFO!$T$9:$T$1000=\"T3 (ALB/MBD)\",COUNTRY_INFO!$U$9:$U$1000=\"T3 (ALB/MBD)\"), \"T3 (ALB/MBD)\", \" \")","v":"T3 (ALB/MBD)"},"ALB","15-30 June 2021",47693,111123,211387,370203,49812,122463,177904,350179,104.44300002096745,110.20490807483598,84.160331524644377,94.591075707112054]
[{"$f":"IF(COUNTRY_INFO!A30=0,\" \",COUNTRY_INFO!A30)","v":"Rwanda"},{"$f":"IF(COUNTRY_INFO!B30=0,\" \",COUNTRY_INFO!B30)","v":"Southern"},{"$f":"IF(COUNTRY_INFO!C30=0,\" \",COUNTRY_INFO!C30)","v":"Nyanza"},{"$f":"IF(OR(COUNTRY_INFO!$T$9:$T$1000=\"T3 (ALB/MBD)\",COUNTRY_INFO!$U$9:$U$1000=\"T3 (ALB/MBD)\"), \"T3 (ALB/MBD)\", \" \")","v":"T3 (ALB/MBD)"},"ALB","15-30 June 2021",37336,99012,191905,328253,34002,93026,152493,279521,91.070280694236132,93.954268169514805,79.462755008988822,85.154134158712949]
[{"$f":"IF(COUNTRY_INFO!A31=0,\" \",COUNTRY_INFO!A31)","v":"Rwanda"},{"$f":"IF(COUNTRY_INFO!B31=0,\" \",COUNTRY_INFO!B31)","v":"Kigali"},{"$f":"IF(COUNTRY_INFO!C31=0,\" \",COUNTRY_INFO!C31)","v":"Nyarugenge"},{"$f":"IF(OR(COUNTRY_INFO!$T$9:$T$1000=\"T3 (ALB/MBD)\",COUNTRY_INFO!$U$9:$U$1000=\"T3 (ALB/MBD)\"), \"T3 (ALB/MBD)\", \" \")","v":"T3 (ALB/MBD)"},"ALB","15-30 June 2021",25010,58290,72180,155480,17438,41901,37034,96373,69.724110355857661,71.883685023160055,51.307841507342758,61.984178029328532]
[{"$f":"IF(COUNTRY_INFO!A32=0,\" \",COUNTRY_INFO!A32)","v":"Rwanda"},{"$f":"IF(COUNTRY_INFO!B32=0,\" \",COUNTRY_INFO!B32)","v":"Southern"},{"$f":"IF(COUNTRY_INFO!C32=0,\" \",COUNTRY_INFO!C32)","v":"Nyaruguru"},{"$f":"IF(OR(COUNTRY_INFO!$T$9:$T$1000=\"T3 (ALB/MBD)\",COUNTRY_INFO!$U$9:$U$1000=\"T3 (ALB/MBD)\"), \"T3 (ALB/MBD)\", \" \")","v":"T3 (ALB/MBD)"},"ALB","15-30 June 2021",32744,89014,148589,270347,38371,74834,139109,252314,117.18482775470316,84.06992158536859,93.619985328658245,93.329683702796771]
[{"$f":"IF(COUNTRY_INFO!A33=0,\" \",COUNTRY_INFO!A33)","v":"Rwanda"},{"$f":"IF(COUNTRY_INFO!B33=0,\" \",COUNTRY_INFO!B33)","v":"Western"},{"$f":"IF(COUNTRY_INFO!C33=0,\" \",COUNTRY_INFO!C33)","v":"Rubavu"},{"$f":"IF(OR(COUNTRY_INFO!$T$9:$T$1000=\"T3 (ALB/MBD)\",COUNTRY_INFO!$U$9:$U$1000=\"T3 (ALB/MBD)\"), \"T3 (ALB/MBD)\", \" \")","v":"T3 (ALB/MBD)"},"ALB","15-30 June 2021",65095.866929664,137311.59430476002,289371.47096077196,491778.93219519599,69207,126626,211771,407604,106.31550552169169,92.217995604185049,73.183095519705986,82.883583113360089]
[{"$f":"IF(COUNTRY_INFO!A34=0,\" \",COUNTRY_INFO!A34)","v":"Rwanda"},{"$f":"IF(COUNTRY_INFO!B34=0,\" \",COUNTRY_INFO!B34)","v":"Southern"},{"$f":"IF(COUNTRY_INFO!C34=0,\" \",COUNTRY_INFO!C34)","v":"Ruhango"},{"$f":"IF(OR(COUNTRY_INFO!$T$9:$T$1000=\"T3 (ALB/MBD)\",COUNTRY_INFO!$U$9:$U$1000=\"T3 (ALB/MBD)\"), \"T3 (ALB/MBD)\", \" \")","v":"T3 (ALB/MBD)"},"ALB","15-30 June 2021",36699,80127,178344,295170,29890,70325,129089,229304,81.446360936265293,87.766920014477009,72.382025747992643,77.68540163295728]
[{"$f":"IF(COUNTRY_INFO!A35=0,\" \",COUNTRY_INFO!A35)","v":"Rwanda"},{"$f":"IF(COUNTRY_INFO!B35=0,\" \",COUNTRY_INFO!B35)","v":"Northern"},{"$f":"IF(COUNTRY_INFO!C35=0,\" \",COUNTRY_INFO!C35)","v":"Rulindo"},{"$f":"IF(OR(COUNTRY_INFO!$T$9:$T$1000=\"T3 (ALB/MBD)\",COUNTRY_INFO!$U$9:$U$1000=\"T3 (ALB/MBD)\"), \"T3 (ALB/MBD)\", \" \")","v":"T3 (ALB/MBD)"},"ALB","15-30 June 2021",37475.418238020007,102789.71859571201,206650.16342679603,346915.30026052805,45299,93240,192477,331016,120.87656957499335,90.709461290313925,93.141470013007392,95.416950405880655]
[{"$f":"IF(COUNTRY_INFO!A36=0,\" \",COUNTRY_INFO!A36)","v":"Rwanda"},{"$f":"IF(COUNTRY_INFO!B36=0,\" \",COUNTRY_INFO!B36)","v":"Western"},{"$f":"IF(COUNTRY_INFO!C36=0,\" \",COUNTRY_INFO!C36)","v":"Rusizi"},{"$f":"IF(OR(COUNTRY_INFO!$T$9:$T$1000=\"T3 (ALB/MBD)\",COUNTRY_INFO!$U$9:$U$1000=\"T3 (ALB/MBD)\"), \"T3 (ALB/MBD)\", \" \")","v":"T3 (ALB/MBD)"},"ALB","15-30 June 2021",62350.036323660002,124930,170303,357583.03632366,57240,113951,177684,348875,91.804276909906307,91.211878652045144,104.33403991708896,97.564751277580726]
[{"$f":"IF(COUNTRY_INFO!A37=0,\" \",COUNTRY_INFO!A37)","v":"Rwanda"},{"$f":"IF(COUNTRY_INFO!B37=0,\" \",COUNTRY_INFO!B37)","v":"Western"},{"$f":"IF(COUNTRY_INFO!C37=0,\" \",COUNTRY_INFO!C37)","v":"Rutsiro"},{"$f":"IF(OR(COUNTRY_INFO!$T$9:$T$1000=\"T3 (ALB/MBD)\",COUNTRY_INFO!$U$9:$U$1000=\"T3 (ALB/MBD)\"), \"T3 (ALB/MBD)\", \" \")","v":"T3 (ALB/MBD)"},"ALB","15-30 June 2021",43700,81288,179120,304108,40051,81483,162603,284137,91.649885583524025,100.23988780631828,90.778807503349711,93.432925145014266]
[{"$f":"IF(COUNTRY_INFO!A38=0,\" \",COUNTRY_INFO!A38)","v":"Rwanda"},{"$f":"IF(COUNTRY_INFO!B38=0,\" \",COUNTRY_INFO!B38)","v":"Eastern"},{"$f":"IF(COUNTRY_INFO!C38=0,\" \",COUNTRY_INFO!C38)","v":"Rwamagana"},{"$f":"IF(OR(COUNTRY_INFO!$T$9:$T$1000=\"T3 (ALB/MBD)\",COUNTRY_INFO!$U$9:$U$1000=\"T3 (ALB/MBD)\"), \"T3 (ALB/MBD)\", \" \")","v":"T3 (ALB/MBD)"},"ALB","15-30 June 2021",40444,95084,165305,300833,45279,100401,180497,326177,111.9548017011176,105.59189769046317,109.19028462538942,108.42460767269549]

{"sheet":"T3_R2","index":9,"n_rows":38,"n_cols":20,"rows_kept":38,"cut":false,"hidden":false,"merged":[[5,6,5,9],[5,10,5,13],[5,14,5,17],[3,0,3,2],[5,0,5,2],[5,3,6,3],[5,5,6,5],[5,4,6,4]]}
["T 3 - Albendazole (ALB) or Mebendazole (MBD) - Round 2"]
["Administrative structure, population requiring PC by age group, population treated by age group and coverage"]
[]
["TOTAL",null,null,null,null,null,{"$f":"SUM(G$9:G$1000)","v":1562018.4470284558},3766445.6541415555,6681169,12009633.101170011,1456139,3458828,5652115,10567082,{"$f":"IF(G4<>0, IF(K4/G4*100=0, \"-\", K4/G4*100), \" \")","v":93.221626336751768},{"$f":"IF(H4<>0, IF(L4/H4*100=0, \"-\", L4/H4*100), \" \")","v":91.832680399800765},{"$f":"IF(I4<>0, IF(M4/I4*100=0, \"-\", M4/I4*100), \" \")","v":84.597695403304414},{"$f":"IF(J4<>0, IF(N4/J4*100=0, \"-\", N4/J4*100), \" \")","v":87.988383250197103}]
[]
[null,null,null,"PC implemented","Medicine","Date","Population targeted for T3",null,null,null,"Population treated",null,null,null,"Programme coverage (%)"]
["Country","Province/State","District",null,null,null,"PreSAC","SAC","Adults","Total","PreSAC","SAC","Adults","Total","PreSAC","SAC","Adults","Total"]
[]
[{"$f":"IF(COUNTRY_INFO!A9=0,\" \",COUNTRY_INFO!A9)","v":"Rwanda"},{"$f":"IF(COUNTRY_INFO!B9=0,\" \",COUNTRY_INFO!B9)","v":"Eastern"},{"$f":"IF(COUNTRY_INFO!C9=0,\" \",COUNTRY_INFO!C9)","v":"Bugesera"},"T3 (ALB/MBD)","MBD","15-28/11/2021",60187.453487568004,129038.25255289199,249271,{"$f":"SUM(G9:I9)","v":438496.70604046003},53073,144904,236885,{"$f":"SUM(K9:M9)","v":434862},{"$f":"IF(G9<>0, IF(K9/G9*100=0, \"-\", K9/G9*100), \" \")","v":88.179507396774099},{"$f":"IF(H9<>0, IF(L9/H9*100=0, \"-\", L9/H9*100), \" \")","v":112.2953830613947},{"$f":"IF(I9<>0, IF(M9/I9*100=0, \"-\", M9/I9*100), \" \")","v":95.031110718856183},{"$f":"IF(J9<>0, IF(N9/J9*100=0, \"-\", N9/J9*100), \" \")","v":99.171098439192235},{"$f":"G9/COUNTRY_INFO!E9*100","v":100},{"$f":"H9/COUNTRY_INFO!F9*100","v":100}]
[{"$f":"IF(COUNTRY_INFO!A10=0,\" \",COUNTRY_INFO!A10)","v":"Rwanda"},{"$f":"IF(COUNTRY_INFO!B10=0,\" \",COUNTRY_INFO!B10)","v":"Northern"},{"$f":"IF(COUNTRY_INFO!C10=0,\" \",COUNTRY_INFO!C10)","v":"Burera"},"T3 (ALB/MBD)","MBD","15-28/11/2021",45797.456781648005,137816.42087070001,215055,{"$f":"SUM(G10:I10)","v":398668.87765234802},43597,107288,174713,{"$f":"SUM(K10:M10)","v":325598},{"$f":"IF(G10<>0, IF(K10/G10*100=0, \"-\", K10/G10*100), \" \")","v":95.195242408024342},{"$f":"IF(H10<>0, IF(L10/H10*100=0, \"-\", L10/H10*100), \" \")","v":77.848488099003887},{"$f":"IF(I10<>0, IF(M10/I10*100=0, \"-\", M10/I10*100), \" \")","v":81.241077863802275},{"$f":"IF(J10<>0, IF(N10/J10*100=0, \"-\", N10/J10*100), \" \")","v":81.671286185507512},{"$f":"G10/COUNTRY_INFO!E10*100","v":100},{"$f":"H10/COUNTRY_INFO!F10*100","v":100}]
[{"$f":"IF(COUNTRY_INFO!A11=0,\" \",COUNTRY_INFO!A11)","v":"Rwanda"},{"$f":"IF(COUNTRY_INFO!B11=0,\" \",COUNTRY_INFO!B11)","v":"Northern"},{"$f":"IF(COUNTRY_INFO!C11=0,\" \",COUNTRY_INFO!C11)","v":"Gakenke"},"T3 (ALB/MBD)","MBD","15-28/11/2021",47043.753583679994,131722.510034304,242424,421190.26361798402,40460,95173,240256,375889,86.005041940437394,72.252646852246031,99.105699105699102,89.24446561778268,{"$f":"G11/COUNTRY_INFO!E11*100","v":100},{"$f":"H11/COUNTRY_INFO!F11*100","v":100}]
[{"$f":"IF(COUNTRY_INFO!A12=0,\" \",COUNTRY_INFO!A12)","v":"Rwanda"},{"$f":"IF(COUNTRY_INFO!B12=0,\" \",COUNTRY_INFO!B12)","v":"Kigali"},{"$f":"IF(COUNTRY_INFO!C12=0,\" \",COUNTRY_INFO!C12)","v":"Gasabo"},"T3 (ALB/MBD)","MBD","15-28/11/2021",75391.190847684004,145444.95225482399,82631,303467.14310250798,80597,197626,75346,353569,106.90506290427686,135.87683651870793,91.18369619150198,116.50981268854142,{"$f":"G12/COUNTRY_INFO!E12*100","v":100},{"$f":"H12/COUNTRY_INFO!F12*100","v":100}]
[{"$f":"IF(COUNTRY_INFO!A13=0,\" \",COUNTRY_INFO!A13)","v":"Rwanda"},{"$f":"IF(COUNTRY_INFO!B13=0,\" \",COUNTRY_INFO!B13)","v":"Eastern"},{"$f":"IF(COUNTRY_INFO!C13=0,\" \",COUNTRY_INFO!C13)","v":"Gatsibo"},"T3 (ALB/MBD)","MBD","15-28/11/2021",63593.799334559997,157445.93867507999,283941,504980.73800964002,59292,161816,241548,462656,93.235505065629582,102.7755948242898,85.069785624478328,91.618544070322145,{"$f":"G13/COUNTRY_INFO!E13*100","v":100},{"$f":"H13/COUNTRY_INFO!F13*100","v":100}]
[{"$f":"IF(COUNTRY_INFO!A14=0,\" \",COUNTRY_INFO!A14)","v":"Rwanda"},{"$f":"IF(COUNTRY_INFO!B14=0,\" \",COUNTRY_INFO!B14)","v":"Northern"},{"$f":"IF(COUNTRY_INFO!C14=0,\" \",COUNTRY_INFO!C14)","v":"Gicumbi"},"T3 (ALB/MBD)","MBD","15-28/11/2021",52333.434693540003,154009.82209813202,261622,467965.25679167203,49492,107251,256236,412979,94.570517470945305,69.639064923834397,97.941304630344533,88.249927533370126,{"$f":"G14/COUNTRY_INFO!E14*100","v":100},{"$f":"H14/COUNTRY_INFO!F14*100","v":100}]
[{"$f":"IF(COUNTRY_INFO!A15=0,\" \",COUNTRY_INFO!A15)","v":"Rwanda"},{"$f":"IF(COUNTRY_INFO!B15=0,\" \",COUNTRY_INFO!B15)","v":"Southern"},{"$f":"IF(COUNTRY_INFO!C15=0,\" \",COUNTRY_INFO!C15)","v":"Gisagara"},"T3 (ALB/MBD)","MBD","15-28/11/2021",53633.863253520001,116206.70371595999,223922,393762.56696948002,52584,100822,208773,362179,98.042536580746685,86.760915485939364,93.234697796554158,91.979032640772076,{"$f":"G15/COUNTRY_INFO!E15*100","v":100},{"$f":"H15/COUNTRY_INFO!F15*100","v":100}]
[{"$f":"IF(COUNTRY_INFO!A16=0,\" \",COUNTRY_INFO!A16)","v":"Rwanda"},{"$f":"IF(COUNTRY_INFO!B16=0,\" \",COUNTRY_INFO!B16)","v":"Southern"},{"$f":"IF(COUNTRY_INFO!C16=0,\" \",COUNTRY_INFO!C16)","v":"Huye"},"T3 (ALB/MBD)","MBD","15-28/11/2021",46752.570769968006,108813.505420368,218814,374380.07619033603,42463,96677,215291,354431,90.824952084295958,88.846508185282431,98.389956766934475,94.671437541939639,{"$f":"G16/COUNTRY_INFO!E16*100","v":100},{"$f":"H16/COUNTRY_INFO!F16*100","v":100}]
[{"$f":"IF(COUNTRY_INFO!A17=0,\" \",COUNTRY_INFO!A17)","v":"Rwanda"},{"$f":"IF(COUNTRY_INFO!B17=0,\" \",COUNTRY_INFO!B17)","v":"Southern"},{"$f":"IF(COUNTRY_INFO!C17=0,\" \",COUNTRY_INFO!C17)","v":"Kamonyi"},"T3 (ALB/MBD)","MBD","15-28/11/2021",48904.583686344005,120116.52133488002,210350,379371.10502122401,38795,108208,189660,336663,79.32794244567512,90.085858962165972,90.164012360351791,88.742393804917043,{"$f":"G17/COUNTRY_INFO!E17*100","v":100},{"$f":"H17/COUNTRY_INFO!F17*100","v":100}]
[{"$f":"IF(COUNTRY_INFO!A18=0,\" \",COUNTRY_INFO!A18)","v":"Rwanda"},{"$f":"IF(COUNTRY_INFO!B18=0,\" \",COUNTRY_INFO!B18)","v":"Western"},{"$f":"IF(COUNTRY_INFO!C18=0,\" \",COUNTRY_INFO!C18)","v":"Karongi"},"T3 (ALB/MBD)","MBD","15-28/11/2021",49391.587394928007,126459.49531287601,231126,406977.08270780405,45163,93328,191026,329517,91.43864852709261,73.800705727233293,82.650156191860717,80.966966937689264,{"$f":"G18/COUNTRY_INFO!E18*100","v":100},{"$f":"H18/COUNTRY_INFO!F18*100","v":100}]
[{"$f":"IF(COUNTRY_INFO!A19=0,\" \",COUNTRY_INFO!A19)","v":"Rwanda"},{"$f":"IF(COUNTRY_INFO!B19=0,\" \",COUNTRY_INFO!B19)","v":"Eastern"},{"$f":"IF(COUNTRY_INFO!C19=0,\" \",COUNTRY_INFO!C19)","v":"Kayonza"},"T3 (ALB/MBD)","MBD","15-28/11/2021",54658.095948000002,131179.43027519999,241195,427032.52622320002,47016,116123,179597,342736,86.01836413169157,88.522262794088022,74.461327971143675,80.259928448836661,{"$f":"G19/COUNTRY_INFO!E19*100","v":100},{"$f":"H19/COUNTRY_INFO!F19*100","v":100}]
[{"$f":"IF(COUNTRY_INFO!A20=0,\" \",COUNTRY_INFO!A20)","v":"Rwanda"},{"$f":"IF(COUNTRY_INFO!B20=0,\" \",COUNTRY_INFO!B20)","v":"Kigali"},{"$f":"IF(COUNTRY_INFO!C20=0,\" \",COUNTRY_INFO!C20)","v":"Kicukiro"},"T3 (ALB/MBD)","MBD","15-28/11/2021",40536.412669692007,88698.487128731998,null,129234.89979842401,42171,109313,0,151484,104.03239266293076,123.24110989779258," ",117.21601536139181,{"$f":"G20/COUNTRY_INFO!E20*100","v":100},{"$f":"H20/COUNTRY_INFO!F20*100","v":100}]
[{"$f":"IF(COUNTRY_INFO!A21=0,\" \",COUNTRY_INFO!A21)","v":"Rwanda"},{"$f":"IF(COUNTRY_INFO!B21=0,\" \",COUNTRY_INFO!B21)","v":"Eastern"},{"$f":"IF(COUNTRY_INFO!C21=0,\" \",COUNTRY_INFO!C21)","v":"Kirehe"},"T3 (ALB/MBD)","MBD","15-28/11/2021",53602.525089000002,129503.700615024,261075,444181.22570402402,51305,121294,192213,364812,95.713774518671897,93.660644000105435,73.623671358804941,82.131341643667085,{"$f":"G21/COUNTRY_INFO!E21*100","v":100},{"$f":"H21/COUNTRY_INFO!F21*100","v":100}]
[{"$f":"IF(COUNTRY_INFO!A22=0,\" \",COUNTRY_INFO!A22)","v":"Rwanda"},{"$f":"IF(COUNTRY_INFO!B22=0,\" \",COUNTRY_INFO!B22)","v":"Southern"},{"$f":"IF(COUNTRY_INFO!C22=0,\" \",COUNTRY_INFO!C22)","v":"Muhanga"},"T3 (ALB/MBD)","MBD","15-28/11/2021",41413.927593995999,112179.47377402801,249297,402890.401368024,33252,94806,168280,296338,80.291829178792312,84.512787242143091,67.501815104072648,73.55300572904622,{"$f":"G22/COUNTRY_INFO!E22*100","v":100},{"$f":"H22/COUNTRY_INFO!F22*100","v":100}]
[{"$f":"IF(COUNTRY_INFO!A23=0,\" \",COUNTRY_INFO!A23)","v":"Rwanda"},{"$f":"IF(COUNTRY_INFO!B23=0,\" \",COUNTRY_INFO!B23)","v":"Northern"},{"$f":"IF(COUNTRY_INFO!C23=0,\" \",COUNTRY_INFO!C23)","v":"Musanze"},"T3 (ALB/MBD)","MBD","15-28/11/2021",51036.595758720003,136870.87044383999,242266,430173.46620256,41363,108575,184085,334023,81.04576605294605,79.326594218270742,75.984661487786155,77.648443300943924,{"$f":"G23/COUNTRY_INFO!E23*100","v":100},{"$f":"H23/COUNTRY_INFO!F23*100","v":100}]
[{"$f":"IF(COUNTRY_INFO!A24=0,\" \",COUNTRY_INFO!A24)","v":"Rwanda"},{"$f":"IF(COUNTRY_INFO!B24=0,\" \",COUNTRY_INFO!B24)","v":"Eastern"},{"$f":"IF(COUNTRY_INFO!C24=0,\" \",COUNTRY_INFO!C24)","v":"Ngoma"},"T3 (ALB/MBD)","MBD","15-28/11/2021",68342.299712819993,119705.14608083999,218891,406938.44579366001,42538,95824,225433,363795,62.24256452994441,80.050025531306375,102.98870213942099,89.398041340253187,{"$f":"G24/COUNTRY_INFO!E24*100","v":100},{"$f":"H24/COUNTRY_INFO!F24*100","v":100}]
[{"$f":"IF(COUNTRY_INFO!A25=0,\" \",COUNTRY_INFO!A25)","v":"Rwanda"},{"$f":"IF(COUNTRY_INFO!B25=0,\" \",COUNTRY_INFO!B25)","v":"Western"},{"$f":"IF(COUNTRY_INFO!C25=0,\" \",COUNTRY_INFO!C25)","v":"Ngororero"},"T3 (ALB/MBD)","MBD","15-28/11/2021",51267.80551536,131587.36748942401,233403,416258.17300478404,46769,105850,200592,353211,91.224891586178501,80.440852355000885,85.942340072749715,84.853829403594816,{"$f":"G25/COUNTRY_INFO!E25*100","v":100},{"$f":"H25/COUNTRY_INFO!F25*100","v":100}]
[{"$f":"IF(COUNTRY_INFO!A26=0,\" \",COUNTRY_INFO!A26)","v":"Rwanda"},{"$f":"IF(COUNTRY_INFO!B26=0,\" \",COUNTRY_INFO!B26)","v":"Western"},{"$f":"IF(COUNTRY_INFO!C26=0,\" \",COUNTRY_INFO!C26)","v":"Nyabihu"},"T3 (ALB/MBD)","MBD","15-28/11/2021",43817.484809303998,116970.40436382001,141262,302049.88917312399,37085,103696,141015,281796,84.635163705529592,88.651484590468002,99.825147598080164,93.294521898826048,{"$f":"G26/COUNTRY_INFO!E26*100","v":100},{"$f":"H26/COUNTRY_INFO!F26*100","v":100}]
[{"$f":"IF(COUNTRY_INFO!A27=0,\" \",COUNTRY_INFO!A27)","v":"Rwanda"},{"$f":"IF(COUNTRY_INFO!B27=0,\" \",COUNTRY_INFO!B27)","v":"Eastern"},{"$f":"IF(COUNTRY_INFO!C27=0,\" \",COUNTRY_INFO!C27)","v":"Nyagatare"},"T3 (ALB/MBD)","MBD","15-28/11/2021",73364.67480600001,180770.55872198401,400358,654493.233527984,76063,170502,203566,450131,103.67796245418552,94.319562436172731,50.845992836411412,68.775500943472139,{"$f":"G27/COUNTRY_INFO!E27*100","v":100},{"$f":"H27/COUNTRY_INFO!F27*100","v":100}]
[{"$f":"IF(COUNTRY_INFO!A28=0,\" \",COUNTRY_INFO!A28)","v":"Rwanda"},{"$f":"IF(COUNTRY_INFO!B28=0,\" \",COUNTRY_INFO!B28)","v":"Southern"},{"$f":"IF(COUNTRY_INFO!C28=0,\" \",COUNTRY_INFO!C28)","v":"Nyamagabe"},"T3 (ALB/MBD)","MBD","15-28/11/2021",47580.315172991999,130421.042483112,244732,422733.35765610402,41352,100557,218203,360112,86.909890885869174,77.101821980161645,89.159979079155974,85.186558732124738,{"$f":"G28/COUNTRY_INFO!E28*100","v":100},{"$f":"H28/COUNTRY_INFO!F28*100","v":100}]
[{"$f":"IF(COUNTRY_INFO!A29=0,\" \",COUNTRY_INFO!A29)","v":"Rwanda"},{"$f":"IF(COUNTRY_INFO!B29=0,\" \",COUNTRY_INFO!B29)","v":"Western"},{"$f":"IF(COUNTRY_INFO!C29=0,\" \",COUNTRY_INFO!C29)","v":"Nyamasheke"},"T3 (ALB/MBD)","MBD","15-28/11/2021",59611.700770775999,129076.57522267201,262514,451202.27599344798,57897,119392,188449,365738,97.123549993365373,92.497031156919846,71.786266637207916,81.058545016140599,{"$f":"G29/COUNTRY_INFO!E29*100","v":100},{"$f":"H29/COUNTRY_INFO!F29*100","v":100}]
[{"$f":"IF(COUNTRY_INFO!A30=0,\" \",COUNTRY_INFO!A30)","v":"Rwanda"},{"$f":"IF(COUNTRY_INFO!B30=0,\" \",COUNTRY_INFO!B30)","v":"Southern"},{"$f":"IF(COUNTRY_INFO!C30=0,\" \",COUNTRY_INFO!C30)","v":"Nyanza"},"T3 (ALB/MBD)","MBD","15-28/11/2021",48941.223127199999,108078.53440590001,191245,348264.75753309997,35966,99069,184525,319560,73.488151096107828,91.663900278233072,96.486182645297916,91.757777118641755,{"$f":"G30/COUNTRY_INFO!E30*100","v":100},{"$f":"H30/COUNTRY_INFO!F30*100","v":100}]
[{"$f":"IF(COUNTRY_INFO!A31=0,\" \",COUNTRY_INFO!A31)","v":"Rwanda"},{"$f":"IF(COUNTRY_INFO!B31=0,\" \",COUNTRY_INFO!B31)","v":"Kigali"},{"$f":"IF(COUNTRY_INFO!C31=0,\" \",COUNTRY_INFO!C31)","v":"Nyarugenge"},"T3 (ALB/MBD)","MBD","15-28/11/2021",37285.135471583999,78513.891041124007,180809,296608.02651270799,43369,102690,156295,302354,116.31713134863806,130.79214217801666,86.442046579539735,101.93722791485071,{"$f":"G31/COUNTRY_INFO!E31*100","v":100},{"$f":"H31/COUNTRY_INFO!F31*100","v":100}]
[{"$f":"IF(COUNTRY_INFO!A32=0,\" \",COUNTRY_INFO!A32)","v":"Rwanda"},{"$f":"IF(COUNTRY_INFO!B32=0,\" \",COUNTRY_INFO!B32)","v":"Southern"},{"$f":"IF(COUNTRY_INFO!C32=0,\" \",COUNTRY_INFO!C32)","v":"Nyaruguru"},"T3 (ALB/MBD)","MBD","15-28/11/2021",43386.292929563999,118663.36527744,198471,360520.65820700396,41218,111393,190971,343582,95.002354930198479,93.873117233409346,96.221110388923307,95.301612315020762,{"$f":"G32/COUNTRY_INFO!E32*100","v":100},{"$f":"H32/COUNTRY_INFO!F32*100","v":100}]
[{"$f":"IF(COUNTRY_INFO!A33=0,\" \",COUNTRY_INFO!A33)","v":"Rwanda"},{"$f":"IF(COUNTRY_INFO!B33=0,\" \",COUNTRY_INFO!B33)","v":"Western"},{"$f":"IF(COUNTRY_INFO!C33=0,\" \",COUNTRY_INFO!C33)","v":"Rubavu"},"T3 (ALB/MBD)","MBD","15-28/11/2021",65095.866929664,137311.59430476002,275269,477676.46123442403,72548,146058,196045,414651,111.44793582423293,106.36975030369797,71.219425362100338,86.805826464307671,{"$f":"G33/COUNTRY_INFO!E33*100","v":100},{"$f":"H33/COUNTRY_INFO!F33*100","v":100}]
[{"$f":"IF(COUNTRY_INFO!A34=0,\" \",COUNTRY_INFO!A34)","v":"Rwanda"},{"$f":"IF(COUNTRY_INFO!B34=0,\" \",COUNTRY_INFO!B34)","v":"Southern"},{"$f":"IF(COUNTRY_INFO!C34=0,\" \",COUNTRY_INFO!C34)","v":"Ruhango"},"T3 (ALB/MBD)","MBD","15-28/11/2021",41908.661102448001,103687.80807243599,203481,349077.46917488403,40303,101793,204336,346432,96.16866523479986,98.172583539318055,100.42018665133354,99.242154132394404,{"$f":"G34/COUNTRY_INFO!E34*100","v":100},{"$f":"H34/COUNTRY_INFO!F34*100","v":100}]
[{"$f":"IF(COUNTRY_INFO!A35=0,\" \",COUNTRY_INFO!A35)","v":"Rwanda"},{"$f":"IF(COUNTRY_INFO!B35=0,\" \",COUNTRY_INFO!B35)","v":"Northern"},{"$f":"IF(COUNTRY_INFO!C35=0,\" \",COUNTRY_INFO!C35)","v":"Rulindo"},"T3 (ALB/MBD)","MBD","15-28/11/2021",37475.418238020007,102789.71859571201,225436,365701.13683373202,44333,98704,195932,338969,118.29887986419523,96.025168030878874,86.91247183236041,92.690168517062631,{"$f":"G35/COUNTRY_INFO!E35*100","v":100},{"$f":"H35/COUNTRY_INFO!F35*100","v":100}]
[{"$f":"IF(COUNTRY_INFO!A36=0,\" \",COUNTRY_INFO!A36)","v":"Rwanda"},{"$f":"IF(COUNTRY_INFO!B36=0,\" \",COUNTRY_INFO!B36)","v":"Western"},{"$f":"IF(COUNTRY_INFO!C36=0,\" \",COUNTRY_INFO!C36)","v":"Rusizi"},"T3 (ALB/MBD)","MBD","15-28/11/2021",62350.036323660002,144976.50722412,266931,474257.54354778002,67019,100296,197377,364692,107.48830947283388,69.180863796747332,73.943078923017552,76.897458978058069,{"$f":"G36/COUNTRY_INFO!E36*100","v":100},{"$f":"H36/COUNTRY_INFO!F36*100","v":100}]
[{"$f":"IF(COUNTRY_INFO!A37=0,\" \",COUNTRY_INFO!A37)","v":"Rwanda"},{"$f":"IF(COUNTRY_INFO!B37=0,\" \",COUNTRY_INFO!B37)","v":"Western"},{"$f":"IF(COUNTRY_INFO!C37=0,\" \",COUNTRY_INFO!C37)","v":"Rutsiro"},"T3 (ALB/MBD)","MBD","15-28/11/2021",49133.934417168006,132153.34084617603,211817,393104.27526334405,39848,117390,192660,349898,81.100771742953711,88.828628355782342,90.955872285982707,89.008953099174576,{"$f":"G37/COUNTRY_INFO!E37*100","v":100},{"$f":"H37/COUNTRY_INFO!F37*100","v":100}]
[{"$f":"IF(COUNTRY_INFO!A38=0,\" \",COUNTRY_INFO!A38)","v":"Rwanda"},{"$f":"IF(COUNTRY_INFO!B38=0,\" \",COUNTRY_INFO!B38)","v":"Eastern"},{"$f":"IF(COUNTRY_INFO!C38=0,\" \",COUNTRY_INFO!C38)","v":"Rwamagana"},"T3 (ALB/MBD)","MBD","15-28/11/2021",48180.346809048002,106233.71550519601,213561,367975.06231424399,49208,122410,202807,374425,102.13293024856145,115.22707213795303,94.964436390539475,101.75281923867109,{"$f":"G38/COUNTRY_INFO!E38*100","v":100},{"$f":"H38/COUNTRY_INFO!F38*100","v":100}]

{"sheet":"DISTRICT","index":10,"n_rows":38,"n_cols":56,"rows_kept":38,"cut":false,"hidden":false,"merged":[[3,0,3,2],[5,0,5,2],[5,4,5,8],[5,10,5,14],[5,16,5,24],[5,26,5,34],[5,3,6,3],[5,9,6,9],[5,15,6,15],[5,25,6,25]]}
["Number of individuals treated"]
["Administrative structure, population treated by age group and gender"]
[]
["TOTAL",null,null,{"$f":"SUM(D$9:D$1000)","v":0},{"$f":"SUM(E$9:E$1000)","v":0},{"$f":"SUM(F$9:F$1000)","v":0},{"$f":"SUM(G$9:G$1000)","v":0},{"$f":"SUM(H$9:H$1000)","v":0},{"$f":"IF(D4>0, IF(H4/D4*100<>0, H4/D4*100, \"-\"),0)","v":0},{"$f":"SUM(J$9:J$1000)","v":0},{"$f":"SUM(K$9:K$1000)","v":0},{"$f":"SUM(L$9:L$1000)","v":0},{"$f":"SUM(M$9:M$1000)","v":0},{"$f":"SUM(N$9:N$1000)","v":0},{"$f":"IF(J4>0, IF(N4/J4*100<>0, N4/J4*100, \"-\"),0)","v":0},{"$f":"SUM(P$9:P$1000)","v":4199615.6299852673},{"$f":"SUM(Q$9:Q$1000)","v":0},{"$f":"SUM(R$9:R$1000)","v":0},{"$f":"SUM(S$9:S$1000)","v":10986217},{"$f":"SUM(T$9:T$1000)","v":1137032.465349704},null,{"$f":"SUM(V$9:V$1000)","v":2686879.0439566476},null,{"$f":"SUM(X$9:X$1000)","v":3823911.5093063521},{"$f":"IF(P4>0, IF(X4/P4*100<>0, X4/P4*100, \"-\"),0)","v":91.053845071049196},{"$f":"SUM(Z$9:Z$1000)","v":1480813},0,0,2856299,865451.24063031597,null,938187.57926559541,null,1803638.8198959115,{"$f":"IF(Z4>0, IF(AH4/Z4*100<>0, AH4/Z4*100, \"-\"),0)","v":121.80057980959862}]
[]
[null,null,null,"Population requiring PC for LF","Population treated for lymphatic filariasis",null,null,null,null,"Population requiring PC for ONCHO","Population treated for onchocerciasis",null,null,null,null,"Population requiring PC for STH","Population treated for STH",null,null,null,null,null,null,null,null,"Population requiring PC for SCH","Population treated for schistosomiasis",null,null,null,null,null,null,null,null,null,null,null,null,null,null,{"$f":"SUM(AP9:AP1000)","v":0},{"$f":"SUM(AQ9:AQ1000)","v":1220488.568478246},{"$f":"SUM(AR9:AR1000)","v":3151996.0157056022},{"$f":"SUM(AS9:AS1000)","v":519402.77195227129},{"$f":"SUM(AT9:AT1000)","v":4891887.3561361199},{"$f":"COUNTIF(AU9:AU1000,\"Y\")","v":23},{"$f":"SUM(AV9:AV1000)","v":1516497},3562563,5974326,{"$f":"SUM(AY9:AY1000)","v":11053386},1137032.465349704,2887172.9017092455,938187.57926559541,4613588.4852943784,{"$f":"IF(AT6<>0,BC6/AT6,0)","v":0.94311012282556783}]
["Country","Province/State","District",null,"Male","Female","Total treated","Total in need treated","(%)",null,"Male","Female","Total treated","Total in need treated","(%)",null,"Male","Female","Total treated","PreSAC in need treated ","PreSAC (%)","SAC in need treated","SAC (%)","Total in need treated ","(%)",null,"Male","Female","Total treated","SAC in need treated","SAC (%)","Adults in need treated","Adults (%)","Total in need treated ","(%)",null,"LF","ONCHO","STH","SCH-SAC","SCH_Adults","<1","PreSAC","SAC","Adults","Total","Dis","PreSAC","SAC","Adults","Total","PreSAC","SAC","Adults","Total","Coverage"]
[]
[{"$f":"IF(COUNTRY_INFO!A9=0,\" \",COUNTRY_INFO!A9)","v":"Rwanda"},{"$f":"IF(COUNTRY_INFO!B9=0,\" \",COUNTRY_INFO!B9)","v":"Eastern"},{"$f":"IF(COUNTRY_INFO!C9=0,\" \",COUNTRY_INFO!C9)","v":"Bugesera"},{"$f":"COUNTRY_INFO!L9","v":0},null,null,{"$f":"MAX('MDA1'!M9,'MDA2'!M9,'MDA5'!M9)","v":0},{"$f":"IF(AND(COUNTRY_INFO!H9>0,COUNTRY_INFO!H9<4),IF(D9>MAX('MDA1'!M9,'MDA2'!M9,'MDA5'!M9),MAX('MDA1'!M9,'MDA2'!M9,'MDA5'!M9),D9),0)","v":0},{"$f":"IF(AND(COUNTRY_INFO!H9>0,COUNTRY_INFO!H9<4), IF(G9/D9*100<>0, IF(G9/D9*100>100,100,G9/D9*100), \"-\"),0)","v":0},{"$f":"COUNTRY_INFO!M9","v":0},null,null,{"$f":"MAX('MDA1'!M9,MAX('MDA3'!I9,'MDA3'!L9)+MAX('MDA3'!J9,'MDA3'!M9))","v":0},{"$f":"IF(AND(COUNTRY_INFO!I9>0,COUNTRY_INFO!I9<4),IF(J9>MAX('MDA1'!M9,MAX('MDA3'!I9,'MDA3'!L9)+MAX('MDA3'!J9,'MDA3'!M9)),MAX('MDA1'!M9,MAX('MDA3'!I9,'MDA3'!L9)+MAX('MDA3'!J9,'MDA3'!M9)),J9),0)","v":0},{"$f":"IF(AND(COUNTRY_INFO!I9>0,COUNTRY_INFO!I9<4), IF(M9/J9*100<>0, IF(M9/J9*100>100,100,M9/J9*100), \"-\"),0)","v":0},{"$f":"COUNTRY_INFO!N9","v":0},null,null,{"$f":"SUM(MAX('MDA2'!J9,'MDA5'!J9, 'T1'!L9, MAX(T3_R1!K9, T3_R2!K9)), MAX('MDA1'!K9, 'MDA2'!K9, 'MDA5'!K9,'T1'!M9, MAX(T3_R1!L9, T3_R2!L9)), MAX('MDA1'!L9, 'MDA2'!L9, 'MDA5'!L9,'T1'!N9, MAX(T3_R1!M9, T3_R2!M9)))","v":434862},{"$f":"IF(AND(COUNTRY_INFO!J9>1,COUNTRY_INFO!J9<4),IF(COUNTRY_INFO!E9>MAX('MDA2'!J9,'MDA5'!J9,'T1'!L9,MAX(T3_R1!K9,T3_R2!K9)),MAX('MDA2'!J9,'MDA5'!J9,'T1'!L9,MAX(T3_R1!K9,T3_R2!K9)),COUNTRY_INFO!E9),0)","v":0},{"$f":"IF(AND(COUNTRY_INFO!J9>1,COUNTRY_INFO!J9<4), IF(T9/COUNTRY_INFO!E9*100<>0, IF(T9/COUNTRY_INFO!E9*100>100,100,T9/COUNTRY_INFO!E9*100), \"-\"),0)","v":0},{"$f":"IF(AND(COUNTRY_INFO!J9>1,COUNTRY_INFO!J9<4),IF(COUNTRY_INFO!F9>MAX('MDA1'!K9,'MDA2'!K9,'MDA5'!K9,'T1'!M9,MAX(T3_R1!L9,T3_R2!L9)),MAX('MDA1'!K9,'MDA2'!K9,'MDA5'!K9,'T1'!M9,MAX(T3_R1!L9,T3_R2!L9)),COUNTRY_INFO!F9),0)","v":0},{"$f":"IF(AND(COUNTRY_INFO!J9>1,COUNTRY_INFO!J9<4), IF(V9/COUNTRY_INFO!F9*100<>0, IF(V9/COUNTRY_INFO!F9*100>100,100,V9/COUNTRY_INFO!F9*100), \"-\"),0)","v":0},{"$f":"SUM(T9,V9)","v":0},{"$f":"IF(AND(COUNTRY_INFO!J9>1,COUNTRY_INFO!J9<4), IF(S9/P9*100<>0, IF(X9/P9*100>100,100,X9/P9*100), \"-\"),0)","v":0},{"$f":"COUNTRY_INFO!O9","v":69225},null,null,{"$f":"MAX('T1'!L9,'T2'!J9)+MAX('T1'!M9,'T2'!K9)+MAX('T1'!N9,'T2'!L9)","v":162629},{"$f":"IF(COUNTRY_INFO!K9=1,IF(COUNTRY_INFO!F9*0.33>MAX('T1'!M9,'T2'!K9),MAX('T1'!M9,'T2'!K9),COUNTRY_INFO!F9*0.33),IF(COUNTRY_INFO!K9=2,IF(COUNTRY_INFO!F9*0.5>MAX('T1'!M9,'T2'!K9),MAX('T1'!M9,'T2'!K9),COUNTRY_INFO!F9*0.5),IF(COUNTRY_INFO!K9=3,IF(COUNTRY_INFO!F9>MAX('T1'!M9,'T2'!K9),MAX('T1'!M9,'T2'!K9),COUNTRY_INFO!F9),0)))","v":55601},{"$f":"IF(AND(COUNTRY_INFO!K9>0,COUNTRY_INFO!K9<4),IF(Z9>0,IF(COUNTRY_INFO!K9=1, AD9/(COUNTRY_INFO!F9*0.33)*100, IF(COUNTRY_INFO!K9=2, AD9/(COUNTRY_INFO!F9*0.5)*100, IF(COUNTRY_INFO!K9=3, AD9/COUNTRY_INFO!F9*100))),\"-\"),0)","v":86.177546425172622},{"$f":"IF(COUNTRY_INFO!K9=2,IF(COUNTRY_INFO!G9*0.2>MAX('T1'!N9,'T2'!L9),MAX('T1'!N9,'T2'!L9),COUNTRY_INFO!G9*0.2),IF(COUNTRY_INFO!K9=3,IF(COUNTRY_INFO!G9>MAX('T1'!N9,'T2'!L9),MAX('T1'!N9,'T2'!L9),COUNTRY_INFO!G9),0))","v":50247.404350984812},{"$f":"IF(AND(COUNTRY_INFO!K9>0,COUNTRY_INFO!K9<4),IF(Z9>0,IF(COUNTRY_INFO!K9=1, 0, IF(COUNTRY_INFO!K9=2, AF9/(COUNTRY_INFO!G9*0.2)*100, IF(COUNTRY_INFO!K9=3, AF9/COUNTRY_INFO!G9*100))),\"-\"),0)","v":100},{"$f":"SUM(AD9,AF9)","v":105848.40435098481},{"$f":"IF(AND(COUNTRY_INFO!K9>0,COUNTRY_INFO!K9<4), IF(AC9/Z9*100<>0, IF(AH9/Z9*100>100,100,AH9/Z9*100), \"-\"),0)","v":100},null,{"$f":"IF(AND(D9<>0, D9<>\"Unknown\",D9<>\"Stopped\",D9<>\"Not required\"),D9/COUNTRY_INFO!D9, 0)","v":0},{"$f":"IF(AND(J9<>0,J9<>\"Unknown\",J9<>\"Stopped\",J9<>\"Not required\"),J9/COUNTRY_INFO!D9, 0)","v":0},{"$f":"IF(AND(P9<>0,P9<>\"Unknown\",P9<>\"Not required\"),P9/(COUNTRY_INFO!E9+COUNTRY_INFO!F9), 0)","v":0},{"$f":"IF(AND(Z9<>0,Z9<>\"Unknown\",Z9<>\"Not required\"),IF(COUNTRY_INFO!K9=1,1,IF(COUNTRY_INFO!K9=2,0.5*COUNTRY_INFO!F9/(0.5*COUNTRY_INFO!F9+0.2*COUNTRY_INFO!G9),IF(COUNTRY_INFO!K9=3,COUNTRY_INFO!F9/(COUNTRY_INFO!F9+COUNTRY_INFO!G9)))),0)","v":0.56217719507350017},{"$f":"IF(AND(Z9<>0,Z9<>\"Unknown\",Z9<>\"Not required\"),IF(COUNTRY_INFO!K9=1,0,IF(COUNTRY_INFO!K9=2,0.2*COUNTRY_INFO!G9/(0.5*COUNTRY_INFO!F9+0.2*COUNTRY_INFO!G9),IF(COUNTRY_INFO!K9=3,COUNTRY_INFO!G9/(COUNTRY_INFO!F9+COUNTRY_INFO!G9)))),0)","v":0.43782280492649989},{"$f":"MAX(COUNTRY_INFO!D9*AK9*PROFILE!$G$7,COUNTRY_INFO!D9*AL9*PROFILE!$G$7)","v":0},{"$f":"MAX(COUNTRY_INFO!D9*AK9*PROFILE!$G$8,COUNTRY_INFO!D9*AL9*PROFILE!$G$8,COUNTRY_INFO!D9*AM9*PROFILE!$G$8)","v":0},{"$f":"MAX(COUNTRY_INFO!D9*AK9*PROFILE!$G$9,COUNTRY_INFO!D9*AL9*PROFILE!$G$9,COUNTRY_INFO!D9*AM9*PROFILE!$G$9,IF(AND(DISTRICT!Z9<>\"Unknown\",Z9<>\"Not required\"),COUNTRY_INFO!O9*DISTRICT!AN9,0))","v":38916.716328963048},{"$f":"MAX(COUNTRY_INFO!D9*AK9*PROFILE!$G$10,COUNTRY_INFO!D9*AL9*PROFILE!$G$10,IF(AND(DISTRICT!Z9<>\"Unknown\",Z9<>\"Not required\"),COUNTRY_INFO!O9*DISTRICT!AO9,0))","v":30308.283671036956},{"$f":"SUM(AP9:AS9)","v":69225},{"$f":"IF(COUNTIFS(AK9:AN9,\">0\")=0,0, IF(COUNTIFS(AK9:AN9,\">0\")<=IF(AND(OR(D9>=0,D9=\"Not required\",D9=\"Unknown\",D9=\"Stopped\"),D9>0,H9>0),1,0)+IF(AND(OR(J9>=0,J9=\"Not required\",J9=\"Unknown\",J9=\"Stopped\"),J9>0,N9>0),1,0)+IF(AND(OR(P9>=0,P9=\"Not required\",P9=\"Unknown\"),P9>0,X9>0),1,0)+IF(AND(OR(Z9>=0,Z9=\"Not required\",Z9=\"Unknown\"),Z9>0,AH9>0),1,0),\"Y\",0))","v":"Y"},{"$f":"MAX('MDA2'!J9,'MDA5'!J9,'T1'!L9,'T2'!J9,T3_R1!K9,T3_R2!K9)","v":53073},{"$f":"MAX('MDA1'!K9,'MDA2'!K9,'MDA3'!I9,'MDA3'!L9,'MDA5'!K9,'T1'!M9,'T2'!K9,T3_R1!L9,T3_R2!L9)","v":144904},{"$f":"MAX('MDA1'!L9,'MDA2'!L9,'MDA3'!J9,'MDA3'!M9,'MDA5'!L9,'T1'!N9,'T2'!L9,T3_R1!M9,T3_R2!M9)","v":236885},{"$f":"SUM(AV9:AX9)","v":434862},{"$f":"MAX('MDA2'!J9,'MDA5'!J9,T9)","v":0},{"$f":"MAX('MDA1'!K9,'MDA2'!K9,'MDA3'!I9,'MDA3'!L9,'MDA5'!K9,V9,AD9)","v":55601},{"$f":"MAX('MDA1'!L9,'MDA2'!L9,'MDA3'!J9,'MDA3'!M9,'MDA5'!L9,AF9)","v":50247.404350984812},{"$f":"IF(AT9<SUM(AZ9:BB9), AT9,SUM(AZ9:BB9))","v":69225},{"$f":"IF(AT9<>0,BC9/AT9*100,0)","v":100}]
[{"$f":"IF(COUNTRY_INFO!A10=0,\" \",COUNTRY_INFO!A10)","v":"Rwanda"},{"$f":"IF(COUNTRY_INFO!B10=0,\" \",COUNTRY_INFO!B10)","v":"Northern"},{"$f":"IF(COUNTRY_INFO!C10=0,\" \",COUNTRY_INFO!C10)","v":"Burera"},{"$f":"COUNTRY_INFO!L10","v":0},null,null,{"$f":"MAX('MDA1'!M10,'MDA2'!M10,'MDA5'!M10)","v":0},{"$f":"IF(AND(COUNTRY_INFO!H10>0,COUNTRY_INFO!H10<4),IF(D10>MAX('MDA1'!M10,'MDA2'!M10,'MDA5'!M10),MAX('MDA1'!M10,'MDA2'!M10,'MDA5'!M10),D10),0)","v":0},{"$f":"IF(AND(COUNTRY_INFO!H10>0,COUNTRY_INFO!H10<4), IF(G10/D10*100<>0, IF(G10/D10*100>100,100,G10/D10*100), \"-\"),0)","v":0},{"$f":"COUNTRY_INFO!M10","v":0},null,null,{"$f":"MAX('MDA1'!M10,MAX('MDA3'!I10,'MDA3'!L10)+MAX('MDA3'!J10,'MDA3'!M10))","v":0},{"$f":"IF(AND(COUNTRY_INFO!I10>0,COUNTRY_INFO!I10<4),IF(J10>MAX('MDA1'!M10,MAX('MDA3'!I10,'MDA3'!L10)+MAX('MDA3'!J10,'MDA3'!M10)),MAX('MDA1'!M10,MAX('MDA3'!I10,'MDA3'!L10)+MAX('MDA3'!J10,'MDA3'!M10)),J10),0)","v":0},{"$f":"IF(AND(COUNTRY_INFO!I10>0,COUNTRY_INFO!I10<4), IF(M10/J10*100<>0, IF(M10/J10*100>100,100,M10/J10*100), \"-\"),0)","v":0},{"$f":"COUNTRY_INFO!N10","v":183613.87765234802},null,null,{"$f":"SUM(MAX('MDA2'!J10,'MDA5'!J10, 'T1'!L10, MAX(T3_R1!K10, T3_R2!K10)), MAX('MDA1'!K10, 'MDA2'!K10, 'MDA5'!K10,'T1'!M10, MAX(T3_R1!L10, T3_R2!L10)), MAX('MDA1'!L10, 'MDA2'!L10, 'MDA5'!L10,'T1'!N10, MAX(T3_R1!M10, T3_R2!M10)))","v":341681},{"$f":"IF(AND(COUNTRY_INFO!J10>1,COUNTRY_INFO!J10<4),IF(COUNTRY_INFO!E10>MAX('MDA2'!J10,'MDA5'!J10,'T1'!L10,MAX(T3_R1!K10,T3_R2!K10)),MAX('MDA2'!J10,'MDA5'!J10,'T1'!L10,MAX(T3_R1!K10,T3_R2!K10)),COUNTRY_INFO!E10),0)","v":45797.456781648005},{"$f":"IF(AND(COUNTRY_INFO!J10>1,COUNTRY_INFO!J10<4), IF(T10/COUNTRY_INFO!E10*100<>0, IF(T10/COUNTRY_INFO!E10*100>100,100,T10/COUNTRY_INFO!E10*100), \"-\"),0)","v":100},{"$f":"IF(AND(COUNTRY_INFO!J10>1,COUNTRY_INFO!J10<4),IF(COUNTRY_INFO!F10>MAX('MDA1'!K10,'MDA2'!K10,'MDA5'!K10,'T1'!M10,MAX(T3_R1!L10,T3_R2!L10)),MAX('MDA1'!K10,'MDA2'!K10,'MDA5'!K10,'T1'!M10,MAX(T3_R1!L10,T3_R2!L10)),COUNTRY_INFO!F10),0)","v":116984},{"$f":"IF(AND(COUNTRY_INFO!J10>1,COUNTRY_INFO!J10<4), IF(V10/COUNTRY_INFO!F10*100<>0, IF(V10/COUNTRY_INFO!F10*100>100,100,V10/COUNTRY_INFO!F10*100), \"-\"),0)","v":84.88393419370172},{"$f":"SUM(T10,V10)","v":162781.45678164801},{"$f":"IF(AND(COUNTRY_INFO!J10>1,COUNTRY_INFO!J10<4), IF(S10/P10*100<>0, IF(X10/P10*100>100,100,X10/P10*100), \"-\"),0)","v":88.654223124602908},{"$f":"COUNTRY_INFO!O10","v":87749},null,null,{"$f":"MAX('T1'!L10,'T2'!J10)+MAX('T1'!M10,'T2'!K10)+MAX('T1'!N10,'T2'!L10)","v":206687},{"$f":"IF(COUNTRY_INFO!K10=1,IF(COUNTRY_INFO!F10*0.33>MAX('T1'!M10,'T2'!K10),MAX('T1'!M10,'T2'!K10),COUNTRY_INFO!F10*0.33),IF(COUNTRY_INFO!K10=2,IF(COUNTRY_INFO!F10*0.5>MAX('T1'!M10,'T2'!K10),MAX('T1'!M10,'T2'!K10),COUNTRY_INFO!F10*0.5),IF(COUNTRY_INFO!K10=3,IF(COUNTRY_INFO!F10>MAX('T1'!M10,'T2'!K10),MAX('T1'!M10,'T2'!K10),COUNTRY_INFO!F10),0)))","v":68908.210435350004},{"$f":"IF(AND(COUNTRY_INFO!K10>0,COUNTRY_INFO!K10<4),IF(Z10>0,IF(COUNTRY_INFO!K10=1, AD10/(COUNTRY_INFO!F10*0.33)*100, IF(COUNTRY_INFO!K10=2, AD10/(COUNTRY_INFO!F10*0.5)*100, IF(COUNTRY_INFO!K10=3, AD10/COUNTRY_INFO!F10*100))),\"-\"),0)","v":100},{"$f":"IF(COUNTRY_INFO!K10=2,IF(COUNTRY_INFO!G10*0.2>MAX('T1'!N10,'T2'!L10),MAX('T1'!N10,'T2'!L10),COUNTRY_INFO!G10*0.2),IF(COUNTRY_INFO!K10=3,IF(COUNTRY_INFO!G10>MAX('T1'!N10,'T2'!L10),MAX('T1'!N10,'T2'!L10),COUNTRY_INFO!G10),0))","v":45712.646676496806},{"$f":"IF(AND(COUNTRY_INFO!K10>0,COUNTRY_INFO!K10<4),IF(Z10>0,IF(COUNTRY_INFO!K10=1, 0, IF(COUNTRY_INFO!K10=2, AF10/(COUNTRY_INFO!G10*0.2)*100, IF(COUNTRY_INFO!K10=3, AF10/COUNTRY_INFO!G10*100))),\"-\"),0)","v":100},{"$f":"SUM(AD10,AF10)","v":114620.85711184681},{"$f":"IF(AND(COUNTRY_INFO!K10>0,COUNTRY_INFO!K10<4), IF(AC10/Z10*100<>0, IF(AH10/Z10*100>100,100,AH10/Z10*100), \"-\"),0)","v":100},null,{"$f":"IF(AND(D10<>0, D10<>\"Unknown\",D10<>\"Stopped\",D10<>\"Not required\"),D10/COUNTRY_INFO!D10, 0)","v":0},{"$f":"IF(AND(J10<>0,J10<>\"Unknown\",J10<>\"Stopped\",J10<>\"Not required\"),J10/COUNTRY_INFO!D10, 0)","v":0},{"$f":"IF(AND(P10<>0,P10<>\"Unknown\",P10<>\"Not required\"),P10/(COUNTRY_INFO!E10+COUNTRY_INFO!F10), 0)","v":1},{"$f":"IF(AND(Z10<>0,Z10<>\"Unknown\",Z10<>\"Not required\"),IF(COUNTRY_INFO!K10=1,1,IF(COUNTRY_INFO!K10=2,0.5*COUNTRY_INFO!F10/(0.5*COUNTRY_INFO!F10+0.2*COUNTRY_INFO!G10),IF(COUNTRY_INFO!K10=3,COUNTRY_INFO!F10/(COUNTRY_INFO!F10+COUNTRY_INFO!G10)))),0)","v":0.60118386977432481},{"$f":"IF(AND(Z10<>0,Z10<>\"Unknown\",Z10<>\"Not required\"),IF(COUNTRY_INFO!K10=1,0,IF(COUNTRY_INFO!K10=2,0.2*COUNTRY_INFO!G10/(0.5*COUNTRY_INFO!F10+0.2*COUNTRY_INFO!G10),IF(COUNTRY_INFO!K10=3,COUNTRY_INFO!G10/(COUNTRY_INFO!F10+COUNTRY_INFO!G10)))),0)","v":0.39881613022567519},{"$f":"MAX(COUNTRY_INFO!D10*AK10*PROFILE!$G$7,COUNTRY_INFO!D10*AL10*PROFILE!$G$7)","v":0},{"$f":"MAX(COUNTRY_INFO!D10*AK10*PROFILE!$G$8,COUNTRY_INFO!D10*AL10*PROFILE!$G$8,COUNTRY_INFO!D10*AM10*PROFILE!$G$8)","v":50060.082257540373},{"$f":"MAX(COUNTRY_INFO!D10*AK10*PROFILE!$G$9,COUNTRY_INFO!D10*AL10*PROFILE!$G$9,COUNTRY_INFO!D10*AM10*PROFILE!$G$9,IF(AND(DISTRICT!Z10<>\"Unknown\",Z10<>\"Not required\"),COUNTRY_INFO!O10*DISTRICT!AN10,0))","v":120708.29228910309},{"$f":"MAX(COUNTRY_INFO!D10*AK10*PROFILE!$G$10,COUNTRY_INFO!D10*AL10*PROFILE!$G$10,IF(AND(DISTRICT!Z10<>\"Unknown\",Z10<>\"Not required\"),COUNTRY_INFO!O10*DISTRICT!AO10,0))","v":34995.716611172771},{"$f":"SUM(AP10:AS10)","v":205764.09115781623},{"$f":"IF(COUNTIFS(AK10:AN10,\">0\")=0,0, IF(COUNTIFS(AK10:AN10,\">0\")<=IF(AND(OR(D10>=0,D10=\"Not required\",D10=\"Unknown\",D10=\"Stopped\"),D10>0,H10>0),1,0)+IF(AND(OR(J10>=0,J10=\"Not required\",J10=\"Unknown\",J10=\"Stopped\"),J10>0,N10>0),1,0)+IF(AND(OR(P10>=0,P10=\"Not required\",P10=\"Unknown\"),P10>0,X10>0),1,0)+IF(AND(OR(Z10>=0,Z10=\"Not required\",Z10=\"Unknown\"),Z10>0,AH10>0),1,0),\"Y\",0))","v":"Y"},{"$f":"MAX('MDA2'!J10,'MDA5'!J10,'T1'!L10,'T2'!J10,T3_R1!K10,T3_R2!K10)","v":49984},{"$f":"MAX('MDA1'!K10,'MDA2'!K10,'MDA3'!I10,'MDA3'!L10,'MDA5'!K10,'T1'!M10,'T2'!K10,T3_R1!L10,T3_R2!L10)","v":116984},{"$f":"MAX('MDA1'!L10,'MDA2'!L10,'MDA3'!J10,'MDA3'!M10,'MDA5'!L10,'T1'!N10,'T2'!L10,T3_R1!M10,T3_R2!M10)","v":174713},{"$f":"SUM(AV10:AX10)","v":341681},{"$f":"MAX('MDA2'!J10,'MDA5'!J10,T10)","v":45797.456781648005},{"$f":"MAX('MDA1'!K10,'MDA2'!K10,'MDA3'!I10,'MDA3'!L10,'MDA5'!K10,V10,AD10)","v":116984},{"$f":"MAX('MDA1'!L10,'MDA2'!L10,'MDA3'!J10,'MDA3'!M10,'MDA5'!L10,AF10)","v":45712.646676496806},{"$f":"IF(AT10<SUM(AZ10:BB10), AT10,SUM(AZ10:BB10))","v":205764.09115781623},{"$f":"IF(AT10<>0,BC10/AT10*100,0)","v":100}]
[{"$f":"IF(COUNTRY_INFO!A11=0,\" \",COUNTRY_INFO!A11)","v":"Rwanda"},{"$f":"IF(COUNTRY_INFO!B11=0,\" \",COUNTRY_INFO!B11)","v":"Northern"},{"$f":"IF(COUNTRY_INFO!C11=0,\" \",COUNTRY_INFO!C11)","v":"Gakenke"},{"$f":"COUNTRY_INFO!L11","v":0},null,null,{"$f":"MAX('MDA1'!M11,'MDA2'!M11,'MDA5'!M11)","v":0},{"$f":"IF(AND(COUNTRY_INFO!H11>0,COUNTRY_INFO!H11<4),IF(D11>MAX('MDA1'!M11,'MDA2'!M11,'MDA5'!M11),MAX('MDA1'!M11,'MDA2'!M11,'MDA5'!M11),D11),0)","v":0},{"$f":"IF(AND(COUNTRY_INFO!H11>0,COUNTRY_INFO!H11<4), IF(G11/D11*100<>0, IF(G11/D11*100>100,100,G11/D11*100), \"-\"),0)","v":0},{"$f":"COUNTRY_INFO!M11","v":0},null,null,{"$f":"MAX('MDA1'!M11,MAX('MDA3'!I11,'MDA3'!L11)+MAX('MDA3'!J11,'MDA3'!M11))","v":0},{"$f":"IF(AND(COUNTRY_INFO!I11>0,COUNTRY_INFO!I11<4),IF(J11>MAX('MDA1'!M11,MAX('MDA3'!I11,'MDA3'!L11)+MAX('MDA3'!J11,'MDA3'!M11)),MAX('MDA1'!M11,MAX('MDA3'!I11,'MDA3'!L11)+MAX('MDA3'!J11,'MDA3'!M11)),J11),0)","v":0},{"$f":"IF(AND(COUNTRY_INFO!I11>0,COUNTRY_INFO!I11<4), IF(M11/J11*100<>0, IF(M11/J11*100>100,100,M11/J11*100), \"-\"),0)","v":0},{"$f":"COUNTRY_INFO!N11","v":178766.26361798399},null,null,{"$f":"SUM(MAX('MDA2'!J11,'MDA5'!J11, 'T1'!L11, MAX(T3_R1!K11, T3_R2!K11)), MAX('MDA1'!K11, 'MDA2'!K11, 'MDA5'!K11,'T1'!M11, MAX(T3_R1!L11, T3_R2!L11)), MAX('MDA1'!L11, 'MDA2'!L11, 'MDA5'!L11,'T1'!N11, MAX(T3_R1!M11, T3_R2!M11)))","v":384480},{"$f":"IF(AND(COUNTRY_INFO!J11>1,COUNTRY_INFO!J11<4),IF(COUNTRY_INFO!E11>MAX('MDA2'!J11,'MDA5'!J11,'T1'!L11,MAX(T3_R1!K11,T3_R2!K11)),MAX('MDA2'!J11,'MDA5'!J11,'T1'!L11,MAX(T3_R1!K11,T3_R2!K11)),COUNTRY_INFO!E11),0)","v":43676},{"$f":"IF(AND(COUNTRY_INFO!J11>1,COUNTRY_INFO!J11<4), IF(T11/COUNTRY_INFO!E11*100<>0, IF(T11/COUNTRY_INFO!E11*100>100,100,T11/COUNTRY_INFO!E11*100), \"-\"),0)","v":92.841231136691633},{"$f":"IF(AND(COUNTRY_INFO!J11>1,COUNTRY_INFO!J11<4),IF(COUNTRY_INFO!F11>MAX('MDA1'!K11,'MDA2'!K11,'MDA5'!K11,'T1'!M11,MAX(T3_R1!L11,T3_R2!L11)),MAX('MDA1'!K11,'MDA2'!K11,'MDA5'!K11,'T1'!M11,MAX(T3_R1!L11,T3_R2!L11)),COUNTRY_INFO!F11),0)","v":100548},{"$f":"IF(AND(COUNTRY_INFO!J11>1,COUNTRY_INFO!J11<4), IF(V11/COUNTRY_INFO!F11*100<>0, IF(V11/COUNTRY_INFO!F11*100>100,100,V11/COUNTRY_INFO!F11*100), \"-\"),0)","v":76.333194663398586},144224,{"$f":"IF(AND(COUNTRY_INFO!J11>1,COUNTRY_INFO!J11<4), IF(S11/P11*100<>0, IF(X11/P11*100>100,100,X11/P11*100), \"-\"),0)","v":80.677414787949388},{"$f":"COUNTRY_INFO!O11","v":48990},null,null,{"$f":"MAX('T1'!L11,'T2'!J11)+MAX('T1'!M11,'T2'!K11)+MAX('T1'!N11,'T2'!L11)","v":107537},{"$f":"IF(COUNTRY_INFO!K11=1,IF(COUNTRY_INFO!F11*0.33>MAX('T1'!M11,'T2'!K11),MAX('T1'!M11,'T2'!K11),COUNTRY_INFO!F11*0.33),IF(COUNTRY_INFO!K11=2,IF(COUNTRY_INFO!F11*0.5>MAX('T1'!M11,'T2'!K11),MAX('T1'!M11,'T2'!K11),COUNTRY_INFO!F11*0.5),IF(COUNTRY_INFO!K11=3,IF(COUNTRY_INFO!F11>MAX('T1'!M11,'T2'!K11),MAX('T1'!M11,'T2'!K11),COUNTRY_INFO!F11),0)))","v":36283},{"$f":"IF(AND(COUNTRY_INFO!K11>0,COUNTRY_INFO!K11<4),IF(Z11>0,IF(COUNTRY_INFO!K11=1, AD11/(COUNTRY_INFO!F11*0.33)*100, IF(COUNTRY_INFO!K11=2, AD11/(COUNTRY_INFO!F11*0.5)*100, IF(COUNTRY_INFO!K11=3, AD11/COUNTRY_INFO!F11*100))),\"-\"),0)","v":55.090052551459813},{"$f":"IF(COUNTRY_INFO!K11=2,IF(COUNTRY_INFO!G11*0.2>MAX('T1'!N11,'T2'!L11),MAX('T1'!N11,'T2'!L11),COUNTRY_INFO!G11*0.2),IF(COUNTRY_INFO!K11=3,IF(COUNTRY_INFO!G11>MAX('T1'!N11,'T2'!L11),MAX('T1'!N11,'T2'!L11),COUNTRY_INFO!G11),0))","v":51613.718217523194},{"$f":"IF(AND(COUNTRY_INFO!K11>0,COUNTRY_INFO!K11<4),IF(Z11>0,IF(COUNTRY_INFO!K11=1, 0, IF(COUNTRY_INFO!K11=2, AF11/(COUNTRY_INFO!G11*0.2)*100, IF(COUNTRY_INFO!K11=3, AF11/COUNTRY_INFO!G11*100))),\"-\"),0)","v":100},87896.718217523186,{"$f":"IF(AND(COUNTRY_INFO!K11>0,COUNTRY_INFO!K11<4), IF(AC11/Z11*100<>0, IF(AH11/Z11*100>100,100,AH11/Z11*100), \"-\"),0)","v":100},null,{"$f":"IF(AND(D11<>0, D11<>\"Unknown\",D11<>\"Stopped\",D11<>\"Not required\"),D11/COUNTRY_INFO!D11, 0)","v":0},{"$f":"IF(AND(J11<>0,J11<>\"Unknown\",J11<>\"Stopped\",J11<>\"Not required\"),J11/COUNTRY_INFO!D11, 0)","v":0},{"$f":"IF(AND(P11<>0,P11<>\"Unknown\",P11<>\"Not required\"),P11/(COUNTRY_INFO!E11+COUNTRY_INFO!F11), 0)","v":1},{"$f":"IF(AND(Z11<>0,Z11<>\"Unknown\",Z11<>\"Not required\"),IF(COUNTRY_INFO!K11=1,1,IF(COUNTRY_INFO!K11=2,0.5*COUNTRY_INFO!F11/(0.5*COUNTRY_INFO!F11+0.2*COUNTRY_INFO!G11),IF(COUNTRY_INFO!K11=3,COUNTRY_INFO!F11/(COUNTRY_INFO!F11+COUNTRY_INFO!G11)))),0)","v":0.56064073226544631},{"$f":"IF(AND(Z11<>0,Z11<>\"Unknown\",Z11<>\"Not required\"),IF(COUNTRY_INFO!K11=1,0,IF(COUNTRY_INFO!K11=2,0.2*COUNTRY_INFO!G11/(0.5*COUNTRY_INFO!F11+0.2*COUNTRY_INFO!G11),IF(COUNTRY_INFO!K11=3,COUNTRY_INFO!G11/(COUNTRY_INFO!F11+COUNTRY_INFO!G11)))),0)","v":0.4393592677345538},{"$f":"MAX(COUNTRY_INFO!D11*AK11*PROFILE!$G$7,COUNTRY_INFO!D11*AL11*PROFILE!$G$7)","v":0},{"$f":"MAX(COUNTRY_INFO!D11*AK11*PROFILE!$G$8,COUNTRY_INFO!D11*AL11*PROFILE!$G$8,COUNTRY_INFO!D11*AM11*PROFILE!$G$8)","v":52891.589699217046},{"$f":"MAX(COUNTRY_INFO!D11*AK11*PROFILE!$G$9,COUNTRY_INFO!D11*AL11*PROFILE!$G$9,COUNTRY_INFO!D11*AM11*PROFILE!$G$9,IF(AND(DISTRICT!Z11<>\"Unknown\",Z11<>\"Not required\"),COUNTRY_INFO!O11*DISTRICT!AN11,0))","v":127535.81658541397},{"$f":"MAX(COUNTRY_INFO!D11*AK11*PROFILE!$G$10,COUNTRY_INFO!D11*AL11*PROFILE!$G$10,IF(AND(DISTRICT!Z11<>\"Unknown\",Z11<>\"Not required\"),COUNTRY_INFO!O11*DISTRICT!AO11,0))","v":21524.21052631579},201951.61681094678,"Y",{"$f":"MAX('MDA2'!J11,'MDA5'!J11,'T1'!L11,'T2'!J11,T3_R1!K11,T3_R2!K11)","v":43676},{"$f":"MAX('MDA1'!K11,'MDA2'!K11,'MDA3'!I11,'MDA3'!L11,'MDA5'!K11,'T1'!M11,'T2'!K11,T3_R1!L11,T3_R2!L11)","v":100548},{"$f":"MAX('MDA1'!L11,'MDA2'!L11,'MDA3'!J11,'MDA3'!M11,'MDA5'!L11,'T1'!N11,'T2'!L11,T3_R1!M11,T3_R2!M11)","v":240256},384480,{"$f":"MAX('MDA2'!J11,'MDA5'!J11,T11)","v":43676},{"$f":"MAX('MDA1'!K11,'MDA2'!K11,'MDA3'!I11,'MDA3'!L11,'MDA5'!K11,V11,AD11)","v":100548},{"$f":"MAX('MDA1'!L11,'MDA2'!L11,'MDA3'!J11,'MDA3'!M11,'MDA5'!L11,AF11)","v":51613.718217523194},195837.71821752319,96.972592401106155]
[{"$f":"IF(COUNTRY_INFO!A12=0,\" \",COUNTRY_INFO!A12)","v":"Rwanda"},{"$f":"IF(COUNTRY_INFO!B12=0,\" \",COUNTRY_INFO!B12)","v":"Kigali"},{"$f":"IF(COUNTRY_INFO!C12=0,\" \",COUNTRY_INFO!C12)","v":"Gasabo"},{"$f":"COUNTRY_INFO!L12","v":0},null,null,{"$f":"MAX('MDA1'!M12,'MDA2'!M12,'MDA5'!M12)","v":0},{"$f":"IF(AND(COUNTRY_INFO!H12>0,COUNTRY_INFO!H12<4),IF(D12>MAX('MDA1'!M12,'MDA2'!M12,'MDA5'!M12),MAX('MDA1'!M12,'MDA2'!M12,'MDA5'!M12),D12),0)","v":0},{"$f":"IF(AND(COUNTRY_INFO!H12>0,COUNTRY_INFO!H12<4), IF(G12/D12*100<>0, IF(G12/D12*100>100,100,G12/D12*100), \"-\"),0)","v":0},{"$f":"COUNTRY_INFO!M12","v":0},null,null,{"$f":"MAX('MDA1'!M12,MAX('MDA3'!I12,'MDA3'!L12)+MAX('MDA3'!J12,'MDA3'!M12))","v":0},{"$f":"IF(AND(COUNTRY_INFO!I12>0,COUNTRY_INFO!I12<4),IF(J12>MAX('MDA1'!M12,MAX('MDA3'!I12,'MDA3'!L12)+MAX('MDA3'!J12,'MDA3'!M12)),MAX('MDA1'!M12,MAX('MDA3'!I12,'MDA3'!L12)+MAX('MDA3'!J12,'MDA3'!M12)),J12),0)","v":0},{"$f":"IF(AND(COUNTRY_INFO!I12>0,COUNTRY_INFO!I12<4), IF(M12/J12*100<>0, IF(M12/J12*100>100,100,M12/J12*100), \"-\"),0)","v":0},{"$f":"COUNTRY_INFO!N12","v":220836.14310250798},null,null,{"$f":"SUM(MAX('MDA2'!J12,'MDA5'!J12, 'T1'!L12, MAX(T3_R1!K12, T3_R2!K12)), MAX('MDA1'!K12, 'MDA2'!K12, 'MDA5'!K12,'T1'!M12, MAX(T3_R1!L12, T3_R2!L12)), MAX('MDA1'!L12, 'MDA2'!L12, 'MDA5'!L12,'T1'!N12, MAX(T3_R1!M12, T3_R2!M12)))","v":379239},{"$f":"IF(AND(COUNTRY_INFO!J12>1,COUNTRY_INFO!J12<4),IF(COUNTRY_INFO!E12>MAX('MDA2'!J12,'MDA5'!J12,'T1'!L12,MAX(T3_R1!K12,T3_R2!K12)),MAX('MDA2'!J12,'MDA5'!J12,'T1'!L12,MAX(T3_R1!K12,T3_R2!K12)),COUNTRY_INFO!E12),0)","v":75391.190847684004},{"$f":"IF(AND(COUNTRY_INFO!J12>1,COUNTRY_INFO!J12<4), IF(T12/COUNTRY_INFO!E12*100<>0, IF(T12/COUNTRY_INFO!E12*100>100,100,T12/COUNTRY_INFO!E12*100), \"-\"),0)","v":100},{"$f":"IF(AND(COUNTRY_INFO!J12>1,COUNTRY_INFO!J12<4),IF(COUNTRY_INFO!F12>MAX('MDA1'!K12,'MDA2'!K12,'MDA5'!K12,'T1'!M12,MAX(T3_R1!L12,T3_R2!L12)),MAX('MDA1'!K12,'MDA2'!K12,'MDA5'!K12,'T1'!M12,MAX(T3_R1!L12,T3_R2!L12)),COUNTRY_INFO!F12),0)","v":145444.95225482399},{"$f":"IF(AND(COUNTRY_INFO!J12>1,COUNTRY_INFO!J12<4), IF(V12/COUNTRY_INFO!F12*100<>0, IF(V12/COUNTRY_INFO!F12*100>100,100,V12/COUNTRY_INFO!F12*100), \"-\"),0)","v":100},220836.14310250798,{"$f":"IF(AND(COUNTRY_INFO!J12>1,COUNTRY_INFO!J12<4), IF(S12/P12*100<>0, IF(X12/P12*100>100,100,X12/P12*100), \"-\"),0)","v":100},{"$f":"COUNTRY_INFO!O12","v":47979},null,null,{"$f":"MAX('T1'!L12,'T2'!J12)+MAX('T1'!M12,'T2'!K12)+MAX('T1'!N12,'T2'!L12)","v":0},{"$f":"IF(COUNTRY_INFO!K12=1,IF(COUNTRY_INFO!F12*0.33>MAX('T1'!M12,'T2'!K12),MAX('T1'!M12,'T2'!K12),COUNTRY_INFO!F12*0.33),IF(COUNTRY_INFO!K12=2,IF(COUNTRY_INFO!F12*0.5>MAX('T1'!M12,'T2'!K12),MAX('T1'!M12,'T2'!K12),COUNTRY_INFO!F12*0.5),IF(COUNTRY_INFO!K12=3,IF(COUNTRY_INFO!F12>MAX('T1'!M12,'T2'!K12),MAX('T1'!M12,'T2'!K12),COUNTRY_INFO!F12),0)))","v":0},{"$f":"IF(AND(COUNTRY_INFO!K12>0,COUNTRY_INFO!K12<4),IF(Z12>0,IF(COUNTRY_INFO!K12=1, AD12/(COUNTRY_INFO!F12*0.33)*100, IF(COUNTRY_INFO!K12=2, AD12/(COUNTRY_INFO!F12*0.5)*100, IF(COUNTRY_INFO!K12=3, AD12/COUNTRY_INFO!F12*100))),\"-\"),0)","v":0},{"$f":"IF(COUNTRY_INFO!K12=2,IF(COUNTRY_INFO!G12*0.2>MAX('T1'!N12,'T2'!L12),MAX('T1'!N12,'T2'!L12),COUNTRY_INFO!G12*0.2),IF(COUNTRY_INFO!K12=3,IF(COUNTRY_INFO!G12>MAX('T1'!N12,'T2'!L12),MAX('T1'!N12,'T2'!L12),COUNTRY_INFO!G12),0))","v":0},{"$f":"IF(AND(COUNTRY_INFO!K12>0,COUNTRY_INFO!K12<4),IF(Z12>0,IF(COUNTRY_INFO!K12=1, 0, IF(COUNTRY_INFO!K12=2, AF12/(COUNTRY_INFO!G12*0.2)*100, IF(COUNTRY_INFO!K12=3, AF12/COUNTRY_INFO!G12*100))),\"-\"),0)","v":0},0,{"$f":"IF(AND(COUNTRY_INFO!K12>0,COUNTRY_INFO!K12<4), IF(AC12/Z12*100<>0, IF(AH12/Z12*100>100,100,AH12/Z12*100), \"-\"),0)","v":"-"},null,{"$f":"IF(AND(D12<>0, D12<>\"Unknown\",D12<>\"Stopped\",D12<>\"Not required\"),D12/COUNTRY_INFO!D12, 0)","v":0},{"$f":"IF(AND(J12<>0,J12<>\"Unknown\",J12<>\"Stopped\",J12<>\"Not required\"),J12/COUNTRY_INFO!D12, 0)","v":0},{"$f":"IF(AND(P12<>0,P12<>\"Unknown\",P12<>\"Not required\"),P12/(COUNTRY_INFO!E12+COUNTRY_INFO!F12), 0)","v":1},{"$f":"IF(AND(Z12<>0,Z12<>\"Unknown\",Z12<>\"Not required\"),IF(COUNTRY_INFO!K12=1,1,IF(COUNTRY_INFO!K12=2,0.5*COUNTRY_INFO!F12/(0.5*COUNTRY_INFO!F12+0.2*COUNTRY_INFO!G12),IF(COUNTRY_INFO!K12=3,COUNTRY_INFO!F12/(COUNTRY_INFO!F12+COUNTRY_INFO!G12)))),0)","v":1},{"$f":"IF(AND(Z12<>0,Z12<>\"Unknown\",Z12<>\"Not required\"),IF(COUNTRY_INFO!K12=1,0,IF(COUNTRY_INFO!K12=2,0.2*COUNTRY_INFO!G12/(0.5*COUNTRY_INFO!F12+0.2*COUNTRY_INFO!G12),IF(COUNTRY_INFO!K12=3,COUNTRY_INFO!G12/(COUNTRY_INFO!F12+COUNTRY_INFO!G12)))),0)","v":0},{"$f":"MAX(COUNTRY_INFO!D12*AK12*PROFILE!$G$7,COUNTRY_INFO!D12*AL12*PROFILE!$G$7)","v":0},{"$f":"MAX(COUNTRY_INFO!D12*AK12*PROFILE!$G$8,COUNTRY_INFO!D12*AL12*PROFILE!$G$8,COUNTRY_INFO!D12*AM12*PROFILE!$G$8)","v":78761.887030177139},{"$f":"MAX(COUNTRY_INFO!D12*AK12*PROFILE!$G$9,COUNTRY_INFO!D12*AL12*PROFILE!$G$9,COUNTRY_INFO!D12*AM12*PROFILE!$G$9,IF(AND(DISTRICT!Z12<>\"Unknown\",Z12<>\"Not required\"),COUNTRY_INFO!O12*DISTRICT!AN12,0))","v":189916.04592195613},{"$f":"MAX(COUNTRY_INFO!D12*AK12*PROFILE!$G$10,COUNTRY_INFO!D12*AL12*PROFILE!$G$10,IF(AND(DISTRICT!Z12<>\"Unknown\",Z12<>\"Not required\"),COUNTRY_INFO!O12*DISTRICT!AO12,0))","v":0},268677.93295213324,0,{"$f":"MAX('MDA2'!J12,'MDA5'!J12,'T1'!L12,'T2'!J12,T3_R1!K12,T3_R2!K12)","v":80597},{"$f":"MAX('MDA1'!K12,'MDA2'!K12,'MDA3'!I12,'MDA3'!L12,'MDA5'!K12,'T1'!M12,'T2'!K12,T3_R1!L12,T3_R2!L12)","v":197626},{"$f":"MAX('MDA1'!L12,'MDA2'!L12,'MDA3'!J12,'MDA3'!M12,'MDA5'!L12,'T1'!N12,'T2'!L12,T3_R1!M12,T3_R2!M12)","v":101016},379239,{"$f":"MAX('MDA2'!J12,'MDA5'!J12,T12)","v":75391.190847684004},{"$f":"MAX('MDA1'!K12,'MDA2'!K12,'MDA3'!I12,'MDA3'!L12,'MDA5'!K12,V12,AD12)","v":145444.95225482399},{"$f":"MAX('MDA1'!L12,'MDA2'!L12,'MDA3'!J12,'MDA3'!M12,'MDA5'!L12,AF12)","v":0},220836.14310250798,82.193628883489808]
[{"$f":"IF(COUNTRY_INFO!A13=0,\" \",COUNTRY_INFO!A13)","v":"Rwanda"},{"$f":"IF(COUNTRY_INFO!B13=0,\" \",COUNTRY_INFO!B13)","v":"Eastern"},{"$f":"IF(COUNTRY_INFO!C13=0,\" \",COUNTRY_INFO!C13)","v":"Gatsibo"},{"$f":"COUNTRY_INFO!L13","v":0},null,null,{"$f":"MAX('MDA1'!M13,'MDA2'!M13,'MDA5'!M13)","v":0},{"$f":"IF(AND(COUNTRY_INFO!H13>0,COUNTRY_INFO!H13<4),IF(D13>MAX('MDA1'!M13,'MDA2'!M13,'MDA5'!M13),MAX('MDA1'!M13,'MDA2'!M13,'MDA5'!M13),D13),0)","v":0},{"$f":"IF(AND(COUNTRY_INFO!H13>0,COUNTRY_INFO!H13<4), IF(G13/D13*100<>0, IF(G13/D13*100>100,100,G13/D13*100), \"-\"),0)","v":0},{"$f":"COUNTRY_INFO!M13","v":0},null,null,{"$f":"MAX('MDA1'!M13,MAX('MDA3'!I13,'MDA3'!L13)+MAX('MDA3'!J13,'MDA3'!M13))","v":0},{"$f":"IF(AND(COUNTRY_INFO!I13>0,COUNTRY_INFO!I13<4),IF(J13>MAX('MDA1'!M13,MAX('MDA3'!I13,'MDA3'!L13)+MAX('MDA3'!J13,'MDA3'!M13)),MAX('MDA1'!M13,MAX('MDA3'!I13,'MDA3'!L13)+MAX('MDA3'!J13,'MDA3'!M13)),J13),0)","v":0},{"$f":"IF(AND(COUNTRY_INFO!I13>0,COUNTRY_INFO!I13<4), IF(M13/J13*100<>0, IF(M13/J13*100>100,100,M13/J13*100), \"-\"),0)","v":0},{"$f":"COUNTRY_INFO!N13","v":221039.73800963999},null,null,{"$f":"SUM(MAX('MDA2'!J13,'MDA5'!J13, 'T1'!L13, MAX(T3_R1!K13, T3_R2!K13)), MAX('MDA1'!K13, 'MDA2'!K13, 'MDA5'!K13,'T1'!M13, MAX(T3_R1!L13, T3_R2!L13)), MAX('MDA1'!L13, 'MDA2'!L13, 'MDA5'!L13,'T1'!N13, MAX(T3_R1!M13, T3_R2!M13)))","v":477894},{"$f":"IF(AND(COUNTRY_INFO!J13>1,COUNTRY_INFO!J13<4),IF(COUNTRY_INFO!E13>MAX('MDA2'!J13,'MDA5'!J13,'T1'!L13,MAX(T3_R1!K13,T3_R2!K13)),MAX('MDA2'!J13,'MDA5'!J13,'T1'!L13,MAX(T3_R1!K13,T3_R2!K13)),COUNTRY_INFO!E13),0)","v":63593.799334559997},{"$f":"IF(AND(COUNTRY_INFO!J13>1,COUNTRY_INFO!J13<4), IF(T13/COUNTRY_INFO!E13*100<>0, IF(T13/COUNTRY_INFO!E13*100>100,100,T13/COUNTRY_INFO!E13*100), \"-\"),0)","v":100},{"$f":"IF(AND(COUNTRY_INFO!J13>1,COUNTRY_INFO!J13<4),IF(COUNTRY_INFO!F13>MAX('MDA1'!K13,'MDA2'!K13,'MDA5'!K13,'T1'!M13,MAX(T3_R1!L13,T3_R2!L13)),MAX('MDA1'!K13,'MDA2'!K13,'MDA5'!K13,'T1'!M13,MAX(T3_R1!L13,T3_R2!L13)),COUNTRY_INFO!F13),0)","v":157445.93867507999},{"$f":"IF(AND(COUNTRY_INFO!J13>1,COUNTRY_INFO!J13<4), IF(V13/COUNTRY_INFO!F13*100<>0, IF(V13/COUNTRY_INFO!F13*100>100,100,V13/COUNTRY_INFO!F13*100), \"-\"),0)","v":100},221039.73800963999,{"$f":"IF(AND(COUNTRY_INFO!J13>1,COUNTRY_INFO!J13<4), IF(S13/P13*100<>0, IF(X13/P13*100>100,100,X13/P13*100), \"-\"),0)","v":100},{"$f":"COUNTRY_INFO!O13","v":45277},null,null,{"$f":"MAX('T1'!L13,'T2'!J13)+MAX('T1'!M13,'T2'!K13)+MAX('T1'!N13,'T2'!L13)","v":57309},{"$f":"IF(COUNTRY_INFO!K13=1,IF(COUNTRY_INFO!F13*0.33>MAX('T1'!M13,'T2'!K13),MAX('T1'!M13,'T2'!K13),COUNTRY_INFO!F13*0.33),IF(COUNTRY_INFO!K13=2,IF(COUNTRY_INFO!F13*0.5>MAX('T1'!M13,'T2'!K13),MAX('T1'!M13,'T2'!K13),COUNTRY_INFO!F13*0.5),IF(COUNTRY_INFO!K13=3,IF(COUNTRY_INFO!F13>MAX('T1'!M13,'T2'!K13),MAX('T1'!M13,'T2'!K13),COUNTRY_INFO!F13),0)))","v":21485},{"$f":"IF(AND(COUNTRY_INFO!K13>0,COUNTRY_INFO!K13<4),IF(Z13>0,IF(COUNTRY_INFO!K13=1, AD13/(COUNTRY_INFO!F13*0.33)*100, IF(COUNTRY_INFO!K13=2, AD13/(COUNTRY_INFO!F13*0.5)*100, IF(COUNTRY_INFO!K13=3, AD13/COUNTRY_INFO!F13*100))),\"-\"),0)","v":27.291907534481957},{"$f":"IF(COUNTRY_INFO!K13=2,IF(COUNTRY_INFO!G13*0.2>MAX('T1'!N13,'T2'!L13),MAX('T1'!N13,'T2'!L13),COUNTRY_INFO!G13*0.2),IF(COUNTRY_INFO!K13=3,IF(COUNTRY_INFO!G13>MAX('T1'!N13,'T2'!L13),MAX('T1'!N13,'T2'!L13),COUNTRY_INFO!G13),0))","v":35824},{"$f":"IF(AND(COUNTRY_INFO!K13>0,COUNTRY_INFO!K13<4),IF(Z13>0,IF(COUNTRY_INFO!K13=1, 0, IF(COUNTRY_INFO!K13=2, AF13/(COUNTRY_INFO!G13*0.2)*100, IF(COUNTRY_INFO!K13=3, AF13/COUNTRY_INFO!G13*100))),\"-\"),0)","v":64.678097062375869},57309,{"$f":"IF(AND(COUNTRY_INFO!K13>0,COUNTRY_INFO!K13<4), IF(AC13/Z13*100<>0, IF(AH13/Z13*100>100,100,AH13/Z13*100), \"-\"),0)","v":100},null,{"$f":"IF(AND(D13<>0, D13<>\"Unknown\",D13<>\"Stopped\",D13<>\"Not required\"),D13/COUNTRY_INFO!D13, 0)","v":0},{"$f":"IF(AND(J13<>0,J13<>\"Unknown\",J13<>\"Stopped\",J13<>\"Not required\"),J13/COUNTRY_INFO!D13, 0)","v":0},{"$f":"IF(AND(P13<>0,P13<>\"Unknown\",P13<>\"Not required\"),P13/(COUNTRY_INFO!E13+COUNTRY_INFO!F13), 0)","v":1},{"$f":"IF(AND(Z13<>0,Z13<>\"Unknown\",Z13<>\"Not required\"),IF(COUNTRY_INFO!K13=1,1,IF(COUNTRY_INFO!K13=2,0.5*COUNTRY_INFO!F13/(0.5*COUNTRY_INFO!F13+0.2*COUNTRY_INFO!G13),IF(COUNTRY_INFO!K13=3,COUNTRY_INFO!F13/(COUNTRY_INFO!F13+COUNTRY_INFO!G13)))),0)","v":0.5869980879541109},{"$f":"IF(AND(Z13<>0,Z13<>\"Unknown\",Z13<>\"Not required\"),IF(COUNTRY_INFO!K13=1,0,IF(COUNTRY_INFO!K13=2,0.2*COUNTRY_INFO!G13/(0.5*COUNTRY_INFO!F13+0.2*COUNTRY_INFO!G13),IF(COUNTRY_INFO!K13=3,COUNTRY_INFO!G13/(COUNTRY_INFO!F13+COUNTRY_INFO!G13)))),0)","v":0.41300191204588915},{"$f":"MAX(COUNTRY_INFO!D13*AK13*PROFILE!$G$7,COUNTRY_INFO!D13*AL13*PROFILE!$G$7)","v":0},{"$f":"MAX(COUNTRY_INFO!D13*AK13*PROFILE!$G$8,COUNTRY_INFO!D13*AL13*PROFILE!$G$8,COUNTRY_INFO!D13*AM13*PROFILE!$G$8)","v":60543.432543798997},{"$f":"MAX(COUNTRY_INFO!D13*AK13*PROFILE!$G$9,COUNTRY_INFO!D13*AL13*PROFILE!$G$9,COUNTRY_INFO!D13*AM13*PROFILE!$G$9,IF(AND(DISTRICT!Z13<>\"Unknown\",Z13<>\"Not required\"),COUNTRY_INFO!O13*DISTRICT!AN13,0))","v":145986.46310817223},{"$f":"MAX(COUNTRY_INFO!D13*AK13*PROFILE!$G$10,COUNTRY_INFO!D13*AL13*PROFILE!$G$10,IF(AND(DISTRICT!Z13<>\"Unknown\",Z13<>\"Not required\"),COUNTRY_INFO!O13*DISTRICT!AO13,0))","v":18699.487571701724},225229.38322367295,"Y",{"$f":"MAX('MDA2'!J13,'MDA5'!J13,'T1'!L13,'T2'!J13,T3_R1!K13,T3_R2!K13)","v":74530},{"$f":"MAX('MDA1'!K13,'MDA2'!K13,'MDA3'!I13,'MDA3'!L13,'MDA5'!K13,'T1'!M13,'T2'!K13,T3_R1!L13,T3_R2!L13)","v":161816},{"$f":"MAX('MDA1'!L13,'MDA2'!L13,'MDA3'!J13,'MDA3'!M13,'MDA5'!L13,'T1'!N13,'T2'!L13,T3_R1!M13,T3_R2!M13)","v":241548},477894,{"$f":"MAX('MDA2'!J13,'MDA5'!J13,T13)","v":63593.799334559997},{"$f":"MAX('MDA1'!K13,'MDA2'!K13,'MDA3'!I13,'MDA3'!L13,'MDA5'!K13,V13,AD13)","v":157445.93867507999},{"$f":"MAX('MDA1'!L13,'MDA2'!L13,'MDA3'!J13,'MDA3'!M13,'MDA5'!L13,AF13)","v":35824},225229.38322367295,100]
[{"$f":"IF(COUNTRY_INFO!A14=0,\" \",COUNTRY_INFO!A14)","v":"Rwanda"},{"$f":"IF(COUNTRY_INFO!B14=0,\" \",COUNTRY_INFO!B14)","v":"Northern"},{"$f":"IF(COUNTRY_INFO!C14=0,\" \",COUNTRY_INFO!C14)","v":"Gicumbi"},{"$f":"COUNTRY_INFO!L14","v":0},null,null,{"$f":"MAX('MDA1'!M14,'MDA2'!M14,'MDA5'!M14)","v":0},{"$f":"IF(AND(COUNTRY_INFO!H14>0,COUNTRY_INFO!H14<4),IF(D14>MAX('MDA1'!M14,'MDA2'!M14,'MDA5'!M14),MAX('MDA1'!M14,'MDA2'!M14,'MDA5'!M14),D14),0)","v":0},{"$f":"IF(AND(COUNTRY_INFO!H14>0,COUNTRY_INFO!H14<4), IF(G14/D14*100<>0, IF(G14/D14*100>100,100,G14/D14*100), \"-\"),0)","v":0},{"$f":"COUNTRY_INFO!M14","v":0},null,null,{"$f":"MAX('MDA1'!M14,MAX('MDA3'!I14,'MDA3'!L14)+MAX('MDA3'!J14,'MDA3'!M14))","v":0},{"$f":"IF(AND(COUNTRY_INFO!I14>0,COUNTRY_INFO!I14<4),IF(J14>MAX('MDA1'!M14,MAX('MDA3'!I14,'MDA3'!L14)+MAX('MDA3'!J14,'MDA3'!M14)),MAX('MDA1'!M14,MAX('MDA3'!I14,'MDA3'!L14)+MAX('MDA3'!J14,'MDA3'!M14)),J14),0)","v":0},{"$f":"IF(AND(COUNTRY_INFO!I14>0,COUNTRY_INFO!I14<4), IF(M14/J14*100<>0, IF(M14/J14*100>100,100,M14/J14*100), \"-\"),0)","v":0},{"$f":"COUNTRY_INFO!N14","v":206343.25679167203},null,null,{"$f":"SUM(MAX('MDA2'!J14,'MDA5'!J14, 'T1'!L14, MAX(T3_R1!K14, T3_R2!K14)), MAX('MDA1'!K14, 'MDA2'!K14, 'MDA5'!K14,'T1'!M14, MAX(T3_R1!L14, T3_R2!L14)), MAX('MDA1'!L14, 'MDA2'!L14, 'MDA5'!L14,'T1'!N14, MAX(T3_R1!M14, T3_R2!M14)))","v":470140},{"$f":"IF(AND(COUNTRY_INFO!J14>1,COUNTRY_INFO!J14<4),IF(COUNTRY_INFO!E14>MAX('MDA2'!J14,'MDA5'!J14,'T1'!L14,MAX(T3_R1!K14,T3_R2!K14)),MAX('MDA2'!J14,'MDA5'!J14,'T1'!L14,MAX(T3_R1!K14,T3_R2!K14)),COUNTRY_INFO!E14),0)","v":52333.434693540003},{"$f":"IF(AND(COUNTRY_INFO!J14>1,COUNTRY_INFO!J14<4), IF(T14/COUNTRY_INFO!E14*100<>0, IF(T14/COUNTRY_INFO!E14*100>100,100,T14/COUNTRY_INFO!E14*100), \"-\"),0)","v":100},{"$f":"IF(AND(COUNTRY_INFO!J14>1,COUNTRY_INFO!J14<4),IF(COUNTRY_INFO!F14>MAX('MDA1'!K14,'MDA2'!K14,'MDA5'!K14,'T1'!M14,MAX(T3_R1!L14,T3_R2!L14)),MAX('MDA1'!K14,'MDA2'!K14,'MDA5'!K14,'T1'!M14,MAX(T3_R1!L14,T3_R2!L14)),COUNTRY_INFO!F14),0)","v":130079},{"$f":"IF(AND(COUNTRY_INFO!J14>1,COUNTRY_INFO!J14<4), IF(V14/COUNTRY_INFO!F14*100<>0, IF(V14/COUNTRY_INFO!F14*100>100,100,V14/COUNTRY_INFO!F14*100), \"-\"),0)","v":84.46149617465062},182412.43469354001,{"$f":"IF(AND(COUNTRY_INFO!J14>1,COUNTRY_INFO!J14<4), IF(S14/P14*100<>0, IF(X14/P14*100>100,100,X14/P14*100), \"-\"),0)","v":88.402421057891402},{"$f":"COUNTRY_INFO!O14","v":24456},null,null,{"$f":"MAX('T1'!L14,'T2'!J14)+MAX('T1'!M14,'T2'!K14)+MAX('T1'!N14,'T2'!L14)","v":65031},{"$f":"IF(COUNTRY_INFO!K14=1,IF(COUNTRY_INFO!F14*0.33>MAX('T1'!M14,'T2'!K14),MAX('T1'!M14,'T2'!K14),COUNTRY_INFO!F14*0.33),IF(COUNTRY_INFO!K14=2,IF(COUNTRY_INFO!F14*0.5>MAX('T1'!M14,'T2'!K14),MAX('T1'!M14,'T2'!K14),COUNTRY_INFO!F14*0.5),IF(COUNTRY_INFO!K14=3,IF(COUNTRY_INFO!F14>MAX('T1'!M14,'T2'!K14),MAX('T1'!M14,'T2'!K14),COUNTRY_INFO!F14),0)))","v":21296},{"$f":"IF(AND(COUNTRY_INFO!K14>0,COUNTRY_INFO!K14<4),IF(Z14>0,IF(COUNTRY_INFO!K14=1, AD14/(COUNTRY_INFO!F14*0.33)*100, IF(COUNTRY_INFO!K14=2, AD14/(COUNTRY_INFO!F14*0.5)*100, IF(COUNTRY_INFO!K14=3, AD14/COUNTRY_INFO!F14*100))),\"-\"),0)","v":27.655379000997232},{"$f":"IF(COUNTRY_INFO!K14=2,IF(COUNTRY_INFO!G14*0.2>MAX('T1'!N14,'T2'!L14),MAX('T1'!N14,'T2'!L14),COUNTRY_INFO!G14*0.2),IF(COUNTRY_INFO!K14=3,IF(COUNTRY_INFO!G14>MAX('T1'!N14,'T2'!L14),MAX('T1'!N14,'T2'!L14),COUNTRY_INFO!G14),0))","v":43735},{"$f":"IF(AND(COUNTRY_INFO!K14>0,COUNTRY_INFO!K14<4),IF(Z14>0,IF(COUNTRY_INFO!K14=1, 0, IF(COUNTRY_INFO!K14=2, AF14/(COUNTRY_INFO!G14*0.2)*100, IF(COUNTRY_INFO!K14=3, AF14/COUNTRY_INFO!G14*100))),\"-\"),0)","v":78.486938216634883},65031,{"$f":"IF(AND(COUNTRY_INFO!K14>0,COUNTRY_INFO!K14<4), IF(AC14/Z14*100<>0, IF(AH14/Z14*100>100,100,AH14/Z14*100), \"-\"),0)","v":100},null,{"$f":"IF(AND(D14<>0, D14<>\"Unknown\",D14<>\"Stopped\",D14<>\"Not required\"),D14/COUNTRY_INFO!D14, 0)","v":0},{"$f":"IF(AND(J14<>0,J14<>\"Unknown\",J14<>\"Stopped\",J14<>\"Not required\"),J14/COUNTRY_INFO!D14, 0)","v":0},{"$f":"IF(AND(P14<>0,P14<>\"Unknown\",P14<>\"Not required\"),P14/(COUNTRY_INFO!E14+COUNTRY_INFO!F14), 0)","v":1},{"$f":"IF(AND(Z14<>0,Z14<>\"Unknown\",Z14<>\"Not required\"),IF(COUNTRY_INFO!K14=1,1,IF(COUNTRY_INFO!K14=2,0.5*COUNTRY_INFO!F14/(0.5*COUNTRY_INFO!F14+0.2*COUNTRY_INFO!G14),IF(COUNTRY_INFO!K14=3,COUNTRY_INFO!F14/(COUNTRY_INFO!F14+COUNTRY_INFO!G14)))),0)","v":0.58017273751408172},{"$f":"IF(AND(Z14<>0,Z14<>\"Unknown\",Z14<>\"Not required\"),IF(COUNTRY_INFO!K14=1,0,IF(COUNTRY_INFO!K14=2,0.2*COUNTRY_INFO!G14/(0.5*COUNTRY_INFO!F14+0.2*COUNTRY_INFO!G14),IF(COUNTRY_INFO!K14=3,COUNTRY_INFO!G14/(COUNTRY_INFO!F14+COUNTRY_INFO!G14)))),0)","v":0.41982726248591812},{"$f":"MAX(COUNTRY_INFO!D14*AK14*PROFILE!$G$7,COUNTRY_INFO!D14*AL14*PROFILE!$G$7)","v":0},{"$f":"MAX(COUNTRY_INFO!D14*AK14*PROFILE!$G$8,COUNTRY_INFO!D14*AL14*PROFILE!$G$8,COUNTRY_INFO!D14*AM14*PROFILE!$G$8)","v":58838.81162751728},{"$f":"MAX(COUNTRY_INFO!D14*AK14*PROFILE!$G$9,COUNTRY_INFO!D14*AL14*PROFILE!$G$9,COUNTRY_INFO!D14*AM14*PROFILE!$G$9,IF(AND(DISTRICT!Z14<>\"Unknown\",Z14<>\"Not required\"),COUNTRY_INFO!O14*DISTRICT!AN14,0))","v":141876.16463231109},{"$f":"MAX(COUNTRY_INFO!D14*AK14*PROFILE!$G$10,COUNTRY_INFO!D14*AL14*PROFILE!$G$10,IF(AND(DISTRICT!Z14<>\"Unknown\",Z14<>\"Not required\"),COUNTRY_INFO!O14*DISTRICT!AO14,0))","v":10267.295531355614},210982.27179118397,"Y",{"$f":"MAX('MDA2'!J14,'MDA5'!J14,'T1'!L14,'T2'!J14,T3_R1!K14,T3_R2!K14)","v":59988},{"$f":"MAX('MDA1'!K14,'MDA2'!K14,'MDA3'!I14,'MDA3'!L14,'MDA5'!K14,'T1'!M14,'T2'!K14,T3_R1!L14,T3_R2!L14)","v":130079},{"$f":"MAX('MDA1'!L14,'MDA2'!L14,'MDA3'!J14,'MDA3'!M14,'MDA5'!L14,'T1'!N14,'T2'!L14,T3_R1!M14,T3_R2!M14)","v":280073},470140,{"$f":"MAX('MDA2'!J14,'MDA5'!J14,T14)","v":52333.434693540003},{"$f":"MAX('MDA1'!K14,'MDA2'!K14,'MDA3'!I14,'MDA3'!L14,'MDA5'!K14,V14,AD14)","v":130079},{"$f":"MAX('MDA1'!L14,'MDA2'!L14,'MDA3'!J14,'MDA3'!M14,'MDA5'!L14,AF14)","v":43735},210982.27179118397,100]
[{"$f":"IF(COUNTRY_INFO!A15=0,\" \",COUNTRY_INFO!A15)","v":"Rwanda"},{"$f":"IF(COUNTRY_INFO!B15=0,\" \",COUNTRY_INFO!B15)","v":"Southern"},{"$f":"IF(COUNTRY_INFO!C15=0,\" \",COUNTRY_INFO!C15)","v":"Gisagara"},{"$f":"COUNTRY_INFO!L15","v":0},null,null,{"$f":"MAX('MDA1'!M15,'MDA2'!M15,'MDA5'!M15)","v":0},{"$f":"IF(AND(COUNTRY_INFO!H15>0,COUNTRY_INFO!H15<4),IF(D15>MAX('MDA1'!M15,'MDA2'!M15,'MDA5'!M15),MAX('MDA1'!M15,'MDA2'!M15,'MDA5'!M15),D15),0)","v":0},{"$f":"IF(AND(COUNTRY_INFO!H15>0,COUNTRY_INFO!H15<4), IF(G15/D15*100<>0, IF(G15/D15*100>100,100,G15/D15*100), \"-\"),0)","v":0},{"$f":"COUNTRY_INFO!M15","v":0},null,null,{"$f":"MAX('MDA1'!M15,MAX('MDA3'!I15,'MDA3'!L15)+MAX('MDA3'!J15,'MDA3'!M15))","v":0},{"$f":"IF(AND(COUNTRY_INFO!I15>0,COUNTRY_INFO!I15<4),IF(J15>MAX('MDA1'!M15,MAX('MDA3'!I15,'MDA3'!L15)+MAX('MDA3'!J15,'MDA3'!M15)),MAX('MDA1'!M15,MAX('MDA3'!I15,'MDA3'!L15)+MAX('MDA3'!J15,'MDA3'!M15)),J15),0)","v":0},{"$f":"IF(AND(COUNTRY_INFO!I15>0,COUNTRY_INFO!I15<4), IF(M15/J15*100<>0, IF(M15/J15*100>100,100,M15/J15*100), \"-\"),0)","v":0},{"$f":"COUNTRY_INFO!N15","v":169840.56696947999},null,null,{"$f":"SUM(MAX('MDA2'!J15,'MDA5'!J15, 'T1'!L15, MAX(T3_R1!K15, T3_R2!K15)), MAX('MDA1'!K15, 'MDA2'!K15, 'MDA5'!K15,'T1'!M15, MAX(T3_R1!L15, T3_R2!L15)), MAX('MDA1'!L15, 'MDA2'!L15, 'MDA5'!L15,'T1'!N15, MAX(T3_R1!M15, T3_R2!M15)))","v":367738},{"$f":"IF(AND(COUNTRY_INFO!J15>1,COUNTRY_INFO!J15<4),IF(COUNTRY_INFO!E15>MAX('MDA2'!J15,'MDA5'!J15,'T1'!L15,MAX(T3_R1!K15,T3_R2!K15)),MAX('MDA2'!J15,'MDA5'!J15,'T1'!L15,MAX(T3_R1!K15,T3_R2!K15)),COUNTRY_INFO!E15),0)","v":52584},{"$f":"IF(AND(COUNTRY_INFO!J15>1,COUNTRY_INFO!J15<4), IF(T15/COUNTRY_INFO!E15*100<>0, IF(T15/COUNTRY_INFO!E15*100>100,100,T15/COUNTRY_INFO!E15*100), \"-\"),0)","v":98.042536580746685},{"$f":"IF(AND(COUNTRY_INFO!J15>1,COUNTRY_INFO!J15<4),IF(COUNTRY_INFO!F15>MAX('MDA1'!K15,'MDA2'!K15,'MDA5'!K15,'T1'!M15,MAX(T3_R1!L15,T3_R2!L15)),MAX('MDA1'!K15,'MDA2'!K15,'MDA5'!K15,'T1'!M15,MAX(T3_R1!L15,T3_R2!L15)),COUNTRY_INFO!F15),0)","v":106381},{"$f":"IF(AND(COUNTRY_INFO!J15>1,COUNTRY_INFO!J15<4), IF(V15/COUNTRY_INFO!F15*100<>0, IF(V15/COUNTRY_INFO!F15*100>100,100,V15/COUNTRY_INFO!F15*100), \"-\"),0)","v":91.544632622936618},158965,{"$f":"IF(AND(COUNTRY_INFO!J15>1,COUNTRY_INFO!J15<4), IF(S15/P15*100<>0, IF(X15/P15*100>100,100,X15/P15*100), \"-\"),0)","v":93.596602293824006},{"$f":"COUNTRY_INFO!O15","v":77780},null,null,{"$f":"MAX('T1'!L15,'T2'!J15)+MAX('T1'!M15,'T2'!K15)+MAX('T1'!N15,'T2'!L15)","v":212579},{"$f":"IF(COUNTRY_INFO!K15=1,IF(COUNTRY_INFO!F15*0.33>MAX('T1'!M15,'T2'!K15),MAX('T1'!M15,'T2'!K15),COUNTRY_INFO!F15*0.33),IF(COUNTRY_INFO!K15=2,IF(COUNTRY_INFO!F15*0.5>MAX('T1'!M15,'T2'!K15),MAX('T1'!M15,'T2'!K15),COUNTRY_INFO!F15*0.5),IF(COUNTRY_INFO!K15=3,IF(COUNTRY_INFO!F15>MAX('T1'!M15,'T2'!K15),MAX('T1'!M15,'T2'!K15),COUNTRY_INFO!F15),0)))","v":58103.351857979993},{"$f":"IF(AND(COUNTRY_INFO!K15>0,COUNTRY_INFO!K15<4),IF(Z15>0,IF(COUNTRY_INFO!K15=1, AD15/(COUNTRY_INFO!F15*0.33)*100, IF(COUNTRY_INFO!K15=2, AD15/(COUNTRY_INFO!F15*0.5)*100, IF(COUNTRY_INFO!K15=3, AD15/COUNTRY_INFO!F15*100))),\"-\"),0)","v":100},{"$f":"IF(COUNTRY_INFO!K15=2,IF(COUNTRY_INFO!G15*0.2>MAX('T1'!N15,'T2'!L15),MAX('T1'!N15,'T2'!L15),COUNTRY_INFO!G15*0.2),IF(COUNTRY_INFO!K15=3,IF(COUNTRY_INFO!G15>MAX('T1'!N15,'T2'!L15),MAX('T1'!N15,'T2'!L15),COUNTRY_INFO!G15),0))","v":44776.149473772006},{"$f":"IF(AND(COUNTRY_INFO!K15>0,COUNTRY_INFO!K15<4),IF(Z15>0,IF(COUNTRY_INFO!K15=1, 0, IF(COUNTRY_INFO!K15=2, AF15/(COUNTRY_INFO!G15*0.2)*100, IF(COUNTRY_INFO!K15=3, AF15/COUNTRY_INFO!G15*100))),\"-\"),0)","v":100},102879.50133175199,{"$f":"IF(AND(COUNTRY_INFO!K15>0,COUNTRY_INFO!K15<4), IF(AC15/Z15*100<>0, IF(AH15/Z15*100>100,100,AH15/Z15*100), \"-\"),0)","v":100},null,{"$f":"IF(AND(D15<>0, D15<>\"Unknown\",D15<>\"Stopped\",D15<>\"Not required\"),D15/COUNTRY_INFO!D15, 0)","v":0},{"$f":"IF(AND(J15<>0,J15<>\"Unknown\",J15<>\"Stopped\",J15<>\"Not required\"),J15/COUNTRY_INFO!D15, 0)","v":0},{"$f":"IF(AND(P15<>0,P15<>\"Unknown\",P15<>\"Not required\"),P15/(COUNTRY_INFO!E15+COUNTRY_INFO!F15), 0)","v":1},{"$f":"IF(AND(Z15<>0,Z15<>\"Unknown\",Z15<>\"Not required\"),IF(COUNTRY_INFO!K15=1,1,IF(COUNTRY_INFO!K15=2,0.5*COUNTRY_INFO!F15/(0.5*COUNTRY_INFO!F15+0.2*COUNTRY_INFO!G15),IF(COUNTRY_INFO!K15=3,COUNTRY_INFO!F15/(COUNTRY_INFO!F15+COUNTRY_INFO!G15)))),0)","v":0.56477093206951023},{"$f":"IF(AND(Z15<>0,Z15<>\"Unknown\",Z15<>\"Not required\"),IF(COUNTRY_INFO!K15=1,0,IF(COUNTRY_INFO!K15=2,0.2*COUNTRY_INFO!G15/(0.5*COUNTRY_INFO!F15+0.2*COUNTRY_INFO!G15),IF(COUNTRY_INFO!K15=3,COUNTRY_INFO!G15/(COUNTRY_INFO!F15+COUNTRY_INFO!G15)))),0)","v":0.43522906793048982},{"$f":"MAX(COUNTRY_INFO!D15*AK15*PROFILE!$G$7,COUNTRY_INFO!D15*AL15*PROFILE!$G$7)","v":0},{"$f":"MAX(COUNTRY_INFO!D15*AK15*PROFILE!$G$8,COUNTRY_INFO!D15*AL15*PROFILE!$G$8,COUNTRY_INFO!D15*AM15*PROFILE!$G$8)","v":47966.618383830239},{"$f":"MAX(COUNTRY_INFO!D15*AK15*PROFILE!$G$9,COUNTRY_INFO!D15*AL15*PROFILE!$G$9,COUNTRY_INFO!D15*AM15*PROFILE!$G$9,IF(AND(DISTRICT!Z15<>\"Unknown\",Z15<>\"Not required\"),COUNTRY_INFO!O15*DISTRICT!AN15,0))","v":115660.38909420936},{"$f":"MAX(COUNTRY_INFO!D15*AK15*PROFILE!$G$10,COUNTRY_INFO!D15*AL15*PROFILE!$G$10,IF(AND(DISTRICT!Z15<>\"Unknown\",Z15<>\"Not required\"),COUNTRY_INFO!O15*DISTRICT!AO15,0))","v":33852.116903633498},197479.12438167309,"Y",{"$f":"MAX('MDA2'!J15,'MDA5'!J15,'T1'!L15,'T2'!J15,T3_R1!K15,T3_R2!K15)","v":52584},{"$f":"MAX('MDA1'!K15,'MDA2'!K15,'MDA3'!I15,'MDA3'!L15,'MDA5'!K15,'T1'!M15,'T2'!K15,T3_R1!L15,T3_R2!L15)","v":106381},{"$f":"MAX('MDA1'!L15,'MDA2'!L15,'MDA3'!J15,'MDA3'!M15,'MDA5'!L15,'T1'!N15,'T2'!L15,T3_R1!M15,T3_R2!M15)","v":208773},367738,{"$f":"MAX('MDA2'!J15,'MDA5'!J15,T15)","v":52584},{"$f":"MAX('MDA1'!K15,'MDA2'!K15,'MDA3'!I15,'MDA3'!L15,'MDA5'!K15,V15,AD15)","v":106381},{"$f":"MAX('MDA1'!L15,'MDA2'!L15,'MDA3'!J15,'MDA3'!M15,'MDA5'!L15,AF15)","v":44776.149473772006},197479.12438167309,100]
[{"$f":"IF(COUNTRY_INFO!A16=0,\" \",COUNTRY_INFO!A16)","v":"Rwanda"},{"$f":"IF(COUNTRY_INFO!B16=0,\" \",COUNTRY_INFO!B16)","v":"Southern"},{"$f":"IF(COUNTRY_INFO!C16=0,\" \",COUNTRY_INFO!C16)","v":"Huye"},{"$f":"COUNTRY_INFO!L16","v":0},null,null,{"$f":"MAX('MDA1'!M16,'MDA2'!M16,'MDA5'!M16)","v":0},{"$f":"IF(AND(COUNTRY_INFO!H16>0,COUNTRY_INFO!H16<4),IF(D16>MAX('MDA1'!M16,'MDA2'!M16,'MDA5'!M16),MAX('MDA1'!M16,'MDA2'!M16,'MDA5'!M16),D16),0)","v":0},{"$f":"IF(AND(COUNTRY_INFO!H16>0,COUNTRY_INFO!H16<4), IF(G16/D16*100<>0, IF(G16/D16*100>100,100,G16/D16*100), \"-\"),0)","v":0},{"$f":"COUNTRY_INFO!M16","v":0},null,null,{"$f":"MAX('MDA1'!M16,MAX('MDA3'!I16,'MDA3'!L16)+MAX('MDA3'!J16,'MDA3'!M16))","v":0},{"$f":"IF(AND(COUNTRY_INFO!I16>0,COUNTRY_INFO!I16<4),IF(J16>MAX('MDA1'!M16,MAX('MDA3'!I16,'MDA3'!L16)+MAX('MDA3'!J16,'MDA3'!M16)),MAX('MDA1'!M16,MAX('MDA3'!I16,'MDA3'!L16)+MAX('MDA3'!J16,'MDA3'!M16)),J16),0)","v":0},{"$f":"IF(AND(COUNTRY_INFO!I16>0,COUNTRY_INFO!I16<4), IF(M16/J16*100<>0, IF(M16/J16*100>100,100,M16/J16*100), \"-\"),0)","v":0},{"$f":"COUNTRY_INFO!N16","v":155566.07619033603},null,null,{"$f":"SUM(MAX('MDA2'!J16,'MDA5'!J16, 'T1'!L16, MAX(T3_R1!K16, T3_R2!K16)), MAX('MDA1'!K16, 'MDA2'!K16, 'MDA5'!K16,'T1'!M16, MAX(T3_R1!L16, T3_R2!L16)), MAX('MDA1'!L16, 'MDA2'!L16, 'MDA5'!L16,'T1'!N16, MAX(T3_R1!M16, T3_R2!M16)))","v":354622},{"$f":"IF(AND(COUNTRY_INFO!J16>1,COUNTRY_INFO!J16<4),IF(COUNTRY_INFO!E16>MAX('MDA2'!J16,'MDA5'!J16,'T1'!L16,MAX(T3_R1!K16,T3_R2!K16)),MAX('MDA2'!J16,'MDA5'!J16,'T1'!L16,MAX(T3_R1!K16,T3_R2!K16)),COUNTRY_INFO!E16),0)","v":42654},{"$f":"IF(AND(COUNTRY_INFO!J16>1,COUNTRY_INFO!J16<4), IF(T16/COUNTRY_INFO!E16*100<>0, IF(T16/COUNTRY_INFO!E16*100>100,100,T16/COUNTRY_INFO!E16*100), \"-\"),0)","v":91.233485768870779},{"$f":"IF(AND(COUNTRY_INFO!J16>1,COUNTRY_INFO!J16<4),IF(COUNTRY_INFO!F16>MAX('MDA1'!K16,'MDA2'!K16,'MDA5'!K16,'T1'!M16,MAX(T3_R1!L16,T3_R2!L16)),MAX('MDA1'!K16,'MDA2'!K16,'MDA5'!K16,'T1'!M16,MAX(T3_R1!L16,T3_R2!L16)),COUNTRY_INFO!F16),0)","v":96677},{"$f":"IF(AND(COUNTRY_INFO!J16>1,COUNTRY_INFO!J16<4), IF(V16/COUNTRY_INFO!F16*100<>0, IF(V16/COUNTRY_INFO!F16*100>100,100,V16/COUNTRY_INFO!F16*100), \"-\"),0)","v":88.846508185282431},139331,{"$f":"IF(AND(COUNTRY_INFO!J16>1,COUNTRY_INFO!J16<4), IF(S16/P16*100<>0, IF(X16/P16*100>100,100,X16/P16*100), \"-\"),0)","v":89.563871129286369},{"$f":"COUNTRY_INFO!O16","v":35895},null,null,{"$f":"MAX('T1'!L16,'T2'!J16)+MAX('T1'!M16,'T2'!K16)+MAX('T1'!N16,'T2'!L16)","v":0},{"$f":"IF(COUNTRY_INFO!K16=1,IF(COUNTRY_INFO!F16*0.33>MAX('T1'!M16,'T2'!K16),MAX('T1'!M16,'T2'!K16),COUNTRY_INFO!F16*0.33),IF(COUNTRY_INFO!K16=2,IF(COUNTRY_INFO!F16*0.5>MAX('T1'!M16,'T2'!K16),MAX('T1'!M16,'T2'!K16),COUNTRY_INFO!F16*0.5),IF(COUNTRY_INFO!K16=3,IF(COUNTRY_INFO!F16>MAX('T1'!M16,'T2'!K16),MAX('T1'!M16,'T2'!K16),COUNTRY_INFO!F16),0)))","v":0},{"$f":"IF(AND(COUNTRY_INFO!K16>0,COUNTRY_INFO!K16<4),IF(Z16>0,IF(COUNTRY_INFO!K16=1, AD16/(COUNTRY_INFO!F16*0.33)*100, IF(COUNTRY_INFO!K16=2, AD16/(COUNTRY_INFO!F16*0.5)*100, IF(COUNTRY_INFO!K16=3, AD16/COUNTRY_INFO!F16*100))),\"-\"),0)","v":0},{"$f":"IF(COUNTRY_INFO!K16=2,IF(COUNTRY_INFO!G16*0.2>MAX('T1'!N16,'T2'!L16),MAX('T1'!N16,'T2'!L16),COUNTRY_INFO!G16*0.2),IF(COUNTRY_INFO!K16=3,IF(COUNTRY_INFO!G16>MAX('T1'!N16,'T2'!L16),MAX('T1'!N16,'T2'!L16),COUNTRY_INFO!G16),0))","v":0},{"$f":"IF(AND(COUNTRY_INFO!K16>0,COUNTRY_INFO!K16<4),IF(Z16>0,IF(COUNTRY_INFO!K16=1, 0, IF(COUNTRY_INFO!K16=2, AF16/(COUNTRY_INFO!G16*0.2)*100, IF(COUNTRY_INFO!K16=3, AF16/COUNTRY_INFO!G16*100))),\"-\"),0)","v":0},0,{"$f":"IF(AND(COUNTRY_INFO!K16>0,COUNTRY_INFO!K16<4), IF(AC16/Z16*100<>0, IF(AH16/Z16*100>100,100,AH16/Z16*100), \"-\"),0)","v":"-"},null,{"$f":"IF(AND(D16<>0, D16<>\"Unknown\",D16<>\"Stopped\",D16<>\"Not required\"),D16/COUNTRY_INFO!D16, 0)","v":0},{"$f":"IF(AND(J16<>0,J16<>\"Unknown\",J16<>\"Stopped\",J16<>\"Not required\"),J16/COUNTRY_INFO!D16, 0)","v":0},{"$f":"IF(AND(P16<>0,P16<>\"Unknown\",P16<>\"Not required\"),P16/(COUNTRY_INFO!E16+COUNTRY_INFO!F16), 0)","v":1},{"$f":"IF(AND(Z16<>0,Z16<>\"Unknown\",Z16<>\"Not required\"),IF(COUNTRY_INFO!K16=1,1,IF(COUNTRY_INFO!K16=2,0.5*COUNTRY_INFO!F16/(0.5*COUNTRY_INFO!F16+0.2*COUNTRY_INFO!G16),IF(COUNTRY_INFO!K16=3,COUNTRY_INFO!F16/(COUNTRY_INFO!F16+COUNTRY_INFO!G16)))),0)","v":1},{"$f":"IF(AND(Z16<>0,Z16<>\"Unknown\",Z16<>\"Not required\"),IF(COUNTRY_INFO!K16=1,0,IF(COUNTRY_INFO!K16=2,0.2*COUNTRY_INFO!G16/(0.5*COUNTRY_INFO!F16+0.2*COUNTRY_INFO!G16),IF(COUNTRY_INFO!K16=3,COUNTRY_INFO!G16/(COUNTRY_INFO!F16+COUNTRY_INFO!G16)))),0)","v":0},{"$f":"MAX(COUNTRY_INFO!D16*AK16*PROFILE!$G$7,COUNTRY_INFO!D16*AL16*PROFILE!$G$7)","v":0},{"$f":"MAX(COUNTRY_INFO!D16*AK16*PROFILE!$G$8,COUNTRY_INFO!D16*AL16*PROFILE!$G$8,COUNTRY_INFO!D16*AM16*PROFILE!$G$8)","v":48842.850947853163},{"$f":"MAX(COUNTRY_INFO!D16*AK16*PROFILE!$G$9,COUNTRY_INFO!D16*AL16*PROFILE!$G$9,COUNTRY_INFO!D16*AM16*PROFILE!$G$9,IF(AND(DISTRICT!Z16<>\"Unknown\",Z16<>\"Not required\"),COUNTRY_INFO!O16*DISTRICT!AN16,0))","v":117773.22094908266},{"$f":"MAX(COUNTRY_INFO!D16*AK16*PROFILE!$G$10,COUNTRY_INFO!D16*AL16*PROFILE!$G$10,IF(AND(DISTRICT!Z16<>\"Unknown\",Z16<>\"Not required\"),COUNTRY_INFO!O16*DISTRICT!AO16,0))","v":0},166616.07189693581,0,{"$f":"MAX('MDA2'!J16,'MDA5'!J16,'T1'!L16,'T2'!J16,T3_R1!K16,T3_R2!K16)","v":42654},{"$f":"MAX('MDA1'!K16,'MDA2'!K16,'MDA3'!I16,'MDA3'!L16,'MDA5'!K16,'T1'!M16,'T2'!K16,T3_R1!L16,T3_R2!L16)","v":96677},{"$f":"MAX('MDA1'!L16,'MDA2'!L16,'MDA3'!J16,'MDA3'!M16,'MDA5'!L16,'T1'!N16,'T2'!L16,T3_R1!M16,T3_R2!M16)","v":215291},354622,{"$f":"MAX('MDA2'!J16,'MDA5'!J16,T16)","v":42654},{"$f":"MAX('MDA1'!K16,'MDA2'!K16,'MDA3'!I16,'MDA3'!L16,'MDA5'!K16,V16,AD16)","v":96677},{"$f":"MAX('MDA1'!L16,'MDA2'!L16,'MDA3'!J16,'MDA3'!M16,'MDA5'!L16,AF16)","v":0},139331,83.623985617777834]
[{"$f":"IF(COUNTRY_INFO!A17=0,\" \",COUNTRY_INFO!A17)","v":"Rwanda"},{"$f":"IF(COUNTRY_INFO!B17=0,\" \",COUNTRY_INFO!B17)","v":"Southern"},{"$f":"IF(COUNTRY_INFO!C17=0,\" \",COUNTRY_INFO!C17)","v":"Kamonyi"},{"$f":"COUNTRY_INFO!L17","v":0},null,null,{"$f":"MAX('MDA1'!M17,'MDA2'!M17,'MDA5'!M17)","v":0},{"$f":"IF(AND(COUNTRY_INFO!H17>0,COUNTRY_INFO!H17<4),IF(D17>MAX('MDA1'!M17,'MDA2'!M17,'MDA5'!M17),MAX('MDA1'!M17,'MDA2'!M17,'MDA5'!M17),D17),0)","v":0},{"$f":"IF(AND(COUNTRY_INFO!H17>0,COUNTRY_INFO!H17<4), IF(G17/D17*100<>0, IF(G17/D17*100>100,100,G17/D17*100), \"-\"),0)","v":0},{"$f":"COUNTRY_INFO!M17","v":0},null,null,{"$f":"MAX('MDA1'!M17,MAX('MDA3'!I17,'MDA3'!L17)+MAX('MDA3'!J17,'MDA3'!M17))","v":0},{"$f":"IF(AND(COUNTRY_INFO!I17>0,COUNTRY_INFO!I17<4),IF(J17>MAX('MDA1'!M17,MAX('MDA3'!I17,'MDA3'!L17)+MAX('MDA3'!J17,'MDA3'!M17)),MAX('MDA1'!M17,MAX('MDA3'!I17,'MDA3'!L17)+MAX('MDA3'!J17,'MDA3'!M17)),J17),0)","v":0},{"$f":"IF(AND(COUNTRY_INFO!I17>0,COUNTRY_INFO!I17<4), IF(M17/J17*100<>0, IF(M17/J17*100>100,100,M17/J17*100), \"-\"),0)","v":0},{"$f":"COUNTRY_INFO!N17","v":0},null,null,{"$f":"SUM(MAX('MDA2'!J17,'MDA5'!J17, 'T1'!L17, MAX(T3_R1!K17, T3_R2!K17)), MAX('MDA1'!K17, 'MDA2'!K17, 'MDA5'!K17,'T1'!M17, MAX(T3_R1!L17, T3_R2!L17)), MAX('MDA1'!L17, 'MDA2'!L17, 'MDA5'!L17,'T1'!N17, MAX(T3_R1!M17, T3_R2!M17)))","v":336663},{"$f":"IF(AND(COUNTRY_INFO!J17>1,COUNTRY_INFO!J17<4),IF(COUNTRY_INFO!E17>MAX('MDA2'!J17,'MDA5'!J17,'T1'!L17,MAX(T3_R1!K17,T3_R2!K17)),MAX('MDA2'!J17,'MDA5'!J17,'T1'!L17,MAX(T3_R1!K17,T3_R2!K17)),COUNTRY_INFO!E17),0)","v":0},{"$f":"IF(AND(COUNTRY_INFO!J17>1,COUNTRY_INFO!J17<4), IF(T17/COUNTRY_INFO!E17*100<>0, IF(T17/COUNTRY_INFO!E17*100>100,100,T17/COUNTRY_INFO!E17*100), \"-\"),0)","v":0},{"$f":"IF(AND(COUNTRY_INFO!J17>1,COUNTRY_INFO!J17<4),IF(COUNTRY_INFO!F17>MAX('MDA1'!K17,'MDA2'!K17,'MDA5'!K17,'T1'!M17,MAX(T3_R1!L17,T3_R2!L17)),MAX('MDA1'!K17,'MDA2'!K17,'MDA5'!K17,'T1'!M17,MAX(T3_R1!L17,T3_R2!L17)),COUNTRY_INFO!F17),0)","v":0},{"$f":"IF(AND(COUNTRY_INFO!J17>1,COUNTRY_INFO!J17<4), IF(V17/COUNTRY_INFO!F17*100<>0, IF(V17/COUNTRY_INFO!F17*100>100,100,V17/COUNTRY_INFO!F17*100), \"-\"),0)","v":0},0,{"$f":"IF(AND(COUNTRY_INFO!J17>1,COUNTRY_INFO!J17<4), IF(S17/P17*100<>0, IF(X17/P17*100>100,100,X17/P17*100), \"-\"),0)","v":0},{"$f":"COUNTRY_INFO!O17","v":41971},null,null,{"$f":"MAX('T1'!L17,'T2'!J17)+MAX('T1'!M17,'T2'!K17)+MAX('T1'!N17,'T2'!L17)","v":108648},{"$f":"IF(COUNTRY_INFO!K17=1,IF(COUNTRY_INFO!F17*0.33>MAX('T1'!M17,'T2'!K17),MAX('T1'!M17,'T2'!K17),COUNTRY_INFO!F17*0.33),IF(COUNTRY_INFO!K17=2,IF(COUNTRY_INFO!F17*0.5>MAX('T1'!M17,'T2'!K17),MAX('T1'!M17,'T2'!K17),COUNTRY_INFO!F17*0.5),IF(COUNTRY_INFO!K17=3,IF(COUNTRY_INFO!F17>MAX('T1'!M17,'T2'!K17),MAX('T1'!M17,'T2'!K17),COUNTRY_INFO!F17),0)))","v":41174},{"$f":"IF(AND(COUNTRY_INFO!K17>0,COUNTRY_INFO!K17<4),IF(Z17>0,IF(COUNTRY_INFO!K17=1, AD17/(COUNTRY_INFO!F17*0.33)*100, IF(COUNTRY_INFO!K17=2, AD17/(COUNTRY_INFO!F17*0.5)*100, IF(COUNTRY_INFO!K17=3, AD17/COUNTRY_INFO!F17*100))),\"-\"),0)","v":68.556763952909606},{"$f":"IF(COUNTRY_INFO!K17=2,IF(COUNTRY_INFO!G17*0.2>MAX('T1'!N17,'T2'!L17),MAX('T1'!N17,'T2'!L17),COUNTRY_INFO!G17*0.2),IF(COUNTRY_INFO!K17=3,IF(COUNTRY_INFO!G17>MAX('T1'!N17,'T2'!L17),MAX('T1'!N17,'T2'!L17),COUNTRY_INFO!G17),0))","v":47360.228412038414},{"$f":"IF(AND(COUNTRY_INFO!K17>0,COUNTRY_INFO!K17<4),IF(Z17>0,IF(COUNTRY_INFO!K17=1, 0, IF(COUNTRY_INFO!K17=2, AF17/(COUNTRY_INFO!G17*0.2)*100, IF(COUNTRY_INFO!K17=3, AF17/COUNTRY_INFO!G17*100))),\"-\"),0)","v":100},88534.228412038414,{"$f":"IF(AND(COUNTRY_INFO!K17>0,COUNTRY_INFO!K17<4), IF(AC17/Z17*100<>0, IF(AH17/Z17*100>100,100,AH17/Z17*100), \"-\"),0)","v":100},null,{"$f":"IF(AND(D17<>0, D17<>\"Unknown\",D17<>\"Stopped\",D17<>\"Not required\"),D17/COUNTRY_INFO!D17, 0)","v":0},{"$f":"IF(AND(J17<>0,J17<>\"Unknown\",J17<>\"Stopped\",J17<>\"Not required\"),J17/COUNTRY_INFO!D17, 0)","v":0},{"$f":"IF(AND(P17<>0,P17<>\"Unknown\",P17<>\"Not required\"),P17/(COUNTRY_INFO!E17+COUNTRY_INFO!F17), 0)","v":0},{"$f":"IF(AND(Z17<>0,Z17<>\"Unknown\",Z17<>\"Not required\"),IF(COUNTRY_INFO!K17=1,1,IF(COUNTRY_INFO!K17=2,0.5*COUNTRY_INFO!F17/(0.5*COUNTRY_INFO!F17+0.2*COUNTRY_INFO!G17),IF(COUNTRY_INFO!K17=3,COUNTRY_INFO!F17/(COUNTRY_INFO!F17+COUNTRY_INFO!G17)))),0)","v":0.55910543130990409},{"$f":"IF(AND(Z17<>0,Z17<>\"Unknown\",Z17<>\"Not required\"),IF(COUNTRY_INFO!K17=1,0,IF(COUNTRY_INFO!K17=2,0.2*COUNTRY_INFO!G17/(0.5*COUNTRY_INFO!F17+0.2*COUNTRY_INFO!G17),IF(COUNTRY_INFO!K17=3,COUNTRY_INFO!G17/(COUNTRY_INFO!F17+COUNTRY_INFO!G17)))),0)","v":0.44089456869009586},{"$f":"MAX(COUNTRY_INFO!D17*AK17*PROFILE!$G$7,COUNTRY_INFO!D17*AL17*PROFILE!$G$7)","v":0},{"$f":"MAX(COUNTRY_INFO!D17*AK17*PROFILE!$G$8,COUNTRY_INFO!D17*AL17*PROFILE!$G$8,COUNTRY_INFO!D17*AM17*PROFILE!$G$8)","v":0},{"$f":"MAX(COUNTRY_INFO!D17*AK17*PROFILE!$G$9,COUNTRY_INFO!D17*AL17*PROFILE!$G$9,COUNTRY_INFO!D17*AM17*PROFILE!$G$9,IF(AND(DISTRICT!Z17<>\"Unknown\",Z17<>\"Not required\"),COUNTRY_INFO!O17*DISTRICT!AN17,0))","v":23466.214057507983},{"$f":"MAX(COUNTRY_INFO!D17*AK17*PROFILE!$G$10,COUNTRY_INFO!D17*AL17*PROFILE!$G$10,IF(AND(DISTRICT!Z17<>\"Unknown\",Z17<>\"Not required\"),COUNTRY_INFO!O17*DISTRICT!AO17,0))","v":18504.785942492013},41971,"Y",{"$f":"MAX('MDA2'!J17,'MDA5'!J17,'T1'!L17,'T2'!J17,T3_R1!K17,T3_R2!K17)","v":38795},{"$f":"MAX('MDA1'!K17,'MDA2'!K17,'MDA3'!I17,'MDA3'!L17,'MDA5'!K17,'T1'!M17,'T2'!K17,T3_R1!L17,T3_R2!L17)","v":108208},{"$f":"MAX('MDA1'!L17,'MDA2'!L17,'MDA3'!J17,'MDA3'!M17,'MDA5'!L17,'T1'!N17,'T2'!L17,T3_R1!M17,T3_R2!M17)","v":189660},336663,{"$f":"MAX('MDA2'!J17,'MDA5'!J17,T17)","v":0},{"$f":"MAX('MDA1'!K17,'MDA2'!K17,'MDA3'!I17,'MDA3'!L17,'MDA5'!K17,V17,AD17)","v":41174},{"$f":"MAX('MDA1'!L17,'MDA2'!L17,'MDA3'!J17,'MDA3'!M17,'MDA5'!L17,AF17)","v":47360.228412038414},41971,100]
[{"$f":"IF(COUNTRY_INFO!A18=0,\" \",COUNTRY_INFO!A18)","v":"Rwanda"},{"$f":"IF(COUNTRY_INFO!B18=0,\" \",COUNTRY_INFO!B18)","v":"Western"},{"$f":"IF(COUNTRY_INFO!C18=0,\" \",COUNTRY_INFO!C18)","v":"Karongi"},{"$f":"COUNTRY_INFO!L18","v":0},null,null,{"$f":"MAX('MDA1'!M18,'MDA2'!M18,'MDA5'!M18)","v":0},{"$f":"IF(AND(COUNTRY_INFO!H18>0,COUNTRY_INFO!H18<4),IF(D18>MAX('MDA1'!M18,'MDA2'!M18,'MDA5'!M18),MAX('MDA1'!M18,'MDA2'!M18,'MDA5'!M18),D18),0)","v":0},{"$f":"IF(AND(COUNTRY_INFO!H18>0,COUNTRY_INFO!H18<4), IF(G18/D18*100<>0, IF(G18/D18*100>100,100,G18/D18*100), \"-\"),0)","v":0},{"$f":"COUNTRY_INFO!M18","v":0},null,null,{"$f":"MAX('MDA1'!M18,MAX('MDA3'!I18,'MDA3'!L18)+MAX('MDA3'!J18,'MDA3'!M18))","v":0},{"$f":"IF(AND(COUNTRY_INFO!I18>0,COUNTRY_INFO!I18<4),IF(J18>MAX('MDA1'!M18,MAX('MDA3'!I18,'MDA3'!L18)+MAX('MDA3'!J18,'MDA3'!M18)),MAX('MDA1'!M18,MAX('MDA3'!I18,'MDA3'!L18)+MAX('MDA3'!J18,'MDA3'!M18)),J18),0)","v":0},{"$f":"IF(AND(COUNTRY_INFO!I18>0,COUNTRY_INFO!I18<4), IF(M18/J18*100<>0, IF(M18/J18*100>100,100,M18/J18*100), \"-\"),0)","v":0},{"$f":"COUNTRY_INFO!N18","v":175851.08270780402},null,null,{"$f":"SUM(MAX('MDA2'!J18,'MDA5'!J18, 'T1'!L18, MAX(T3_R1!K18, T3_R2!K18)), MAX('MDA1'!K18, 'MDA2'!K18, 'MDA5'!K18,'T1'!M18, MAX(T3_R1!L18, T3_R2!L18)), MAX('MDA1'!L18, 'MDA2'!L18, 'MDA5'!L18,'T1'!N18, MAX(T3_R1!M18, T3_R2!M18)))","v":394310},{"$f":"IF(AND(COUNTRY_INFO!J18>1,COUNTRY_INFO!J18<4),IF(COUNTRY_INFO!E18>MAX('MDA2'!J18,'MDA5'!J18,'T1'!L18,MAX(T3_R1!K18,T3_R2!K18)),MAX('MDA2'!J18,'MDA5'!J18,'T1'!L18,MAX(T3_R1!K18,T3_R2!K18)),COUNTRY_INFO!E18),0)","v":49391.587394928007},{"$f":"IF(AND(COUNTRY_INFO!J18>1,COUNTRY_INFO!J18<4), IF(T18/COUNTRY_INFO!E18*100<>0, IF(T18/COUNTRY_INFO!E18*100>100,100,T18/COUNTRY_INFO!E18*100), \"-\"),0)","v":100},{"$f":"IF(AND(COUNTRY_INFO!J18>1,COUNTRY_INFO!J18<4),IF(COUNTRY_INFO!F18>MAX('MDA1'!K18,'MDA2'!K18,'MDA5'!K18,'T1'!M18,MAX(T3_R1!L18,T3_R2!L18)),MAX('MDA1'!K18,'MDA2'!K18,'MDA5'!K18,'T1'!M18,MAX(T3_R1!L18,T3_R2!L18)),COUNTRY_INFO!F18),0)","v":110295},{"$f":"IF(AND(COUNTRY_INFO!J18>1,COUNTRY_INFO!J18<4), IF(V18/COUNTRY_INFO!F18*100<>0, IF(V18/COUNTRY_INFO!F18*100>100,100,V18/COUNTRY_INFO!F18*100), \"-\"),0)","v":87.217649989126471},159686.58739492801,{"$f":"IF(AND(COUNTRY_INFO!J18>1,COUNTRY_INFO!J18<4), IF(S18/P18*100<>0, IF(X18/P18*100>100,100,X18/P18*100), \"-\"),0)","v":90.80784999218055},{"$f":"COUNTRY_INFO!O18","v":28801},null,null,{"$f":"MAX('T1'!L18,'T2'!J18)+MAX('T1'!M18,'T2'!K18)+MAX('T1'!N18,'T2'!L18)","v":77768},{"$f":"IF(COUNTRY_INFO!K18=1,IF(COUNTRY_INFO!F18*0.33>MAX('T1'!M18,'T2'!K18),MAX('T1'!M18,'T2'!K18),COUNTRY_INFO!F18*0.33),IF(COUNTRY_INFO!K18=2,IF(COUNTRY_INFO!F18*0.5>MAX('T1'!M18,'T2'!K18),MAX('T1'!M18,'T2'!K18),COUNTRY_INFO!F18*0.5),IF(COUNTRY_INFO!K18=3,IF(COUNTRY_INFO!F18>MAX('T1'!M18,'T2'!K18),MAX('T1'!M18,'T2'!K18),COUNTRY_INFO!F18),0)))","v":23019},{"$f":"IF(AND(COUNTRY_INFO!K18>0,COUNTRY_INFO!K18<4),IF(Z18>0,IF(COUNTRY_INFO!K18=1, AD18/(COUNTRY_INFO!F18*0.33)*100, IF(COUNTRY_INFO!K18=2, AD18/(COUNTRY_INFO!F18*0.5)*100, IF(COUNTRY_INFO!K18=3, AD18/COUNTRY_INFO!F18*100))),\"-\"),0)","v":36.405332700479661},{"$f":"IF(COUNTRY_INFO!K18=2,IF(COUNTRY_INFO!G18*0.2>MAX('T1'!N18,'T2'!L18),MAX('T1'!N18,'T2'!L18),COUNTRY_INFO!G18*0.2),IF(COUNTRY_INFO!K18=3,IF(COUNTRY_INFO!G18>MAX('T1'!N18,'T2'!L18),MAX('T1'!N18,'T2'!L18),COUNTRY_INFO!G18),0))","v":47518.113390292812},{"$f":"IF(AND(COUNTRY_INFO!K18>0,COUNTRY_INFO!K18<4),IF(Z18>0,IF(COUNTRY_INFO!K18=1, 0, IF(COUNTRY_INFO!K18=2, AF18/(COUNTRY_INFO!G18*0.2)*100, IF(COUNTRY_INFO!K18=3, AF18/COUNTRY_INFO!G18*100))),\"-\"),0)","v":100},70537.113390292812,{"$f":"IF(AND(COUNTRY_INFO!K18>0,COUNTRY_INFO!K18<4), IF(AC18/Z18*100<>0, IF(AH18/Z18*100>100,100,AH18/Z18*100), \"-\"),0)","v":100},null,{"$f":"IF(AND(D18<>0, D18<>\"Unknown\",D18<>\"Stopped\",D18<>\"Not required\"),D18/COUNTRY_INFO!D18, 0)","v":0},{"$f":"IF(AND(J18<>0,J18<>\"Unknown\",J18<>\"Stopped\",J18<>\"Not required\"),J18/COUNTRY_INFO!D18, 0)","v":0},{"$f":"IF(AND(P18<>0,P18<>\"Unknown\",P18<>\"Not required\"),P18/(COUNTRY_INFO!E18+COUNTRY_INFO!F18), 0)","v":1},{"$f":"IF(AND(Z18<>0,Z18<>\"Unknown\",Z18<>\"Not required\"),IF(COUNTRY_INFO!K18=1,1,IF(COUNTRY_INFO!K18=2,0.5*COUNTRY_INFO!F18/(0.5*COUNTRY_INFO!F18+0.2*COUNTRY_INFO!G18),IF(COUNTRY_INFO!K18=3,COUNTRY_INFO!F18/(COUNTRY_INFO!F18+COUNTRY_INFO!G18)))),0)","v":0.5709342560553633},{"$f":"IF(AND(Z18<>0,Z18<>\"Unknown\",Z18<>\"Not required\"),IF(COUNTRY_INFO!K18=1,0,IF(COUNTRY_INFO!K18=2,0.2*COUNTRY_INFO!G18/(0.5*COUNTRY_INFO!F18+0.2*COUNTRY_INFO!G18),IF(COUNTRY_INFO!K18=3,COUNTRY_INFO!G18/(COUNTRY_INFO!F18+COUNTRY_INFO!G18)))),0)","v":0.4290657439446367},{"$f":"MAX(COUNTRY_INFO!D18*AK18*PROFILE!$G$7,COUNTRY_INFO!D18*AL18*PROFILE!$G$7)","v":0},{"$f":"MAX(COUNTRY_INFO!D18*AK18*PROFILE!$G$8,COUNTRY_INFO!D18*AL18*PROFILE!$G$8,COUNTRY_INFO!D18*AM18*PROFILE!$G$8)","v":50265.37742074643},{"$f":"MAX(COUNTRY_INFO!D18*AK18*PROFILE!$G$9,COUNTRY_INFO!D18*AL18*PROFILE!$G$9,COUNTRY_INFO!D18*AM18*PROFILE!$G$9,IF(AND(DISTRICT!Z18<>\"Unknown\",Z18<>\"Not required\"),COUNTRY_INFO!O18*DISTRICT!AN18,0))","v":121203.31401995698},{"$f":"MAX(COUNTRY_INFO!D18*AK18*PROFILE!$G$10,COUNTRY_INFO!D18*AL18*PROFILE!$G$10,IF(AND(DISTRICT!Z18<>\"Unknown\",Z18<>\"Not required\"),COUNTRY_INFO!O18*DISTRICT!AO18,0))","v":12357.522491349482},183826.21393205289,"Y",{"$f":"MAX('MDA2'!J18,'MDA5'!J18,'T1'!L18,'T2'!J18,T3_R1!K18,T3_R2!K18)","v":50981},{"$f":"MAX('MDA1'!K18,'MDA2'!K18,'MDA3'!I18,'MDA3'!L18,'MDA5'!K18,'T1'!M18,'T2'!K18,T3_R1!L18,T3_R2!L18)","v":110295},{"$f":"MAX('MDA1'!L18,'MDA2'!L18,'MDA3'!J18,'MDA3'!M18,'MDA5'!L18,'T1'!N18,'T2'!L18,T3_R1!M18,T3_R2!M18)","v":233034},394310,{"$f":"MAX('MDA2'!J18,'MDA5'!J18,T18)","v":49391.587394928007},{"$f":"MAX('MDA1'!K18,'MDA2'!K18,'MDA3'!I18,'MDA3'!L18,'MDA5'!K18,V18,AD18)","v":110295},{"$f":"MAX('MDA1'!L18,'MDA2'!L18,'MDA3'!J18,'MDA3'!M18,'MDA5'!L18,AF18)","v":47518.113390292812},183826.21393205289,100]
[{"$f":"IF(COUNTRY_INFO!A19=0,\" \",COUNTRY_INFO!A19)","v":"Rwanda"},{"$f":"IF(COUNTRY_INFO!B19=0,\" \",COUNTRY_INFO!B19)","v":"Eastern"},{"$f":"IF(COUNTRY_INFO!C19=0,\" \",COUNTRY_INFO!C19)","v":"Kayonza"},{"$f":"COUNTRY_INFO!L19","v":0},null,null,{"$f":"MAX('MDA1'!M19,'MDA2'!M19,'MDA5'!M19)","v":0},{"$f":"IF(AND(COUNTRY_INFO!H19>0,COUNTRY_INFO!H19<4),IF(D19>MAX('MDA1'!M19,'MDA2'!M19,'MDA5'!M19),MAX('MDA1'!M19,'MDA2'!M19,'MDA5'!M19),D19),0)","v":0},{"$f":"IF(AND(COUNTRY_INFO!H19>0,COUNTRY_INFO!H19<4), IF(G19/D19*100<>0, IF(G19/D19*100>100,100,G19/D19*100), \"-\"),0)","v":0},{"$f":"COUNTRY_INFO!M19","v":0},null,null,{"$f":"MAX('MDA1'!M19,MAX('MDA3'!I19,'MDA3'!L19)+MAX('MDA3'!J19,'MDA3'!M19))","v":0},{"$f":"IF(AND(COUNTRY_INFO!I19>0,COUNTRY_INFO!I19<4),IF(J19>MAX('MDA1'!M19,MAX('MDA3'!I19,'MDA3'!L19)+MAX('MDA3'!J19,'MDA3'!M19)),MAX('MDA1'!M19,MAX('MDA3'!I19,'MDA3'!L19)+MAX('MDA3'!J19,'MDA3'!M19)),J19),0)","v":0},{"$f":"IF(AND(COUNTRY_INFO!I19>0,COUNTRY_INFO!I19<4), IF(M19/J19*100<>0, IF(M19/J19*100>100,100,M19/J19*100), \"-\"),0)","v":0},{"$f":"COUNTRY_INFO!N19","v":185837.5262232},null,null,{"$f":"SUM(MAX('MDA2'!J19,'MDA5'!J19, 'T1'!L19, MAX(T3_R1!K19, T3_R2!K19)), MAX('MDA1'!K19, 'MDA2'!K19, 'MDA5'!K19,'T1'!M19, MAX(T3_R1!L19, T3_R2!L19)), MAX('MDA1'!L19, 'MDA2'!L19, 'MDA5'!L19,'T1'!N19, MAX(T3_R1!M19, T3_R2!M19)))","v":342736},{"$f":"IF(AND(COUNTRY_INFO!J19>1,COUNTRY_INFO!J19<4),IF(COUNTRY_INFO!E19>MAX('MDA2'!J19,'MDA5'!J19,'T1'!L19,MAX(T3_R1!K19,T3_R2!K19)),MAX('MDA2'!J19,'MDA5'!J19,'T1'!L19,MAX(T3_R1!K19,T3_R2!K19)),COUNTRY_INFO!E19),0)","v":47016},{"$f":"IF(AND(COUNTRY_INFO!J19>1,COUNTRY_INFO!J19<4), IF(T19/COUNTRY_INFO!E19*100<>0, IF(T19/COUNTRY_INFO!E19*100>100,100,T19/COUNTRY_INFO!E19*100), \"-\"),0)","v":86.01836413169157},{"$f":"IF(AND(COUNTRY_INFO!J19>1,COUNTRY_INFO!J19<4),IF(COUNTRY_INFO!F19>MAX('MDA1'!K19,'MDA2'!K19,'MDA5'!K19,'T1'!M19,MAX(T3_R1!L19,T3_R2!L19)),MAX('MDA1'!K19,'MDA2'!K19,'MDA5'!K19,'T1'!M19,MAX(T3_R1!L19,T3_R2!L19)),COUNTRY_INFO!F19),0)","v":116123},{"$f":"IF(AND(COUNTRY_INFO!J19>1,COUNTRY_INFO!J19<4), IF(V19/COUNTRY_INFO!F19*100<>0, IF(V19/COUNTRY_INFO!F19*100>100,100,V19/COUNTRY_INFO!F19*100), \"-\"),0)","v":88.522262794088022},163139,{"$f":"IF(AND(COUNTRY_INFO!J19>1,COUNTRY_INFO!J19<4), IF(S19/P19*100<>0, IF(X19/P19*100>100,100,X19/P19*100), \"-\"),0)","v":87.785822011030248},{"$f":"COUNTRY_INFO!O19","v":52810},null,null,{"$f":"MAX('T1'!L19,'T2'!J19)+MAX('T1'!M19,'T2'!K19)+MAX('T1'!N19,'T2'!L19)","v":113171},{"$f":"IF(COUNTRY_INFO!K19=1,IF(COUNTRY_INFO!F19*0.33>MAX('T1'!M19,'T2'!K19),MAX('T1'!M19,'T2'!K19),COUNTRY_INFO!F19*0.33),IF(COUNTRY_INFO!K19=2,IF(COUNTRY_INFO!F19*0.5>MAX('T1'!M19,'T2'!K19),MAX('T1'!M19,'T2'!K19),COUNTRY_INFO!F19*0.5),IF(COUNTRY_INFO!K19=3,IF(COUNTRY_INFO!F19>MAX('T1'!M19,'T2'!K19),MAX('T1'!M19,'T2'!K19),COUNTRY_INFO!F19),0)))","v":46722},{"$f":"IF(AND(COUNTRY_INFO!K19>0,COUNTRY_INFO!K19<4),IF(Z19>0,IF(COUNTRY_INFO!K19=1, AD19/(COUNTRY_INFO!F19*0.33)*100, IF(COUNTRY_INFO!K19=2, AD19/(COUNTRY_INFO!F19*0.5)*100, IF(COUNTRY_INFO!K19=3, AD19/COUNTRY_INFO!F19*100))),\"-\"),0)","v":71.233729102165469},{"$f":"IF(COUNTRY_INFO!K19=2,IF(COUNTRY_INFO!G19*0.2>MAX('T1'!N19,'T2'!L19),MAX('T1'!N19,'T2'!L19),COUNTRY_INFO!G19*0.2),IF(COUNTRY_INFO!K19=3,IF(COUNTRY_INFO!G19>MAX('T1'!N19,'T2'!L19),MAX('T1'!N19,'T2'!L19),COUNTRY_INFO!G19),0))","v":47486.953759622411},{"$f":"IF(AND(COUNTRY_INFO!K19>0,COUNTRY_INFO!K19<4),IF(Z19>0,IF(COUNTRY_INFO!K19=1, 0, IF(COUNTRY_INFO!K19=2, AF19/(COUNTRY_INFO!G19*0.2)*100, IF(COUNTRY_INFO!K19=3, AF19/COUNTRY_INFO!G19*100))),\"-\"),0)","v":100},94208.953759622411,{"$f":"IF(AND(COUNTRY_INFO!K19>0,COUNTRY_INFO!K19<4), IF(AC19/Z19*100<>0, IF(AH19/Z19*100>100,100,AH19/Z19*100), \"-\"),0)","v":100},null,{"$f":"IF(AND(D19<>0, D19<>\"Unknown\",D19<>\"Stopped\",D19<>\"Not required\"),D19/COUNTRY_INFO!D19, 0)","v":0},{"$f":"IF(AND(J19<>0,J19<>\"Unknown\",J19<>\"Stopped\",J19<>\"Not required\"),J19/COUNTRY_INFO!D19, 0)","v":0},{"$f":"IF(AND(P19<>0,P19<>\"Unknown\",P19<>\"Not required\"),P19/(COUNTRY_INFO!E19+COUNTRY_INFO!F19), 0)","v":1},{"$f":"IF(AND(Z19<>0,Z19<>\"Unknown\",Z19<>\"Not required\"),IF(COUNTRY_INFO!K19=1,1,IF(COUNTRY_INFO!K19=2,0.5*COUNTRY_INFO!F19/(0.5*COUNTRY_INFO!F19+0.2*COUNTRY_INFO!G19),IF(COUNTRY_INFO!K19=3,COUNTRY_INFO!F19/(COUNTRY_INFO!F19+COUNTRY_INFO!G19)))),0)","v":0.58004640371229688},{"$f":"IF(AND(Z19<>0,Z19<>\"Unknown\",Z19<>\"Not required\"),IF(COUNTRY_INFO!K19=1,0,IF(COUNTRY_INFO!K19=2,0.2*COUNTRY_INFO!G19/(0.5*COUNTRY_INFO!F19+0.2*COUNTRY_INFO!G19),IF(COUNTRY_INFO!K19=3,COUNTRY_INFO!G19/(COUNTRY_INFO!F19+COUNTRY_INFO!G19)))),0)","v":0.41995359628770307},{"$f":"MAX(COUNTRY_INFO!D19*AK19*PROFILE!$G$7,COUNTRY_INFO!D19*AL19*PROFILE!$G$7)","v":0},{"$f":"MAX(COUNTRY_INFO!D19*AK19*PROFILE!$G$8,COUNTRY_INFO!D19*AL19*PROFILE!$G$8,COUNTRY_INFO!D19*AM19*PROFILE!$G$8)","v":51620.052102410562},{"$f":"MAX(COUNTRY_INFO!D19*AK19*PROFILE!$G$9,COUNTRY_INFO!D19*AL19*PROFILE!$G$9,COUNTRY_INFO!D19*AM19*PROFILE!$G$9,IF(AND(DISTRICT!Z19<>\"Unknown\",Z19<>\"Not required\"),COUNTRY_INFO!O19*DISTRICT!AN19,0))","v":124469.79821368464},{"$f":"MAX(COUNTRY_INFO!D19*AK19*PROFILE!$G$10,COUNTRY_INFO!D19*AL19*PROFILE!$G$10,IF(AND(DISTRICT!Z19<>\"Unknown\",Z19<>\"Not required\"),COUNTRY_INFO!O19*DISTRICT!AO19,0))","v":22177.749419953598},198267.59973604878,"Y",{"$f":"MAX('MDA2'!J19,'MDA5'!J19,'T1'!L19,'T2'!J19,T3_R1!K19,T3_R2!K19)","v":47016},{"$f":"MAX('MDA1'!K19,'MDA2'!K19,'MDA3'!I19,'MDA3'!L19,'MDA5'!K19,'T1'!M19,'T2'!K19,T3_R1!L19,T3_R2!L19)","v":116123},{"$f":"MAX('MDA1'!L19,'MDA2'!L19,'MDA3'!J19,'MDA3'!M19,'MDA5'!L19,'T1'!N19,'T2'!L19,T3_R1!M19,T3_R2!M19)","v":179597},342736,{"$f":"MAX('MDA2'!J19,'MDA5'!J19,T19)","v":47016},{"$f":"MAX('MDA1'!K19,'MDA2'!K19,'MDA3'!I19,'MDA3'!L19,'MDA5'!K19,V19,AD19)","v":116123},{"$f":"MAX('MDA1'!L19,'MDA2'!L19,'MDA3'!J19,'MDA3'!M19,'MDA5'!L19,AF19)","v":47486.953759622411},198267.59973604878,100]
[{"$f":"IF(COUNTRY_INFO!A20=0,\" \",COUNTRY_INFO!A20)","v":"Rwanda"},{"$f":"IF(COUNTRY_INFO!B20=0,\" \",COUNTRY_INFO!B20)","v":"Kigali"},{"$f":"IF(COUNTRY_INFO!C20=0,\" \",COUNTRY_INFO!C20)","v":"Kicukiro"},{"$f":"COUNTRY_INFO!L20","v":0},null,null,{"$f":"MAX('MDA1'!M20,'MDA2'!M20,'MDA5'!M20)","v":0},{"$f":"IF(AND(COUNTRY_INFO!H20>0,COUNTRY_INFO!H20<4),IF(D20>MAX('MDA1'!M20,'MDA2'!M20,'MDA5'!M20),MAX('MDA1'!M20,'MDA2'!M20,'MDA5'!M20),D20),0)","v":0},{"$f":"IF(AND(COUNTRY_INFO!H20>0,COUNTRY_INFO!H20<4), IF(G20/D20*100<>0, IF(G20/D20*100>100,100,G20/D20*100), \"-\"),0)","v":0},{"$f":"COUNTRY_INFO!M20","v":0},null,null,{"$f":"MAX('MDA1'!M20,MAX('MDA3'!I20,'MDA3'!L20)+MAX('MDA3'!J20,'MDA3'!M20))","v":0},{"$f":"IF(AND(COUNTRY_INFO!I20>0,COUNTRY_INFO!I20<4),IF(J20>MAX('MDA1'!M20,MAX('MDA3'!I20,'MDA3'!L20)+MAX('MDA3'!J20,'MDA3'!M20)),MAX('MDA1'!M20,MAX('MDA3'!I20,'MDA3'!L20)+MAX('MDA3'!J20,'MDA3'!M20)),J20),0)","v":0},{"$f":"IF(AND(COUNTRY_INFO!I20>0,COUNTRY_INFO!I20<4), IF(M20/J20*100<>0, IF(M20/J20*100>100,100,M20/J20*100), \"-\"),0)","v":0},{"$f":"COUNTRY_INFO!N20","v":0},null,null,{"$f":"SUM(MAX('MDA2'!J20,'MDA5'!J20, 'T1'!L20, MAX(T3_R1!K20, T3_R2!K20)), MAX('MDA1'!K20, 'MDA2'!K20, 'MDA5'!K20,'T1'!M20, MAX(T3_R1!L20, T3_R2!L20)), MAX('MDA1'!L20, 'MDA2'!L20, 'MDA5'!L20,'T1'!N20, MAX(T3_R1!M20, T3_R2!M20)))","v":217995},{"$f":"IF(AND(COUNTRY_INFO!J20>1,COUNTRY_INFO!J20<4),IF(COUNTRY_INFO!E20>MAX('MDA2'!J20,'MDA5'!J20,'T1'!L20,MAX(T3_R1!K20,T3_R2!K20)),MAX('MDA2'!J20,'MDA5'!J20,'T1'!L20,MAX(T3_R1!K20,T3_R2!K20)),COUNTRY_INFO!E20),0)","v":0},{"$f":"IF(AND(COUNTRY_INFO!J20>1,COUNTRY_INFO!J20<4), IF(T20/COUNTRY_INFO!E20*100<>0, IF(T20/COUNTRY_INFO!E20*100>100,100,T20/COUNTRY_INFO!E20*100), \"-\"),0)","v":0},{"$f":"IF(AND(COUNTRY_INFO!J20>1,COUNTRY_INFO!J20<4),IF(COUNTRY_INFO!F20>MAX('MDA1'!K20,'MDA2'!K20,'MDA5'!K20,'T1'!M20,MAX(T3_R1!L20,T3_R2!L20)),MAX('MDA1'!K20,'MDA2'!K20,'MDA5'!K20,'T1'!M20,MAX(T3_R1!L20,T3_R2!L20)),COUNTRY_INFO!F20),0)","v":0},{"$f":"IF(AND(COUNTRY_INFO!J20>1,COUNTRY_INFO!J20<4), IF(V20/COUNTRY_INFO!F20*100<>0, IF(V20/COUNTRY_INFO!F20*100>100,100,V20/COUNTRY_INFO!F20*100), \"-\"),0)","v":0},0,{"$f":"IF(AND(COUNTRY_INFO!J20>1,COUNTRY_INFO!J20<4), IF(S20/P20*100<>0, IF(X20/P20*100>100,100,X20/P20*100), \"-\"),0)","v":0},{"$f":"COUNTRY_INFO!O20","v":37998},null,null,{"$f":"MAX('T1'!L20,'T2'!J20)+MAX('T1'!M20,'T2'!K20)+MAX('T1'!N20,'T2'!L20)","v":0},{"$f":"IF(COUNTRY_INFO!K20=1,IF(COUNTRY_INFO!F20*0.33>MAX('T1'!M20,'T2'!K20),MAX('T1'!M20,'T2'!K20),COUNTRY_INFO!F20*0.33),IF(COUNTRY_INFO!K20=2,IF(COUNTRY_INFO!F20*0.5>MAX('T1'!M20,'T2'!K20),MAX('T1'!M20,'T2'!K20),COUNTRY_INFO!F20*0.5),IF(COUNTRY_INFO!K20=3,IF(COUNTRY_INFO!F20>MAX('T1'!M20,'T2'!K20),MAX('T1'!M20,'T2'!K20),COUNTRY_INFO!F20),0)))","v":0},{"$f":"IF(AND(COUNTRY_INFO!K20>0,COUNTRY_INFO!K20<4),IF(Z20>0,IF(COUNTRY_INFO!K20=1, AD20/(COUNTRY_INFO!F20*0.33)*100, IF(COUNTRY_INFO!K20=2, AD20/(COUNTRY_INFO!F20*0.5)*100, IF(COUNTRY_INFO!K20=3, AD20/COUNTRY_INFO!F20*100))),\"-\"),0)","v":0},{"$f":"IF(COUNTRY_INFO!K20=2,IF(COUNTRY_INFO!G20*0.2>MAX('T1'!N20,'T2'!L20),MAX('T1'!N20,'T2'!L20),COUNTRY_INFO!G20*0.2),IF(COUNTRY_INFO!K20=3,IF(COUNTRY_INFO!G20>MAX('T1'!N20,'T2'!L20),MAX('T1'!N20,'T2'!L20),COUNTRY_INFO!G20),0))","v":0},{"$f":"IF(AND(COUNTRY_INFO!K20>0,COUNTRY_INFO!K20<4),IF(Z20>0,IF(COUNTRY_INFO!K20=1, 0, IF(COUNTRY_INFO!K20=2, AF20/(COUNTRY_INFO!G20*0.2)*100, IF(COUNTRY_INFO!K20=3, AF20/COUNTRY_INFO!G20*100))),\"-\"),0)","v":0},0,{"$f":"IF(AND(COUNTRY_INFO!K20>0,COUNTRY_INFO!K20<4), IF(AC20/Z20*100<>0, IF(AH20/Z20*100>100,100,AH20/Z20*100), \"-\"),0)","v":"-"},null,{"$f":"IF(AND(D20<>0, D20<>\"Unknown\",D20<>\"Stopped\",D20<>\"Not required\"),D20/COUNTRY_INFO!D20, 0)","v":0},{"$f":"IF(AND(J20<>0,J20<>\"Unknown\",J20<>\"Stopped\",J20<>\"Not required\"),J20/COUNTRY_INFO!D20, 0)","v":0},{"$f":"IF(AND(P20<>0,P20<>\"Unknown\",P20<>\"Not required\"),P20/(COUNTRY_INFO!E20+COUNTRY_INFO!F20), 0)","v":0},{"$f":"IF(AND(Z20<>0,Z20<>\"Unknown\",Z20<>\"Not required\"),IF(COUNTRY_INFO!K20=1,1,IF(COUNTRY_INFO!K20=2,0.5*COUNTRY_INFO!F20/(0.5*COUNTRY_INFO!F20+0.2*COUNTRY_INFO!G20),IF(COUNTRY_INFO!K20=3,COUNTRY_INFO!F20/(COUNTRY_INFO!F20+COUNTRY_INFO!G20)))),0)","v":1},{"$f":"IF(AND(Z20<>0,Z20<>\"Unknown\",Z20<>\"Not required\"),IF(COUNTRY_INFO!K20=1,0,IF(COUNTRY_INFO!K20=2,0.2*COUNTRY_INFO!G20/(0.5*COUNTRY_INFO!F20+0.2*COUNTRY_INFO!G20),IF(COUNTRY_INFO!K20=3,COUNTRY_INFO!G20/(COUNTRY_INFO!F20+COUNTRY_INFO!G20)))),0)","v":0},{"$f":"MAX(COUNTRY_INFO!D20*AK20*PROFILE!$G$7,COUNTRY_INFO!D20*AL20*PROFILE!$G$7)","v":0},{"$f":"MAX(COUNTRY_INFO!D20*AK20*PROFILE!$G$8,COUNTRY_INFO!D20*AL20*PROFILE!$G$8,COUNTRY_INFO!D20*AM20*PROFILE!$G$8)","v":0},{"$f":"MAX(COUNTRY_INFO!D20*AK20*PROFILE!$G$9,COUNTRY_INFO!D20*AL20*PROFILE!$G$9,COUNTRY_INFO!D20*AM20*PROFILE!$G$9,IF(AND(DISTRICT!Z20<>\"Unknown\",Z20<>\"Not required\"),COUNTRY_INFO!O20*DISTRICT!AN20,0))","v":37998},{"$f":"MAX(COUNTRY_INFO!D20*AK20*PROFILE!$G$10,COUNTRY_INFO!D20*AL20*PROFILE!$G$10,IF(AND(DISTRICT!Z20<>\"Unknown\",Z20<>\"Not required\"),COUNTRY_INFO!O20*DISTRICT!AO20,0))","v":0},37998,0,{"$f":"MAX('MDA2'!J20,'MDA5'!J20,'T1'!L20,'T2'!J20,T3_R1!K20,T3_R2!K20)","v":42171},{"$f":"MAX('MDA1'!K20,'MDA2'!K20,'MDA3'!I20,'MDA3'!L20,'MDA5'!K20,'T1'!M20,'T2'!K20,T3_R1!L20,T3_R2!L20)","v":109313},{"$f":"MAX('MDA1'!L20,'MDA2'!L20,'MDA3'!J20,'MDA3'!M20,'MDA5'!L20,'T1'!N20,'T2'!L20,T3_R1!M20,T3_R2!M20)","v":66511},217995,{"$f":"MAX('MDA2'!J20,'MDA5'!J20,T20)","v":0},{"$f":"MAX('MDA1'!K20,'MDA2'!K20,'MDA3'!I20,'MDA3'!L20,'MDA5'!K20,V20,AD20)","v":0},{"$f":"MAX('MDA1'!L20,'MDA2'!L20,'MDA3'!J20,'MDA3'!M20,'MDA5'!L20,AF20)","v":0},0,0]
[{"$f":"IF(COUNTRY_INFO!A21=0,\" \",COUNTRY_INFO!A21)","v":"Rwanda"},{"$f":"IF(COUNTRY_INFO!B21=0,\" \",COUNTRY_INFO!B21)","v":"Eastern"},{"$f":"IF(COUNTRY_INFO!C21=0,\" \",COUNTRY_INFO!C21)","v":"Kirehe"},{"$f":"COUNTRY_INFO!L21","v":0},null,null,{"$f":"MAX('MDA1'!M21,'MDA2'!M21,'MDA5'!M21)","v":0},{"$f":"IF(AND(COUNTRY_INFO!H21>0,COUNTRY_INFO!H21<4),IF(D21>MAX('MDA1'!M21,'MDA2'!M21,'MDA5'!M21),MAX('MDA1'!M21,'MDA2'!M21,'MDA5'!M21),D21),0)","v":0},{"$f":"IF(AND(COUNTRY_INFO!H21>0,COUNTRY_INFO!H21<4), IF(G21/D21*100<>0, IF(G21/D21*100>100,100,G21/D21*100), \"-\"),0)","v":0},{"$f":"COUNTRY_INFO!M21","v":0},null,null,{"$f":"MAX('MDA1'!M21,MAX('MDA3'!I21,'MDA3'!L21)+MAX('MDA3'!J21,'MDA3'!M21))","v":0},{"$f":"IF(AND(COUNTRY_INFO!I21>0,COUNTRY_INFO!I21<4),IF(J21>MAX('MDA1'!M21,MAX('MDA3'!I21,'MDA3'!L21)+MAX('MDA3'!J21,'MDA3'!M21)),MAX('MDA1'!M21,MAX('MDA3'!I21,'MDA3'!L21)+MAX('MDA3'!J21,'MDA3'!M21)),J21),0)","v":0},{"$f":"IF(AND(COUNTRY_INFO!I21>0,COUNTRY_INFO!I21<4), IF(M21/J21*100<>0, IF(M21/J21*100>100,100,M21/J21*100), \"-\"),0)","v":0},{"$f":"COUNTRY_INFO!N21","v":0},null,null,{"$f":"SUM(MAX('MDA2'!J21,'MDA5'!J21, 'T1'!L21, MAX(T3_R1!K21, T3_R2!K21)), MAX('MDA1'!K21, 'MDA2'!K21, 'MDA5'!K21,'T1'!M21, MAX(T3_R1!L21, T3_R2!L21)), MAX('MDA1'!L21, 'MDA2'!L21, 'MDA5'!L21,'T1'!N21, MAX(T3_R1!M21, T3_R2!M21)))","v":385925},{"$f":"IF(AND(COUNTRY_INFO!J21>1,COUNTRY_INFO!J21<4),IF(COUNTRY_INFO!E21>MAX('MDA2'!J21,'MDA5'!J21,'T1'!L21,MAX(T3_R1!K21,T3_R2!K21)),MAX('MDA2'!J21,'MDA5'!J21,'T1'!L21,MAX(T3_R1!K21,T3_R2!K21)),COUNTRY_INFO!E21),0)","v":0},{"$f":"IF(AND(COUNTRY_INFO!J21>1,COUNTRY_INFO!J21<4), IF(T21/COUNTRY_INFO!E21*100<>0, IF(T21/COUNTRY_INFO!E21*100>100,100,T21/COUNTRY_INFO!E21*100), \"-\"),0)","v":0},{"$f":"IF(AND(COUNTRY_INFO!J21>1,COUNTRY_INFO!J21<4),IF(COUNTRY_INFO!F21>MAX('MDA1'!K21,'MDA2'!K21,'MDA5'!K21,'T1'!M21,MAX(T3_R1!L21,T3_R2!L21)),MAX('MDA1'!K21,'MDA2'!K21,'MDA5'!K21,'T1'!M21,MAX(T3_R1!L21,T3_R2!L21)),COUNTRY_INFO!F21),0)","v":0},{"$f":"IF(AND(COUNTRY_INFO!J21>1,COUNTRY_INFO!J21<4), IF(V21/COUNTRY_INFO!F21*100<>0, IF(V21/COUNTRY_INFO!F21*100>100,100,V21/COUNTRY_INFO!F21*100), \"-\"),0)","v":0},0,{"$f":"IF(AND(COUNTRY_INFO!J21>1,COUNTRY_INFO!J21<4), IF(S21/P21*100<>0, IF(X21/P21*100>100,100,X21/P21*100), \"-\"),0)","v":0},{"$f":"COUNTRY_INFO!O21","v":42721},null,null,{"$f":"MAX('T1'!L21,'T2'!J21)+MAX('T1'!M21,'T2'!K21)+MAX('T1'!N21,'T2'!L21)","v":0},{"$f":"IF(COUNTRY_INFO!K21=1,IF(COUNTRY_INFO!F21*0.33>MAX('T1'!M21,'T2'!K21),MAX('T1'!M21,'T2'!K21),COUNTRY_INFO!F21*0.33),IF(COUNTRY_INFO!K21=2,IF(COUNTRY_INFO!F21*0.5>MAX('T1'!M21,'T2'!K21),MAX('T1'!M21,'T2'!K21),COUNTRY_INFO!F21*0.5),IF(COUNTRY_INFO!K21=3,IF(COUNTRY_INFO!F21>MAX('T1'!M21,'T2'!K21),MAX('T1'!M21,'T2'!K21),COUNTRY_INFO!F21),0)))","v":0},{"$f":"IF(AND(COUNTRY_INFO!K21>0,COUNTRY_INFO!K21<4),IF(Z21>0,IF(COUNTRY_INFO!K21=1, AD21/(COUNTRY_INFO!F21*0.33)*100, IF(COUNTRY_INFO!K21=2, AD21/(COUNTRY_INFO!F21*0.5)*100, IF(COUNTRY_INFO!K21=3, AD21/COUNTRY_INFO!F21*100))),\"-\"),0)","v":0},{"$f":"IF(COUNTRY_INFO!K21=2,IF(COUNTRY_INFO!G21*0.2>MAX('T1'!N21,'T2'!L21),MAX('T1'!N21,'T2'!L21),COUNTRY_INFO!G21*0.2),IF(COUNTRY_INFO!K21=3,IF(COUNTRY_INFO!G21>MAX('T1'!N21,'T2'!L21),MAX('T1'!N21,'T2'!L21),COUNTRY_INFO!G21),0))","v":0},{"$f":"IF(AND(COUNTRY_INFO!K21>0,COUNTRY_INFO!K21<4),IF(Z21>0,IF(COUNTRY_INFO!K21=1, 0, IF(COUNTRY_INFO!K21=2, AF21/(COUNTRY_INFO!G21*0.2)*100, IF(COUNTRY_INFO!K21=3, AF21/COUNTRY_INFO!G21*100))),\"-\"),0)","v":0},0,{"$f":"IF(AND(COUNTRY_INFO!K21>0,COUNTRY_INFO!K21<4), IF(AC21/Z21*100<>0, IF(AH21/Z21*100>100,100,AH21/Z21*100), \"-\"),0)","v":"-"},null,{"$f":"IF(AND(D21<>0, D21<>\"Unknown\",D21<>\"Stopped\",D21<>\"Not required\"),D21/COUNTRY_INFO!D21, 0)","v":0},{"$f":"IF(AND(J21<>0,J21<>\"Unknown\",J21<>\"Stopped\",J21<>\"Not required\"),J21/COUNTRY_INFO!D21, 0)","v":0},{"$f":"IF(AND(P21<>0,P21<>\"Unknown\",P21<>\"Not required\"),P21/(COUNTRY_INFO!E21+COUNTRY_INFO!F21), 0)","v":0},{"$f":"IF(AND(Z21<>0,Z21<>\"Unknown\",Z21<>\"Not required\"),IF(COUNTRY_INFO!K21=1,1,IF(COUNTRY_INFO!K21=2,0.5*COUNTRY_INFO!F21/(0.5*COUNTRY_INFO!F21+0.2*COUNTRY_INFO!G21),IF(COUNTRY_INFO!K21=3,COUNTRY_INFO!F21/(COUNTRY_INFO!F21+COUNTRY_INFO!G21)))),0)","v":1},{"$f":"IF(AND(Z21<>0,Z21<>\"Unknown\",Z21<>\"Not required\"),IF(COUNTRY_INFO!K21=1,0,IF(COUNTRY_INFO!K21=2,0.2*COUNTRY_INFO!G21/(0.5*COUNTRY_INFO!F21+0.2*COUNTRY_INFO!G21),IF(COUNTRY_INFO!K21=3,COUNTRY_INFO!G21/(COUNTRY_INFO!F21+COUNTRY_INFO!G21)))),0)","v":0},{"$f":"MAX(COUNTRY_INFO!D21*AK21*PROFILE!$G$7,COUNTRY_INFO!D21*AL21*PROFILE!$G$7)","v":0},{"$f":"MAX(COUNTRY_INFO!D21*AK21*PROFILE!$G$8,COUNTRY_INFO!D21*AL21*PROFILE!$G$8,COUNTRY_INFO!D21*AM21*PROFILE!$G$8)","v":0},{"$f":"MAX(COUNTRY_INFO!D21*AK21*PROFILE!$G$9,COUNTRY_INFO!D21*AL21*PROFILE!$G$9,COUNTRY_INFO!D21*AM21*PROFILE!$G$9,IF(AND(DISTRICT!Z21<>\"Unknown\",Z21<>\"Not required\"),COUNTRY_INFO!O21*DISTRICT!AN21,0))","v":42721},{"$f":"MAX(COUNTRY_INFO!D21*AK21*PROFILE!$G$10,COUNTRY_INFO!D21*AL21*PROFILE!$G$10,IF(AND(DISTRICT!Z21<>\"Unknown\",Z21<>\"Not required\"),COUNTRY_INFO!O21*DISTRICT!AO21,0))","v":0},42721,0,{"$f":"MAX('MDA2'!J21,'MDA5'!J21,'T1'!L21,'T2'!J21,T3_R1!K21,T3_R2!K21)","v":58095},{"$f":"MAX('MDA1'!K21,'MDA2'!K21,'MDA3'!I21,'MDA3'!L21,'MDA5'!K21,'T1'!M21,'T2'!K21,T3_R1!L21,T3_R2!L21)","v":121294},{"$f":"MAX('MDA1'!L21,'MDA2'!L21,'MDA3'!J21,'MDA3'!M21,'MDA5'!L21,'T1'!N21,'T2'!L21,T3_R1!M21,T3_R2!M21)","v":206536},385925,{"$f":"MAX('MDA2'!J21,'MDA5'!J21,T21)","v":0},{"$f":"MAX('MDA1'!K21,'MDA2'!K21,'MDA3'!I21,'MDA3'!L21,'MDA5'!K21,V21,AD21)","v":0},{"$f":"MAX('MDA1'!L21,'MDA2'!L21,'MDA3'!J21,'MDA3'!M21,'MDA5'!L21,AF21)","v":0},0,0]
[{"$f":"IF(COUNTRY_INFO!A22=0,\" \",COUNTRY_INFO!A22)","v":"Rwanda"},{"$f":"IF(COUNTRY_INFO!B22=0,\" \",COUNTRY_INFO!B22)","v":"Southern"},{"$f":"IF(COUNTRY_INFO!C22=0,\" \",COUNTRY_INFO!C22)","v":"Muhanga"},{"$f":"COUNTRY_INFO!L22","v":0},null,null,{"$f":"MAX('MDA1'!M22,'MDA2'!M22,'MDA5'!M22)","v":0},{"$f":"IF(AND(COUNTRY_INFO!H22>0,COUNTRY_INFO!H22<4),IF(D22>MAX('MDA1'!M22,'MDA2'!M22,'MDA5'!M22),MAX('MDA1'!M22,'MDA2'!M22,'MDA5'!M22),D22),0)","v":0},{"$f":"IF(AND(COUNTRY_INFO!H22>0,COUNTRY_INFO!H22<4), IF(G22/D22*100<>0, IF(G22/D22*100>100,100,G22/D22*100), \"-\"),0)","v":0},{"$f":"COUNTRY_INFO!M22","v":0},null,null,{"$f":"MAX('MDA1'!M22,MAX('MDA3'!I22,'MDA3'!L22)+MAX('MDA3'!J22,'MDA3'!M22))","v":0},{"$f":"IF(AND(COUNTRY_INFO!I22>0,COUNTRY_INFO!I22<4),IF(J22>MAX('MDA1'!M22,MAX('MDA3'!I22,'MDA3'!L22)+MAX('MDA3'!J22,'MDA3'!M22)),MAX('MDA1'!M22,MAX('MDA3'!I22,'MDA3'!L22)+MAX('MDA3'!J22,'MDA3'!M22)),J22),0)","v":0},{"$f":"IF(AND(COUNTRY_INFO!I22>0,COUNTRY_INFO!I22<4), IF(M22/J22*100<>0, IF(M22/J22*100>100,100,M22/J22*100), \"-\"),0)","v":0},{"$f":"COUNTRY_INFO!N22","v":153593.401368024},null,null,{"$f":"SUM(MAX('MDA2'!J22,'MDA5'!J22, 'T1'!L22, MAX(T3_R1!K22, T3_R2!K22)), MAX('MDA1'!K22, 'MDA2'!K22, 'MDA5'!K22,'T1'!M22, MAX(T3_R1!L22, T3_R2!L22)), MAX('MDA1'!L22, 'MDA2'!L22, 'MDA5'!L22,'T1'!N22, MAX(T3_R1!M22, T3_R2!M22)))","v":343574},{"$f":"IF(AND(COUNTRY_INFO!J22>1,COUNTRY_INFO!J22<4),IF(COUNTRY_INFO!E22>MAX('MDA2'!J22,'MDA5'!J22,'T1'!L22,MAX(T3_R1!K22,T3_R2!K22)),MAX('MDA2'!J22,'MDA5'!J22,'T1'!L22,MAX(T3_R1!K22,T3_R2!K22)),COUNTRY_INFO!E22),0)","v":37679},{"$f":"IF(AND(COUNTRY_INFO!J22>1,COUNTRY_INFO!J22<4), IF(T22/COUNTRY_INFO!E22*100<>0, IF(T22/COUNTRY_INFO!E22*100>100,100,T22/COUNTRY_INFO!E22*100), \"-\"),0)","v":90.981469734984827},{"$f":"IF(AND(COUNTRY_INFO!J22>1,COUNTRY_INFO!J22<4),IF(COUNTRY_INFO!F22>MAX('MDA1'!K22,'MDA2'!K22,'MDA5'!K22,'T1'!M22,MAX(T3_R1!L22,T3_R2!L22)),MAX('MDA1'!K22,'MDA2'!K22,'MDA5'!K22,'T1'!M22,MAX(T3_R1!L22,T3_R2!L22)),COUNTRY_INFO!F22),0)","v":98055},{"$f":"IF(AND(COUNTRY_INFO!J22>1,COUNTRY_INFO!J22<4), IF(V22/COUNTRY_INFO!F22*100<>0, IF(V22/COUNTRY_INFO!F22*100>100,100,V22/COUNTRY_INFO!F22*100), \"-\"),0)","v":87.409039016816877},135734,{"$f":"IF(AND(COUNTRY_INFO!J22>1,COUNTRY_INFO!J22<4), IF(S22/P22*100<>0, IF(X22/P22*100>100,100,X22/P22*100), \"-\"),0)","v":88.372286042919754},{"$f":"COUNTRY_INFO!O22","v":22840},null,null,{"$f":"MAX('T1'!L22,'T2'!J22)+MAX('T1'!M22,'T2'!K22)+MAX('T1'!N22,'T2'!L22)","v":41565},{"$f":"IF(COUNTRY_INFO!K22=1,IF(COUNTRY_INFO!F22*0.33>MAX('T1'!M22,'T2'!K22),MAX('T1'!M22,'T2'!K22),COUNTRY_INFO!F22*0.33),IF(COUNTRY_INFO!K22=2,IF(COUNTRY_INFO!F22*0.5>MAX('T1'!M22,'T2'!K22),MAX('T1'!M22,'T2'!K22),COUNTRY_INFO!F22*0.5),IF(COUNTRY_INFO!K22=3,IF(COUNTRY_INFO!F22>MAX('T1'!M22,'T2'!K22),MAX('T1'!M22,'T2'!K22),COUNTRY_INFO!F22),0)))","v":15908},{"$f":"IF(AND(COUNTRY_INFO!K22>0,COUNTRY_INFO!K22<4),IF(Z22>0,IF(COUNTRY_INFO!K22=1, AD22/(COUNTRY_INFO!F22*0.33)*100, IF(COUNTRY_INFO!K22=2, AD22/(COUNTRY_INFO!F22*0.5)*100, IF(COUNTRY_INFO!K22=3, AD22/COUNTRY_INFO!F22*100))),\"-\"),0)","v":28.3616948177966},{"$f":"IF(COUNTRY_INFO!K22=2,IF(COUNTRY_INFO!G22*0.2>MAX('T1'!N22,'T2'!L22),MAX('T1'!N22,'T2'!L22),COUNTRY_INFO!G22*0.2),IF(COUNTRY_INFO!K22=3,IF(COUNTRY_INFO!G22>MAX('T1'!N22,'T2'!L22),MAX('T1'!N22,'T2'!L22),COUNTRY_INFO!G22),0))","v":25657},{"$f":"IF(AND(COUNTRY_INFO!K22>0,COUNTRY_INFO!K22<4),IF(Z22>0,IF(COUNTRY_INFO!K22=1, 0, IF(COUNTRY_INFO!K22=2, AF22/(COUNTRY_INFO!G22*0.2)*100, IF(COUNTRY_INFO!K22=3, AF22/COUNTRY_INFO!G22*100))),\"-\"),0)","v":56.073080665086849},41565,{"$f":"IF(AND(COUNTRY_INFO!K22>0,COUNTRY_INFO!K22<4), IF(AC22/Z22*100<>0, IF(AH22/Z22*100>100,100,AH22/Z22*100), \"-\"),0)","v":100},null,{"$f":"IF(AND(D22<>0, D22<>\"Unknown\",D22<>\"Stopped\",D22<>\"Not required\"),D22/COUNTRY_INFO!D22, 0)","v":0},{"$f":"IF(AND(J22<>0,J22<>\"Unknown\",J22<>\"Stopped\",J22<>\"Not required\"),J22/COUNTRY_INFO!D22, 0)","v":0},{"$f":"IF(AND(P22<>0,P22<>\"Unknown\",P22<>\"Not required\"),P22/(COUNTRY_INFO!E22+COUNTRY_INFO!F22), 0)","v":1},{"$f":"IF(AND(Z22<>0,Z22<>\"Unknown\",Z22<>\"Not required\"),IF(COUNTRY_INFO!K22=1,1,IF(COUNTRY_INFO!K22=2,0.5*COUNTRY_INFO!F22/(0.5*COUNTRY_INFO!F22+0.2*COUNTRY_INFO!G22),IF(COUNTRY_INFO!K22=3,COUNTRY_INFO!F22/(COUNTRY_INFO!F22+COUNTRY_INFO!G22)))),0)","v":0.55073035925779712},{"$f":"IF(AND(Z22<>0,Z22<>\"Unknown\",Z22<>\"Not required\"),IF(COUNTRY_INFO!K22=1,0,IF(COUNTRY_INFO!K22=2,0.2*COUNTRY_INFO!G22/(0.5*COUNTRY_INFO!F22+0.2*COUNTRY_INFO!G22),IF(COUNTRY_INFO!K22=3,COUNTRY_INFO!G22/(COUNTRY_INFO!F22+COUNTRY_INFO!G22)))),0)","v":0.44926964074220294},{"$f":"MAX(COUNTRY_INFO!D22*AK22*PROFILE!$G$7,COUNTRY_INFO!D22*AL22*PROFILE!$G$7)","v":0},{"$f":"MAX(COUNTRY_INFO!D22*AK22*PROFILE!$G$8,COUNTRY_INFO!D22*AL22*PROFILE!$G$8,COUNTRY_INFO!D22*AM22*PROFILE!$G$8)","v":47466.056085165612},{"$f":"MAX(COUNTRY_INFO!D22*AK22*PROFILE!$G$9,COUNTRY_INFO!D22*AL22*PROFILE!$G$9,COUNTRY_INFO!D22*AM22*PROFILE!$G$9,IF(AND(DISTRICT!Z22<>\"Unknown\",Z22<>\"Not required\"),COUNTRY_INFO!O22*DISTRICT!AN22,0))","v":114453.39906280536},{"$f":"MAX(COUNTRY_INFO!D22*AK22*PROFILE!$G$10,COUNTRY_INFO!D22*AL22*PROFILE!$G$10,IF(AND(DISTRICT!Z22<>\"Unknown\",Z22<>\"Not required\"),COUNTRY_INFO!O22*DISTRICT!AO22,0))","v":10261.318594551914},172180.77374252287,"Y",{"$f":"MAX('MDA2'!J22,'MDA5'!J22,'T1'!L22,'T2'!J22,T3_R1!K22,T3_R2!K22)","v":37679},{"$f":"MAX('MDA1'!K22,'MDA2'!K22,'MDA3'!I22,'MDA3'!L22,'MDA5'!K22,'T1'!M22,'T2'!K22,T3_R1!L22,T3_R2!L22)","v":98055},{"$f":"MAX('MDA1'!L22,'MDA2'!L22,'MDA3'!J22,'MDA3'!M22,'MDA5'!L22,'T1'!N22,'T2'!L22,T3_R1!M22,T3_R2!M22)","v":207840},343574,{"$f":"MAX('MDA2'!J22,'MDA5'!J22,T22)","v":37679},{"$f":"MAX('MDA1'!K22,'MDA2'!K22,'MDA3'!I22,'MDA3'!L22,'MDA5'!K22,V22,AD22)","v":98055},{"$f":"MAX('MDA1'!L22,'MDA2'!L22,'MDA3'!J22,'MDA3'!M22,'MDA5'!L22,AF22)","v":25657},161391,93.733461926093]
[{"$f":"IF(COUNTRY_INFO!A23=0,\" \",COUNTRY_INFO!A23)","v":"Rwanda"},{"$f":"IF(COUNTRY_INFO!B23=0,\" \",COUNTRY_INFO!B23)","v":"Northern"},{"$f":"IF(COUNTRY_INFO!C23=0,\" \",COUNTRY_INFO!C23)","v":"Musanze"},{"$f":"COUNTRY_INFO!L23","v":0},null,null,{"$f":"MAX('MDA1'!M23,'MDA2'!M23,'MDA5'!M23)","v":0},{"$f":"IF(AND(COUNTRY_INFO!H23>0,COUNTRY_INFO!H23<4),IF(D23>MAX('MDA1'!M23,'MDA2'!M23,'MDA5'!M23),MAX('MDA1'!M23,'MDA2'!M23,'MDA5'!M23),D23),0)","v":0},{"$f":"IF(AND(COUNTRY_INFO!H23>0,COUNTRY_INFO!H23<4), IF(G23/D23*100<>0, IF(G23/D23*100>100,100,G23/D23*100), \"-\"),0)","v":0},{"$f":"COUNTRY_INFO!M23","v":0},null,null,{"$f":"MAX('MDA1'!M23,MAX('MDA3'!I23,'MDA3'!L23)+MAX('MDA3'!J23,'MDA3'!M23))","v":0},{"$f":"IF(AND(COUNTRY_INFO!I23>0,COUNTRY_INFO!I23<4),IF(J23>MAX('MDA1'!M23,MAX('MDA3'!I23,'MDA3'!L23)+MAX('MDA3'!J23,'MDA3'!M23)),MAX('MDA1'!M23,MAX('MDA3'!I23,'MDA3'!L23)+MAX('MDA3'!J23,'MDA3'!M23)),J23),0)","v":0},{"$f":"IF(AND(COUNTRY_INFO!I23>0,COUNTRY_INFO!I23<4), IF(M23/J23*100<>0, IF(M23/J23*100>100,100,M23/J23*100), \"-\"),0)","v":0},{"$f":"COUNTRY_INFO!N23","v":187907.46620256},null,null,{"$f":"SUM(MAX('MDA2'!J23,'MDA5'!J23, 'T1'!L23, MAX(T3_R1!K23, T3_R2!K23)), MAX('MDA1'!K23, 'MDA2'!K23, 'MDA5'!K23,'T1'!M23, MAX(T3_R1!L23, T3_R2!L23)), MAX('MDA1'!L23, 'MDA2'!L23, 'MDA5'!L23,'T1'!N23, MAX(T3_R1!M23, T3_R2!M23)))","v":334023},{"$f":"IF(AND(COUNTRY_INFO!J23>1,COUNTRY_INFO!J23<4),IF(COUNTRY_INFO!E23>MAX('MDA2'!J23,'MDA5'!J23,'T1'!L23,MAX(T3_R1!K23,T3_R2!K23)),MAX('MDA2'!J23,'MDA5'!J23,'T1'!L23,MAX(T3_R1!K23,T3_R2!K23)),COUNTRY_INFO!E23),0)","v":41363},{"$f":"IF(AND(COUNTRY_INFO!J23>1,COUNTRY_INFO!J23<4), IF(T23/COUNTRY_INFO!E23*100<>0, IF(T23/COUNTRY_INFO!E23*100>100,100,T23/COUNTRY_INFO!E23*100), \"-\"),0)","v":81.04576605294605},{"$f":"IF(AND(COUNTRY_INFO!J23>1,COUNTRY_INFO!J23<4),IF(COUNTRY_INFO!F23>MAX('MDA1'!K23,'MDA2'!K23,'MDA5'!K23,'T1'!M23,MAX(T3_R1!L23,T3_R2!L23)),MAX('MDA1'!K23,'MDA2'!K23,'MDA5'!K23,'T1'!M23,MAX(T3_R1!L23,T3_R2!L23)),COUNTRY_INFO!F23),0)","v":108575},{"$f":"IF(AND(COUNTRY_INFO!J23>1,COUNTRY_INFO!J23<4), IF(V23/COUNTRY_INFO!F23*100<>0, IF(V23/COUNTRY_INFO!F23*100>100,100,V23/COUNTRY_INFO!F23*100), \"-\"),0)","v":79.326594218270742},149938,{"$f":"IF(AND(COUNTRY_INFO!J23>1,COUNTRY_INFO!J23<4), IF(S23/P23*100<>0, IF(X23/P23*100>100,100,X23/P23*100), \"-\"),0)","v":79.793529778306009},{"$f":"COUNTRY_INFO!O23","v":19130},null,null,{"$f":"MAX('T1'!L23,'T2'!J23)+MAX('T1'!M23,'T2'!K23)+MAX('T1'!N23,'T2'!L23)","v":15187},{"$f":"IF(COUNTRY_INFO!K23=1,IF(COUNTRY_INFO!F23*0.33>MAX('T1'!M23,'T2'!K23),MAX('T1'!M23,'T2'!K23),COUNTRY_INFO!F23*0.33),IF(COUNTRY_INFO!K23=2,IF(COUNTRY_INFO!F23*0.5>MAX('T1'!M23,'T2'!K23),MAX('T1'!M23,'T2'!K23),COUNTRY_INFO!F23*0.5),IF(COUNTRY_INFO!K23=3,IF(COUNTRY_INFO!F23>MAX('T1'!M23,'T2'!K23),MAX('T1'!M23,'T2'!K23),COUNTRY_INFO!F23),0)))","v":2967},{"$f":"IF(AND(COUNTRY_INFO!K23>0,COUNTRY_INFO!K23<4),IF(Z23>0,IF(COUNTRY_INFO!K23=1, AD23/(COUNTRY_INFO!F23*0.33)*100, IF(COUNTRY_INFO!K23=2, AD23/(COUNTRY_INFO!F23*0.5)*100, IF(COUNTRY_INFO!K23=3, AD23/COUNTRY_INFO!F23*100))),\"-\"),0)","v":4.3354732681668757},{"$f":"IF(COUNTRY_INFO!K23=2,IF(COUNTRY_INFO!G23*0.2>MAX('T1'!N23,'T2'!L23),MAX('T1'!N23,'T2'!L23),COUNTRY_INFO!G23*0.2),IF(COUNTRY_INFO!K23=3,IF(COUNTRY_INFO!G23>MAX('T1'!N23,'T2'!L23),MAX('T1'!N23,'T2'!L23),COUNTRY_INFO!G23),0))","v":12220},{"$f":"IF(AND(COUNTRY_INFO!K23>0,COUNTRY_INFO!K23<4),IF(Z23>0,IF(COUNTRY_INFO!K23=1, 0, IF(COUNTRY_INFO!K23=2, AF23/(COUNTRY_INFO!G23*0.2)*100, IF(COUNTRY_INFO!K23=3, AF23/COUNTRY_INFO!G23*100))),\"-\"),0)","v":23.22571743680005},15187,{"$f":"IF(AND(COUNTRY_INFO!K23>0,COUNTRY_INFO!K23<4), IF(AC23/Z23*100<>0, IF(AH23/Z23*100>100,100,AH23/Z23*100), \"-\"),0)","v":79.388395190799784},null,{"$f":"IF(AND(D23<>0, D23<>\"Unknown\",D23<>\"Stopped\",D23<>\"Not required\"),D23/COUNTRY_INFO!D23, 0)","v":0},{"$f":"IF(AND(J23<>0,J23<>\"Unknown\",J23<>\"Stopped\",J23<>\"Not required\"),J23/COUNTRY_INFO!D23, 0)","v":0},{"$f":"IF(AND(P23<>0,P23<>\"Unknown\",P23<>\"Not required\"),P23/(COUNTRY_INFO!E23+COUNTRY_INFO!F23), 0)","v":1},{"$f":"IF(AND(Z23<>0,Z23<>\"Unknown\",Z23<>\"Not required\"),IF(COUNTRY_INFO!K23=1,1,IF(COUNTRY_INFO!K23=2,0.5*COUNTRY_INFO!F23/(0.5*COUNTRY_INFO!F23+0.2*COUNTRY_INFO!G23),IF(COUNTRY_INFO!K23=3,COUNTRY_INFO!F23/(COUNTRY_INFO!F23+COUNTRY_INFO!G23)))),0)","v":0.56535070908394014},{"$f":"IF(AND(Z23<>0,Z23<>\"Unknown\",Z23<>\"Not required\"),IF(COUNTRY_INFO!K23=1,0,IF(COUNTRY_INFO!K23=2,0.2*COUNTRY_INFO!G23/(0.5*COUNTRY_INFO!F23+0.2*COUNTRY_INFO!G23),IF(COUNTRY_INFO!K23=3,COUNTRY_INFO!G23/(COUNTRY_INFO!F23+COUNTRY_INFO!G23)))),0)","v":0.43464929091605981},{"$f":"MAX(COUNTRY_INFO!D23*AK23*PROFILE!$G$7,COUNTRY_INFO!D23*AL23*PROFILE!$G$7)","v":0},{"$f":"MAX(COUNTRY_INFO!D23*AK23*PROFILE!$G$8,COUNTRY_INFO!D23*AL23*PROFILE!$G$8,COUNTRY_INFO!D23*AM23*PROFILE!$G$8)","v":54772.550710286538},{"$f":"MAX(COUNTRY_INFO!D23*AK23*PROFILE!$G$9,COUNTRY_INFO!D23*AL23*PROFILE!$G$9,COUNTRY_INFO!D23*AM23*PROFILE!$G$9,IF(AND(DISTRICT!Z23<>\"Unknown\",Z23<>\"Not required\"),COUNTRY_INFO!O23*DISTRICT!AN23,0))","v":132071.31835188146},{"$f":"MAX(COUNTRY_INFO!D23*AK23*PROFILE!$G$10,COUNTRY_INFO!D23*AL23*PROFILE!$G$10,IF(AND(DISTRICT!Z23<>\"Unknown\",Z23<>\"Not required\"),COUNTRY_INFO!O23*DISTRICT!AO23,0))","v":8314.8409352242234},195158.70999739223,"Y",{"$f":"MAX('MDA2'!J23,'MDA5'!J23,'T1'!L23,'T2'!J23,T3_R1!K23,T3_R2!K23)","v":41363},{"$f":"MAX('MDA1'!K23,'MDA2'!K23,'MDA3'!I23,'MDA3'!L23,'MDA5'!K23,'T1'!M23,'T2'!K23,T3_R1!L23,T3_R2!L23)","v":108575},{"$f":"MAX('MDA1'!L23,'MDA2'!L23,'MDA3'!J23,'MDA3'!M23,'MDA5'!L23,'T1'!N23,'T2'!L23,T3_R1!M23,T3_R2!M23)","v":184085},334023,{"$f":"MAX('MDA2'!J23,'MDA5'!J23,T23)","v":41363},{"$f":"MAX('MDA1'!K23,'MDA2'!K23,'MDA3'!I23,'MDA3'!L23,'MDA5'!K23,V23,AD23)","v":108575},{"$f":"MAX('MDA1'!L23,'MDA2'!L23,'MDA3'!J23,'MDA3'!M23,'MDA5'!L23,AF23)","v":12220},162158,83.090321719264693]
[{"$f":"IF(COUNTRY_INFO!A24=0,\" \",COUNTRY_INFO!A24)","v":"Rwanda"},{"$f":"IF(COUNTRY_INFO!B24=0,\" \",COUNTRY_INFO!B24)","v":"Eastern"},{"$f":"IF(COUNTRY_INFO!C24=0,\" \",COUNTRY_INFO!C24)","v":"Ngoma"},{"$f":"COUNTRY_INFO!L24","v":0},null,null,{"$f":"MAX('MDA1'!M24,'MDA2'!M24,'MDA5'!M24)","v":0},{"$f":"IF(AND(COUNTRY_INFO!H24>0,COUNTRY_INFO!H24<4),IF(D24>MAX('MDA1'!M24,'MDA2'!M24,'MDA5'!M24),MAX('MDA1'!M24,'MDA2'!M24,'MDA5'!M24),D24),0)","v":0},{"$f":"IF(AND(COUNTRY_INFO!H24>0,COUNTRY_INFO!H24<4), IF(G24/D24*100<>0, IF(G24/D24*100>100,100,G24/D24*100), \"-\"),0)","v":0},{"$f":"COUNTRY_INFO!M24","v":0},null,null,{"$f":"MAX('MDA1'!M24,MAX('MDA3'!I24,'MDA3'!L24)+MAX('MDA3'!J24,'MDA3'!M24))","v":0},{"$f":"IF(AND(COUNTRY_INFO!I24>0,COUNTRY_INFO!I24<4),IF(J24>MAX('MDA1'!M24,MAX('MDA3'!I24,'MDA3'!L24)+MAX('MDA3'!J24,'MDA3'!M24)),MAX('MDA1'!M24,MAX('MDA3'!I24,'MDA3'!L24)+MAX('MDA3'!J24,'MDA3'!M24)),J24),0)","v":0},{"$f":"IF(AND(COUNTRY_INFO!I24>0,COUNTRY_INFO!I24<4), IF(M24/J24*100<>0, IF(M24/J24*100>100,100,M24/J24*100), \"-\"),0)","v":0},{"$f":"COUNTRY_INFO!N24","v":0},null,null,{"$f":"SUM(MAX('MDA2'!J24,'MDA5'!J24, 'T1'!L24, MAX(T3_R1!K24, T3_R2!K24)), MAX('MDA1'!K24, 'MDA2'!K24, 'MDA5'!K24,'T1'!M24, MAX(T3_R1!L24, T3_R2!L24)), MAX('MDA1'!L24, 'MDA2'!L24, 'MDA5'!L24,'T1'!N24, MAX(T3_R1!M24, T3_R2!M24)))","v":363795},{"$f":"IF(AND(COUNTRY_INFO!J24>1,COUNTRY_INFO!J24<4),IF(COUNTRY_INFO!E24>MAX('MDA2'!J24,'MDA5'!J24,'T1'!L24,MAX(T3_R1!K24,T3_R2!K24)),MAX('MDA2'!J24,'MDA5'!J24,'T1'!L24,MAX(T3_R1!K24,T3_R2!K24)),COUNTRY_INFO!E24),0)","v":0},{"$f":"IF(AND(COUNTRY_INFO!J24>1,COUNTRY_INFO!J24<4), IF(T24/COUNTRY_INFO!E24*100<>0, IF(T24/COUNTRY_INFO!E24*100>100,100,T24/COUNTRY_INFO!E24*100), \"-\"),0)","v":0},{"$f":"IF(AND(COUNTRY_INFO!J24>1,COUNTRY_INFO!J24<4),IF(COUNTRY_INFO!F24>MAX('MDA1'!K24,'MDA2'!K24,'MDA5'!K24,'T1'!M24,MAX(T3_R1!L24,T3_R2!L24)),MAX('MDA1'!K24,'MDA2'!K24,'MDA5'!K24,'T1'!M24,MAX(T3_R1!L24,T3_R2!L24)),COUNTRY_INFO!F24),0)","v":0},{"$f":"IF(AND(COUNTRY_INFO!J24>1,COUNTRY_INFO!J24<4), IF(V24/COUNTRY_INFO!F24*100<>0, IF(V24/COUNTRY_INFO!F24*100>100,100,V24/COUNTRY_INFO!F24*100), \"-\"),0)","v":0},0,{"$f":"IF(AND(COUNTRY_INFO!J24>1,COUNTRY_INFO!J24<4), IF(S24/P24*100<>0, IF(X24/P24*100>100,100,X24/P24*100), \"-\"),0)","v":0},{"$f":"COUNTRY_INFO!O24","v":50770},null,null,{"$f":"MAX('T1'!L24,'T2'!J24)+MAX('T1'!M24,'T2'!K24)+MAX('T1'!N24,'T2'!L24)","v":118148},{"$f":"IF(COUNTRY_INFO!K24=1,IF(COUNTRY_INFO!F24*0.33>MAX('T1'!M24,'T2'!K24),MAX('T1'!M24,'T2'!K24),COUNTRY_INFO!F24*0.33),IF(COUNTRY_INFO!K24=2,IF(COUNTRY_INFO!F24*0.5>MAX('T1'!M24,'T2'!K24),MAX('T1'!M24,'T2'!K24),COUNTRY_INFO!F24*0.5),IF(COUNTRY_INFO!K24=3,IF(COUNTRY_INFO!F24>MAX('T1'!M24,'T2'!K24),MAX('T1'!M24,'T2'!K24),COUNTRY_INFO!F24),0)))","v":37616},{"$f":"IF(AND(COUNTRY_INFO!K24>0,COUNTRY_INFO!K24<4),IF(Z24>0,IF(COUNTRY_INFO!K24=1, AD24/(COUNTRY_INFO!F24*0.33)*100, IF(COUNTRY_INFO!K24=2, AD24/(COUNTRY_INFO!F24*0.5)*100, IF(COUNTRY_INFO!K24=3, AD24/COUNTRY_INFO!F24*100))),\"-\"),0)","v":62.847757563566965},{"$f":"IF(COUNTRY_INFO!K24=2,IF(COUNTRY_INFO!G24*0.2>MAX('T1'!N24,'T2'!L24),MAX('T1'!N24,'T2'!L24),COUNTRY_INFO!G24*0.2),IF(COUNTRY_INFO!K24=3,IF(COUNTRY_INFO!G24>MAX('T1'!N24,'T2'!L24),MAX('T1'!N24,'T2'!L24),COUNTRY_INFO!G24),0))","v":44655.962296824},{"$f":"IF(AND(COUNTRY_INFO!K24>0,COUNTRY_INFO!K24<4),IF(Z24>0,IF(COUNTRY_INFO!K24=1, 0, IF(COUNTRY_INFO!K24=2, AF24/(COUNTRY_INFO!G24*0.2)*100, IF(COUNTRY_INFO!K24=3, AF24/COUNTRY_INFO!G24*100))),\"-\"),0)","v":100},82271.962296824,{"$f":"IF(AND(COUNTRY_INFO!K24>0,COUNTRY_INFO!K24<4), IF(AC24/Z24*100<>0, IF(AH24/Z24*100>100,100,AH24/Z24*100), \"-\"),0)","v":100},null,{"$f":"IF(AND(D24<>0, D24<>\"Unknown\",D24<>\"Stopped\",D24<>\"Not required\"),D24/COUNTRY_INFO!D24, 0)","v":0},{"$f":"IF(AND(J24<>0,J24<>\"Unknown\",J24<>\"Stopped\",J24<>\"Not required\"),J24/COUNTRY_INFO!D24, 0)","v":0},{"$f":"IF(AND(P24<>0,P24<>\"Unknown\",P24<>\"Not required\"),P24/(COUNTRY_INFO!E24+COUNTRY_INFO!F24), 0)","v":0},{"$f":"IF(AND(Z24<>0,Z24<>\"Unknown\",Z24<>\"Not required\"),IF(COUNTRY_INFO!K24=1,1,IF(COUNTRY_INFO!K24=2,0.5*COUNTRY_INFO!F24/(0.5*COUNTRY_INFO!F24+0.2*COUNTRY_INFO!G24),IF(COUNTRY_INFO!K24=3,COUNTRY_INFO!F24/(COUNTRY_INFO!F24+COUNTRY_INFO!G24)))),0)","v":0.57270511779041433},{"$f":"IF(AND(Z24<>0,Z24<>\"Unknown\",Z24<>\"Not required\"),IF(COUNTRY_INFO!K24=1,0,IF(COUNTRY_INFO!K24=2,0.2*COUNTRY_INFO!G24/(0.5*COUNTRY_INFO!F24+0.2*COUNTRY_INFO!G24),IF(COUNTRY_INFO!K24=3,COUNTRY_INFO!G24/(COUNTRY_INFO!F24+COUNTRY_INFO!G24)))),0)","v":0.42729488220958578},{"$f":"MAX(COUNTRY_INFO!D24*AK24*PROFILE!$G$7,COUNTRY_INFO!D24*AL24*PROFILE!$G$7)","v":0},{"$f":"MAX(COUNTRY_INFO!D24*AK24*PROFILE!$G$8,COUNTRY_INFO!D24*AL24*PROFILE!$G$8,COUNTRY_INFO!D24*AM24*PROFILE!$G$8)","v":0},{"$f":"MAX(COUNTRY_INFO!D24*AK24*PROFILE!$G$9,COUNTRY_INFO!D24*AL24*PROFILE!$G$9,COUNTRY_INFO!D24*AM24*PROFILE!$G$9,IF(AND(DISTRICT!Z24<>\"Unknown\",Z24<>\"Not required\"),COUNTRY_INFO!O24*DISTRICT!AN24,0))","v":29076.238830219336},{"$f":"MAX(COUNTRY_INFO!D24*AK24*PROFILE!$G$10,COUNTRY_INFO!D24*AL24*PROFILE!$G$10,IF(AND(DISTRICT!Z24<>\"Unknown\",Z24<>\"Not required\"),COUNTRY_INFO!O24*DISTRICT!AO24,0))","v":21693.761169780671},50770.000000000007,"Y",{"$f":"MAX('MDA2'!J24,'MDA5'!J24,'T1'!L24,'T2'!J24,T3_R1!K24,T3_R2!K24)","v":42538},{"$f":"MAX('MDA1'!K24,'MDA2'!K24,'MDA3'!I24,'MDA3'!L24,'MDA5'!K24,'T1'!M24,'T2'!K24,T3_R1!L24,T3_R2!L24)","v":95824},{"$f":"MAX('MDA1'!L24,'MDA2'!L24,'MDA3'!J24,'MDA3'!M24,'MDA5'!L24,'T1'!N24,'T2'!L24,T3_R1!M24,T3_R2!M24)","v":225433},363795,{"$f":"MAX('MDA2'!J24,'MDA5'!J24,T24)","v":0},{"$f":"MAX('MDA1'!K24,'MDA2'!K24,'MDA3'!I24,'MDA3'!L24,'MDA5'!K24,V24,AD24)","v":37616},{"$f":"MAX('MDA1'!L24,'MDA2'!L24,'MDA3'!J24,'MDA3'!M24,'MDA5'!L24,AF24)","v":44655.962296824},50770.000000000007,100]
[{"$f":"IF(COUNTRY_INFO!A25=0,\" \",COUNTRY_INFO!A25)","v":"Rwanda"},{"$f":"IF(COUNTRY_INFO!B25=0,\" \",COUNTRY_INFO!B25)","v":"Western"},{"$f":"IF(COUNTRY_INFO!C25=0,\" \",COUNTRY_INFO!C25)","v":"Ngororero"},{"$f":"COUNTRY_INFO!L25","v":0},null,null,{"$f":"MAX('MDA1'!M25,'MDA2'!M25,'MDA5'!M25)","v":0},{"$f":"IF(AND(COUNTRY_INFO!H25>0,COUNTRY_INFO!H25<4),IF(D25>MAX('MDA1'!M25,'MDA2'!M25,'MDA5'!M25),MAX('MDA1'!M25,'MDA2'!M25,'MDA5'!M25),D25),0)","v":0},{"$f":"IF(AND(COUNTRY_INFO!H25>0,COUNTRY_INFO!H25<4), IF(G25/D25*100<>0, IF(G25/D25*100>100,100,G25/D25*100), \"-\"),0)","v":0},{"$f":"COUNTRY_INFO!M25","v":0},null,null,{"$f":"MAX('MDA1'!M25,MAX('MDA3'!I25,'MDA3'!L25)+MAX('MDA3'!J25,'MDA3'!M25))","v":0},{"$f":"IF(AND(COUNTRY_INFO!I25>0,COUNTRY_INFO!I25<4),IF(J25>MAX('MDA1'!M25,MAX('MDA3'!I25,'MDA3'!L25)+MAX('MDA3'!J25,'MDA3'!M25)),MAX('MDA1'!M25,MAX('MDA3'!I25,'MDA3'!L25)+MAX('MDA3'!J25,'MDA3'!M25)),J25),0)","v":0},{"$f":"IF(AND(COUNTRY_INFO!I25>0,COUNTRY_INFO!I25<4), IF(M25/J25*100<>0, IF(M25/J25*100>100,100,M25/J25*100), \"-\"),0)","v":0},{"$f":"COUNTRY_INFO!N25","v":182855.17300478401},null,null,{"$f":"SUM(MAX('MDA2'!J25,'MDA5'!J25, 'T1'!L25, MAX(T3_R1!K25, T3_R2!K25)), MAX('MDA1'!K25, 'MDA2'!K25, 'MDA5'!K25,'T1'!M25, MAX(T3_R1!L25, T3_R2!L25)), MAX('MDA1'!L25, 'MDA2'!L25, 'MDA5'!L25,'T1'!N25, MAX(T3_R1!M25, T3_R2!M25)))","v":362962},{"$f":"IF(AND(COUNTRY_INFO!J25>1,COUNTRY_INFO!J25<4),IF(COUNTRY_INFO!E25>MAX('MDA2'!J25,'MDA5'!J25,'T1'!L25,MAX(T3_R1!K25,T3_R2!K25)),MAX('MDA2'!J25,'MDA5'!J25,'T1'!L25,MAX(T3_R1!K25,T3_R2!K25)),COUNTRY_INFO!E25),0)","v":49197},{"$f":"IF(AND(COUNTRY_INFO!J25>1,COUNTRY_INFO!J25<4), IF(T25/COUNTRY_INFO!E25*100<>0, IF(T25/COUNTRY_INFO!E25*100>100,100,T25/COUNTRY_INFO!E25*100), \"-\"),0)","v":95.960807187778727},{"$f":"IF(AND(COUNTRY_INFO!J25>1,COUNTRY_INFO!J25<4),IF(COUNTRY_INFO!F25>MAX('MDA1'!K25,'MDA2'!K25,'MDA5'!K25,'T1'!M25,MAX(T3_R1!L25,T3_R2!L25)),MAX('MDA1'!K25,'MDA2'!K25,'MDA5'!K25,'T1'!M25,MAX(T3_R1!L25,T3_R2!L25)),COUNTRY_INFO!F25),0)","v":113173},{"$f":"IF(AND(COUNTRY_INFO!J25>1,COUNTRY_INFO!J25<4), IF(V25/COUNTRY_INFO!F25*100<>0, IF(V25/COUNTRY_INFO!F25*100>100,100,V25/COUNTRY_INFO!F25*100), \"-\"),0)","v":86.005976226476292},162370,{"$f":"IF(AND(COUNTRY_INFO!J25>1,COUNTRY_INFO!J25<4), IF(S25/P25*100<>0, IF(X25/P25*100>100,100,X25/P25*100), \"-\"),0)","v":88.797050327776034},{"$f":"COUNTRY_INFO!O25","v":8795},null,null,{"$f":"MAX('T1'!L25,'T2'!J25)+MAX('T1'!M25,'T2'!K25)+MAX('T1'!N25,'T2'!L25)","v":17868},{"$f":"IF(COUNTRY_INFO!K25=1,IF(COUNTRY_INFO!F25*0.33>MAX('T1'!M25,'T2'!K25),MAX('T1'!M25,'T2'!K25),COUNTRY_INFO!F25*0.33),IF(COUNTRY_INFO!K25=2,IF(COUNTRY_INFO!F25*0.5>MAX('T1'!M25,'T2'!K25),MAX('T1'!M25,'T2'!K25),COUNTRY_INFO!F25*0.5),IF(COUNTRY_INFO!K25=3,IF(COUNTRY_INFO!F25>MAX('T1'!M25,'T2'!K25),MAX('T1'!M25,'T2'!K25),COUNTRY_INFO!F25),0)))","v":7737},{"$f":"IF(AND(COUNTRY_INFO!K25>0,COUNTRY_INFO!K25<4),IF(Z25>0,IF(COUNTRY_INFO!K25=1, AD25/(COUNTRY_INFO!F25*0.33)*100, IF(COUNTRY_INFO!K25=2, AD25/(COUNTRY_INFO!F25*0.5)*100, IF(COUNTRY_INFO!K25=3, AD25/COUNTRY_INFO!F25*100))),\"-\"),0)","v":11.759487476063143},{"$f":"IF(COUNTRY_INFO!K25=2,IF(COUNTRY_INFO!G25*0.2>MAX('T1'!N25,'T2'!L25),MAX('T1'!N25,'T2'!L25),COUNTRY_INFO!G25*0.2),IF(COUNTRY_INFO!K25=3,IF(COUNTRY_INFO!G25>MAX('T1'!N25,'T2'!L25),MAX('T1'!N25,'T2'!L25),COUNTRY_INFO!G25),0))","v":10131},{"$f":"IF(AND(COUNTRY_INFO!K25>0,COUNTRY_INFO!K25<4),IF(Z25>0,IF(COUNTRY_INFO!K25=1, 0, IF(COUNTRY_INFO!K25=2, AF25/(COUNTRY_INFO!G25*0.2)*100, IF(COUNTRY_INFO!K25=3, AF25/COUNTRY_INFO!G25*100))),\"-\"),0)","v":21.916014166126537},17868,{"$f":"IF(AND(COUNTRY_INFO!K25>0,COUNTRY_INFO!K25<4), IF(AC25/Z25*100<>0, IF(AH25/Z25*100>100,100,AH25/Z25*100), \"-\"),0)","v":100},null,{"$f":"IF(AND(D25<>0, D25<>\"Unknown\",D25<>\"Stopped\",D25<>\"Not required\"),D25/COUNTRY_INFO!D25, 0)","v":0},{"$f":"IF(AND(J25<>0,J25<>\"Unknown\",J25<>\"Stopped\",J25<>\"Not required\"),J25/COUNTRY_INFO!D25, 0)","v":0},{"$f":"IF(AND(P25<>0,P25<>\"Unknown\",P25<>\"Not required\"),P25/(COUNTRY_INFO!E25+COUNTRY_INFO!F25), 0)","v":1},{"$f":"IF(AND(Z25<>0,Z25<>\"Unknown\",Z25<>\"Not required\"),IF(COUNTRY_INFO!K25=1,1,IF(COUNTRY_INFO!K25=2,0.5*COUNTRY_INFO!F25/(0.5*COUNTRY_INFO!F25+0.2*COUNTRY_INFO!G25),IF(COUNTRY_INFO!K25=3,COUNTRY_INFO!F25/(COUNTRY_INFO!F25+COUNTRY_INFO!G25)))),0)","v":0.58733790999237212},{"$f":"IF(AND(Z25<>0,Z25<>\"Unknown\",Z25<>\"Not required\"),IF(COUNTRY_INFO!K25=1,0,IF(COUNTRY_INFO!K25=2,0.2*COUNTRY_INFO!G25/(0.5*COUNTRY_INFO!F25+0.2*COUNTRY_INFO!G25),IF(COUNTRY_INFO!K25=3,COUNTRY_INFO!G25/(COUNTRY_INFO!F25+COUNTRY_INFO!G25)))),0)","v":0.41266209000762777},{"$f":"MAX(COUNTRY_INFO!D25*AK25*PROFILE!$G$7,COUNTRY_INFO!D25*AL25*PROFILE!$G$7)","v":0},{"$f":"MAX(COUNTRY_INFO!D25*AK25*PROFILE!$G$8,COUNTRY_INFO!D25*AL25*PROFILE!$G$8,COUNTRY_INFO!D25*AM25*PROFILE!$G$8)","v":50435.628252218754},{"$f":"MAX(COUNTRY_INFO!D25*AK25*PROFILE!$G$9,COUNTRY_INFO!D25*AL25*PROFILE!$G$9,COUNTRY_INFO!D25*AM25*PROFILE!$G$9,IF(AND(DISTRICT!Z25<>\"Unknown\",Z25<>\"Not required\"),COUNTRY_INFO!O25*DISTRICT!AN25,0))","v":121613.83446261424},{"$f":"MAX(COUNTRY_INFO!D25*AK25*PROFILE!$G$10,COUNTRY_INFO!D25*AL25*PROFILE!$G$10,IF(AND(DISTRICT!Z25<>\"Unknown\",Z25<>\"Not required\"),COUNTRY_INFO!O25*DISTRICT!AO25,0))","v":3629.3630816170862},175678.82579645005,"Y",{"$f":"MAX('MDA2'!J25,'MDA5'!J25,'T1'!L25,'T2'!J25,T3_R1!K25,T3_R2!K25)","v":49197},{"$f":"MAX('MDA1'!K25,'MDA2'!K25,'MDA3'!I25,'MDA3'!L25,'MDA5'!K25,'T1'!M25,'T2'!K25,T3_R1!L25,T3_R2!L25)","v":113173},{"$f":"MAX('MDA1'!L25,'MDA2'!L25,'MDA3'!J25,'MDA3'!M25,'MDA5'!L25,'T1'!N25,'T2'!L25,T3_R1!M25,T3_R2!M25)","v":200592},362962,{"$f":"MAX('MDA2'!J25,'MDA5'!J25,T25)","v":49197},{"$f":"MAX('MDA1'!K25,'MDA2'!K25,'MDA3'!I25,'MDA3'!L25,'MDA5'!K25,V25,AD25)","v":113173},{"$f":"MAX('MDA1'!L25,'MDA2'!L25,'MDA3'!J25,'MDA3'!M25,'MDA5'!L25,AF25)","v":10131},172501,98.19111621332668]
[{"$f":"IF(COUNTRY_INFO!A26=0,\" \",COUNTRY_INFO!A26)","v":"Rwanda"},{"$f":"IF(COUNTRY_INFO!B26=0,\" \",COUNTRY_INFO!B26)","v":"Western"},{"$f":"IF(COUNTRY_INFO!C26=0,\" \",COUNTRY_INFO!C26)","v":"Nyabihu"},{"$f":"COUNTRY_INFO!L26","v":0},null,null,{"$f":"MAX('MDA1'!M26,'MDA2'!M26,'MDA5'!M26)","v":0},{"$f":"IF(AND(COUNTRY_INFO!H26>0,COUNTRY_INFO!H26<4),IF(D26>MAX('MDA1'!M26,'MDA2'!M26,'MDA5'!M26),MAX('MDA1'!M26,'MDA2'!M26,'MDA5'!M26),D26),0)","v":0},{"$f":"IF(AND(COUNTRY_INFO!H26>0,COUNTRY_INFO!H26<4), IF(G26/D26*100<>0, IF(G26/D26*100>100,100,G26/D26*100), \"-\"),0)","v":0},{"$f":"COUNTRY_INFO!M26","v":0},null,null,{"$f":"MAX('MDA1'!M26,MAX('MDA3'!I26,'MDA3'!L26)+MAX('MDA3'!J26,'MDA3'!M26))","v":0},{"$f":"IF(AND(COUNTRY_INFO!I26>0,COUNTRY_INFO!I26<4),IF(J26>MAX('MDA1'!M26,MAX('MDA3'!I26,'MDA3'!L26)+MAX('MDA3'!J26,'MDA3'!M26)),MAX('MDA1'!M26,MAX('MDA3'!I26,'MDA3'!L26)+MAX('MDA3'!J26,'MDA3'!M26)),J26),0)","v":0},{"$f":"IF(AND(COUNTRY_INFO!I26>0,COUNTRY_INFO!I26<4), IF(M26/J26*100<>0, IF(M26/J26*100>100,100,M26/J26*100), \"-\"),0)","v":0},{"$f":"COUNTRY_INFO!N26","v":160787.88917312401},null,null,{"$f":"SUM(MAX('MDA2'!J26,'MDA5'!J26, 'T1'!L26, MAX(T3_R1!K26, T3_R2!K26)), MAX('MDA1'!K26, 'MDA2'!K26, 'MDA5'!K26,'T1'!M26, MAX(T3_R1!L26, T3_R2!L26)), MAX('MDA1'!L26, 'MDA2'!L26, 'MDA5'!L26,'T1'!N26, MAX(T3_R1!M26, T3_R2!M26)))","v":291068},{"$f":"IF(AND(COUNTRY_INFO!J26>1,COUNTRY_INFO!J26<4),IF(COUNTRY_INFO!E26>MAX('MDA2'!J26,'MDA5'!J26,'T1'!L26,MAX(T3_R1!K26,T3_R2!K26)),MAX('MDA2'!J26,'MDA5'!J26,'T1'!L26,MAX(T3_R1!K26,T3_R2!K26)),COUNTRY_INFO!E26),0)","v":41283},{"$f":"IF(AND(COUNTRY_INFO!J26>1,COUNTRY_INFO!J26<4), IF(T26/COUNTRY_INFO!E26*100<>0, IF(T26/COUNTRY_INFO!E26*100>100,100,T26/COUNTRY_INFO!E26*100), \"-\"),0)","v":94.215814028728005},{"$f":"IF(AND(COUNTRY_INFO!J26>1,COUNTRY_INFO!J26<4),IF(COUNTRY_INFO!F26>MAX('MDA1'!K26,'MDA2'!K26,'MDA5'!K26,'T1'!M26,MAX(T3_R1!L26,T3_R2!L26)),MAX('MDA1'!K26,'MDA2'!K26,'MDA5'!K26,'T1'!M26,MAX(T3_R1!L26,T3_R2!L26)),COUNTRY_INFO!F26),0)","v":103696},{"$f":"IF(AND(COUNTRY_INFO!J26>1,COUNTRY_INFO!J26<4), IF(V26/COUNTRY_INFO!F26*100<>0, IF(V26/COUNTRY_INFO!F26*100>100,100,V26/COUNTRY_INFO!F26*100), \"-\"),0)","v":88.651484590468002},144979,{"$f":"IF(AND(COUNTRY_INFO!J26>1,COUNTRY_INFO!J26<4), IF(S26/P26*100<>0, IF(X26/P26*100>100,100,X26/P26*100), \"-\"),0)","v":90.167860742233998},{"$f":"COUNTRY_INFO!O26","v":38587},null,null,{"$f":"MAX('T1'!L26,'T2'!J26)+MAX('T1'!M26,'T2'!K26)+MAX('T1'!N26,'T2'!L26)","v":0},{"$f":"IF(COUNTRY_INFO!K26=1,IF(COUNTRY_INFO!F26*0.33>MAX('T1'!M26,'T2'!K26),MAX('T1'!M26,'T2'!K26),COUNTRY_INFO!F26*0.33),IF(COUNTRY_INFO!K26=2,IF(COUNTRY_INFO!F26*0.5>MAX('T1'!M26,'T2'!K26),MAX('T1'!M26,'T2'!K26),COUNTRY_INFO!F26*0.5),IF(COUNTRY_INFO!K26=3,IF(COUNTRY_INFO!F26>MAX('T1'!M26,'T2'!K26),MAX('T1'!M26,'T2'!K26),COUNTRY_INFO!F26),0)))","v":0},{"$f":"IF(AND(COUNTRY_INFO!K26>0,COUNTRY_INFO!K26<4),IF(Z26>0,IF(COUNTRY_INFO!K26=1, AD26/(COUNTRY_INFO!F26*0.33)*100, IF(COUNTRY_INFO!K26=2, AD26/(COUNTRY_INFO!F26*0.5)*100, IF(COUNTRY_INFO!K26=3, AD26/COUNTRY_INFO!F26*100))),\"-\"),0)","v":0},{"$f":"IF(COUNTRY_INFO!K26=2,IF(COUNTRY_INFO!G26*0.2>MAX('T1'!N26,'T2'!L26),MAX('T1'!N26,'T2'!L26),COUNTRY_INFO!G26*0.2),IF(COUNTRY_INFO!K26=3,IF(COUNTRY_INFO!G26>MAX('T1'!N26,'T2'!L26),MAX('T1'!N26,'T2'!L26),COUNTRY_INFO!G26),0))","v":0},{"$f":"IF(AND(COUNTRY_INFO!K26>0,COUNTRY_INFO!K26<4),IF(Z26>0,IF(COUNTRY_INFO!K26=1, 0, IF(COUNTRY_INFO!K26=2, AF26/(COUNTRY_INFO!G26*0.2)*100, IF(COUNTRY_INFO!K26=3, AF26/COUNTRY_INFO!G26*100))),\"-\"),0)","v":0},0,{"$f":"IF(AND(COUNTRY_INFO!K26>0,COUNTRY_INFO!K26<4), IF(AC26/Z26*100<>0, IF(AH26/Z26*100>100,100,AH26/Z26*100), \"-\"),0)","v":"-"},null,{"$f":"IF(AND(D26<>0, D26<>\"Unknown\",D26<>\"Stopped\",D26<>\"Not required\"),D26/COUNTRY_INFO!D26, 0)","v":0},{"$f":"IF(AND(J26<>0,J26<>\"Unknown\",J26<>\"Stopped\",J26<>\"Not required\"),J26/COUNTRY_INFO!D26, 0)","v":0},{"$f":"IF(AND(P26<>0,P26<>\"Unknown\",P26<>\"Not required\"),P26/(COUNTRY_INFO!E26+COUNTRY_INFO!F26), 0)","v":1},{"$f":"IF(AND(Z26<>0,Z26<>\"Unknown\",Z26<>\"Not required\"),IF(COUNTRY_INFO!K26=1,1,IF(COUNTRY_INFO!K26=2,0.5*COUNTRY_INFO!F26/(0.5*COUNTRY_INFO!F26+0.2*COUNTRY_INFO!G26),IF(COUNTRY_INFO!K26=3,COUNTRY_INFO!F26/(COUNTRY_INFO!F26+COUNTRY_INFO!G26)))),0)","v":1},{"$f":"IF(AND(Z26<>0,Z26<>\"Unknown\",Z26<>\"Not required\"),IF(COUNTRY_INFO!K26=1,0,IF(COUNTRY_INFO!K26=2,0.2*COUNTRY_INFO!G26/(0.5*COUNTRY_INFO!F26+0.2*COUNTRY_INFO!G26),IF(COUNTRY_INFO!K26=3,COUNTRY_INFO!G26/(COUNTRY_INFO!F26+COUNTRY_INFO!G26)))),0)","v":0},{"$f":"MAX(COUNTRY_INFO!D26*AK26*PROFILE!$G$7,COUNTRY_INFO!D26*AL26*PROFILE!$G$7)","v":0},{"$f":"MAX(COUNTRY_INFO!D26*AK26*PROFILE!$G$8,COUNTRY_INFO!D26*AL26*PROFILE!$G$8,COUNTRY_INFO!D26*AM26*PROFILE!$G$8)","v":43836.855149167117},{"$f":"MAX(COUNTRY_INFO!D26*AK26*PROFILE!$G$9,COUNTRY_INFO!D26*AL26*PROFILE!$G$9,COUNTRY_INFO!D26*AM26*PROFILE!$G$9,IF(AND(DISTRICT!Z26<>\"Unknown\",Z26<>\"Not required\"),COUNTRY_INFO!O26*DISTRICT!AN26,0))","v":105702.42168516817},{"$f":"MAX(COUNTRY_INFO!D26*AK26*PROFILE!$G$10,COUNTRY_INFO!D26*AL26*PROFILE!$G$10,IF(AND(DISTRICT!Z26<>\"Unknown\",Z26<>\"Not required\"),COUNTRY_INFO!O26*DISTRICT!AO26,0))","v":0},149539.27683433529,0,{"$f":"MAX('MDA2'!J26,'MDA5'!J26,'T1'!L26,'T2'!J26,T3_R1!K26,T3_R2!K26)","v":41283},{"$f":"MAX('MDA1'!K26,'MDA2'!K26,'MDA3'!I26,'MDA3'!L26,'MDA5'!K26,'T1'!M26,'T2'!K26,T3_R1!L26,T3_R2!L26)","v":103696},{"$f":"MAX('MDA1'!L26,'MDA2'!L26,'MDA3'!J26,'MDA3'!M26,'MDA5'!L26,'T1'!N26,'T2'!L26,T3_R1!M26,T3_R2!M26)","v":146089},291068,{"$f":"MAX('MDA2'!J26,'MDA5'!J26,T26)","v":41283},{"$f":"MAX('MDA1'!K26,'MDA2'!K26,'MDA3'!I26,'MDA3'!L26,'MDA5'!K26,V26,AD26)","v":103696},{"$f":"MAX('MDA1'!L26,'MDA2'!L26,'MDA3'!J26,'MDA3'!M26,'MDA5'!L26,AF26)","v":0},144979,96.950448784510755]
[{"$f":"IF(COUNTRY_INFO!A27=0,\" \",COUNTRY_INFO!A27)","v":"Rwanda"},{"$f":"IF(COUNTRY_INFO!B27=0,\" \",COUNTRY_INFO!B27)","v":"Eastern"},{"$f":"IF(COUNTRY_INFO!C27=0,\" \",COUNTRY_INFO!C27)","v":"Nyagatare"},{"$f":"COUNTRY_INFO!L27","v":0},null,null,{"$f":"MAX('MDA1'!M27,'MDA2'!M27,'MDA5'!M27)","v":0},{"$f":"IF(AND(COUNTRY_INFO!H27>0,COUNTRY_INFO!H27<4),IF(D27>MAX('MDA1'!M27,'MDA2'!M27,'MDA5'!M27),MAX('MDA1'!M27,'MDA2'!M27,'MDA5'!M27),D27),0)","v":0},{"$f":"IF(AND(COUNTRY_INFO!H27>0,COUNTRY_INFO!H27<4), IF(G27/D27*100<>0, IF(G27/D27*100>100,100,G27/D27*100), \"-\"),0)","v":0},{"$f":"COUNTRY_INFO!M27","v":0},null,null,{"$f":"MAX('MDA1'!M27,MAX('MDA3'!I27,'MDA3'!L27)+MAX('MDA3'!J27,'MDA3'!M27))","v":0},{"$f":"IF(AND(COUNTRY_INFO!I27>0,COUNTRY_INFO!I27<4),IF(J27>MAX('MDA1'!M27,MAX('MDA3'!I27,'MDA3'!L27)+MAX('MDA3'!J27,'MDA3'!M27)),MAX('MDA1'!M27,MAX('MDA3'!I27,'MDA3'!L27)+MAX('MDA3'!J27,'MDA3'!M27)),J27),0)","v":0},{"$f":"IF(AND(COUNTRY_INFO!I27>0,COUNTRY_INFO!I27<4), IF(M27/J27*100<>0, IF(M27/J27*100>100,100,M27/J27*100), \"-\"),0)","v":0},{"$f":"COUNTRY_INFO!N27","v":254135.233527984},null,null,{"$f":"SUM(MAX('MDA2'!J27,'MDA5'!J27, 'T1'!L27, MAX(T3_R1!K27, T3_R2!K27)), MAX('MDA1'!K27, 'MDA2'!K27, 'MDA5'!K27,'T1'!M27, MAX(T3_R1!L27, T3_R2!L27)), MAX('MDA1'!L27, 'MDA2'!L27, 'MDA5'!L27,'T1'!N27, MAX(T3_R1!M27, T3_R2!M27)))","v":488476},{"$f":"IF(AND(COUNTRY_INFO!J27>1,COUNTRY_INFO!J27<4),IF(COUNTRY_INFO!E27>MAX('MDA2'!J27,'MDA5'!J27,'T1'!L27,MAX(T3_R1!K27,T3_R2!K27)),MAX('MDA2'!J27,'MDA5'!J27,'T1'!L27,MAX(T3_R1!K27,T3_R2!K27)),COUNTRY_INFO!E27),0)","v":73364.67480600001},{"$f":"IF(AND(COUNTRY_INFO!J27>1,COUNTRY_INFO!J27<4), IF(T27/COUNTRY_INFO!E27*100<>0, IF(T27/COUNTRY_INFO!E27*100>100,100,T27/COUNTRY_INFO!E27*100), \"-\"),0)","v":100},{"$f":"IF(AND(COUNTRY_INFO!J27>1,COUNTRY_INFO!J27<4),IF(COUNTRY_INFO!F27>MAX('MDA1'!K27,'MDA2'!K27,'MDA5'!K27,'T1'!M27,MAX(T3_R1!L27,T3_R2!L27)),MAX('MDA1'!K27,'MDA2'!K27,'MDA5'!K27,'T1'!M27,MAX(T3_R1!L27,T3_R2!L27)),COUNTRY_INFO!F27),0)","v":180770.55872198401},{"$f":"IF(AND(COUNTRY_INFO!J27>1,COUNTRY_INFO!J27<4), IF(V27/COUNTRY_INFO!F27*100<>0, IF(V27/COUNTRY_INFO!F27*100>100,100,V27/COUNTRY_INFO!F27*100), \"-\"),0)","v":100},254135.233527984,{"$f":"IF(AND(COUNTRY_INFO!J27>1,COUNTRY_INFO!J27<4), IF(S27/P27*100<>0, IF(X27/P27*100>100,100,X27/P27*100), \"-\"),0)","v":100},{"$f":"COUNTRY_INFO!O27","v":154567},null,null,{"$f":"MAX('T1'!L27,'T2'!J27)+MAX('T1'!M27,'T2'!K27)+MAX('T1'!N27,'T2'!L27)","v":413314},{"$f":"IF(COUNTRY_INFO!K27=1,IF(COUNTRY_INFO!F27*0.33>MAX('T1'!M27,'T2'!K27),MAX('T1'!M27,'T2'!K27),COUNTRY_INFO!F27*0.33),IF(COUNTRY_INFO!K27=2,IF(COUNTRY_INFO!F27*0.5>MAX('T1'!M27,'T2'!K27),MAX('T1'!M27,'T2'!K27),COUNTRY_INFO!F27*0.5),IF(COUNTRY_INFO!K27=3,IF(COUNTRY_INFO!F27>MAX('T1'!M27,'T2'!K27),MAX('T1'!M27,'T2'!K27),COUNTRY_INFO!F27),0)))","v":90385.279360992005},{"$f":"IF(AND(COUNTRY_INFO!K27>0,COUNTRY_INFO!K27<4),IF(Z27>0,IF(COUNTRY_INFO!K27=1, AD27/(COUNTRY_INFO!F27*0.33)*100, IF(COUNTRY_INFO!K27=2, AD27/(COUNTRY_INFO!F27*0.5)*100, IF(COUNTRY_INFO!K27=3, AD27/COUNTRY_INFO!F27*100))),\"-\"),0)","v":100},{"$f":"IF(COUNTRY_INFO!K27=2,IF(COUNTRY_INFO!G27*0.2>MAX('T1'!N27,'T2'!L27),MAX('T1'!N27,'T2'!L27),COUNTRY_INFO!G27*0.2),IF(COUNTRY_INFO!K27=3,IF(COUNTRY_INFO!G27>MAX('T1'!N27,'T2'!L27),MAX('T1'!N27,'T2'!L27),COUNTRY_INFO!G27),0))","v":62917.545113625616},{"$f":"IF(AND(COUNTRY_INFO!K27>0,COUNTRY_INFO!K27<4),IF(Z27>0,IF(COUNTRY_INFO!K27=1, 0, IF(COUNTRY_INFO!K27=2, AF27/(COUNTRY_INFO!G27*0.2)*100, IF(COUNTRY_INFO!K27=3, AF27/COUNTRY_INFO!G27*100))),\"-\"),0)","v":100},153302.82447461761,{"$f":"IF(AND(COUNTRY_INFO!K27>0,COUNTRY_INFO!K27<4), IF(AC27/Z27*100<>0, IF(AH27/Z27*100>100,100,AH27/Z27*100), \"-\"),0)","v":99.182118094171202},null,{"$f":"IF(AND(D27<>0, D27<>\"Unknown\",D27<>\"Stopped\",D27<>\"Not required\"),D27/COUNTRY_INFO!D27, 0)","v":0},{"$f":"IF(AND(J27<>0,J27<>\"Unknown\",J27<>\"Stopped\",J27<>\"Not required\"),J27/COUNTRY_INFO!D27, 0)","v":0},{"$f":"IF(AND(P27<>0,P27<>\"Unknown\",P27<>\"Not required\"),P27/(COUNTRY_INFO!E27+COUNTRY_INFO!F27), 0)","v":1},{"$f":"IF(AND(Z27<>0,Z27<>\"Unknown\",Z27<>\"Not required\"),IF(COUNTRY_INFO!K27=1,1,IF(COUNTRY_INFO!K27=2,0.5*COUNTRY_INFO!F27/(0.5*COUNTRY_INFO!F27+0.2*COUNTRY_INFO!G27),IF(COUNTRY_INFO!K27=3,COUNTRY_INFO!F27/(COUNTRY_INFO!F27+COUNTRY_INFO!G27)))),0)","v":0.58958652373660037},{"$f":"IF(AND(Z27<>0,Z27<>\"Unknown\",Z27<>\"Not required\"),IF(COUNTRY_INFO!K27=1,0,IF(COUNTRY_INFO!K27=2,0.2*COUNTRY_INFO!G27/(0.5*COUNTRY_INFO!F27+0.2*COUNTRY_INFO!G27),IF(COUNTRY_INFO!K27=3,COUNTRY_INFO!G27/(COUNTRY_INFO!F27+COUNTRY_INFO!G27)))),0)","v":0.4104134762633998},{"$f":"MAX(COUNTRY_INFO!D27*AK27*PROFILE!$G$7,COUNTRY_INFO!D27*AL27*PROFILE!$G$7)","v":0},{"$f":"MAX(COUNTRY_INFO!D27*AK27*PROFILE!$G$8,COUNTRY_INFO!D27*AL27*PROFILE!$G$8,COUNTRY_INFO!D27*AM27*PROFILE!$G$8)","v":69286.869040682373},{"$f":"MAX(COUNTRY_INFO!D27*AK27*PROFILE!$G$9,COUNTRY_INFO!D27*AL27*PROFILE!$G$9,COUNTRY_INFO!D27*AM27*PROFILE!$G$9,IF(AND(DISTRICT!Z27<>\"Unknown\",Z27<>\"Not required\"),COUNTRY_INFO!O27*DISTRICT!AN27,0))","v":167069.23486326737},{"$f":"MAX(COUNTRY_INFO!D27*AK27*PROFILE!$G$10,COUNTRY_INFO!D27*AL27*PROFILE!$G$10,IF(AND(DISTRICT!Z27<>\"Unknown\",Z27<>\"Not required\"),COUNTRY_INFO!O27*DISTRICT!AO27,0))","v":63436.37978560492},299792.48368955462,"Y",{"$f":"MAX('MDA2'!J27,'MDA5'!J27,'T1'!L27,'T2'!J27,T3_R1!K27,T3_R2!K27)","v":76063},{"$f":"MAX('MDA1'!K27,'MDA2'!K27,'MDA3'!I27,'MDA3'!L27,'MDA5'!K27,'T1'!M27,'T2'!K27,T3_R1!L27,T3_R2!L27)","v":186514},{"$f":"MAX('MDA1'!L27,'MDA2'!L27,'MDA3'!J27,'MDA3'!M27,'MDA5'!L27,'T1'!N27,'T2'!L27,T3_R1!M27,T3_R2!M27)","v":248815},511392,{"$f":"MAX('MDA2'!J27,'MDA5'!J27,T27)","v":73364.67480600001},{"$f":"MAX('MDA1'!K27,'MDA2'!K27,'MDA3'!I27,'MDA3'!L27,'MDA5'!K27,V27,AD27)","v":180770.55872198401},{"$f":"MAX('MDA1'!L27,'MDA2'!L27,'MDA3'!J27,'MDA3'!M27,'MDA5'!L27,AF27)","v":62917.545113625616},299792.48368955462,100]
[{"$f":"IF(COUNTRY_INFO!A28=0,\" \",COUNTRY_INFO!A28)","v":"Rwanda"},{"$f":"IF(COUNTRY_INFO!B28=0,\" \",COUNTRY_INFO!B28)","v":"Southern"},{"$f":"IF(COUNTRY_INFO!C28=0,\" \",COUNTRY_INFO!C28)","v":"Nyamagabe"},{"$f":"COUNTRY_INFO!L28","v":0},null,null,{"$f":"MAX('MDA1'!M28,'MDA2'!M28,'MDA5'!M28)","v":0},{"$f":"IF(AND(COUNTRY_INFO!H28>0,COUNTRY_INFO!H28<4),IF(D28>MAX('MDA1'!M28,'MDA2'!M28,'MDA5'!M28),MAX('MDA1'!M28,'MDA2'!M28,'MDA5'!M28),D28),0)","v":0},{"$f":"IF(AND(COUNTRY_INFO!H28>0,COUNTRY_INFO!H28<4), IF(G28/D28*100<>0, IF(G28/D28*100>100,100,G28/D28*100), \"-\"),0)","v":0},{"$f":"COUNTRY_INFO!M28","v":0},null,null,{"$f":"MAX('MDA1'!M28,MAX('MDA3'!I28,'MDA3'!L28)+MAX('MDA3'!J28,'MDA3'!M28))","v":0},{"$f":"IF(AND(COUNTRY_INFO!I28>0,COUNTRY_INFO!I28<4),IF(J28>MAX('MDA1'!M28,MAX('MDA3'!I28,'MDA3'!L28)+MAX('MDA3'!J28,'MDA3'!M28)),MAX('MDA1'!M28,MAX('MDA3'!I28,'MDA3'!L28)+MAX('MDA3'!J28,'MDA3'!M28)),J28),0)","v":0},{"$f":"IF(AND(COUNTRY_INFO!I28>0,COUNTRY_INFO!I28<4), IF(M28/J28*100<>0, IF(M28/J28*100>100,100,M28/J28*100), \"-\"),0)","v":0},{"$f":"COUNTRY_INFO!N28","v":178001.357656104},null,null,{"$f":"SUM(MAX('MDA2'!J28,'MDA5'!J28, 'T1'!L28, MAX(T3_R1!K28, T3_R2!K28)), MAX('MDA1'!K28, 'MDA2'!K28, 'MDA5'!K28,'T1'!M28, MAX(T3_R1!L28, T3_R2!L28)), MAX('MDA1'!L28, 'MDA2'!L28, 'MDA5'!L28,'T1'!N28, MAX(T3_R1!M28, T3_R2!M28)))","v":360112},{"$f":"IF(AND(COUNTRY_INFO!J28>1,COUNTRY_INFO!J28<4),IF(COUNTRY_INFO!E28>MAX('MDA2'!J28,'MDA5'!J28,'T1'!L28,MAX(T3_R1!K28,T3_R2!K28)),MAX('MDA2'!J28,'MDA5'!J28,'T1'!L28,MAX(T3_R1!K28,T3_R2!K28)),COUNTRY_INFO!E28),0)","v":41352},{"$f":"IF(AND(COUNTRY_INFO!J28>1,COUNTRY_INFO!J28<4), IF(T28/COUNTRY_INFO!E28*100<>0, IF(T28/COUNTRY_INFO!E28*100>100,100,T28/COUNTRY_INFO!E28*100), \"-\"),0)","v":86.909890885869174},{"$f":"IF(AND(COUNTRY_INFO!J28>1,COUNTRY_INFO!J28<4),IF(COUNTRY_INFO!F28>MAX('MDA1'!K28,'MDA2'!K28,'MDA5'!K28,'T1'!M28,MAX(T3_R1!L28,T3_R2!L28)),MAX('MDA1'!K28,'MDA2'!K28,'MDA5'!K28,'T1'!M28,MAX(T3_R1!L28,T3_R2!L28)),COUNTRY_INFO!F28),0)","v":100557},{"$f":"IF(AND(COUNTRY_INFO!J28>1,COUNTRY_INFO!J28<4), IF(V28/COUNTRY_INFO!F28*100<>0, IF(V28/COUNTRY_INFO!F28*100>100,100,V28/COUNTRY_INFO!F28*100), \"-\"),0)","v":77.101821980161645},141909,{"$f":"IF(AND(COUNTRY_INFO!J28>1,COUNTRY_INFO!J28<4), IF(S28/P28*100<>0, IF(X28/P28*100>100,100,X28/P28*100), \"-\"),0)","v":79.723549229419973},{"$f":"COUNTRY_INFO!O28","v":41575},null,null,{"$f":"MAX('T1'!L28,'T2'!J28)+MAX('T1'!M28,'T2'!K28)+MAX('T1'!N28,'T2'!L28)","v":0},{"$f":"IF(COUNTRY_INFO!K28=1,IF(COUNTRY_INFO!F28*0.33>MAX('T1'!M28,'T2'!K28),MAX('T1'!M28,'T2'!K28),COUNTRY_INFO!F28*0.33),IF(COUNTRY_INFO!K28=2,IF(COUNTRY_INFO!F28*0.5>MAX('T1'!M28,'T2'!K28),MAX('T1'!M28,'T2'!K28),COUNTRY_INFO!F28*0.5),IF(COUNTRY_INFO!K28=3,IF(COUNTRY_INFO!F28>MAX('T1'!M28,'T2'!K28),MAX('T1'!M28,'T2'!K28),COUNTRY_INFO!F28),0)))","v":0},{"$f":"IF(AND(COUNTRY_INFO!K28>0,COUNTRY_INFO!K28<4),IF(Z28>0,IF(COUNTRY_INFO!K28=1, AD28/(COUNTRY_INFO!F28*0.33)*100, IF(COUNTRY_INFO!K28=2, AD28/(COUNTRY_INFO!F28*0.5)*100, IF(COUNTRY_INFO!K28=3, AD28/COUNTRY_INFO!F28*100))),\"-\"),0)","v":0},{"$f":"IF(COUNTRY_INFO!K28=2,IF(COUNTRY_INFO!G28*0.2>MAX('T1'!N28,'T2'!L28),MAX('T1'!N28,'T2'!L28),COUNTRY_INFO!G28*0.2),IF(COUNTRY_INFO!K28=3,IF(COUNTRY_INFO!G28>MAX('T1'!N28,'T2'!L28),MAX('T1'!N28,'T2'!L28),COUNTRY_INFO!G28),0))","v":0},{"$f":"IF(AND(COUNTRY_INFO!K28>0,COUNTRY_INFO!K28<4),IF(Z28>0,IF(COUNTRY_INFO!K28=1, 0, IF(COUNTRY_INFO!K28=2, AF28/(COUNTRY_INFO!G28*0.2)*100, IF(COUNTRY_INFO!K28=3, AF28/COUNTRY_INFO!G28*100))),\"-\"),0)","v":0},0,{"$f":"IF(AND(COUNTRY_INFO!K28>0,COUNTRY_INFO!K28<4), IF(AC28/Z28*100<>0, IF(AH28/Z28*100>100,100,AH28/Z28*100), \"-\"),0)","v":"-"},null,{"$f":"IF(AND(D28<>0, D28<>\"Unknown\",D28<>\"Stopped\",D28<>\"Not required\"),D28/COUNTRY_INFO!D28, 0)","v":0},{"$f":"IF(AND(J28<>0,J28<>\"Unknown\",J28<>\"Stopped\",J28<>\"Not required\"),J28/COUNTRY_INFO!D28, 0)","v":0},{"$f":"IF(AND(P28<>0,P28<>\"Unknown\",P28<>\"Not required\"),P28/(COUNTRY_INFO!E28+COUNTRY_INFO!F28), 0)","v":1},{"$f":"IF(AND(Z28<>0,Z28<>\"Unknown\",Z28<>\"Not required\"),IF(COUNTRY_INFO!K28=1,1,IF(COUNTRY_INFO!K28=2,0.5*COUNTRY_INFO!F28/(0.5*COUNTRY_INFO!F28+0.2*COUNTRY_INFO!G28),IF(COUNTRY_INFO!K28=3,COUNTRY_INFO!F28/(COUNTRY_INFO!F28+COUNTRY_INFO!G28)))),0)","v":1},{"$f":"IF(AND(Z28<>0,Z28<>\"Unknown\",Z28<>\"Not required\"),IF(COUNTRY_INFO!K28=1,0,IF(COUNTRY_INFO!K28=2,0.2*COUNTRY_INFO!G28/(0.5*COUNTRY_INFO!F28+0.2*COUNTRY_INFO!G28),IF(COUNTRY_INFO!K28=3,COUNTRY_INFO!G28/(COUNTRY_INFO!F28+COUNTRY_INFO!G28)))),0)","v":0},{"$f":"MAX(COUNTRY_INFO!D28*AK28*PROFILE!$G$7,COUNTRY_INFO!D28*AL28*PROFILE!$G$7)","v":0},{"$f":"MAX(COUNTRY_INFO!D28*AK28*PROFILE!$G$8,COUNTRY_INFO!D28*AL28*PROFILE!$G$8,COUNTRY_INFO!D28*AM28*PROFILE!$G$8)","v":50151.42120727188},{"$f":"MAX(COUNTRY_INFO!D28*AK28*PROFILE!$G$9,COUNTRY_INFO!D28*AL28*PROFILE!$G$9,COUNTRY_INFO!D28*AM28*PROFILE!$G$9,IF(AND(DISTRICT!Z28<>\"Unknown\",Z28<>\"Not required\"),COUNTRY_INFO!O28*DISTRICT!AN28,0))","v":120928.53500833892},{"$f":"MAX(COUNTRY_INFO!D28*AK28*PROFILE!$G$10,COUNTRY_INFO!D28*AL28*PROFILE!$G$10,IF(AND(DISTRICT!Z28<>\"Unknown\",Z28<>\"Not required\"),COUNTRY_INFO!O28*DISTRICT!AO28,0))","v":0},171079.95621561079,0,{"$f":"MAX('MDA2'!J28,'MDA5'!J28,'T1'!L28,'T2'!J28,T3_R1!K28,T3_R2!K28)","v":41352},{"$f":"MAX('MDA1'!K28,'MDA2'!K28,'MDA3'!I28,'MDA3'!L28,'MDA5'!K28,'T1'!M28,'T2'!K28,T3_R1!L28,T3_R2!L28)","v":100557},{"$f":"MAX('MDA1'!L28,'MDA2'!L28,'MDA3'!J28,'MDA3'!M28,'MDA5'!L28,'T1'!N28,'T2'!L28,T3_R1!M28,T3_R2!M28)","v":218203},360112,{"$f":"MAX('MDA2'!J28,'MDA5'!J28,T28)","v":41352},{"$f":"MAX('MDA1'!K28,'MDA2'!K28,'MDA3'!I28,'MDA3'!L28,'MDA5'!K28,V28,AD28)","v":100557},{"$f":"MAX('MDA1'!L28,'MDA2'!L28,'MDA3'!J28,'MDA3'!M28,'MDA5'!L28,AF28)","v":0},141909,82.948934018403151]
[{"$f":"IF(COUNTRY_INFO!A29=0,\" \",COUNTRY_INFO!A29)","v":"Rwanda"},{"$f":"IF(COUNTRY_INFO!B29=0,\" \",COUNTRY_INFO!B29)","v":"Western"},{"$f":"IF(COUNTRY_INFO!C29=0,\" \",COUNTRY_INFO!C29)","v":"Nyamasheke"},{"$f":"COUNTRY_INFO!L29","v":0},null,null,{"$f":"MAX('MDA1'!M29,'MDA2'!M29,'MDA5'!M29)","v":0},{"$f":"IF(AND(COUNTRY_INFO!H29>0,COUNTRY_INFO!H29<4),IF(D29>MAX('MDA1'!M29,'MDA2'!M29,'MDA5'!M29),MAX('MDA1'!M29,'MDA2'!M29,'MDA5'!M29),D29),0)","v":0},{"$f":"IF(AND(COUNTRY_INFO!H29>0,COUNTRY_INFO!H29<4), IF(G29/D29*100<>0, IF(G29/D29*100>100,100,G29/D29*100), \"-\"),0)","v":0},{"$f":"COUNTRY_INFO!M29","v":0},null,null,{"$f":"MAX('MDA1'!M29,MAX('MDA3'!I29,'MDA3'!L29)+MAX('MDA3'!J29,'MDA3'!M29))","v":0},{"$f":"IF(AND(COUNTRY_INFO!I29>0,COUNTRY_INFO!I29<4),IF(J29>MAX('MDA1'!M29,MAX('MDA3'!I29,'MDA3'!L29)+MAX('MDA3'!J29,'MDA3'!M29)),MAX('MDA1'!M29,MAX('MDA3'!I29,'MDA3'!L29)+MAX('MDA3'!J29,'MDA3'!M29)),J29),0)","v":0},{"$f":"IF(AND(COUNTRY_INFO!I29>0,COUNTRY_INFO!I29<4), IF(M29/J29*100<>0, IF(M29/J29*100>100,100,M29/J29*100), \"-\"),0)","v":0},{"$f":"COUNTRY_INFO!N29","v":188688.27599344801},null,null,{"$f":"SUM(MAX('MDA2'!J29,'MDA5'!J29, 'T1'!L29, MAX(T3_R1!K29, T3_R2!K29)), MAX('MDA1'!K29, 'MDA2'!K29, 'MDA5'!K29,'T1'!M29, MAX(T3_R1!L29, T3_R2!L29)), MAX('MDA1'!L29, 'MDA2'!L29, 'MDA5'!L29,'T1'!N29, MAX(T3_R1!M29, T3_R2!M29)))","v":368809},{"$f":"IF(AND(COUNTRY_INFO!J29>1,COUNTRY_INFO!J29<4),IF(COUNTRY_INFO!E29>MAX('MDA2'!J29,'MDA5'!J29,'T1'!L29,MAX(T3_R1!K29,T3_R2!K29)),MAX('MDA2'!J29,'MDA5'!J29,'T1'!L29,MAX(T3_R1!K29,T3_R2!K29)),COUNTRY_INFO!E29),0)","v":57897},{"$f":"IF(AND(COUNTRY_INFO!J29>1,COUNTRY_INFO!J29<4), IF(T29/COUNTRY_INFO!E29*100<>0, IF(T29/COUNTRY_INFO!E29*100>100,100,T29/COUNTRY_INFO!E29*100), \"-\"),0)","v":97.123549993365373},{"$f":"IF(AND(COUNTRY_INFO!J29>1,COUNTRY_INFO!J29<4),IF(COUNTRY_INFO!F29>MAX('MDA1'!K29,'MDA2'!K29,'MDA5'!K29,'T1'!M29,MAX(T3_R1!L29,T3_R2!L29)),MAX('MDA1'!K29,'MDA2'!K29,'MDA5'!K29,'T1'!M29,MAX(T3_R1!L29,T3_R2!L29)),COUNTRY_INFO!F29),0)","v":122463},{"$f":"IF(AND(COUNTRY_INFO!J29>1,COUNTRY_INFO!J29<4), IF(V29/COUNTRY_INFO!F29*100<>0, IF(V29/COUNTRY_INFO!F29*100>100,100,V29/COUNTRY_INFO!F29*100), \"-\"),0)","v":94.87623899901061},180360,{"$f":"IF(AND(COUNTRY_INFO!J29>1,COUNTRY_INFO!J29<4), IF(S29/P29*100<>0, IF(X29/P29*100>100,100,X29/P29*100), \"-\"),0)","v":95.586224978950369},{"$f":"COUNTRY_INFO!O29","v":87346},null,null,{"$f":"MAX('T1'!L29,'T2'!J29)+MAX('T1'!M29,'T2'!K29)+MAX('T1'!N29,'T2'!L29)","v":212838},{"$f":"IF(COUNTRY_INFO!K29=1,IF(COUNTRY_INFO!F29*0.33>MAX('T1'!M29,'T2'!K29),MAX('T1'!M29,'T2'!K29),COUNTRY_INFO!F29*0.33),IF(COUNTRY_INFO!K29=2,IF(COUNTRY_INFO!F29*0.5>MAX('T1'!M29,'T2'!K29),MAX('T1'!M29,'T2'!K29),COUNTRY_INFO!F29*0.5),IF(COUNTRY_INFO!K29=3,IF(COUNTRY_INFO!F29>MAX('T1'!M29,'T2'!K29),MAX('T1'!M29,'T2'!K29),COUNTRY_INFO!F29),0)))","v":64538.287611336003},{"$f":"IF(AND(COUNTRY_INFO!K29>0,COUNTRY_INFO!K29<4),IF(Z29>0,IF(COUNTRY_INFO!K29=1, AD29/(COUNTRY_INFO!F29*0.33)*100, IF(COUNTRY_INFO!K29=2, AD29/(COUNTRY_INFO!F29*0.5)*100, IF(COUNTRY_INFO!K29=3, AD29/COUNTRY_INFO!F29*100))),\"-\"),0)","v":100},{"$f":"IF(COUNTRY_INFO!K29=2,IF(COUNTRY_INFO!G29*0.2>MAX('T1'!N29,'T2'!L29),MAX('T1'!N29,'T2'!L29),COUNTRY_INFO!G29*0.2),IF(COUNTRY_INFO!K29=3,IF(COUNTRY_INFO!G29>MAX('T1'!N29,'T2'!L29),MAX('T1'!N29,'T2'!L29),COUNTRY_INFO!G29),0))","v":57739.597771363209},{"$f":"IF(AND(COUNTRY_INFO!K29>0,COUNTRY_INFO!K29<4),IF(Z29>0,IF(COUNTRY_INFO!K29=1, 0, IF(COUNTRY_INFO!K29=2, AF29/(COUNTRY_INFO!G29*0.2)*100, IF(COUNTRY_INFO!K29=3, AF29/COUNTRY_INFO!G29*100))),\"-\"),0)","v":100},122277.88538269921,{"$f":"IF(AND(COUNTRY_INFO!K29>0,COUNTRY_INFO!K29<4), IF(AC29/Z29*100<>0, IF(AH29/Z29*100>100,100,AH29/Z29*100), \"-\"),0)","v":100},null,{"$f":"IF(AND(D29<>0, D29<>\"Unknown\",D29<>\"Stopped\",D29<>\"Not required\"),D29/COUNTRY_INFO!D29, 0)","v":0},{"$f":"IF(AND(J29<>0,J29<>\"Unknown\",J29<>\"Stopped\",J29<>\"Not required\"),J29/COUNTRY_INFO!D29, 0)","v":0},{"$f":"IF(AND(P29<>0,P29<>\"Unknown\",P29<>\"Not required\"),P29/(COUNTRY_INFO!E29+COUNTRY_INFO!F29), 0)","v":1},{"$f":"IF(AND(Z29<>0,Z29<>\"Unknown\",Z29<>\"Not required\"),IF(COUNTRY_INFO!K29=1,1,IF(COUNTRY_INFO!K29=2,0.5*COUNTRY_INFO!F29/(0.5*COUNTRY_INFO!F29+0.2*COUNTRY_INFO!G29),IF(COUNTRY_INFO!K29=3,COUNTRY_INFO!F29/(COUNTRY_INFO!F29+COUNTRY_INFO!G29)))),0)","v":0.52780016116035455},{"$f":"IF(AND(Z29<>0,Z29<>\"Unknown\",Z29<>\"Not required\"),IF(COUNTRY_INFO!K29=1,0,IF(COUNTRY_INFO!K29=2,0.2*COUNTRY_INFO!G29/(0.5*COUNTRY_INFO!F29+0.2*COUNTRY_INFO!G29),IF(COUNTRY_INFO!K29=3,COUNTRY_INFO!G29/(COUNTRY_INFO!F29+COUNTRY_INFO!G29)))),0)","v":0.47219983883964545},{"$f":"MAX(COUNTRY_INFO!D29*AK29*PROFILE!$G$7,COUNTRY_INFO!D29*AL29*PROFILE!$G$7)","v":0},{"$f":"MAX(COUNTRY_INFO!D29*AK29*PROFILE!$G$8,COUNTRY_INFO!D29*AL29*PROFILE!$G$8,COUNTRY_INFO!D29*AM29*PROFILE!$G$8)","v":58159.423820466749},{"$f":"MAX(COUNTRY_INFO!D29*AK29*PROFILE!$G$9,COUNTRY_INFO!D29*AL29*PROFILE!$G$9,COUNTRY_INFO!D29*AM29*PROFILE!$G$9,IF(AND(DISTRICT!Z29<>\"Unknown\",Z29<>\"Not required\"),COUNTRY_INFO!O29*DISTRICT!AN29,0))","v":140237.97831113788},{"$f":"MAX(COUNTRY_INFO!D29*AK29*PROFILE!$G$10,COUNTRY_INFO!D29*AL29*PROFILE!$G$10,IF(AND(DISTRICT!Z29<>\"Unknown\",Z29<>\"Not required\"),COUNTRY_INFO!O29*DISTRICT!AO29,0))","v":41244.767123287675},239642.16925489227,"Y",{"$f":"MAX('MDA2'!J29,'MDA5'!J29,'T1'!L29,'T2'!J29,T3_R1!K29,T3_R2!K29)","v":57897},{"$f":"MAX('MDA1'!K29,'MDA2'!K29,'MDA3'!I29,'MDA3'!L29,'MDA5'!K29,'T1'!M29,'T2'!K29,T3_R1!L29,T3_R2!L29)","v":122463},{"$f":"MAX('MDA1'!L29,'MDA2'!L29,'MDA3'!J29,'MDA3'!M29,'MDA5'!L29,'T1'!N29,'T2'!L29,T3_R1!M29,T3_R2!M29)","v":188449},368809,{"$f":"MAX('MDA2'!J29,'MDA5'!J29,T29)","v":57897},{"$f":"MAX('MDA1'!K29,'MDA2'!K29,'MDA3'!I29,'MDA3'!L29,'MDA5'!K29,V29,AD29)","v":122463},{"$f":"MAX('MDA1'!L29,'MDA2'!L29,'MDA3'!J29,'MDA3'!M29,'MDA5'!L29,AF29)","v":57739.597771363209},238099.59777136322,99.356302153195614]
[{"$f":"IF(COUNTRY_INFO!A30=0,\" \",COUNTRY_INFO!A30)","v":"Rwanda"},{"$f":"IF(COUNTRY_INFO!B30=0,\" \",COUNTRY_INFO!B30)","v":"Southern"},{"$f":"IF(COUNTRY_INFO!C30=0,\" \",COUNTRY_INFO!C30)","v":"Nyanza"},{"$f":"COUNTRY_INFO!L30","v":0},null,null,{"$f":"MAX('MDA1'!M30,'MDA2'!M30,'MDA5'!M30)","v":0},{"$f":"IF(AND(COUNTRY_INFO!H30>0,COUNTRY_INFO!H30<4),IF(D30>MAX('MDA1'!M30,'MDA2'!M30,'MDA5'!M30),MAX('MDA1'!M30,'MDA2'!M30,'MDA5'!M30),D30),0)","v":0},{"$f":"IF(AND(COUNTRY_INFO!H30>0,COUNTRY_INFO!H30<4), IF(G30/D30*100<>0, IF(G30/D30*100>100,100,G30/D30*100), \"-\"),0)","v":0},{"$f":"COUNTRY_INFO!M30","v":0},null,null,{"$f":"MAX('MDA1'!M30,MAX('MDA3'!I30,'MDA3'!L30)+MAX('MDA3'!J30,'MDA3'!M30))","v":0},{"$f":"IF(AND(COUNTRY_INFO!I30>0,COUNTRY_INFO!I30<4),IF(J30>MAX('MDA1'!M30,MAX('MDA3'!I30,'MDA3'!L30)+MAX('MDA3'!J30,'MDA3'!M30)),MAX('MDA1'!M30,MAX('MDA3'!I30,'MDA3'!L30)+MAX('MDA3'!J30,'MDA3'!M30)),J30),0)","v":0},{"$f":"IF(AND(COUNTRY_INFO!I30>0,COUNTRY_INFO!I30<4), IF(M30/J30*100<>0, IF(M30/J30*100>100,100,M30/J30*100), \"-\"),0)","v":0},{"$f":"COUNTRY_INFO!N30","v":157019.7575331},null,null,{"$f":"SUM(MAX('MDA2'!J30,'MDA5'!J30, 'T1'!L30, MAX(T3_R1!K30, T3_R2!K30)), MAX('MDA1'!K30, 'MDA2'!K30, 'MDA5'!K30,'T1'!M30, MAX(T3_R1!L30, T3_R2!L30)), MAX('MDA1'!L30, 'MDA2'!L30, 'MDA5'!L30,'T1'!N30, MAX(T3_R1!M30, T3_R2!M30)))","v":319560},{"$f":"IF(AND(COUNTRY_INFO!J30>1,COUNTRY_INFO!J30<4),IF(COUNTRY_INFO!E30>MAX('MDA2'!J30,'MDA5'!J30,'T1'!L30,MAX(T3_R1!K30,T3_R2!K30)),MAX('MDA2'!J30,'MDA5'!J30,'T1'!L30,MAX(T3_R1!K30,T3_R2!K30)),COUNTRY_INFO!E30),0)","v":35966},{"$f":"IF(AND(COUNTRY_INFO!J30>1,COUNTRY_INFO!J30<4), IF(T30/COUNTRY_INFO!E30*100<>0, IF(T30/COUNTRY_INFO!E30*100>100,100,T30/COUNTRY_INFO!E30*100), \"-\"),0)","v":73.488151096107828},{"$f":"IF(AND(COUNTRY_INFO!J30>1,COUNTRY_INFO!J30<4),IF(COUNTRY_INFO!F30>MAX('MDA1'!K30,'MDA2'!K30,'MDA5'!K30,'T1'!M30,MAX(T3_R1!L30,T3_R2!L30)),MAX('MDA1'!K30,'MDA2'!K30,'MDA5'!K30,'T1'!M30,MAX(T3_R1!L30,T3_R2!L30)),COUNTRY_INFO!F30),0)","v":99069},{"$f":"IF(AND(COUNTRY_INFO!J30>1,COUNTRY_INFO!J30<4), IF(V30/COUNTRY_INFO!F30*100<>0, IF(V30/COUNTRY_INFO!F30*100>100,100,V30/COUNTRY_INFO!F30*100), \"-\"),0)","v":91.663900278233072},135035,{"$f":"IF(AND(COUNTRY_INFO!J30>1,COUNTRY_INFO!J30<4), IF(S30/P30*100<>0, IF(X30/P30*100>100,100,X30/P30*100), \"-\"),0)","v":85.998731701986245},{"$f":"COUNTRY_INFO!O30","v":49773},null,null,{"$f":"MAX('T1'!L30,'T2'!J30)+MAX('T1'!M30,'T2'!K30)+MAX('T1'!N30,'T2'!L30)","v":113147},{"$f":"IF(COUNTRY_INFO!K30=1,IF(COUNTRY_INFO!F30*0.33>MAX('T1'!M30,'T2'!K30),MAX('T1'!M30,'T2'!K30),COUNTRY_INFO!F30*0.33),IF(COUNTRY_INFO!K30=2,IF(COUNTRY_INFO!F30*0.5>MAX('T1'!M30,'T2'!K30),MAX('T1'!M30,'T2'!K30),COUNTRY_INFO!F30*0.5),IF(COUNTRY_INFO!K30=3,IF(COUNTRY_INFO!F30>MAX('T1'!M30,'T2'!K30),MAX('T1'!M30,'T2'!K30),COUNTRY_INFO!F30),0)))","v":42350},{"$f":"IF(AND(COUNTRY_INFO!K30>0,COUNTRY_INFO!K30<4),IF(Z30>0,IF(COUNTRY_INFO!K30=1, AD30/(COUNTRY_INFO!F30*0.33)*100, IF(COUNTRY_INFO!K30=2, AD30/(COUNTRY_INFO!F30*0.5)*100, IF(COUNTRY_INFO!K30=3, AD30/COUNTRY_INFO!F30*100))),\"-\"),0)","v":78.368938351717915},{"$f":"IF(COUNTRY_INFO!K30=2,IF(COUNTRY_INFO!G30*0.2>MAX('T1'!N30,'T2'!L30),MAX('T1'!N30,'T2'!L30),COUNTRY_INFO!G30*0.2),IF(COUNTRY_INFO!K30=3,IF(COUNTRY_INFO!G30>MAX('T1'!N30,'T2'!L30),MAX('T1'!N30,'T2'!L30),COUNTRY_INFO!G30),0))","v":47717.692549020001},{"$f":"IF(AND(COUNTRY_INFO!K30>0,COUNTRY_INFO!K30<4),IF(Z30>0,IF(COUNTRY_INFO!K30=1, 0, IF(COUNTRY_INFO!K30=2, AF30/(COUNTRY_INFO!G30*0.2)*100, IF(COUNTRY_INFO!K30=3, AF30/COUNTRY_INFO!G30*100))),\"-\"),0)","v":100},90067.692549019994,{"$f":"IF(AND(COUNTRY_INFO!K30>0,COUNTRY_INFO!K30<4), IF(AC30/Z30*100<>0, IF(AH30/Z30*100>100,100,AH30/Z30*100), \"-\"),0)","v":100},null,{"$f":"IF(AND(D30<>0, D30<>\"Unknown\",D30<>\"Stopped\",D30<>\"Not required\"),D30/COUNTRY_INFO!D30, 0)","v":0},{"$f":"IF(AND(J30<>0,J30<>\"Unknown\",J30<>\"Stopped\",J30<>\"Not required\"),J30/COUNTRY_INFO!D30, 0)","v":0},{"$f":"IF(AND(P30<>0,P30<>\"Unknown\",P30<>\"Not required\"),P30/(COUNTRY_INFO!E30+COUNTRY_INFO!F30), 0)","v":1},{"$f":"IF(AND(Z30<>0,Z30<>\"Unknown\",Z30<>\"Not required\"),IF(COUNTRY_INFO!K30=1,1,IF(COUNTRY_INFO!K30=2,0.5*COUNTRY_INFO!F30/(0.5*COUNTRY_INFO!F30+0.2*COUNTRY_INFO!G30),IF(COUNTRY_INFO!K30=3,COUNTRY_INFO!F30/(COUNTRY_INFO!F30+COUNTRY_INFO!G30)))),0)","v":0.53106212424849697},{"$f":"IF(AND(Z30<>0,Z30<>\"Unknown\",Z30<>\"Not required\"),IF(COUNTRY_INFO!K30=1,0,IF(COUNTRY_INFO!K30=2,0.2*COUNTRY_INFO!G30/(0.5*COUNTRY_INFO!F30+0.2*COUNTRY_INFO!G30),IF(COUNTRY_INFO!K30=3,COUNTRY_INFO!G30/(COUNTRY_INFO!F30+COUNTRY_INFO!G30)))),0)","v":0.46893787575150297},{"$f":"MAX(COUNTRY_INFO!D30*AK30*PROFILE!$G$7,COUNTRY_INFO!D30*AL30*PROFILE!$G$7)","v":0},{"$f":"MAX(COUNTRY_INFO!D30*AK30*PROFILE!$G$8,COUNTRY_INFO!D30*AL30*PROFILE!$G$8,COUNTRY_INFO!D30*AM30*PROFILE!$G$8)","v":48146.810869695117},{"$f":"MAX(COUNTRY_INFO!D30*AK30*PROFILE!$G$9,COUNTRY_INFO!D30*AL30*PROFILE!$G$9,COUNTRY_INFO!D30*AM30*PROFILE!$G$9,IF(AND(DISTRICT!Z30<>\"Unknown\",Z30<>\"Not required\"),COUNTRY_INFO!O30*DISTRICT!AN30,0))","v":116094.88153351816},{"$f":"MAX(COUNTRY_INFO!D30*AK30*PROFILE!$G$10,COUNTRY_INFO!D30*AL30*PROFILE!$G$10,IF(AND(DISTRICT!Z30<>\"Unknown\",Z30<>\"Not required\"),COUNTRY_INFO!O30*DISTRICT!AO30,0))","v":23340.444889779559},187582.13729299282,"Y",{"$f":"MAX('MDA2'!J30,'MDA5'!J30,'T1'!L30,'T2'!J30,T3_R1!K30,T3_R2!K30)","v":35966},{"$f":"MAX('MDA1'!K30,'MDA2'!K30,'MDA3'!I30,'MDA3'!L30,'MDA5'!K30,'T1'!M30,'T2'!K30,T3_R1!L30,T3_R2!L30)","v":99069},{"$f":"MAX('MDA1'!L30,'MDA2'!L30,'MDA3'!J30,'MDA3'!M30,'MDA5'!L30,'T1'!N30,'T2'!L30,T3_R1!M30,T3_R2!M30)","v":184525},319560,{"$f":"MAX('MDA2'!J30,'MDA5'!J30,T30)","v":35966},{"$f":"MAX('MDA1'!K30,'MDA2'!K30,'MDA3'!I30,'MDA3'!L30,'MDA5'!K30,V30,AD30)","v":99069},{"$f":"MAX('MDA1'!L30,'MDA2'!L30,'MDA3'!J30,'MDA3'!M30,'MDA5'!L30,AF30)","v":47717.692549020001},182752.69254901999,97.425423969645095]
[{"$f":"IF(COUNTRY_INFO!A31=0,\" \",COUNTRY_INFO!A31)","v":"Rwanda"},{"$f":"IF(COUNTRY_INFO!B31=0,\" \",COUNTRY_INFO!B31)","v":"Kigali"},{"$f":"IF(COUNTRY_INFO!C31=0,\" \",COUNTRY_INFO!C31)","v":"Nyarugenge"},{"$f":"COUNTRY_INFO!L31","v":0},null,null,{"$f":"MAX('MDA1'!M31,'MDA2'!M31,'MDA5'!M31)","v":0},{"$f":"IF(AND(COUNTRY_INFO!H31>0,COUNTRY_INFO!H31<4),IF(D31>MAX('MDA1'!M31,'MDA2'!M31,'MDA5'!M31),MAX('MDA1'!M31,'MDA2'!M31,'MDA5'!M31),D31),0)","v":0},{"$f":"IF(AND(COUNTRY_INFO!H31>0,COUNTRY_INFO!H31<4), IF(G31/D31*100<>0, IF(G31/D31*100>100,100,G31/D31*100), \"-\"),0)","v":0},{"$f":"COUNTRY_INFO!M31","v":0},null,null,{"$f":"MAX('MDA1'!M31,MAX('MDA3'!I31,'MDA3'!L31)+MAX('MDA3'!J31,'MDA3'!M31))","v":0},{"$f":"IF(AND(COUNTRY_INFO!I31>0,COUNTRY_INFO!I31<4),IF(J31>MAX('MDA1'!M31,MAX('MDA3'!I31,'MDA3'!L31)+MAX('MDA3'!J31,'MDA3'!M31)),MAX('MDA1'!M31,MAX('MDA3'!I31,'MDA3'!L31)+MAX('MDA3'!J31,'MDA3'!M31)),J31),0)","v":0},{"$f":"IF(AND(COUNTRY_INFO!I31>0,COUNTRY_INFO!I31<4), IF(M31/J31*100<>0, IF(M31/J31*100>100,100,M31/J31*100), \"-\"),0)","v":0},{"$f":"COUNTRY_INFO!N31","v":0},null,null,{"$f":"SUM(MAX('MDA2'!J31,'MDA5'!J31, 'T1'!L31, MAX(T3_R1!K31, T3_R2!K31)), MAX('MDA1'!K31, 'MDA2'!K31, 'MDA5'!K31,'T1'!M31, MAX(T3_R1!L31, T3_R2!L31)), MAX('MDA1'!L31, 'MDA2'!L31, 'MDA5'!L31,'T1'!N31, MAX(T3_R1!M31, T3_R2!M31)))","v":302354},{"$f":"IF(AND(COUNTRY_INFO!J31>1,COUNTRY_INFO!J31<4),IF(COUNTRY_INFO!E31>MAX('MDA2'!J31,'MDA5'!J31,'T1'!L31,MAX(T3_R1!K31,T3_R2!K31)),MAX('MDA2'!J31,'MDA5'!J31,'T1'!L31,MAX(T3_R1!K31,T3_R2!K31)),COUNTRY_INFO!E31),0)","v":0},{"$f":"IF(AND(COUNTRY_INFO!J31>1,COUNTRY_INFO!J31<4), IF(T31/COUNTRY_INFO!E31*100<>0, IF(T31/COUNTRY_INFO!E31*100>100,100,T31/COUNTRY_INFO!E31*100), \"-\"),0)","v":0},{"$f":"IF(AND(COUNTRY_INFO!J31>1,COUNTRY_INFO!J31<4),IF(COUNTRY_INFO!F31>MAX('MDA1'!K31,'MDA2'!K31,'MDA5'!K31,'T1'!M31,MAX(T3_R1!L31,T3_R2!L31)),MAX('MDA1'!K31,'MDA2'!K31,'MDA5'!K31,'T1'!M31,MAX(T3_R1!L31,T3_R2!L31)),COUNTRY_INFO!F31),0)","v":0},{"$f":"IF(AND(COUNTRY_INFO!J31>1,COUNTRY_INFO!J31<4), IF(V31/COUNTRY_INFO!F31*100<>0, IF(V31/COUNTRY_INFO!F31*100>100,100,V31/COUNTRY_INFO!F31*100), \"-\"),0)","v":0},0,{"$f":"IF(AND(COUNTRY_INFO!J31>1,COUNTRY_INFO!J31<4), IF(S31/P31*100<>0, IF(X31/P31*100>100,100,X31/P31*100), \"-\"),0)","v":0},{"$f":"COUNTRY_INFO!O31","v":6463},null,null,{"$f":"MAX('T1'!L31,'T2'!J31)+MAX('T1'!M31,'T2'!K31)+MAX('T1'!N31,'T2'!L31)","v":27577},{"$f":"IF(COUNTRY_INFO!K31=1,IF(COUNTRY_INFO!F31*0.33>MAX('T1'!M31,'T2'!K31),MAX('T1'!M31,'T2'!K31),COUNTRY_INFO!F31*0.33),IF(COUNTRY_INFO!K31=2,IF(COUNTRY_INFO!F31*0.5>MAX('T1'!M31,'T2'!K31),MAX('T1'!M31,'T2'!K31),COUNTRY_INFO!F31*0.5),IF(COUNTRY_INFO!K31=3,IF(COUNTRY_INFO!F31>MAX('T1'!M31,'T2'!K31),MAX('T1'!M31,'T2'!K31),COUNTRY_INFO!F31),0)))","v":12786},{"$f":"IF(AND(COUNTRY_INFO!K31>0,COUNTRY_INFO!K31<4),IF(Z31>0,IF(COUNTRY_INFO!K31=1, AD31/(COUNTRY_INFO!F31*0.33)*100, IF(COUNTRY_INFO!K31=2, AD31/(COUNTRY_INFO!F31*0.5)*100, IF(COUNTRY_INFO!K31=3, AD31/COUNTRY_INFO!F31*100))),\"-\"),0)","v":32.57003271765744},{"$f":"IF(COUNTRY_INFO!K31=2,IF(COUNTRY_INFO!G31*0.2>MAX('T1'!N31,'T2'!L31),MAX('T1'!N31,'T2'!L31),COUNTRY_INFO!G31*0.2),IF(COUNTRY_INFO!K31=3,IF(COUNTRY_INFO!G31>MAX('T1'!N31,'T2'!L31),MAX('T1'!N31,'T2'!L31),COUNTRY_INFO!G31),0))","v":14791},{"$f":"IF(AND(COUNTRY_INFO!K31>0,COUNTRY_INFO!K31<4),IF(Z31>0,IF(COUNTRY_INFO!K31=1, 0, IF(COUNTRY_INFO!K31=2, AF31/(COUNTRY_INFO!G31*0.2)*100, IF(COUNTRY_INFO!K31=3, AF31/COUNTRY_INFO!G31*100))),\"-\"),0)","v":31.784871390651166},27577,{"$f":"IF(AND(COUNTRY_INFO!K31>0,COUNTRY_INFO!K31<4), IF(AC31/Z31*100<>0, IF(AH31/Z31*100>100,100,AH31/Z31*100), \"-\"),0)","v":100},null,{"$f":"IF(AND(D31<>0, D31<>\"Unknown\",D31<>\"Stopped\",D31<>\"Not required\"),D31/COUNTRY_INFO!D31, 0)","v":0},{"$f":"IF(AND(J31<>0,J31<>\"Unknown\",J31<>\"Stopped\",J31<>\"Not required\"),J31/COUNTRY_INFO!D31, 0)","v":0},{"$f":"IF(AND(P31<>0,P31<>\"Unknown\",P31<>\"Not required\"),P31/(COUNTRY_INFO!E31+COUNTRY_INFO!F31), 0)","v":0},{"$f":"IF(AND(Z31<>0,Z31<>\"Unknown\",Z31<>\"Not required\"),IF(COUNTRY_INFO!K31=1,1,IF(COUNTRY_INFO!K31=2,0.5*COUNTRY_INFO!F31/(0.5*COUNTRY_INFO!F31+0.2*COUNTRY_INFO!G31),IF(COUNTRY_INFO!K31=3,COUNTRY_INFO!F31/(COUNTRY_INFO!F31+COUNTRY_INFO!G31)))),0)","v":0.45758462181362297},{"$f":"IF(AND(Z31<>0,Z31<>\"Unknown\",Z31<>\"Not required\"),IF(COUNTRY_INFO!K31=1,0,IF(COUNTRY_INFO!K31=2,0.2*COUNTRY_INFO!G31/(0.5*COUNTRY_INFO!F31+0.2*COUNTRY_INFO!G31),IF(COUNTRY_INFO!K31=3,COUNTRY_INFO!G31/(COUNTRY_INFO!F31+COUNTRY_INFO!G31)))),0)","v":0.54241537818637697},{"$f":"MAX(COUNTRY_INFO!D31*AK31*PROFILE!$G$7,COUNTRY_INFO!D31*AL31*PROFILE!$G$7)","v":0},{"$f":"MAX(COUNTRY_INFO!D31*AK31*PROFILE!$G$8,COUNTRY_INFO!D31*AL31*PROFILE!$G$8,COUNTRY_INFO!D31*AM31*PROFILE!$G$8)","v":0},{"$f":"MAX(COUNTRY_INFO!D31*AK31*PROFILE!$G$9,COUNTRY_INFO!D31*AL31*PROFILE!$G$9,COUNTRY_INFO!D31*AM31*PROFILE!$G$9,IF(AND(DISTRICT!Z31<>\"Unknown\",Z31<>\"Not required\"),COUNTRY_INFO!O31*DISTRICT!AN31,0))","v":2957.3694107814454},{"$f":"MAX(COUNTRY_INFO!D31*AK31*PROFILE!$G$10,COUNTRY_INFO!D31*AL31*PROFILE!$G$10,IF(AND(DISTRICT!Z31<>\"Unknown\",Z31<>\"Not required\"),COUNTRY_INFO!O31*DISTRICT!AO31,0))","v":3505.6305892185542},6463,"Y",{"$f":"MAX('MDA2'!J31,'MDA5'!J31,'T1'!L31,'T2'!J31,T3_R1!K31,T3_R2!K31)","v":43369},{"$f":"MAX('MDA1'!K31,'MDA2'!K31,'MDA3'!I31,'MDA3'!L31,'MDA5'!K31,'T1'!M31,'T2'!K31,T3_R1!L31,T3_R2!L31)","v":102690},{"$f":"MAX('MDA1'!L31,'MDA2'!L31,'MDA3'!J31,'MDA3'!M31,'MDA5'!L31,'T1'!N31,'T2'!L31,T3_R1!M31,T3_R2!M31)","v":156295},302354,{"$f":"MAX('MDA2'!J31,'MDA5'!J31,T31)","v":0},{"$f":"MAX('MDA1'!K31,'MDA2'!K31,'MDA3'!I31,'MDA3'!L31,'MDA5'!K31,V31,AD31)","v":12786},{"$f":"MAX('MDA1'!L31,'MDA2'!L31,'MDA3'!J31,'MDA3'!M31,'MDA5'!L31,AF31)","v":14791},6463,100]
[{"$f":"IF(COUNTRY_INFO!A32=0,\" \",COUNTRY_INFO!A32)","v":"Rwanda"},{"$f":"IF(COUNTRY_INFO!B32=0,\" \",COUNTRY_INFO!B32)","v":"Southern"},{"$f":"IF(COUNTRY_INFO!C32=0,\" \",COUNTRY_INFO!C32)","v":"Nyaruguru"},{"$f":"COUNTRY_INFO!L32","v":0},null,null,{"$f":"MAX('MDA1'!M32,'MDA2'!M32,'MDA5'!M32)","v":0},{"$f":"IF(AND(COUNTRY_INFO!H32>0,COUNTRY_INFO!H32<4),IF(D32>MAX('MDA1'!M32,'MDA2'!M32,'MDA5'!M32),MAX('MDA1'!M32,'MDA2'!M32,'MDA5'!M32),D32),0)","v":0},{"$f":"IF(AND(COUNTRY_INFO!H32>0,COUNTRY_INFO!H32<4), IF(G32/D32*100<>0, IF(G32/D32*100>100,100,G32/D32*100), \"-\"),0)","v":0},{"$f":"COUNTRY_INFO!M32","v":0},null,null,{"$f":"MAX('MDA1'!M32,MAX('MDA3'!I32,'MDA3'!L32)+MAX('MDA3'!J32,'MDA3'!M32))","v":0},{"$f":"IF(AND(COUNTRY_INFO!I32>0,COUNTRY_INFO!I32<4),IF(J32>MAX('MDA1'!M32,MAX('MDA3'!I32,'MDA3'!L32)+MAX('MDA3'!J32,'MDA3'!M32)),MAX('MDA1'!M32,MAX('MDA3'!I32,'MDA3'!L32)+MAX('MDA3'!J32,'MDA3'!M32)),J32),0)","v":0},{"$f":"IF(AND(COUNTRY_INFO!I32>0,COUNTRY_INFO!I32<4), IF(M32/J32*100<>0, IF(M32/J32*100>100,100,M32/J32*100), \"-\"),0)","v":0},{"$f":"COUNTRY_INFO!N32","v":162049.65820700399},null,null,{"$f":"SUM(MAX('MDA2'!J32,'MDA5'!J32, 'T1'!L32, MAX(T3_R1!K32, T3_R2!K32)), MAX('MDA1'!K32, 'MDA2'!K32, 'MDA5'!K32,'T1'!M32, MAX(T3_R1!L32, T3_R2!L32)), MAX('MDA1'!L32, 'MDA2'!L32, 'MDA5'!L32,'T1'!N32, MAX(T3_R1!M32, T3_R2!M32)))","v":343582},{"$f":"IF(AND(COUNTRY_INFO!J32>1,COUNTRY_INFO!J32<4),IF(COUNTRY_INFO!E32>MAX('MDA2'!J32,'MDA5'!J32,'T1'!L32,MAX(T3_R1!K32,T3_R2!K32)),MAX('MDA2'!J32,'MDA5'!J32,'T1'!L32,MAX(T3_R1!K32,T3_R2!K32)),COUNTRY_INFO!E32),0)","v":41218},{"$f":"IF(AND(COUNTRY_INFO!J32>1,COUNTRY_INFO!J32<4), IF(T32/COUNTRY_INFO!E32*100<>0, IF(T32/COUNTRY_INFO!E32*100>100,100,T32/COUNTRY_INFO!E32*100), \"-\"),0)","v":95.002354930198479},{"$f":"IF(AND(COUNTRY_INFO!J32>1,COUNTRY_INFO!J32<4),IF(COUNTRY_INFO!F32>MAX('MDA1'!K32,'MDA2'!K32,'MDA5'!K32,'T1'!M32,MAX(T3_R1!L32,T3_R2!L32)),MAX('MDA1'!K32,'MDA2'!K32,'MDA5'!K32,'T1'!M32,MAX(T3_R1!L32,T3_R2!L32)),COUNTRY_INFO!F32),0)","v":111393},{"$f":"IF(AND(COUNTRY_INFO!J32>1,COUNTRY_INFO!J32<4), IF(V32/COUNTRY_INFO!F32*100<>0, IF(V32/COUNTRY_INFO!F32*100>100,100,V32/COUNTRY_INFO!F32*100), \"-\"),0)","v":93.873117233409346},152611,{"$f":"IF(AND(COUNTRY_INFO!J32>1,COUNTRY_INFO!J32<4), IF(S32/P32*100<>0, IF(X32/P32*100>100,100,X32/P32*100), \"-\"),0)","v":94.175453184265933},{"$f":"COUNTRY_INFO!O32","v":39145},null,null,{"$f":"MAX('T1'!L32,'T2'!J32)+MAX('T1'!M32,'T2'!K32)+MAX('T1'!N32,'T2'!L32)","v":0},{"$f":"IF(COUNTRY_INFO!K32=1,IF(COUNTRY_INFO!F32*0.33>MAX('T1'!M32,'T2'!K32),MAX('T1'!M32,'T2'!K32),COUNTRY_INFO!F32*0.33),IF(COUNTRY_INFO!K32=2,IF(COUNTRY_INFO!F32*0.5>MAX('T1'!M32,'T2'!K32),MAX('T1'!M32,'T2'!K32),COUNTRY_INFO!F32*0.5),IF(COUNTRY_INFO!K32=3,IF(COUNTRY_INFO!F32>MAX('T1'!M32,'T2'!K32),MAX('T1'!M32,'T2'!K32),COUNTRY_INFO!F32),0)))","v":0},{"$f":"IF(AND(COUNTRY_INFO!K32>0,COUNTRY_INFO!K32<4),IF(Z32>0,IF(COUNTRY_INFO!K32=1, AD32/(COUNTRY_INFO!F32*0.33)*100, IF(COUNTRY_INFO!K32=2, AD32/(COUNTRY_INFO!F32*0.5)*100, IF(COUNTRY_INFO!K32=3, AD32/COUNTRY_INFO!F32*100))),\"-\"),0)","v":0},{"$f":"IF(COUNTRY_INFO!K32=2,IF(COUNTRY_INFO!G32*0.2>MAX('T1'!N32,'T2'!L32),MAX('T1'!N32,'T2'!L32),COUNTRY_INFO!G32*0.2),IF(COUNTRY_INFO!K32=3,IF(COUNTRY_INFO!G32>MAX('T1'!N32,'T2'!L32),MAX('T1'!N32,'T2'!L32),COUNTRY_INFO!G32),0))","v":0},{"$f":"IF(AND(COUNTRY_INFO!K32>0,COUNTRY_INFO!K32<4),IF(Z32>0,IF(COUNTRY_INFO!K32=1, 0, IF(COUNTRY_INFO!K32=2, AF32/(COUNTRY_INFO!G32*0.2)*100, IF(COUNTRY_INFO!K32=3, AF32/COUNTRY_INFO!G32*100))),\"-\"),0)","v":0},0,{"$f":"IF(AND(COUNTRY_INFO!K32>0,COUNTRY_INFO!K32<4), IF(AC32/Z32*100<>0, IF(AH32/Z32*100>100,100,AH32/Z32*100), \"-\"),0)","v":"-"},null,{"$f":"IF(AND(D32<>0, D32<>\"Unknown\",D32<>\"Stopped\",D32<>\"Not required\"),D32/COUNTRY_INFO!D32, 0)","v":0},{"$f":"IF(AND(J32<>0,J32<>\"Unknown\",J32<>\"Stopped\",J32<>\"Not required\"),J32/COUNTRY_INFO!D32, 0)","v":0},{"$f":"IF(AND(P32<>0,P32<>\"Unknown\",P32<>\"Not required\"),P32/(COUNTRY_INFO!E32+COUNTRY_INFO!F32), 0)","v":1},{"$f":"IF(AND(Z32<>0,Z32<>\"Unknown\",Z32<>\"Not required\"),IF(COUNTRY_INFO!K32=1,1,IF(COUNTRY_INFO!K32=2,0.5*COUNTRY_INFO!F32/(0.5*COUNTRY_INFO!F32+0.2*COUNTRY_INFO!G32),IF(COUNTRY_INFO!K32=3,COUNTRY_INFO!F32/(COUNTRY_INFO!F32+COUNTRY_INFO!G32)))),0)","v":1},{"$f":"IF(AND(Z32<>0,Z32<>\"Unknown\",Z32<>\"Not required\"),IF(COUNTRY_INFO!K32=1,0,IF(COUNTRY_INFO!K32=2,0.2*COUNTRY_INFO!G32/(0.5*COUNTRY_INFO!F32+0.2*COUNTRY_INFO!G32),IF(COUNTRY_INFO!K32=3,COUNTRY_INFO!G32/(COUNTRY_INFO!F32+COUNTRY_INFO!G32)))),0)","v":0},{"$f":"MAX(COUNTRY_INFO!D32*AK32*PROFILE!$G$7,COUNTRY_INFO!D32*AL32*PROFILE!$G$7)","v":0},{"$f":"MAX(COUNTRY_INFO!D32*AK32*PROFILE!$G$8,COUNTRY_INFO!D32*AL32*PROFILE!$G$8,COUNTRY_INFO!D32*AM32*PROFILE!$G$8)","v":43776.459598732399},{"$f":"MAX(COUNTRY_INFO!D32*AK32*PROFILE!$G$9,COUNTRY_INFO!D32*AL32*PROFILE!$G$9,COUNTRY_INFO!D32*AM32*PROFILE!$G$9,IF(AND(DISTRICT!Z32<>\"Unknown\",Z32<>\"Not required\"),COUNTRY_INFO!O32*DISTRICT!AN32,0))","v":105556.79180551018},{"$f":"MAX(COUNTRY_INFO!D32*AK32*PROFILE!$G$10,COUNTRY_INFO!D32*AL32*PROFILE!$G$10,IF(AND(DISTRICT!Z32<>\"Unknown\",Z32<>\"Not required\"),COUNTRY_INFO!O32*DISTRICT!AO32,0))","v":0},149333.25140424259,0,{"$f":"MAX('MDA2'!J32,'MDA5'!J32,'T1'!L32,'T2'!J32,T3_R1!K32,T3_R2!K32)","v":41218},{"$f":"MAX('MDA1'!K32,'MDA2'!K32,'MDA3'!I32,'MDA3'!L32,'MDA5'!K32,'T1'!M32,'T2'!K32,T3_R1!L32,T3_R2!L32)","v":111393},{"$f":"MAX('MDA1'!L32,'MDA2'!L32,'MDA3'!J32,'MDA3'!M32,'MDA5'!L32,'T1'!N32,'T2'!L32,T3_R1!M32,T3_R2!M32)","v":190971},343582,{"$f":"MAX('MDA2'!J32,'MDA5'!J32,T32)","v":41218},{"$f":"MAX('MDA1'!K32,'MDA2'!K32,'MDA3'!I32,'MDA3'!L32,'MDA5'!K32,V32,AD32)","v":111393},{"$f":"MAX('MDA1'!L32,'MDA2'!L32,'MDA3'!J32,'MDA3'!M32,'MDA5'!L32,AF32)","v":0},149333.25140424259,100]
[{"$f":"IF(COUNTRY_INFO!A33=0,\" \",COUNTRY_INFO!A33)","v":"Rwanda"},{"$f":"IF(COUNTRY_INFO!B33=0,\" \",COUNTRY_INFO!B33)","v":"Western"},{"$f":"IF(COUNTRY_INFO!C33=0,\" \",COUNTRY_INFO!C33)","v":"Rubavu"},{"$f":"COUNTRY_INFO!L33","v":0},null,null,{"$f":"MAX('MDA1'!M33,'MDA2'!M33,'MDA5'!M33)","v":0},{"$f":"IF(AND(COUNTRY_INFO!H33>0,COUNTRY_INFO!H33<4),IF(D33>MAX('MDA1'!M33,'MDA2'!M33,'MDA5'!M33),MAX('MDA1'!M33,'MDA2'!M33,'MDA5'!M33),D33),0)","v":0},{"$f":"IF(AND(COUNTRY_INFO!H33>0,COUNTRY_INFO!H33<4), IF(G33/D33*100<>0, IF(G33/D33*100>100,100,G33/D33*100), \"-\"),0)","v":0},{"$f":"COUNTRY_INFO!M33","v":0},null,null,{"$f":"MAX('MDA1'!M33,MAX('MDA3'!I33,'MDA3'!L33)+MAX('MDA3'!J33,'MDA3'!M33))","v":0},{"$f":"IF(AND(COUNTRY_INFO!I33>0,COUNTRY_INFO!I33<4),IF(J33>MAX('MDA1'!M33,MAX('MDA3'!I33,'MDA3'!L33)+MAX('MDA3'!J33,'MDA3'!M33)),MAX('MDA1'!M33,MAX('MDA3'!I33,'MDA3'!L33)+MAX('MDA3'!J33,'MDA3'!M33)),J33),0)","v":0},{"$f":"IF(AND(COUNTRY_INFO!I33>0,COUNTRY_INFO!I33<4), IF(M33/J33*100<>0, IF(M33/J33*100>100,100,M33/J33*100), \"-\"),0)","v":0},{"$f":"COUNTRY_INFO!N33","v":202407.46123442403},null,null,{"$f":"SUM(MAX('MDA2'!J33,'MDA5'!J33, 'T1'!L33, MAX(T3_R1!K33, T3_R2!K33)), MAX('MDA1'!K33, 'MDA2'!K33, 'MDA5'!K33,'T1'!M33, MAX(T3_R1!L33, T3_R2!L33)), MAX('MDA1'!L33, 'MDA2'!L33, 'MDA5'!L33,'T1'!N33, MAX(T3_R1!M33, T3_R2!M33)))","v":430377},{"$f":"IF(AND(COUNTRY_INFO!J33>1,COUNTRY_INFO!J33<4),IF(COUNTRY_INFO!E33>MAX('MDA2'!J33,'MDA5'!J33,'T1'!L33,MAX(T3_R1!K33,T3_R2!K33)),MAX('MDA2'!J33,'MDA5'!J33,'T1'!L33,MAX(T3_R1!K33,T3_R2!K33)),COUNTRY_INFO!E33),0)","v":65095.866929664},{"$f":"IF(AND(COUNTRY_INFO!J33>1,COUNTRY_INFO!J33<4), IF(T33/COUNTRY_INFO!E33*100<>0, IF(T33/COUNTRY_INFO!E33*100>100,100,T33/COUNTRY_INFO!E33*100), \"-\"),0)","v":100},{"$f":"IF(AND(COUNTRY_INFO!J33>1,COUNTRY_INFO!J33<4),IF(COUNTRY_INFO!F33>MAX('MDA1'!K33,'MDA2'!K33,'MDA5'!K33,'T1'!M33,MAX(T3_R1!L33,T3_R2!L33)),MAX('MDA1'!K33,'MDA2'!K33,'MDA5'!K33,'T1'!M33,MAX(T3_R1!L33,T3_R2!L33)),COUNTRY_INFO!F33),0)","v":137311.59430476002},{"$f":"IF(AND(COUNTRY_INFO!J33>1,COUNTRY_INFO!J33<4), IF(V33/COUNTRY_INFO!F33*100<>0, IF(V33/COUNTRY_INFO!F33*100>100,100,V33/COUNTRY_INFO!F33*100), \"-\"),0)","v":100},202407.46123442403,{"$f":"IF(AND(COUNTRY_INFO!J33>1,COUNTRY_INFO!J33<4), IF(S33/P33*100<>0, IF(X33/P33*100>100,100,X33/P33*100), \"-\"),0)","v":100},{"$f":"COUNTRY_INFO!O33","v":45365},null,null,{"$f":"MAX('T1'!L33,'T2'!J33)+MAX('T1'!M33,'T2'!K33)+MAX('T1'!N33,'T2'!L33)","v":99002},{"$f":"IF(COUNTRY_INFO!K33=1,IF(COUNTRY_INFO!F33*0.33>MAX('T1'!M33,'T2'!K33),MAX('T1'!M33,'T2'!K33),COUNTRY_INFO!F33*0.33),IF(COUNTRY_INFO!K33=2,IF(COUNTRY_INFO!F33*0.5>MAX('T1'!M33,'T2'!K33),MAX('T1'!M33,'T2'!K33),COUNTRY_INFO!F33*0.5),IF(COUNTRY_INFO!K33=3,IF(COUNTRY_INFO!F33>MAX('T1'!M33,'T2'!K33),MAX('T1'!M33,'T2'!K33),COUNTRY_INFO!F33),0)))","v":34895},{"$f":"IF(AND(COUNTRY_INFO!K33>0,COUNTRY_INFO!K33<4),IF(Z33>0,IF(COUNTRY_INFO!K33=1, AD33/(COUNTRY_INFO!F33*0.33)*100, IF(COUNTRY_INFO!K33=2, AD33/(COUNTRY_INFO!F33*0.5)*100, IF(COUNTRY_INFO!K33=3, AD33/COUNTRY_INFO!F33*100))),\"-\"),0)","v":50.826006611723294},{"$f":"IF(COUNTRY_INFO!K33=2,IF(COUNTRY_INFO!G33*0.2>MAX('T1'!N33,'T2'!L33),MAX('T1'!N33,'T2'!L33),COUNTRY_INFO!G33*0.2),IF(COUNTRY_INFO!K33=3,IF(COUNTRY_INFO!G33>MAX('T1'!N33,'T2'!L33),MAX('T1'!N33,'T2'!L33),COUNTRY_INFO!G33),0))","v":57874.294192154397},{"$f":"IF(AND(COUNTRY_INFO!K33>0,COUNTRY_INFO!K33<4),IF(Z33>0,IF(COUNTRY_INFO!K33=1, 0, IF(COUNTRY_INFO!K33=2, AF33/(COUNTRY_INFO!G33*0.2)*100, IF(COUNTRY_INFO!K33=3, AF33/COUNTRY_INFO!G33*100))),\"-\"),0)","v":100},92769.294192154397,{"$f":"IF(AND(COUNTRY_INFO!K33>0,COUNTRY_INFO!K33<4), IF(AC33/Z33*100<>0, IF(AH33/Z33*100>100,100,AH33/Z33*100), \"-\"),0)","v":100},null,{"$f":"IF(AND(D33<>0, D33<>\"Unknown\",D33<>\"Stopped\",D33<>\"Not required\"),D33/COUNTRY_INFO!D33, 0)","v":0},{"$f":"IF(AND(J33<>0,J33<>\"Unknown\",J33<>\"Stopped\",J33<>\"Not required\"),J33/COUNTRY_INFO!D33, 0)","v":0},{"$f":"IF(AND(P33<>0,P33<>\"Unknown\",P33<>\"Not required\"),P33/(COUNTRY_INFO!E33+COUNTRY_INFO!F33), 0)","v":1},{"$f":"IF(AND(Z33<>0,Z33<>\"Unknown\",Z33<>\"Not required\"),IF(COUNTRY_INFO!K33=1,1,IF(COUNTRY_INFO!K33=2,0.5*COUNTRY_INFO!F33/(0.5*COUNTRY_INFO!F33+0.2*COUNTRY_INFO!G33),IF(COUNTRY_INFO!K33=3,COUNTRY_INFO!F33/(COUNTRY_INFO!F33+COUNTRY_INFO!G33)))),0)","v":0.54260450160771712},{"$f":"IF(AND(Z33<>0,Z33<>\"Unknown\",Z33<>\"Not required\"),IF(COUNTRY_INFO!K33=1,0,IF(COUNTRY_INFO!K33=2,0.2*COUNTRY_INFO!G33/(0.5*COUNTRY_INFO!F33+0.2*COUNTRY_INFO!G33),IF(COUNTRY_INFO!K33=3,COUNTRY_INFO!G33/(COUNTRY_INFO!F33+COUNTRY_INFO!G33)))),0)","v":0.45739549839228294},{"$f":"MAX(COUNTRY_INFO!D33*AK33*PROFILE!$G$7,COUNTRY_INFO!D33*AL33*PROFILE!$G$7)","v":0},{"$f":"MAX(COUNTRY_INFO!D33*AK33*PROFILE!$G$8,COUNTRY_INFO!D33*AL33*PROFILE!$G$8,COUNTRY_INFO!D33*AM33*PROFILE!$G$8)","v":60036.780981818934},{"$f":"MAX(COUNTRY_INFO!D33*AK33*PROFILE!$G$9,COUNTRY_INFO!D33*AL33*PROFILE!$G$9,COUNTRY_INFO!D33*AM33*PROFILE!$G$9,IF(AND(DISTRICT!Z33<>\"Unknown\",Z33<>\"Not required\"),COUNTRY_INFO!O33*DISTRICT!AN33,0))","v":144764.79022881918},{"$f":"MAX(COUNTRY_INFO!D33*AK33*PROFILE!$G$10,COUNTRY_INFO!D33*AL33*PROFILE!$G$10,IF(AND(DISTRICT!Z33<>\"Unknown\",Z33<>\"Not required\"),COUNTRY_INFO!O33*DISTRICT!AO33,0))","v":20749.746784565916},225551.31799520404,"Y",{"$f":"MAX('MDA2'!J33,'MDA5'!J33,'T1'!L33,'T2'!J33,T3_R1!K33,T3_R2!K33)","v":72548},{"$f":"MAX('MDA1'!K33,'MDA2'!K33,'MDA3'!I33,'MDA3'!L33,'MDA5'!K33,'T1'!M33,'T2'!K33,T3_R1!L33,T3_R2!L33)","v":146058},{"$f":"MAX('MDA1'!L33,'MDA2'!L33,'MDA3'!J33,'MDA3'!M33,'MDA5'!L33,'T1'!N33,'T2'!L33,T3_R1!M33,T3_R2!M33)","v":211771},430377,{"$f":"MAX('MDA2'!J33,'MDA5'!J33,T33)","v":65095.866929664},{"$f":"MAX('MDA1'!K33,'MDA2'!K33,'MDA3'!I33,'MDA3'!L33,'MDA5'!K33,V33,AD33)","v":137311.59430476002},{"$f":"MAX('MDA1'!L33,'MDA2'!L33,'MDA3'!J33,'MDA3'!M33,'MDA5'!L33,AF33)","v":57874.294192154397},225551.31799520404,100]
[{"$f":"IF(COUNTRY_INFO!A34=0,\" \",COUNTRY_INFO!A34)","v":"Rwanda"},{"$f":"IF(COUNTRY_INFO!B34=0,\" \",COUNTRY_INFO!B34)","v":"Southern"},{"$f":"IF(COUNTRY_INFO!C34=0,\" \",COUNTRY_INFO!C34)","v":"Ruhango"},{"$f":"COUNTRY_INFO!L34","v":0},null,null,{"$f":"MAX('MDA1'!M34,'MDA2'!M34,'MDA5'!M34)","v":0},{"$f":"IF(AND(COUNTRY_INFO!H34>0,COUNTRY_INFO!H34<4),IF(D34>MAX('MDA1'!M34,'MDA2'!M34,'MDA5'!M34),MAX('MDA1'!M34,'MDA2'!M34,'MDA5'!M34),D34),0)","v":0},{"$f":"IF(AND(COUNTRY_INFO!H34>0,COUNTRY_INFO!H34<4), IF(G34/D34*100<>0, IF(G34/D34*100>100,100,G34/D34*100), \"-\"),0)","v":0},{"$f":"COUNTRY_INFO!M34","v":0},null,null,{"$f":"MAX('MDA1'!M34,MAX('MDA3'!I34,'MDA3'!L34)+MAX('MDA3'!J34,'MDA3'!M34))","v":0},{"$f":"IF(AND(COUNTRY_INFO!I34>0,COUNTRY_INFO!I34<4),IF(J34>MAX('MDA1'!M34,MAX('MDA3'!I34,'MDA3'!L34)+MAX('MDA3'!J34,'MDA3'!M34)),MAX('MDA1'!M34,MAX('MDA3'!I34,'MDA3'!L34)+MAX('MDA3'!J34,'MDA3'!M34)),J34),0)","v":0},{"$f":"IF(AND(COUNTRY_INFO!I34>0,COUNTRY_INFO!I34<4), IF(M34/J34*100<>0, IF(M34/J34*100>100,100,M34/J34*100), \"-\"),0)","v":0},{"$f":"COUNTRY_INFO!N34","v":145596.469174884},null,null,{"$f":"SUM(MAX('MDA2'!J34,'MDA5'!J34, 'T1'!L34, MAX(T3_R1!K34, T3_R2!K34)), MAX('MDA1'!K34, 'MDA2'!K34, 'MDA5'!K34,'T1'!M34, MAX(T3_R1!L34, T3_R2!L34)), MAX('MDA1'!L34, 'MDA2'!L34, 'MDA5'!L34,'T1'!N34, MAX(T3_R1!M34, T3_R2!M34)))","v":346432},{"$f":"IF(AND(COUNTRY_INFO!J34>1,COUNTRY_INFO!J34<4),IF(COUNTRY_INFO!E34>MAX('MDA2'!J34,'MDA5'!J34,'T1'!L34,MAX(T3_R1!K34,T3_R2!K34)),MAX('MDA2'!J34,'MDA5'!J34,'T1'!L34,MAX(T3_R1!K34,T3_R2!K34)),COUNTRY_INFO!E34),0)","v":40303},{"$f":"IF(AND(COUNTRY_INFO!J34>1,COUNTRY_INFO!J34<4), IF(T34/COUNTRY_INFO!E34*100<>0, IF(T34/COUNTRY_INFO!E34*100>100,100,T34/COUNTRY_INFO!E34*100), \"-\"),0)","v":96.16866523479986},{"$f":"IF(AND(COUNTRY_INFO!J34>1,COUNTRY_INFO!J34<4),IF(COUNTRY_INFO!F34>MAX('MDA1'!K34,'MDA2'!K34,'MDA5'!K34,'T1'!M34,MAX(T3_R1!L34,T3_R2!L34)),MAX('MDA1'!K34,'MDA2'!K34,'MDA5'!K34,'T1'!M34,MAX(T3_R1!L34,T3_R2!L34)),COUNTRY_INFO!F34),0)","v":101793},{"$f":"IF(AND(COUNTRY_INFO!J34>1,COUNTRY_INFO!J34<4), IF(V34/COUNTRY_INFO!F34*100<>0, IF(V34/COUNTRY_INFO!F34*100>100,100,V34/COUNTRY_INFO!F34*100), \"-\"),0)","v":98.172583539318055},142096,{"$f":"IF(AND(COUNTRY_INFO!J34>1,COUNTRY_INFO!J34<4), IF(S34/P34*100<>0, IF(X34/P34*100>100,100,X34/P34*100), \"-\"),0)","v":97.595773307744579},{"$f":"COUNTRY_INFO!O34","v":16902},null,null,{"$f":"MAX('T1'!L34,'T2'!J34)+MAX('T1'!M34,'T2'!K34)+MAX('T1'!N34,'T2'!L34)","v":40610},{"$f":"IF(COUNTRY_INFO!K34=1,IF(COUNTRY_INFO!F34*0.33>MAX('T1'!M34,'T2'!K34),MAX('T1'!M34,'T2'!K34),COUNTRY_INFO!F34*0.33),IF(COUNTRY_INFO!K34=2,IF(COUNTRY_INFO!F34*0.5>MAX('T1'!M34,'T2'!K34),MAX('T1'!M34,'T2'!K34),COUNTRY_INFO!F34*0.5),IF(COUNTRY_INFO!K34=3,IF(COUNTRY_INFO!F34>MAX('T1'!M34,'T2'!K34),MAX('T1'!M34,'T2'!K34),COUNTRY_INFO!F34),0)))","v":16456},{"$f":"IF(AND(COUNTRY_INFO!K34>0,COUNTRY_INFO!K34<4),IF(Z34>0,IF(COUNTRY_INFO!K34=1, AD34/(COUNTRY_INFO!F34*0.33)*100, IF(COUNTRY_INFO!K34=2, AD34/(COUNTRY_INFO!F34*0.5)*100, IF(COUNTRY_INFO!K34=3, AD34/COUNTRY_INFO!F34*100))),\"-\"),0)","v":31.741436733822916},{"$f":"IF(COUNTRY_INFO!K34=2,IF(COUNTRY_INFO!G34*0.2>MAX('T1'!N34,'T2'!L34),MAX('T1'!N34,'T2'!L34),COUNTRY_INFO!G34*0.2),IF(COUNTRY_INFO!K34=3,IF(COUNTRY_INFO!G34>MAX('T1'!N34,'T2'!L34),MAX('T1'!N34,'T2'!L34),COUNTRY_INFO!G34),0))","v":24154},{"$f":"IF(AND(COUNTRY_INFO!K34>0,COUNTRY_INFO!K34<4),IF(Z34>0,IF(COUNTRY_INFO!K34=1, 0, IF(COUNTRY_INFO!K34=2, AF34/(COUNTRY_INFO!G34*0.2)*100, IF(COUNTRY_INFO!K34=3, AF34/COUNTRY_INFO!G34*100))),\"-\"),0)","v":61.562101941841476},40610,{"$f":"IF(AND(COUNTRY_INFO!K34>0,COUNTRY_INFO!K34<4), IF(AC34/Z34*100<>0, IF(AH34/Z34*100>100,100,AH34/Z34*100), \"-\"),0)","v":100},null,{"$f":"IF(AND(D34<>0, D34<>\"Unknown\",D34<>\"Stopped\",D34<>\"Not required\"),D34/COUNTRY_INFO!D34, 0)","v":0},{"$f":"IF(AND(J34<>0,J34<>\"Unknown\",J34<>\"Stopped\",J34<>\"Not required\"),J34/COUNTRY_INFO!D34, 0)","v":0},{"$f":"IF(AND(P34<>0,P34<>\"Unknown\",P34<>\"Not required\"),P34/(COUNTRY_INFO!E34+COUNTRY_INFO!F34), 0)","v":1},{"$f":"IF(AND(Z34<>0,Z34<>\"Unknown\",Z34<>\"Not required\"),IF(COUNTRY_INFO!K34=1,1,IF(COUNTRY_INFO!K34=2,0.5*COUNTRY_INFO!F34/(0.5*COUNTRY_INFO!F34+0.2*COUNTRY_INFO!G34),IF(COUNTRY_INFO!K34=3,COUNTRY_INFO!F34/(COUNTRY_INFO!F34+COUNTRY_INFO!G34)))),0)","v":0.56921856406188021},{"$f":"IF(AND(Z34<>0,Z34<>\"Unknown\",Z34<>\"Not required\"),IF(COUNTRY_INFO!K34=1,0,IF(COUNTRY_INFO!K34=2,0.2*COUNTRY_INFO!G34/(0.5*COUNTRY_INFO!F34+0.2*COUNTRY_INFO!G34),IF(COUNTRY_INFO!K34=3,COUNTRY_INFO!G34/(COUNTRY_INFO!F34+COUNTRY_INFO!G34)))),0)","v":0.43078143593811991},{"$f":"MAX(COUNTRY_INFO!D34*AK34*PROFILE!$G$7,COUNTRY_INFO!D34*AL34*PROFILE!$G$7)","v":0},{"$f":"MAX(COUNTRY_INFO!D34*AK34*PROFILE!$G$8,COUNTRY_INFO!D34*AL34*PROFILE!$G$8,COUNTRY_INFO!D34*AM34*PROFILE!$G$8)","v":42650.070156057074},{"$f":"MAX(COUNTRY_INFO!D34*AK34*PROFILE!$G$9,COUNTRY_INFO!D34*AL34*PROFILE!$G$9,COUNTRY_INFO!D34*AM34*PROFILE!$G$9,IF(AND(DISTRICT!Z34<>\"Unknown\",Z34<>\"Not required\"),COUNTRY_INFO!O34*DISTRICT!AN34,0))","v":102840.76458489303},{"$f":"MAX(COUNTRY_INFO!D34*AK34*PROFILE!$G$10,COUNTRY_INFO!D34*AL34*PROFILE!$G$10,IF(AND(DISTRICT!Z34<>\"Unknown\",Z34<>\"Not required\"),COUNTRY_INFO!O34*DISTRICT!AO34,0))","v":7281.0678302261031},152771.90257117618,"Y",{"$f":"MAX('MDA2'!J34,'MDA5'!J34,'T1'!L34,'T2'!J34,T3_R1!K34,T3_R2!K34)","v":40303},{"$f":"MAX('MDA1'!K34,'MDA2'!K34,'MDA3'!I34,'MDA3'!L34,'MDA5'!K34,'T1'!M34,'T2'!K34,T3_R1!L34,T3_R2!L34)","v":101793},{"$f":"MAX('MDA1'!L34,'MDA2'!L34,'MDA3'!J34,'MDA3'!M34,'MDA5'!L34,'T1'!N34,'T2'!L34,T3_R1!M34,T3_R2!M34)","v":204336},346432,{"$f":"MAX('MDA2'!J34,'MDA5'!J34,T34)","v":40303},{"$f":"MAX('MDA1'!K34,'MDA2'!K34,'MDA3'!I34,'MDA3'!L34,'MDA5'!K34,V34,AD34)","v":101793},{"$f":"MAX('MDA1'!L34,'MDA2'!L34,'MDA3'!J34,'MDA3'!M34,'MDA5'!L34,AF34)","v":24154},152771.90257117618,100]
[{"$f":"IF(COUNTRY_INFO!A35=0,\" \",COUNTRY_INFO!A35)","v":"Rwanda"},{"$f":"IF(COUNTRY_INFO!B35=0,\" \",COUNTRY_INFO!B35)","v":"Northern"},{"$f":"IF(COUNTRY_INFO!C35=0,\" \",COUNTRY_INFO!C35)","v":"Rulindo"},{"$f":"COUNTRY_INFO!L35","v":0},null,null,{"$f":"MAX('MDA1'!M35,'MDA2'!M35,'MDA5'!M35)","v":0},{"$f":"IF(AND(COUNTRY_INFO!H35>0,COUNTRY_INFO!H35<4),IF(D35>MAX('MDA1'!M35,'MDA2'!M35,'MDA5'!M35),MAX('MDA1'!M35,'MDA2'!M35,'MDA5'!M35),D35),0)","v":0},{"$f":"IF(AND(COUNTRY_INFO!H35>0,COUNTRY_INFO!H35<4), IF(G35/D35*100<>0, IF(G35/D35*100>100,100,G35/D35*100), \"-\"),0)","v":0},{"$f":"COUNTRY_INFO!M35","v":0},null,null,{"$f":"MAX('MDA1'!M35,MAX('MDA3'!I35,'MDA3'!L35)+MAX('MDA3'!J35,'MDA3'!M35))","v":0},{"$f":"IF(AND(COUNTRY_INFO!I35>0,COUNTRY_INFO!I35<4),IF(J35>MAX('MDA1'!M35,MAX('MDA3'!I35,'MDA3'!L35)+MAX('MDA3'!J35,'MDA3'!M35)),MAX('MDA1'!M35,MAX('MDA3'!I35,'MDA3'!L35)+MAX('MDA3'!J35,'MDA3'!M35)),J35),0)","v":0},{"$f":"IF(AND(COUNTRY_INFO!I35>0,COUNTRY_INFO!I35<4), IF(M35/J35*100<>0, IF(M35/J35*100>100,100,M35/J35*100), \"-\"),0)","v":0},{"$f":"COUNTRY_INFO!N35","v":140265.13683373202},null,null,{"$f":"SUM(MAX('MDA2'!J35,'MDA5'!J35, 'T1'!L35, MAX(T3_R1!K35, T3_R2!K35)), MAX('MDA1'!K35, 'MDA2'!K35, 'MDA5'!K35,'T1'!M35, MAX(T3_R1!L35, T3_R2!L35)), MAX('MDA1'!L35, 'MDA2'!L35, 'MDA5'!L35,'T1'!N35, MAX(T3_R1!M35, T3_R2!M35)))","v":339935},{"$f":"IF(AND(COUNTRY_INFO!J35>1,COUNTRY_INFO!J35<4),IF(COUNTRY_INFO!E35>MAX('MDA2'!J35,'MDA5'!J35,'T1'!L35,MAX(T3_R1!K35,T3_R2!K35)),MAX('MDA2'!J35,'MDA5'!J35,'T1'!L35,MAX(T3_R1!K35,T3_R2!K35)),COUNTRY_INFO!E35),0)","v":37475.418238020007},{"$f":"IF(AND(COUNTRY_INFO!J35>1,COUNTRY_INFO!J35<4), IF(T35/COUNTRY_INFO!E35*100<>0, IF(T35/COUNTRY_INFO!E35*100>100,100,T35/COUNTRY_INFO!E35*100), \"-\"),0)","v":100},{"$f":"IF(AND(COUNTRY_INFO!J35>1,COUNTRY_INFO!J35<4),IF(COUNTRY_INFO!F35>MAX('MDA1'!K35,'MDA2'!K35,'MDA5'!K35,'T1'!M35,MAX(T3_R1!L35,T3_R2!L35)),MAX('MDA1'!K35,'MDA2'!K35,'MDA5'!K35,'T1'!M35,MAX(T3_R1!L35,T3_R2!L35)),COUNTRY_INFO!F35),0)","v":98704},{"$f":"IF(AND(COUNTRY_INFO!J35>1,COUNTRY_INFO!J35<4), IF(V35/COUNTRY_INFO!F35*100<>0, IF(V35/COUNTRY_INFO!F35*100>100,100,V35/COUNTRY_INFO!F35*100), \"-\"),0)","v":96.025168030878874},136179.41823802001,{"$f":"IF(AND(COUNTRY_INFO!J35>1,COUNTRY_INFO!J35<4), IF(S35/P35*100<>0, IF(X35/P35*100>100,100,X35/P35*100), \"-\"),0)","v":97.087146037895963},{"$f":"COUNTRY_INFO!O35","v":11953},null,null,{"$f":"MAX('T1'!L35,'T2'!J35)+MAX('T1'!M35,'T2'!K35)+MAX('T1'!N35,'T2'!L35)","v":22999},{"$f":"IF(COUNTRY_INFO!K35=1,IF(COUNTRY_INFO!F35*0.33>MAX('T1'!M35,'T2'!K35),MAX('T1'!M35,'T2'!K35),COUNTRY_INFO!F35*0.33),IF(COUNTRY_INFO!K35=2,IF(COUNTRY_INFO!F35*0.5>MAX('T1'!M35,'T2'!K35),MAX('T1'!M35,'T2'!K35),COUNTRY_INFO!F35*0.5),IF(COUNTRY_INFO!K35=3,IF(COUNTRY_INFO!F35>MAX('T1'!M35,'T2'!K35),MAX('T1'!M35,'T2'!K35),COUNTRY_INFO!F35),0)))","v":5037},{"$f":"IF(AND(COUNTRY_INFO!K35>0,COUNTRY_INFO!K35<4),IF(Z35>0,IF(COUNTRY_INFO!K35=1, AD35/(COUNTRY_INFO!F35*0.33)*100, IF(COUNTRY_INFO!K35=2, AD35/(COUNTRY_INFO!F35*0.5)*100, IF(COUNTRY_INFO!K35=3, AD35/COUNTRY_INFO!F35*100))),\"-\"),0)","v":9.8005910879303144},{"$f":"IF(COUNTRY_INFO!K35=2,IF(COUNTRY_INFO!G35*0.2>MAX('T1'!N35,'T2'!L35),MAX('T1'!N35,'T2'!L35),COUNTRY_INFO!G35*0.2),IF(COUNTRY_INFO!K35=3,IF(COUNTRY_INFO!G35>MAX('T1'!N35,'T2'!L35),MAX('T1'!N35,'T2'!L35),COUNTRY_INFO!G35),0))","v":17962},{"$f":"IF(AND(COUNTRY_INFO!K35>0,COUNTRY_INFO!K35<4),IF(Z35>0,IF(COUNTRY_INFO!K35=1, 0, IF(COUNTRY_INFO!K35=2, AF35/(COUNTRY_INFO!G35*0.2)*100, IF(COUNTRY_INFO!K35=3, AF35/COUNTRY_INFO!G35*100))),\"-\"),0)","v":43.459922078316851},22999,{"$f":"IF(AND(COUNTRY_INFO!K35>0,COUNTRY_INFO!K35<4), IF(AC35/Z35*100<>0, IF(AH35/Z35*100>100,100,AH35/Z35*100), \"-\"),0)","v":100},null,{"$f":"IF(AND(D35<>0, D35<>\"Unknown\",D35<>\"Stopped\",D35<>\"Not required\"),D35/COUNTRY_INFO!D35, 0)","v":0},{"$f":"IF(AND(J35<>0,J35<>\"Unknown\",J35<>\"Stopped\",J35<>\"Not required\"),J35/COUNTRY_INFO!D35, 0)","v":0},{"$f":"IF(AND(P35<>0,P35<>\"Unknown\",P35<>\"Not required\"),P35/(COUNTRY_INFO!E35+COUNTRY_INFO!F35), 0)","v":1},{"$f":"IF(AND(Z35<>0,Z35<>\"Unknown\",Z35<>\"Not required\"),IF(COUNTRY_INFO!K35=1,1,IF(COUNTRY_INFO!K35=2,0.5*COUNTRY_INFO!F35/(0.5*COUNTRY_INFO!F35+0.2*COUNTRY_INFO!G35),IF(COUNTRY_INFO!K35=3,COUNTRY_INFO!F35/(COUNTRY_INFO!F35+COUNTRY_INFO!G35)))),0)","v":0.55427251732101612},{"$f":"IF(AND(Z35<>0,Z35<>\"Unknown\",Z35<>\"Not required\"),IF(COUNTRY_INFO!K35=1,0,IF(COUNTRY_INFO!K35=2,0.2*COUNTRY_INFO!G35/(0.5*COUNTRY_INFO!F35+0.2*COUNTRY_INFO!G35),IF(COUNTRY_INFO!K35=3,COUNTRY_INFO!G35/(COUNTRY_INFO!F35+COUNTRY_INFO!G35)))),0)","v":0.44572748267898388},{"$f":"MAX(COUNTRY_INFO!D35*AK35*PROFILE!$G$7,COUNTRY_INFO!D35*AL35*PROFILE!$G$7)","v":0},{"$f":"MAX(COUNTRY_INFO!D35*AK35*PROFILE!$G$8,COUNTRY_INFO!D35*AL35*PROFILE!$G$8,COUNTRY_INFO!D35*AM35*PROFILE!$G$8)","v":42133.849751724192},{"$f":"MAX(COUNTRY_INFO!D35*AK35*PROFILE!$G$9,COUNTRY_INFO!D35*AL35*PROFILE!$G$9,COUNTRY_INFO!D35*AM35*PROFILE!$G$9,IF(AND(DISTRICT!Z35<>\"Unknown\",Z35<>\"Not required\"),COUNTRY_INFO!O35*DISTRICT!AN35,0))","v":101596.0186587629},{"$f":"MAX(COUNTRY_INFO!D35*AK35*PROFILE!$G$10,COUNTRY_INFO!D35*AL35*PROFILE!$G$10,IF(AND(DISTRICT!Z35<>\"Unknown\",Z35<>\"Not required\"),COUNTRY_INFO!O35*DISTRICT!AO35,0))","v":5327.7806004618942},149057.64901094898,"Y",{"$f":"MAX('MDA2'!J35,'MDA5'!J35,'T1'!L35,'T2'!J35,T3_R1!K35,T3_R2!K35)","v":45299},{"$f":"MAX('MDA1'!K35,'MDA2'!K35,'MDA3'!I35,'MDA3'!L35,'MDA5'!K35,'T1'!M35,'T2'!K35,T3_R1!L35,T3_R2!L35)","v":98704},{"$f":"MAX('MDA1'!L35,'MDA2'!L35,'MDA3'!J35,'MDA3'!M35,'MDA5'!L35,'T1'!N35,'T2'!L35,T3_R1!M35,T3_R2!M35)","v":195932},339935,{"$f":"MAX('MDA2'!J35,'MDA5'!J35,T35)","v":37475.418238020007},{"$f":"MAX('MDA1'!K35,'MDA2'!K35,'MDA3'!I35,'MDA3'!L35,'MDA5'!K35,V35,AD35)","v":98704},{"$f":"MAX('MDA1'!L35,'MDA2'!L35,'MDA3'!J35,'MDA3'!M35,'MDA5'!L35,AF35)","v":17962},149057.64901094898,100]
[{"$f":"IF(COUNTRY_INFO!A36=0,\" \",COUNTRY_INFO!A36)","v":"Rwanda"},{"$f":"IF(COUNTRY_INFO!B36=0,\" \",COUNTRY_INFO!B36)","v":"Western"},{"$f":"IF(COUNTRY_INFO!C36=0,\" \",COUNTRY_INFO!C36)","v":"Rusizi"},{"$f":"COUNTRY_INFO!L36","v":0},null,null,{"$f":"MAX('MDA1'!M36,'MDA2'!M36,'MDA5'!M36)","v":0},{"$f":"IF(AND(COUNTRY_INFO!H36>0,COUNTRY_INFO!H36<4),IF(D36>MAX('MDA1'!M36,'MDA2'!M36,'MDA5'!M36),MAX('MDA1'!M36,'MDA2'!M36,'MDA5'!M36),D36),0)","v":0},{"$f":"IF(AND(COUNTRY_INFO!H36>0,COUNTRY_INFO!H36<4), IF(G36/D36*100<>0, IF(G36/D36*100>100,100,G36/D36*100), \"-\"),0)","v":0},{"$f":"COUNTRY_INFO!M36","v":0},null,null,{"$f":"MAX('MDA1'!M36,MAX('MDA3'!I36,'MDA3'!L36)+MAX('MDA3'!J36,'MDA3'!M36))","v":0},{"$f":"IF(AND(COUNTRY_INFO!I36>0,COUNTRY_INFO!I36<4),IF(J36>MAX('MDA1'!M36,MAX('MDA3'!I36,'MDA3'!L36)+MAX('MDA3'!J36,'MDA3'!M36)),MAX('MDA1'!M36,MAX('MDA3'!I36,'MDA3'!L36)+MAX('MDA3'!J36,'MDA3'!M36)),J36),0)","v":0},{"$f":"IF(AND(COUNTRY_INFO!I36>0,COUNTRY_INFO!I36<4), IF(M36/J36*100<>0, IF(M36/J36*100>100,100,M36/J36*100), \"-\"),0)","v":0},{"$f":"COUNTRY_INFO!N36","v":207326.54354777999},null,null,{"$f":"SUM(MAX('MDA2'!J36,'MDA5'!J36, 'T1'!L36, MAX(T3_R1!K36, T3_R2!K36)), MAX('MDA1'!K36, 'MDA2'!K36, 'MDA5'!K36,'T1'!M36, MAX(T3_R1!L36, T3_R2!L36)), MAX('MDA1'!L36, 'MDA2'!L36, 'MDA5'!L36,'T1'!N36, MAX(T3_R1!M36, T3_R2!M36)))","v":378347},{"$f":"IF(AND(COUNTRY_INFO!J36>1,COUNTRY_INFO!J36<4),IF(COUNTRY_INFO!E36>MAX('MDA2'!J36,'MDA5'!J36,'T1'!L36,MAX(T3_R1!K36,T3_R2!K36)),MAX('MDA2'!J36,'MDA5'!J36,'T1'!L36,MAX(T3_R1!K36,T3_R2!K36)),COUNTRY_INFO!E36),0)","v":62350.036323660002},{"$f":"IF(AND(COUNTRY_INFO!J36>1,COUNTRY_INFO!J36<4), IF(T36/COUNTRY_INFO!E36*100<>0, IF(T36/COUNTRY_INFO!E36*100>100,100,T36/COUNTRY_INFO!E36*100), \"-\"),0)","v":100},{"$f":"IF(AND(COUNTRY_INFO!J36>1,COUNTRY_INFO!J36<4),IF(COUNTRY_INFO!F36>MAX('MDA1'!K36,'MDA2'!K36,'MDA5'!K36,'T1'!M36,MAX(T3_R1!L36,T3_R2!L36)),MAX('MDA1'!K36,'MDA2'!K36,'MDA5'!K36,'T1'!M36,MAX(T3_R1!L36,T3_R2!L36)),COUNTRY_INFO!F36),0)","v":113951},{"$f":"IF(AND(COUNTRY_INFO!J36>1,COUNTRY_INFO!J36<4), IF(V36/COUNTRY_INFO!F36*100<>0, IF(V36/COUNTRY_INFO!F36*100>100,100,V36/COUNTRY_INFO!F36*100), \"-\"),0)","v":78.599631196689344},176301.03632366,{"$f":"IF(AND(COUNTRY_INFO!J36>1,COUNTRY_INFO!J36<4), IF(S36/P36*100<>0, IF(X36/P36*100>100,100,X36/P36*100), \"-\"),0)","v":85.035438929714317},{"$f":"COUNTRY_INFO!O36","v":132522},null,null,{"$f":"MAX('T1'!L36,'T2'!J36)+MAX('T1'!M36,'T2'!K36)+MAX('T1'!N36,'T2'!L36)","v":349482},{"$f":"IF(COUNTRY_INFO!K36=1,IF(COUNTRY_INFO!F36*0.33>MAX('T1'!M36,'T2'!K36),MAX('T1'!M36,'T2'!K36),COUNTRY_INFO!F36*0.33),IF(COUNTRY_INFO!K36=2,IF(COUNTRY_INFO!F36*0.5>MAX('T1'!M36,'T2'!K36),MAX('T1'!M36,'T2'!K36),COUNTRY_INFO!F36*0.5),IF(COUNTRY_INFO!K36=3,IF(COUNTRY_INFO!F36>MAX('T1'!M36,'T2'!K36),MAX('T1'!M36,'T2'!K36),COUNTRY_INFO!F36),0)))","v":72488.253612059998},{"$f":"IF(AND(COUNTRY_INFO!K36>0,COUNTRY_INFO!K36<4),IF(Z36>0,IF(COUNTRY_INFO!K36=1, AD36/(COUNTRY_INFO!F36*0.33)*100, IF(COUNTRY_INFO!K36=2, AD36/(COUNTRY_INFO!F36*0.5)*100, IF(COUNTRY_INFO!K36=3, AD36/COUNTRY_INFO!F36*100))),\"-\"),0)","v":100},{"$f":"IF(COUNTRY_INFO!K36=2,IF(COUNTRY_INFO!G36*0.2>MAX('T1'!N36,'T2'!L36),MAX('T1'!N36,'T2'!L36),COUNTRY_INFO!G36*0.2),IF(COUNTRY_INFO!K36=3,IF(COUNTRY_INFO!G36>MAX('T1'!N36,'T2'!L36),MAX('T1'!N36,'T2'!L36),COUNTRY_INFO!G36),0))","v":56774.016815040006},{"$f":"IF(AND(COUNTRY_INFO!K36>0,COUNTRY_INFO!K36<4),IF(Z36>0,IF(COUNTRY_INFO!K36=1, 0, IF(COUNTRY_INFO!K36=2, AF36/(COUNTRY_INFO!G36*0.2)*100, IF(COUNTRY_INFO!K36=3, AF36/COUNTRY_INFO!G36*100))),\"-\"),0)","v":100},129262.27042710001,{"$f":"IF(AND(COUNTRY_INFO!K36>0,COUNTRY_INFO!K36<4), IF(AC36/Z36*100<>0, IF(AH36/Z36*100>100,100,AH36/Z36*100), \"-\"),0)","v":97.540235151220173},null,{"$f":"IF(AND(D36<>0, D36<>\"Unknown\",D36<>\"Stopped\",D36<>\"Not required\"),D36/COUNTRY_INFO!D36, 0)","v":0},{"$f":"IF(AND(J36<>0,J36<>\"Unknown\",J36<>\"Stopped\",J36<>\"Not required\"),J36/COUNTRY_INFO!D36, 0)","v":0},{"$f":"IF(AND(P36<>0,P36<>\"Unknown\",P36<>\"Not required\"),P36/(COUNTRY_INFO!E36+COUNTRY_INFO!F36), 0)","v":1},{"$f":"IF(AND(Z36<>0,Z36<>\"Unknown\",Z36<>\"Not required\"),IF(COUNTRY_INFO!K36=1,1,IF(COUNTRY_INFO!K36=2,0.5*COUNTRY_INFO!F36/(0.5*COUNTRY_INFO!F36+0.2*COUNTRY_INFO!G36),IF(COUNTRY_INFO!K36=3,COUNTRY_INFO!F36/(COUNTRY_INFO!F36+COUNTRY_INFO!G36)))),0)","v":0.56078431372549009},{"$f":"IF(AND(Z36<>0,Z36<>\"Unknown\",Z36<>\"Not required\"),IF(COUNTRY_INFO!K36=1,0,IF(COUNTRY_INFO!K36=2,0.2*COUNTRY_INFO!G36/(0.5*COUNTRY_INFO!F36+0.2*COUNTRY_INFO!G36),IF(COUNTRY_INFO!K36=3,COUNTRY_INFO!G36/(COUNTRY_INFO!F36+COUNTRY_INFO!G36)))),0)","v":0.4392156862745098},{"$f":"MAX(COUNTRY_INFO!D36*AK36*PROFILE!$G$7,COUNTRY_INFO!D36*AL36*PROFILE!$G$7)","v":0},{"$f":"MAX(COUNTRY_INFO!D36*AK36*PROFILE!$G$8,COUNTRY_INFO!D36*AL36*PROFILE!$G$8,COUNTRY_INFO!D36*AM36*PROFILE!$G$8)","v":59841.924555725054},{"$f":"MAX(COUNTRY_INFO!D36*AK36*PROFILE!$G$9,COUNTRY_INFO!D36*AL36*PROFILE!$G$9,COUNTRY_INFO!D36*AM36*PROFILE!$G$9,IF(AND(DISTRICT!Z36<>\"Unknown\",Z36<>\"Not required\"),COUNTRY_INFO!O36*DISTRICT!AN36,0))","v":144294.93909444939},{"$f":"MAX(COUNTRY_INFO!D36*AK36*PROFILE!$G$10,COUNTRY_INFO!D36*AL36*PROFILE!$G$10,IF(AND(DISTRICT!Z36<>\"Unknown\",Z36<>\"Not required\"),COUNTRY_INFO!O36*DISTRICT!AO36,0))","v":58205.74117647059},262342.60482664505,"Y",{"$f":"MAX('MDA2'!J36,'MDA5'!J36,'T1'!L36,'T2'!J36,T3_R1!K36,T3_R2!K36)","v":67019},{"$f":"MAX('MDA1'!K36,'MDA2'!K36,'MDA3'!I36,'MDA3'!L36,'MDA5'!K36,'T1'!M36,'T2'!K36,T3_R1!L36,T3_R2!L36)","v":113951},{"$f":"MAX('MDA1'!L36,'MDA2'!L36,'MDA3'!J36,'MDA3'!M36,'MDA5'!L36,'T1'!N36,'T2'!L36,T3_R1!M36,T3_R2!M36)","v":241630},422600,{"$f":"MAX('MDA2'!J36,'MDA5'!J36,T36)","v":62350.036323660002},{"$f":"MAX('MDA1'!K36,'MDA2'!K36,'MDA3'!I36,'MDA3'!L36,'MDA5'!K36,V36,AD36)","v":113951},{"$f":"MAX('MDA1'!L36,'MDA2'!L36,'MDA3'!J36,'MDA3'!M36,'MDA5'!L36,AF36)","v":56774.016815040006},233075.05313869999,88.843767215285169]
[{"$f":"IF(COUNTRY_INFO!A37=0,\" \",COUNTRY_INFO!A37)","v":"Rwanda"},{"$f":"IF(COUNTRY_INFO!B37=0,\" \",COUNTRY_INFO!B37)","v":"Western"},{"$f":"IF(COUNTRY_INFO!C37=0,\" \",COUNTRY_INFO!C37)","v":"Rutsiro"},{"$f":"COUNTRY_INFO!L37","v":0},null,null,{"$f":"MAX('MDA1'!M37,'MDA2'!M37,'MDA5'!M37)","v":0},{"$f":"IF(AND(COUNTRY_INFO!H37>0,COUNTRY_INFO!H37<4),IF(D37>MAX('MDA1'!M37,'MDA2'!M37,'MDA5'!M37),MAX('MDA1'!M37,'MDA2'!M37,'MDA5'!M37),D37),0)","v":0},{"$f":"IF(AND(COUNTRY_INFO!H37>0,COUNTRY_INFO!H37<4), IF(G37/D37*100<>0, IF(G37/D37*100>100,100,G37/D37*100), \"-\"),0)","v":0},{"$f":"COUNTRY_INFO!M37","v":0},null,null,{"$f":"MAX('MDA1'!M37,MAX('MDA3'!I37,'MDA3'!L37)+MAX('MDA3'!J37,'MDA3'!M37))","v":0},{"$f":"IF(AND(COUNTRY_INFO!I37>0,COUNTRY_INFO!I37<4),IF(J37>MAX('MDA1'!M37,MAX('MDA3'!I37,'MDA3'!L37)+MAX('MDA3'!J37,'MDA3'!M37)),MAX('MDA1'!M37,MAX('MDA3'!I37,'MDA3'!L37)+MAX('MDA3'!J37,'MDA3'!M37)),J37),0)","v":0},{"$f":"IF(AND(COUNTRY_INFO!I37>0,COUNTRY_INFO!I37<4), IF(M37/J37*100<>0, IF(M37/J37*100>100,100,M37/J37*100), \"-\"),0)","v":0},{"$f":"COUNTRY_INFO!N37","v":181287.27526334403},null,null,{"$f":"SUM(MAX('MDA2'!J37,'MDA5'!J37, 'T1'!L37, MAX(T3_R1!K37, T3_R2!K37)), MAX('MDA1'!K37, 'MDA2'!K37, 'MDA5'!K37,'T1'!M37, MAX(T3_R1!L37, T3_R2!L37)), MAX('MDA1'!L37, 'MDA2'!L37, 'MDA5'!L37,'T1'!N37, MAX(T3_R1!M37, T3_R2!M37)))","v":350101},{"$f":"IF(AND(COUNTRY_INFO!J37>1,COUNTRY_INFO!J37<4),IF(COUNTRY_INFO!E37>MAX('MDA2'!J37,'MDA5'!J37,'T1'!L37,MAX(T3_R1!K37,T3_R2!K37)),MAX('MDA2'!J37,'MDA5'!J37,'T1'!L37,MAX(T3_R1!K37,T3_R2!K37)),COUNTRY_INFO!E37),0)","v":40051},{"$f":"IF(AND(COUNTRY_INFO!J37>1,COUNTRY_INFO!J37<4), IF(T37/COUNTRY_INFO!E37*100<>0, IF(T37/COUNTRY_INFO!E37*100>100,100,T37/COUNTRY_INFO!E37*100), \"-\"),0)","v":81.51392815391084},{"$f":"IF(AND(COUNTRY_INFO!J37>1,COUNTRY_INFO!J37<4),IF(COUNTRY_INFO!F37>MAX('MDA1'!K37,'MDA2'!K37,'MDA5'!K37,'T1'!M37,MAX(T3_R1!L37,T3_R2!L37)),MAX('MDA1'!K37,'MDA2'!K37,'MDA5'!K37,'T1'!M37,MAX(T3_R1!L37,T3_R2!L37)),COUNTRY_INFO!F37),0)","v":117390},{"$f":"IF(AND(COUNTRY_INFO!J37>1,COUNTRY_INFO!J37<4), IF(V37/COUNTRY_INFO!F37*100<>0, IF(V37/COUNTRY_INFO!F37*100>100,100,V37/COUNTRY_INFO!F37*100), \"-\"),0)","v":88.828628355782342},157441,{"$f":"IF(AND(COUNTRY_INFO!J37>1,COUNTRY_INFO!J37<4), IF(S37/P37*100<>0, IF(X37/P37*100>100,100,X37/P37*100), \"-\"),0)","v":86.846139516022774},{"$f":"COUNTRY_INFO!O37","v":50377},null,null,{"$f":"MAX('T1'!L37,'T2'!J37)+MAX('T1'!M37,'T2'!K37)+MAX('T1'!N37,'T2'!L37)","v":108632},{"$f":"IF(COUNTRY_INFO!K37=1,IF(COUNTRY_INFO!F37*0.33>MAX('T1'!M37,'T2'!K37),MAX('T1'!M37,'T2'!K37),COUNTRY_INFO!F37*0.33),IF(COUNTRY_INFO!K37=2,IF(COUNTRY_INFO!F37*0.5>MAX('T1'!M37,'T2'!K37),MAX('T1'!M37,'T2'!K37),COUNTRY_INFO!F37*0.5),IF(COUNTRY_INFO!K37=3,IF(COUNTRY_INFO!F37>MAX('T1'!M37,'T2'!K37),MAX('T1'!M37,'T2'!K37),COUNTRY_INFO!F37),0)))","v":36579},{"$f":"IF(AND(COUNTRY_INFO!K37>0,COUNTRY_INFO!K37<4),IF(Z37>0,IF(COUNTRY_INFO!K37=1, AD37/(COUNTRY_INFO!F37*0.33)*100, IF(COUNTRY_INFO!K37=2, AD37/(COUNTRY_INFO!F37*0.5)*100, IF(COUNTRY_INFO!K37=3, AD37/COUNTRY_INFO!F37*100))),\"-\"),0)","v":55.358418887914851},{"$f":"IF(COUNTRY_INFO!K37=2,IF(COUNTRY_INFO!G37*0.2>MAX('T1'!N37,'T2'!L37),MAX('T1'!N37,'T2'!L37),COUNTRY_INFO!G37*0.2),IF(COUNTRY_INFO!K37=3,IF(COUNTRY_INFO!G37>MAX('T1'!N37,'T2'!L37),MAX('T1'!N37,'T2'!L37),COUNTRY_INFO!G37),0))","v":45745.38721598401},{"$f":"IF(AND(COUNTRY_INFO!K37>0,COUNTRY_INFO!K37<4),IF(Z37>0,IF(COUNTRY_INFO!K37=1, 0, IF(COUNTRY_INFO!K37=2, AF37/(COUNTRY_INFO!G37*0.2)*100, IF(COUNTRY_INFO!K37=3, AF37/COUNTRY_INFO!G37*100))),\"-\"),0)","v":100},82324.38721598401,{"$f":"IF(AND(COUNTRY_INFO!K37>0,COUNTRY_INFO!K37<4), IF(AC37/Z37*100<>0, IF(AH37/Z37*100>100,100,AH37/Z37*100), \"-\"),0)","v":100},null,{"$f":"IF(AND(D37<>0, D37<>\"Unknown\",D37<>\"Stopped\",D37<>\"Not required\"),D37/COUNTRY_INFO!D37, 0)","v":0},{"$f":"IF(AND(J37<>0,J37<>\"Unknown\",J37<>\"Stopped\",J37<>\"Not required\"),J37/COUNTRY_INFO!D37, 0)","v":0},{"$f":"IF(AND(P37<>0,P37<>\"Unknown\",P37<>\"Not required\"),P37/(COUNTRY_INFO!E37+COUNTRY_INFO!F37), 0)","v":1},{"$f":"IF(AND(Z37<>0,Z37<>\"Unknown\",Z37<>\"Not required\"),IF(COUNTRY_INFO!K37=1,1,IF(COUNTRY_INFO!K37=2,0.5*COUNTRY_INFO!F37/(0.5*COUNTRY_INFO!F37+0.2*COUNTRY_INFO!G37),IF(COUNTRY_INFO!K37=3,COUNTRY_INFO!F37/(COUNTRY_INFO!F37+COUNTRY_INFO!G37)))),0)","v":0.59090909090909094},{"$f":"IF(AND(Z37<>0,Z37<>\"Unknown\",Z37<>\"Not required\"),IF(COUNTRY_INFO!K37=1,0,IF(COUNTRY_INFO!K37=2,0.2*COUNTRY_INFO!G37/(0.5*COUNTRY_INFO!F37+0.2*COUNTRY_INFO!G37),IF(COUNTRY_INFO!K37=3,COUNTRY_INFO!G37/(COUNTRY_INFO!F37+COUNTRY_INFO!G37)))),0)","v":0.40909090909090912},{"$f":"MAX(COUNTRY_INFO!D37*AK37*PROFILE!$G$7,COUNTRY_INFO!D37*AL37*PROFILE!$G$7)","v":0},{"$f":"MAX(COUNTRY_INFO!D37*AK37*PROFILE!$G$8,COUNTRY_INFO!D37*AL37*PROFILE!$G$8,COUNTRY_INFO!D37*AM37*PROFILE!$G$8)","v":50003.16628614306},{"$f":"MAX(COUNTRY_INFO!D37*AK37*PROFILE!$G$9,COUNTRY_INFO!D37*AL37*PROFILE!$G$9,COUNTRY_INFO!D37*AM37*PROFILE!$G$9,IF(AND(DISTRICT!Z37<>\"Unknown\",Z37<>\"Not required\"),COUNTRY_INFO!O37*DISTRICT!AN37,0))","v":120571.05260827314},{"$f":"MAX(COUNTRY_INFO!D37*AK37*PROFILE!$G$10,COUNTRY_INFO!D37*AL37*PROFILE!$G$10,IF(AND(DISTRICT!Z37<>\"Unknown\",Z37<>\"Not required\"),COUNTRY_INFO!O37*DISTRICT!AO37,0))","v":20608.772727272728},191182.99162168894,"Y",{"$f":"MAX('MDA2'!J37,'MDA5'!J37,'T1'!L37,'T2'!J37,T3_R1!K37,T3_R2!K37)","v":40051},{"$f":"MAX('MDA1'!K37,'MDA2'!K37,'MDA3'!I37,'MDA3'!L37,'MDA5'!K37,'T1'!M37,'T2'!K37,T3_R1!L37,T3_R2!L37)","v":117390},{"$f":"MAX('MDA1'!L37,'MDA2'!L37,'MDA3'!J37,'MDA3'!M37,'MDA5'!L37,'T1'!N37,'T2'!L37,T3_R1!M37,T3_R2!M37)","v":192660},350101,{"$f":"MAX('MDA2'!J37,'MDA5'!J37,T37)","v":40051},{"$f":"MAX('MDA1'!K37,'MDA2'!K37,'MDA3'!I37,'MDA3'!L37,'MDA5'!K37,V37,AD37)","v":117390},{"$f":"MAX('MDA1'!L37,'MDA2'!L37,'MDA3'!J37,'MDA3'!M37,'MDA5'!L37,AF37)","v":45745.38721598401},191182.99162168894,100]
[{"$f":"IF(COUNTRY_INFO!A38=0,\" \",COUNTRY_INFO!A38)","v":"Rwanda"},{"$f":"IF(COUNTRY_INFO!B38=0,\" \",COUNTRY_INFO!B38)","v":"Eastern"},{"$f":"IF(COUNTRY_INFO!C38=0,\" \",COUNTRY_INFO!C38)","v":"Rwamagana"},{"$f":"COUNTRY_INFO!L38","v":0},null,null,{"$f":"MAX('MDA1'!M38,'MDA2'!M38,'MDA5'!M38)","v":0},{"$f":"IF(AND(COUNTRY_INFO!H38>0,COUNTRY_INFO!H38<4),IF(D38>MAX('MDA1'!M38,'MDA2'!M38,'MDA5'!M38),MAX('MDA1'!M38,'MDA2'!M38,'MDA5'!M38),D38),0)","v":0},{"$f":"IF(AND(COUNTRY_INFO!H38>0,COUNTRY_INFO!H38<4), IF(G38/D38*100<>0, IF(G38/D38*100>100,100,G38/D38*100), \"-\"),0)","v":0},{"$f":"COUNTRY_INFO!M38","v":0},null,null,{"$f":"MAX('MDA1'!M38,MAX('MDA3'!I38,'MDA3'!L38)+MAX('MDA3'!J38,'MDA3'!M38))","v":0},{"$f":"IF(AND(COUNTRY_INFO!I38>0,COUNTRY_INFO!I38<4),IF(J38>MAX('MDA1'!M38,MAX('MDA3'!I38,'MDA3'!L38)+MAX('MDA3'!J38,'MDA3'!M38)),MAX('MDA1'!M38,MAX('MDA3'!I38,'MDA3'!L38)+MAX('MDA3'!J38,'MDA3'!M38)),J38),0)","v":0},{"$f":"IF(AND(COUNTRY_INFO!I38>0,COUNTRY_INFO!I38<4), IF(M38/J38*100<>0, IF(M38/J38*100>100,100,M38/J38*100), \"-\"),0)","v":0},{"$f":"COUNTRY_INFO!N38","v":0},null,null,{"$f":"SUM(MAX('MDA2'!J38,'MDA5'!J38, 'T1'!L38, MAX(T3_R1!K38, T3_R2!K38)), MAX('MDA1'!K38, 'MDA2'!K38, 'MDA5'!K38,'T1'!M38, MAX(T3_R1!L38, T3_R2!L38)), MAX('MDA1'!L38, 'MDA2'!L38, 'MDA5'!L38,'T1'!N38, MAX(T3_R1!M38, T3_R2!M38)))","v":374425},{"$f":"IF(AND(COUNTRY_INFO!J38>1,COUNTRY_INFO!J38<4),IF(COUNTRY_INFO!E38>MAX('MDA2'!J38,'MDA5'!J38,'T1'!L38,MAX(T3_R1!K38,T3_R2!K38)),MAX('MDA2'!J38,'MDA5'!J38,'T1'!L38,MAX(T3_R1!K38,T3_R2!K38)),COUNTRY_INFO!E38),0)","v":0},{"$f":"IF(AND(COUNTRY_INFO!J38>1,COUNTRY_INFO!J38<4), IF(T38/COUNTRY_INFO!E38*100<>0, IF(T38/COUNTRY_INFO!E38*100>100,100,T38/COUNTRY_INFO!E38*100), \"-\"),0)","v":0},{"$f":"IF(AND(COUNTRY_INFO!J38>1,COUNTRY_INFO!J38<4),IF(COUNTRY_INFO!F38>MAX('MDA1'!K38,'MDA2'!K38,'MDA5'!K38,'T1'!M38,MAX(T3_R1!L38,T3_R2!L38)),MAX('MDA1'!K38,'MDA2'!K38,'MDA5'!K38,'T1'!M38,MAX(T3_R1!L38,T3_R2!L38)),COUNTRY_INFO!F38),0)","v":0},{"$f":"IF(AND(COUNTRY_INFO!J38>1,COUNTRY_INFO!J38<4), IF(V38/COUNTRY_INFO!F38*100<>0, IF(V38/COUNTRY_INFO!F38*100>100,100,V38/COUNTRY_INFO!F38*100), \"-\"),0)","v":0},0,{"$f":"IF(AND(COUNTRY_INFO!J38>1,COUNTRY_INFO!J38<4), IF(S38/P38*100<>0, IF(X38/P38*100>100,100,X38/P38*100), \"-\"),0)","v":0},{"$f":"COUNTRY_INFO!O38","v":63051},null,null,{"$f":"MAX('T1'!L38,'T2'!J38)+MAX('T1'!M38,'T2'!K38)+MAX('T1'!N38,'T2'!L38)","v":164571},{"$f":"IF(COUNTRY_INFO!K38=1,IF(COUNTRY_INFO!F38*0.33>MAX('T1'!M38,'T2'!K38),MAX('T1'!M38,'T2'!K38),COUNTRY_INFO!F38*0.33),IF(COUNTRY_INFO!K38=2,IF(COUNTRY_INFO!F38*0.5>MAX('T1'!M38,'T2'!K38),MAX('T1'!M38,'T2'!K38),COUNTRY_INFO!F38*0.5),IF(COUNTRY_INFO!K38=3,IF(COUNTRY_INFO!F38>MAX('T1'!M38,'T2'!K38),MAX('T1'!M38,'T2'!K38),COUNTRY_INFO!F38),0)))","v":53116.857752598007},{"$f":"IF(AND(COUNTRY_INFO!K38>0,COUNTRY_INFO!K38<4),IF(Z38>0,IF(COUNTRY_INFO!K38=1, AD38/(COUNTRY_INFO!F38*0.33)*100, IF(COUNTRY_INFO!K38=2, AD38/(COUNTRY_INFO!F38*0.5)*100, IF(COUNTRY_INFO!K38=3, AD38/COUNTRY_INFO!F38*100))),\"-\"),0)","v":100},{"$f":"IF(COUNTRY_INFO!K38=2,IF(COUNTRY_INFO!G38*0.2>MAX('T1'!N38,'T2'!L38),MAX('T1'!N38,'T2'!L38),COUNTRY_INFO!G38*0.2),IF(COUNTRY_INFO!K38=3,IF(COUNTRY_INFO!G38>MAX('T1'!N38,'T2'!L38),MAX('T1'!N38,'T2'!L38),COUNTRY_INFO!G38),0))","v":45573.869030853602},{"$f":"IF(AND(COUNTRY_INFO!K38>0,COUNTRY_INFO!K38<4),IF(Z38>0,IF(COUNTRY_INFO!K38=1, 0, IF(COUNTRY_INFO!K38=2, AF38/(COUNTRY_INFO!G38*0.2)*100, IF(COUNTRY_INFO!K38=3, AF38/COUNTRY_INFO!G38*100))),\"-\"),0)","v":100},98690.72678345161,{"$f":"IF(AND(COUNTRY_INFO!K38>0,COUNTRY_INFO!K38<4), IF(AC38/Z38*100<>0, IF(AH38/Z38*100>100,100,AH38/Z38*100), \"-\"),0)","v":100},null,{"$f":"IF(AND(D38<>0, D38<>\"Unknown\",D38<>\"Stopped\",D38<>\"Not required\"),D38/COUNTRY_INFO!D38, 0)","v":0},{"$f":"IF(AND(J38<>0,J38<>\"Unknown\",J38<>\"Stopped\",J38<>\"Not required\"),J38/COUNTRY_INFO!D38, 0)","v":0},{"$f":"IF(AND(P38<>0,P38<>\"Unknown\",P38<>\"Not required\"),P38/(COUNTRY_INFO!E38+COUNTRY_INFO!F38), 0)","v":0},{"$f":"IF(AND(Z38<>0,Z38<>\"Unknown\",Z38<>\"Not required\"),IF(COUNTRY_INFO!K38=1,1,IF(COUNTRY_INFO!K38=2,0.5*COUNTRY_INFO!F38/(0.5*COUNTRY_INFO!F38+0.2*COUNTRY_INFO!G38),IF(COUNTRY_INFO!K38=3,COUNTRY_INFO!F38/(COUNTRY_INFO!F38+COUNTRY_INFO!G38)))),0)","v":0.5382152861144458},{"$f":"IF(AND(Z38<>0,Z38<>\"Unknown\",Z38<>\"Not required\"),IF(COUNTRY_INFO!K38=1,0,IF(COUNTRY_INFO!K38=2,0.2*COUNTRY_INFO!G38/(0.5*COUNTRY_INFO!F38+0.2*COUNTRY_INFO!G38),IF(COUNTRY_INFO!K38=3,COUNTRY_INFO!G38/(COUNTRY_INFO!F38+COUNTRY_INFO!G38)))),0)","v":0.4617847138855542},{"$f":"MAX(COUNTRY_INFO!D38*AK38*PROFILE!$G$7,COUNTRY_INFO!D38*AL38*PROFILE!$G$7)","v":0},{"$f":"MAX(COUNTRY_INFO!D38*AK38*PROFILE!$G$8,COUNTRY_INFO!D38*AL38*PROFILE!$G$8,COUNTRY_INFO!D38*AM38*PROFILE!$G$8)","v":0},{"$f":"MAX(COUNTRY_INFO!D38*AK38*PROFILE!$G$9,COUNTRY_INFO!D38*AL38*PROFILE!$G$9,COUNTRY_INFO!D38*AM38*PROFILE!$G$9,IF(AND(DISTRICT!Z38<>\"Unknown\",Z38<>\"Not required\"),COUNTRY_INFO!O38*DISTRICT!AN38,0))","v":33935.012004801923},{"$f":"MAX(COUNTRY_INFO!D38*AK38*PROFILE!$G$10,COUNTRY_INFO!D38*AL38*PROFILE!$G$10,IF(AND(DISTRICT!Z38<>\"Unknown\",Z38<>\"Not required\"),COUNTRY_INFO!O38*DISTRICT!AO38,0))","v":29115.987995198077},63051,"Y",{"$f":"MAX('MDA2'!J38,'MDA5'!J38,'T1'!L38,'T2'!J38,T3_R1!K38,T3_R2!K38)","v":49208},{"$f":"MAX('MDA1'!K38,'MDA2'!K38,'MDA3'!I38,'MDA3'!L38,'MDA5'!K38,'T1'!M38,'T2'!K38,T3_R1!L38,T3_R2!L38)","v":122410},{"$f":"MAX('MDA1'!L38,'MDA2'!L38,'MDA3'!J38,'MDA3'!M38,'MDA5'!L38,'T1'!N38,'T2'!L38,T3_R1!M38,T3_R2!M38)","v":202807},374425,{"$f":"MAX('MDA2'!J38,'MDA5'!J38,T38)","v":0},{"$f":"MAX('MDA1'!K38,'MDA2'!K38,'MDA3'!I38,'MDA3'!L38,'MDA5'!K38,V38,AD38)","v":53116.857752598007},{"$f":"MAX('MDA1'!L38,'MDA2'!L38,'MDA3'!J38,'MDA3'!M38,'MDA5'!L38,AF38)","v":45573.869030853602},63051,100]

{"sheet":"SUMMARY","index":11,"n_rows":71,"n_cols":8,"rows_kept":71,"cut":false,"hidden":false,"merged":[[70,1,70,2],[36,1,36,2],[37,1,37,2],[38,1,38,2],[67,1,67,7],[63,1,63,2],[54,1,60,7],[69,1,69,2],[64,3,65,7],[49,1,49,7],[63,3,63,7],[50,3,50,4],[32,1,32,2],[33,1,33,2],[34,1,34,2],[35,1,35,2],[23,1,23,5],[31,1,31,2],[24,1,24,5],[25,1,25,5],[26,1,26,5],[27,1,27,5],[15,1,15,3],[0,1,0,5],[1,1,1,7],[5,1,11,7],[3,3,3,5]]}
[]
[null,"PC Joint Reporting Form v.3.1"]
[]
[null,"Country",null,{"$f":"IF(INTRO!$E$34<>0,INTRO!$E$34,\" \")","v":"Rwanda"},null,null,"Year",{"$f":"IF(INTRO!$E$36<>0,INTRO!$E$36,\" \")","v":2021}]
[]
[null,"National authorities are requested to complete the Joint Reporting Form (JRF) for submission to the World Health Organization any time before 15 August of the current year for reporting data on PC interventions implemented during the previous year."]
[]
[]
[]
[]
[]
[]
[]
[null,"Number of people received treatment (at least once) for the diseases"]
[]
[null,null,null,null,"PreSAC","SAC","Adults","Total"]
[null,"Lymphatic filariasis",null,null,0,0,0,{"$f":"SUM(E17:G17)","v":0}]
[null,"Onchocerciasis",null,null,"Not eligible",0,0,{"$f":"SUM(E18:G18)","v":0}]
[null,"Soil-transmitted helminthiases",null,null,1516497,3562563,5907157,{"$f":"SUM(E19:G19)","v":10986217}]
[null,"Schistosomiasis",null,null,"Not targeted",1027010,1829289,{"$f":"SUM(E20:G20)","v":2856299}]
[]
[null,"Coverage of PC interventions for the diseases (%)"]
[]
[null,null,null,null,null,null,"Geographical","National"]
[null,"Lymphatic filariasis",null,null,null,null,0,0]
[null,"Onchocerciasis",null,null,null,null,0,0]
[null,"Soil-transmitted helminthiases",null,null,null,null,100,91.053845071049196]
[null,"Schistosomiasis",null,null,null,null,76.666666666666671,121.80057980959862]
[]
[null,"Number of people treated and programme coverage (%) by PC interventions"]
[]
[null,null,null,"PreSAC","SAC","Adults","Total","Coverage (%)"]
[null,"MDA 1 (IVM+ALB)",null,"Not eligible",{"$f":"'MDA1'!$K$4","v":0},{"$f":"'MDA1'!$L$4","v":0},{"$f":"'MDA1'!$M$4","v":0},{"$f":"'MDA1'!$Q$4","v":" "}]
[null,"MDA 2 (DEC+ALB)",null,{"$f":"'MDA2'!$J$4","v":0},{"$f":"'MDA2'!$K$4","v":0},{"$f":"'MDA2'!$L$4","v":0},{"$f":"'MDA2'!$M$4","v":0},{"$f":"'MDA2'!$Q$4","v":" "}]
[null,"MDA 3 (IVM)",null,{"$f":"IF($B$35=\"MDA 3 (IVM)\",\"Not eligible\",'MDA5'!$J$4)","v":"Not eligible"},{"$f":"IF($B$35=\"MDA 3 (IVM)\",'MDA3'!$O$4,'MDA5'!$K$4)","v":0},{"$f":"IF($B$35=\"MDA 3 (IVM)\",'MDA3'!$P$4,'MDA5'!$L$4)","v":0},{"$f":"IF($B$35=\"MDA 3 (IVM)\",'MDA3'!$Q$4,'MDA5'!$M$4)","v":0},{"$f":"IF($B$35=\"MDA 3 (IVM)\",'MDA3'!$T$4,'MDA5'!$Q$4)","v":" "}]
[null,"T 1 (PZQ+ALB/MBD)",null,{"$f":"IF('T1'!$L$4<>0,'T1'!$L$4,\"Not targeted\")","v":"Not targeted"},{"$f":"'T1'!$M$4","v":0},{"$f":"IF('T1'!$N$4<>0,'T1'!$N$4,\"Not targeted\")","v":"Not targeted"},{"$f":"'T1'!$O$4","v":0},{"$f":"'T1'!$S$4","v":" "}]
[null,"T 2 (PZQ)",null,{"$f":"IF('T2'!$J$4<>0,'T2'!$J$4,\"Not targeted\")","v":"Not targeted"},{"$f":"'T2'!$K$4","v":1027010},{"$f":"'T2'!$L$4","v":1829289},{"$f":"'T2'!$M$4","v":2856299},{"$f":"'T2'!$Q$4","v":94.834831684134784}]
[null,"T 3 (ALB/MBD) - round 1",null,{"$f":"T3_R1!$K$4","v":1359742},{"$f":"T3_R1!$L$4","v":3006657},{"$f":"IF(T3_R1!$M$4<>0,T3_R1!$M$4,\"Not targeted\")","v":5033961},{"$f":"T3_R1!$N$4","v":9400360},{"$f":"T3_R1!$R$4","v":87.268570930294118}]
[null,"T 3 (ALB/MBD) - round 2",null,{"$f":"T3_R2!$K$4","v":1456139},{"$f":"T3_R2!$L$4","v":3458828},{"$f":"IF(T3_R2!$M$4<>0,T3_R2!$M$4,\"Not targeted\")","v":5652115},{"$f":"T3_R2!$N$4","v":10567082},{"$f":"T3_R2!$R$4","v":87.988383250197103}]
[]
[null,"Inventory of PC medicines in the country"]
[]
[null,null,"IVM","DEC","ALB (LF)","ALB (STH)","MBD","PZQ"]
[null,"Available"]
[null,"Distributed"]
[null,"Wasted"]
[null,"Received"]
[null,"Remaining",{"$f":"C44-C45-C46+C47","v":0},0,0,0,0,0]
[]
[null,"Please indicate the medicine has been used to treat PreSAC for STH and delivery channels"]
[null,"PC medicine",null,"Delivery channels",null,null,"Source"]
[]
[null,"Additional information"]
[]
[]
[]
[]
[]
[]
[]
[]
[]
[null,null,null,"       I have read and accept WHO Data Sharing Policy"]
[null,"Name and signature of NTD coordinator or Ministry of Health representative:",null,"Dr Sabin NSANZIMANA, \nDirector General, \nRwanda Biomedical Centre"]
[]
[null,"Date:"]
[]
[null,"Please send the national report (signed and in electronic format) to the concerned WR with copy to:"]
[]
[null,"WHO headquarters",null,"PC_JointForms@who.int"]
[null,"WHO Regional Office",null,"Regional Advisor for NTD"]

{"sheet":"PROFILE","index":12,"n_rows":124,"n_cols":8,"rows_kept":124,"cut":false,"hidden":true,"merged":[[79,1,79,3],[123,1,124,7],[85,6,85,7],[87,6,87,7],[89,6,89,7],[86,6,86,7],[88,6,88,7],[9,1,9,2],[4,1,4,7],[5,1,5,2],[81,1,81,3],[19,1,19,6],[9,3,9,5],[43,1,43,3],[77,1,77,3],[80,1,80,3],[6,3,6,5],[7,3,7,5],[8,3,8,5],[78,1,78,3],[23,1,23,3],[11,1,11,6],[20,1,20,6],[0,1,0,5],[1,1,1,7],[3,3,3,5],[69,1,69,3],[73,1,73,3],[26,1,26,3],[27,1,27,3],[28,1,28,3],[59,1,59,3],[5,3,5,5],[30,1,30,3],[34,1,34,3],[42,1,42,3],[6,1,6,2],[7,1,7,2],[8,1,8,2],[12,1,12,6],[47,1,47,3],[51,1,51,3],[55,1,55,3],[65,1,65,3],[29,1,29,3],[21,1,21,6],[16,1,16,6],[18,1,18,6],[17,1,17,6],[63,1,63,3],[13,1,13,6],[14,1,14,6],[15,1,15,6]]}
[]
[null,"PC Joint Reporting Form v.3.1 - Country Profile"]
[]
[null,"Country",null,{"$f":"IF(INTRO!$E$34<>0,INTRO!$E$34,\" \")","v":"Rwanda"},null,null,"Year",{"$f":"IF(INTRO!$E$36<>0,INTRO!$E$36,\" \")","v":2021}]
[null,"!!! WARNING !!!\nBefore analysing data in the country profile please be ensure that your report in the SUMMARY tab is updated"]
[null,"Total population",null,null,null,null,1,{"$f":"COUNTRY_INFO!D4","v":13231595.191860002}]
[null,"Population — other age groups",null,null,null,null,{"$f":"IF($H$6<>0,H7/$H$6,0)","v":3.269666839969998E-2},{"$f":"H6-SUM(H8:H10)","v":432629.08038731106}]
[null,"Population — Pre-SAC",null,{"$f":"INTRO!B48","v":"1-4 years age"},null,null,{"$f":"IF($H$6<>0,H8/$H$6,0)","v":0.11805216411014451},{"$f":"COUNTRY_INFO!E4","v":1562018.4470284558}]
[null,"Population — SAC",null,{"$f":"INTRO!B49","v":"5-15 years age"},null,null,{"$f":"IF($H$6<>0,H9/$H$6,0)","v":0.28465544777689772},{"$f":"COUNTRY_INFO!F4","v":3766445.6541415555}]
[null,"Population — Adults",null,{"$f":"INTRO!B50","v":"16 years +"},null,null,{"$f":"IF($H$6<>0,H10/$H$6,0)","v":0.56459571971325784},{"$f":"COUNTRY_INFO!G4","v":7470502.0103026796}]
[]
[null,"Total number of people requiring PC for at least one disease (LF, ONCHO, STH, SCH)",null,null,null,null,null,{"$f":"DISTRICT!AT6","v":4891887.3561361199}]
[null,"Proportion of number of people requiring PC for at least one disease out of total population",null,null,null,null,null,{"$f":"IF(H6<>0,H12/H6,0)","v":0.36971259211025287}]
[null,"Number of IUs requiring PC for at least one disease (LF, ONCHO, STH, SCH)",null,null,null,null,null,{"$f":"COUNTIF(DISTRICT!AT9:AT1000,\">0\")","v":30}]
[null,"Number of IUs received PC for at least one disease (LF, ONCHO, STH, SCH)",null,null,null,null,null,{"$f":"COUNTIF(DISTRICT!AY9:AY1000,\">0\")","v":30}]
[null,"Proportion of IUs requiring PC for at least one disease and received it",null,null,null,null,null,{"$f":"IF(H14<>0,H15/H14,0)","v":1}]
[null,"Total number of people received PC for at least one disease (LF, ONCHO, STH, SCH)",null,null,null,null,null,{"$f":"DISTRICT!AY6","v":11053386}]
[null,"Total number of people in need who received PC for at least one disease (LF, ONCHO, STH, SCH)",null,null,null,null,null,{"$f":"DISTRICT!BC6","v":4613588.4852943784}]
[null,"Coverage of PC for at least one disease (LF, ONCHO, STH, SCH)",null,null,null,null,null,{"$f":"DISTRICT!BD6","v":0.94311012282556783}]
[null,"Number of IUs received treatment for all diseases requiring PC in those IUs",null,null,null,null,null,{"$f":"DISTRICT!AU6","v":23}]
[null,"Population requiring PC in IUs which received treatment for all diseases in need of PC",null,null,null,null,null,{"$f":"SUMIF(DISTRICT!AU9:AU1000,\"Y\",DISTRICT!AT9:AT1000)","v":3905921.8668328626}]
[null,"Population received PC in IUs which were treated for all diseases in need of PC",null,null,null,null,null,{"$f":"SUMIF(DISTRICT!AU9:AU1000,\"Y\",DISTRICT!AY9:AY1000)","v":8720843}]
[]
[null,null,null,null,"LF","ONCHO","STH","SCH"]
[]
[null,"Diseases requiring PC in the country",null,null,{"$f":"IF(INTRO!E38=\"Endemic\",\"Yes\",\"No\")","v":"No"},{"$f":"IF(INTRO!E40=\"Endemic\",\"Yes\",\"No\")","v":"No"},{"$f":"IF(INTRO!E42=\"Endemic\",\"Yes\",\"No\")","v":"Yes"},{"$f":"IF(INTRO!E44=\"Endemic\",\"Yes\",\"No\")","v":"Yes"}]
[null,"Number of implementation units (IUs) in the country",null,null,{"$f":"IF(E26=\"Yes\",INTRO!$E$46,\"-\")","v":"-"},{"$f":"IF(F26=\"Yes\",INTRO!$E$46,\"-\")","v":"-"},{"$f":"IF(G26=\"Yes\",INTRO!$E$46,\"-\")","v":30},{"$f":"IF(H26=\"Yes\",INTRO!$E$46,\"-\")","v":30}]
[null,"Number of IUs with endemicity status known",null,null,{"$f":"IF(E26=\"Yes\",E27-E29,\"-\")","v":"-"},{"$f":"IF(F26=\"Yes\",F27-F29,\"-\")","v":"-"},{"$f":"IF(G26=\"Yes\",G27-G29,\"-\")","v":30},{"$f":"IF(H26=\"Yes\",H27-H29,\"-\")","v":30}]
[null,"Number of IUs with endemicity status unknown",null,null,{"$f":"IF(E26=\"Yes\",E27-(992-COUNTIF(COUNTRY_INFO!H$9:H$1000,\"\"))+COUNTIF(COUNTRY_INFO!H$9:H$1000,\"=4\"),\"-\")","v":"-"},{"$f":"IF(F26=\"Yes\",F27-(992-COUNTIF(COUNTRY_INFO!I$9:I$1000,\"\"))+COUNTIF(COUNTRY_INFO!I$9:I$1000,\"=4\"),\"-\")","v":"-"},{"$f":"IF(G26=\"Yes\",G27-(992-COUNTIF(COUNTRY_INFO!J$9:J$1000,\"\"))+COUNTIF(COUNTRY_INFO!J$9:J$1000,\"=4\")+COUNTIF(COUNTRY_INFO!J$9:J$1000,\"=5\"),\"-\")","v":0},{"$f":"IF(H26=\"Yes\",H27-(992-COUNTIF(COUNTRY_INFO!K$9:K$1000,\"\"))+COUNTIF(COUNTRY_INFO!K$9:K$1000,\"=4\")+COUNTIF(COUNTRY_INFO!K$9:K$1000,\"=5\"),\"-\")","v":0}]
[null,"Number of non-endemic IUs",null,null,{"$f":"IF(E26=\"Yes\",COUNTIF(COUNTRY_INFO!H$9:H$1000,\"=0\"),\"-\")","v":"-"},{"$f":"IF(F26=\"Yes\",COUNTIF(COUNTRY_INFO!I$9:I$1000,\"=0\"),\"-\")","v":"-"},{"$f":"IF(G26=\"Yes\",COUNTIF(COUNTRY_INFO!J$9:J$1000,\"=0\"),\"-\")","v":0},{"$f":"IF(H26=\"Yes\",COUNTIF(COUNTRY_INFO!K$9:K$1000,\"=0\"),\"-\")","v":0}]
[null,"Number of IUs requiring PC (total)",null,null,{"$f":"COUNTIF(COUNTRY_INFO!H$9:H$1000,\"=1\")","v":0},{"$f":"COUNTIF(COUNTRY_INFO!I$9:I$1000,\"=1\")","v":0},{"$f":"SUM(G33:G34)","v":23},{"$f":"SUM(H32:H34)","v":30}]
[null,null,null,"low prevalence",null,null,{"$f":"COUNTIF(COUNTRY_INFO!J$9:J$1000,\"=1\")","v":7},{"$f":"COUNTIF(COUNTRY_INFO!K$9:K$1000,\"=1\")","v":7}]
[null,null,null,"moderate prevalence",null,null,{"$f":"COUNTIF(COUNTRY_INFO!J$9:J$1000,\"=2\")","v":13},{"$f":"COUNTIF(COUNTRY_INFO!K$9:K$1000,\"=2\")","v":23}]
[null,null,null,"high prevalence",null,null,{"$f":"COUNTIF(COUNTRY_INFO!J$9:J$1000,\"=3\")","v":10},{"$f":"COUNTIF(COUNTRY_INFO!K$9:K$1000,\"=3\")","v":0}]
[null,"Population requiring PC in the country (total)",null,null,{"$f":"COUNTRY_INFO!L4","v":0},{"$f":"COUNTRY_INFO!M4","v":0},{"$f":"COUNTRY_INFO!N4","v":4199615.6299852673},{"$f":"COUNTRY_INFO!O4","v":1480813}]
[null,null,"Pre-SAC","moderate prevalence",null,null,{"$f":"SUMIF(COUNTRY_INFO!J$9:J$1000,\"=2\",COUNTRY_INFO!E$9:E$1000)","v":712653.03689961613}]
[null,null,null,"high prevalence",null,null,{"$f":"SUMIF(COUNTRY_INFO!J$9:J$1000,\"=3\",COUNTRY_INFO!E$9:E$1000)","v":492326.65320278413}]
[null,null,"SAC","low prevalence",null,null,null,{"$f":"SUMIF(COUNTRY_INFO!K$9:K$1000,\"=1\",COUNTRY_INFO!F$9:F$1000)*0.33","v":276710.10098929564}]
[null,null,null,"moderate prevalence",null,null,{"$f":"SUMIF(COUNTRY_INFO!J$9:J$1000,\"=2\",COUNTRY_INFO!F$9:F$1000)","v":1726103.11216176},{"$f":"SUMIF(COUNTRY_INFO!K$9:K$1000,\"=2\",COUNTRY_INFO!F$9:F$1000)*0.5","v":1463965.0982991182}]
[null,null,null,"high prevalence",null,null,{"$f":"SUMIF(COUNTRY_INFO!J$9:J$1000,\"=3\",COUNTRY_INFO!F$9:F$1000)","v":1268532.827721108},{"$f":"SUMIF(COUNTRY_INFO!K$9:K$1000,\"=3\",COUNTRY_INFO!F$9:F$1000)","v":0}]
[null,null,"Adults","moderate prevalence",null,null,null,{"$f":"SUMIF(COUNTRY_INFO!K$9:K$1000,\"=2\",COUNTRY_INFO!G$9:G$1000)*0.2","v":1136521.2227506705}]
[null,null,null,"high prevalence",null,null,null,{"$f":"SUMIF(COUNTRY_INFO!K$9:K$1000,\"=3\",COUNTRY_INFO!G$9:G$1000)","v":0}]
[null,"Number of IUs where PC was implemented (total)",null,null,{"$f":"COUNTIF(DISTRICT!G$9:G$1000,\">0\")","v":0},{"$f":"COUNTIF(DISTRICT!M$9:M$1000,\">0\")","v":0},{"$f":"COUNTIF(DISTRICT!S$9:S$1000,\">0\")","v":30},{"$f":"COUNTIF(DISTRICT!AC$9:AC$1000,\">0\")","v":23}]
[null,"Number of IUs in need where PC was implemented (total)",null,null,{"$f":"COUNTIF(DISTRICT!H$9:H$1000,\">0\")","v":0},{"$f":"COUNTIF(DISTRICT!N$9:N$1000,\">0\")","v":0},{"$f":"COUNTIF(DISTRICT!X$9:X$1000,\">0\")","v":23},{"$f":"COUNTIF(DISTRICT!AH$9:AH$1000,\">0\")","v":23}]
[null,null,"Pre-SAC",null,null,null,{"$f":"COUNTIF(DISTRICT!T$9:T$1000,\">0\")","v":23}]
[null,null,"SAC",null,null,null,{"$f":"COUNTIF(DISTRICT!V$9:V$1000,\">0\")","v":23},{"$f":"COUNTIF(DISTRICT!AD$9:AD$1000,\">0\")","v":23}]
[null,null,"Adults",null,null,null,null,{"$f":"COUNTIF(DISTRICT!AF$9:AF$1000,\">0\")","v":23}]
[null,"Number of individuals treated (total)",null,null,{"$f":"DISTRICT!G4","v":0},{"$f":"DISTRICT!M4","v":0},{"$f":"DISTRICT!S4","v":10986217},{"$f":"DISTRICT!AC4","v":2856299}]
[null,null,"Pre-SAC",null,{"$f":"SUMMARY!$E17","v":0},{"$f":"SUMMARY!$E18","v":"Not eligible"},{"$f":"SUMMARY!$E19","v":1516497},{"$f":"SUMMARY!$E20","v":"Not targeted"}]
[null,null,"SAC",null,{"$f":"SUMMARY!$F17","v":0},{"$f":"SUMMARY!$F18","v":0},{"$f":"SUMMARY!$F19","v":3562563},{"$f":"SUMMARY!$F20","v":1027010}]
[null,null,"Adults",null,{"$f":"SUMMARY!$G17","v":0},{"$f":"SUMMARY!$G18","v":0},{"$f":"SUMMARY!$G19","v":5907157},{"$f":"SUMMARY!$G20","v":1829289}]
[null,"Number of individuals in need treated (total)",null,null,{"$f":"DISTRICT!H4","v":0},{"$f":"DISTRICT!N4","v":0},{"$f":"DISTRICT!X4","v":3823911.5093063521},{"$f":"DISTRICT!AH4","v":1803638.8198959115}]
[null,null,"Pre-SAC",null,null,null,{"$f":"DISTRICT!T4","v":1137032.465349704}]
[null,null,"SAC",null,null,null,{"$f":"DISTRICT!V4","v":2686879.0439566476},{"$f":"DISTRICT!AD4","v":865451.24063031597}]
[null,null,"Adults",null,null,null,null,{"$f":"DISTRICT!AF4","v":938187.57926559541}]
[null,"Geographical coverage (all ages)",null,null,{"$f":"IF(E31<>0,E44/E31,0)","v":0},{"$f":"IF(F31<>0,F44/F31,0)","v":0},{"$f":"IF(G31<>0,G44/G31,0)","v":1},{"$f":"IF(H31<>0,H44/H31,0)","v":0.76666666666666672}]
[null,null,"Pre-SAC",null,null,null,{"$f":"IF(G31<>0,G45/G31,0)","v":1}]
[null,null,"SAC",null,null,null,{"$f":"IF(G31<>0,G46/G31,0)","v":1},{"$f":"IF(H31<>0,H46/H31,0)","v":0.76666666666666672}]
[null,null,"Adults",null,null,null,null,{"$f":"IF(SUM(H33:H34)<>0,H47/SUM(H33:H34),0)","v":1}]
[null,"National coverage (total)",null,null,{"$f":"IF(E35<>0,E52/E35,0)","v":0},{"$f":"IF(F35<>0,F52/F35,0)","v":0},{"$f":"IF(G35<>0,G52/G35,0)","v":0.910538450710492},{"$f":"IF(H35<>0,H52/H35,0)","v":1.2180057980959862}]
[null,null,"Pre-SAC",null,null,null,{"$f":"IF(SUM(G36:G37)<>0,G53/SUM(G36:G37),0)","v":0.94361131120233066}]
[null,null,"SAC",null,null,null,{"$f":"IF(SUM(G39:G40)<>0,G54/SUM(G39:G40),0)","v":0.89723061430356776},{"$f":"IF(SUM(H38:H40)<>0,H54/SUM(H38:H40),0)","v":0.49719283700032696}]
[null,null,"Adults",null,null,null,null,{"$f":"IF(SUM(H41:H42)<>0,H55/SUM(H41:H42),0)","v":0.82549059400311309}]
[null,null,null,null,"LF","ONCHO","STH","SCH"]
[]
[null,"Number of IUs achieved effective coverage (all ages)",null,null,{"$f":"COUNTIF(DISTRICT!I$9:I$1000,\">=65\")","v":0},{"$f":"COUNTIF(DISTRICT!O$9:O$1000,\">=65\")","v":0},{"$f":"COUNTIF(DISTRICT!Y$9:Y$1000,\">=75\")","v":23},{"$f":"COUNTIF(DISTRICT!AI$9:AI$1000,\">=75\")","v":23}]
[null,null,"Pre-SAC",null,null,null,{"$f":"COUNTIF(DISTRICT!U$9:U$1000,\">=75\")","v":22}]
[null,null,"SAC",null,null,null,{"$f":"COUNTIF(DISTRICT!W$9:W$1000,\">=75\")","v":23},{"$f":"COUNTIF(DISTRICT!AE$9:AE$1000,\">=75\")","v":8}]
[null,null,"Adults",null,null,null,null,{"$f":"COUNTIF(DISTRICT!AG$9:AG$1000,\">=75\")","v":16}]
[null,"Number of individuals in need treated in IUs achieved effective coverage (total)",null,null,{"$f":"SUMIF(DISTRICT!I9:I1000,\">=65\",DISTRICT!H9:H1000)","v":0},{"$f":"SUMIF(DISTRICT!O9:O1000,\">=65\",DISTRICT!N9:N1000)","v":0},{"$f":"SUMIF(DISTRICT!Y9:Y1000,\">=75\",DISTRICT!X9:X1000)","v":3823911.5093063521},{"$f":"SUMIF(DISTRICT!AI9:AI1000,\">=75\",DISTRICT!AH9:AH1000)","v":1803638.8198959115}]
[null,null,"Pre-SAC",null,null,null,{"$f":"SUMIF(DISTRICT!U9:U1000,\">=75\",DISTRICT!T9:T1000)","v":1101066.465349704}]
[null,null,"SAC",null,null,null,{"$f":"SUMIF(DISTRICT!W9:W1000,\">=75\",DISTRICT!V9:V1000)","v":2686879.0439566476},{"$f":"SUMIF(DISTRICT!AE9:AE1000,\">=75\",DISTRICT!AD9:AD1000)","v":505491.24063031597}]
[null,null,"Adults",null,null,null,null,{"$f":"SUMIF(DISTRICT!AG9:AG1000,\">=75\",DISTRICT!AF9:AF1000)","v":797448.57926559541}]
[null,"Proportion of IUs requiring PC and achieved effective coverage (total)",null,null,{"$f":"IF(E44<>0,E66/E44,0)","v":0},{"$f":"IF(F44<>0,F66/F44,0)","v":0},{"$f":"IF(G44<>0,G66/G44,0)","v":1},{"$f":"IF(H44<>0,H66/H44,0)","v":1}]
[null,null,"Pre-SAC",null,null,null,{"$f":"IF(G45<>0,G67/G45,0)","v":0.95652173913043481}]
[null,null,"SAC",null,null,null,{"$f":"IF(G46<>0,G68/G46,0)","v":1},{"$f":"IF(H46<>0,H68/H46,0)","v":0.34782608695652173}]
[null,null,"Adults",null,null,null,null,{"$f":"IF(H47<>0,H69/H47,0)","v":0.69565217391304346}]
[null,"Number of implementation units where PC was stopped (i.e. under surveillance)",null,null,{"$f":"COUNTIF(COUNTRY_INFO!H$9:H$1000,\"=99\")","v":0},{"$f":"COUNTIF(COUNTRY_INFO!I$9:I$1000,\"=99\")","v":0}]
[null,"Number of individuals in IUs no longer requiring PC (stopped)",null,null,{"$f":"SUMIF(COUNTRY_INFO!H$9:H$1000,\"=99\",COUNTRY_INFO!D$9:D$1000)","v":0},{"$f":"SUMIF(COUNTRY_INFO!I$9:I$1000,\"=99\",COUNTRY_INFO!D$9:D$1000)","v":0}]
[null,"Number of individuals requiring PC living in IUs targeted with PC",null,null,{"$f":"SUMIF(DISTRICT!H$9:H$1000,\">0\",DISTRICT!D$9:D$1000)","v":0},{"$f":"SUMIF(DISTRICT!N$9:N$1000,\">0\",DISTRICT!J$9:J$1000)","v":0},{"$f":"SUMIF(DISTRICT!X$9:X$1000,\">0\",DISTRICT!P$9:P$1000)","v":4199615.6299852673},{"$f":"SUMIF(DISTRICT!AH$9:AH$1000,\">0\",DISTRICT!Z$9:Z$1000)","v":1196913}]
[null,"Number of individuals requiring PC living in IUs not targeted with PC",null,null,{"$f":"SUMIF(DISTRICT!H$9:H$1000,\"=0\",DISTRICT!D$9:D$1000)","v":0},{"$f":"SUMIF(DISTRICT!N$9:N$1000,\"=0\",DISTRICT!J$9:J$1000)","v":0},{"$f":"SUMIF(DISTRICT!X$9:X$1000,\"=0\",DISTRICT!P$9:P$1000)","v":0},{"$f":"SUMIF(DISTRICT!AH$9:AH$1000,\"=0\",DISTRICT!Z$9:Z$1000)","v":283900}]
[null,null,null,null,{"$f":"E35-E52","v":0},{"$f":"F35-F52","v":0},{"$f":"G35-G52","v":375704.12067891518},{"$f":"H35-H52","v":-322825.8198959115}]
[null,"Number of IUs requiring and receiving PC",null,null,{"$f":"E31-E44","v":0},{"$f":"F31-F44","v":0},{"$f":"G31-G44","v":0},{"$f":"H31-H44","v":7}]
[null,null,null,null,{"$f":"E27-E31-E29","v":{"$error":"#VALUE!"}},{"$f":"F27-F31-F29","v":{"$error":"#VALUE!"}},{"$f":"G27-G31-G29","v":7},{"$f":"H27-H31-H29","v":0}]
[]
[null,null,null,null,null,null,"Requiring and receiving PC"]
[null,null,null,null,null,null,"Requiring and not receiving PC"]
[null,null,null,null,null,null,"Not requiring PC"]
[null,null,null,null,null,null,"Status unknown"]
[]
[]
[]
[]
[]
[]
[]
[]
[]
[]
[]
[]
[]
[]
[]
[]
[]
[]
[]
[]
[]
[]
[]
[]
[]
[]
[]
[]
[]
[]
[]
[]
[]
[]
[null,"Click here to access data Preventive Chemotherapy Data Portal"]

{"sheet":"DATA_POLICY","index":13,"n_rows":39,"n_cols":8,"rows_kept":39,"cut":false,"hidden":true,"merged":[[55,1,55,2],[8,1,12,7],[13,1,16,7],[26,2,36,7],[38,1,45,7],[6,1,6,7],[17,1,21,7],[22,1,25,7],[0,1,0,5],[1,1,1,7],[3,3,3,5]]}
[]
[null,"PC Joint Reporting Form v.3.1"]
[]
[null,"Country",null,{"$f":"IF(INTRO!$E$34<>0,INTRO!$E$34,\" \")","v":"Rwanda"},null,null,"Year",{"$f":"IF(INTRO!$E$36<>0,INTRO!$E$36,\" \")","v":2021}]
[]
[]
[null,"WHO Data Sharing Policy statement"]
[]
[null,"Data are the basis for all sound public health actions and the benefits of data sharing are widely recognized, including scientific and public health benefits. Whenever possible, WHO wishes to promote the sharing of health data, including but not restricted to surveillance and epidemiological data.  "]
[]
[]
[]
[]
[null,{"$f":"\"In this connection, and without prejudice to information sharing and publication pursuant to legally binding instruments, by providing data to WHO, the Ministry of Health of \" & D4 & \":\"","v":"In this connection, and without prejudice to information sharing and publication pursuant to legally binding instruments, by providing data to WHO, the Ministry of Health of Rwanda:"}]
[]
[]
[]
[null,"Confirms that all data to be supplied to WHO hereunder have been collected in accordance with applicable national laws, including data protection laws aimed at protecting the confidentiality of identifiable persons;"]
[]
[]
[]
[]
[null,{"$f":"\"Agrees that WHO shall be entitled, subject always to measures to ensure the ethical and secure use of the data, and subject always to an appropriate acknowledgement of \"&D4&\":\"","v":"Agrees that WHO shall be entitled, subject always to measures to ensure the ethical and secure use of the data, and subject always to an appropriate acknowledgement of Rwanda:"}]
[]
[]
[]
[null,null,"to publish the data, stripped of any personal identifiers and make the Data available to any interested party on request (to the extent they have not, or not yet, been published by WHO) on terms that allow non-commercial, not-for-profit use of the Data for public health purposes (provided always that publication of the Data shall remain under the control of WHO); \nto use, compile, aggregate, evaluate and analyse the Data and publish and disseminate the results thereof in conjunction with WHO’s work and in accordance with the Organization’s policies and practices."]
[]
[]
[]
[]
[]
[]
[]
[]
[]
[]
[]
[null,{"$f":"CONCATENATE(\"Except where data sharing and publication is required under legally binding instruments (IHR, WHO Nomenclature Regulations 1967, etc.), the Ministry of Health of \", D4,\" may in respect of certain data opt out of (any part of) the above,\" & \" by notifying WHO thereof in writing at the following address, provided that any such notification shall clearly identify the data in question and clearly indicate the scope of the opt-out (in reference to the  above), \" & \"and provided that specific reasons shall be given for the opt out.\")","v":"Except where data sharing and publication is required under legally binding instruments (IHR, WHO Nomenclature Regulations 1967, etc.), the Ministry of Health of Rwanda may in respect of certain data opt out of (any part of) the above, by notifying WHO thereof in writing at the following address, provided that any such notification shall clearly identify the data in question and clearly indicate the scope of the opt-out (in reference to the  above), and provided that specific reasons shall be given for the opt out."}]