{"text_format":"1","workbook":"xlsx","n_sheets":12,"sheets":["INTRO","COUNTRY_INFO","MDA1","MDA4","MDA3","T1","T2","T3_R1","T3_R2","DISTRICT","SUMMARY","PROFILE"],"not_rendered":{"charts":8,"images":2,"macros":1,"external_links":0,"defined_names":6,"comments":11,"pivot_tables":0},"unopened":[],"bounds":{"document_bytes":16777216,"sheet_cells":100000,"rows_first":2000,"rows_last":500,"rows_between":2000,"halvings":0,"cell_chars":16384,"cell_head_chars":4096},"cells_cut":0,"cells_raw":0,"read":"whole","date_system":"1900"}

{"sheet":"INTRO","index":0,"n_rows":50,"n_cols":5,"rows_kept":50,"cut":false,"hidden":false,"merged":[[45,1,45,2],[10,2,10,4],[41,1,41,2],[43,1,43,2],[46,1,46,4],[33,1,33,2],[35,1,35,2],[26,2,27,4],[37,1,37,2],[39,1,39,2],[28,1,28,4],[29,2,29,4],[30,1,30,4],[31,1,31,4],[20,1,20,4],[21,2,21,4],[22,1,22,4],[23,2,24,4],[25,1,25,4],[15,1,15,4],[16,1,16,4],[17,1,17,4],[18,1,18,4],[19,2,19,4],[9,2,9,4],[11,2,11,4],[12,1,12,4],[13,1,13,4],[14,1,14,4],[0,2,0,4],[7,2,7,4],[8,2,8,4],[1,1,1,4],[2,1,2,4],[3,1,3,4],[4,1,4,4],[5,1,5,4]]}
[null,null,"Cette version sera utilisée par les pays endémiques à la Loase"]
[null,"Formulaire de Rapport Commun v.3 (L)"]
[]
[null,"Le but de ce formulaire de rapport commun - disponible sous forme de fichier Excel - est de mettre à disposition des autorités sanitaires nationales et des gestionnaires de données un outil standardisé qui réponde aux défis, facilite l'intégration et par conséquent contribue à améliorer la gestion de programme. Ce formulaire tend à standardiser le rapport de résultats des programmes nationaux, améliore la disponibilité et la coordination des données de chimioprévention à travers les Bureaux des Régions de l'Organisation mondiale de la Santé. \nLes autorités nationales sont priées de compléter ce formulaire et de le soumettre à l'Organisation mondiale de la Santé avant le 15 août de l'année en cours pour rapporter les données des activités de chimioprévention mises en oeuvre l'année précédente."]
[]
[null,"Structure de l'application (feuilles de travail) :"]
[]
[null,"INTRO","Cette feuille contient des instructions pour compléter le formulaire de rapport commun et des informations sur le statut de la chimioprévention pour les maladies d'endémie du pays. "]
[null,"COUNTRY_INFO","Cette feuille contient des informations sur la structure administrative du pays, la population par groupe d'âge, le statut d'endémicité pour chaque maladie, la population devant être traitée par chimioprévention, les interventions prévues et les interventions mises en oeuvre. "]
[null,"MDA1, MDA2, MDA3, T1, T2 et T3","Ces feuilles contiennent des informations sur l'endémicité des districts ciblés pour le traitement aux médicaments spécifiques pour la chimioprévention, les plans de traitement, et le nombre de personnes traitées par groupe d'âge. "]
[null,"DISTRICT","Cette feuille contient un résumé sur les personnes traitées, par maladie, au niveau de mise en oeuvre. Si les données par genre (sexe) sont disponibles, merci de les saisir.  "]
[null,"SUMMARY","Cette feuille contient un résumé sur les personnes traitées, par maladie et par type d'intervention de chimioprévention. Avant de générer le rapport (exécuter macro), veuillez sélectionner la maladie pour laquelle vous souhaitez un rapport. Veuillez suivre le même processus pour générer les divers rapports. \nCette feuille doit être imprimée et soumise comme formulaire de rapport commun (voir les instructions pour la soumission du formulaire sous la feuille SUMMARY). "]
[]
[null,"Instructions pour la saisie des données"]
[]
[null,"La plupart des cellules des feuilles de travail mentionnées ci-dessus contiennent des formules calculées automatiquement en fonction du protocole de traitement recommandé par l'OMS pour chaque maladie.\nVoir : http://www.who.int/neglected_diseases/preventive_chemotherapy/pct_manual/en/index.html"]
[]
[null,"Veuillez entrer vos données dans les cellules en fonction de leur code de couleur :"]
[]
[null,null,"Blanc - la cellule n'est pas protégée. Veuillez entrer la valeur de l'indicateur demandé."]
[]
[null,null,"Jaune - la cellule est protégée et inclut le nom de l'indicateur. Aucune entrée de données requise."]
[]
[null,null,"Orange - la cellule n'est pas protégée et contient un menu déroulant. Veuillez sélectionner la valeur dans le menu déroulant. "]
[]
[]
[null,null,"Vert - la cellule n'est pas protégée et contient des formules. Veuillez changer la valeur indiquée uniquement si vos données sont différentes de celles calculées automatiquement.  "]
[]
[]
[null,null,"Bleu - la cellule est protégée et contient des formules. Aucune entrée de données requise. "]
[]
[null,"Données pays"]
[]
[null,"PAYS",null,null," Congo"]
[]
[null,"Année de rapport des données",null,null,2019]
[]
[null,"Le pays est-il endémique à la filariose lymphatique (FL) ?",null,null,"Endémique"]
[]
[null,"Le pays est-il endémique à l'onchocercose (ONCHO) ? ",null,null,"Endémique"]
[]
[null,"Le pays est-il endémique aux géohelminthiases (STH) ?",null,null,"Endémique"]
[]
[null,"Le pays est-il endémique à la schistosomiase (SCH) ?",null,null,"Endémique"]
[]
[null,"Combien d'unités administratives compte le pays ?",null,null,52]
[null,"Si les données démographiques par groupe d'âge ne sont pas disponibles au second niveau administratif, veuillez entrer la proportion (%) de population, par groupe d'âge, du pays. Si les données sont disponibles, veuillez laisser les cellules vierges."]
[null,"1-4 ans","Enfants d'âge pré-scolaire (EAPréS)",null,0.16]
[null,"5-14 ans","Enfants d'âge scolaire (EAS)",null,0.24]
[null,"15 ans et plus","Adultes",null,0.55300000000000005]

{"sheet":"COUNTRY_INFO","index":1,"n_rows":60,"n_cols":50,"rows_kept":60,"cut":false,"hidden":false,"merged":[[3,0,3,2],[3,7,3,11],[3,20,3,21],[5,0,5,2],[3,16,3,19],[5,16,5,19],[5,3,5,6],[5,7,5,11],[5,12,5,15],[5,20,5,21]]}
["INFORMATIONS PAYS"]
["Structure administrative, population par groupe d'âge, statut d'endémicité, interventions planifiées et interventions mises en oeuvre",null,null,null,null,null,null,null,null,null,null,null," "," "]
[]
["TOTAL",null,null,{"$f":"SUM(D$9:D$1000)","v":5321638},{"$f":"SUM(E$9:E$1000)","v":851462},{"$f":"SUM(F$9:F$1000)","v":1277191},{"$f":"SUM(G$9:G$1000)","v":2942865},null,null,null,null,null,{"$f":"SUM(M$9:M$1000)","v":1031260},{"$f":"SUM(N$9:N$1000)","v":713514},{"$f":"SUM(O$9:O$1000)","v":809022},{"$f":"SUM(P$9:P$1000)","v":408975.29}]
[]
["Structure administrative du pays",null,null,"Population",null,null,null,"Endémicité",null,null,null,null,"Population nécessitant la CP",null,null,null,"Nombre de tournées de traitement prévues pour l'année",null,null,null,"Mise en oeuvre de la chimioprévention",null,null,null,null,null,"mda1","mda4","mda3",null,"mda4_r1","mda4_r2",null,null,null,null,null,"roadmap pop 2019"]
["Pays","Région/Département","District","Total","EAPréS","EAS","Adultes","FL","Oncho","STH","SCH","Loa","FL","Oncho","STH","SCH","FL","Oncho","STH","SCH","TOURNEE 1","TOURNEE 2","IU_ID","IU_NAME","x","x","x","x","x","x","x","x","x","x","x","x","x","x","x","x","x","x","x","x","x","x","x","x","x","x"]
[]
[{"$f":"IF(INTRO!$E$34<>0,INTRO!$E$34,\"\")","v":" Congo"},"Bouenza","Loudima",50384,{"$f":"IF(INTRO!$E$48=\"\",\"\",ROUND($D9*INTRO!$E$48,0))","v":8061},{"$f":"IF(INTRO!$E$49=\"\",\"\",ROUND($D9*INTRO!$E$49,0))","v":12092},{"$f":"IF(INTRO!$E$50=\"\",\"\",ROUND($D9*INTRO!$E$50,0))","v":27862},0,1,1,3,1,{"$f":"IF(INTRO!$E$38=\"Endémique\", IF($H9>0, IF($H9=4,\"Inconnu\", IF($H9=99,\"Interrompu\", $D9)), 0),\"Non requis\")","v":0},16204,{"$f":"IF(INTRO!$E$42=\"Endémique\", IF(AND($J9>1,$J9<5), IF($J9=4, \"Inconnu\", E9+F9), 0),\"Non requis\")","v":0},{"$f":"IF(INTRO!$E$44=\"Endémique\", IF(AND($K9>0,$K9<5), IF($K9=4,\"Inconnu\", IF($K9=1, $F9*0.33, IF($K9=2, $F9*0.5+$G9*0.2, SUM(F9:G9)))), 0),\"Non requis\")","v":39954},0,1,0,0,"MDA3 (IVM)",null,12831,"Loudima",null,null,{"$f":"'MDA1'!M9","v":0},{"$f":"'MDA4'!U9","v":0},{"$f":"'MDA3'!Q9","v":13390},null,{"$f":"'MDA4'!M9","v":0},{"$f":"'MDA4'!Q9","v":0},null,null,null,null,"Loudima",126714,{"$f":"(AL9-D9)/D9*100","v":151.4965068275643}]
[{"$f":"IF(INTRO!$E$34<>0,INTRO!$E$34,\"\")","v":" Congo"},"Bouenza","Loutété",55614,{"$f":"IF(INTRO!$E$48=\"\",\"\",ROUND($D10*INTRO!$E$48,0))","v":8898},{"$f":"IF(INTRO!$E$49=\"\",\"\",ROUND($D10*INTRO!$E$49,0))","v":13347},{"$f":"IF(INTRO!$E$50=\"\",\"\",ROUND($D10*INTRO!$E$50,0))","v":30755},1,1,2,2,1,{"$f":"IF(INTRO!$E$38=\"Endémique\", IF($H10>0, IF($H10=4,\"Inconnu\", IF($H10=99,\"Interrompu\", $D10)), 0),\"Non requis\")","v":55614},31821,{"$f":"IF(INTRO!$E$42=\"Endémique\", IF(AND($J10>1,$J10<5), IF($J10=4, \"Inconnu\", E10+F10), 0),\"Non requis\")","v":22245},{"$f":"IF(INTRO!$E$44=\"Endémique\", IF(AND($K10>0,$K10<5), IF($K10=4,\"Inconnu\", IF($K10=1, $F10*0.33, IF($K10=2, $F10*0.5+$G10*0.2, SUM(F10:G10)))), 0),\"Non requis\")","v":12824.5},1,1,1,0,"MDA1 (IVM+ALB)",null,12823,"Loutété",null,null,{"$f":"'MDA1'!M10","v":25928},{"$f":"'MDA4'!U10","v":2792},{"$f":"'MDA3'!Q10","v":0},null,{"$f":"'MDA4'!M10","v":2792},{"$f":"'MDA4'!Q10","v":2634},null,null,null,null,"Loutété",159001,{"$f":"(AL10-D10)/D10*100","v":185.90103211421584}]
[{"$f":"IF(INTRO!$E$34<>0,INTRO!$E$34,\"\")","v":" Congo"},"Bouenza","Madingou",105844,{"$f":"IF(INTRO!$E$48=\"\",\"\",ROUND($D11*INTRO!$E$48,0))","v":16935},{"$f":"IF(INTRO!$E$49=\"\",\"\",ROUND($D11*INTRO!$E$49,0))","v":25403},{"$f":"IF(INTRO!$E$50=\"\",\"\",ROUND($D11*INTRO!$E$50,0))","v":58532},1,1,1,0,1,{"$f":"IF(INTRO!$E$38=\"Endémique\", IF($H11>0, IF($H11=4,\"Inconnu\", IF($H11=99,\"Interrompu\", $D11)), 0),\"Non requis\")","v":105844},48422,{"$f":"IF(INTRO!$E$42=\"Endémique\", IF(AND($J11>1,$J11<5), IF($J11=4, \"Inconnu\", E11+F11), 0),\"Non requis\")","v":0},{"$f":"IF(INTRO!$E$44=\"Endémique\", IF(AND($K11>0,$K11<5), IF($K11=4,\"Inconnu\", IF($K11=1, $F11*0.33, IF($K11=2, $F11*0.5+$G11*0.2, SUM(F11:G11)))), 0),\"Non requis\")","v":0},1,1,0,0,"MDA1 (IVM+ALB)",null,12763,"Madingou",null,null,{"$f":"'MDA1'!M11","v":40439},{"$f":"'MDA4'!U11","v":15621},{"$f":"'MDA3'!Q11","v":0},null,{"$f":"'MDA4'!M11","v":13362},{"$f":"'MDA4'!Q11","v":15621},null,null,null,null,"Madingou",181621,71.593099278182976]
[{"$f":"IF(INTRO!$E$34<>0,INTRO!$E$34,\"\")","v":" Congo"},"Bouenza","Mouyondzi",84145,{"$f":"IF(INTRO!$E$48=\"\",\"\",ROUND($D12*INTRO!$E$48,0))","v":13463},{"$f":"IF(INTRO!$E$49=\"\",\"\",ROUND($D12*INTRO!$E$49,0))","v":20195},{"$f":"IF(INTRO!$E$50=\"\",\"\",ROUND($D12*INTRO!$E$50,0))","v":46532},1,1,3,3,1,{"$f":"IF(INTRO!$E$38=\"Endémique\", IF($H12>0, IF($H12=4,\"Inconnu\", IF($H12=99,\"Interrompu\", $D12)), 0),\"Non requis\")","v":84145},40579,{"$f":"IF(INTRO!$E$42=\"Endémique\", IF(AND($J12>1,$J12<5), IF($J12=4, \"Inconnu\", E12+F12), 0),\"Non requis\")","v":33658},{"$f":"IF(INTRO!$E$44=\"Endémique\", IF(AND($K12>0,$K12<5), IF($K12=4,\"Inconnu\", IF($K12=1, $F12*0.33, IF($K12=2, $F12*0.5+$G12*0.2, SUM(F12:G12)))), 0),\"Non requis\")","v":66727},1,1,2,0,"MDA1 (IVM+ALB)",null,12765,"Mouyondzi",null,null,{"$f":"'MDA1'!M12","v":33683},{"$f":"'MDA4'!U12","v":6645},{"$f":"'MDA3'!Q12","v":0},null,{"$f":"'MDA4'!M12","v":1276},{"$f":"'MDA4'!Q12","v":6645},null,null,null,null,"Mouyondzi",15505,-81.573474359736167]
[{"$f":"IF(INTRO!$E$34<>0,INTRO!$E$34,\"\")","v":" Congo"},"Bouenza","Nkayi",126714,{"$f":"IF(INTRO!$E$48=\"\",\"\",ROUND($D13*INTRO!$E$48,0))","v":20274},{"$f":"IF(INTRO!$E$49=\"\",\"\",ROUND($D13*INTRO!$E$49,0))","v":30411},{"$f":"IF(INTRO!$E$50=\"\",\"\",ROUND($D13*INTRO!$E$50,0))","v":70073},0,1,2,0,1,{"$f":"IF(INTRO!$E$38=\"Endémique\", IF($H13>0, IF($H13=4,\"Inconnu\", IF($H13=99,\"Interrompu\", $D13)), 0),\"Non requis\")","v":0},38249,{"$f":"IF(INTRO!$E$42=\"Endémique\", IF(AND($J13>1,$J13<5), IF($J13=4, \"Inconnu\", E13+F13), 0),\"Non requis\")","v":50685},{"$f":"IF(INTRO!$E$44=\"Endémique\", IF(AND($K13>0,$K13<5), IF($K13=4,\"Inconnu\", IF($K13=1, $F13*0.33, IF($K13=2, $F13*0.5+$G13*0.2, SUM(F13:G13)))), 0),\"Non requis\")","v":0},0,1,1,0,"MDA3 (IVM)",null,12832,"Nkayi",null,null,{"$f":"'MDA1'!M13","v":0},{"$f":"'MDA4'!U13","v":0},{"$f":"'MDA3'!Q13","v":30278},null,{"$f":"'MDA4'!M13","v":0},{"$f":"'MDA4'!Q13","v":0},null,null,null,null,"Nkayi",178861,41.153305869911769]
[{"$f":"IF(INTRO!$E$34<>0,INTRO!$E$34,\"\")","v":" Congo"},"Brazzaville","Bacongo",159001,{"$f":"IF(INTRO!$E$48=\"\",\"\",ROUND($D14*INTRO!$E$48,0))","v":25440},{"$f":"IF(INTRO!$E$49=\"\",\"\",ROUND($D14*INTRO!$E$49,0))","v":38160},{"$f":"IF(INTRO!$E$50=\"\",\"\",ROUND($D14*INTRO!$E$50,0))","v":87928},0,1,1,4,1,{"$f":"IF(INTRO!$E$38=\"Endémique\", IF($H14>0, IF($H14=4,\"Inconnu\", IF($H14=99,\"Interrompu\", $D14)), 0),\"Non requis\")","v":0},122326,{"$f":"IF(INTRO!$E$42=\"Endémique\", IF(AND($J14>1,$J14<5), IF($J14=4, \"Inconnu\", E14+F14), 0),\"Non requis\")","v":0},{"$f":"IF(INTRO!$E$44=\"Endémique\", IF(AND($K14>0,$K14<5), IF($K14=4,\"Inconnu\", IF($K14=1, $F14*0.33, IF($K14=2, $F14*0.5+$G14*0.2, SUM(F14:G14)))), 0),\"Non requis\")","v":"Inconnu"},0,1,0,0,"MDA3 (IVM)",null,12800,"Bacongo",null,null,{"$f":"'MDA1'!M14","v":0},{"$f":"'MDA4'!U14","v":0},{"$f":"'MDA3'!Q14","v":99677},null,{"$f":"'MDA4'!M14","v":0},{"$f":"'MDA4'!Q14","v":0},null,null,null,null,"Bacongo",232218,46.048138062024769]
[{"$f":"IF(INTRO!$E$34<>0,INTRO!$E$34,\"\")","v":" Congo"},"Brazzaville","Djiri",181621,{"$f":"IF(INTRO!$E$48=\"\",\"\",ROUND($D15*INTRO!$E$48,0))","v":29059},{"$f":"IF(INTRO!$E$49=\"\",\"\",ROUND($D15*INTRO!$E$49,0))","v":43589},{"$f":"IF(INTRO!$E$50=\"\",\"\",ROUND($D15*INTRO!$E$50,0))","v":100436},0,4,1,0,1,{"$f":"IF(INTRO!$E$38=\"Endémique\", IF($H15>0, IF($H15=4,\"Inconnu\", IF($H15=99,\"Interrompu\", $D15)), 0),\"Non requis\")","v":0},null,{"$f":"IF(INTRO!$E$42=\"Endémique\", IF(AND($J15>1,$J15<5), IF($J15=4, \"Inconnu\", E15+F15), 0),\"Non requis\")","v":0},{"$f":"IF(INTRO!$E$44=\"Endémique\", IF(AND($K15>0,$K15<5), IF($K15=4,\"Inconnu\", IF($K15=1, $F15*0.33, IF($K15=2, $F15*0.5+$G15*0.2, SUM(F15:G15)))), 0),\"Non requis\")","v":0},0,0,0,0,null,null,12847,"Djiri",null,null,{"$f":"'MDA1'!M15","v":0},{"$f":"'MDA4'!U15","v":0},{"$f":"'MDA3'!Q15","v":0},null,{"$f":"'MDA4'!M15","v":0},{"$f":"'MDA4'!Q15","v":0},null,null,null,null,"Djiri",218748,20.442019370006772]
[{"$f":"IF(INTRO!$E$34<>0,INTRO!$E$34,\"\")","v":" Congo"},"Brazzaville","Île Mbamou",15505,{"$f":"IF(INTRO!$E$48=\"\",\"\",ROUND($D16*INTRO!$E$48,0))","v":2481},{"$f":"IF(INTRO!$E$49=\"\",\"\",ROUND($D16*INTRO!$E$49,0))","v":3721},{"$f":"IF(INTRO!$E$50=\"\",\"\",ROUND($D16*INTRO!$E$50,0))","v":8574},0,4,1,4,1,{"$f":"IF(INTRO!$E$38=\"Endémique\", IF($H16>0, IF($H16=4,\"Inconnu\", IF($H16=99,\"Interrompu\", $D16)), 0),\"Non requis\")","v":0},null,{"$f":"IF(INTRO!$E$42=\"Endémique\", IF(AND($J16>1,$J16<5), IF($J16=4, \"Inconnu\", E16+F16), 0),\"Non requis\")","v":0},{"$f":"IF(INTRO!$E$44=\"Endémique\", IF(AND($K16>0,$K16<5), IF($K16=4,\"Inconnu\", IF($K16=1, $F16*0.33, IF($K16=2, $F16*0.5+$G16*0.2, SUM(F16:G16)))), 0),\"Non requis\")","v":"Inconnu"},0,0,0,0,null,null,12834,"Ile M'Bamou",null,null,{"$f":"'MDA1'!M16","v":0},{"$f":"'MDA4'!U16","v":0},{"$f":"'MDA3'!Q16","v":0},null,{"$f":"'MDA4'!M16","v":0},{"$f":"'MDA4'!Q16","v":0},null,null,null,null,"Île Mbamou",231188,1391.0544985488552]
[{"$f":"IF(INTRO!$E$34<>0,INTRO!$E$34,\"\")","v":" Congo"},"Brazzaville","Madibou",178861,{"$f":"IF(INTRO!$E$48=\"\",\"\",ROUND($D17*INTRO!$E$48,0))","v":28618},{"$f":"IF(INTRO!$E$49=\"\",\"\",ROUND($D17*INTRO!$E$49,0))","v":42927},{"$f":"IF(INTRO!$E$50=\"\",\"\",ROUND($D17*INTRO!$E$50,0))","v":98910},0,1,1,0,1,{"$f":"IF(INTRO!$E$38=\"Endémique\", IF($H17>0, IF($H17=4,\"Inconnu\", IF($H17=99,\"Interrompu\", $D17)), 0),\"Non requis\")","v":0},96961,{"$f":"IF(INTRO!$E$42=\"Endémique\", IF(AND($J17>1,$J17<5), IF($J17=4, \"Inconnu\", E17+F17), 0),\"Non requis\")","v":0},{"$f":"IF(INTRO!$E$44=\"Endémique\", IF(AND($K17>0,$K17<5), IF($K17=4,\"Inconnu\", IF($K17=1, $F17*0.33, IF($K17=2, $F17*0.5+$G17*0.2, SUM(F17:G17)))), 0),\"Non requis\")","v":0},0,1,0,0,"MDA3 (IVM)",null,12824,"Madibou",null,null,{"$f":"'MDA1'!M17","v":0},{"$f":"'MDA4'!U17","v":0},{"$f":"'MDA3'!Q17","v":77314},null,{"$f":"'MDA4'!M17","v":0},{"$f":"'MDA4'!Q17","v":0},null,null,null,null,"Madibou",247175,38.193904764034642]
[{"$f":"IF(INTRO!$E$34<>0,INTRO!$E$34,\"\")","v":" Congo"},"Brazzaville","Makélékélé",232218,{"$f":"IF(INTRO!$E$48=\"\",\"\",ROUND($D18*INTRO!$E$48,0))","v":37155},{"$f":"IF(INTRO!$E$49=\"\",\"\",ROUND($D18*INTRO!$E$49,0))","v":55732},{"$f":"IF(INTRO!$E$50=\"\",\"\",ROUND($D18*INTRO!$E$50,0))","v":128417},0,1,1,1,1,{"$f":"IF(INTRO!$E$38=\"Endémique\", IF($H18>0, IF($H18=4,\"Inconnu\", IF($H18=99,\"Interrompu\", $D18)), 0),\"Non requis\")","v":0},94128,{"$f":"IF(INTRO!$E$42=\"Endémique\", IF(AND($J18>1,$J18<5), IF($J18=4, \"Inconnu\", E18+F18), 0),\"Non requis\")","v":0},{"$f":"IF(INTRO!$E$44=\"Endémique\", IF(AND($K18>0,$K18<5), IF($K18=4,\"Inconnu\", IF($K18=1, $F18*0.33, IF($K18=2, $F18*0.5+$G18*0.2, SUM(F18:G18)))), 0),\"Non requis\")","v":18391.560000000001},0,1,0,0,"MDA3 (IVM)",null,12805,"Makélékélé",null,null,{"$f":"'MDA1'!M18","v":0},{"$f":"'MDA4'!U18","v":0},{"$f":"'MDA3'!Q18","v":78428},null,{"$f":"'MDA4'!M18","v":0},{"$f":"'MDA4'!Q18","v":0},null,null,null,null,"Makélékélé",102875,-55.698955292010098]
[{"$f":"IF(INTRO!$E$34<>0,INTRO!$E$34,\"\")","v":" Congo"},"Brazzaville","Mfilou",218748,{"$f":"IF(INTRO!$E$48=\"\",\"\",ROUND($D19*INTRO!$E$48,0))","v":35000},{"$f":"IF(INTRO!$E$49=\"\",\"\",ROUND($D19*INTRO!$E$49,0))","v":52500},{"$f":"IF(INTRO!$E$50=\"\",\"\",ROUND($D19*INTRO!$E$50,0))","v":120968},0,1,1,0,1,{"$f":"IF(INTRO!$E$38=\"Endémique\", IF($H19>0, IF($H19=4,\"Inconnu\", IF($H19=99,\"Interrompu\", $D19)), 0),\"Non requis\")","v":0},87100,{"$f":"IF(INTRO!$E$42=\"Endémique\", IF(AND($J19>1,$J19<5), IF($J19=4, \"Inconnu\", E19+F19), 0),\"Non requis\")","v":0},{"$f":"IF(INTRO!$E$44=\"Endémique\", IF(AND($K19>0,$K19<5), IF($K19=4,\"Inconnu\", IF($K19=1, $F19*0.33, IF($K19=2, $F19*0.5+$G19*0.2, SUM(F19:G19)))), 0),\"Non requis\")","v":0},0,1,0,0,"MDA3 (IVM)",null,12806,"Mfilou",null,null,{"$f":"'MDA1'!M19","v":0},{"$f":"'MDA4'!U19","v":0},{"$f":"'MDA3'!Q19","v":71739},null,{"$f":"'MDA4'!M19","v":0},{"$f":"'MDA4'!Q19","v":0},null,null,null,null,"Mfilou",317814,45.287728344944867]
[{"$f":"IF(INTRO!$E$34<>0,INTRO!$E$34,\"\")","v":" Congo"},"Brazzaville","Moungali",231188,{"$f":"IF(INTRO!$E$48=\"\",\"\",ROUND($D20*INTRO!$E$48,0))","v":36990},{"$f":"IF(INTRO!$E$49=\"\",\"\",ROUND($D20*INTRO!$E$49,0))","v":55485},{"$f":"IF(INTRO!$E$50=\"\",\"\",ROUND($D20*INTRO!$E$50,0))","v":127847},0,4,1,1,1,{"$f":"IF(INTRO!$E$38=\"Endémique\", IF($H20>0, IF($H20=4,\"Inconnu\", IF($H20=99,\"Interrompu\", $D20)), 0),\"Non requis\")","v":0},null,{"$f":"IF(INTRO!$E$42=\"Endémique\", IF(AND($J20>1,$J20<5), IF($J20=4, \"Inconnu\", E20+F20), 0),\"Non requis\")","v":0},{"$f":"IF(INTRO!$E$44=\"Endémique\", IF(AND($K20>0,$K20<5), IF($K20=4,\"Inconnu\", IF($K20=1, $F20*0.33, IF($K20=2, $F20*0.5+$G20*0.2, SUM(F20:G20)))), 0),\"Non requis\")","v":18310.05},0,0,0,0,null,null,12808,"Moungali",null,null,{"$f":"'MDA1'!M20","v":0},{"$f":"'MDA4'!U20","v":0},{"$f":"'MDA3'!Q20","v":0},null,{"$f":"'MDA4'!M20","v":0},{"$f":"'MDA4'!Q20","v":0},null,null,null,null,"Moungali",64829,-71.958319635967257]
[{"$f":"IF(INTRO!$E$34<>0,INTRO!$E$34,\"\")","v":" Congo"},"Brazzaville","Ouenzé",247175,{"$f":"IF(INTRO!$E$48=\"\",\"\",ROUND($D21*INTRO!$E$48,0))","v":39548},{"$f":"IF(INTRO!$E$49=\"\",\"\",ROUND($D21*INTRO!$E$49,0))","v":59322},{"$f":"IF(INTRO!$E$50=\"\",\"\",ROUND($D21*INTRO!$E$50,0))","v":136688},0,4,1,0,1,{"$f":"IF(INTRO!$E$38=\"Endémique\", IF($H21>0, IF($H21=4,\"Inconnu\", IF($H21=99,\"Interrompu\", $D21)), 0),\"Non requis\")","v":0},null,{"$f":"IF(INTRO!$E$42=\"Endémique\", IF(AND($J21>1,$J21<5), IF($J21=4, \"Inconnu\", E21+F21), 0),\"Non requis\")","v":0},{"$f":"IF(INTRO!$E$44=\"Endémique\", IF(AND($K21>0,$K21<5), IF($K21=4,\"Inconnu\", IF($K21=1, $F21*0.33, IF($K21=2, $F21*0.5+$G21*0.2, SUM(F21:G21)))), 0),\"Non requis\")","v":0},0,0,0,0,null,null,12810,"Ouenzé",null,null,{"$f":"'MDA1'!M21","v":0},{"$f":"'MDA4'!U21","v":0},{"$f":"'MDA3'!Q21","v":0},null,{"$f":"'MDA4'!M21","v":0},{"$f":"'MDA4'!Q21","v":0},null,null,null,null,"Ouenzé",94456,-61.785779306159604]
[{"$f":"IF(INTRO!$E$34<>0,INTRO!$E$34,\"\")","v":" Congo"},"Brazzaville","Poto-Poto",102875,{"$f":"IF(INTRO!$E$48=\"\",\"\",ROUND($D22*INTRO!$E$48,0))","v":16460},{"$f":"IF(INTRO!$E$49=\"\",\"\",ROUND($D22*INTRO!$E$49,0))","v":24690},{"$f":"IF(INTRO!$E$50=\"\",\"\",ROUND($D22*INTRO!$E$50,0))","v":56890},0,4,1,0,1,{"$f":"IF(INTRO!$E$38=\"Endémique\", IF($H22>0, IF($H22=4,\"Inconnu\", IF($H22=99,\"Interrompu\", $D22)), 0),\"Non requis\")","v":0},null,{"$f":"IF(INTRO!$E$42=\"Endémique\", IF(AND($J22>1,$J22<5), IF($J22=4, \"Inconnu\", E22+F22), 0),\"Non requis\")","v":0},{"$f":"IF(INTRO!$E$44=\"Endémique\", IF(AND($K22>0,$K22<5), IF($K22=4,\"Inconnu\", IF($K22=1, $F22*0.33, IF($K22=2, $F22*0.5+$G22*0.2, SUM(F22:G22)))), 0),\"Non requis\")","v":0},0,0,0,0,null,null,12811,"Poto-Poto",null,null,{"$f":"'MDA1'!M22","v":0},{"$f":"'MDA4'!U22","v":0},{"$f":"'MDA3'!Q22","v":0},null,{"$f":"'MDA4'!M22","v":0},{"$f":"'MDA4'!Q22","v":0},null,null,null,null,"Poto-Poto",56721,-44.864155528554072]
[{"$f":"IF(INTRO!$E$34<>0,INTRO!$E$34,\"\")","v":" Congo"},"Brazzaville","Talangaî",317814,{"$f":"IF(INTRO!$E$48=\"\",\"\",ROUND($D23*INTRO!$E$48,0))","v":50850},{"$f":"IF(INTRO!$E$49=\"\",\"\",ROUND($D23*INTRO!$E$49,0))","v":76275},{"$f":"IF(INTRO!$E$50=\"\",\"\",ROUND($D23*INTRO!$E$50,0))","v":175751},0,4,0,0,1,{"$f":"IF(INTRO!$E$38=\"Endémique\", IF($H23>0, IF($H23=4,\"Inconnu\", IF($H23=99,\"Interrompu\", $D23)), 0),\"Non requis\")","v":0},null,{"$f":"IF(INTRO!$E$42=\"Endémique\", IF(AND($J23>1,$J23<5), IF($J23=4, \"Inconnu\", E23+F23), 0),\"Non requis\")","v":0},{"$f":"IF(INTRO!$E$44=\"Endémique\", IF(AND($K23>0,$K23<5), IF($K23=4,\"Inconnu\", IF($K23=1, $F23*0.33, IF($K23=2, $F23*0.5+$G23*0.2, SUM(F23:G23)))), 0),\"Non requis\")","v":0},0,0,0,0,null,null,12833,"Talangaï",null,null,{"$f":"'MDA1'!M23","v":0},{"$f":"'MDA4'!U23","v":0},{"$f":"'MDA3'!Q23","v":0},null,{"$f":"'MDA4'!M23","v":0},{"$f":"'MDA4'!Q23","v":0},null,null,null,null,"Talangaî",42541,-86.614497788014376]
[{"$f":"IF(INTRO!$E$34<>0,INTRO!$E$34,\"\")","v":" Congo"},"Cuvette","Mossaka",64829,{"$f":"IF(INTRO!$E$48=\"\",\"\",ROUND($D24*INTRO!$E$48,0))","v":10373},{"$f":"IF(INTRO!$E$49=\"\",\"\",ROUND($D24*INTRO!$E$49,0))","v":15559},{"$f":"IF(INTRO!$E$50=\"\",\"\",ROUND($D24*INTRO!$E$50,0))","v":35850},0,4,2,1,1,{"$f":"IF(INTRO!$E$38=\"Endémique\", IF($H24>0, IF($H24=4,\"Inconnu\", IF($H24=99,\"Interrompu\", $D24)), 0),\"Non requis\")","v":0},null,{"$f":"IF(INTRO!$E$42=\"Endémique\", IF(AND($J24>1,$J24<5), IF($J24=4, \"Inconnu\", E24+F24), 0),\"Non requis\")","v":25932},{"$f":"IF(INTRO!$E$44=\"Endémique\", IF(AND($K24>0,$K24<5), IF($K24=4,\"Inconnu\", IF($K24=1, $F24*0.33, IF($K24=2, $F24*0.5+$G24*0.2, SUM(F24:G24)))), 0),\"Non requis\")","v":5134.47},0,0,1,0,null,null,12773,"Mossaka",null,null,{"$f":"'MDA1'!M24","v":0},{"$f":"'MDA4'!U24","v":0},{"$f":"'MDA3'!Q24","v":0},null,{"$f":"'MDA4'!M24","v":0},{"$f":"'MDA4'!Q24","v":0},null,null,null,null,"Mossaka",73793,13.827145259066159]
[{"$f":"IF(INTRO!$E$34<>0,INTRO!$E$34,\"\")","v":" Congo"},"Cuvette","Owando",94456,{"$f":"IF(INTRO!$E$48=\"\",\"\",ROUND($D25*INTRO!$E$48,0))","v":15113},{"$f":"IF(INTRO!$E$49=\"\",\"\",ROUND($D25*INTRO!$E$49,0))","v":22669},{"$f":"IF(INTRO!$E$50=\"\",\"\",ROUND($D25*INTRO!$E$50,0))","v":52234},1,4,1,1,1,{"$f":"IF(INTRO!$E$38=\"Endémique\", IF($H25>0, IF($H25=4,\"Inconnu\", IF($H25=99,\"Interrompu\", $D25)), 0),\"Non requis\")","v":94456},null,{"$f":"IF(INTRO!$E$42=\"Endémique\", IF(AND($J25>1,$J25<5), IF($J25=4, \"Inconnu\", E25+F25), 0),\"Non requis\")","v":0},{"$f":"IF(INTRO!$E$44=\"Endémique\", IF(AND($K25>0,$K25<5), IF($K25=4,\"Inconnu\", IF($K25=1, $F25*0.33, IF($K25=2, $F25*0.5+$G25*0.2, SUM(F25:G25)))), 0),\"Non requis\")","v":7480.77},1,0,0,0,"MDA4 (ALB/2*ALB)",null,12775,"Owando",null,null,{"$f":"'MDA1'!M25","v":0},{"$f":"'MDA4'!U25","v":42520},{"$f":"'MDA3'!Q25","v":0},null,{"$f":"'MDA4'!M25","v":42520},{"$f":"'MDA4'!Q25","v":0},null,null,null,null,"Owando",47331,-49.890954518505971]
[{"$f":"IF(INTRO!$E$34<>0,INTRO!$E$34,\"\")","v":" Congo"},"Cuvette","Oyo-Alima",56721,{"$f":"IF(INTRO!$E$48=\"\",\"\",ROUND($D26*INTRO!$E$48,0))","v":9075},{"$f":"IF(INTRO!$E$49=\"\",\"\",ROUND($D26*INTRO!$E$49,0))","v":13613},{"$f":"IF(INTRO!$E$50=\"\",\"\",ROUND($D26*INTRO!$E$50,0))","v":31367},0,4,1,0,1,{"$f":"IF(INTRO!$E$38=\"Endémique\", IF($H26>0, IF($H26=4,\"Inconnu\", IF($H26=99,\"Interrompu\", $D26)), 0),\"Non requis\")","v":0},null,{"$f":"IF(INTRO!$E$42=\"Endémique\", IF(AND($J26>1,$J26<5), IF($J26=4, \"Inconnu\", E26+F26), 0),\"Non requis\")","v":0},{"$f":"IF(INTRO!$E$44=\"Endémique\", IF(AND($K26>0,$K26<5), IF($K26=4,\"Inconnu\", IF($K26=1, $F26*0.33, IF($K26=2, $F26*0.5+$G26*0.2, SUM(F26:G26)))), 0),\"Non requis\")","v":0},0,0,0,0,null,null,12829,"Oyo-Alima",null,null,{"$f":"'MDA1'!M26","v":0},{"$f":"'MDA4'!U26","v":0},{"$f":"'MDA3'!Q26","v":0},null,{"$f":"'MDA4'!M26","v":0},{"$f":"'MDA4'!Q26","v":0},null,null,null,null,"Oyo-Alima",23282,-58.953474021967168]
[{"$f":"IF(INTRO!$E$34<>0,INTRO!$E$34,\"\")","v":" Congo"},"Cuvette-Ouest","Etoumbi",42541,{"$f":"IF(INTRO!$E$48=\"\",\"\",ROUND($D27*INTRO!$E$48,0))","v":6807},{"$f":"IF(INTRO!$E$49=\"\",\"\",ROUND($D27*INTRO!$E$49,0))","v":10210},{"$f":"IF(INTRO!$E$50=\"\",\"\",ROUND($D27*INTRO!$E$50,0))","v":23525},1,4,2,0,1,{"$f":"IF(INTRO!$E$38=\"Endémique\", IF($H27>0, IF($H27=4,\"Inconnu\", IF($H27=99,\"Interrompu\", $D27)), 0),\"Non requis\")","v":42541},null,{"$f":"IF(INTRO!$E$42=\"Endémique\", IF(AND($J27>1,$J27<5), IF($J27=4, \"Inconnu\", E27+F27), 0),\"Non requis\")","v":17017},{"$f":"IF(INTRO!$E$44=\"Endémique\", IF(AND($K27>0,$K27<5), IF($K27=4,\"Inconnu\", IF($K27=1, $F27*0.33, IF($K27=2, $F27*0.5+$G27*0.2, SUM(F27:G27)))), 0),\"Non requis\")","v":0},1,0,1,0,"MDA4 (ALB/2*ALB)",null,12822,"Etoumbi",null,null,{"$f":"'MDA1'!M27","v":0},{"$f":"'MDA4'!U27","v":21886},{"$f":"'MDA3'!Q27","v":0},null,{"$f":"'MDA4'!M27","v":21886},{"$f":"'MDA4'!Q27","v":0},null,null,null,null,"Etoumbi",37028,-12.959262828800453]
[{"$f":"IF(INTRO!$E$34<>0,INTRO!$E$34,\"\")","v":" Congo"},"Cuvette-Ouest","Ewo",73793,{"$f":"IF(INTRO!$E$48=\"\",\"\",ROUND($D28*INTRO!$E$48,0))","v":11807},{"$f":"IF(INTRO!$E$49=\"\",\"\",ROUND($D28*INTRO!$E$49,0))","v":17710},{"$f":"IF(INTRO!$E$50=\"\",\"\",ROUND($D28*INTRO!$E$50,0))","v":40808},1,4,2,1,1,{"$f":"IF(INTRO!$E$38=\"Endémique\", IF($H28>0, IF($H28=4,\"Inconnu\", IF($H28=99,\"Interrompu\", $D28)), 0),\"Non requis\")","v":73793},null,{"$f":"IF(INTRO!$E$42=\"Endémique\", IF(AND($J28>1,$J28<5), IF($J28=4, \"Inconnu\", E28+F28), 0),\"Non requis\")","v":29517},{"$f":"IF(INTRO!$E$44=\"Endémique\", IF(AND($K28>0,$K28<5), IF($K28=4,\"Inconnu\", IF($K28=1, $F28*0.33, IF($K28=2, $F28*0.5+$G28*0.2, SUM(F28:G28)))), 0),\"Non requis\")","v":5844.3},1,0,1,0,"MDA4 (ALB/2*ALB)",null,12768,"Ewo",null,null,{"$f":"'MDA1'!M28","v":0},{"$f":"'MDA4'!U28","v":25373},{"$f":"'MDA3'!Q28","v":0},null,{"$f":"'MDA4'!M28","v":25373},{"$f":"'MDA4'!Q28","v":0},null,null,null,null,"Ewo",88864,20.423346387868769]
[{"$f":"IF(INTRO!$E$34<>0,INTRO!$E$34,\"\")","v":" Congo"},"Kouilou","Hinda-Loango",47331,{"$f":"IF(INTRO!$E$48=\"\",\"\",ROUND($D29*INTRO!$E$48,0))","v":7573},{"$f":"IF(INTRO!$E$49=\"\",\"\",ROUND($D29*INTRO!$E$49,0))","v":11359},{"$f":"IF(INTRO!$E$50=\"\",\"\",ROUND($D29*INTRO!$E$50,0))","v":26174},0,4,3,2,1,{"$f":"IF(INTRO!$E$38=\"Endémique\", IF($H29>0, IF($H29=4,\"Inconnu\", IF($H29=99,\"Interrompu\", $D29)), 0),\"Non requis\")","v":0},null,{"$f":"IF(INTRO!$E$42=\"Endémique\", IF(AND($J29>1,$J29<5), IF($J29=4, \"Inconnu\", E29+F29), 0),\"Non requis\")","v":18932},{"$f":"IF(INTRO!$E$44=\"Endémique\", IF(AND($K29>0,$K29<5), IF($K29=4,\"Inconnu\", IF($K29=1, $F29*0.33, IF($K29=2, $F29*0.5+$G29*0.2, SUM(F29:G29)))), 0),\"Non requis\")","v":10914.3},0,0,2,0,null,null,12850,"Hinda-Loango",null,null,{"$f":"'MDA1'!M29","v":0},{"$f":"'MDA4'!U29","v":0},{"$f":"'MDA3'!Q29","v":0},null,{"$f":"'MDA4'!M29","v":0},{"$f":"'MDA4'!Q29","v":0},null,null,null,null,"Hinda-Loango",32563,-31.201538103991044]
[{"$f":"IF(INTRO!$E$34<>0,INTRO!$E$34,\"\")","v":" Congo"},"Kouilou","Madingo Kayes-Nzambi",23282,{"$f":"IF(INTRO!$E$48=\"\",\"\",ROUND($D30*INTRO!$E$48,0))","v":3725},{"$f":"IF(INTRO!$E$49=\"\",\"\",ROUND($D30*INTRO!$E$49,0))","v":5588},{"$f":"IF(INTRO!$E$50=\"\",\"\",ROUND($D30*INTRO!$E$50,0))","v":12875},0,4,3,3,1,{"$f":"IF(INTRO!$E$38=\"Endémique\", IF($H30>0, IF($H30=4,\"Inconnu\", IF($H30=99,\"Interrompu\", $D30)), 0),\"Non requis\")","v":0},null,{"$f":"IF(INTRO!$E$42=\"Endémique\", IF(AND($J30>1,$J30<5), IF($J30=4, \"Inconnu\", E30+F30), 0),\"Non requis\")","v":9313},{"$f":"IF(INTRO!$E$44=\"Endémique\", IF(AND($K30>0,$K30<5), IF($K30=4,\"Inconnu\", IF($K30=1, $F30*0.33, IF($K30=2, $F30*0.5+$G30*0.2, SUM(F30:G30)))), 0),\"Non requis\")","v":18463},0,0,2,0,null,null,12849,"Madingo-Kayes Nzambi",null,null,{"$f":"'MDA1'!M30","v":0},{"$f":"'MDA4'!U30","v":0},{"$f":"'MDA3'!Q30","v":0},null,{"$f":"'MDA4'!M30","v":0},{"$f":"'MDA4'!Q30","v":0},null,null,null,null,"Madingo Kayes-Nzambi",143861,517.90653723906871]
[{"$f":"IF(INTRO!$E$34<>0,INTRO!$E$34,\"\")","v":" Congo"},"Kouilou","Mvouti-Kakamouéka",37028,{"$f":"IF(INTRO!$E$48=\"\",\"\",ROUND($D31*INTRO!$E$48,0))","v":5924},{"$f":"IF(INTRO!$E$49=\"\",\"\",ROUND($D31*INTRO!$E$49,0))","v":8887},{"$f":"IF(INTRO!$E$50=\"\",\"\",ROUND($D31*INTRO!$E$50,0))","v":20476},0,1,2,3,1,{"$f":"IF(INTRO!$E$38=\"Endémique\", IF($H31>0, IF($H31=4,\"Inconnu\", IF($H31=99,\"Interrompu\", $D31)), 0),\"Non requis\")","v":0},913,{"$f":"IF(INTRO!$E$42=\"Endémique\", IF(AND($J31>1,$J31<5), IF($J31=4, \"Inconnu\", E31+F31), 0),\"Non requis\")","v":14811},{"$f":"IF(INTRO!$E$44=\"Endémique\", IF(AND($K31>0,$K31<5), IF($K31=4,\"Inconnu\", IF($K31=1, $F31*0.33, IF($K31=2, $F31*0.5+$G31*0.2, SUM(F31:G31)))), 0),\"Non requis\")","v":29363},0,1,1,0,"MDA3 (IVM)",null,12848,"Mvouti-Kakamoueka",null,null,{"$f":"'MDA1'!M31","v":0},{"$f":"'MDA4'!U31","v":0},{"$f":"'MDA3'!Q31","v":801},null,{"$f":"'MDA4'!M31","v":0},{"$f":"'MDA4'!Q31","v":0},null,null,null,null,"Mvouti-Kakamouéka",119962,223.97645025386191]
[{"$f":"IF(INTRO!$E$34<>0,INTRO!$E$34,\"\")","v":" Congo"},"Lékoumou","Sibiti",88864,{"$f":"IF(INTRO!$E$48=\"\",\"\",ROUND($D32*INTRO!$E$48,0))","v":14218},{"$f":"IF(INTRO!$E$49=\"\",\"\",ROUND($D32*INTRO!$E$49,0))","v":21327},{"$f":"IF(INTRO!$E$50=\"\",\"\",ROUND($D32*INTRO!$E$50,0))","v":49142},0,1,2,3,1,{"$f":"IF(INTRO!$E$38=\"Endémique\", IF($H32>0, IF($H32=4,\"Inconnu\", IF($H32=99,\"Interrompu\", $D32)), 0),\"Non requis\")","v":0},720,{"$f":"IF(INTRO!$E$42=\"Endémique\", IF(AND($J32>1,$J32<5), IF($J32=4, \"Inconnu\", E32+F32), 0),\"Non requis\")","v":35545},{"$f":"IF(INTRO!$E$44=\"Endémique\", IF(AND($K32>0,$K32<5), IF($K32=4,\"Inconnu\", IF($K32=1, $F32*0.33, IF($K32=2, $F32*0.5+$G32*0.2, SUM(F32:G32)))), 0),\"Non requis\")","v":70469},0,1,1,0,"MDA3 (IVM)",null,12784,"Sibiti",null,null,{"$f":"'MDA1'!M32","v":0},{"$f":"'MDA4'!U32","v":0},{"$f":"'MDA3'!Q32","v":610},null,{"$f":"'MDA4'!M32","v":0},{"$f":"'MDA4'!Q32","v":0},null,null,null,null,"Sibiti",160182,80.255221462009359]
[{"$f":"IF(INTRO!$E$34<>0,INTRO!$E$34,\"\")","v":" Congo"},"Lékoumou","Zanaga",32563,{"$f":"IF(INTRO!$E$48=\"\",\"\",ROUND($D33*INTRO!$E$48,0))","v":5210},{"$f":"IF(INTRO!$E$49=\"\",\"\",ROUND($D33*INTRO!$E$49,0))","v":7815},{"$f":"IF(INTRO!$E$50=\"\",\"\",ROUND($D33*INTRO!$E$50,0))","v":18007},0,4,2,0,1,{"$f":"IF(INTRO!$E$38=\"Endémique\", IF($H33>0, IF($H33=4,\"Inconnu\", IF($H33=99,\"Interrompu\", $D33)), 0),\"Non requis\")","v":0},null,{"$f":"IF(INTRO!$E$42=\"Endémique\", IF(AND($J33>1,$J33<5), IF($J33=4, \"Inconnu\", E33+F33), 0),\"Non requis\")","v":13025},{"$f":"IF(INTRO!$E$44=\"Endémique\", IF(AND($K33>0,$K33<5), IF($K33=4,\"Inconnu\", IF($K33=1, $F33*0.33, IF($K33=2, $F33*0.5+$G33*0.2, SUM(F33:G33)))), 0),\"Non requis\")","v":0},0,0,1,0,null,null,12785,"Zanaga",null,null,{"$f":"'MDA1'!M33","v":0},{"$f":"'MDA4'!U33","v":0},{"$f":"'MDA3'!Q33","v":0},null,{"$f":"'MDA4'!M33","v":0},{"$f":"'MDA4'!Q33","v":0},null,null,null,null,"Zanaga",65597,101.446426926266]
[{"$f":"IF(INTRO!$E$34<>0,INTRO!$E$34,\"\")","v":" Congo"},"Likouala","Bétou",143861,{"$f":"IF(INTRO!$E$48=\"\",\"\",ROUND($D34*INTRO!$E$48,0))","v":23018},{"$f":"IF(INTRO!$E$49=\"\",\"\",ROUND($D34*INTRO!$E$49,0))","v":34527},{"$f":"IF(INTRO!$E$50=\"\",\"\",ROUND($D34*INTRO!$E$50,0))","v":79555},0,4,2,0,1,{"$f":"IF(INTRO!$E$38=\"Endémique\", IF($H34>0, IF($H34=4,\"Inconnu\", IF($H34=99,\"Interrompu\", $D34)), 0),\"Non requis\")","v":0},null,{"$f":"IF(INTRO!$E$42=\"Endémique\", IF(AND($J34>1,$J34<5), IF($J34=4, \"Inconnu\", E34+F34), 0),\"Non requis\")","v":57545},{"$f":"IF(INTRO!$E$44=\"Endémique\", IF(AND($K34>0,$K34<5), IF($K34=4,\"Inconnu\", IF($K34=1, $F34*0.33, IF($K34=2, $F34*0.5+$G34*0.2, SUM(F34:G34)))), 0),\"Non requis\")","v":0},0,0,1,0,null,null,12786,"Bétou",null,null,{"$f":"'MDA1'!M34","v":0},{"$f":"'MDA4'!U34","v":0},{"$f":"'MDA3'!Q34","v":0},null,{"$f":"'MDA4'!M34","v":0},{"$f":"'MDA4'!Q34","v":0},null,null,null,null,"Bétou",39084,-72.832108771661524]
[{"$f":"IF(INTRO!$E$34<>0,INTRO!$E$34,\"\")","v":" Congo"},"Likouala","Impfondo",119962,{"$f":"IF(INTRO!$E$48=\"\",\"\",ROUND($D35*INTRO!$E$48,0))","v":19194},{"$f":"IF(INTRO!$E$49=\"\",\"\",ROUND($D35*INTRO!$E$49,0))","v":28791},{"$f":"IF(INTRO!$E$50=\"\",\"\",ROUND($D35*INTRO!$E$50,0))","v":66339},1,4,2,0,1,{"$f":"IF(INTRO!$E$38=\"Endémique\", IF($H35>0, IF($H35=4,\"Inconnu\", IF($H35=99,\"Interrompu\", $D35)), 0),\"Non requis\")","v":119962},null,{"$f":"IF(INTRO!$E$42=\"Endémique\", IF(AND($J35>1,$J35<5), IF($J35=4, \"Inconnu\", E35+F35), 0),\"Non requis\")","v":47985},{"$f":"IF(INTRO!$E$44=\"Endémique\", IF(AND($K35>0,$K35<5), IF($K35=4,\"Inconnu\", IF($K35=1, $F35*0.33, IF($K35=2, $F35*0.5+$G35*0.2, SUM(F35:G35)))), 0),\"Non requis\")","v":0},1,0,1,0,"MDA4 (ALB/2*ALB)",null,12789,"Impfondo",null,null,{"$f":"'MDA1'!M35","v":0},{"$f":"'MDA4'!U35","v":57947},{"$f":"'MDA3'!Q35","v":0},null,{"$f":"'MDA4'!M35","v":57947},{"$f":"'MDA4'!Q35","v":0},null,null,null,null,"Impfondo",16134,-86.550741068004868]
[{"$f":"IF(INTRO!$E$34<>0,INTRO!$E$34,\"\")","v":" Congo"},"Niari","Dolisie",160182,{"$f":"IF(INTRO!$E$48=\"\",\"\",ROUND($D36*INTRO!$E$48,0))","v":25629},{"$f":"IF(INTRO!$E$49=\"\",\"\",ROUND($D36*INTRO!$E$49,0))","v":38444},{"$f":"IF(INTRO!$E$50=\"\",\"\",ROUND($D36*INTRO!$E$50,0))","v":88581},1,1,2,2,1,{"$f":"IF(INTRO!$E$38=\"Endémique\", IF($H36>0, IF($H36=4,\"Inconnu\", IF($H36=99,\"Interrompu\", $D36)), 0),\"Non requis\")","v":160182},10925,{"$f":"IF(INTRO!$E$42=\"Endémique\", IF(AND($J36>1,$J36<5), IF($J36=4, \"Inconnu\", E36+F36), 0),\"Non requis\")","v":64073},{"$f":"IF(INTRO!$E$44=\"Endémique\", IF(AND($K36>0,$K36<5), IF($K36=4,\"Inconnu\", IF($K36=1, $F36*0.33, IF($K36=2, $F36*0.5+$G36*0.2, SUM(F36:G36)))), 0),\"Non requis\")","v":36938.199999999997},1,1,1,0,"MDA1 (IVM+ALB)",null,12835,"Dolisie",null,null,{"$f":"'MDA1'!M36","v":9613},{"$f":"'MDA4'!U36","v":79969},{"$f":"'MDA3'!Q36","v":0},null,{"$f":"'MDA4'!M36","v":67021},{"$f":"'MDA4'!Q36","v":79969},null,null,null,null,"Dolisie",46443,-71.006105554931267]
[{"$f":"IF(INTRO!$E$34<>0,INTRO!$E$34,\"\")","v":" Congo"},"Niari","Kibangou",65597,{"$f":"IF(INTRO!$E$48=\"\",\"\",ROUND($D37*INTRO!$E$48,0))","v":10496},{"$f":"IF(INTRO!$E$49=\"\",\"\",ROUND($D37*INTRO!$E$49,0))","v":15743},{"$f":"IF(INTRO!$E$50=\"\",\"\",ROUND($D37*INTRO!$E$50,0))","v":36275},1,1,3,1,1,{"$f":"IF(INTRO!$E$38=\"Endémique\", IF($H37>0, IF($H37=4,\"Inconnu\", IF($H37=99,\"Interrompu\", $D37)), 0),\"Non requis\")","v":65597},9899,{"$f":"IF(INTRO!$E$42=\"Endémique\", IF(AND($J37>1,$J37<5), IF($J37=4, \"Inconnu\", E37+F37), 0),\"Non requis\")","v":26239},{"$f":"IF(INTRO!$E$44=\"Endémique\", IF(AND($K37>0,$K37<5), IF($K37=4,\"Inconnu\", IF($K37=1, $F37*0.33, IF($K37=2, $F37*0.5+$G37*0.2, SUM(F37:G37)))), 0),\"Non requis\")","v":5195.1900000000005},1,1,2,0,"MDA1 (IVM+ALB)",null,12791,"Kibangou",null,null,{"$f":"'MDA1'!M37","v":8079},{"$f":"'MDA4'!U37","v":19485.32},{"$f":"'MDA3'!Q37","v":0},null,{"$f":"'MDA4'!M37","v":18608},{"$f":"'MDA4'!Q37","v":18783},null,null,null,null,"Kibangou",44628,-31.966400902480295]
[{"$f":"IF(INTRO!$E$34<>0,INTRO!$E$34,\"\")","v":" Congo"},"Niari","Kimongo-Londela Nkayes",39084,{"$f":"IF(INTRO!$E$48=\"\",\"\",ROUND($D38*INTRO!$E$48,0))","v":6253},{"$f":"IF(INTRO!$E$49=\"\",\"\",ROUND($D38*INTRO!$E$49,0))","v":9380},{"$f":"IF(INTRO!$E$50=\"\",\"\",ROUND($D38*INTRO!$E$50,0))","v":21613},1,4,3,2,1,{"$f":"IF(INTRO!$E$38=\"Endémique\", IF($H38>0, IF($H38=4,\"Inconnu\", IF($H38=99,\"Interrompu\", $D38)), 0),\"Non requis\")","v":39084},null,{"$f":"IF(INTRO!$E$42=\"Endémique\", IF(AND($J38>1,$J38<5), IF($J38=4, \"Inconnu\", E38+F38), 0),\"Non requis\")","v":15633},{"$f":"IF(INTRO!$E$44=\"Endémique\", IF(AND($K38>0,$K38<5), IF($K38=4,\"Inconnu\", IF($K38=1, $F38*0.33, IF($K38=2, $F38*0.5+$G38*0.2, SUM(F38:G38)))), 0),\"Non requis\")","v":9012.6},1,0,2,0,"MDA4 (ALB/2*ALB)",null,12836,"Kimongo-Londela Nkayes",null,null,{"$f":"'MDA1'!M38","v":0},{"$f":"'MDA4'!U38","v":22352},{"$f":"'MDA3'!Q38","v":0},null,{"$f":"'MDA4'!M38","v":17045},{"$f":"'MDA4'!Q38","v":22352},null,null,null,null,"Kimongo-Londela Nkayes",48376,23.774434551223006]
[{"$f":"IF(INTRO!$E$34<>0,INTRO!$E$34,\"\")","v":" Congo"},"Niari","Mayoko",16134,{"$f":"IF(INTRO!$E$48=\"\",\"\",ROUND($D39*INTRO!$E$48,0))","v":2581},{"$f":"IF(INTRO!$E$49=\"\",\"\",ROUND($D39*INTRO!$E$49,0))","v":3872},{"$f":"IF(INTRO!$E$50=\"\",\"\",ROUND($D39*INTRO!$E$50,0))","v":8922},0,4,2,0,1,{"$f":"IF(INTRO!$E$38=\"Endémique\", IF($H39>0, IF($H39=4,\"Inconnu\", IF($H39=99,\"Interrompu\", $D39)), 0),\"Non requis\")","v":0},null,{"$f":"IF(INTRO!$E$42=\"Endémique\", IF(AND($J39>1,$J39<5), IF($J39=4, \"Inconnu\", E39+F39), 0),\"Non requis\")","v":6453},{"$f":"IF(INTRO!$E$44=\"Endémique\", IF(AND($K39>0,$K39<5), IF($K39=4,\"Inconnu\", IF($K39=1, $F39*0.33, IF($K39=2, $F39*0.5+$G39*0.2, SUM(F39:G39)))), 0),\"Non requis\")","v":0},0,0,1,0,null,null,12838,"Mayoko",null,null,{"$f":"'MDA1'!M39","v":0},{"$f":"'MDA4'!U39","v":0},{"$f":"'MDA3'!Q39","v":0},null,{"$f":"'MDA4'!M39","v":0},{"$f":"'MDA4'!Q39","v":0},null,null,null,null,"Mayoko",99870,519.00334696913353]
[{"$f":"IF(INTRO!$E$34<>0,INTRO!$E$34,\"\")","v":" Congo"},"Niari","Mossendjo",46443,{"$f":"IF(INTRO!$E$48=\"\",\"\",ROUND($D40*INTRO!$E$48,0))","v":7431},{"$f":"IF(INTRO!$E$49=\"\",\"\",ROUND($D40*INTRO!$E$49,0))","v":11146},{"$f":"IF(INTRO!$E$50=\"\",\"\",ROUND($D40*INTRO!$E$50,0))","v":25683},0,4,2,0,1,{"$f":"IF(INTRO!$E$38=\"Endémique\", IF($H40>0, IF($H40=4,\"Inconnu\", IF($H40=99,\"Interrompu\", $D40)), 0),\"Non requis\")","v":0},null,{"$f":"IF(INTRO!$E$42=\"Endémique\", IF(AND($J40>1,$J40<5), IF($J40=4, \"Inconnu\", E40+F40), 0),\"Non requis\")","v":18577},{"$f":"IF(INTRO!$E$44=\"Endémique\", IF(AND($K40>0,$K40<5), IF($K40=4,\"Inconnu\", IF($K40=1, $F40*0.33, IF($K40=2, $F40*0.5+$G40*0.2, SUM(F40:G40)))), 0),\"Non requis\")","v":0},0,0,1,0,null,null,12837,"Mossendjo",null,null,{"$f":"'MDA1'!M40","v":0},{"$f":"'MDA4'!U40","v":0},{"$f":"'MDA3'!Q40","v":0},null,{"$f":"'MDA4'!M40","v":0},{"$f":"'MDA4'!Q40","v":0},null,null,null,null,"Mossendjo",36788,-20.78892405744676]
[{"$f":"IF(INTRO!$E$34<>0,INTRO!$E$34,\"\")","v":" Congo"},"Plateaux","Abala",44628,{"$f":"IF(INTRO!$E$48=\"\",\"\",ROUND($D41*INTRO!$E$48,0))","v":7140},{"$f":"IF(INTRO!$E$49=\"\",\"\",ROUND($D41*INTRO!$E$49,0))","v":10711},{"$f":"IF(INTRO!$E$50=\"\",\"\",ROUND($D41*INTRO!$E$50,0))","v":24679},0,4,1,0,1,{"$f":"IF(INTRO!$E$38=\"Endémique\", IF($H41>0, IF($H41=4,\"Inconnu\", IF($H41=99,\"Interrompu\", $D41)), 0),\"Non requis\")","v":0},null,{"$f":"IF(INTRO!$E$42=\"Endémique\", IF(AND($J41>1,$J41<5), IF($J41=4, \"Inconnu\", E41+F41), 0),\"Non requis\")","v":0},{"$f":"IF(INTRO!$E$44=\"Endémique\", IF(AND($K41>0,$K41<5), IF($K41=4,\"Inconnu\", IF($K41=1, $F41*0.33, IF($K41=2, $F41*0.5+$G41*0.2, SUM(F41:G41)))), 0),\"Non requis\")","v":0},0,0,0,0,null,null,12830,"Abala",null,null,{"$f":"'MDA1'!M41","v":0},{"$f":"'MDA4'!U41","v":0},{"$f":"'MDA3'!Q41","v":0},null,{"$f":"'MDA4'!M41","v":0},{"$f":"'MDA4'!Q41","v":0},null,null,null,null,"Abala",277201,521.13695437841704]
[{"$f":"IF(INTRO!$E$34<>0,INTRO!$E$34,\"\")","v":" Congo"},"Plateaux","Djambala-Lékana",48376,{"$f":"IF(INTRO!$E$48=\"\",\"\",ROUND($D42*INTRO!$E$48,0))","v":7740},{"$f":"IF(INTRO!$E$49=\"\",\"\",ROUND($D42*INTRO!$E$49,0))","v":11610},{"$f":"IF(INTRO!$E$50=\"\",\"\",ROUND($D42*INTRO!$E$50,0))","v":26752},0,4,3,0,1,{"$f":"IF(INTRO!$E$38=\"Endémique\", IF($H42>0, IF($H42=4,\"Inconnu\", IF($H42=99,\"Interrompu\", $D42)), 0),\"Non requis\")","v":0},null,{"$f":"IF(INTRO!$E$42=\"Endémique\", IF(AND($J42>1,$J42<5), IF($J42=4, \"Inconnu\", E42+F42), 0),\"Non requis\")","v":19350},{"$f":"IF(INTRO!$E$44=\"Endémique\", IF(AND($K42>0,$K42<5), IF($K42=4,\"Inconnu\", IF($K42=1, $F42*0.33, IF($K42=2, $F42*0.5+$G42*0.2, SUM(F42:G42)))), 0),\"Non requis\")","v":0},0,0,2,0,null,null,12839,"Djambala-Lékana",null,null,{"$f":"'MDA1'!M42","v":0},{"$f":"'MDA4'!U42","v":0},{"$f":"'MDA3'!Q42","v":0},null,{"$f":"'MDA4'!M42","v":0},{"$f":"'MDA4'!Q42","v":0},null,null,null,null,"Djambala-Lékana",174472,260.65817760873159]
[{"$f":"IF(INTRO!$E$34<>0,INTRO!$E$34,\"\")","v":" Congo"},"Plateaux","Gamboma",99870,{"$f":"IF(INTRO!$E$48=\"\",\"\",ROUND($D43*INTRO!$E$48,0))","v":15979},{"$f":"IF(INTRO!$E$49=\"\",\"\",ROUND($D43*INTRO!$E$49,0))","v":23969},{"$f":"IF(INTRO!$E$50=\"\",\"\",ROUND($D43*INTRO!$E$50,0))","v":55228},0,4,2,0,1,{"$f":"IF(INTRO!$E$38=\"Endémique\", IF($H43>0, IF($H43=4,\"Inconnu\", IF($H43=99,\"Interrompu\", $D43)), 0),\"Non requis\")","v":0},null,{"$f":"IF(INTRO!$E$42=\"Endémique\", IF(AND($J43>1,$J43<5), IF($J43=4, \"Inconnu\", E43+F43), 0),\"Non requis\")","v":39948},{"$f":"IF(INTRO!$E$44=\"Endémique\", IF(AND($K43>0,$K43<5), IF($K43=4,\"Inconnu\", IF($K43=1, $F43*0.33, IF($K43=2, $F43*0.5+$G43*0.2, SUM(F43:G43)))), 0),\"Non requis\")","v":0},0,0,1,0,null,null,12798,"Gamboma",null,null,{"$f":"'MDA1'!M43","v":0},{"$f":"'MDA4'!U43","v":0},{"$f":"'MDA3'!Q43","v":0},null,{"$f":"'MDA4'!M43","v":0},{"$f":"'MDA4'!Q43","v":0},null,null,null,null,"Gamboma",183072,83.310303394412728]
[{"$f":"IF(INTRO!$E$34<>0,INTRO!$E$34,\"\")","v":" Congo"},"Plateaux","Ngo Mpouya",36788,{"$f":"IF(INTRO!$E$48=\"\",\"\",ROUND($D44*INTRO!$E$48,0))","v":5886},{"$f":"IF(INTRO!$E$49=\"\",\"\",ROUND($D44*INTRO!$E$49,0))","v":8829},{"$f":"IF(INTRO!$E$50=\"\",\"\",ROUND($D44*INTRO!$E$50,0))","v":20344},0,4,3,0,1,{"$f":"IF(INTRO!$E$38=\"Endémique\", IF($H44>0, IF($H44=4,\"Inconnu\", IF($H44=99,\"Interrompu\", $D44)), 0),\"Non requis\")","v":0},null,{"$f":"IF(INTRO!$E$42=\"Endémique\", IF(AND($J44>1,$J44<5), IF($J44=4, \"Inconnu\", E44+F44), 0),\"Non requis\")","v":14715},{"$f":"IF(INTRO!$E$44=\"Endémique\", IF(AND($K44>0,$K44<5), IF($K44=4,\"Inconnu\", IF($K44=1, $F44*0.33, IF($K44=2, $F44*0.5+$G44*0.2, SUM(F44:G44)))), 0),\"Non requis\")","v":0},0,0,2,0,null,null,12840,"Ngo-Mpouya",null,null,{"$f":"'MDA1'!M44","v":0},{"$f":"'MDA4'!U44","v":0},{"$f":"'MDA3'!Q44","v":0},null,{"$f":"'MDA4'!M44","v":0},{"$f":"'MDA4'!Q44","v":0},null,null,null,null,"Ngo Mpouya",117866,220.39251929977169]
[{"$f":"IF(INTRO!$E$34<>0,INTRO!$E$34,\"\")","v":" Congo"},"Pointe-Noire","Loandjili",277201,{"$f":"IF(INTRO!$E$48=\"\",\"\",ROUND($D45*INTRO!$E$48,0))","v":44352},{"$f":"IF(INTRO!$E$49=\"\",\"\",ROUND($D45*INTRO!$E$49,0))","v":66528},{"$f":"IF(INTRO!$E$50=\"\",\"\",ROUND($D45*INTRO!$E$50,0))","v":153292},0,4,1,1,1,{"$f":"IF(INTRO!$E$38=\"Endémique\", IF($H45>0, IF($H45=4,\"Inconnu\", IF($H45=99,\"Interrompu\", $D45)), 0),\"Non requis\")","v":0},null,{"$f":"IF(INTRO!$E$42=\"Endémique\", IF(AND($J45>1,$J45<5), IF($J45=4, \"Inconnu\", E45+F45), 0),\"Non requis\")","v":0},{"$f":"IF(INTRO!$E$44=\"Endémique\", IF(AND($K45>0,$K45<5), IF($K45=4,\"Inconnu\", IF($K45=1, $F45*0.33, IF($K45=2, $F45*0.5+$G45*0.2, SUM(F45:G45)))), 0),\"Non requis\")","v":21954.240000000002},0,0,0,0,null,null,12777,"Loandjili",null,null,{"$f":"'MDA1'!M45","v":0},{"$f":"'MDA4'!U45","v":0},{"$f":"'MDA3'!Q45","v":0},null,{"$f":"'MDA4'!M45","v":0},{"$f":"'MDA4'!Q45","v":0},null,null,null,null,"Loandjili",200893,-27.528039220637734]
[{"$f":"IF(INTRO!$E$34<>0,INTRO!$E$34,\"\")","v":" Congo"},"Pointe-Noire","Lumumba",174472,{"$f":"IF(INTRO!$E$48=\"\",\"\",ROUND($D46*INTRO!$E$48,0))","v":27916},{"$f":"IF(INTRO!$E$49=\"\",\"\",ROUND($D46*INTRO!$E$49,0))","v":41873},{"$f":"IF(INTRO!$E$50=\"\",\"\",ROUND($D46*INTRO!$E$50,0))","v":96483},0,4,1,1,1,{"$f":"IF(INTRO!$E$38=\"Endémique\", IF($H46>0, IF($H46=4,\"Inconnu\", IF($H46=99,\"Interrompu\", $D46)), 0),\"Non requis\")","v":0},null,{"$f":"IF(INTRO!$E$42=\"Endémique\", IF(AND($J46>1,$J46<5), IF($J46=4, \"Inconnu\", E46+F46), 0),\"Non requis\")","v":0},{"$f":"IF(INTRO!$E$44=\"Endémique\", IF(AND($K46>0,$K46<5), IF($K46=4,\"Inconnu\", IF($K46=1, $F46*0.33, IF($K46=2, $F46*0.5+$G46*0.2, SUM(F46:G46)))), 0),\"Non requis\")","v":13818.09},0,0,0,0,null,null,12778,"Lumumba",null,null,{"$f":"'MDA1'!M46","v":0},{"$f":"'MDA4'!U46","v":0},{"$f":"'MDA3'!Q46","v":0},null,{"$f":"'MDA4'!M46","v":0},{"$f":"'MDA4'!Q46","v":0},null,null,null,null,"Lumumba",26669,-84.714452748865142]
[{"$f":"IF(INTRO!$E$34<>0,INTRO!$E$34,\"\")","v":" Congo"},"Pointe-Noire","Mongo-Poukou",183072,{"$f":"IF(INTRO!$E$48=\"\",\"\",ROUND($D47*INTRO!$E$48,0))","v":29292},{"$f":"IF(INTRO!$E$49=\"\",\"\",ROUND($D47*INTRO!$E$49,0))","v":43937},{"$f":"IF(INTRO!$E$50=\"\",\"\",ROUND($D47*INTRO!$E$50,0))","v":101239},0,4,1,4,1,{"$f":"IF(INTRO!$E$38=\"Endémique\", IF($H47>0, IF($H47=4,\"Inconnu\", IF($H47=99,\"Interrompu\", $D47)), 0),\"Non requis\")","v":0},null,{"$f":"IF(INTRO!$E$42=\"Endémique\", IF(AND($J47>1,$J47<5), IF($J47=4, \"Inconnu\", E47+F47), 0),\"Non requis\")","v":0},{"$f":"IF(INTRO!$E$44=\"Endémique\", IF(AND($K47>0,$K47<5), IF($K47=4,\"Inconnu\", IF($K47=1, $F47*0.33, IF($K47=2, $F47*0.5+$G47*0.2, SUM(F47:G47)))), 0),\"Non requis\")","v":"Inconnu"},0,0,0,0,null,null,12825,"Mongo-Mpoukou",null,null,{"$f":"'MDA1'!M47","v":0},{"$f":"'MDA4'!U47","v":0},{"$f":"'MDA3'!Q47","v":0},null,{"$f":"'MDA4'!M47","v":0},{"$f":"'MDA4'!Q47","v":0},null,null,null,null,"Mongo-Poukou",246085,34.419791120433487]
[{"$f":"IF(INTRO!$E$34<>0,INTRO!$E$34,\"\")","v":" Congo"},"Pointe-Noire","Mvoumvou",117866,{"$f":"IF(INTRO!$E$48=\"\",\"\",ROUND($D48*INTRO!$E$48,0))","v":18859},{"$f":"IF(INTRO!$E$49=\"\",\"\",ROUND($D48*INTRO!$E$49,0))","v":28288},{"$f":"IF(INTRO!$E$50=\"\",\"\",ROUND($D48*INTRO!$E$50,0))","v":65180},0,4,1,4,1,{"$f":"IF(INTRO!$E$38=\"Endémique\", IF($H48>0, IF($H48=4,\"Inconnu\", IF($H48=99,\"Interrompu\", $D48)), 0),\"Non requis\")","v":0},null,{"$f":"IF(INTRO!$E$42=\"Endémique\", IF(AND($J48>1,$J48<5), IF($J48=4, \"Inconnu\", E48+F48), 0),\"Non requis\")","v":0},{"$f":"IF(INTRO!$E$44=\"Endémique\", IF(AND($K48>0,$K48<5), IF($K48=4,\"Inconnu\", IF($K48=1, $F48*0.33, IF($K48=2, $F48*0.5+$G48*0.2, SUM(F48:G48)))), 0),\"Non requis\")","v":"Inconnu"},0,0,0,0,null,null,12780,"Mvoumvou",null,null,{"$f":"'MDA1'!M48","v":0},{"$f":"'MDA4'!U48","v":0},{"$f":"'MDA3'!Q48","v":0},null,{"$f":"'MDA4'!M48","v":0},{"$f":"'MDA4'!Q48","v":0},null,null,null,null,"Mvoumvou",28732,-75.623165289396439]
[{"$f":"IF(INTRO!$E$34<>0,INTRO!$E$34,\"\")","v":" Congo"},"Pointe-Noire","Ngoyo",200893,{"$f":"IF(INTRO!$E$48=\"\",\"\",ROUND($D49*INTRO!$E$48,0))","v":32143},{"$f":"IF(INTRO!$E$49=\"\",\"\",ROUND($D49*INTRO!$E$49,0))","v":48214},{"$f":"IF(INTRO!$E$50=\"\",\"\",ROUND($D49*INTRO!$E$50,0))","v":111094},0,4,2,0,1,{"$f":"IF(INTRO!$E$38=\"Endémique\", IF($H49>0, IF($H49=4,\"Inconnu\", IF($H49=99,\"Interrompu\", $D49)), 0),\"Non requis\")","v":0},null,{"$f":"IF(INTRO!$E$42=\"Endémique\", IF(AND($J49>1,$J49<5), IF($J49=4, \"Inconnu\", E49+F49), 0),\"Non requis\")","v":80357},{"$f":"IF(INTRO!$E$44=\"Endémique\", IF(AND($K49>0,$K49<5), IF($K49=4,\"Inconnu\", IF($K49=1, $F49*0.33, IF($K49=2, $F49*0.5+$G49*0.2, SUM(F49:G49)))), 0),\"Non requis\")","v":0},0,0,1,0,null,null,12826,"Ngoyo",null,null,{"$f":"'MDA1'!M49","v":0},{"$f":"'MDA4'!U49","v":0},{"$f":"'MDA3'!Q49","v":0},null,{"$f":"'MDA4'!M49","v":0},{"$f":"'MDA4'!Q49","v":0},null,null,null,null,"Ngoyo",36246,-81.957559496846571]
[{"$f":"IF(INTRO!$E$34<>0,INTRO!$E$34,\"\")","v":" Congo"},"Pointe-Noire","Tchiamba Nzassi",26669,{"$f":"IF(INTRO!$E$48=\"\",\"\",ROUND($D50*INTRO!$E$48,0))","v":4267},{"$f":"IF(INTRO!$E$49=\"\",\"\",ROUND($D50*INTRO!$E$49,0))","v":6401},{"$f":"IF(INTRO!$E$50=\"\",\"\",ROUND($D50*INTRO!$E$50,0))","v":14748},0,4,2,1,1,{"$f":"IF(INTRO!$E$38=\"Endémique\", IF($H50>0, IF($H50=4,\"Inconnu\", IF($H50=99,\"Interrompu\", $D50)), 0),\"Non requis\")","v":0},null,{"$f":"IF(INTRO!$E$42=\"Endémique\", IF(AND($J50>1,$J50<5), IF($J50=4, \"Inconnu\", E50+F50), 0),\"Non requis\")","v":10668},{"$f":"IF(INTRO!$E$44=\"Endémique\", IF(AND($K50>0,$K50<5), IF($K50=4,\"Inconnu\", IF($K50=1, $F50*0.33, IF($K50=2, $F50*0.5+$G50*0.2, SUM(F50:G50)))), 0),\"Non requis\")","v":2112.33},0,0,1,0,null,null,12842,"Tchiamba Nzassi",null,null,{"$f":"'MDA1'!M50","v":0},{"$f":"'MDA4'!U50","v":0},{"$f":"'MDA3'!Q50","v":0},null,{"$f":"'MDA4'!M50","v":0},{"$f":"'MDA4'!Q50","v":0},null,null,null,null,"Tchiamba Nzassi",77529,190.70831302261053]
[{"$f":"IF(INTRO!$E$34<>0,INTRO!$E$34,\"\")","v":" Congo"},"Pointe-Noire","Tie-Tie",246085,{"$f":"IF(INTRO!$E$48=\"\",\"\",ROUND($D51*INTRO!$E$48,0))","v":39374},{"$f":"IF(INTRO!$E$49=\"\",\"\",ROUND($D51*INTRO!$E$49,0))","v":59060},{"$f":"IF(INTRO!$E$50=\"\",\"\",ROUND($D51*INTRO!$E$50,0))","v":136085},0,4,1,0,1,{"$f":"IF(INTRO!$E$38=\"Endémique\", IF($H51>0, IF($H51=4,\"Inconnu\", IF($H51=99,\"Interrompu\", $D51)), 0),\"Non requis\")","v":0},null,{"$f":"IF(INTRO!$E$42=\"Endémique\", IF(AND($J51>1,$J51<5), IF($J51=4, \"Inconnu\", E51+F51), 0),\"Non requis\")","v":0},{"$f":"IF(INTRO!$E$44=\"Endémique\", IF(AND($K51>0,$K51<5), IF($K51=4,\"Inconnu\", IF($K51=1, $F51*0.33, IF($K51=2, $F51*0.5+$G51*0.2, SUM(F51:G51)))), 0),\"Non requis\")","v":0},0,0,0,0,null,null,12841,"Tié-Tié",null,null,{"$f":"'MDA1'!M51","v":0},{"$f":"'MDA4'!U51","v":0},{"$f":"'MDA3'!Q51","v":0},null,{"$f":"'MDA4'!M51","v":0},{"$f":"'MDA4'!Q51","v":0},null,null,null,null,"Tie-Tie",31516,-87.193043054229221]
[{"$f":"IF(INTRO!$E$34<>0,INTRO!$E$34,\"\")","v":" Congo"},"Pool","Boko",28732,{"$f":"IF(INTRO!$E$48=\"\",\"\",ROUND($D52*INTRO!$E$48,0))","v":4597},{"$f":"IF(INTRO!$E$49=\"\",\"\",ROUND($D52*INTRO!$E$49,0))","v":6896},{"$f":"IF(INTRO!$E$50=\"\",\"\",ROUND($D52*INTRO!$E$50,0))","v":15889},0,1,2,0,1,{"$f":"IF(INTRO!$E$38=\"Endémique\", IF($H52>0, IF($H52=4,\"Inconnu\", IF($H52=99,\"Interrompu\", $D52)), 0),\"Non requis\")","v":0},17828,{"$f":"IF(INTRO!$E$42=\"Endémique\", IF(AND($J52>1,$J52<5), IF($J52=4, \"Inconnu\", E52+F52), 0),\"Non requis\")","v":11493},{"$f":"IF(INTRO!$E$44=\"Endémique\", IF(AND($K52>0,$K52<5), IF($K52=4,\"Inconnu\", IF($K52=1, $F52*0.33, IF($K52=2, $F52*0.5+$G52*0.2, SUM(F52:G52)))), 0),\"Non requis\")","v":0},0,1,1,0,"MDA3 (IVM)",null,12844,"Boko",null,null,{"$f":"'MDA1'!M52","v":0},{"$f":"'MDA4'!U52","v":0},{"$f":"'MDA3'!Q52","v":15330},null,{"$f":"'MDA4'!M52","v":0},{"$f":"'MDA4'!Q52","v":0},null,null,null,null,"BOKO",43704,52.109146596129754]
[{"$f":"IF(INTRO!$E$34<>0,INTRO!$E$34,\"\")","v":" Congo"},"Pool","Goma tsétsé",36246,{"$f":"IF(INTRO!$E$48=\"\",\"\",ROUND($D53*INTRO!$E$48,0))","v":5799},{"$f":"IF(INTRO!$E$49=\"\",\"\",ROUND($D53*INTRO!$E$49,0))","v":8699},{"$f":"IF(INTRO!$E$50=\"\",\"\",ROUND($D53*INTRO!$E$50,0))","v":20044},0,1,1,0,1,{"$f":"IF(INTRO!$E$38=\"Endémique\", IF($H53>0, IF($H53=4,\"Inconnu\", IF($H53=99,\"Interrompu\", $D53)), 0),\"Non requis\")","v":0},28276,{"$f":"IF(INTRO!$E$42=\"Endémique\", IF(AND($J53>1,$J53<5), IF($J53=4, \"Inconnu\", E53+F53), 0),\"Non requis\")","v":0},{"$f":"IF(INTRO!$E$44=\"Endémique\", IF(AND($K53>0,$K53<5), IF($K53=4,\"Inconnu\", IF($K53=1, $F53*0.33, IF($K53=2, $F53*0.5+$G53*0.2, SUM(F53:G53)))), 0),\"Non requis\")","v":0},0,1,0,0,"MDA3 (IVM)",null,12802,"Goma Tsétsé",null,null,{"$f":"'MDA1'!M53","v":0},{"$f":"'MDA4'!U53","v":0},{"$f":"'MDA3'!Q53","v":20840},null,{"$f":"'MDA4'!M53","v":0},{"$f":"'MDA4'!Q53","v":0},null,null,null,null,"Goma tsétsé",27100,-25.233129172874246]
[{"$f":"IF(INTRO!$E$34<>0,INTRO!$E$34,\"\")","v":" Congo"},"Pool","Ignié",77529,{"$f":"IF(INTRO!$E$48=\"\",\"\",ROUND($D54*INTRO!$E$48,0))","v":12405},{"$f":"IF(INTRO!$E$49=\"\",\"\",ROUND($D54*INTRO!$E$49,0))","v":18607},{"$f":"IF(INTRO!$E$50=\"\",\"\",ROUND($D54*INTRO!$E$50,0))","v":42874},1,1,2,1,1,{"$f":"IF(INTRO!$E$38=\"Endémique\", IF($H54>0, IF($H54=4,\"Inconnu\", IF($H54=99,\"Interrompu\", $D54)), 0),\"Non requis\")","v":77529},3135,{"$f":"IF(INTRO!$E$42=\"Endémique\", IF(AND($J54>1,$J54<5), IF($J54=4, \"Inconnu\", E54+F54), 0),\"Non requis\")","v":31012},{"$f":"IF(INTRO!$E$44=\"Endémique\", IF(AND($K54>0,$K54<5), IF($K54=4,\"Inconnu\", IF($K54=1, $F54*0.33, IF($K54=2, $F54*0.5+$G54*0.2, SUM(F54:G54)))), 0),\"Non requis\")","v":6140.31},1,1,1,0,"MDA1 (IVM+ALB)",null,12828,"Ignié",null,null,{"$f":"'MDA1'!M54","v":2696},{"$f":"'MDA4'!U54","v":46557.600000000006},{"$f":"'MDA3'!Q54","v":0},null,{"$f":"'MDA4'!M54","v":42864},{"$f":"'MDA4'!Q54","v":45468},null,null,null,null,"Ignié",48000,-38.087683318500176]
[{"$f":"IF(INTRO!$E$34<>0,INTRO!$E$34,\"\")","v":" Congo"},"Pool","Kindamba",31516,{"$f":"IF(INTRO!$E$48=\"\",\"\",ROUND($D55*INTRO!$E$48,0))","v":5043},{"$f":"IF(INTRO!$E$49=\"\",\"\",ROUND($D55*INTRO!$E$49,0))","v":7564},{"$f":"IF(INTRO!$E$50=\"\",\"\",ROUND($D55*INTRO!$E$50,0))","v":17428},0,1,2,0,1,{"$f":"IF(INTRO!$E$38=\"Endémique\", IF($H55>0, IF($H55=4,\"Inconnu\", IF($H55=99,\"Interrompu\", $D55)), 0),\"Non requis\")","v":0},5566,{"$f":"IF(INTRO!$E$42=\"Endémique\", IF(AND($J55>1,$J55<5), IF($J55=4, \"Inconnu\", E55+F55), 0),\"Non requis\")","v":12607},{"$f":"IF(INTRO!$E$44=\"Endémique\", IF(AND($K55>0,$K55<5), IF($K55=4,\"Inconnu\", IF($K55=1, $F55*0.33, IF($K55=2, $F55*0.5+$G55*0.2, SUM(F55:G55)))), 0),\"Non requis\")","v":0},0,1,1,0,"MDA3 (IVM)",null,12803,"Kindamba",null,null,{"$f":"'MDA1'!M55","v":0},{"$f":"'MDA4'!U55","v":0},{"$f":"'MDA3'!Q55","v":4910},null,{"$f":"'MDA4'!M55","v":0},{"$f":"'MDA4'!Q55","v":0},null,null,null,null,"Kindamba",77357,145.45310318568346]
[{"$f":"IF(INTRO!$E$34<>0,INTRO!$E$34,\"\")","v":" Congo"},"Pool","Kinkala",43704,{"$f":"IF(INTRO!$E$48=\"\",\"\",ROUND($D56*INTRO!$E$48,0))","v":6993},{"$f":"IF(INTRO!$E$49=\"\",\"\",ROUND($D56*INTRO!$E$49,0))","v":10489},{"$f":"IF(INTRO!$E$50=\"\",\"\",ROUND($D56*INTRO!$E$50,0))","v":24168},0,1,2,0,1,{"$f":"IF(INTRO!$E$38=\"Endémique\", IF($H56>0, IF($H56=4,\"Inconnu\", IF($H56=99,\"Interrompu\", $D56)), 0),\"Non requis\")","v":0},18023,{"$f":"IF(INTRO!$E$42=\"Endémique\", IF(AND($J56>1,$J56<5), IF($J56=4, \"Inconnu\", E56+F56), 0),\"Non requis\")","v":17482},{"$f":"IF(INTRO!$E$44=\"Endémique\", IF(AND($K56>0,$K56<5), IF($K56=4,\"Inconnu\", IF($K56=1, $F56*0.33, IF($K56=2, $F56*0.5+$G56*0.2, SUM(F56:G56)))), 0),\"Non requis\")","v":0},0,1,1,0,"MDA3 (IVM)",null,12843,"Kinkala",null,null,{"$f":"'MDA1'!M56","v":0},{"$f":"'MDA4'!U56","v":0},{"$f":"'MDA3'!Q56","v":13843},null,{"$f":"'MDA4'!M56","v":0},{"$f":"'MDA4'!Q56","v":0},null,null,null,null,"Kinkala",35156,-19.558850448471535]
[{"$f":"IF(INTRO!$E$34<>0,INTRO!$E$34,\"\")","v":" Congo"},"Pool","Kintélé",27100,{"$f":"IF(INTRO!$E$48=\"\",\"\",ROUND($D57*INTRO!$E$48,0))","v":4336},{"$f":"IF(INTRO!$E$49=\"\",\"\",ROUND($D57*INTRO!$E$49,0))","v":6504},{"$f":"IF(INTRO!$E$50=\"\",\"\",ROUND($D57*INTRO!$E$50,0))","v":14986},0,4,1,4,1,{"$f":"IF(INTRO!$E$38=\"Endémique\", IF($H57>0, IF($H57=4,\"Inconnu\", IF($H57=99,\"Interrompu\", $D57)), 0),\"Non requis\")","v":0},null,{"$f":"IF(INTRO!$E$42=\"Endémique\", IF(AND($J57>1,$J57<5), IF($J57=4, \"Inconnu\", E57+F57), 0),\"Non requis\")","v":0},{"$f":"IF(INTRO!$E$44=\"Endémique\", IF(AND($K57>0,$K57<5), IF($K57=4,\"Inconnu\", IF($K57=1, $F57*0.33, IF($K57=2, $F57*0.5+$G57*0.2, SUM(F57:G57)))), 0),\"Non requis\")","v":"Inconnu"},0,0,0,0,null,null,12846,"Kintélé",null,null,{"$f":"'MDA1'!M57","v":0},{"$f":"'MDA4'!U57","v":0},{"$f":"'MDA3'!Q57","v":0},null,{"$f":"'MDA4'!M57","v":0},{"$f":"'MDA4'!Q57","v":0},null,null,null,null,"Kintélé",27100,0]
[{"$f":"IF(INTRO!$E$34<>0,INTRO!$E$34,\"\")","v":" Congo"},"Pool","Mindouli",48000,{"$f":"IF(INTRO!$E$48=\"\",\"\",ROUND($D58*INTRO!$E$48,0))","v":7680},{"$f":"IF(INTRO!$E$49=\"\",\"\",ROUND($D58*INTRO!$E$49,0))","v":11520},{"$f":"IF(INTRO!$E$50=\"\",\"\",ROUND($D58*INTRO!$E$50,0))","v":26544},0,1,2,1,1,{"$f":"IF(INTRO!$E$38=\"Endémique\", IF($H58>0, IF($H58=4,\"Inconnu\", IF($H58=99,\"Interrompu\", $D58)), 0),\"Non requis\")","v":0},42439,{"$f":"IF(INTRO!$E$42=\"Endémique\", IF(AND($J58>1,$J58<5), IF($J58=4, \"Inconnu\", E58+F58), 0),\"Non requis\")","v":19200},{"$f":"IF(INTRO!$E$44=\"Endémique\", IF(AND($K58>0,$K58<5), IF($K58=4,\"Inconnu\", IF($K58=1, $F58*0.33, IF($K58=2, $F58*0.5+$G58*0.2, SUM(F58:G58)))), 0),\"Non requis\")","v":3801.6000000000004},0,1,1,0,"MDA3 (IVM)",null,12807,"Mindouli",null,null,{"$f":"'MDA1'!M58","v":0},{"$f":"'MDA4'!U58","v":0},{"$f":"'MDA3'!Q58","v":34306},null,{"$f":"'MDA4'!M58","v":0},{"$f":"'MDA4'!Q58","v":0},null,null,null,null,"Mindouli",48000,0]
[{"$f":"IF(INTRO!$E$34<>0,INTRO!$E$34,\"\")","v":" Congo"},"Sangha","Ouesso",77357,{"$f":"IF(INTRO!$E$48=\"\",\"\",ROUND($D59*INTRO!$E$48,0))","v":12377},{"$f":"IF(INTRO!$E$49=\"\",\"\",ROUND($D59*INTRO!$E$49,0))","v":18566},{"$f":"IF(INTRO!$E$50=\"\",\"\",ROUND($D59*INTRO!$E$50,0))","v":42778},1,4,2,1,1,{"$f":"IF(INTRO!$E$38=\"Endémique\", IF($H59>0, IF($H59=4,\"Inconnu\", IF($H59=99,\"Interrompu\", $D59)), 0),\"Non requis\")","v":77357},null,{"$f":"IF(INTRO!$E$42=\"Endémique\", IF(AND($J59>1,$J59<5), IF($J59=4, \"Inconnu\", E59+F59), 0),\"Non requis\")","v":30943},{"$f":"IF(INTRO!$E$44=\"Endémique\", IF(AND($K59>0,$K59<5), IF($K59=4,\"Inconnu\", IF($K59=1, $F59*0.33, IF($K59=2, $F59*0.5+$G59*0.2, SUM(F59:G59)))), 0),\"Non requis\")","v":6126.7800000000007},1,0,1,0,"MDA4 (ALB/2*ALB)",null,12813,"Ouesso",null,null,{"$f":"'MDA1'!M59","v":0},{"$f":"'MDA4'!U59","v":48813},{"$f":"'MDA3'!Q59","v":0},null,{"$f":"'MDA4'!M59","v":48813},{"$f":"'MDA4'!Q59","v":0},null,null,null,null,"Ouesso",77357,0]
[{"$f":"IF(INTRO!$E$34<>0,INTRO!$E$34,\"\")","v":" Congo"},"Sangha","Sembé-Souanké",35156,{"$f":"IF(INTRO!$E$48=\"\",\"\",ROUND($D60*INTRO!$E$48,0))","v":5625},{"$f":"IF(INTRO!$E$49=\"\",\"\",ROUND($D60*INTRO!$E$49,0))","v":8437},{"$f":"IF(INTRO!$E$50=\"\",\"\",ROUND($D60*INTRO!$E$50,0))","v":19441},1,4,3,0,1,{"$f":"IF(INTRO!$E$38=\"Endémique\", IF($H60>0, IF($H60=4,\"Inconnu\", IF($H60=99,\"Interrompu\", $D60)), 0),\"Non requis\")","v":35156},null,{"$f":"IF(INTRO!$E$42=\"Endémique\", IF(AND($J60>1,$J60<5), IF($J60=4, \"Inconnu\", E60+F60), 0),\"Non requis\")","v":14062},{"$f":"IF(INTRO!$E$44=\"Endémique\", IF(AND($K60>0,$K60<5), IF($K60=4,\"Inconnu\", IF($K60=1, $F60*0.33, IF($K60=2, $F60*0.5+$G60*0.2, SUM(F60:G60)))), 0),\"Non requis\")","v":0},1,0,2,0,"MDA4 (ALB/2*ALB)",null,12814,"Sembé-Souanké",null,null,{"$f":"'MDA1'!M60","v":0},{"$f":"'MDA4'!U60","v":21783},{"$f":"'MDA3'!Q60","v":0},null,{"$f":"'MDA4'!M60","v":21783},{"$f":"'MDA4'!Q60","v":0},null,null,null,null,"Sembé-Souanké",35156,0]

{"sheet":"MDA1","index":2,"n_rows":60,"n_cols":17,"rows_kept":60,"cut":false,"hidden":false,"merged":[[5,13,5,16],[3,0,3,2],[5,0,5,2],[5,5,5,8],[5,9,5,12],[5,3,6,3],[5,4,6,4]]}
["MDA 1 - Ivermectine (IVM) et Albendazole (ALB)",null,null,null,null,null,null,null,null,null,null," "]
["Structure administrative, population nécessitant une chimioprévention par groupe d'âge, population traitée par groupe d'âge et couverture"]
[]
["TOTAL",null,null,null,null,null,{"$f":"SUM(G$9:G$1000)","v":34747.440000000002},{"$f":"SUM(H$9:H$1000)","v":86868.6},{"$f":"SUM(I$9:I$1000)","v":121616.04},null,{"$f":"SUM(K$9:K$1000)","v":28905.119999999999},{"$f":"SUM(L$9:L$1000)","v":91532.88},{"$f":"SUM(M$9:M$1000)","v":120438},null,{"$f":"IF(G4<>0, IF(K4/G4*100=0, \"-\", K4/G4*100), \" \")","v":83.186329697957589},{"$f":"IF(H4<>0, IF(L4/H4*100=0, \"-\", L4/H4*100), \" \")","v":105.36935095074628},{"$f":"IF(I4<>0, IF(M4/I4*100=0, \"-\", M4/I4*100), \" \")","v":99.031344878520969}]
[]
["Structure administrative du pays",null,null,"Mise en oeuvre \nde la CP","Date","Population ciblée pour MDA 1",null,null,null,"Population traitée",null,null,null,"Couverture du Programme (%)"]
["Pays","Région/Département","District",null,null,"EAPréS","EAS","Adultes","Total","EAPréS","EAS","Adultes","Total","EAPréS","EAS","Adultes","Total"]
[]
[{"$f":"IF(COUNTRY_INFO!A9=0,\" \",COUNTRY_INFO!A9)","v":" Congo"},{"$f":"IF(COUNTRY_INFO!B9=0,\" \",COUNTRY_INFO!B9)","v":"Bouenza"},{"$f":"IF(COUNTRY_INFO!C9=0,\" \",COUNTRY_INFO!C9)","v":"Loudima"},{"$f":"IF(COUNTRY_INFO!$U$9:$U$1000=\"MDA1 (IVM+ALB)\", COUNTRY_INFO!$U$9:$U$1000, \" \")","v":" "},null,null,null,null,{"$f":"SUM(F9:H9)","v":0},null,null,null,{"$f":"SUM(J9:L9)","v":0},null,{"$f":"IF(G9<>0, IF(K9/G9*100=0, \"-\", K9/G9*100), \" \")","v":" "},{"$f":"IF(H9<>0, IF(L9/H9*100=0, \"-\", L9/H9*100), \" \")","v":" "}," "]
[{"$f":"IF(COUNTRY_INFO!A10=0,\" \",COUNTRY_INFO!A10)","v":" Congo"},{"$f":"IF(COUNTRY_INFO!B10=0,\" \",COUNTRY_INFO!B10)","v":"Bouenza"},{"$f":"IF(COUNTRY_INFO!C10=0,\" \",COUNTRY_INFO!C10)","v":"Loutété"},{"$f":"IF(COUNTRY_INFO!$U$9:$U$1000=\"MDA1 (IVM+ALB)\", COUNTRY_INFO!$U$9:$U$1000, \" \")","v":"MDA1 (IVM+ALB)"},"Août-Nov",null,7637.04,19092.599999999999,{"$f":"SUM(F10:H10)","v":26729.64},null,6222.72,19705.28,{"$f":"SUM(J10:L10)","v":25928},null,{"$f":"IF(G10<>0, IF(K10/G10*100=0, \"-\", K10/G10*100), \" \")","v":81.480783130637008},{"$f":"IF(H10<>0, IF(L10/H10*100=0, \"-\", L10/H10*100), \" \")","v":103.20899196547353},{"$f":"IF(I10<>0, IF(M10/I10*100=0, \"-\", M10/I10*100), \" \")","v":97.000932298377379}]
[{"$f":"IF(COUNTRY_INFO!A11=0,\" \",COUNTRY_INFO!A11)","v":" Congo"},{"$f":"IF(COUNTRY_INFO!B11=0,\" \",COUNTRY_INFO!B11)","v":"Bouenza"},{"$f":"IF(COUNTRY_INFO!C11=0,\" \",COUNTRY_INFO!C11)","v":"Madingou"},{"$f":"IF(COUNTRY_INFO!$U$9:$U$1000=\"MDA1 (IVM+ALB)\", COUNTRY_INFO!$U$9:$U$1000, \" \")","v":"MDA1 (IVM+ALB)"},"Août-Nov",null,11621.279999999999,29053.200000000001,40674.479999999996,null,9705.36,30733.64,40439,null,83.513692123414998,105.78401002299229,99.421062051684501]
[{"$f":"IF(COUNTRY_INFO!A12=0,\" \",COUNTRY_INFO!A12)","v":" Congo"},{"$f":"IF(COUNTRY_INFO!B12=0,\" \",COUNTRY_INFO!B12)","v":"Bouenza"},{"$f":"IF(COUNTRY_INFO!C12=0,\" \",COUNTRY_INFO!C12)","v":"Mouyondzi"},{"$f":"IF(COUNTRY_INFO!$U$9:$U$1000=\"MDA1 (IVM+ALB)\", COUNTRY_INFO!$U$9:$U$1000, \" \")","v":"MDA1 (IVM+ALB)"},"Août-Nov",null,9738.9599999999991,24347.4,34086.36,null,8083.92,25599.08,33683,null,83.005988319081297,105.14091853750298,98.816652760811067]
[{"$f":"IF(COUNTRY_INFO!A13=0,\" \",COUNTRY_INFO!A13)","v":" Congo"},{"$f":"IF(COUNTRY_INFO!B13=0,\" \",COUNTRY_INFO!B13)","v":"Bouenza"},{"$f":"IF(COUNTRY_INFO!C13=0,\" \",COUNTRY_INFO!C13)","v":"Nkayi"},{"$f":"IF(COUNTRY_INFO!$U$9:$U$1000=\"MDA1 (IVM+ALB)\", COUNTRY_INFO!$U$9:$U$1000, \" \")","v":" "},null,null,0,0,0,null,0,0,0,null," "," "," "]
[{"$f":"IF(COUNTRY_INFO!A14=0,\" \",COUNTRY_INFO!A14)","v":" Congo"},{"$f":"IF(COUNTRY_INFO!B14=0,\" \",COUNTRY_INFO!B14)","v":"Brazzaville"},{"$f":"IF(COUNTRY_INFO!C14=0,\" \",COUNTRY_INFO!C14)","v":"Bacongo"},{"$f":"IF(COUNTRY_INFO!$U$9:$U$1000=\"MDA1 (IVM+ALB)\", COUNTRY_INFO!$U$9:$U$1000, \" \")","v":" "},null,null,0,0,0,null,0,0,0,null," "," "," "]
[{"$f":"IF(COUNTRY_INFO!A15=0,\" \",COUNTRY_INFO!A15)","v":" Congo"},{"$f":"IF(COUNTRY_INFO!B15=0,\" \",COUNTRY_INFO!B15)","v":"Brazzaville"},{"$f":"IF(COUNTRY_INFO!C15=0,\" \",COUNTRY_INFO!C15)","v":"Djiri"},{"$f":"IF(COUNTRY_INFO!$U$9:$U$1000=\"MDA1 (IVM+ALB)\", COUNTRY_INFO!$U$9:$U$1000, \" \")","v":" "},null,null,0,0,0,null,0,0,0,null," "," "," "]
[{"$f":"IF(COUNTRY_INFO!A16=0,\" \",COUNTRY_INFO!A16)","v":" Congo"},{"$f":"IF(COUNTRY_INFO!B16=0,\" \",COUNTRY_INFO!B16)","v":"Brazzaville"},{"$f":"IF(COUNTRY_INFO!C16=0,\" \",COUNTRY_INFO!C16)","v":"Île Mbamou"},{"$f":"IF(COUNTRY_INFO!$U$9:$U$1000=\"MDA1 (IVM+ALB)\", COUNTRY_INFO!$U$9:$U$1000, \" \")","v":" "},null,null,0,0,0,null,0,0,0,null," "," "," "]
[{"$f":"IF(COUNTRY_INFO!A17=0,\" \",COUNTRY_INFO!A17)","v":" Congo"},{"$f":"IF(COUNTRY_INFO!B17=0,\" \",COUNTRY_INFO!B17)","v":"Brazzaville"},{"$f":"IF(COUNTRY_INFO!C17=0,\" \",COUNTRY_INFO!C17)","v":"Madibou"},{"$f":"IF(COUNTRY_INFO!$U$9:$U$1000=\"MDA1 (IVM+ALB)\", COUNTRY_INFO!$U$9:$U$1000, \" \")","v":" "},null,null,0,0,0,null,0,0,0,null," "," "," "]
[{"$f":"IF(COUNTRY_INFO!A18=0,\" \",COUNTRY_INFO!A18)","v":" Congo"},{"$f":"IF(COUNTRY_INFO!B18=0,\" \",COUNTRY_INFO!B18)","v":"Brazzaville"},{"$f":"IF(COUNTRY_INFO!C18=0,\" \",COUNTRY_INFO!C18)","v":"Makélékélé"},{"$f":"IF(COUNTRY_INFO!$U$9:$U$1000=\"MDA1 (IVM+ALB)\", COUNTRY_INFO!$U$9:$U$1000, \" \")","v":" "},null,null,0,0,0,null,0,0,0,null," "," "," "]
[{"$f":"IF(COUNTRY_INFO!A19=0,\" \",COUNTRY_INFO!A19)","v":" Congo"},{"$f":"IF(COUNTRY_INFO!B19=0,\" \",COUNTRY_INFO!B19)","v":"Brazzaville"},{"$f":"IF(COUNTRY_INFO!C19=0,\" \",COUNTRY_INFO!C19)","v":"Mfilou"},{"$f":"IF(COUNTRY_INFO!$U$9:$U$1000=\"MDA1 (IVM+ALB)\", COUNTRY_INFO!$U$9:$U$1000, \" \")","v":" "},null,null,0,0,0,null,0,0,0,null," "," "," "]
[{"$f":"IF(COUNTRY_INFO!A20=0,\" \",COUNTRY_INFO!A20)","v":" Congo"},{"$f":"IF(COUNTRY_INFO!B20=0,\" \",COUNTRY_INFO!B20)","v":"Brazzaville"},{"$f":"IF(COUNTRY_INFO!C20=0,\" \",COUNTRY_INFO!C20)","v":"Moungali"},{"$f":"IF(COUNTRY_INFO!$U$9:$U$1000=\"MDA1 (IVM+ALB)\", COUNTRY_INFO!$U$9:$U$1000, \" \")","v":" "},null,null,0,0,0,null,0,0,0,null," "," "," "]
[{"$f":"IF(COUNTRY_INFO!A21=0,\" \",COUNTRY_INFO!A21)","v":" Congo"},{"$f":"IF(COUNTRY_INFO!B21=0,\" \",COUNTRY_INFO!B21)","v":"Brazzaville"},{"$f":"IF(COUNTRY_INFO!C21=0,\" \",COUNTRY_INFO!C21)","v":"Ouenzé"},{"$f":"IF(COUNTRY_INFO!$U$9:$U$1000=\"MDA1 (IVM+ALB)\", COUNTRY_INFO!$U$9:$U$1000, \" \")","v":" "},null,null,0,0,0,null,0,0,0,null," "," "," "]
[{"$f":"IF(COUNTRY_INFO!A22=0,\" \",COUNTRY_INFO!A22)","v":" Congo"},{"$f":"IF(COUNTRY_INFO!B22=0,\" \",COUNTRY_INFO!B22)","v":"Brazzaville"},{"$f":"IF(COUNTRY_INFO!C22=0,\" \",COUNTRY_INFO!C22)","v":"Poto-Poto"},{"$f":"IF(COUNTRY_INFO!$U$9:$U$1000=\"MDA1 (IVM+ALB)\", COUNTRY_INFO!$U$9:$U$1000, \" \")","v":" "},null,null,0,0,0,null,0,0,0,null," "," "," "]
[{"$f":"IF(COUNTRY_INFO!A23=0,\" \",COUNTRY_INFO!A23)","v":" Congo"},{"$f":"IF(COUNTRY_INFO!B23=0,\" \",COUNTRY_INFO!B23)","v":"Brazzaville"},{"$f":"IF(COUNTRY_INFO!C23=0,\" \",COUNTRY_INFO!C23)","v":"Talangaî"},{"$f":"IF(COUNTRY_INFO!$U$9:$U$1000=\"MDA1 (IVM+ALB)\", COUNTRY_INFO!$U$9:$U$1000, \" \")","v":" "},null,null,0,0,0,null,0,0,0,null," "," "," "]
[{"$f":"IF(COUNTRY_INFO!A24=0,\" \",COUNTRY_INFO!A24)","v":" Congo"},{"$f":"IF(COUNTRY_INFO!B24=0,\" \",COUNTRY_INFO!B24)","v":"Cuvette"},{"$f":"IF(COUNTRY_INFO!C24=0,\" \",COUNTRY_INFO!C24)","v":"Mossaka"},{"$f":"IF(COUNTRY_INFO!$U$9:$U$1000=\"MDA1 (IVM+ALB)\", COUNTRY_INFO!$U$9:$U$1000, \" \")","v":" "},null,null,0,0,0,null,0,0,0,null," "," "," "]
[{"$f":"IF(COUNTRY_INFO!A25=0,\" \",COUNTRY_INFO!A25)","v":" Congo"},{"$f":"IF(COUNTRY_INFO!B25=0,\" \",COUNTRY_INFO!B25)","v":"Cuvette"},{"$f":"IF(COUNTRY_INFO!C25=0,\" \",COUNTRY_INFO!C25)","v":"Owando"},{"$f":"IF(COUNTRY_INFO!$U$9:$U$1000=\"MDA1 (IVM+ALB)\", COUNTRY_INFO!$U$9:$U$1000, \" \")","v":" "},null,null,0,0,0,null,0,0,0,null," "," "," "]
[{"$f":"IF(COUNTRY_INFO!A26=0,\" \",COUNTRY_INFO!A26)","v":" Congo"},{"$f":"IF(COUNTRY_INFO!B26=0,\" \",COUNTRY_INFO!B26)","v":"Cuvette"},{"$f":"IF(COUNTRY_INFO!C26=0,\" \",COUNTRY_INFO!C26)","v":"Oyo-Alima"},{"$f":"IF(COUNTRY_INFO!$U$9:$U$1000=\"MDA1 (IVM+ALB)\", COUNTRY_INFO!$U$9:$U$1000, \" \")","v":" "},null,null,0,0,0,null,0,0,0,null," "," "," "]
[{"$f":"IF(COUNTRY_INFO!A27=0,\" \",COUNTRY_INFO!A27)","v":" Congo"},{"$f":"IF(COUNTRY_INFO!B27=0,\" \",COUNTRY_INFO!B27)","v":"Cuvette-Ouest"},{"$f":"IF(COUNTRY_INFO!C27=0,\" \",COUNTRY_INFO!C27)","v":"Etoumbi"},{"$f":"IF(COUNTRY_INFO!$U$9:$U$1000=\"MDA1 (IVM+ALB)\", COUNTRY_INFO!$U$9:$U$1000, \" \")","v":" "},null,null,0,0,0,null,0,0,0,null," "," "," "]
[{"$f":"IF(COUNTRY_INFO!A28=0,\" \",COUNTRY_INFO!A28)","v":" Congo"},{"$f":"IF(COUNTRY_INFO!B28=0,\" \",COUNTRY_INFO!B28)","v":"Cuvette-Ouest"},{"$f":"IF(COUNTRY_INFO!C28=0,\" \",COUNTRY_INFO!C28)","v":"Ewo"},{"$f":"IF(COUNTRY_INFO!$U$9:$U$1000=\"MDA1 (IVM+ALB)\", COUNTRY_INFO!$U$9:$U$1000, \" \")","v":" "},null,null,0,0,0,null,0,0,0,null," "," "," "]
[{"$f":"IF(COUNTRY_INFO!A29=0,\" \",COUNTRY_INFO!A29)","v":" Congo"},{"$f":"IF(COUNTRY_INFO!B29=0,\" \",COUNTRY_INFO!B29)","v":"Kouilou"},{"$f":"IF(COUNTRY_INFO!C29=0,\" \",COUNTRY_INFO!C29)","v":"Hinda-Loango"},{"$f":"IF(COUNTRY_INFO!$U$9:$U$1000=\"MDA1 (IVM+ALB)\", COUNTRY_INFO!$U$9:$U$1000, \" \")","v":" "},null,null,0,0,0,null,0,0,0,null," "," "," "]
[{"$f":"IF(COUNTRY_INFO!A30=0,\" \",COUNTRY_INFO!A30)","v":" Congo"},{"$f":"IF(COUNTRY_INFO!B30=0,\" \",COUNTRY_INFO!B30)","v":"Kouilou"},{"$f":"IF(COUNTRY_INFO!C30=0,\" \",COUNTRY_INFO!C30)","v":"Madingo Kayes-Nzambi"},{"$f":"IF(COUNTRY_INFO!$U$9:$U$1000=\"MDA1 (IVM+ALB)\", COUNTRY_INFO!$U$9:$U$1000, \" \")","v":" "},null,null,0,0,0,null,0,0,0,null," "," "," "]
[{"$f":"IF(COUNTRY_INFO!A31=0,\" \",COUNTRY_INFO!A31)","v":" Congo"},{"$f":"IF(COUNTRY_INFO!B31=0,\" \",COUNTRY_INFO!B31)","v":"Kouilou"},{"$f":"IF(COUNTRY_INFO!C31=0,\" \",COUNTRY_INFO!C31)","v":"Mvouti-Kakamouéka"},{"$f":"IF(COUNTRY_INFO!$U$9:$U$1000=\"MDA1 (IVM+ALB)\", COUNTRY_INFO!$U$9:$U$1000, \" \")","v":" "},null,null,0,0,0,null,0,0,0,null," "," "," "]
[{"$f":"IF(COUNTRY_INFO!A32=0,\" \",COUNTRY_INFO!A32)","v":" Congo"},{"$f":"IF(COUNTRY_INFO!B32=0,\" \",COUNTRY_INFO!B32)","v":"Lékoumou"},{"$f":"IF(COUNTRY_INFO!C32=0,\" \",COUNTRY_INFO!C32)","v":"Sibiti"},{"$f":"IF(COUNTRY_INFO!$U$9:$U$1000=\"MDA1 (IVM+ALB)\", COUNTRY_INFO!$U$9:$U$1000, \" \")","v":" "},null,null,0,0,0,null,0,0,0,null," "," "," "]
[{"$f":"IF(COUNTRY_INFO!A33=0,\" \",COUNTRY_INFO!A33)","v":" Congo"},{"$f":"IF(COUNTRY_INFO!B33=0,\" \",COUNTRY_INFO!B33)","v":"Lékoumou"},{"$f":"IF(COUNTRY_INFO!C33=0,\" \",COUNTRY_INFO!C33)","v":"Zanaga"},{"$f":"IF(COUNTRY_INFO!$U$9:$U$1000=\"MDA1 (IVM+ALB)\", COUNTRY_INFO!$U$9:$U$1000, \" \")","v":" "},null,null,0,0,0,null,0,0,0,null," "," "," "]
[{"$f":"IF(COUNTRY_INFO!A34=0,\" \",COUNTRY_INFO!A34)","v":" Congo"},{"$f":"IF(COUNTRY_INFO!B34=0,\" \",COUNTRY_INFO!B34)","v":"Likouala"},{"$f":"IF(COUNTRY_INFO!C34=0,\" \",COUNTRY_INFO!C34)","v":"Bétou"},{"$f":"IF(COUNTRY_INFO!$U$9:$U$1000=\"MDA1 (IVM+ALB)\", COUNTRY_INFO!$U$9:$U$1000, \" \")","v":" "},null,null,0,0,0,null,0,0,0,null," "," "," "]
[{"$f":"IF(COUNTRY_INFO!A35=0,\" \",COUNTRY_INFO!A35)","v":" Congo"},{"$f":"IF(COUNTRY_INFO!B35=0,\" \",COUNTRY_INFO!B35)","v":"Likouala"},{"$f":"IF(COUNTRY_INFO!C35=0,\" \",COUNTRY_INFO!C35)","v":"Impfondo"},{"$f":"IF(COUNTRY_INFO!$U$9:$U$1000=\"MDA1 (IVM+ALB)\", COUNTRY_INFO!$U$9:$U$1000, \" \")","v":" "},null,null,0,0,0,null,0,0,0,null," "," "," "]
[{"$f":"IF(COUNTRY_INFO!A36=0,\" \",COUNTRY_INFO!A36)","v":" Congo"},{"$f":"IF(COUNTRY_INFO!B36=0,\" \",COUNTRY_INFO!B36)","v":"Niari"},{"$f":"IF(COUNTRY_INFO!C36=0,\" \",COUNTRY_INFO!C36)","v":"Dolisie"},{"$f":"IF(COUNTRY_INFO!$U$9:$U$1000=\"MDA1 (IVM+ALB)\", COUNTRY_INFO!$U$9:$U$1000, \" \")","v":"MDA1 (IVM+ALB)"},"Août-Nov",null,2622,6555,9177,null,2307.12,7305.88,9613,null,87.990846681922193,111.45507246376812,104.75100795466928]
[{"$f":"IF(COUNTRY_INFO!A37=0,\" \",COUNTRY_INFO!A37)","v":" Congo"},{"$f":"IF(COUNTRY_INFO!B37=0,\" \",COUNTRY_INFO!B37)","v":"Niari"},{"$f":"IF(COUNTRY_INFO!C37=0,\" \",COUNTRY_INFO!C37)","v":"Kibangou"},{"$f":"IF(COUNTRY_INFO!$U$9:$U$1000=\"MDA1 (IVM+ALB)\", COUNTRY_INFO!$U$9:$U$1000, \" \")","v":"MDA1 (IVM+ALB)"},"Août-Nov",null,2375.7599999999998,5939.4,8315.16,null,1938.96,6140.04,8079,null,81.614304475199532,103.3781190019194,97.159886279999412]
[{"$f":"IF(COUNTRY_INFO!A38=0,\" \",COUNTRY_INFO!A38)","v":" Congo"},{"$f":"IF(COUNTRY_INFO!B38=0,\" \",COUNTRY_INFO!B38)","v":"Niari"},{"$f":"IF(COUNTRY_INFO!C38=0,\" \",COUNTRY_INFO!C38)","v":"Kimongo-Londela Nkayes"},{"$f":"IF(COUNTRY_INFO!$U$9:$U$1000=\"MDA1 (IVM+ALB)\", COUNTRY_INFO!$U$9:$U$1000, \" \")","v":" "},null,null,0,0,0,null,0,0,0,null," "," "," "]
[{"$f":"IF(COUNTRY_INFO!A39=0,\" \",COUNTRY_INFO!A39)","v":" Congo"},{"$f":"IF(COUNTRY_INFO!B39=0,\" \",COUNTRY_INFO!B39)","v":"Niari"},{"$f":"IF(COUNTRY_INFO!C39=0,\" \",COUNTRY_INFO!C39)","v":"Mayoko"},{"$f":"IF(COUNTRY_INFO!$U$9:$U$1000=\"MDA1 (IVM+ALB)\", COUNTRY_INFO!$U$9:$U$1000, \" \")","v":" "},null,null,0,0,0,null,0,0,0,null," "," "," "]
[{"$f":"IF(COUNTRY_INFO!A40=0,\" \",COUNTRY_INFO!A40)","v":" Congo"},{"$f":"IF(COUNTRY_INFO!B40=0,\" \",COUNTRY_INFO!B40)","v":"Niari"},{"$f":"IF(COUNTRY_INFO!C40=0,\" \",COUNTRY_INFO!C40)","v":"Mossendjo"},{"$f":"IF(COUNTRY_INFO!$U$9:$U$1000=\"MDA1 (IVM+ALB)\", COUNTRY_INFO!$U$9:$U$1000, \" \")","v":" "},null,null,0,0,0,null,0,0,0,null," "," "," "]
[{"$f":"IF(COUNTRY_INFO!A41=0,\" \",COUNTRY_INFO!A41)","v":" Congo"},{"$f":"IF(COUNTRY_INFO!B41=0,\" \",COUNTRY_INFO!B41)","v":"Plateaux"},{"$f":"IF(COUNTRY_INFO!C41=0,\" \",COUNTRY_INFO!C41)","v":"Abala"},{"$f":"IF(COUNTRY_INFO!$U$9:$U$1000=\"MDA1 (IVM+ALB)\", COUNTRY_INFO!$U$9:$U$1000, \" \")","v":" "},null,null,0,0,0,null,0,0,0,null," "," "," "]
[{"$f":"IF(COUNTRY_INFO!A42=0,\" \",COUNTRY_INFO!A42)","v":" Congo"},{"$f":"IF(COUNTRY_INFO!B42=0,\" \",COUNTRY_INFO!B42)","v":"Plateaux"},{"$f":"IF(COUNTRY_INFO!C42=0,\" \",COUNTRY_INFO!C42)","v":"Djambala-Lékana"},{"$f":"IF(COUNTRY_INFO!$U$9:$U$1000=\"MDA1 (IVM+ALB)\", COUNTRY_INFO!$U$9:$U$1000, \" \")","v":" "},null,null,0,0,0,null,0,0,0,null," "," "," "]
[{"$f":"IF(COUNTRY_INFO!A43=0,\" \",COUNTRY_INFO!A43)","v":" Congo"},{"$f":"IF(COUNTRY_INFO!B43=0,\" \",COUNTRY_INFO!B43)","v":"Plateaux"},{"$f":"IF(COUNTRY_INFO!C43=0,\" \",COUNTRY_INFO!C43)","v":"Gamboma"},{"$f":"IF(COUNTRY_INFO!$U$9:$U$1000=\"MDA1 (IVM+ALB)\", COUNTRY_INFO!$U$9:$U$1000, \" \")","v":" "},null,null,0,0,0,null,0,0,0,null," "," "," "]
[{"$f":"IF(COUNTRY_INFO!A44=0,\" \",COUNTRY_INFO!A44)","v":" Congo"},{"$f":"IF(COUNTRY_INFO!B44=0,\" \",COUNTRY_INFO!B44)","v":"Plateaux"},{"$f":"IF(COUNTRY_INFO!C44=0,\" \",COUNTRY_INFO!C44)","v":"Ngo Mpouya"},{"$f":"IF(COUNTRY_INFO!$U$9:$U$1000=\"MDA1 (IVM+ALB)\", COUNTRY_INFO!$U$9:$U$1000, \" \")","v":" "},null,null,0,0,0,null,0,0,0,null," "," "," "]
[{"$f":"IF(COUNTRY_INFO!A45=0,\" \",COUNTRY_INFO!A45)","v":" Congo"},{"$f":"IF(COUNTRY_INFO!B45=0,\" \",COUNTRY_INFO!B45)","v":"Pointe-Noire"},{"$f":"IF(COUNTRY_INFO!C45=0,\" \",COUNTRY_INFO!C45)","v":"Loandjili"},{"$f":"IF(COUNTRY_INFO!$U$9:$U$1000=\"MDA1 (IVM+ALB)\", COUNTRY_INFO!$U$9:$U$1000, \" \")","v":" "},null,null,0,0,0,null,0,0,0,null," "," "," "]
[{"$f":"IF(COUNTRY_INFO!A46=0,\" \",COUNTRY_INFO!A46)","v":" Congo"},{"$f":"IF(COUNTRY_INFO!B46=0,\" \",COUNTRY_INFO!B46)","v":"Pointe-Noire"},{"$f":"IF(COUNTRY_INFO!C46=0,\" \",COUNTRY_INFO!C46)","v":"Lumumba"},{"$f":"IF(COUNTRY_INFO!$U$9:$U$1000=\"MDA1 (IVM+ALB)\", COUNTRY_INFO!$U$9:$U$1000, \" \")","v":" "},null,null,0,0,0,null,0,0,0,null," "," "," "]
[{"$f":"IF(COUNTRY_INFO!A47=0,\" \",COUNTRY_INFO!A47)","v":" Congo"},{"$f":"IF(COUNTRY_INFO!B47=0,\" \",COUNTRY_INFO!B47)","v":"Pointe-Noire"},{"$f":"IF(COUNTRY_INFO!C47=0,\" \",COUNTRY_INFO!C47)","v":"Mongo-Poukou"},{"$f":"IF(COUNTRY_INFO!$U$9:$U$1000=\"MDA1 (IVM+ALB)\", COUNTRY_INFO!$U$9:$U$1000, \" \")","v":" "},null,null,0,0,0,null,0,0,0,null," "," "," "]
[{"$f":"IF(COUNTRY_INFO!A48=0,\" \",COUNTRY_INFO!A48)","v":" Congo"},{"$f":"IF(COUNTRY_INFO!B48=0,\" \",COUNTRY_INFO!B48)","v":"Pointe-Noire"},{"$f":"IF(COUNTRY_INFO!C48=0,\" \",COUNTRY_INFO!C48)","v":"Mvoumvou"},{"$f":"IF(COUNTRY_INFO!$U$9:$U$1000=\"MDA1 (IVM+ALB)\", COUNTRY_INFO!$U$9:$U$1000, \" \")","v":" "},null,null,0,0,0,null,0,0,0,null," "," "," "]
[{"$f":"IF(COUNTRY_INFO!A49=0,\" \",COUNTRY_INFO!A49)","v":" Congo"},{"$f":"IF(COUNTRY_INFO!B49=0,\" \",COUNTRY_INFO!B49)","v":"Pointe-Noire"},{"$f":"IF(COUNTRY_INFO!C49=0,\" \",COUNTRY_INFO!C49)","v":"Ngoyo"},{"$f":"IF(COUNTRY_INFO!$U$9:$U$1000=\"MDA1 (IVM+ALB)\", COUNTRY_INFO!$U$9:$U$1000, \" \")","v":" "},null,null,0,0,0,null,0,0,0,null," "," "," "]
[{"$f":"IF(COUNTRY_INFO!A50=0,\" \",COUNTRY_INFO!A50)","v":" Congo"},{"$f":"IF(COUNTRY_INFO!B50=0,\" \",COUNTRY_INFO!B50)","v":"Pointe-Noire"},{"$f":"IF(COUNTRY_INFO!C50=0,\" \",COUNTRY_INFO!C50)","v":"Tchiamba Nzassi"},{"$f":"IF(COUNTRY_INFO!$U$9:$U$1000=\"MDA1 (IVM+ALB)\", COUNTRY_INFO!$U$9:$U$1000, \" \")","v":" "},null,null,0,0,0,null,0,0,0,null," "," "," "]
[{"$f":"IF(COUNTRY_INFO!A51=0,\" \",COUNTRY_INFO!A51)","v":" Congo"},{"$f":"IF(COUNTRY_INFO!B51=0,\" \",COUNTRY_INFO!B51)","v":"Pointe-Noire"},{"$f":"IF(COUNTRY_INFO!C51=0,\" \",COUNTRY_INFO!C51)","v":"Tie-Tie"},{"$f":"IF(COUNTRY_INFO!$U$9:$U$1000=\"MDA1 (IVM+ALB)\", COUNTRY_INFO!$U$9:$U$1000, \" \")","v":" "},null,null,0,0,0,null,0,0,0,null," "," "," "]
[{"$f":"IF(COUNTRY_INFO!A52=0,\" \",COUNTRY_INFO!A52)","v":" Congo"},{"$f":"IF(COUNTRY_INFO!B52=0,\" \",COUNTRY_INFO!B52)","v":"Pool"},{"$f":"IF(COUNTRY_INFO!C52=0,\" \",COUNTRY_INFO!C52)","v":"Boko"},{"$f":"IF(COUNTRY_INFO!$U$9:$U$1000=\"MDA1 (IVM+ALB)\", COUNTRY_INFO!$U$9:$U$1000, \" \")","v":" "},null,null,0,0,0,null,0,0,0,null," "," "," "]
[{"$f":"IF(COUNTRY_INFO!A53=0,\" \",COUNTRY_INFO!A53)","v":" Congo"},{"$f":"IF(COUNTRY_INFO!B53=0,\" \",COUNTRY_INFO!B53)","v":"Pool"},{"$f":"IF(COUNTRY_INFO!C53=0,\" \",COUNTRY_INFO!C53)","v":"Goma tsétsé"},{"$f":"IF(COUNTRY_INFO!$U$9:$U$1000=\"MDA1 (IVM+ALB)\", COUNTRY_INFO!$U$9:$U$1000, \" \")","v":" "},null,null,0,0,0,null,0,0,0,null," "," "," "]
[{"$f":"IF(COUNTRY_INFO!A54=0,\" \",COUNTRY_INFO!A54)","v":" Congo"},{"$f":"IF(COUNTRY_INFO!B54=0,\" \",COUNTRY_INFO!B54)","v":"Pool"},{"$f":"IF(COUNTRY_INFO!C54=0,\" \",COUNTRY_INFO!C54)","v":"Ignié"},{"$f":"IF(COUNTRY_INFO!$U$9:$U$1000=\"MDA1 (IVM+ALB)\", COUNTRY_INFO!$U$9:$U$1000, \" \")","v":"MDA1 (IVM+ALB)"},"Août-Nov",null,752.4,1881,2633.4,null,647.04,2048.96,2696,null,85.996810207336523,108.92929292929293,102.37715500873395]
[{"$f":"IF(COUNTRY_INFO!A55=0,\" \",COUNTRY_INFO!A55)","v":" Congo"},{"$f":"IF(COUNTRY_INFO!B55=0,\" \",COUNTRY_INFO!B55)","v":"Pool"},{"$f":"IF(COUNTRY_INFO!C55=0,\" \",COUNTRY_INFO!C55)","v":"Kindamba"},{"$f":"IF(COUNTRY_INFO!$U$9:$U$1000=\"MDA1 (IVM+ALB)\", COUNTRY_INFO!$U$9:$U$1000, \" \")","v":" "},null,null,0,0,0,null,0,0,0,null," "," "," "]
[{"$f":"IF(COUNTRY_INFO!A56=0,\" \",COUNTRY_INFO!A56)","v":" Congo"},{"$f":"IF(COUNTRY_INFO!B56=0,\" \",COUNTRY_INFO!B56)","v":"Pool"},{"$f":"IF(COUNTRY_INFO!C56=0,\" \",COUNTRY_INFO!C56)","v":"Kinkala"},{"$f":"IF(COUNTRY_INFO!$U$9:$U$1000=\"MDA1 (IVM+ALB)\", COUNTRY_INFO!$U$9:$U$1000, \" \")","v":" "},null,null,0,0,0,null,0,0,0,null," "," "," "]
[{"$f":"IF(COUNTRY_INFO!A57=0,\" \",COUNTRY_INFO!A57)","v":" Congo"},{"$f":"IF(COUNTRY_INFO!B57=0,\" \",COUNTRY_INFO!B57)","v":"Pool"},{"$f":"IF(COUNTRY_INFO!C57=0,\" \",COUNTRY_INFO!C57)","v":"Kintélé"},{"$f":"IF(COUNTRY_INFO!$U$9:$U$1000=\"MDA1 (IVM+ALB)\", COUNTRY_INFO!$U$9:$U$1000, \" \")","v":" "},null,null,0,0,0,null,0,0,0,null," "," "," "]
[{"$f":"IF(COUNTRY_INFO!A58=0,\" \",COUNTRY_INFO!A58)","v":" Congo"},{"$f":"IF(COUNTRY_INFO!B58=0,\" \",COUNTRY_INFO!B58)","v":"Pool"},{"$f":"IF(COUNTRY_INFO!C58=0,\" \",COUNTRY_INFO!C58)","v":"Mindouli"},{"$f":"IF(COUNTRY_INFO!$U$9:$U$1000=\"MDA1 (IVM+ALB)\", COUNTRY_INFO!$U$9:$U$1000, \" \")","v":" "},null,null,0,0,0,null,0,0,0,null," "," "," "]
[{"$f":"IF(COUNTRY_INFO!A59=0,\" \",COUNTRY_INFO!A59)","v":" Congo"},{"$f":"IF(COUNTRY_INFO!B59=0,\" \",COUNTRY_INFO!B59)","v":"Sangha"},{"$f":"IF(COUNTRY_INFO!C59=0,\" \",COUNTRY_INFO!C59)","v":"Ouesso"},{"$f":"IF(COUNTRY_INFO!$U$9:$U$1000=\"MDA1 (IVM+ALB)\", COUNTRY_INFO!$U$9:$U$1000, \" \")","v":" "},null,null,0,0,0,null,0,0,0,null," "," "," "]
[{"$f":"IF(COUNTRY_INFO!A60=0,\" \",COUNTRY_INFO!A60)","v":" Congo"},{"$f":"IF(COUNTRY_INFO!B60=0,\" \",COUNTRY_INFO!B60)","v":"Sangha"},{"$f":"IF(COUNTRY_INFO!C60=0,\" \",COUNTRY_INFO!C60)","v":"Sembé-Souanké"},{"$f":"IF(COUNTRY_INFO!$U$9:$U$1000=\"MDA1 (IVM+ALB)\", COUNTRY_INFO!$U$9:$U$1000, \" \")","v":" "},null,null,0,0,0,null,0,0,0,null," "," "," "]

{"sheet":"MDA4","index":3,"n_rows":60,"n_cols":25,"rows_kept":60,"cut":false,"hidden":false,"merged":[[5,5,5,8],[5,13,5,16],[5,21,5,24],[3,0,3,2],[5,0,5,2],[5,3,6,3],[5,4,6,4],[5,9,5,12],[5,17,5,20]]}
["MDA 4 - Albendazole (ALB) ou 2 x Albendazole (ALB)",null,null,null,null,null,null,null,null,null,null," "," "]
["Structure administrative, population nécessitant une chimioprévention par groupe d'âge, population traitée par groupe d'âge et couverture"]
[]
["TOTAL",null,null,null,null,{"$f":"SUM(F$9:F$1000)","v":0},{"$f":"SUM(G$9:G$1000)","v":120464.16},301160.40000000002,421624.56,0,98028.319999999992,283261.68,381290,0,45953.280000000006,145518.72,191472,0,100292.08,311451.83999999997,411743.92000000004,{"$f":"IF(F4<>0, IF(N4/F4*100=0, \"-\", N4/F4*100), \" \")","v":" "},{"$f":"IF(G4<>0, IF(O4/G4*100=0, \"-\", O4/G4*100), \" \")","v":38.146847991967078},{"$f":"IF(H4<>0, IF(P4/H4*100=0, \"-\", P4/H4*100), \" \")","v":48.319340789824956},{"$f":"IF(I4<>0, IF(Q4/I4*100=0, \"-\", Q4/I4*100), \" \")","v":45.412914276151277}]
[]
["Structure administrative du pays",null,null,"Mise en oeuvre \nde la CP","Date","Population ciblée pour MDA 4",null,null,null,"Population traitée - tournée 1",null,null,null,"Population traitée - tournée 2",null,null,null,"Population traitée",null,null,null,"Couverture du Programme (%)"]
["Pays","Région/Département","District",null,null,"EAPréS","EAS","Adultes","Total","EAPréS","EAS","Adultes","Total","EAPréS","EAS","Adultes","Total","EAPréS","EAS","Adultes","Total","EAPréS","EAS","Adultes","Total"]
[]
[{"$f":"IF(COUNTRY_INFO!A9=0,\" \",COUNTRY_INFO!A9)","v":" Congo"},{"$f":"IF(COUNTRY_INFO!B9=0,\" \",COUNTRY_INFO!B9)","v":"Bouenza"},{"$f":"IF(COUNTRY_INFO!C9=0,\" \",COUNTRY_INFO!C9)","v":"Loudima"},{"$f":"IF(COUNTRY_INFO!$U$9:$U$1000=\"MDA4 (ALB/2*ALB)\", COUNTRY_INFO!$U$9:$U$1000, \" \")","v":" "},null,null,null,null,{"$f":"SUM(F9:H9)","v":0},null,null,null,{"$f":"SUM(J9:L9)","v":0},null,null,null,{"$f":"SUM(N9:P9)","v":0},{"$f":"MAX(J9,N9)","v":0},{"$f":"MAX(K9,O9)","v":0},{"$f":"MAX(L9,P9)","v":0},{"$f":"SUM(R9:T9)","v":0},{"$f":"IF(F9<>0, IF(R9/F9*100=0, \"-\",R9/F9*100), \" \")","v":" "},{"$f":"IF(G9<>0, IF(S9/G9*100=0, \"-\", S9/G9*100), \" \")","v":" "},{"$f":"IF(H9<>0, IF(T9/H9*100=0, \"-\", T9/H9*100), \" \")","v":" "},{"$f":"IF(I9<>0, IF(U9/I9*100=0, \"-\", U9/I9*100), \" \")","v":" "}]
[{"$f":"IF(COUNTRY_INFO!A10=0,\" \",COUNTRY_INFO!A10)","v":" Congo"},{"$f":"IF(COUNTRY_INFO!B10=0,\" \",COUNTRY_INFO!B10)","v":"Bouenza"},{"$f":"IF(COUNTRY_INFO!C10=0,\" \",COUNTRY_INFO!C10)","v":"Loutété"},"MDA4 (ALB/2*ALB)","1 er passage Avr et 2ème passage Nov",null,774.24,1935.6,{"$f":"SUM(F10:H10)","v":2709.84},null,781.7600000000001,2010.2399999999998,{"$f":"SUM(J10:L10)","v":2792},null,632.16,2001.8400000000001,{"$f":"SUM(N10:P10)","v":2634},{"$f":"MAX(J10,N10)","v":0},{"$f":"MAX(K10,O10)","v":781.7600000000001},{"$f":"MAX(L10,P10)","v":2010.2399999999998},{"$f":"SUM(R10:T10)","v":2792},{"$f":"IF(F10<>0, IF(R10/F10*100=0, \"-\",R10/F10*100), \" \")","v":" "},{"$f":"IF(G10<>0, IF(S10/G10*100=0, \"-\", S10/G10*100), \" \")","v":100.97127505682994},{"$f":"IF(H10<>0, IF(T10/H10*100=0, \"-\", T10/H10*100), \" \")","v":103.85616862988221},{"$f":"IF(I10<>0, IF(U10/I10*100=0, \"-\", U10/I10*100), \" \")","v":103.03191332329584}]
[{"$f":"IF(COUNTRY_INFO!A11=0,\" \",COUNTRY_INFO!A11)","v":" Congo"},{"$f":"IF(COUNTRY_INFO!B11=0,\" \",COUNTRY_INFO!B11)","v":"Bouenza"},{"$f":"IF(COUNTRY_INFO!C11=0,\" \",COUNTRY_INFO!C11)","v":"Madingou"},"MDA4 (ALB/2*ALB)","1 er passage Avr et 2ème passage Nov",null,4515.12,11287.8,15802.919999999998,null,3741.3600000000006,9620.64,13362,null,3749.04,11871.96,15621,0,3749.04,11871.96,15621," ",83.033009089459426,105.17514484664858,98.848820344594557]
[{"$f":"IF(COUNTRY_INFO!A12=0,\" \",COUNTRY_INFO!A12)","v":" Congo"},{"$f":"IF(COUNTRY_INFO!B12=0,\" \",COUNTRY_INFO!B12)","v":"Bouenza"},{"$f":"IF(COUNTRY_INFO!C12=0,\" \",COUNTRY_INFO!C12)","v":"Mouyondzi"},"MDA4 (ALB/2*ALB)","1 er passage Avr et 2ème passage Nov",null,1939.6799999999998,4849.2,6788.8799999999992,null,357.28000000000003,918.72,1276,null,1594.8,5050.2,6645,0,1594.8,5050.2,6645," ",82.219747587230884,104.14501361049244,97.880651889560582]
[{"$f":"IF(COUNTRY_INFO!A13=0,\" \",COUNTRY_INFO!A13)","v":" Congo"},{"$f":"IF(COUNTRY_INFO!B13=0,\" \",COUNTRY_INFO!B13)","v":"Bouenza"},{"$f":"IF(COUNTRY_INFO!C13=0,\" \",COUNTRY_INFO!C13)","v":"Nkayi"},{"$f":"IF(COUNTRY_INFO!$U$9:$U$1000=\"MDA4 (ALB/2*ALB)\", COUNTRY_INFO!$U$9:$U$1000, \" \")","v":" "},null,0,0,0,0,null,null,null,0,null,0,0,0,0,0,0,0," "," "," "," "]
[{"$f":"IF(COUNTRY_INFO!A14=0,\" \",COUNTRY_INFO!A14)","v":" Congo"},{"$f":"IF(COUNTRY_INFO!B14=0,\" \",COUNTRY_INFO!B14)","v":"Brazzaville"},{"$f":"IF(COUNTRY_INFO!C14=0,\" \",COUNTRY_INFO!C14)","v":"Bacongo"},{"$f":"IF(COUNTRY_INFO!$U$9:$U$1000=\"MDA4 (ALB/2*ALB)\", COUNTRY_INFO!$U$9:$U$1000, \" \")","v":" "},null,0,0,0,0,null,null,null,0,null,0,0,0,0,0,0,0," "," "," "," "]
[{"$f":"IF(COUNTRY_INFO!A15=0,\" \",COUNTRY_INFO!A15)","v":" Congo"},{"$f":"IF(COUNTRY_INFO!B15=0,\" \",COUNTRY_INFO!B15)","v":"Brazzaville"},{"$f":"IF(COUNTRY_INFO!C15=0,\" \",COUNTRY_INFO!C15)","v":"Djiri"},{"$f":"IF(COUNTRY_INFO!$U$9:$U$1000=\"MDA4 (ALB/2*ALB)\", COUNTRY_INFO!$U$9:$U$1000, \" \")","v":" "},null,0,0,0,0,null,null,null,0,null,0,0,0,0,0,0,0," "," "," "," "]
[{"$f":"IF(COUNTRY_INFO!A16=0,\" \",COUNTRY_INFO!A16)","v":" Congo"},{"$f":"IF(COUNTRY_INFO!B16=0,\" \",COUNTRY_INFO!B16)","v":"Brazzaville"},{"$f":"IF(COUNTRY_INFO!C16=0,\" \",COUNTRY_INFO!C16)","v":"Île Mbamou"},{"$f":"IF(COUNTRY_INFO!$U$9:$U$1000=\"MDA4 (ALB/2*ALB)\", COUNTRY_INFO!$U$9:$U$1000, \" \")","v":" "},null,0,0,0,0,null,null,null,0,null,0,0,0,0,0,0,0," "," "," "," "]
[{"$f":"IF(COUNTRY_INFO!A17=0,\" \",COUNTRY_INFO!A17)","v":" Congo"},{"$f":"IF(COUNTRY_INFO!B17=0,\" \",COUNTRY_INFO!B17)","v":"Brazzaville"},{"$f":"IF(COUNTRY_INFO!C17=0,\" \",COUNTRY_INFO!C17)","v":"Madibou"},{"$f":"IF(COUNTRY_INFO!$U$9:$U$1000=\"MDA4 (ALB/2*ALB)\", COUNTRY_INFO!$U$9:$U$1000, \" \")","v":" "},null,0,0,0,0,null,null,null,0,null,0,0,0,0,0,0,0," "," "," "," "]
[{"$f":"IF(COUNTRY_INFO!A18=0,\" \",COUNTRY_INFO!A18)","v":" Congo"},{"$f":"IF(COUNTRY_INFO!B18=0,\" \",COUNTRY_INFO!B18)","v":"Brazzaville"},{"$f":"IF(COUNTRY_INFO!C18=0,\" \",COUNTRY_INFO!C18)","v":"Makélékélé"},{"$f":"IF(COUNTRY_INFO!$U$9:$U$1000=\"MDA4 (ALB/2*ALB)\", COUNTRY_INFO!$U$9:$U$1000, \" \")","v":" "},null,0,0,0,0,null,null,null,0,null,0,0,0,0,0,0,0," "," "," "," "]
[{"$f":"IF(COUNTRY_INFO!A19=0,\" \",COUNTRY_INFO!A19)","v":" Congo"},{"$f":"IF(COUNTRY_INFO!B19=0,\" \",COUNTRY_INFO!B19)","v":"Brazzaville"},{"$f":"IF(COUNTRY_INFO!C19=0,\" \",COUNTRY_INFO!C19)","v":"Mfilou"},{"$f":"IF(COUNTRY_INFO!$U$9:$U$1000=\"MDA4 (ALB/2*ALB)\", COUNTRY_INFO!$U$9:$U$1000, \" \")","v":" "},null,0,0,0,0,null,null,null,0,null,0,0,0,0,0,0,0," "," "," "," "]
[{"$f":"IF(COUNTRY_INFO!A20=0,\" \",COUNTRY_INFO!A20)","v":" Congo"},{"$f":"IF(COUNTRY_INFO!B20=0,\" \",COUNTRY_INFO!B20)","v":"Brazzaville"},{"$f":"IF(COUNTRY_INFO!C20=0,\" \",COUNTRY_INFO!C20)","v":"Moungali"},{"$f":"IF(COUNTRY_INFO!$U$9:$U$1000=\"MDA4 (ALB/2*ALB)\", COUNTRY_INFO!$U$9:$U$1000, \" \")","v":" "},null,0,0,0,0,null,null,null,0,null,0,0,0,0,0,0,0," "," "," "," "]
[{"$f":"IF(COUNTRY_INFO!A21=0,\" \",COUNTRY_INFO!A21)","v":" Congo"},{"$f":"IF(COUNTRY_INFO!B21=0,\" \",COUNTRY_INFO!B21)","v":"Brazzaville"},{"$f":"IF(COUNTRY_INFO!C21=0,\" \",COUNTRY_INFO!C21)","v":"Ouenzé"},{"$f":"IF(COUNTRY_INFO!$U$9:$U$1000=\"MDA4 (ALB/2*ALB)\", COUNTRY_INFO!$U$9:$U$1000, \" \")","v":" "},null,0,0,0,0,null,null,null,0,null,0,0,0,0,0,0,0," "," "," "," "]
[{"$f":"IF(COUNTRY_INFO!A22=0,\" \",COUNTRY_INFO!A22)","v":" Congo"},{"$f":"IF(COUNTRY_INFO!B22=0,\" \",COUNTRY_INFO!B22)","v":"Brazzaville"},{"$f":"IF(COUNTRY_INFO!C22=0,\" \",COUNTRY_INFO!C22)","v":"Poto-Poto"},{"$f":"IF(COUNTRY_INFO!$U$9:$U$1000=\"MDA4 (ALB/2*ALB)\", COUNTRY_INFO!$U$9:$U$1000, \" \")","v":" "},null,0,0,0,0,null,null,null,0,null,0,0,0,0,0,0,0," "," "," "," "]
[{"$f":"IF(COUNTRY_INFO!A23=0,\" \",COUNTRY_INFO!A23)","v":" Congo"},{"$f":"IF(COUNTRY_INFO!B23=0,\" \",COUNTRY_INFO!B23)","v":"Brazzaville"},{"$f":"IF(COUNTRY_INFO!C23=0,\" \",COUNTRY_INFO!C23)","v":"Talangaî"},{"$f":"IF(COUNTRY_INFO!$U$9:$U$1000=\"MDA4 (ALB/2*ALB)\", COUNTRY_INFO!$U$9:$U$1000, \" \")","v":" "},null,0,0,0,0,null,null,null,0,null,0,0,0,0,0,0,0," "," "," "," "]
[{"$f":"IF(COUNTRY_INFO!A24=0,\" \",COUNTRY_INFO!A24)","v":" Congo"},{"$f":"IF(COUNTRY_INFO!B24=0,\" \",COUNTRY_INFO!B24)","v":"Cuvette"},{"$f":"IF(COUNTRY_INFO!C24=0,\" \",COUNTRY_INFO!C24)","v":"Mossaka"},{"$f":"IF(COUNTRY_INFO!$U$9:$U$1000=\"MDA4 (ALB/2*ALB)\", COUNTRY_INFO!$U$9:$U$1000, \" \")","v":" "},null,0,0,0,0,null,null,null,0,null,0,0,0,0,0,0,0," "," "," "," "]
[{"$f":"IF(COUNTRY_INFO!A25=0,\" \",COUNTRY_INFO!A25)","v":" Congo"},{"$f":"IF(COUNTRY_INFO!B25=0,\" \",COUNTRY_INFO!B25)","v":"Cuvette"},{"$f":"IF(COUNTRY_INFO!C25=0,\" \",COUNTRY_INFO!C25)","v":"Owando"},{"$f":"IF(COUNTRY_INFO!$U$9:$U$1000=\"MDA4 (ALB/2*ALB)\", COUNTRY_INFO!$U$9:$U$1000, \" \")","v":"MDA4 (ALB/2*ALB)"},"1 seul passage septembre",null,12228.24,30570.6,42798.84,null,10204.799999999999,32315.200000000001,42520,null,null,null,0,0,10204.799999999999,32315.200000000001,42520," ",83.452729092657648,105.70679018403304,99.348487015068642]
[{"$f":"IF(COUNTRY_INFO!A26=0,\" \",COUNTRY_INFO!A26)","v":" Congo"},{"$f":"IF(COUNTRY_INFO!B26=0,\" \",COUNTRY_INFO!B26)","v":"Cuvette"},{"$f":"IF(COUNTRY_INFO!C26=0,\" \",COUNTRY_INFO!C26)","v":"Oyo-Alima"},{"$f":"IF(COUNTRY_INFO!$U$9:$U$1000=\"MDA4 (ALB/2*ALB)\", COUNTRY_INFO!$U$9:$U$1000, \" \")","v":" "},null,null,0,0,0,null,0,0,0,null,null,null,0,0,0,0,0," "," "," "," "]
[{"$f":"IF(COUNTRY_INFO!A27=0,\" \",COUNTRY_INFO!A27)","v":" Congo"},{"$f":"IF(COUNTRY_INFO!B27=0,\" \",COUNTRY_INFO!B27)","v":"Cuvette-Ouest"},{"$f":"IF(COUNTRY_INFO!C27=0,\" \",COUNTRY_INFO!C27)","v":"Etoumbi"},{"$f":"IF(COUNTRY_INFO!$U$9:$U$1000=\"MDA4 (ALB/2*ALB)\", COUNTRY_INFO!$U$9:$U$1000, \" \")","v":"MDA4 (ALB/2*ALB)"},"1 seul passage septembre",null,6906.7199999999993,17266.8,24173.519999999997,null,5252.64,16633.36,21886,null,null,null,0,0,5252.64,16633.36,21886," ",76.051150184168463,96.331456899946716,90.537083552581507]
[{"$f":"IF(COUNTRY_INFO!A28=0,\" \",COUNTRY_INFO!A28)","v":" Congo"},{"$f":"IF(COUNTRY_INFO!B28=0,\" \",COUNTRY_INFO!B28)","v":"Cuvette-Ouest"},{"$f":"IF(COUNTRY_INFO!C28=0,\" \",COUNTRY_INFO!C28)","v":"Ewo"},{"$f":"IF(COUNTRY_INFO!$U$9:$U$1000=\"MDA4 (ALB/2*ALB)\", COUNTRY_INFO!$U$9:$U$1000, \" \")","v":"MDA4 (ALB/2*ALB)"},"1 seul passage septembre",null,6089.5199999999995,15223.8,21313.32,null,6089.52,19283.48,25373,null,null,null,0,0,6089.52,19283.48,25373," ",100.00000000000003,126.66666666666666,119.04761904761905]
[{"$f":"IF(COUNTRY_INFO!A29=0,\" \",COUNTRY_INFO!A29)","v":" Congo"},{"$f":"IF(COUNTRY_INFO!B29=0,\" \",COUNTRY_INFO!B29)","v":"Kouilou"},{"$f":"IF(COUNTRY_INFO!C29=0,\" \",COUNTRY_INFO!C29)","v":"Hinda-Loango"},{"$f":"IF(COUNTRY_INFO!$U$9:$U$1000=\"MDA4 (ALB/2*ALB)\", COUNTRY_INFO!$U$9:$U$1000, \" \")","v":" "},null,0,0,0,0,null,null,null,0,null,0,0,0,0,0,0,0," "," "," "," "]
[{"$f":"IF(COUNTRY_INFO!A30=0,\" \",COUNTRY_INFO!A30)","v":" Congo"},{"$f":"IF(COUNTRY_INFO!B30=0,\" \",COUNTRY_INFO!B30)","v":"Kouilou"},{"$f":"IF(COUNTRY_INFO!C30=0,\" \",COUNTRY_INFO!C30)","v":"Madingo Kayes-Nzambi"},{"$f":"IF(COUNTRY_INFO!$U$9:$U$1000=\"MDA4 (ALB/2*ALB)\", COUNTRY_INFO!$U$9:$U$1000, \" \")","v":" "},null,0,0,0,0,null,null,null,0,null,0,0,0,0,0,0,0," "," "," "," "]
[{"$f":"IF(COUNTRY_INFO!A31=0,\" \",COUNTRY_INFO!A31)","v":" Congo"},{"$f":"IF(COUNTRY_INFO!B31=0,\" \",COUNTRY_INFO!B31)","v":"Kouilou"},{"$f":"IF(COUNTRY_INFO!C31=0,\" \",COUNTRY_INFO!C31)","v":"Mvouti-Kakamouéka"},{"$f":"IF(COUNTRY_INFO!$U$9:$U$1000=\"MDA4 (ALB/2*ALB)\", COUNTRY_INFO!$U$9:$U$1000, \" \")","v":" "},null,0,0,0,0,null,null,null,0,null,0,0,0,0,0,0,0," "," "," "," "]
[{"$f":"IF(COUNTRY_INFO!A32=0,\" \",COUNTRY_INFO!A32)","v":" Congo"},{"$f":"IF(COUNTRY_INFO!B32=0,\" \",COUNTRY_INFO!B32)","v":"Lékoumou"},{"$f":"IF(COUNTRY_INFO!C32=0,\" \",COUNTRY_INFO!C32)","v":"Sibiti"},{"$f":"IF(COUNTRY_INFO!$U$9:$U$1000=\"MDA4 (ALB/2*ALB)\", COUNTRY_INFO!$U$9:$U$1000, \" \")","v":" "},null,0,0,0,0,null,null,null,0,null,0,0,0,0,0,0,0," "," "," "," "]
[{"$f":"IF(COUNTRY_INFO!A33=0,\" \",COUNTRY_INFO!A33)","v":" Congo"},{"$f":"IF(COUNTRY_INFO!B33=0,\" \",COUNTRY_INFO!B33)","v":"Lékoumou"},{"$f":"IF(COUNTRY_INFO!C33=0,\" \",COUNTRY_INFO!C33)","v":"Zanaga"},{"$f":"IF(COUNTRY_INFO!$U$9:$U$1000=\"MDA4 (ALB/2*ALB)\", COUNTRY_INFO!$U$9:$U$1000, \" \")","v":" "},null,0,0,0,0,null,null,null,0,null,0,0,0,0,0,0,0," "," "," "," "]
[{"$f":"IF(COUNTRY_INFO!A34=0,\" \",COUNTRY_INFO!A34)","v":" Congo"},{"$f":"IF(COUNTRY_INFO!B34=0,\" \",COUNTRY_INFO!B34)","v":"Likouala"},{"$f":"IF(COUNTRY_INFO!C34=0,\" \",COUNTRY_INFO!C34)","v":"Bétou"},{"$f":"IF(COUNTRY_INFO!$U$9:$U$1000=\"MDA4 (ALB/2*ALB)\", COUNTRY_INFO!$U$9:$U$1000, \" \")","v":" "},null,0,0,0,0,null,null,null,0,null,0,0,0,0,0,0,0," "," "," "," "]
[{"$f":"IF(COUNTRY_INFO!A35=0,\" \",COUNTRY_INFO!A35)","v":" Congo"},{"$f":"IF(COUNTRY_INFO!B35=0,\" \",COUNTRY_INFO!B35)","v":"Likouala"},{"$f":"IF(COUNTRY_INFO!C35=0,\" \",COUNTRY_INFO!C35)","v":"Impfondo"},{"$f":"IF(COUNTRY_INFO!$U$9:$U$1000=\"MDA4 (ALB/2*ALB)\", COUNTRY_INFO!$U$9:$U$1000, \" \")","v":"MDA4 (ALB/2*ALB)"},"1 seul passage septembre",null,17062.079999999998,42655.200000000004,59717.279999999999,null,13907.28,44039.72,57947,null,null,null,0,0,13907.28,44039.72,57947," ",81.509874528779619,103.24584106978749,97.035564915213826]
[{"$f":"IF(COUNTRY_INFO!A36=0,\" \",COUNTRY_INFO!A36)","v":" Congo"},{"$f":"IF(COUNTRY_INFO!B36=0,\" \",COUNTRY_INFO!B36)","v":"Niari"},{"$f":"IF(COUNTRY_INFO!C36=0,\" \",COUNTRY_INFO!C36)","v":"Dolisie"},"MDA4 (ALB/2*ALB)","1 er passage Avr et 2ème passage Nov",null,24154.079999999998,60385.2,84539.28,null,18765.88,48255.119999999995,67021,null,19192.560000000001,60776.44,79969,0,19192.560000000001,60776.44,79969," ",79.458874028735522,100.64790710306499,94.593897653256576]
[{"$f":"IF(COUNTRY_INFO!A37=0,\" \",COUNTRY_INFO!A37)","v":" Congo"},{"$f":"IF(COUNTRY_INFO!B37=0,\" \",COUNTRY_INFO!B37)","v":"Niari"},{"$f":"IF(COUNTRY_INFO!C37=0,\" \",COUNTRY_INFO!C37)","v":"Kibangou"},"MDA4 (ALB/2*ALB)","1 er passage Avr et 2ème passage Nov",null,5516.16,13790.4,19306.559999999998,null,5210.2400000000007,13397.759999999998,18608,null,4507.92,14275.08,18783,0,5210.2400000000007,14275.08,19485.32," ",94.454113006149214,103.51461886529761,100.92590290554094]
[{"$f":"IF(COUNTRY_INFO!A38=0,\" \",COUNTRY_INFO!A38)","v":" Congo"},{"$f":"IF(COUNTRY_INFO!B38=0,\" \",COUNTRY_INFO!B38)","v":"Niari"},{"$f":"IF(COUNTRY_INFO!C38=0,\" \",COUNTRY_INFO!C38)","v":"Kimongo-Londela Nkayes"},{"$f":"IF(COUNTRY_INFO!$U$9:$U$1000=\"MDA4 (ALB/2*ALB)\", COUNTRY_INFO!$U$9:$U$1000, \" \")","v":"MDA4 (ALB/2*ALB)"},"1 er passage Avr et 2ème passage Nov",null,6698.88,16747.2,23446.080000000002,null,4772.6000000000004,12272.4,17045,null,5364.48,16987.52,22352,0,5364.48,16987.52,22352," ",80.080252221266832,101.434986146938,95.333633596746225]
[{"$f":"IF(COUNTRY_INFO!A39=0,\" \",COUNTRY_INFO!A39)","v":" Congo"},{"$f":"IF(COUNTRY_INFO!B39=0,\" \",COUNTRY_INFO!B39)","v":"Niari"},{"$f":"IF(COUNTRY_INFO!C39=0,\" \",COUNTRY_INFO!C39)","v":"Mayoko"},{"$f":"IF(COUNTRY_INFO!$U$9:$U$1000=\"MDA4 (ALB/2*ALB)\", COUNTRY_INFO!$U$9:$U$1000, \" \")","v":" "},null,0,0,0,0,null,null,null,0,null,0,0,0,0,0,0,0," "," "," "," "]
[{"$f":"IF(COUNTRY_INFO!A40=0,\" \",COUNTRY_INFO!A40)","v":" Congo"},{"$f":"IF(COUNTRY_INFO!B40=0,\" \",COUNTRY_INFO!B40)","v":"Niari"},{"$f":"IF(COUNTRY_INFO!C40=0,\" \",COUNTRY_INFO!C40)","v":"Mossendjo"},{"$f":"IF(COUNTRY_INFO!$U$9:$U$1000=\"MDA4 (ALB/2*ALB)\", COUNTRY_INFO!$U$9:$U$1000, \" \")","v":" "},null,0,0,0,0,null,null,null,0,null,0,0,0,0,0,0,0," "," "," "," "]
[{"$f":"IF(COUNTRY_INFO!A41=0,\" \",COUNTRY_INFO!A41)","v":" Congo"},{"$f":"IF(COUNTRY_INFO!B41=0,\" \",COUNTRY_INFO!B41)","v":"Plateaux"},{"$f":"IF(COUNTRY_INFO!C41=0,\" \",COUNTRY_INFO!C41)","v":"Abala"},{"$f":"IF(COUNTRY_INFO!$U$9:$U$1000=\"MDA4 (ALB/2*ALB)\", COUNTRY_INFO!$U$9:$U$1000, \" \")","v":" "},null,0,0,0,0,null,null,null,0,null,0,0,0,0,0,0,0," "," "," "," "]
[{"$f":"IF(COUNTRY_INFO!A42=0,\" \",COUNTRY_INFO!A42)","v":" Congo"},{"$f":"IF(COUNTRY_INFO!B42=0,\" \",COUNTRY_INFO!B42)","v":"Plateaux"},{"$f":"IF(COUNTRY_INFO!C42=0,\" \",COUNTRY_INFO!C42)","v":"Djambala-Lékana"},{"$f":"IF(COUNTRY_INFO!$U$9:$U$1000=\"MDA4 (ALB/2*ALB)\", COUNTRY_INFO!$U$9:$U$1000, \" \")","v":" "},null,0,0,0,0,null,null,null,0,null,0,0,0,0,0,0,0," "," "," "," "]
[{"$f":"IF(COUNTRY_INFO!A43=0,\" \",COUNTRY_INFO!A43)","v":" Congo"},{"$f":"IF(COUNTRY_INFO!B43=0,\" \",COUNTRY_INFO!B43)","v":"Plateaux"},{"$f":"IF(COUNTRY_INFO!C43=0,\" \",COUNTRY_INFO!C43)","v":"Gamboma"},{"$f":"IF(COUNTRY_INFO!$U$9:$U$1000=\"MDA4 (ALB/2*ALB)\", COUNTRY_INFO!$U$9:$U$1000, \" \")","v":" "},null,0,0,0,0,null,null,null,0,null,0,0,0,0,0,0,0," "," "," "," "]
[{"$f":"IF(COUNTRY_INFO!A44=0,\" \",COUNTRY_INFO!A44)","v":" Congo"},{"$f":"IF(COUNTRY_INFO!B44=0,\" \",COUNTRY_INFO!B44)","v":"Plateaux"},{"$f":"IF(COUNTRY_INFO!C44=0,\" \",COUNTRY_INFO!C44)","v":"Ngo Mpouya"},{"$f":"IF(COUNTRY_INFO!$U$9:$U$1000=\"MDA4 (ALB/2*ALB)\", COUNTRY_INFO!$U$9:$U$1000, \" \")","v":" "},null,0,0,0,0,null,null,null,0,null,0,0,0,0,0,0,0," "," "," "," "]
[{"$f":"IF(COUNTRY_INFO!A45=0,\" \",COUNTRY_INFO!A45)","v":" Congo"},{"$f":"IF(COUNTRY_INFO!B45=0,\" \",COUNTRY_INFO!B45)","v":"Pointe-Noire"},{"$f":"IF(COUNTRY_INFO!C45=0,\" \",COUNTRY_INFO!C45)","v":"Loandjili"},{"$f":"IF(COUNTRY_INFO!$U$9:$U$1000=\"MDA4 (ALB/2*ALB)\", COUNTRY_INFO!$U$9:$U$1000, \" \")","v":" "},null,0,0,0,0,null,null,null,0,null,0,0,0,0,0,0,0," "," "," "," "]
[{"$f":"IF(COUNTRY_INFO!A46=0,\" \",COUNTRY_INFO!A46)","v":" Congo"},{"$f":"IF(COUNTRY_INFO!B46=0,\" \",COUNTRY_INFO!B46)","v":"Pointe-Noire"},{"$f":"IF(COUNTRY_INFO!C46=0,\" \",COUNTRY_INFO!C46)","v":"Lumumba"},{"$f":"IF(COUNTRY_INFO!$U$9:$U$1000=\"MDA4 (ALB/2*ALB)\", COUNTRY_INFO!$U$9:$U$1000, \" \")","v":" "},null,0,0,0,0,null,null,null,0,null,0,0,0,0,0,0,0," "," "," "," "]
[{"$f":"IF(COUNTRY_INFO!A47=0,\" \",COUNTRY_INFO!A47)","v":" Congo"},{"$f":"IF(COUNTRY_INFO!B47=0,\" \",COUNTRY_INFO!B47)","v":"Pointe-Noire"},{"$f":"IF(COUNTRY_INFO!C47=0,\" \",COUNTRY_INFO!C47)","v":"Mongo-Poukou"},{"$f":"IF(COUNTRY_INFO!$U$9:$U$1000=\"MDA4 (ALB/2*ALB)\", COUNTRY_INFO!$U$9:$U$1000, \" \")","v":" "},null,0,0,0,0,null,null,null,0,null,0,0,0,0,0,0,0," "," "," "," "]
[{"$f":"IF(COUNTRY_INFO!A48=0,\" \",COUNTRY_INFO!A48)","v":" Congo"},{"$f":"IF(COUNTRY_INFO!B48=0,\" \",COUNTRY_INFO!B48)","v":"Pointe-Noire"},{"$f":"IF(COUNTRY_INFO!C48=0,\" \",COUNTRY_INFO!C48)","v":"Mvoumvou"},{"$f":"IF(COUNTRY_INFO!$U$9:$U$1000=\"MDA4 (ALB/2*ALB)\", COUNTRY_INFO!$U$9:$U$1000, \" \")","v":" "},null,0,0,0,0,null,null,null,0,null,0,0,0,0,0,0,0," "," "," "," "]
[{"$f":"IF(COUNTRY_INFO!A49=0,\" \",COUNTRY_INFO!A49)","v":" Congo"},{"$f":"IF(COUNTRY_INFO!B49=0,\" \",COUNTRY_INFO!B49)","v":"Pointe-Noire"},{"$f":"IF(COUNTRY_INFO!C49=0,\" \",COUNTRY_INFO!C49)","v":"Ngoyo"},{"$f":"IF(COUNTRY_INFO!$U$9:$U$1000=\"MDA4 (ALB/2*ALB)\", COUNTRY_INFO!$U$9:$U$1000, \" \")","v":" "},null,0,0,0,0,null,null,null,0,null,0,0,0,0,0,0,0," "," "," "," "]
[{"$f":"IF(COUNTRY_INFO!A50=0,\" \",COUNTRY_INFO!A50)","v":" Congo"},{"$f":"IF(COUNTRY_INFO!B50=0,\" \",COUNTRY_INFO!B50)","v":"Pointe-Noire"},{"$f":"IF(COUNTRY_INFO!C50=0,\" \",COUNTRY_INFO!C50)","v":"Tchiamba Nzassi"},{"$f":"IF(COUNTRY_INFO!$U$9:$U$1000=\"MDA4 (ALB/2*ALB)\", COUNTRY_INFO!$U$9:$U$1000, \" \")","v":" "},null,0,0,0,0,null,null,null,0,null,0,0,0,0,0,0,0," "," "," "," "]
[{"$f":"IF(COUNTRY_INFO!A51=0,\" \",COUNTRY_INFO!A51)","v":" Congo"},{"$f":"IF(COUNTRY_INFO!B51=0,\" \",COUNTRY_INFO!B51)","v":"Pointe-Noire"},{"$f":"IF(COUNTRY_INFO!C51=0,\" \",COUNTRY_INFO!C51)","v":"Tie-Tie"},{"$f":"IF(COUNTRY_INFO!$U$9:$U$1000=\"MDA4 (ALB/2*ALB)\", COUNTRY_INFO!$U$9:$U$1000, \" \")","v":" "},null,0,0,0,0,null,null,null,0,null,0,0,0,0,0,0,0," "," "," "," "]
[{"$f":"IF(COUNTRY_INFO!A52=0,\" \",COUNTRY_INFO!A52)","v":" Congo"},{"$f":"IF(COUNTRY_INFO!B52=0,\" \",COUNTRY_INFO!B52)","v":"Pool"},{"$f":"IF(COUNTRY_INFO!C52=0,\" \",COUNTRY_INFO!C52)","v":"Boko"},{"$f":"IF(COUNTRY_INFO!$U$9:$U$1000=\"MDA4 (ALB/2*ALB)\", COUNTRY_INFO!$U$9:$U$1000, \" \")","v":" "},null,0,0,0,0,null,null,null,0,null,0,0,0,0,0,0,0," "," "," "," "]
[{"$f":"IF(COUNTRY_INFO!A53=0,\" \",COUNTRY_INFO!A53)","v":" Congo"},{"$f":"IF(COUNTRY_INFO!B53=0,\" \",COUNTRY_INFO!B53)","v":"Pool"},{"$f":"IF(COUNTRY_INFO!C53=0,\" \",COUNTRY_INFO!C53)","v":"Goma tsétsé"},{"$f":"IF(COUNTRY_INFO!$U$9:$U$1000=\"MDA4 (ALB/2*ALB)\", COUNTRY_INFO!$U$9:$U$1000, \" \")","v":" "},null,0,0,0,0,null,null,null,0,null,0,0,0,0,0,0,0," "," "," "," "]
[{"$f":"IF(COUNTRY_INFO!A54=0,\" \",COUNTRY_INFO!A54)","v":" Congo"},{"$f":"IF(COUNTRY_INFO!B54=0,\" \",COUNTRY_INFO!B54)","v":"Pool"},{"$f":"IF(COUNTRY_INFO!C54=0,\" \",COUNTRY_INFO!C54)","v":"Ignié"},"MDA4 (ALB/2*ALB)","1 er passage Avr et 2ème passage Nov",null,13164.48,32911.199999999997,46075.679999999993,null,12001.920000000002,30862.079999999998,42864,null,10912.32,34555.68,45468,0,12001.920000000002,34555.68,46557.600000000006," ",91.168963757018901,104.99671844235398,101.04593138940112]
[{"$f":"IF(COUNTRY_INFO!A55=0,\" \",COUNTRY_INFO!A55)","v":" Congo"},{"$f":"IF(COUNTRY_INFO!B55=0,\" \",COUNTRY_INFO!B55)","v":"Pool"},{"$f":"IF(COUNTRY_INFO!C55=0,\" \",COUNTRY_INFO!C55)","v":"Kindamba"},{"$f":"IF(COUNTRY_INFO!$U$9:$U$1000=\"MDA4 (ALB/2*ALB)\", COUNTRY_INFO!$U$9:$U$1000, \" \")","v":" "},null,0,0,0,0,null,null,null,0,null,0,0,0,0,0,0,0," "," "," "," "]
[{"$f":"IF(COUNTRY_INFO!A56=0,\" \",COUNTRY_INFO!A56)","v":" Congo"},{"$f":"IF(COUNTRY_INFO!B56=0,\" \",COUNTRY_INFO!B56)","v":"Pool"},{"$f":"IF(COUNTRY_INFO!C56=0,\" \",COUNTRY_INFO!C56)","v":"Kinkala"},{"$f":"IF(COUNTRY_INFO!$U$9:$U$1000=\"MDA4 (ALB/2*ALB)\", COUNTRY_INFO!$U$9:$U$1000, \" \")","v":" "},null,0,0,0,0,null,null,null,0,null,0,0,0,0,0,0,0," "," "," "," "]
[{"$f":"IF(COUNTRY_INFO!A57=0,\" \",COUNTRY_INFO!A57)","v":" Congo"},{"$f":"IF(COUNTRY_INFO!B57=0,\" \",COUNTRY_INFO!B57)","v":"Pool"},{"$f":"IF(COUNTRY_INFO!C57=0,\" \",COUNTRY_INFO!C57)","v":"Kintélé"},{"$f":"IF(COUNTRY_INFO!$U$9:$U$1000=\"MDA4 (ALB/2*ALB)\", COUNTRY_INFO!$U$9:$U$1000, \" \")","v":" "},null,0,0,0,0,null,null,null,0,null,0,0,0,0,0,0,0," "," "," "," "]
[{"$f":"IF(COUNTRY_INFO!A58=0,\" \",COUNTRY_INFO!A58)","v":" Congo"},{"$f":"IF(COUNTRY_INFO!B58=0,\" \",COUNTRY_INFO!B58)","v":"Pool"},{"$f":"IF(COUNTRY_INFO!C58=0,\" \",COUNTRY_INFO!C58)","v":"Mindouli"},{"$f":"IF(COUNTRY_INFO!$U$9:$U$1000=\"MDA4 (ALB/2*ALB)\", COUNTRY_INFO!$U$9:$U$1000, \" \")","v":" "},null,0,0,0,0,null,null,null,0,null,0,0,0,0,0,0,0," "," "," "," "]
[{"$f":"IF(COUNTRY_INFO!A59=0,\" \",COUNTRY_INFO!A59)","v":" Congo"},{"$f":"IF(COUNTRY_INFO!B59=0,\" \",COUNTRY_INFO!B59)","v":"Sangha"},{"$f":"IF(COUNTRY_INFO!C59=0,\" \",COUNTRY_INFO!C59)","v":"Ouesso"},{"$f":"IF(COUNTRY_INFO!$U$9:$U$1000=\"MDA4 (ALB/2*ALB)\", COUNTRY_INFO!$U$9:$U$1000, \" \")","v":"MDA4 (ALB/2*ALB)"},"1 seul passage septembre",null,14673.359999999999,36683.4,51356.76,null,11715.12,37097.879999999997,48813,null,null,null,0,0,11715.12,37097.879999999997,48813," ",79.839382390945232,101.12988436186394,95.046883798744304]
[{"$f":"IF(COUNTRY_INFO!A60=0,\" \",COUNTRY_INFO!A60)","v":" Congo"},{"$f":"IF(COUNTRY_INFO!B60=0,\" \",COUNTRY_INFO!B60)","v":"Sangha"},{"$f":"IF(COUNTRY_INFO!C60=0,\" \",COUNTRY_INFO!C60)","v":"Sembé-Souanké"},{"$f":"IF(COUNTRY_INFO!$U$9:$U$1000=\"MDA4 (ALB/2*ALB)\", COUNTRY_INFO!$U$9:$U$1000, \" \")","v":"MDA4 (ALB/2*ALB)"},"1 seul passage septembre",null,6741.5999999999995,16854,23595.599999999999,null,5227.92,16555.080000000002,21783,null,null,null,0,0,5227.92,16555.080000000002,21783," ",77.547169811320757,98.226415094339643,92.318059299191376]

{"sheet":"MDA3","index":4,"n_rows":60,"n_cols":20,"rows_kept":60,"cut":false,"hidden":false,"merged":[[5,5,5,7],[5,17,5,19],[3,0,3,2],[5,0,5,2],[5,3,6,3],[5,4,6,4],[5,8,5,10],[5,11,5,13],[5,14,5,16]]}
["MDA 3 - Ivermectine (IVM) ",null,null,null,null,null,null,null,null,null,null,null," "]
["Structure administrative, population nécessitant une chimioprévention par groupe d'âge, population traitée par groupe d'âge et couverture"]
[]
["TOTAL",null,null,null,null,{"$f":"SUM(F$9:F$1000)","v":136495.92000000001},341239.79999999993,477735.72,110751.6,350714.39999999997,461466,0,0,0,110751.6,350714.39999999997,461466,{"$f":"IF(F4<>0, IF(O4/F4*100=0, \"-\", O4/F4*100), \" \")","v":81.139128554172174},{"$f":"IF(G4<>0, IF(P4/G4*100=0, \"-\", P4/G4*100), \" \")","v":102.77652255100374},{"$f":"IF(H4<>0, IF(Q4/H4*100=0, \"-\", Q4/H4*100), \" \")","v":96.594409980480421}]
[]
["Structure administrative du pays",null,null,"Mise en oeuvre \nde la CP","Date","Population ciblée pour MDA 3",null,null,"Population traitée - tournée 1",null,null,"Population traitée - tournée 2",null,null,"Population traitée",null,null,"Couverture du Programme (%)"]
["Pays","Région/Département","District",null,null,"EAS","Adultes","Total","EAS","Adultes","Total","EAS","Adultes","Total","EAS","Adultes","Total","EAS","Adultes","Total"]
[]
[{"$f":"IF(COUNTRY_INFO!A9=0,\" \",COUNTRY_INFO!A9)","v":" Congo"},{"$f":"IF(COUNTRY_INFO!B9=0,\" \",COUNTRY_INFO!B9)","v":"Bouenza"},{"$f":"IF(COUNTRY_INFO!C9=0,\" \",COUNTRY_INFO!C9)","v":"Loudima"},{"$f":"IF(COUNTRY_INFO!$U$9:$U$1000=\"MDA3 (IVM)\", COUNTRY_INFO!$U$9:$U$1000, \" \")","v":"MDA3 (IVM)"},"Aout à Nov",3888.96,9722.4,{"$f":"SUM(F9:G9)","v":13611.36},3213.6,10176.4,{"$f":"SUM(I9:J9)","v":13390},null,null,{"$f":"SUM(L9:M9)","v":0},{"$f":"MAX(I9,L9)","v":3213.6},10176.4,{"$f":"SUM(O9:P9)","v":13390},{"$f":"IF(F9<>0, IF(MAX(I9,L9)/F9*100=0, \"-\", MAX(I9,L9)/F9*100), \" \")","v":82.633917551221913},104.66962889821443,{"$f":"IF(H9<>0, IF((MAX(I9,L9)+MAX(J9,M9))/H9*100=0, \"-\",(MAX(I9,L9)+MAX(J9,M9))/H9*100), \" \")","v":98.373711370502278}]
[{"$f":"IF(COUNTRY_INFO!A10=0,\" \",COUNTRY_INFO!A10)","v":" Congo"},{"$f":"IF(COUNTRY_INFO!B10=0,\" \",COUNTRY_INFO!B10)","v":"Bouenza"},{"$f":"IF(COUNTRY_INFO!C10=0,\" \",COUNTRY_INFO!C10)","v":"Loutété"},null,null,0,0,{"$f":"SUM(F10:G10)","v":0},0,0,{"$f":"SUM(I10:J10)","v":0},null,null,{"$f":"SUM(L10:M10)","v":0},{"$f":"MAX(I10,L10)","v":0},{"$f":"MAX(J10,M10)","v":0},{"$f":"SUM(O10:P10)","v":0},{"$f":"IF(F10<>0, IF(MAX(I10,L10)/F10*100=0, \"-\", MAX(I10,L10)/F10*100), \" \")","v":" "},{"$f":"IF(G10<>0, IF(MAX(J10,M10)/G10*100=0, \"-\", MAX(J10,M10)/G10*100), \" \")","v":" "},{"$f":"IF(H10<>0, IF((MAX(I10,L10)+MAX(J10,M10))/H10*100=0, \"-\",(MAX(I10,L10)+MAX(J10,M10))/H10*100), \" \")","v":" "}]
[{"$f":"IF(COUNTRY_INFO!A11=0,\" \",COUNTRY_INFO!A11)","v":" Congo"},{"$f":"IF(COUNTRY_INFO!B11=0,\" \",COUNTRY_INFO!B11)","v":"Bouenza"},{"$f":"IF(COUNTRY_INFO!C11=0,\" \",COUNTRY_INFO!C11)","v":"Madingou"},null,null,0,0,0,0,0,0,null,null,0,0,0,0," "," "," "]
[{"$f":"IF(COUNTRY_INFO!A12=0,\" \",COUNTRY_INFO!A12)","v":" Congo"},{"$f":"IF(COUNTRY_INFO!B12=0,\" \",COUNTRY_INFO!B12)","v":"Bouenza"},{"$f":"IF(COUNTRY_INFO!C12=0,\" \",COUNTRY_INFO!C12)","v":"Mouyondzi"},null,null,0,0,0,0,0,0,null,null,0,0,0,0," "," "," "]
[{"$f":"IF(COUNTRY_INFO!A13=0,\" \",COUNTRY_INFO!A13)","v":" Congo"},{"$f":"IF(COUNTRY_INFO!B13=0,\" \",COUNTRY_INFO!B13)","v":"Bouenza"},{"$f":"IF(COUNTRY_INFO!C13=0,\" \",COUNTRY_INFO!C13)","v":"Nkayi"},{"$f":"IF(COUNTRY_INFO!$U$9:$U$1000=\"MDA3 (IVM)\", COUNTRY_INFO!$U$9:$U$1000, \" \")","v":"MDA3 (IVM)"},"Aout à Nov",9179.76,22949.4,32129.160000000003,7266.72,23011.279999999999,30278,null,null,0,7266.72,23011.279999999999,30278,79.160239483385183,100.26963667895457,94.23838033736331]
[{"$f":"IF(COUNTRY_INFO!A14=0,\" \",COUNTRY_INFO!A14)","v":" Congo"},{"$f":"IF(COUNTRY_INFO!B14=0,\" \",COUNTRY_INFO!B14)","v":"Brazzaville"},{"$f":"IF(COUNTRY_INFO!C14=0,\" \",COUNTRY_INFO!C14)","v":"Bacongo"},{"$f":"IF(COUNTRY_INFO!$U$9:$U$1000=\"MDA3 (IVM)\", COUNTRY_INFO!$U$9:$U$1000, \" \")","v":"MDA3 (IVM)"},"Aout à Nov",29358.239999999998,73395.600000000006,102753.84,23922.48,75754.52,99677,null,null,0,23922.48,75754.52,99677,81.484721154946627,103.21398012959904,97.005620422555509]
[{"$f":"IF(COUNTRY_INFO!A15=0,\" \",COUNTRY_INFO!A15)","v":" Congo"},{"$f":"IF(COUNTRY_INFO!B15=0,\" \",COUNTRY_INFO!B15)","v":"Brazzaville"},{"$f":"IF(COUNTRY_INFO!C15=0,\" \",COUNTRY_INFO!C15)","v":"Djiri"},{"$f":"IF(COUNTRY_INFO!$U$9:$U$1000=\"MDA3 (IVM)\", COUNTRY_INFO!$U$9:$U$1000, \" \")","v":" "},null,0,0,0,0,0,0,null,null,0,0,0,0," "," "," "]
[{"$f":"IF(COUNTRY_INFO!A16=0,\" \",COUNTRY_INFO!A16)","v":" Congo"},{"$f":"IF(COUNTRY_INFO!B16=0,\" \",COUNTRY_INFO!B16)","v":"Brazzaville"},{"$f":"IF(COUNTRY_INFO!C16=0,\" \",COUNTRY_INFO!C16)","v":"Île Mbamou"},{"$f":"IF(COUNTRY_INFO!$U$9:$U$1000=\"MDA3 (IVM)\", COUNTRY_INFO!$U$9:$U$1000, \" \")","v":" "},null,0,0,0,0,0,0,null,null,0,0,0,0," "," "," "]
[{"$f":"IF(COUNTRY_INFO!A17=0,\" \",COUNTRY_INFO!A17)","v":" Congo"},{"$f":"IF(COUNTRY_INFO!B17=0,\" \",COUNTRY_INFO!B17)","v":"Brazzaville"},{"$f":"IF(COUNTRY_INFO!C17=0,\" \",COUNTRY_INFO!C17)","v":"Madibou"},{"$f":"IF(COUNTRY_INFO!$U$9:$U$1000=\"MDA3 (IVM)\", COUNTRY_INFO!$U$9:$U$1000, \" \")","v":"MDA3 (IVM)"},"Aout à Nov",23270.639999999999,58176.6,81447.239999999991,18555.36,58758.64,77314,null,null,0,18555.36,58758.64,77314,79.73721393137447,101.00047097974098,94.925254680207715]
[{"$f":"IF(COUNTRY_INFO!A18=0,\" \",COUNTRY_INFO!A18)","v":" Congo"},{"$f":"IF(COUNTRY_INFO!B18=0,\" \",COUNTRY_INFO!B18)","v":"Brazzaville"},{"$f":"IF(COUNTRY_INFO!C18=0,\" \",COUNTRY_INFO!C18)","v":"Makélékélé"},{"$f":"IF(COUNTRY_INFO!$U$9:$U$1000=\"MDA3 (IVM)\", COUNTRY_INFO!$U$9:$U$1000, \" \")","v":"MDA3 (IVM)"},"Aout à Nov",22590.719999999998,56476.800000000003,79067.520000000004,18822.72,59605.279999999999,78428,null,null,0,18822.72,59605.279999999999,78428,83.320584735679091,105.53940733186016,99.191172304379847]
[{"$f":"IF(COUNTRY_INFO!A19=0,\" \",COUNTRY_INFO!A19)","v":" Congo"},{"$f":"IF(COUNTRY_INFO!B19=0,\" \",COUNTRY_INFO!B19)","v":"Brazzaville"},{"$f":"IF(COUNTRY_INFO!C19=0,\" \",COUNTRY_INFO!C19)","v":"Mfilou"},{"$f":"IF(COUNTRY_INFO!$U$9:$U$1000=\"MDA3 (IVM)\", COUNTRY_INFO!$U$9:$U$1000, \" \")","v":"MDA3 (IVM)"},"Aout à Nov",20904,52260,73164,17217.36,54521.64,71739,null,null,0,17217.36,54521.64,71739,82.363949483352471,104.32766934557979,98.052320813514854]
[{"$f":"IF(COUNTRY_INFO!A20=0,\" \",COUNTRY_INFO!A20)","v":" Congo"},{"$f":"IF(COUNTRY_INFO!B20=0,\" \",COUNTRY_INFO!B20)","v":"Brazzaville"},{"$f":"IF(COUNTRY_INFO!C20=0,\" \",COUNTRY_INFO!C20)","v":"Moungali"},{"$f":"IF(COUNTRY_INFO!$U$9:$U$1000=\"MDA3 (IVM)\", COUNTRY_INFO!$U$9:$U$1000, \" \")","v":" "},null,0,0,0,0,0,0,null,null,0,0,0,0," "," "," "]
[{"$f":"IF(COUNTRY_INFO!A21=0,\" \",COUNTRY_INFO!A21)","v":" Congo"},{"$f":"IF(COUNTRY_INFO!B21=0,\" \",COUNTRY_INFO!B21)","v":"Brazzaville"},{"$f":"IF(COUNTRY_INFO!C21=0,\" \",COUNTRY_INFO!C21)","v":"Ouenzé"},{"$f":"IF(COUNTRY_INFO!$U$9:$U$1000=\"MDA3 (IVM)\", COUNTRY_INFO!$U$9:$U$1000, \" \")","v":" "},null,0,0,0,0,0,0,null,null,0,0,0,0," "," "," "]
[{"$f":"IF(COUNTRY_INFO!A22=0,\" \",COUNTRY_INFO!A22)","v":" Congo"},{"$f":"IF(COUNTRY_INFO!B22=0,\" \",COUNTRY_INFO!B22)","v":"Brazzaville"},{"$f":"IF(COUNTRY_INFO!C22=0,\" \",COUNTRY_INFO!C22)","v":"Poto-Poto"},{"$f":"IF(COUNTRY_INFO!$U$9:$U$1000=\"MDA3 (IVM)\", COUNTRY_INFO!$U$9:$U$1000, \" \")","v":" "},null,0,0,0,0,0,0,null,null,0,0,0,0," "," "," "]
[{"$f":"IF(COUNTRY_INFO!A23=0,\" \",COUNTRY_INFO!A23)","v":" Congo"},{"$f":"IF(COUNTRY_INFO!B23=0,\" \",COUNTRY_INFO!B23)","v":"Brazzaville"},{"$f":"IF(COUNTRY_INFO!C23=0,\" \",COUNTRY_INFO!C23)","v":"Talangaî"},{"$f":"IF(COUNTRY_INFO!$U$9:$U$1000=\"MDA3 (IVM)\", COUNTRY_INFO!$U$9:$U$1000, \" \")","v":" "},null,0,0,0,0,0,0,null,null,0,0,0,0," "," "," "]
[{"$f":"IF(COUNTRY_INFO!A24=0,\" \",COUNTRY_INFO!A24)","v":" Congo"},{"$f":"IF(COUNTRY_INFO!B24=0,\" \",COUNTRY_INFO!B24)","v":"Cuvette"},{"$f":"IF(COUNTRY_INFO!C24=0,\" \",COUNTRY_INFO!C24)","v":"Mossaka"},{"$f":"IF(COUNTRY_INFO!$U$9:$U$1000=\"MDA3 (IVM)\", COUNTRY_INFO!$U$9:$U$1000, \" \")","v":" "},null,0,0,0,0,0,0,null,null,0,0,0,0," "," "," "]
[{"$f":"IF(COUNTRY_INFO!A25=0,\" \",COUNTRY_INFO!A25)","v":" Congo"},{"$f":"IF(COUNTRY_INFO!B25=0,\" \",COUNTRY_INFO!B25)","v":"Cuvette"},{"$f":"IF(COUNTRY_INFO!C25=0,\" \",COUNTRY_INFO!C25)","v":"Owando"},{"$f":"IF(COUNTRY_INFO!$U$9:$U$1000=\"MDA3 (IVM)\", COUNTRY_INFO!$U$9:$U$1000, \" \")","v":" "},null,0,0,0,0,0,0,null,null,0,0,0,0," "," "," "]
[{"$f":"IF(COUNTRY_INFO!A26=0,\" \",COUNTRY_INFO!A26)","v":" Congo"},{"$f":"IF(COUNTRY_INFO!B26=0,\" \",COUNTRY_INFO!B26)","v":"Cuvette"},{"$f":"IF(COUNTRY_INFO!C26=0,\" \",COUNTRY_INFO!C26)","v":"Oyo-Alima"},{"$f":"IF(COUNTRY_INFO!$U$9:$U$1000=\"MDA3 (IVM)\", COUNTRY_INFO!$U$9:$U$1000, \" \")","v":" "},null,0,0,0,0,0,0,null,null,0,0,0,0," "," "," "]
[{"$f":"IF(COUNTRY_INFO!A27=0,\" \",COUNTRY_INFO!A27)","v":" Congo"},{"$f":"IF(COUNTRY_INFO!B27=0,\" \",COUNTRY_INFO!B27)","v":"Cuvette-Ouest"},{"$f":"IF(COUNTRY_INFO!C27=0,\" \",COUNTRY_INFO!C27)","v":"Etoumbi"},{"$f":"IF(COUNTRY_INFO!$U$9:$U$1000=\"MDA3 (IVM)\", COUNTRY_INFO!$U$9:$U$1000, \" \")","v":" "},null,0,0,0,0,0,0,null,null,0,0,0,0," "," "," "]
[{"$f":"IF(COUNTRY_INFO!A28=0,\" \",COUNTRY_INFO!A28)","v":" Congo"},{"$f":"IF(COUNTRY_INFO!B28=0,\" \",COUNTRY_INFO!B28)","v":"Cuvette-Ouest"},{"$f":"IF(COUNTRY_INFO!C28=0,\" \",COUNTRY_INFO!C28)","v":"Ewo"},{"$f":"IF(COUNTRY_INFO!$U$9:$U$1000=\"MDA3 (IVM)\", COUNTRY_INFO!$U$9:$U$1000, \" \")","v":" "},null,0,0,0,0,0,0,null,null,0,0,0,0," "," "," "]
[{"$f":"IF(COUNTRY_INFO!A29=0,\" \",COUNTRY_INFO!A29)","v":" Congo"},{"$f":"IF(COUNTRY_INFO!B29=0,\" \",COUNTRY_INFO!B29)","v":"Kouilou"},{"$f":"IF(COUNTRY_INFO!C29=0,\" \",COUNTRY_INFO!C29)","v":"Hinda-Loango"},{"$f":"IF(COUNTRY_INFO!$U$9:$U$1000=\"MDA3 (IVM)\", COUNTRY_INFO!$U$9:$U$1000, \" \")","v":" "},null,0,0,0,0,0,0,null,null,0,0,0,0," "," "," "]
[{"$f":"IF(COUNTRY_INFO!A30=0,\" \",COUNTRY_INFO!A30)","v":" Congo"},{"$f":"IF(COUNTRY_INFO!B30=0,\" \",COUNTRY_INFO!B30)","v":"Kouilou"},{"$f":"IF(COUNTRY_INFO!C30=0,\" \",COUNTRY_INFO!C30)","v":"Madingo Kayes-Nzambi"},{"$f":"IF(COUNTRY_INFO!$U$9:$U$1000=\"MDA3 (IVM)\", COUNTRY_INFO!$U$9:$U$1000, \" \")","v":" "},null,null,null,0,null,null,0,null,null,0,0,0,0," "," "," "]
[{"$f":"IF(COUNTRY_INFO!A31=0,\" \",COUNTRY_INFO!A31)","v":" Congo"},{"$f":"IF(COUNTRY_INFO!B31=0,\" \",COUNTRY_INFO!B31)","v":"Kouilou"},{"$f":"IF(COUNTRY_INFO!C31=0,\" \",COUNTRY_INFO!C31)","v":"Mvouti-Kakamouéka"},{"$f":"IF(COUNTRY_INFO!$U$9:$U$1000=\"MDA3 (IVM)\", COUNTRY_INFO!$U$9:$U$1000, \" \")","v":"MDA3 (IVM)"},"Aout à Nov",219.12,547.79999999999995,766.92,192,609,801,null,null,0,192,609,801,87.623220153340625,111.17196056955095,104.44374902206228]
[{"$f":"IF(COUNTRY_INFO!A32=0,\" \",COUNTRY_INFO!A32)","v":" Congo"},{"$f":"IF(COUNTRY_INFO!B32=0,\" \",COUNTRY_INFO!B32)","v":"Lékoumou"},{"$f":"IF(COUNTRY_INFO!C32=0,\" \",COUNTRY_INFO!C32)","v":"Sibiti"},{"$f":"IF(COUNTRY_INFO!$U$9:$U$1000=\"MDA3 (IVM)\", COUNTRY_INFO!$U$9:$U$1000, \" \")","v":"MDA3 (IVM)"},"Aout à Nov",172.79999999999998,432,604.79999999999995,146.4,463.6,610,null,null,0,146.4,463.6,610,84.722222222222229,107.31481481481482,100.85978835978837]
[{"$f":"IF(COUNTRY_INFO!A33=0,\" \",COUNTRY_INFO!A33)","v":" Congo"},{"$f":"IF(COUNTRY_INFO!B33=0,\" \",COUNTRY_INFO!B33)","v":"Lékoumou"},{"$f":"IF(COUNTRY_INFO!C33=0,\" \",COUNTRY_INFO!C33)","v":"Zanaga"},{"$f":"IF(COUNTRY_INFO!$U$9:$U$1000=\"MDA3 (IVM)\", COUNTRY_INFO!$U$9:$U$1000, \" \")","v":" "},null,0,0,0,0,0,0,null,null,0,0,0,0," "," "," "]
[{"$f":"IF(COUNTRY_INFO!A34=0,\" \",COUNTRY_INFO!A34)","v":" Congo"},{"$f":"IF(COUNTRY_INFO!B34=0,\" \",COUNTRY_INFO!B34)","v":"Likouala"},{"$f":"IF(COUNTRY_INFO!C34=0,\" \",COUNTRY_INFO!C34)","v":"Bétou"},{"$f":"IF(COUNTRY_INFO!$U$9:$U$1000=\"MDA3 (IVM)\", COUNTRY_INFO!$U$9:$U$1000, \" \")","v":" "},null,0,0,0,0,0,0,null,null,0,0,0,0," "," "," "]
[{"$f":"IF(COUNTRY_INFO!A35=0,\" \",COUNTRY_INFO!A35)","v":" Congo"},{"$f":"IF(COUNTRY_INFO!B35=0,\" \",COUNTRY_INFO!B35)","v":"Likouala"},{"$f":"IF(COUNTRY_INFO!C35=0,\" \",COUNTRY_INFO!C35)","v":"Impfondo"},{"$f":"IF(COUNTRY_INFO!$U$9:$U$1000=\"MDA3 (IVM)\", COUNTRY_INFO!$U$9:$U$1000, \" \")","v":" "},null,0,0,0,0,0,0,null,null,0,0,0,0," "," "," "]
[{"$f":"IF(COUNTRY_INFO!A36=0,\" \",COUNTRY_INFO!A36)","v":" Congo"},{"$f":"IF(COUNTRY_INFO!B36=0,\" \",COUNTRY_INFO!B36)","v":"Niari"},{"$f":"IF(COUNTRY_INFO!C36=0,\" \",COUNTRY_INFO!C36)","v":"Dolisie"},{"$f":"IF(COUNTRY_INFO!$U$9:$U$1000=\"MDA3 (IVM)\", COUNTRY_INFO!$U$9:$U$1000, \" \")","v":" "},null,0,0,0,0,0,0,null,null,0,0,0,0," "," "," "]
[{"$f":"IF(COUNTRY_INFO!A37=0,\" \",COUNTRY_INFO!A37)","v":" Congo"},{"$f":"IF(COUNTRY_INFO!B37=0,\" \",COUNTRY_INFO!B37)","v":"Niari"},{"$f":"IF(COUNTRY_INFO!C37=0,\" \",COUNTRY_INFO!C37)","v":"Kibangou"},{"$f":"IF(COUNTRY_INFO!$U$9:$U$1000=\"MDA3 (IVM)\", COUNTRY_INFO!$U$9:$U$1000, \" \")","v":" "},null,0,0,0,0,0,0,null,null,0,0,0,0," "," "," "]
[{"$f":"IF(COUNTRY_INFO!A38=0,\" \",COUNTRY_INFO!A38)","v":" Congo"},{"$f":"IF(COUNTRY_INFO!B38=0,\" \",COUNTRY_INFO!B38)","v":"Niari"},{"$f":"IF(COUNTRY_INFO!C38=0,\" \",COUNTRY_INFO!C38)","v":"Kimongo-Londela Nkayes"},{"$f":"IF(COUNTRY_INFO!$U$9:$U$1000=\"MDA3 (IVM)\", COUNTRY_INFO!$U$9:$U$1000, \" \")","v":" "},null,0,0,0,0,0,0,null,null,0,0,0,0," "," "," "]
[{"$f":"IF(COUNTRY_INFO!A39=0,\" \",COUNTRY_INFO!A39)","v":" Congo"},{"$f":"IF(COUNTRY_INFO!B39=0,\" \",COUNTRY_INFO!B39)","v":"Niari"},{"$f":"IF(COUNTRY_INFO!C39=0,\" \",COUNTRY_INFO!C39)","v":"Mayoko"},{"$f":"IF(COUNTRY_INFO!$U$9:$U$1000=\"MDA3 (IVM)\", COUNTRY_INFO!$U$9:$U$1000, \" \")","v":" "},null,0,0,0,0,0,0,null,null,0,0,0,0," "," "," "]
[{"$f":"IF(COUNTRY_INFO!A40=0,\" \",COUNTRY_INFO!A40)","v":" Congo"},{"$f":"IF(COUNTRY_INFO!B40=0,\" \",COUNTRY_INFO!B40)","v":"Niari"},{"$f":"IF(COUNTRY_INFO!C40=0,\" \",COUNTRY_INFO!C40)","v":"Mossendjo"},{"$f":"IF(COUNTRY_INFO!$U$9:$U$1000=\"MDA3 (IVM)\", COUNTRY_INFO!$U$9:$U$1000, \" \")","v":" "},null,0,0,0,0,0,0,null,null,0,0,0,0," "," "," "]
[{"$f":"IF(COUNTRY_INFO!A41=0,\" \",COUNTRY_INFO!A41)","v":" Congo"},{"$f":"IF(COUNTRY_INFO!B41=0,\" \",COUNTRY_INFO!B41)","v":"Plateaux"},{"$f":"IF(COUNTRY_INFO!C41=0,\" \",COUNTRY_INFO!C41)","v":"Abala"},{"$f":"IF(COUNTRY_INFO!$U$9:$U$1000=\"MDA3 (IVM)\", COUNTRY_INFO!$U$9:$U$1000, \" \")","v":" "},null,0,0,0,0,0,0,null,null,0,0,0,0," "," "," "]
[{"$f":"IF(COUNTRY_INFO!A42=0,\" \",COUNTRY_INFO!A42)","v":" Congo"},{"$f":"IF(COUNTRY_INFO!B42=0,\" \",COUNTRY_INFO!B42)","v":"Plateaux"},{"$f":"IF(COUNTRY_INFO!C42=0,\" \",COUNTRY_INFO!C42)","v":"Djambala-Lékana"},{"$f":"IF(COUNTRY_INFO!$U$9:$U$1000=\"MDA3 (IVM)\", COUNTRY_INFO!$U$9:$U$1000, \" \")","v":" "},null,0,0,0,0,0,0,null,null,0,0,0,0," "," "," "]
[{"$f":"IF(COUNTRY_INFO!A43=0,\" \",COUNTRY_INFO!A43)","v":" Congo"},{"$f":"IF(COUNTRY_INFO!B43=0,\" \",COUNTRY_INFO!B43)","v":"Plateaux"},{"$f":"IF(COUNTRY_INFO!C43=0,\" \",COUNTRY_INFO!C43)","v":"Gamboma"},{"$f":"IF(COUNTRY_INFO!$U$9:$U$1000=\"MDA3 (IVM)\", COUNTRY_INFO!$U$9:$U$1000, \" \")","v":" "},null,0,0,0,0,0,0,null,null,0,0,0,0," "," "," "]
[{"$f":"IF(COUNTRY_INFO!A44=0,\" \",COUNTRY_INFO!A44)","v":" Congo"},{"$f":"IF(COUNTRY_INFO!B44=0,\" \",COUNTRY_INFO!B44)","v":"Plateaux"},{"$f":"IF(COUNTRY_INFO!C44=0,\" \",COUNTRY_INFO!C44)","v":"Ngo Mpouya"},{"$f":"IF(COUNTRY_INFO!$U$9:$U$1000=\"MDA3 (IVM)\", COUNTRY_INFO!$U$9:$U$1000, \" \")","v":" "},null,0,0,0,0,0,0,null,null,0,0,0,0," "," "," "]
[{"$f":"IF(COUNTRY_INFO!A45=0,\" \",COUNTRY_INFO!A45)","v":" Congo"},{"$f":"IF(COUNTRY_INFO!B45=0,\" \",COUNTRY_INFO!B45)","v":"Pointe-Noire"},{"$f":"IF(COUNTRY_INFO!C45=0,\" \",COUNTRY_INFO!C45)","v":"Loandjili"},{"$f":"IF(COUNTRY_INFO!$U$9:$U$1000=\"MDA3 (IVM)\", COUNTRY_INFO!$U$9:$U$1000, \" \")","v":" "},null,0,0,0,0,0,0,null,null,0,0,0,0," "," "," "]
[{"$f":"IF(COUNTRY_INFO!A46=0,\" \",COUNTRY_INFO!A46)","v":" Congo"},{"$f":"IF(COUNTRY_INFO!B46=0,\" \",COUNTRY_INFO!B46)","v":"Pointe-Noire"},{"$f":"IF(COUNTRY_INFO!C46=0,\" \",COUNTRY_INFO!C46)","v":"Lumumba"},{"$f":"IF(COUNTRY_INFO!$U$9:$U$1000=\"MDA3 (IVM)\", COUNTRY_INFO!$U$9:$U$1000, \" \")","v":" "},null,0,0,0,0,0,0,null,null,0,0,0,0," "," "," "]
[{"$f":"IF(COUNTRY_INFO!A47=0,\" \",COUNTRY_INFO!A47)","v":" Congo"},{"$f":"IF(COUNTRY_INFO!B47=0,\" \",COUNTRY_INFO!B47)","v":"Pointe-Noire"},{"$f":"IF(COUNTRY_INFO!C47=0,\" \",COUNTRY_INFO!C47)","v":"Mongo-Poukou"},{"$f":"IF(COUNTRY_INFO!$U$9:$U$1000=\"MDA3 (IVM)\", COUNTRY_INFO!$U$9:$U$1000, \" \")","v":" "},null,0,0,0,0,0,0,null,null,0,0,0,0," "," "," "]
[{"$f":"IF(COUNTRY_INFO!A48=0,\" \",COUNTRY_INFO!A48)","v":" Congo"},{"$f":"IF(COUNTRY_INFO!B48=0,\" \",COUNTRY_INFO!B48)","v":"Pointe-Noire"},{"$f":"IF(COUNTRY_INFO!C48=0,\" \",COUNTRY_INFO!C48)","v":"Mvoumvou"},{"$f":"IF(COUNTRY_INFO!$U$9:$U$1000=\"MDA3 (IVM)\", COUNTRY_INFO!$U$9:$U$1000, \" \")","v":" "},null,0,0,0,0,0,0,null,null,0,0,0,0," "," "," "]
[{"$f":"IF(COUNTRY_INFO!A49=0,\" \",COUNTRY_INFO!A49)","v":" Congo"},{"$f":"IF(COUNTRY_INFO!B49=0,\" \",COUNTRY_INFO!B49)","v":"Pointe-Noire"},{"$f":"IF(COUNTRY_INFO!C49=0,\" \",COUNTRY_INFO!C49)","v":"Ngoyo"},{"$f":"IF(COUNTRY_INFO!$U$9:$U$1000=\"MDA3 (IVM)\", COUNTRY_INFO!$U$9:$U$1000, \" \")","v":" "},null,0,0,0,0,0,0,null,null,0,0,0,0," "," "," "]
[{"$f":"IF(COUNTRY_INFO!A50=0,\" \",COUNTRY_INFO!A50)","v":" Congo"},{"$f":"IF(COUNTRY_INFO!B50=0,\" \",COUNTRY_INFO!B50)","v":"Pointe-Noire"},{"$f":"IF(COUNTRY_INFO!C50=0,\" \",COUNTRY_INFO!C50)","v":"Tchiamba Nzassi"},{"$f":"IF(COUNTRY_INFO!$U$9:$U$1000=\"MDA3 (IVM)\", COUNTRY_INFO!$U$9:$U$1000, \" \")","v":" "},null,0,0,0,0,0,0,null,null,0,0,0,0," "," "," "]
[{"$f":"IF(COUNTRY_INFO!A51=0,\" \",COUNTRY_INFO!A51)","v":" Congo"},{"$f":"IF(COUNTRY_INFO!B51=0,\" \",COUNTRY_INFO!B51)","v":"Pointe-Noire"},{"$f":"IF(COUNTRY_INFO!C51=0,\" \",COUNTRY_INFO!C51)","v":"Tie-Tie"},{"$f":"IF(COUNTRY_INFO!$U$9:$U$1000=\"MDA3 (IVM)\", COUNTRY_INFO!$U$9:$U$1000, \" \")","v":" "},null,0,0,0,0,0,0,null,null,0,0,0,0," "," "," "]
[{"$f":"IF(COUNTRY_INFO!A52=0,\" \",COUNTRY_INFO!A52)","v":" Congo"},{"$f":"IF(COUNTRY_INFO!B52=0,\" \",COUNTRY_INFO!B52)","v":"Pool"},{"$f":"IF(COUNTRY_INFO!C52=0,\" \",COUNTRY_INFO!C52)","v":"Boko"},{"$f":"IF(COUNTRY_INFO!$U$9:$U$1000=\"MDA3 (IVM)\", COUNTRY_INFO!$U$9:$U$1000, \" \")","v":"MDA3 (IVM)"},"Aout à Nov",4278.72,10696.8,14975.52,3679.2,11650.8,15330,null,null,0,3679.2,11650.8,15330,85.988332959389709,108.91855508189366,102.36706304689251]
[{"$f":"IF(COUNTRY_INFO!A53=0,\" \",COUNTRY_INFO!A53)","v":" Congo"},{"$f":"IF(COUNTRY_INFO!B53=0,\" \",COUNTRY_INFO!B53)","v":"Pool"},{"$f":"IF(COUNTRY_INFO!C53=0,\" \",COUNTRY_INFO!C53)","v":"Goma tsétsé"},{"$f":"IF(COUNTRY_INFO!$U$9:$U$1000=\"MDA3 (IVM)\", COUNTRY_INFO!$U$9:$U$1000, \" \")","v":"MDA3 (IVM)"},"Aout à Nov",6786.24,16965.599999999999,23751.839999999997,5001.6000000000004,15838.4,20840,null,null,0,5001.6000000000004,15838.4,20840,73.70207950205122,93.355967369264874,87.740570835775273]
[{"$f":"IF(COUNTRY_INFO!A54=0,\" \",COUNTRY_INFO!A54)","v":" Congo"},{"$f":"IF(COUNTRY_INFO!B54=0,\" \",COUNTRY_INFO!B54)","v":"Pool"},{"$f":"IF(COUNTRY_INFO!C54=0,\" \",COUNTRY_INFO!C54)","v":"Ignié"},{"$f":"IF(COUNTRY_INFO!$U$9:$U$1000=\"MDA3 (IVM)\", COUNTRY_INFO!$U$9:$U$1000, \" \")","v":" "},null,0,0,0,0,0,0,null,null,0,0,0,0," "," "," "]
[{"$f":"IF(COUNTRY_INFO!A55=0,\" \",COUNTRY_INFO!A55)","v":" Congo"},{"$f":"IF(COUNTRY_INFO!B55=0,\" \",COUNTRY_INFO!B55)","v":"Pool"},{"$f":"IF(COUNTRY_INFO!C55=0,\" \",COUNTRY_INFO!C55)","v":"Kindamba"},{"$f":"IF(COUNTRY_INFO!$U$9:$U$1000=\"MDA3 (IVM)\", COUNTRY_INFO!$U$9:$U$1000, \" \")","v":"MDA3 (IVM)"},"Aout à Nov",1335.84,3339.6,4675.4399999999996,1178.4000000000001,3731.6,4910,null,null,0,1178.4000000000001,3731.6,4910,88.214157384117868,111.73793268654929,105.01685402871175]
[{"$f":"IF(COUNTRY_INFO!A56=0,\" \",COUNTRY_INFO!A56)","v":" Congo"},{"$f":"IF(COUNTRY_INFO!B56=0,\" \",COUNTRY_INFO!B56)","v":"Pool"},{"$f":"IF(COUNTRY_INFO!C56=0,\" \",COUNTRY_INFO!C56)","v":"Kinkala"},{"$f":"IF(COUNTRY_INFO!$U$9:$U$1000=\"MDA3 (IVM)\", COUNTRY_INFO!$U$9:$U$1000, \" \")","v":"MDA3 (IVM)"},"Aout à Nov",4325.5199999999995,10813.800000000001,15139.32,3322.32,10520.68,13843,null,null,0,3322.32,10520.68,13843,76.807412750374539,97.289389483807724,91.437396131398245]
[{"$f":"IF(COUNTRY_INFO!A57=0,\" \",COUNTRY_INFO!A57)","v":" Congo"},{"$f":"IF(COUNTRY_INFO!B57=0,\" \",COUNTRY_INFO!B57)","v":"Pool"},{"$f":"IF(COUNTRY_INFO!C57=0,\" \",COUNTRY_INFO!C57)","v":"Kintélé"},{"$f":"IF(COUNTRY_INFO!$U$9:$U$1000=\"MDA3 (IVM)\", COUNTRY_INFO!$U$9:$U$1000, \" \")","v":" "},null,0,0,0,0,0,0,null,null,0,0,0,0," "," "," "]
[{"$f":"IF(COUNTRY_INFO!A58=0,\" \",COUNTRY_INFO!A58)","v":" Congo"},{"$f":"IF(COUNTRY_INFO!B58=0,\" \",COUNTRY_INFO!B58)","v":"Pool"},{"$f":"IF(COUNTRY_INFO!C58=0,\" \",COUNTRY_INFO!C58)","v":"Mindouli"},{"$f":"IF(COUNTRY_INFO!$U$9:$U$1000=\"MDA3 (IVM)\", COUNTRY_INFO!$U$9:$U$1000, \" \")","v":"MDA3 (IVM)"},"Aout à Nov",10185.359999999999,25463.4,35648.76,8233.44,26072.559999999998,34306,null,null,0,8233.44,26072.559999999998,34306,80.836023468979022,102.39229639404006,96.233361272594053]
[{"$f":"IF(COUNTRY_INFO!A59=0,\" \",COUNTRY_INFO!A59)","v":" Congo"},{"$f":"IF(COUNTRY_INFO!B59=0,\" \",COUNTRY_INFO!B59)","v":"Sangha"},{"$f":"IF(COUNTRY_INFO!C59=0,\" \",COUNTRY_INFO!C59)","v":"Ouesso"},{"$f":"IF(COUNTRY_INFO!$U$9:$U$1000=\"MDA3 (IVM)\", COUNTRY_INFO!$U$9:$U$1000, \" \")","v":" "},null,0,0,0,0,0,0,null,null,0,0,0,0," "," "," "]
[{"$f":"IF(COUNTRY_INFO!A60=0,\" \",COUNTRY_INFO!A60)","v":" Congo"},{"$f":"IF(COUNTRY_INFO!B60=0,\" \",COUNTRY_INFO!B60)","v":"Sangha"},{"$f":"IF(COUNTRY_INFO!C60=0,\" \",COUNTRY_INFO!C60)","v":"Sembé-Souanké"},{"$f":"IF(COUNTRY_INFO!$U$9:$U$1000=\"MDA3 (IVM)\", COUNTRY_INFO!$U$9:$U$1000, \" \")","v":" "},null,0,0,0,0,0,0,null,null,0,0,0,0," "," "," "]

{"sheet":"T1","index":5,"n_rows":60,"n_cols":20,"rows_kept":60,"cut":false,"hidden":false,"merged":[[5,6,5,10],[5,11,5,14],[5,15,5,18],[3,0,3,2],[5,0,5,2],[5,3,6,3],[5,5,6,5],[5,4,6,4]]}
["T 1 - Praziquantel (PZQ) et Albendazole (ALB) ou Mebendazole (MBD)"]
["Structure administrative, population nécessitant une chimioprévention par groupe d'âge, population traitée par groupe d'âge et couverture"]
[]
["TOTAL",null,null,null,null,null,{"$f":"SUM(G$9:G$1000)","v":0},0,0,0,{"$f":"SUM(K$9:K$1000)","v":0},0,0,0,0,{"$f":"IF(G4<>0, IF(L4/G4*100=0, \"-\", L4/G4*100), \" \")","v":" "},{"$f":"IF(OR(I4<>0,H4<>0), IF(M4/MAX(H4,I4)*100=0, \"-\", M4/MAX(H4,I4)*100), \" \")","v":" "},{"$f":"IF(J4<>0, IF(N4/J4*100=0, \"-\", N4/J4*100), \" \")","v":" "},{"$f":"IF(K4<>0, IF(O4/K4*100=0, \"-\", O4/K4*100), \" \")","v":" "}]
[]
["Structure administrative du pays",null,null,"Mise en oeuvre \nde la CP","Médica-ment","Date","Population ciblée pour T1",null,null,null,null,"Population traitée",null,null,null,"Couverture du Programme (%)"]
["Pays","Région/Département","District",null,null,null,"EAPréS (ALB)","EAS (ALB)","EAS (PZQ)","Adultes (PZQ)","Total","EAPréS","EAS","Adultes","Total","EAPréS","EAS","Adultes","Total"]
[]
[{"$f":"IF(COUNTRY_INFO!A9=0,\" \",COUNTRY_INFO!A9)","v":" Congo"},{"$f":"IF(COUNTRY_INFO!B9=0,\" \",COUNTRY_INFO!B9)","v":"Bouenza"},{"$f":"IF(COUNTRY_INFO!C9=0,\" \",COUNTRY_INFO!C9)","v":"Loudima"},{"$f":"IF(OR(COUNTRY_INFO!$U$9:$U$1000=\"T1 (PZQ+ALB/MBD)\",COUNTRY_INFO!$V$9:$V$1000=\"T1 (PZQ+ALB/MBD)\"), \"T1 (PZQ+ALB/MBD)\", \" \")","v":" "},null,null,null,null,null,null,{"$f":"MAX(H9:I9)+G9+J9","v":0},null,null,null,{"$f":"SUM(L9:N9)","v":0},{"$f":"IF(G9<>0, IF(L9/G9*100=0, \"-\", L9/G9*100), \" \")","v":" "},{"$f":"IF(OR(I9<>0,H9<>0), IF(M9/MAX(H9,I9)*100=0, \"-\", M9/MAX(H9,I9)*100), \" \")","v":" "},{"$f":"IF(J9<>0, IF(N9/J9*100=0, \"-\", N9/J9*100), \" \")","v":" "}," "]
[{"$f":"IF(COUNTRY_INFO!A10=0,\" \",COUNTRY_INFO!A10)","v":" Congo"},{"$f":"IF(COUNTRY_INFO!B10=0,\" \",COUNTRY_INFO!B10)","v":"Bouenza"},{"$f":"IF(COUNTRY_INFO!C10=0,\" \",COUNTRY_INFO!C10)","v":"Loutété"},{"$f":"IF(OR(COUNTRY_INFO!$U$9:$U$1000=\"T1 (PZQ+ALB/MBD)\",COUNTRY_INFO!$V$9:$V$1000=\"T1 (PZQ+ALB/MBD)\"), \"T1 (PZQ+ALB/MBD)\", \" \")","v":" "},null,null,null,null,null,null,0,null,null,null,{"$f":"SUM(L10:N10)","v":0},{"$f":"IF(G10<>0, IF(L10/G10*100=0, \"-\", L10/G10*100), \" \")","v":" "}," ",{"$f":"IF(J10<>0, IF(N10/J10*100=0, \"-\", N10/J10*100), \" \")","v":" "},{"$f":"IF(K10<>0, IF(O10/K10*100=0, \"-\", O10/K10*100), \" \")","v":" "}]
[{"$f":"IF(COUNTRY_INFO!A11=0,\" \",COUNTRY_INFO!A11)","v":" Congo"},{"$f":"IF(COUNTRY_INFO!B11=0,\" \",COUNTRY_INFO!B11)","v":"Bouenza"},{"$f":"IF(COUNTRY_INFO!C11=0,\" \",COUNTRY_INFO!C11)","v":"Madingou"},{"$f":"IF(OR(COUNTRY_INFO!$U$9:$U$1000=\"T1 (PZQ+ALB/MBD)\",COUNTRY_INFO!$V$9:$V$1000=\"T1 (PZQ+ALB/MBD)\"), \"T1 (PZQ+ALB/MBD)\", \" \")","v":" "},null,null,null,null,null,null,0,null,null,null,0," "," "," "," "]
[{"$f":"IF(COUNTRY_INFO!A12=0,\" \",COUNTRY_INFO!A12)","v":" Congo"},{"$f":"IF(COUNTRY_INFO!B12=0,\" \",COUNTRY_INFO!B12)","v":"Bouenza"},{"$f":"IF(COUNTRY_INFO!C12=0,\" \",COUNTRY_INFO!C12)","v":"Mouyondzi"},{"$f":"IF(OR(COUNTRY_INFO!$U$9:$U$1000=\"T1 (PZQ+ALB/MBD)\",COUNTRY_INFO!$V$9:$V$1000=\"T1 (PZQ+ALB/MBD)\"), \"T1 (PZQ+ALB/MBD)\", \" \")","v":" "},null,null,null,null,null,null,0,null,null,null,0," "," "," "," "]
[{"$f":"IF(COUNTRY_INFO!A13=0,\" \",COUNTRY_INFO!A13)","v":" Congo"},{"$f":"IF(COUNTRY_INFO!B13=0,\" \",COUNTRY_INFO!B13)","v":"Bouenza"},{"$f":"IF(COUNTRY_INFO!C13=0,\" \",COUNTRY_INFO!C13)","v":"Nkayi"},{"$f":"IF(OR(COUNTRY_INFO!$U$9:$U$1000=\"T1 (PZQ+ALB/MBD)\",COUNTRY_INFO!$V$9:$V$1000=\"T1 (PZQ+ALB/MBD)\"), \"T1 (PZQ+ALB/MBD)\", \" \")","v":" "},null,null,null,null,null,null,0,null,null,null,0," "," "," "," "]
[{"$f":"IF(COUNTRY_INFO!A14=0,\" \",COUNTRY_INFO!A14)","v":" Congo"},{"$f":"IF(COUNTRY_INFO!B14=0,\" \",COUNTRY_INFO!B14)","v":"Brazzaville"},{"$f":"IF(COUNTRY_INFO!C14=0,\" \",COUNTRY_INFO!C14)","v":"Bacongo"},{"$f":"IF(OR(COUNTRY_INFO!$U$9:$U$1000=\"T1 (PZQ+ALB/MBD)\",COUNTRY_INFO!$V$9:$V$1000=\"T1 (PZQ+ALB/MBD)\"), \"T1 (PZQ+ALB/MBD)\", \" \")","v":" "},null,null,null,null,null,null,0,null,null,null,0," "," "," "," "]
[{"$f":"IF(COUNTRY_INFO!A15=0,\" \",COUNTRY_INFO!A15)","v":" Congo"},{"$f":"IF(COUNTRY_INFO!B15=0,\" \",COUNTRY_INFO!B15)","v":"Brazzaville"},{"$f":"IF(COUNTRY_INFO!C15=0,\" \",COUNTRY_INFO!C15)","v":"Djiri"},{"$f":"IF(OR(COUNTRY_INFO!$U$9:$U$1000=\"T1 (PZQ+ALB/MBD)\",COUNTRY_INFO!$V$9:$V$1000=\"T1 (PZQ+ALB/MBD)\"), \"T1 (PZQ+ALB/MBD)\", \" \")","v":" "},null,null,null,null,null,null,0,null,null,null,0," "," "," "," "]
[{"$f":"IF(COUNTRY_INFO!A16=0,\" \",COUNTRY_INFO!A16)","v":" Congo"},{"$f":"IF(COUNTRY_INFO!B16=0,\" \",COUNTRY_INFO!B16)","v":"Brazzaville"},{"$f":"IF(COUNTRY_INFO!C16=0,\" \",COUNTRY_INFO!C16)","v":"Île Mbamou"},{"$f":"IF(OR(COUNTRY_INFO!$U$9:$U$1000=\"T1 (PZQ+ALB/MBD)\",COUNTRY_INFO!$V$9:$V$1000=\"T1 (PZQ+ALB/MBD)\"), \"T1 (PZQ+ALB/MBD)\", \" \")","v":" "},null,null,null,null,null,null,0,null,null,null,0," "," "," "," "]
[{"$f":"IF(COUNTRY_INFO!A17=0,\" \",COUNTRY_INFO!A17)","v":" Congo"},{"$f":"IF(COUNTRY_INFO!B17=0,\" \",COUNTRY_INFO!B17)","v":"Brazzaville"},{"$f":"IF(COUNTRY_INFO!C17=0,\" \",COUNTRY_INFO!C17)","v":"Madibou"},{"$f":"IF(OR(COUNTRY_INFO!$U$9:$U$1000=\"T1 (PZQ+ALB/MBD)\",COUNTRY_INFO!$V$9:$V$1000=\"T1 (PZQ+ALB/MBD)\"), \"T1 (PZQ+ALB/MBD)\", \" \")","v":" "},null,null,null,null,null,null,0,null,null,null,0," "," "," "," "]
[{"$f":"IF(COUNTRY_INFO!A18=0,\" \",COUNTRY_INFO!A18)","v":" Congo"},{"$f":"IF(COUNTRY_INFO!B18=0,\" \",COUNTRY_INFO!B18)","v":"Brazzaville"},{"$f":"IF(COUNTRY_INFO!C18=0,\" \",COUNTRY_INFO!C18)","v":"Makélékélé"},{"$f":"IF(OR(COUNTRY_INFO!$U$9:$U$1000=\"T1 (PZQ+ALB/MBD)\",COUNTRY_INFO!$V$9:$V$1000=\"T1 (PZQ+ALB/MBD)\"), \"T1 (PZQ+ALB/MBD)\", \" \")","v":" "},null,null,null,null,null,null,0,null,null,null,0," "," "," "," "]
[{"$f":"IF(COUNTRY_INFO!A19=0,\" \",COUNTRY_INFO!A19)","v":" Congo"},{"$f":"IF(COUNTRY_INFO!B19=0,\" \",COUNTRY_INFO!B19)","v":"Brazzaville"},{"$f":"IF(COUNTRY_INFO!C19=0,\" \",COUNTRY_INFO!C19)","v":"Mfilou"},{"$f":"IF(OR(COUNTRY_INFO!$U$9:$U$1000=\"T1 (PZQ+ALB/MBD)\",COUNTRY_INFO!$V$9:$V$1000=\"T1 (PZQ+ALB/MBD)\"), \"T1 (PZQ+ALB/MBD)\", \" \")","v":" "},null,null,null,null,null,null,0,null,null,null,0," "," "," "," "," "]
[{"$f":"IF(COUNTRY_INFO!A20=0,\" \",COUNTRY_INFO!A20)","v":" Congo"},{"$f":"IF(COUNTRY_INFO!B20=0,\" \",COUNTRY_INFO!B20)","v":"Brazzaville"},{"$f":"IF(COUNTRY_INFO!C20=0,\" \",COUNTRY_INFO!C20)","v":"Moungali"},{"$f":"IF(OR(COUNTRY_INFO!$U$9:$U$1000=\"T1 (PZQ+ALB/MBD)\",COUNTRY_INFO!$V$9:$V$1000=\"T1 (PZQ+ALB/MBD)\"), \"T1 (PZQ+ALB/MBD)\", \" \")","v":" "},null,null,null,null,null,null,0,null,null,null,0," "," "," "," "]
[{"$f":"IF(COUNTRY_INFO!A21=0,\" \",COUNTRY_INFO!A21)","v":" Congo"},{"$f":"IF(COUNTRY_INFO!B21=0,\" \",COUNTRY_INFO!B21)","v":"Brazzaville"},{"$f":"IF(COUNTRY_INFO!C21=0,\" \",COUNTRY_INFO!C21)","v":"Ouenzé"},{"$f":"IF(OR(COUNTRY_INFO!$U$9:$U$1000=\"T1 (PZQ+ALB/MBD)\",COUNTRY_INFO!$V$9:$V$1000=\"T1 (PZQ+ALB/MBD)\"), \"T1 (PZQ+ALB/MBD)\", \" \")","v":" "},null,null,null,null,null,null,0,null,null,null,0," "," "," "," "]
[{"$f":"IF(COUNTRY_INFO!A22=0,\" \",COUNTRY_INFO!A22)","v":" Congo"},{"$f":"IF(COUNTRY_INFO!B22=0,\" \",COUNTRY_INFO!B22)","v":"Brazzaville"},{"$f":"IF(COUNTRY_INFO!C22=0,\" \",COUNTRY_INFO!C22)","v":"Poto-Poto"},{"$f":"IF(OR(COUNTRY_INFO!$U$9:$U$1000=\"T1 (PZQ+ALB/MBD)\",COUNTRY_INFO!$V$9:$V$1000=\"T1 (PZQ+ALB/MBD)\"), \"T1 (PZQ+ALB/MBD)\", \" \")","v":" "},null,null,null,null,null,null,0,null,null,null,0," "," "," "," "]
[{"$f":"IF(COUNTRY_INFO!A23=0,\" \",COUNTRY_INFO!A23)","v":" Congo"},{"$f":"IF(COUNTRY_INFO!B23=0,\" \",COUNTRY_INFO!B23)","v":"Brazzaville"},{"$f":"IF(COUNTRY_INFO!C23=0,\" \",COUNTRY_INFO!C23)","v":"Talangaî"},{"$f":"IF(OR(COUNTRY_INFO!$U$9:$U$1000=\"T1 (PZQ+ALB/MBD)\",COUNTRY_INFO!$V$9:$V$1000=\"T1 (PZQ+ALB/MBD)\"), \"T1 (PZQ+ALB/MBD)\", \" \")","v":" "},null,null,null,null,null,null,0,null,null,null,0," "," "," "," "]
[{"$f":"IF(COUNTRY_INFO!A24=0,\" \",COUNTRY_INFO!A24)","v":" Congo"},{"$f":"IF(COUNTRY_INFO!B24=0,\" \",COUNTRY_INFO!B24)","v":"Cuvette"},{"$f":"IF(COUNTRY_INFO!C24=0,\" \",COUNTRY_INFO!C24)","v":"Mossaka"},{"$f":"IF(OR(COUNTRY_INFO!$U$9:$U$1000=\"T1 (PZQ+ALB/MBD)\",COUNTRY_INFO!$V$9:$V$1000=\"T1 (PZQ+ALB/MBD)\"), \"T1 (PZQ+ALB/MBD)\", \" \")","v":" "},null,null,null,null,null,null,0,null,null,null,0," "," "," "," "]
[{"$f":"IF(COUNTRY_INFO!A25=0,\" \",COUNTRY_INFO!A25)","v":" Congo"},{"$f":"IF(COUNTRY_INFO!B25=0,\" \",COUNTRY_INFO!B25)","v":"Cuvette"},{"$f":"IF(COUNTRY_INFO!C25=0,\" \",COUNTRY_INFO!C25)","v":"Owando"},{"$f":"IF(OR(COUNTRY_INFO!$U$9:$U$1000=\"T1 (PZQ+ALB/MBD)\",COUNTRY_INFO!$V$9:$V$1000=\"T1 (PZQ+ALB/MBD)\"), \"T1 (PZQ+ALB/MBD)\", \" \")","v":" "},null,null,null,null,null,null,0,null,null,null,0," "," "," "," "]
[{"$f":"IF(COUNTRY_INFO!A26=0,\" \",COUNTRY_INFO!A26)","v":" Congo"},{"$f":"IF(COUNTRY_INFO!B26=0,\" \",COUNTRY_INFO!B26)","v":"Cuvette"},{"$f":"IF(COUNTRY_INFO!C26=0,\" \",COUNTRY_INFO!C26)","v":"Oyo-Alima"},{"$f":"IF(OR(COUNTRY_INFO!$U$9:$U$1000=\"T1 (PZQ+ALB/MBD)\",COUNTRY_INFO!$V$9:$V$1000=\"T1 (PZQ+ALB/MBD)\"), \"T1 (PZQ+ALB/MBD)\", \" \")","v":" "},null,null,null,null,null,null,0,null,null,null,0," "," "," "," "]
[{"$f":"IF(COUNTRY_INFO!A27=0,\" \",COUNTRY_INFO!A27)","v":" Congo"},{"$f":"IF(COUNTRY_INFO!B27=0,\" \",COUNTRY_INFO!B27)","v":"Cuvette-Ouest"},{"$f":"IF(COUNTRY_INFO!C27=0,\" \",COUNTRY_INFO!C27)","v":"Etoumbi"},{"$f":"IF(OR(COUNTRY_INFO!$U$9:$U$1000=\"T1 (PZQ+ALB/MBD)\",COUNTRY_INFO!$V$9:$V$1000=\"T1 (PZQ+ALB/MBD)\"), \"T1 (PZQ+ALB/MBD)\", \" \")","v":" "},null,null,null,null,null,null,0,null,null,null,0," "," "," "," "]
[{"$f":"IF(COUNTRY_INFO!A28=0,\" \",COUNTRY_INFO!A28)","v":" Congo"},{"$f":"IF(COUNTRY_INFO!B28=0,\" \",COUNTRY_INFO!B28)","v":"Cuvette-Ouest"},{"$f":"IF(COUNTRY_INFO!C28=0,\" \",COUNTRY_INFO!C28)","v":"Ewo"},{"$f":"IF(OR(COUNTRY_INFO!$U$9:$U$1000=\"T1 (PZQ+ALB/MBD)\",COUNTRY_INFO!$V$9:$V$1000=\"T1 (PZQ+ALB/MBD)\"), \"T1 (PZQ+ALB/MBD)\", \" \")","v":" "},null,null,null,null,null,null,0,null,null,null,0," "," "," "," "]
[{"$f":"IF(COUNTRY_INFO!A29=0,\" \",COUNTRY_INFO!A29)","v":" Congo"},{"$f":"IF(COUNTRY_INFO!B29=0,\" \",COUNTRY_INFO!B29)","v":"Kouilou"},{"$f":"IF(COUNTRY_INFO!C29=0,\" \",COUNTRY_INFO!C29)","v":"Hinda-Loango"},{"$f":"IF(OR(COUNTRY_INFO!$U$9:$U$1000=\"T1 (PZQ+ALB/MBD)\",COUNTRY_INFO!$V$9:$V$1000=\"T1 (PZQ+ALB/MBD)\"), \"T1 (PZQ+ALB/MBD)\", \" \")","v":" "},null,null,null,null,null,null,0,null,null,null,0," "," "," "," "]
[{"$f":"IF(COUNTRY_INFO!A30=0,\" \",COUNTRY_INFO!A30)","v":" Congo"},{"$f":"IF(COUNTRY_INFO!B30=0,\" \",COUNTRY_INFO!B30)","v":"Kouilou"},{"$f":"IF(COUNTRY_INFO!C30=0,\" \",COUNTRY_INFO!C30)","v":"Madingo Kayes-Nzambi"},{"$f":"IF(OR(COUNTRY_INFO!$U$9:$U$1000=\"T1 (PZQ+ALB/MBD)\",COUNTRY_INFO!$V$9:$V$1000=\"T1 (PZQ+ALB/MBD)\"), \"T1 (PZQ+ALB/MBD)\", \" \")","v":" "},null,null,null,null,null,null,0,null,null,null,0," "," "," "," "]
[{"$f":"IF(COUNTRY_INFO!A31=0,\" \",COUNTRY_INFO!A31)","v":" Congo"},{"$f":"IF(COUNTRY_INFO!B31=0,\" \",COUNTRY_INFO!B31)","v":"Kouilou"},{"$f":"IF(COUNTRY_INFO!C31=0,\" \",COUNTRY_INFO!C31)","v":"Mvouti-Kakamouéka"},{"$f":"IF(OR(COUNTRY_INFO!$U$9:$U$1000=\"T1 (PZQ+ALB/MBD)\",COUNTRY_INFO!$V$9:$V$1000=\"T1 (PZQ+ALB/MBD)\"), \"T1 (PZQ+ALB/MBD)\", \" \")","v":" "},null,null,null,null,null,null,0,null,null,null,0," "," "," "," "]
[{"$f":"IF(COUNTRY_INFO!A32=0,\" \",COUNTRY_INFO!A32)","v":" Congo"},{"$f":"IF(COUNTRY_INFO!B32=0,\" \",COUNTRY_INFO!B32)","v":"Lékoumou"},{"$f":"IF(COUNTRY_INFO!C32=0,\" \",COUNTRY_INFO!C32)","v":"Sibiti"},{"$f":"IF(OR(COUNTRY_INFO!$U$9:$U$1000=\"T1 (PZQ+ALB/MBD)\",COUNTRY_INFO!$V$9:$V$1000=\"T1 (PZQ+ALB/MBD)\"), \"T1 (PZQ+ALB/MBD)\", \" \")","v":" "},null,null,null,null,null,null,0,null,null,null,0," "," "," "," "]
[{"$f":"IF(COUNTRY_INFO!A33=0,\" \",COUNTRY_INFO!A33)","v":" Congo"},{"$f":"IF(COUNTRY_INFO!B33=0,\" \",COUNTRY_INFO!B33)","v":"Lékoumou"},{"$f":"IF(COUNTRY_INFO!C33=0,\" \",COUNTRY_INFO!C33)","v":"Zanaga"},{"$f":"IF(OR(COUNTRY_INFO!$U$9:$U$1000=\"T1 (PZQ+ALB/MBD)\",COUNTRY_INFO!$V$9:$V$1000=\"T1 (PZQ+ALB/MBD)\"), \"T1 (PZQ+ALB/MBD)\", \" \")","v":" "},null,null,null,null,null,null,0,null,null,null,0," "," "," "," "]
[{"$f":"IF(COUNTRY_INFO!A34=0,\" \",COUNTRY_INFO!A34)","v":" Congo"},{"$f":"IF(COUNTRY_INFO!B34=0,\" \",COUNTRY_INFO!B34)","v":"Likouala"},{"$f":"IF(COUNTRY_INFO!C34=0,\" \",COUNTRY_INFO!C34)","v":"Bétou"},{"$f":"IF(OR(COUNTRY_INFO!$U$9:$U$1000=\"T1 (PZQ+ALB/MBD)\",COUNTRY_INFO!$V$9:$V$1000=\"T1 (PZQ+ALB/MBD)\"), \"T1 (PZQ+ALB/MBD)\", \" \")","v":" "},null,null,null,null,null,null,0,null,null,null,0," "," "," "," "]
[{"$f":"IF(COUNTRY_INFO!A35=0,\" \",COUNTRY_INFO!A35)","v":" Congo"},{"$f":"IF(COUNTRY_INFO!B35=0,\" \",COUNTRY_INFO!B35)","v":"Likouala"},{"$f":"IF(COUNTRY_INFO!C35=0,\" \",COUNTRY_INFO!C35)","v":"Impfondo"},{"$f":"IF(OR(COUNTRY_INFO!$U$9:$U$1000=\"T1 (PZQ+ALB/MBD)\",COUNTRY_INFO!$V$9:$V$1000=\"T1 (PZQ+ALB/MBD)\"), \"T1 (PZQ+ALB/MBD)\", \" \")","v":" "},null,null,null,null,null,null,0,null,null,null,0," "," "," "," "]
[{"$f":"IF(COUNTRY_INFO!A36=0,\" \",COUNTRY_INFO!A36)","v":" Congo"},{"$f":"IF(COUNTRY_INFO!B36=0,\" \",COUNTRY_INFO!B36)","v":"Niari"},{"$f":"IF(COUNTRY_INFO!C36=0,\" \",COUNTRY_INFO!C36)","v":"Dolisie"},{"$f":"IF(OR(COUNTRY_INFO!$U$9:$U$1000=\"T1 (PZQ+ALB/MBD)\",COUNTRY_INFO!$V$9:$V$1000=\"T1 (PZQ+ALB/MBD)\"), \"T1 (PZQ+ALB/MBD)\", \" \")","v":" "},null,null,null,null,null,null,0,null,null,null,0," "," "," "," "]
[{"$f":"IF(COUNTRY_INFO!A37=0,\" \",COUNTRY_INFO!A37)","v":" Congo"},{"$f":"IF(COUNTRY_INFO!B37=0,\" \",COUNTRY_INFO!B37)","v":"Niari"},{"$f":"IF(COUNTRY_INFO!C37=0,\" \",COUNTRY_INFO!C37)","v":"Kibangou"},{"$f":"IF(OR(COUNTRY_INFO!$U$9:$U$1000=\"T1 (PZQ+ALB/MBD)\",COUNTRY_INFO!$V$9:$V$1000=\"T1 (PZQ+ALB/MBD)\"), \"T1 (PZQ+ALB/MBD)\", \" \")","v":" "},null,null,null,null,null,null,0,null,null,null,0," "," "," "," "]
[{"$f":"IF(COUNTRY_INFO!A38=0,\" \",COUNTRY_INFO!A38)","v":" Congo"},{"$f":"IF(COUNTRY_INFO!B38=0,\" \",COUNTRY_INFO!B38)","v":"Niari"},{"$f":"IF(COUNTRY_INFO!C38=0,\" \",COUNTRY_INFO!C38)","v":"Kimongo-Londela Nkayes"},{"$f":"IF(OR(COUNTRY_INFO!$U$9:$U$1000=\"T1 (PZQ+ALB/MBD)\",COUNTRY_INFO!$V$9:$V$1000=\"T1 (PZQ+ALB/MBD)\"), \"T1 (PZQ+ALB/MBD)\", \" \")","v":" "},null,null,null,null,null,null,0,null,null,null,0," "," "," "," "]
[{"$f":"IF(COUNTRY_INFO!A39=0,\" \",COUNTRY_INFO!A39)","v":" Congo"},{"$f":"IF(COUNTRY_INFO!B39=0,\" \",COUNTRY_INFO!B39)","v":"Niari"},{"$f":"IF(COUNTRY_INFO!C39=0,\" \",COUNTRY_INFO!C39)","v":"Mayoko"},{"$f":"IF(OR(COUNTRY_INFO!$U$9:$U$1000=\"T1 (PZQ+ALB/MBD)\",COUNTRY_INFO!$V$9:$V$1000=\"T1 (PZQ+ALB/MBD)\"), \"T1 (PZQ+ALB/MBD)\", \" \")","v":" "},null,null,null,null,null,null,0,null,null,null,0," "," "," "," "]
[{"$f":"IF(COUNTRY_INFO!A40=0,\" \",COUNTRY_INFO!A40)","v":" Congo"},{"$f":"IF(COUNTRY_INFO!B40=0,\" \",COUNTRY_INFO!B40)","v":"Niari"},{"$f":"IF(COUNTRY_INFO!C40=0,\" \",COUNTRY_INFO!C40)","v":"Mossendjo"},{"$f":"IF(OR(COUNTRY_INFO!$U$9:$U$1000=\"T1 (PZQ+ALB/MBD)\",COUNTRY_INFO!$V$9:$V$1000=\"T1 (PZQ+ALB/MBD)\"), \"T1 (PZQ+ALB/MBD)\", \" \")","v":" "},null,null,null,null,null,null,0,null,null,null,0," "," "," "," "]
[{"$f":"IF(COUNTRY_INFO!A41=0,\" \",COUNTRY_INFO!A41)","v":" Congo"},{"$f":"IF(COUNTRY_INFO!B41=0,\" \",COUNTRY_INFO!B41)","v":"Plateaux"},{"$f":"IF(COUNTRY_INFO!C41=0,\" \",COUNTRY_INFO!C41)","v":"Abala"},{"$f":"IF(OR(COUNTRY_INFO!$U$9:$U$1000=\"T1 (PZQ+ALB/MBD)\",COUNTRY_INFO!$V$9:$V$1000=\"T1 (PZQ+ALB/MBD)\"), \"T1 (PZQ+ALB/MBD)\", \" \")","v":" "},null,null,null,null,null,null,{"$f":"MAX(H41:I41)+G41+J41","v":0},null,null,null,0," ",{"$f":"IF(OR(I41<>0,H41<>0), IF(M41/MAX(H41,I41)*100=0, \"-\", M41/MAX(H41,I41)*100), \" \")","v":" "}," "," "]
[{"$f":"IF(COUNTRY_INFO!A42=0,\" \",COUNTRY_INFO!A42)","v":" Congo"},{"$f":"IF(COUNTRY_INFO!B42=0,\" \",COUNTRY_INFO!B42)","v":"Plateaux"},{"$f":"IF(COUNTRY_INFO!C42=0,\" \",COUNTRY_INFO!C42)","v":"Djambala-Lékana"},{"$f":"IF(OR(COUNTRY_INFO!$U$9:$U$1000=\"T1 (PZQ+ALB/MBD)\",COUNTRY_INFO!$V$9:$V$1000=\"T1 (PZQ+ALB/MBD)\"), \"T1 (PZQ+ALB/MBD)\", \" \")","v":" "},null,null,null,null,null,null,0,null,null,null,0," "," "," "," "]
[{"$f":"IF(COUNTRY_INFO!A43=0,\" \",COUNTRY_INFO!A43)","v":" Congo"},{"$f":"IF(COUNTRY_INFO!B43=0,\" \",COUNTRY_INFO!B43)","v":"Plateaux"},{"$f":"IF(COUNTRY_INFO!C43=0,\" \",COUNTRY_INFO!C43)","v":"Gamboma"},{"$f":"IF(OR(COUNTRY_INFO!$U$9:$U$1000=\"T1 (PZQ+ALB/MBD)\",COUNTRY_INFO!$V$9:$V$1000=\"T1 (PZQ+ALB/MBD)\"), \"T1 (PZQ+ALB/MBD)\", \" \")","v":" "},null,null,null,null,null,null,0,null,null,null,0," "," "," "," "]
[{"$f":"IF(COUNTRY_INFO!A44=0,\" \",COUNTRY_INFO!A44)","v":" Congo"},{"$f":"IF(COUNTRY_INFO!B44=0,\" \",COUNTRY_INFO!B44)","v":"Plateaux"},{"$f":"IF(COUNTRY_INFO!C44=0,\" \",COUNTRY_INFO!C44)","v":"Ngo Mpouya"},{"$f":"IF(OR(COUNTRY_INFO!$U$9:$U$1000=\"T1 (PZQ+ALB/MBD)\",COUNTRY_INFO!$V$9:$V$1000=\"T1 (PZQ+ALB/MBD)\"), \"T1 (PZQ+ALB/MBD)\", \" \")","v":" "},null,null,null,null,null,null,0,null,null,null,0," "," "," "," "]
[{"$f":"IF(COUNTRY_INFO!A45=0,\" \",COUNTRY_INFO!A45)","v":" Congo"},{"$f":"IF(COUNTRY_INFO!B45=0,\" \",COUNTRY_INFO!B45)","v":"Pointe-Noire"},{"$f":"IF(COUNTRY_INFO!C45=0,\" \",COUNTRY_INFO!C45)","v":"Loandjili"},{"$f":"IF(OR(COUNTRY_INFO!$U$9:$U$1000=\"T1 (PZQ+ALB/MBD)\",COUNTRY_INFO!$V$9:$V$1000=\"T1 (PZQ+ALB/MBD)\"), \"T1 (PZQ+ALB/MBD)\", \" \")","v":" "},null,null,null,null,null,null,0,null,null,null,0," "," "," "," "]
[{"$f":"IF(COUNTRY_INFO!A46=0,\" \",COUNTRY_INFO!A46)","v":" Congo"},{"$f":"IF(COUNTRY_INFO!B46=0,\" \",COUNTRY_INFO!B46)","v":"Pointe-Noire"},{"$f":"IF(COUNTRY_INFO!C46=0,\" \",COUNTRY_INFO!C46)","v":"Lumumba"},{"$f":"IF(OR(COUNTRY_INFO!$U$9:$U$1000=\"T1 (PZQ+ALB/MBD)\",COUNTRY_INFO!$V$9:$V$1000=\"T1 (PZQ+ALB/MBD)\"), \"T1 (PZQ+ALB/MBD)\", \" \")","v":" "},null,null,null,null,null,null,0,null,null,null,0," "," "," "," "]
[{"$f":"IF(COUNTRY_INFO!A47=0,\" \",COUNTRY_INFO!A47)","v":" Congo"},{"$f":"IF(COUNTRY_INFO!B47=0,\" \",COUNTRY_INFO!B47)","v":"Pointe-Noire"},{"$f":"IF(COUNTRY_INFO!C47=0,\" \",COUNTRY_INFO!C47)","v":"Mongo-Poukou"},{"$f":"IF(OR(COUNTRY_INFO!$U$9:$U$1000=\"T1 (PZQ+ALB/MBD)\",COUNTRY_INFO!$V$9:$V$1000=\"T1 (PZQ+ALB/MBD)\"), \"T1 (PZQ+ALB/MBD)\", \" \")","v":" "},null,null,null,null,null,null,0,null,null,null,0," "," "," "," "]
[{"$f":"IF(COUNTRY_INFO!A48=0,\" \",COUNTRY_INFO!A48)","v":" Congo"},{"$f":"IF(COUNTRY_INFO!B48=0,\" \",COUNTRY_INFO!B48)","v":"Pointe-Noire"},{"$f":"IF(COUNTRY_INFO!C48=0,\" \",COUNTRY_INFO!C48)","v":"Mvoumvou"},{"$f":"IF(OR(COUNTRY_INFO!$U$9:$U$1000=\"T1 (PZQ+ALB/MBD)\",COUNTRY_INFO!$V$9:$V$1000=\"T1 (PZQ+ALB/MBD)\"), \"T1 (PZQ+ALB/MBD)\", \" \")","v":" "},null,null,null,null,null,null,0,null,null,null,0," "," "," "," "]
[{"$f":"IF(COUNTRY_INFO!A49=0,\" \",COUNTRY_INFO!A49)","v":" Congo"},{"$f":"IF(COUNTRY_INFO!B49=0,\" \",COUNTRY_INFO!B49)","v":"Pointe-Noire"},{"$f":"IF(COUNTRY_INFO!C49=0,\" \",COUNTRY_INFO!C49)","v":"Ngoyo"},{"$f":"IF(OR(COUNTRY_INFO!$U$9:$U$1000=\"T1 (PZQ+ALB/MBD)\",COUNTRY_INFO!$V$9:$V$1000=\"T1 (PZQ+ALB/MBD)\"), \"T1 (PZQ+ALB/MBD)\", \" \")","v":" "},null,null,null,null,null,null,0,null,null,null,0," "," "," "," "]
[{"$f":"IF(COUNTRY_INFO!A50=0,\" \",COUNTRY_INFO!A50)","v":" Congo"},{"$f":"IF(COUNTRY_INFO!B50=0,\" \",COUNTRY_INFO!B50)","v":"Pointe-Noire"},{"$f":"IF(COUNTRY_INFO!C50=0,\" \",COUNTRY_INFO!C50)","v":"Tchiamba Nzassi"},{"$f":"IF(OR(COUNTRY_INFO!$U$9:$U$1000=\"T1 (PZQ+ALB/MBD)\",COUNTRY_INFO!$V$9:$V$1000=\"T1 (PZQ+ALB/MBD)\"), \"T1 (PZQ+ALB/MBD)\", \" \")","v":" "},null,null,null,null,null,null,0,null,null,null,0," "," "," "," "]
[{"$f":"IF(COUNTRY_INFO!A51=0,\" \",COUNTRY_INFO!A51)","v":" Congo"},{"$f":"IF(COUNTRY_INFO!B51=0,\" \",COUNTRY_INFO!B51)","v":"Pointe-Noire"},{"$f":"IF(COUNTRY_INFO!C51=0,\" \",COUNTRY_INFO!C51)","v":"Tie-Tie"},{"$f":"IF(OR(COUNTRY_INFO!$U$9:$U$1000=\"T1 (PZQ+ALB/MBD)\",COUNTRY_INFO!$V$9:$V$1000=\"T1 (PZQ+ALB/MBD)\"), \"T1 (PZQ+ALB/MBD)\", \" \")","v":" "},null,null,null,null,null,null,0,null,null,null,0," "," "," "," "]
[{"$f":"IF(COUNTRY_INFO!A52=0,\" \",COUNTRY_INFO!A52)","v":" Congo"},{"$f":"IF(COUNTRY_INFO!B52=0,\" \",COUNTRY_INFO!B52)","v":"Pool"},{"$f":"IF(COUNTRY_INFO!C52=0,\" \",COUNTRY_INFO!C52)","v":"Boko"},{"$f":"IF(OR(COUNTRY_INFO!$U$9:$U$1000=\"T1 (PZQ+ALB/MBD)\",COUNTRY_INFO!$V$9:$V$1000=\"T1 (PZQ+ALB/MBD)\"), \"T1 (PZQ+ALB/MBD)\", \" \")","v":" "},null,null,null,null,null,null,0,null,null,null,0," "," "," "," "]
[{"$f":"IF(COUNTRY_INFO!A53=0,\" \",COUNTRY_INFO!A53)","v":" Congo"},{"$f":"IF(COUNTRY_INFO!B53=0,\" \",COUNTRY_INFO!B53)","v":"Pool"},{"$f":"IF(COUNTRY_INFO!C53=0,\" \",COUNTRY_INFO!C53)","v":"Goma tsétsé"},{"$f":"IF(OR(COUNTRY_INFO!$U$9:$U$1000=\"T1 (PZQ+ALB/MBD)\",COUNTRY_INFO!$V$9:$V$1000=\"T1 (PZQ+ALB/MBD)\"), \"T1 (PZQ+ALB/MBD)\", \" \")","v":" "},null,null,null,null,null,null,0,null,null,null,0," "," "," "," "]
[{"$f":"IF(COUNTRY_INFO!A54=0,\" \",COUNTRY_INFO!A54)","v":" Congo"},{"$f":"IF(COUNTRY_INFO!B54=0,\" \",COUNTRY_INFO!B54)","v":"Pool"},{"$f":"IF(COUNTRY_INFO!C54=0,\" \",COUNTRY_INFO!C54)","v":"Ignié"},{"$f":"IF(OR(COUNTRY_INFO!$U$9:$U$1000=\"T1 (PZQ+ALB/MBD)\",COUNTRY_INFO!$V$9:$V$1000=\"T1 (PZQ+ALB/MBD)\"), \"T1 (PZQ+ALB/MBD)\", \" \")","v":" "},null,null,null,null,null,null,0,null,null,null,0," "," "," "," "]
[{"$f":"IF(COUNTRY_INFO!A55=0,\" \",COUNTRY_INFO!A55)","v":" Congo"},{"$f":"IF(COUNTRY_INFO!B55=0,\" \",COUNTRY_INFO!B55)","v":"Pool"},{"$f":"IF(COUNTRY_INFO!C55=0,\" \",COUNTRY_INFO!C55)","v":"Kindamba"},{"$f":"IF(OR(COUNTRY_INFO!$U$9:$U$1000=\"T1 (PZQ+ALB/MBD)\",COUNTRY_INFO!$V$9:$V$1000=\"T1 (PZQ+ALB/MBD)\"), \"T1 (PZQ+ALB/MBD)\", \" \")","v":" "},null,null,null,null,null,null,0,null,null,null,0," "," "," "," "]
[{"$f":"IF(COUNTRY_INFO!A56=0,\" \",COUNTRY_INFO!A56)","v":" Congo"},{"$f":"IF(COUNTRY_INFO!B56=0,\" \",COUNTRY_INFO!B56)","v":"Pool"},{"$f":"IF(COUNTRY_INFO!C56=0,\" \",COUNTRY_INFO!C56)","v":"Kinkala"},{"$f":"IF(OR(COUNTRY_INFO!$U$9:$U$1000=\"T1 (PZQ+ALB/MBD)\",COUNTRY_INFO!$V$9:$V$1000=\"T1 (PZQ+ALB/MBD)\"), \"T1 (PZQ+ALB/MBD)\", \" \")","v":" "},null,null,null,null,null,null,0,null,null,null,0," "," "," "," "]
[{"$f":"IF(COUNTRY_INFO!A57=0,\" \",COUNTRY_INFO!A57)","v":" Congo"},{"$f":"IF(COUNTRY_INFO!B57=0,\" \",COUNTRY_INFO!B57)","v":"Pool"},{"$f":"IF(COUNTRY_INFO!C57=0,\" \",COUNTRY_INFO!C57)","v":"Kintélé"},{"$f":"IF(OR(COUNTRY_INFO!$U$9:$U$1000=\"T1 (PZQ+ALB/MBD)\",COUNTRY_INFO!$V$9:$V$1000=\"T1 (PZQ+ALB/MBD)\"), \"T1 (PZQ+ALB/MBD)\", \" \")","v":" "},null,null,null,null,null,null,0,null,null,null,0," "," "," "," "]
[{"$f":"IF(COUNTRY_INFO!A58=0,\" \",COUNTRY_INFO!A58)","v":" Congo"},{"$f":"IF(COUNTRY_INFO!B58=0,\" \",COUNTRY_INFO!B58)","v":"Pool"},{"$f":"IF(COUNTRY_INFO!C58=0,\" \",COUNTRY_INFO!C58)","v":"Mindouli"},{"$f":"IF(OR(COUNTRY_INFO!$U$9:$U$1000=\"T1 (PZQ+ALB/MBD)\",COUNTRY_INFO!$V$9:$V$1000=\"T1 (PZQ+ALB/MBD)\"), \"T1 (PZQ+ALB/MBD)\", \" \")","v":" "},null,null,null,null,null,null,0,null,null,null,0," "," "," "," "]
[{"$f":"IF(COUNTRY_INFO!A59=0,\" \",COUNTRY_INFO!A59)","v":" Congo"},{"$f":"IF(COUNTRY_INFO!B59=0,\" \",COUNTRY_INFO!B59)","v":"Sangha"},{"$f":"IF(COUNTRY_INFO!C59=0,\" \",COUNTRY_INFO!C59)","v":"Ouesso"},{"$f":"IF(OR(COUNTRY_INFO!$U$9:$U$1000=\"T1 (PZQ+ALB/MBD)\",COUNTRY_INFO!$V$9:$V$1000=\"T1 (PZQ+ALB/MBD)\"), \"T1 (PZQ+ALB/MBD)\", \" \")","v":" "},null,null,null,null,null,null,0,null,null,null,0," "," "," "," "]
[{"$f":"IF(COUNTRY_INFO!A60=0,\" \",COUNTRY_INFO!A60)","v":" Congo"},{"$f":"IF(COUNTRY_INFO!B60=0,\" \",COUNTRY_INFO!B60)","v":"Sangha"},{"$f":"IF(COUNTRY_INFO!C60=0,\" \",COUNTRY_INFO!C60)","v":"Sembé-Souanké"},{"$f":"IF(OR(COUNTRY_INFO!$U$9:$U$1000=\"T1 (PZQ+ALB/MBD)\",COUNTRY_INFO!$V$9:$V$1000=\"T1 (PZQ+ALB/MBD)\"), \"T1 (PZQ+ALB/MBD)\", \" \")","v":" "},null,null,null,null,null,null,0,null,null,null,0," "," "," "," "]

{"sheet":"T2","index":6,"n_rows":60,"n_cols":17,"rows_kept":60,"cut":false,"hidden":false,"merged":[[5,5,5,8],[5,9,5,12],[5,13,5,16],[3,0,3,2],[5,0,5,2],[5,3,6,3],[5,4,6,4]]}
["T 2 - Praziquantel (PZQ) "]
["Structure administrative, population nécessitant une chimioprévention par groupe d'âge, population traitée par groupe d'âge et couverture"]
[]
["TOTAL",null,null,null,null,{"$f":"SUM(F$9:F$1000)","v":0},0,0,0,0,0,0,0,{"$f":"IF(F4<>0, IF(J4/F4*100=0, \"-\", J4/F4*100), \" \")","v":" "},{"$f":"IF(G4<>0, IF(K4/G4*100=0, \"-\", K4/G4*100), \" \")","v":" "},{"$f":"IF(H4<>0, IF(L4/H4*100=0, \"-\", L4/H4*100), \" \")","v":" "},{"$f":"IF(I4<>0, IF(M4/I4*100=0, \"-\", M4/I4*100), \" \")","v":" "}]
[]
["Structure administrative du pays",null,null,"Mise en oeuvre \nde la CP","Date","Population ciblée pour T2",null,null,null,"Population traitée",null,null,null,"Couverture du Programme (%)"]
["Pays","Région/Département","District",null,null,"EAPréS","EAS","Adultes","Total","EAPréS","EAS","Adultes","Total","EAPréS","EAS","Adultes","Total"]
[]
[{"$f":"IF(COUNTRY_INFO!A9=0,\" \",COUNTRY_INFO!A9)","v":" Congo"},{"$f":"IF(COUNTRY_INFO!B9=0,\" \",COUNTRY_INFO!B9)","v":"Bouenza"},{"$f":"IF(COUNTRY_INFO!C9=0,\" \",COUNTRY_INFO!C9)","v":"Loudima"},{"$f":"IF(OR(COUNTRY_INFO!$U$9:$U$1000=\"T2 (PZQ)\",COUNTRY_INFO!$V$9:$V$1000=\"T2 (PZQ)\"), \"T2 (PZQ)\", \" \")","v":" "},null,null,null,null,{"$f":"SUM(F9:H9)","v":0},null,null,null,{"$f":"SUM(J9:L9)","v":0},{"$f":"IF(F9<>0, IF(J9/F9*100=0, \"-\", J9/F9*100), \" \")","v":" "}," "," "," "]
[{"$f":"IF(COUNTRY_INFO!A10=0,\" \",COUNTRY_INFO!A10)","v":" Congo"},{"$f":"IF(COUNTRY_INFO!B10=0,\" \",COUNTRY_INFO!B10)","v":"Bouenza"},{"$f":"IF(COUNTRY_INFO!C10=0,\" \",COUNTRY_INFO!C10)","v":"Loutété"},{"$f":"IF(OR(COUNTRY_INFO!$U$9:$U$1000=\"T2 (PZQ)\",COUNTRY_INFO!$V$9:$V$1000=\"T2 (PZQ)\"), \"T2 (PZQ)\", \" \")","v":" "},null,null,null,null,{"$f":"SUM(F10:H10)","v":0},null,null,null,{"$f":"SUM(J10:L10)","v":0},{"$f":"IF(F10<>0, IF(J10/F10*100=0, \"-\", J10/F10*100), \" \")","v":" "},{"$f":"IF(G10<>0, IF(K10/G10*100=0, \"-\", K10/G10*100), \" \")","v":" "},{"$f":"IF(H10<>0, IF(L10/H10*100=0, \"-\", L10/H10*100), \" \")","v":" "},{"$f":"IF(I10<>0, IF(M10/I10*100=0, \"-\", M10/I10*100), \" \")","v":" "}]
[{"$f":"IF(COUNTRY_INFO!A11=0,\" \",COUNTRY_INFO!A11)","v":" Congo"},{"$f":"IF(COUNTRY_INFO!B11=0,\" \",COUNTRY_INFO!B11)","v":"Bouenza"},{"$f":"IF(COUNTRY_INFO!C11=0,\" \",COUNTRY_INFO!C11)","v":"Madingou"},{"$f":"IF(OR(COUNTRY_INFO!$U$9:$U$1000=\"T2 (PZQ)\",COUNTRY_INFO!$V$9:$V$1000=\"T2 (PZQ)\"), \"T2 (PZQ)\", \" \")","v":" "},null,null,null,null,0,null,null,null,0," "," "," "," "]
[{"$f":"IF(COUNTRY_INFO!A12=0,\" \",COUNTRY_INFO!A12)","v":" Congo"},{"$f":"IF(COUNTRY_INFO!B12=0,\" \",COUNTRY_INFO!B12)","v":"Bouenza"},{"$f":"IF(COUNTRY_INFO!C12=0,\" \",COUNTRY_INFO!C12)","v":"Mouyondzi"},{"$f":"IF(OR(COUNTRY_INFO!$U$9:$U$1000=\"T2 (PZQ)\",COUNTRY_INFO!$V$9:$V$1000=\"T2 (PZQ)\"), \"T2 (PZQ)\", \" \")","v":" "},null,null,null,null,0,null,null,null,0," "," "," "," "]
[{"$f":"IF(COUNTRY_INFO!A13=0,\" \",COUNTRY_INFO!A13)","v":" Congo"},{"$f":"IF(COUNTRY_INFO!B13=0,\" \",COUNTRY_INFO!B13)","v":"Bouenza"},{"$f":"IF(COUNTRY_INFO!C13=0,\" \",COUNTRY_INFO!C13)","v":"Nkayi"},{"$f":"IF(OR(COUNTRY_INFO!$U$9:$U$1000=\"T2 (PZQ)\",COUNTRY_INFO!$V$9:$V$1000=\"T2 (PZQ)\"), \"T2 (PZQ)\", \" \")","v":" "},null,null,null,null,0,null,null,null,0," "," "," "," "]
[{"$f":"IF(COUNTRY_INFO!A14=0,\" \",COUNTRY_INFO!A14)","v":" Congo"},{"$f":"IF(COUNTRY_INFO!B14=0,\" \",COUNTRY_INFO!B14)","v":"Brazzaville"},{"$f":"IF(COUNTRY_INFO!C14=0,\" \",COUNTRY_INFO!C14)","v":"Bacongo"},{"$f":"IF(OR(COUNTRY_INFO!$U$9:$U$1000=\"T2 (PZQ)\",COUNTRY_INFO!$V$9:$V$1000=\"T2 (PZQ)\"), \"T2 (PZQ)\", \" \")","v":" "},null,null,null,null,0,null,null,null,0," "," "," "," "]
[{"$f":"IF(COUNTRY_INFO!A15=0,\" \",COUNTRY_INFO!A15)","v":" Congo"},{"$f":"IF(COUNTRY_INFO!B15=0,\" \",COUNTRY_INFO!B15)","v":"Brazzaville"},{"$f":"IF(COUNTRY_INFO!C15=0,\" \",COUNTRY_INFO!C15)","v":"Djiri"},{"$f":"IF(OR(COUNTRY_INFO!$U$9:$U$1000=\"T2 (PZQ)\",COUNTRY_INFO!$V$9:$V$1000=\"T2 (PZQ)\"), \"T2 (PZQ)\", \" \")","v":" "},null,null,null,null,0,null,null,null,0," "," "," "," "]
[{"$f":"IF(COUNTRY_INFO!A16=0,\" \",COUNTRY_INFO!A16)","v":" Congo"},{"$f":"IF(COUNTRY_INFO!B16=0,\" \",COUNTRY_INFO!B16)","v":"Brazzaville"},{"$f":"IF(COUNTRY_INFO!C16=0,\" \",COUNTRY_INFO!C16)","v":"Île Mbamou"},{"$f":"IF(OR(COUNTRY_INFO!$U$9:$U$1000=\"T2 (PZQ)\",COUNTRY_INFO!$V$9:$V$1000=\"T2 (PZQ)\"), \"T2 (PZQ)\", \" \")","v":" "},null,null,null,null,0,null,null,null,0," "," "," "," "]
[{"$f":"IF(COUNTRY_INFO!A17=0,\" \",COUNTRY_INFO!A17)","v":" Congo"},{"$f":"IF(COUNTRY_INFO!B17=0,\" \",COUNTRY_INFO!B17)","v":"Brazzaville"},{"$f":"IF(COUNTRY_INFO!C17=0,\" \",COUNTRY_INFO!C17)","v":"Madibou"},{"$f":"IF(OR(COUNTRY_INFO!$U$9:$U$1000=\"T2 (PZQ)\",COUNTRY_INFO!$V$9:$V$1000=\"T2 (PZQ)\"), \"T2 (PZQ)\", \" \")","v":" "},null,null,null,null,0,null,null,null,0," "," "," "," "]
[{"$f":"IF(COUNTRY_INFO!A18=0,\" \",COUNTRY_INFO!A18)","v":" Congo"},{"$f":"IF(COUNTRY_INFO!B18=0,\" \",COUNTRY_INFO!B18)","v":"Brazzaville"},{"$f":"IF(COUNTRY_INFO!C18=0,\" \",COUNTRY_INFO!C18)","v":"Makélékélé"},{"$f":"IF(OR(COUNTRY_INFO!$U$9:$U$1000=\"T2 (PZQ)\",COUNTRY_INFO!$V$9:$V$1000=\"T2 (PZQ)\"), \"T2 (PZQ)\", \" \")","v":" "},null,null,null,null,0,null,null,null,0," "," "," "," "]
[{"$f":"IF(COUNTRY_INFO!A19=0,\" \",COUNTRY_INFO!A19)","v":" Congo"},{"$f":"IF(COUNTRY_INFO!B19=0,\" \",COUNTRY_INFO!B19)","v":"Brazzaville"},{"$f":"IF(COUNTRY_INFO!C19=0,\" \",COUNTRY_INFO!C19)","v":"Mfilou"},{"$f":"IF(OR(COUNTRY_INFO!$U$9:$U$1000=\"T2 (PZQ)\",COUNTRY_INFO!$V$9:$V$1000=\"T2 (PZQ)\"), \"T2 (PZQ)\", \" \")","v":" "},null,null,null,null,0,null,null,null,0," "," "," "," "]
[{"$f":"IF(COUNTRY_INFO!A20=0,\" \",COUNTRY_INFO!A20)","v":" Congo"},{"$f":"IF(COUNTRY_INFO!B20=0,\" \",COUNTRY_INFO!B20)","v":"Brazzaville"},{"$f":"IF(COUNTRY_INFO!C20=0,\" \",COUNTRY_INFO!C20)","v":"Moungali"},{"$f":"IF(OR(COUNTRY_INFO!$U$9:$U$1000=\"T2 (PZQ)\",COUNTRY_INFO!$V$9:$V$1000=\"T2 (PZQ)\"), \"T2 (PZQ)\", \" \")","v":" "},null,null,null,null,0,null,null,null,0," "," "," "," "]
[{"$f":"IF(COUNTRY_INFO!A21=0,\" \",COUNTRY_INFO!A21)","v":" Congo"},{"$f":"IF(COUNTRY_INFO!B21=0,\" \",COUNTRY_INFO!B21)","v":"Brazzaville"},{"$f":"IF(COUNTRY_INFO!C21=0,\" \",COUNTRY_INFO!C21)","v":"Ouenzé"},{"$f":"IF(OR(COUNTRY_INFO!$U$9:$U$1000=\"T2 (PZQ)\",COUNTRY_INFO!$V$9:$V$1000=\"T2 (PZQ)\"), \"T2 (PZQ)\", \" \")","v":" "},null,null,null,null,0,null,null,null,0," "," "," "," "]
[{"$f":"IF(COUNTRY_INFO!A22=0,\" \",COUNTRY_INFO!A22)","v":" Congo"},{"$f":"IF(COUNTRY_INFO!B22=0,\" \",COUNTRY_INFO!B22)","v":"Brazzaville"},{"$f":"IF(COUNTRY_INFO!C22=0,\" \",COUNTRY_INFO!C22)","v":"Poto-Poto"},{"$f":"IF(OR(COUNTRY_INFO!$U$9:$U$1000=\"T2 (PZQ)\",COUNTRY_INFO!$V$9:$V$1000=\"T2 (PZQ)\"), \"T2 (PZQ)\", \" \")","v":" "},null,null,null,null,0,null,null,null,0," "," "," "," "]
[{"$f":"IF(COUNTRY_INFO!A23=0,\" \",COUNTRY_INFO!A23)","v":" Congo"},{"$f":"IF(COUNTRY_INFO!B23=0,\" \",COUNTRY_INFO!B23)","v":"Brazzaville"},{"$f":"IF(COUNTRY_INFO!C23=0,\" \",COUNTRY_INFO!C23)","v":"Talangaî"},{"$f":"IF(OR(COUNTRY_INFO!$U$9:$U$1000=\"T2 (PZQ)\",COUNTRY_INFO!$V$9:$V$1000=\"T2 (PZQ)\"), \"T2 (PZQ)\", \" \")","v":" "},null,null,null,null,0,null,null,null,0," "," "," "," "]
[{"$f":"IF(COUNTRY_INFO!A24=0,\" \",COUNTRY_INFO!A24)","v":" Congo"},{"$f":"IF(COUNTRY_INFO!B24=0,\" \",COUNTRY_INFO!B24)","v":"Cuvette"},{"$f":"IF(COUNTRY_INFO!C24=0,\" \",COUNTRY_INFO!C24)","v":"Mossaka"},{"$f":"IF(OR(COUNTRY_INFO!$U$9:$U$1000=\"T2 (PZQ)\",COUNTRY_INFO!$V$9:$V$1000=\"T2 (PZQ)\"), \"T2 (PZQ)\", \" \")","v":" "},null,null,null,null,0,null,null,null,0," "," "," "," "]
[{"$f":"IF(COUNTRY_INFO!A25=0,\" \",COUNTRY_INFO!A25)","v":" Congo"},{"$f":"IF(COUNTRY_INFO!B25=0,\" \",COUNTRY_INFO!B25)","v":"Cuvette"},{"$f":"IF(COUNTRY_INFO!C25=0,\" \",COUNTRY_INFO!C25)","v":"Owando"},{"$f":"IF(OR(COUNTRY_INFO!$U$9:$U$1000=\"T2 (PZQ)\",COUNTRY_INFO!$V$9:$V$1000=\"T2 (PZQ)\"), \"T2 (PZQ)\", \" \")","v":" "},null,null,null,null,0,null,null,null,0," "," "," "," "]
[{"$f":"IF(COUNTRY_INFO!A26=0,\" \",COUNTRY_INFO!A26)","v":" Congo"},{"$f":"IF(COUNTRY_INFO!B26=0,\" \",COUNTRY_INFO!B26)","v":"Cuvette"},{"$f":"IF(COUNTRY_INFO!C26=0,\" \",COUNTRY_INFO!C26)","v":"Oyo-Alima"},{"$f":"IF(OR(COUNTRY_INFO!$U$9:$U$1000=\"T2 (PZQ)\",COUNTRY_INFO!$V$9:$V$1000=\"T2 (PZQ)\"), \"T2 (PZQ)\", \" \")","v":" "},null,null,null,null,0,null,null,null,0," "," "," "," "]
[{"$f":"IF(COUNTRY_INFO!A27=0,\" \",COUNTRY_INFO!A27)","v":" Congo"},{"$f":"IF(COUNTRY_INFO!B27=0,\" \",COUNTRY_INFO!B27)","v":"Cuvette-Ouest"},{"$f":"IF(COUNTRY_INFO!C27=0,\" \",COUNTRY_INFO!C27)","v":"Etoumbi"},{"$f":"IF(OR(COUNTRY_INFO!$U$9:$U$1000=\"T2 (PZQ)\",COUNTRY_INFO!$V$9:$V$1000=\"T2 (PZQ)\"), \"T2 (PZQ)\", \" \")","v":" "},null,null,null,null,0,null,null,null,0," "," "," "," "]
[{"$f":"IF(COUNTRY_INFO!A28=0,\" \",COUNTRY_INFO!A28)","v":" Congo"},{"$f":"IF(COUNTRY_INFO!B28=0,\" \",COUNTRY_INFO!B28)","v":"Cuvette-Ouest"},{"$f":"IF(COUNTRY_INFO!C28=0,\" \",COUNTRY_INFO!C28)","v":"Ewo"},{"$f":"IF(OR(COUNTRY_INFO!$U$9:$U$1000=\"T2 (PZQ)\",COUNTRY_INFO!$V$9:$V$1000=\"T2 (PZQ)\"), \"T2 (PZQ)\", \" \")","v":" "},null,null,null,null,0,null,null,null,0," "," "," "," "]
[{"$f":"IF(COUNTRY_INFO!A29=0,\" \",COUNTRY_INFO!A29)","v":" Congo"},{"$f":"IF(COUNTRY_INFO!B29=0,\" \",COUNTRY_INFO!B29)","v":"Kouilou"},{"$f":"IF(COUNTRY_INFO!C29=0,\" \",COUNTRY_INFO!C29)","v":"Hinda-Loango"},{"$f":"IF(OR(COUNTRY_INFO!$U$9:$U$1000=\"T2 (PZQ)\",COUNTRY_INFO!$V$9:$V$1000=\"T2 (PZQ)\"), \"T2 (PZQ)\", \" \")","v":" "},null,null,null,null,0,null,null,null,0," "," "," "," "]
[{"$f":"IF(COUNTRY_INFO!A30=0,\" \",COUNTRY_INFO!A30)","v":" Congo"},{"$f":"IF(COUNTRY_INFO!B30=0,\" \",COUNTRY_INFO!B30)","v":"Kouilou"},{"$f":"IF(COUNTRY_INFO!C30=0,\" \",COUNTRY_INFO!C30)","v":"Madingo Kayes-Nzambi"},{"$f":"IF(OR(COUNTRY_INFO!$U$9:$U$1000=\"T2 (PZQ)\",COUNTRY_INFO!$V$9:$V$1000=\"T2 (PZQ)\"), \"T2 (PZQ)\", \" \")","v":" "},null,null,null,null,0,null,null,null,0," "," "," "," "]
[{"$f":"IF(COUNTRY_INFO!A31=0,\" \",COUNTRY_INFO!A31)","v":" Congo"},{"$f":"IF(COUNTRY_INFO!B31=0,\" \",COUNTRY_INFO!B31)","v":"Kouilou"},{"$f":"IF(COUNTRY_INFO!C31=0,\" \",COUNTRY_INFO!C31)","v":"Mvouti-Kakamouéka"},{"$f":"IF(OR(COUNTRY_INFO!$U$9:$U$1000=\"T2 (PZQ)\",COUNTRY_INFO!$V$9:$V$1000=\"T2 (PZQ)\"), \"T2 (PZQ)\", \" \")","v":" "},null,null,null,null,0,null,null,null,0," "," "," "," "]
[{"$f":"IF(COUNTRY_INFO!A32=0,\" \",COUNTRY_INFO!A32)","v":" Congo"},{"$f":"IF(COUNTRY_INFO!B32=0,\" \",COUNTRY_INFO!B32)","v":"Lékoumou"},{"$f":"IF(COUNTRY_INFO!C32=0,\" \",COUNTRY_INFO!C32)","v":"Sibiti"},{"$f":"IF(OR(COUNTRY_INFO!$U$9:$U$1000=\"T2 (PZQ)\",COUNTRY_INFO!$V$9:$V$1000=\"T2 (PZQ)\"), \"T2 (PZQ)\", \" \")","v":" "},null,null,null,null,0,null,null,null,0," "," "," "," "]
[{"$f":"IF(COUNTRY_INFO!A33=0,\" \",COUNTRY_INFO!A33)","v":" Congo"},{"$f":"IF(COUNTRY_INFO!B33=0,\" \",COUNTRY_INFO!B33)","v":"Lékoumou"},{"$f":"IF(COUNTRY_INFO!C33=0,\" \",COUNTRY_INFO!C33)","v":"Zanaga"},{"$f":"IF(OR(COUNTRY_INFO!$U$9:$U$1000=\"T2 (PZQ)\",COUNTRY_INFO!$V$9:$V$1000=\"T2 (PZQ)\"), \"T2 (PZQ)\", \" \")","v":" "},null,null,null,null,0,null,null,null,0," "," "," "," "]
[{"$f":"IF(COUNTRY_INFO!A34=0,\" \",COUNTRY_INFO!A34)","v":" Congo"},{"$f":"IF(COUNTRY_INFO!B34=0,\" \",COUNTRY_INFO!B34)","v":"Likouala"},{"$f":"IF(COUNTRY_INFO!C34=0,\" \",COUNTRY_INFO!C34)","v":"Bétou"},{"$f":"IF(OR(COUNTRY_INFO!$U$9:$U$1000=\"T2 (PZQ)\",COUNTRY_INFO!$V$9:$V$1000=\"T2 (PZQ)\"), \"T2 (PZQ)\", \" \")","v":" "},null,null,null,null,0,null,null,null,0," "," "," "," "]
[{"$f":"IF(COUNTRY_INFO!A35=0,\" \",COUNTRY_INFO!A35)","v":" Congo"},{"$f":"IF(COUNTRY_INFO!B35=0,\" \",COUNTRY_INFO!B35)","v":"Likouala"},{"$f":"IF(COUNTRY_INFO!C35=0,\" \",COUNTRY_INFO!C35)","v":"Impfondo"},{"$f":"IF(OR(COUNTRY_INFO!$U$9:$U$1000=\"T2 (PZQ)\",COUNTRY_INFO!$V$9:$V$1000=\"T2 (PZQ)\"), \"T2 (PZQ)\", \" \")","v":" "},null,null,null,null,0,null,null,null,0," "," "," "," "]
[{"$f":"IF(COUNTRY_INFO!A36=0,\" \",COUNTRY_INFO!A36)","v":" Congo"},{"$f":"IF(COUNTRY_INFO!B36=0,\" \",COUNTRY_INFO!B36)","v":"Niari"},{"$f":"IF(COUNTRY_INFO!C36=0,\" \",COUNTRY_INFO!C36)","v":"Dolisie"},{"$f":"IF(OR(COUNTRY_INFO!$U$9:$U$1000=\"T2 (PZQ)\",COUNTRY_INFO!$V$9:$V$1000=\"T2 (PZQ)\"), \"T2 (PZQ)\", \" \")","v":" "},null,null,null,null,0,null,null,null,0," "," "," "," "]
[{"$f":"IF(COUNTRY_INFO!A37=0,\" \",COUNTRY_INFO!A37)","v":" Congo"},{"$f":"IF(COUNTRY_INFO!B37=0,\" \",COUNTRY_INFO!B37)","v":"Niari"},{"$f":"IF(COUNTRY_INFO!C37=0,\" \",COUNTRY_INFO!C37)","v":"Kibangou"},{"$f":"IF(OR(COUNTRY_INFO!$U$9:$U$1000=\"T2 (PZQ)\",COUNTRY_INFO!$V$9:$V$1000=\"T2 (PZQ)\"), \"T2 (PZQ)\", \" \")","v":" "},null,null,null,null,0,null,null,null,0," "," "," "," "]
[{"$f":"IF(COUNTRY_INFO!A38=0,\" \",COUNTRY_INFO!A38)","v":" Congo"},{"$f":"IF(COUNTRY_INFO!B38=0,\" \",COUNTRY_INFO!B38)","v":"Niari"},{"$f":"IF(COUNTRY_INFO!C38=0,\" \",COUNTRY_INFO!C38)","v":"Kimongo-Londela Nkayes"},{"$f":"IF(OR(COUNTRY_INFO!$U$9:$U$1000=\"T2 (PZQ)\",COUNTRY_INFO!$V$9:$V$1000=\"T2 (PZQ)\"), \"T2 (PZQ)\", \" \")","v":" "},null,null,null,null,0,null,null,null,0," "," "," "," "]
[{"$f":"IF(COUNTRY_INFO!A39=0,\" \",COUNTRY_INFO!A39)","v":" Congo"},{"$f":"IF(COUNTRY_INFO!B39=0,\" \",COUNTRY_INFO!B39)","v":"Niari"},{"$f":"IF(COUNTRY_INFO!C39=0,\" \",COUNTRY_INFO!C39)","v":"Mayoko"},{"$f":"IF(OR(COUNTRY_INFO!$U$9:$U$1000=\"T2 (PZQ)\",COUNTRY_INFO!$V$9:$V$1000=\"T2 (PZQ)\"), \"T2 (PZQ)\", \" \")","v":" "},null,null,null,null,0,null,null,null,0," "," "," "," "]
[{"$f":"IF(COUNTRY_INFO!A40=0,\" \",COUNTRY_INFO!A40)","v":" Congo"},{"$f":"IF(COUNTRY_INFO!B40=0,\" \",COUNTRY_INFO!B40)","v":"Niari"},{"$f":"IF(COUNTRY_INFO!C40=0,\" \",COUNTRY_INFO!C40)","v":"Mossendjo"},{"$f":"IF(OR(COUNTRY_INFO!$U$9:$U$1000=\"T2 (PZQ)\",COUNTRY_INFO!$V$9:$V$1000=\"T2 (PZQ)\"), \"T2 (PZQ)\", \" \")","v":" "},null,null,null,null,0,null,null,null,0," "," "," "," "]
[{"$f":"IF(COUNTRY_INFO!A41=0,\" \",COUNTRY_INFO!A41)","v":" Congo"},{"$f":"IF(COUNTRY_INFO!B41=0,\" \",COUNTRY_INFO!B41)","v":"Plateaux"},{"$f":"IF(COUNTRY_INFO!C41=0,\" \",COUNTRY_INFO!C41)","v":"Abala"},{"$f":"IF(OR(COUNTRY_INFO!$U$9:$U$1000=\"T2 (PZQ)\",COUNTRY_INFO!$V$9:$V$1000=\"T2 (PZQ)\"), \"T2 (PZQ)\", \" \")","v":" "},null,null,null,null,0,null,null,null,0," "," "," "," "]
[{"$f":"IF(COUNTRY_INFO!A42=0,\" \",COUNTRY_INFO!A42)","v":" Congo"},{"$f":"IF(COUNTRY_INFO!B42=0,\" \",COUNTRY_INFO!B42)","v":"Plateaux"},{"$f":"IF(COUNTRY_INFO!C42=0,\" \",COUNTRY_INFO!C42)","v":"Djambala-Lékana"},{"$f":"IF(OR(COUNTRY_INFO!$U$9:$U$1000=\"T2 (PZQ)\",COUNTRY_INFO!$V$9:$V$1000=\"T2 (PZQ)\"), \"T2 (PZQ)\", \" \")","v":" "},null,null,null,null,0,null,null,null,0," "," "," "," "]
[{"$f":"IF(COUNTRY_INFO!A43=0,\" \",COUNTRY_INFO!A43)","v":" Congo"},{"$f":"IF(COUNTRY_INFO!B43=0,\" \",COUNTRY_INFO!B43)","v":"Plateaux"},{"$f":"IF(COUNTRY_INFO!C43=0,\" \",COUNTRY_INFO!C43)","v":"Gamboma"},{"$f":"IF(OR(COUNTRY_INFO!$U$9:$U$1000=\"T2 (PZQ)\",COUNTRY_INFO!$V$9:$V$1000=\"T2 (PZQ)\"), \"T2 (PZQ)\", \" \")","v":" "},null,null,null,null,0,null,null,null,0," "," "," "," "]
[{"$f":"IF(COUNTRY_INFO!A44=0,\" \",COUNTRY_INFO!A44)","v":" Congo"},{"$f":"IF(COUNTRY_INFO!B44=0,\" \",COUNTRY_INFO!B44)","v":"Plateaux"},{"$f":"IF(COUNTRY_INFO!C44=0,\" \",COUNTRY_INFO!C44)","v":"Ngo Mpouya"},{"$f":"IF(OR(COUNTRY_INFO!$U$9:$U$1000=\"T2 (PZQ)\",COUNTRY_INFO!$V$9:$V$1000=\"T2 (PZQ)\"), \"T2 (PZQ)\", \" \")","v":" "},null,null,null,null,0,null,null,null,0," "," "," "," "]
[{"$f":"IF(COUNTRY_INFO!A45=0,\" \",COUNTRY_INFO!A45)","v":" Congo"},{"$f":"IF(COUNTRY_INFO!B45=0,\" \",COUNTRY_INFO!B45)","v":"Pointe-Noire"},{"$f":"IF(COUNTRY_INFO!C45=0,\" \",COUNTRY_INFO!C45)","v":"Loandjili"},{"$f":"IF(OR(COUNTRY_INFO!$U$9:$U$1000=\"T2 (PZQ)\",COUNTRY_INFO!$V$9:$V$1000=\"T2 (PZQ)\"), \"T2 (PZQ)\", \" \")","v":" "},null,null,null,null,0,null,null,null,0," "," "," "," "]
[{"$f":"IF(COUNTRY_INFO!A46=0,\" \",COUNTRY_INFO!A46)","v":" Congo"},{"$f":"IF(COUNTRY_INFO!B46=0,\" \",COUNTRY_INFO!B46)","v":"Pointe-Noire"},{"$f":"IF(COUNTRY_INFO!C46=0,\" \",COUNTRY_INFO!C46)","v":"Lumumba"},{"$f":"IF(OR(COUNTRY_INFO!$U$9:$U$1000=\"T2 (PZQ)\",COUNTRY_INFO!$V$9:$V$1000=\"T2 (PZQ)\"), \"T2 (PZQ)\", \" \")","v":" "},null,null,null,null,0,null,null,null,0," "," "," "," "]
[{"$f":"IF(COUNTRY_INFO!A47=0,\" \",COUNTRY_INFO!A47)","v":" Congo"},{"$f":"IF(COUNTRY_INFO!B47=0,\" \",COUNTRY_INFO!B47)","v":"Pointe-Noire"},{"$f":"IF(COUNTRY_INFO!C47=0,\" \",COUNTRY_INFO!C47)","v":"Mongo-Poukou"},{"$f":"IF(OR(COUNTRY_INFO!$U$9:$U$1000=\"T2 (PZQ)\",COUNTRY_INFO!$V$9:$V$1000=\"T2 (PZQ)\"), \"T2 (PZQ)\", \" \")","v":" "},null,null,null,null,0,null,null,null,0," "," "," "," "]
[{"$f":"IF(COUNTRY_INFO!A48=0,\" \",COUNTRY_INFO!A48)","v":" Congo"},{"$f":"IF(COUNTRY_INFO!B48=0,\" \",COUNTRY_INFO!B48)","v":"Pointe-Noire"},{"$f":"IF(COUNTRY_INFO!C48=0,\" \",COUNTRY_INFO!C48)","v":"Mvoumvou"},{"$f":"IF(OR(COUNTRY_INFO!$U$9:$U$1000=\"T2 (PZQ)\",COUNTRY_INFO!$V$9:$V$1000=\"T2 (PZQ)\"), \"T2 (PZQ)\", \" \")","v":" "},null,null,null,null,0,null,null,null,0," "," "," "," "]
[{"$f":"IF(COUNTRY_INFO!A49=0,\" \",COUNTRY_INFO!A49)","v":" Congo"},{"$f":"IF(COUNTRY_INFO!B49=0,\" \",COUNTRY_INFO!B49)","v":"Pointe-Noire"},{"$f":"IF(COUNTRY_INFO!C49=0,\" \",COUNTRY_INFO!C49)","v":"Ngoyo"},{"$f":"IF(OR(COUNTRY_INFO!$U$9:$U$1000=\"T2 (PZQ)\",COUNTRY_INFO!$V$9:$V$1000=\"T2 (PZQ)\"), \"T2 (PZQ)\", \" \")","v":" "},null,null,null,null,0,null,null,null,0," "," "," "," "]
[{"$f":"IF(COUNTRY_INFO!A50=0,\" \",COUNTRY_INFO!A50)","v":" Congo"},{"$f":"IF(COUNTRY_INFO!B50=0,\" \",COUNTRY_INFO!B50)","v":"Pointe-Noire"},{"$f":"IF(COUNTRY_INFO!C50=0,\" \",COUNTRY_INFO!C50)","v":"Tchiamba Nzassi"},{"$f":"IF(OR(COUNTRY_INFO!$U$9:$U$1000=\"T2 (PZQ)\",COUNTRY_INFO!$V$9:$V$1000=\"T2 (PZQ)\"), \"T2 (PZQ)\", \" \")","v":" "},null,null,null,null,0,null,null,null,0," "," "," "," "]
[{"$f":"IF(COUNTRY_INFO!A51=0,\" \",COUNTRY_INFO!A51)","v":" Congo"},{"$f":"IF(COUNTRY_INFO!B51=0,\" \",COUNTRY_INFO!B51)","v":"Pointe-Noire"},{"$f":"IF(COUNTRY_INFO!C51=0,\" \",COUNTRY_INFO!C51)","v":"Tie-Tie"},{"$f":"IF(OR(COUNTRY_INFO!$U$9:$U$1000=\"T2 (PZQ)\",COUNTRY_INFO!$V$9:$V$1000=\"T2 (PZQ)\"), \"T2 (PZQ)\", \" \")","v":" "},null,null,null,null,0,null,null,null,0," "," "," "," "]
[{"$f":"IF(COUNTRY_INFO!A52=0,\" \",COUNTRY_INFO!A52)","v":" Congo"},{"$f":"IF(COUNTRY_INFO!B52=0,\" \",COUNTRY_INFO!B52)","v":"Pool"},{"$f":"IF(COUNTRY_INFO!C52=0,\" \",COUNTRY_INFO!C52)","v":"Boko"},{"$f":"IF(OR(COUNTRY_INFO!$U$9:$U$1000=\"T2 (PZQ)\",COUNTRY_INFO!$V$9:$V$1000=\"T2 (PZQ)\"), \"T2 (PZQ)\", \" \")","v":" "},null,null,null,null,0,null,null,null,0," "," "," "," "]
[{"$f":"IF(COUNTRY_INFO!A53=0,\" \",COUNTRY_INFO!A53)","v":" Congo"},{"$f":"IF(COUNTRY_INFO!B53=0,\" \",COUNTRY_INFO!B53)","v":"Pool"},{"$f":"IF(COUNTRY_INFO!C53=0,\" \",COUNTRY_INFO!C53)","v":"Goma tsétsé"},{"$f":"IF(OR(COUNTRY_INFO!$U$9:$U$1000=\"T2 (PZQ)\",COUNTRY_INFO!$V$9:$V$1000=\"T2 (PZQ)\"), \"T2 (PZQ)\", \" \")","v":" "},null,null,null,null,0,null,null,null,0," "," "," "," "]
[{"$f":"IF(COUNTRY_INFO!A54=0,\" \",COUNTRY_INFO!A54)","v":" Congo"},{"$f":"IF(COUNTRY_INFO!B54=0,\" \",COUNTRY_INFO!B54)","v":"Pool"},{"$f":"IF(COUNTRY_INFO!C54=0,\" \",COUNTRY_INFO!C54)","v":"Ignié"},{"$f":"IF(OR(COUNTRY_INFO!$U$9:$U$1000=\"T2 (PZQ)\",COUNTRY_INFO!$V$9:$V$1000=\"T2 (PZQ)\"), \"T2 (PZQ)\", \" \")","v":" "},null,null,null,null,0,null,null,null,0," "," "," "," "]
[{"$f":"IF(COUNTRY_INFO!A55=0,\" \",COUNTRY_INFO!A55)","v":" Congo"},{"$f":"IF(COUNTRY_INFO!B55=0,\" \",COUNTRY_INFO!B55)","v":"Pool"},{"$f":"IF(COUNTRY_INFO!C55=0,\" \",COUNTRY_INFO!C55)","v":"Kindamba"},{"$f":"IF(OR(COUNTRY_INFO!$U$9:$U$1000=\"T2 (PZQ)\",COUNTRY_INFO!$V$9:$V$1000=\"T2 (PZQ)\"), \"T2 (PZQ)\", \" \")","v":" "},null,null,null,null,0,null,null,null,0," "," "," "," "]
[{"$f":"IF(COUNTRY_INFO!A56=0,\" \",COUNTRY_INFO!A56)","v":" Congo"},{"$f":"IF(COUNTRY_INFO!B56=0,\" \",COUNTRY_INFO!B56)","v":"Pool"},{"$f":"IF(COUNTRY_INFO!C56=0,\" \",COUNTRY_INFO!C56)","v":"Kinkala"},{"$f":"IF(OR(COUNTRY_INFO!$U$9:$U$1000=\"T2 (PZQ)\",COUNTRY_INFO!$V$9:$V$1000=\"T2 (PZQ)\"), \"T2 (PZQ)\", \" \")","v":" "},null,null,null,null,0,null,null,null,0," "," "," "," "]
[{"$f":"IF(COUNTRY_INFO!A57=0,\" \",COUNTRY_INFO!A57)","v":" Congo"},{"$f":"IF(COUNTRY_INFO!B57=0,\" \",COUNTRY_INFO!B57)","v":"Pool"},{"$f":"IF(COUNTRY_INFO!C57=0,\" \",COUNTRY_INFO!C57)","v":"Kintélé"},{"$f":"IF(OR(COUNTRY_INFO!$U$9:$U$1000=\"T2 (PZQ)\",COUNTRY_INFO!$V$9:$V$1000=\"T2 (PZQ)\"), \"T2 (PZQ)\", \" \")","v":" "},null,null,null,null,0,null,null,null,0," "," "," "," "]
[{"$f":"IF(COUNTRY_INFO!A58=0,\" \",COUNTRY_INFO!A58)","v":" Congo"},{"$f":"IF(COUNTRY_INFO!B58=0,\" \",COUNTRY_INFO!B58)","v":"Pool"},{"$f":"IF(COUNTRY_INFO!C58=0,\" \",COUNTRY_INFO!C58)","v":"Mindouli"},{"$f":"IF(OR(COUNTRY_INFO!$U$9:$U$1000=\"T2 (PZQ)\",COUNTRY_INFO!$V$9:$V$1000=\"T2 (PZQ)\"), \"T2 (PZQ)\", \" \")","v":" "},null,null,null,null,0,null,null,null,0," "," "," "," "]
[{"$f":"IF(COUNTRY_INFO!A59=0,\" \",COUNTRY_INFO!A59)","v":" Congo"},{"$f":"IF(COUNTRY_INFO!B59=0,\" \",COUNTRY_INFO!B59)","v":"Sangha"},{"$f":"IF(COUNTRY_INFO!C59=0,\" \",COUNTRY_INFO!C59)","v":"Ouesso"},{"$f":"IF(OR(COUNTRY_INFO!$U$9:$U$1000=\"T2 (PZQ)\",COUNTRY_INFO!$V$9:$V$1000=\"T2 (PZQ)\"), \"T2 (PZQ)\", \" \")","v":" "},null,null,null,null,0,null,null,null,0," "," "," "," "]
[{"$f":"IF(COUNTRY_INFO!A60=0,\" \",COUNTRY_INFO!A60)","v":" Congo"},{"$f":"IF(COUNTRY_INFO!B60=0,\" \",COUNTRY_INFO!B60)","v":"Sangha"},{"$f":"IF(COUNTRY_INFO!C60=0,\" \",COUNTRY_INFO!C60)","v":"Sembé-Souanké"},{"$f":"IF(OR(COUNTRY_INFO!$U$9:$U$1000=\"T2 (PZQ)\",COUNTRY_INFO!$V$9:$V$1000=\"T2 (PZQ)\"), \"T2 (PZQ)\", \" \")","v":" "},null,null,null,null,0,null,null,null,0," "," "," "," "]

{"sheet":"T3_R1","index":7,"n_rows":60,"n_cols":20,"rows_kept":60,"cut":false,"hidden":false,"merged":[[5,6,5,9],[5,10,5,13],[5,14,5,17],[3,0,3,2],[5,0,5,2],[5,3,6,3],[5,5,6,5],[5,4,6,4]]}
["T 3 - Albendazole (ALB) ou Mebendazole (MBD) - Tournée 1"]
["Structure administrative, population nécessitant une chimioprévention par groupe d'âge, population traitée par groupe d'âge et couverture"]
[]
["TOTAL",null,null,null,null,null,{"$f":"SUM(G$9:G$1000)","v":0},0,0,0,0,0,0,0,{"$f":"IF(G4<>0, IF(K4/G4*100=0, \"-\", K4/G4*100), \" \")","v":" "},{"$f":"IF(H4<>0, IF(L4/H4*100=0, \"-\", L4/H4*100), \" \")","v":" "},{"$f":"IF(I4<>0, IF(M4/I4*100=0, \"-\", M4/I4*100), \" \")","v":" "},{"$f":"IF(J4<>0, IF(N4/J4*100=0, \"-\", N4/J4*100), \" \")","v":" "}]
[]
["Structure administrative du pays",null,null,"Mise en oeuvre \nde la CP","Médica-ment","Date","Population ciblée pour T3",null,null,null,"Population traitée",null,null,null,"Couverture du Programme (%)"]
["Pays","Région/Département","District",null,null,null,"EAPréS","EAS","Adultes","Total","EAPréS","EAS","Adultes","Total","EAPréS","EAS","Adultes","Total"]
[]
[{"$f":"IF(COUNTRY_INFO!A9=0,\" \",COUNTRY_INFO!A9)","v":" Congo"},{"$f":"IF(COUNTRY_INFO!B9=0,\" \",COUNTRY_INFO!B9)","v":"Bouenza"},{"$f":"IF(COUNTRY_INFO!C9=0,\" \",COUNTRY_INFO!C9)","v":"Loudima"},{"$f":"IF(OR(COUNTRY_INFO!$U$9:$U$1000=\"T3 (ALB/MBD)\",COUNTRY_INFO!$V$9:$V$1000=\"T3 (ALB/MBD)\"), \"T3 (ALB/MBD)\", \" \")","v":" "},null,null,null,null,null,{"$f":"SUM(G9:I9)","v":0},null,null,null,{"$f":"SUM(K9:M9)","v":0},{"$f":"IF(G9<>0, IF(K9/G9*100=0, \"-\", K9/G9*100), \" \")","v":" "}," "," "," "]
[{"$f":"IF(COUNTRY_INFO!A10=0,\" \",COUNTRY_INFO!A10)","v":" Congo"},{"$f":"IF(COUNTRY_INFO!B10=0,\" \",COUNTRY_INFO!B10)","v":"Bouenza"},{"$f":"IF(COUNTRY_INFO!C10=0,\" \",COUNTRY_INFO!C10)","v":"Loutété"},{"$f":"IF(OR(COUNTRY_INFO!$U$9:$U$1000=\"T3 (ALB/MBD)\",COUNTRY_INFO!$V$9:$V$1000=\"T3 (ALB/MBD)\"), \"T3 (ALB/MBD)\", \" \")","v":" "},null,null,null,null,null,{"$f":"SUM(G10:I10)","v":0},null,null,null,{"$f":"SUM(K10:M10)","v":0},{"$f":"IF(G10<>0, IF(K10/G10*100=0, \"-\", K10/G10*100), \" \")","v":" "},{"$f":"IF(H10<>0, IF(L10/H10*100=0, \"-\", L10/H10*100), \" \")","v":" "},{"$f":"IF(I10<>0, IF(M10/I10*100=0, \"-\", M10/I10*100), \" \")","v":" "},{"$f":"IF(J10<>0, IF(N10/J10*100=0, \"-\", N10/J10*100), \" \")","v":" "}]
[{"$f":"IF(COUNTRY_INFO!A11=0,\" \",COUNTRY_INFO!A11)","v":" Congo"},{"$f":"IF(COUNTRY_INFO!B11=0,\" \",COUNTRY_INFO!B11)","v":"Bouenza"},{"$f":"IF(COUNTRY_INFO!C11=0,\" \",COUNTRY_INFO!C11)","v":"Madingou"},{"$f":"IF(OR(COUNTRY_INFO!$U$9:$U$1000=\"T3 (ALB/MBD)\",COUNTRY_INFO!$V$9:$V$1000=\"T3 (ALB/MBD)\"), \"T3 (ALB/MBD)\", \" \")","v":" "},null,null,null,null,null,0,null,null,null,0," "," "," "," "]
[{"$f":"IF(COUNTRY_INFO!A12=0,\" \",COUNTRY_INFO!A12)","v":" Congo"},{"$f":"IF(COUNTRY_INFO!B12=0,\" \",COUNTRY_INFO!B12)","v":"Bouenza"},{"$f":"IF(COUNTRY_INFO!C12=0,\" \",COUNTRY_INFO!C12)","v":"Mouyondzi"},{"$f":"IF(OR(COUNTRY_INFO!$U$9:$U$1000=\"T3 (ALB/MBD)\",COUNTRY_INFO!$V$9:$V$1000=\"T3 (ALB/MBD)\"), \"T3 (ALB/MBD)\", \" \")","v":" "},null,null,null,null,null,0,null,null,null,0," "," "," "," "]
[{"$f":"IF(COUNTRY_INFO!A13=0,\" \",COUNTRY_INFO!A13)","v":" Congo"},{"$f":"IF(COUNTRY_INFO!B13=0,\" \",COUNTRY_INFO!B13)","v":"Bouenza"},{"$f":"IF(COUNTRY_INFO!C13=0,\" \",COUNTRY_INFO!C13)","v":"Nkayi"},{"$f":"IF(OR(COUNTRY_INFO!$U$9:$U$1000=\"T3 (ALB/MBD)\",COUNTRY_INFO!$V$9:$V$1000=\"T3 (ALB/MBD)\"), \"T3 (ALB/MBD)\", \" \")","v":" "},null,null,null,null,null,0,null,null,null,0," "," "," "," "]
[{"$f":"IF(COUNTRY_INFO!A14=0,\" \",COUNTRY_INFO!A14)","v":" Congo"},{"$f":"IF(COUNTRY_INFO!B14=0,\" \",COUNTRY_INFO!B14)","v":"Brazzaville"},{"$f":"IF(COUNTRY_INFO!C14=0,\" \",COUNTRY_INFO!C14)","v":"Bacongo"},{"$f":"IF(OR(COUNTRY_INFO!$U$9:$U$1000=\"T3 (ALB/MBD)\",COUNTRY_INFO!$V$9:$V$1000=\"T3 (ALB/MBD)\"), \"T3 (ALB/MBD)\", \" \")","v":" "},null,null,null,null,null,0,null,null,null,0," "," "," "," "]
[{"$f":"IF(COUNTRY_INFO!A15=0,\" \",COUNTRY_INFO!A15)","v":" Congo"},{"$f":"IF(COUNTRY_INFO!B15=0,\" \",COUNTRY_INFO!B15)","v":"Brazzaville"},{"$f":"IF(COUNTRY_INFO!C15=0,\" \",COUNTRY_INFO!C15)","v":"Djiri"},{"$f":"IF(OR(COUNTRY_INFO!$U$9:$U$1000=\"T3 (ALB/MBD)\",COUNTRY_INFO!$V$9:$V$1000=\"T3 (ALB/MBD)\"), \"T3 (ALB/MBD)\", \" \")","v":" "},null,null,null,null,null,0,null,null,null,0," "," "," "," "]
[{"$f":"IF(COUNTRY_INFO!A16=0,\" \",COUNTRY_INFO!A16)","v":" Congo"},{"$f":"IF(COUNTRY_INFO!B16=0,\" \",COUNTRY_INFO!B16)","v":"Brazzaville"},{"$f":"IF(COUNTRY_INFO!C16=0,\" \",COUNTRY_INFO!C16)","v":"Île Mbamou"},{"$f":"IF(OR(COUNTRY_INFO!$U$9:$U$1000=\"T3 (ALB/MBD)\",COUNTRY_INFO!$V$9:$V$1000=\"T3 (ALB/MBD)\"), \"T3 (ALB/MBD)\", \" \")","v":" "},null,null,null,null,null,0,null,null,null,0," "," "," "," "]
[{"$f":"IF(COUNTRY_INFO!A17=0,\" \",COUNTRY_INFO!A17)","v":" Congo"},{"$f":"IF(COUNTRY_INFO!B17=0,\" \",COUNTRY_INFO!B17)","v":"Brazzaville"},{"$f":"IF(COUNTRY_INFO!C17=0,\" \",COUNTRY_INFO!C17)","v":"Madibou"},{"$f":"IF(OR(COUNTRY_INFO!$U$9:$U$1000=\"T3 (ALB/MBD)\",COUNTRY_INFO!$V$9:$V$1000=\"T3 (ALB/MBD)\"), \"T3 (ALB/MBD)\", \" \")","v":" "},null,null,null,null,null,0,null,null,null,0," "," "," "," "]
[{"$f":"IF(COUNTRY_INFO!A18=0,\" \",COUNTRY_INFO!A18)","v":" Congo"},{"$f":"IF(COUNTRY_INFO!B18=0,\" \",COUNTRY_INFO!B18)","v":"Brazzaville"},{"$f":"IF(COUNTRY_INFO!C18=0,\" \",COUNTRY_INFO!C18)","v":"Makélékélé"},{"$f":"IF(OR(COUNTRY_INFO!$U$9:$U$1000=\"T3 (ALB/MBD)\",COUNTRY_INFO!$V$9:$V$1000=\"T3 (ALB/MBD)\"), \"T3 (ALB/MBD)\", \" \")","v":" "},null,null,null,null,null,0,null,null,null,0," "," "," "," "]
[{"$f":"IF(COUNTRY_INFO!A19=0,\" \",COUNTRY_INFO!A19)","v":" Congo"},{"$f":"IF(COUNTRY_INFO!B19=0,\" \",COUNTRY_INFO!B19)","v":"Brazzaville"},{"$f":"IF(COUNTRY_INFO!C19=0,\" \",COUNTRY_INFO!C19)","v":"Mfilou"},{"$f":"IF(OR(COUNTRY_INFO!$U$9:$U$1000=\"T3 (ALB/MBD)\",COUNTRY_INFO!$V$9:$V$1000=\"T3 (ALB/MBD)\"), \"T3 (ALB/MBD)\", \" \")","v":" "},null,null,null,null,null,0,null,null,null,0," "," "," "," "]
[{"$f":"IF(COUNTRY_INFO!A20=0,\" \",COUNTRY_INFO!A20)","v":" Congo"},{"$f":"IF(COUNTRY_INFO!B20=0,\" \",COUNTRY_INFO!B20)","v":"Brazzaville"},{"$f":"IF(COUNTRY_INFO!C20=0,\" \",COUNTRY_INFO!C20)","v":"Moungali"},{"$f":"IF(OR(COUNTRY_INFO!$U$9:$U$1000=\"T3 (ALB/MBD)\",COUNTRY_INFO!$V$9:$V$1000=\"T3 (ALB/MBD)\"), \"T3 (ALB/MBD)\", \" \")","v":" "},null,null,null,null,null,0,null,null,null,0," "," "," "," "]
[{"$f":"IF(COUNTRY_INFO!A21=0,\" \",COUNTRY_INFO!A21)","v":" Congo"},{"$f":"IF(COUNTRY_INFO!B21=0,\" \",COUNTRY_INFO!B21)","v":"Brazzaville"},{"$f":"IF(COUNTRY_INFO!C21=0,\" \",COUNTRY_INFO!C21)","v":"Ouenzé"},{"$f":"IF(OR(COUNTRY_INFO!$U$9:$U$1000=\"T3 (ALB/MBD)\",COUNTRY_INFO!$V$9:$V$1000=\"T3 (ALB/MBD)\"), \"T3 (ALB/MBD)\", \" \")","v":" "},null,null,null,null,null,0,null,null,null,0," "," "," "," "]
[{"$f":"IF(COUNTRY_INFO!A22=0,\" \",COUNTRY_INFO!A22)","v":" Congo"},{"$f":"IF(COUNTRY_INFO!B22=0,\" \",COUNTRY_INFO!B22)","v":"Brazzaville"},{"$f":"IF(COUNTRY_INFO!C22=0,\" \",COUNTRY_INFO!C22)","v":"Poto-Poto"},{"$f":"IF(OR(COUNTRY_INFO!$U$9:$U$1000=\"T3 (ALB/MBD)\",COUNTRY_INFO!$V$9:$V$1000=\"T3 (ALB/MBD)\"), \"T3 (ALB/MBD)\", \" \")","v":" "},null,null,null,null,null,0,null,null,null,0," "," "," "," ",null," "]
[{"$f":"IF(COUNTRY_INFO!A23=0,\" \",COUNTRY_INFO!A23)","v":" Congo"},{"$f":"IF(COUNTRY_INFO!B23=0,\" \",COUNTRY_INFO!B23)","v":"Brazzaville"},{"$f":"IF(COUNTRY_INFO!C23=0,\" \",COUNTRY_INFO!C23)","v":"Talangaî"},{"$f":"IF(OR(COUNTRY_INFO!$U$9:$U$1000=\"T3 (ALB/MBD)\",COUNTRY_INFO!$V$9:$V$1000=\"T3 (ALB/MBD)\"), \"T3 (ALB/MBD)\", \" \")","v":" "},null,null,null,null,null,0,null,null,null,0," "," "," "," "]
[{"$f":"IF(COUNTRY_INFO!A24=0,\" \",COUNTRY_INFO!A24)","v":" Congo"},{"$f":"IF(COUNTRY_INFO!B24=0,\" \",COUNTRY_INFO!B24)","v":"Cuvette"},{"$f":"IF(COUNTRY_INFO!C24=0,\" \",COUNTRY_INFO!C24)","v":"Mossaka"},{"$f":"IF(OR(COUNTRY_INFO!$U$9:$U$1000=\"T3 (ALB/MBD)\",COUNTRY_INFO!$V$9:$V$1000=\"T3 (ALB/MBD)\"), \"T3 (ALB/MBD)\", \" \")","v":" "},null,null,null,null,null,0,null,null,null,0," "," "," "," ",null," "]
[{"$f":"IF(COUNTRY_INFO!A25=0,\" \",COUNTRY_INFO!A25)","v":" Congo"},{"$f":"IF(COUNTRY_INFO!B25=0,\" \",COUNTRY_INFO!B25)","v":"Cuvette"},{"$f":"IF(COUNTRY_INFO!C25=0,\" \",COUNTRY_INFO!C25)","v":"Owando"},{"$f":"IF(OR(COUNTRY_INFO!$U$9:$U$1000=\"T3 (ALB/MBD)\",COUNTRY_INFO!$V$9:$V$1000=\"T3 (ALB/MBD)\"), \"T3 (ALB/MBD)\", \" \")","v":" "},null,null,null,null,null,0,null,null,null,0," "," "," "," "]
[{"$f":"IF(COUNTRY_INFO!A26=0,\" \",COUNTRY_INFO!A26)","v":" Congo"},{"$f":"IF(COUNTRY_INFO!B26=0,\" \",COUNTRY_INFO!B26)","v":"Cuvette"},{"$f":"IF(COUNTRY_INFO!C26=0,\" \",COUNTRY_INFO!C26)","v":"Oyo-Alima"},{"$f":"IF(OR(COUNTRY_INFO!$U$9:$U$1000=\"T3 (ALB/MBD)\",COUNTRY_INFO!$V$9:$V$1000=\"T3 (ALB/MBD)\"), \"T3 (ALB/MBD)\", \" \")","v":" "},null,null,null,null,null,0,null,null,null,0," "," "," "," "]
[{"$f":"IF(COUNTRY_INFO!A27=0,\" \",COUNTRY_INFO!A27)","v":" Congo"},{"$f":"IF(COUNTRY_INFO!B27=0,\" \",COUNTRY_INFO!B27)","v":"Cuvette-Ouest"},{"$f":"IF(COUNTRY_INFO!C27=0,\" \",COUNTRY_INFO!C27)","v":"Etoumbi"},{"$f":"IF(OR(COUNTRY_INFO!$U$9:$U$1000=\"T3 (ALB/MBD)\",COUNTRY_INFO!$V$9:$V$1000=\"T3 (ALB/MBD)\"), \"T3 (ALB/MBD)\", \" \")","v":" "},null,null,null,null,null,0,null,null,null,0," "," "," "," "]
[{"$f":"IF(COUNTRY_INFO!A28=0,\" \",COUNTRY_INFO!A28)","v":" Congo"},{"$f":"IF(COUNTRY_INFO!B28=0,\" \",COUNTRY_INFO!B28)","v":"Cuvette-Ouest"},{"$f":"IF(COUNTRY_INFO!C28=0,\" \",COUNTRY_INFO!C28)","v":"Ewo"},{"$f":"IF(OR(COUNTRY_INFO!$U$9:$U$1000=\"T3 (ALB/MBD)\",COUNTRY_INFO!$V$9:$V$1000=\"T3 (ALB/MBD)\"), \"T3 (ALB/MBD)\", \" \")","v":" "},null,null,null,null,null,0,null,null,null,0," "," "," "," "]
[{"$f":"IF(COUNTRY_INFO!A29=0,\" \",COUNTRY_INFO!A29)","v":" Congo"},{"$f":"IF(COUNTRY_INFO!B29=0,\" \",COUNTRY_INFO!B29)","v":"Kouilou"},{"$f":"IF(COUNTRY_INFO!C29=0,\" \",COUNTRY_INFO!C29)","v":"Hinda-Loango"},{"$f":"IF(OR(COUNTRY_INFO!$U$9:$U$1000=\"T3 (ALB/MBD)\",COUNTRY_INFO!$V$9:$V$1000=\"T3 (ALB/MBD)\"), \"T3 (ALB/MBD)\", \" \")","v":" "},null,null,null,null,null,0,null,null,null,0," "," "," "," "]
[{"$f":"IF(COUNTRY_INFO!A30=0,\" \",COUNTRY_INFO!A30)","v":" Congo"},{"$f":"IF(COUNTRY_INFO!B30=0,\" \",COUNTRY_INFO!B30)","v":"Kouilou"},{"$f":"IF(COUNTRY_INFO!C30=0,\" \",COUNTRY_INFO!C30)","v":"Madingo Kayes-Nzambi"},{"$f":"IF(OR(COUNTRY_INFO!$U$9:$U$1000=\"T3 (ALB/MBD)\",COUNTRY_INFO!$V$9:$V$1000=\"T3 (ALB/MBD)\"), \"T3 (ALB/MBD)\", \" \")","v":" "},null,null,null,null,null,0,null,null,null,0," "," "," "," "]
[{"$f":"IF(COUNTRY_INFO!A31=0,\" \",COUNTRY_INFO!A31)","v":" Congo"},{"$f":"IF(COUNTRY_INFO!B31=0,\" \",COUNTRY_INFO!B31)","v":"Kouilou"},{"$f":"IF(COUNTRY_INFO!C31=0,\" \",COUNTRY_INFO!C31)","v":"Mvouti-Kakamouéka"},{"$f":"IF(OR(COUNTRY_INFO!$U$9:$U$1000=\"T3 (ALB/MBD)\",COUNTRY_INFO!$V$9:$V$1000=\"T3 (ALB/MBD)\"), \"T3 (ALB/MBD)\", \" \")","v":" "},null,null,null,null,null,0,null,null,null,0," "," "," "," "]
[{"$f":"IF(COUNTRY_INFO!A32=0,\" \",COUNTRY_INFO!A32)","v":" Congo"},{"$f":"IF(COUNTRY_INFO!B32=0,\" \",COUNTRY_INFO!B32)","v":"Lékoumou"},{"$f":"IF(COUNTRY_INFO!C32=0,\" \",COUNTRY_INFO!C32)","v":"Sibiti"},{"$f":"IF(OR(COUNTRY_INFO!$U$9:$U$1000=\"T3 (ALB/MBD)\",COUNTRY_INFO!$V$9:$V$1000=\"T3 (ALB/MBD)\"), \"T3 (ALB/MBD)\", \" \")","v":" "},null,null,null,null,null,0,null,null,null,0," "," "," "," "]
[{"$f":"IF(COUNTRY_INFO!A33=0,\" \",COUNTRY_INFO!A33)","v":" Congo"},{"$f":"IF(COUNTRY_INFO!B33=0,\" \",COUNTRY_INFO!B33)","v":"Lékoumou"},{"$f":"IF(COUNTRY_INFO!C33=0,\" \",COUNTRY_INFO!C33)","v":"Zanaga"},{"$f":"IF(OR(COUNTRY_INFO!$U$9:$U$1000=\"T3 (ALB/MBD)\",COUNTRY_INFO!$V$9:$V$1000=\"T3 (ALB/MBD)\"), \"T3 (ALB/MBD)\", \" \")","v":" "},null,null,null,null,null,0,null,null,null,0," "," "," "," "]
[{"$f":"IF(COUNTRY_INFO!A34=0,\" \",COUNTRY_INFO!A34)","v":" Congo"},{"$f":"IF(COUNTRY_INFO!B34=0,\" \",COUNTRY_INFO!B34)","v":"Likouala"},{"$f":"IF(COUNTRY_INFO!C34=0,\" \",COUNTRY_INFO!C34)","v":"Bétou"},{"$f":"IF(OR(COUNTRY_INFO!$U$9:$U$1000=\"T3 (ALB/MBD)\",COUNTRY_INFO!$V$9:$V$1000=\"T3 (ALB/MBD)\"), \"T3 (ALB/MBD)\", \" \")","v":" "},null,null,null,null,null,0,null,null,null,0," "," "," "," "]
[{"$f":"IF(COUNTRY_INFO!A35=0,\" \",COUNTRY_INFO!A35)","v":" Congo"},{"$f":"IF(COUNTRY_INFO!B35=0,\" \",COUNTRY_INFO!B35)","v":"Likouala"},{"$f":"IF(COUNTRY_INFO!C35=0,\" \",COUNTRY_INFO!C35)","v":"Impfondo"},{"$f":"IF(OR(COUNTRY_INFO!$U$9:$U$1000=\"T3 (ALB/MBD)\",COUNTRY_INFO!$V$9:$V$1000=\"T3 (ALB/MBD)\"), \"T3 (ALB/MBD)\", \" \")","v":" "},null,null,null,null,null,0,null,null,null,0," "," "," "," "]
[{"$f":"IF(COUNTRY_INFO!A36=0,\" \",COUNTRY_INFO!A36)","v":" Congo"},{"$f":"IF(COUNTRY_INFO!B36=0,\" \",COUNTRY_INFO!B36)","v":"Niari"},{"$f":"IF(COUNTRY_INFO!C36=0,\" \",COUNTRY_INFO!C36)","v":"Dolisie"},{"$f":"IF(OR(COUNTRY_INFO!$U$9:$U$1000=\"T3 (ALB/MBD)\",COUNTRY_INFO!$V$9:$V$1000=\"T3 (ALB/MBD)\"), \"T3 (ALB/MBD)\", \" \")","v":" "},null,null,null,null,null,0,null,null,null,0," "," "," "," "]
[{"$f":"IF(COUNTRY_INFO!A37=0,\" \",COUNTRY_INFO!A37)","v":" Congo"},{"$f":"IF(COUNTRY_INFO!B37=0,\" \",COUNTRY_INFO!B37)","v":"Niari"},{"$f":"IF(COUNTRY_INFO!C37=0,\" \",COUNTRY_INFO!C37)","v":"Kibangou"},{"$f":"IF(OR(COUNTRY_INFO!$U$9:$U$1000=\"T3 (ALB/MBD)\",COUNTRY_INFO!$V$9:$V$1000=\"T3 (ALB/MBD)\"), \"T3 (ALB/MBD)\", \" \")","v":" "},null,null,null,null,null,0,null,null,null,0," "," "," "," "]
[{"$f":"IF(COUNTRY_INFO!A38=0,\" \",COUNTRY_INFO!A38)","v":" Congo"},{"$f":"IF(COUNTRY_INFO!B38=0,\" \",COUNTRY_INFO!B38)","v":"Niari"},{"$f":"IF(COUNTRY_INFO!C38=0,\" \",COUNTRY_INFO!C38)","v":"Kimongo-Londela Nkayes"},{"$f":"IF(OR(COUNTRY_INFO!$U$9:$U$1000=\"T3 (ALB/MBD)\",COUNTRY_INFO!$V$9:$V$1000=\"T3 (ALB/MBD)\"), \"T3 (ALB/MBD)\", \" \")","v":" "},null,null,null,null,null,0,null,null,null,0," "," "," "," "," "]
[{"$f":"IF(COUNTRY_INFO!A39=0,\" \",COUNTRY_INFO!A39)","v":" Congo"},{"$f":"IF(COUNTRY_INFO!B39=0,\" \",COUNTRY_INFO!B39)","v":"Niari"},{"$f":"IF(COUNTRY_INFO!C39=0,\" \",COUNTRY_INFO!C39)","v":"Mayoko"},{"$f":"IF(OR(COUNTRY_INFO!$U$9:$U$1000=\"T3 (ALB/MBD)\",COUNTRY_INFO!$V$9:$V$1000=\"T3 (ALB/MBD)\"), \"T3 (ALB/MBD)\", \" \")","v":" "},null,null,null,null,null,0,null,null,null,0," "," "," "," "]
[{"$f":"IF(COUNTRY_INFO!A40=0,\" \",COUNTRY_INFO!A40)","v":" Congo"},{"$f":"IF(COUNTRY_INFO!B40=0,\" \",COUNTRY_INFO!B40)","v":"Niari"},{"$f":"IF(COUNTRY_INFO!C40=0,\" \",COUNTRY_INFO!C40)","v":"Mossendjo"},{"$f":"IF(OR(COUNTRY_INFO!$U$9:$U$1000=\"T3 (ALB/MBD)\",COUNTRY_INFO!$V$9:$V$1000=\"T3 (ALB/MBD)\"), \"T3 (ALB/MBD)\", \" \")","v":" "},null,null,null,null,null,0,null,null,null,0," "," "," "," "]
[{"$f":"IF(COUNTRY_INFO!A41=0,\" \",COUNTRY_INFO!A41)","v":" Congo"},{"$f":"IF(COUNTRY_INFO!B41=0,\" \",COUNTRY_INFO!B41)","v":"Plateaux"},{"$f":"IF(COUNTRY_INFO!C41=0,\" \",COUNTRY_INFO!C41)","v":"Abala"},{"$f":"IF(OR(COUNTRY_INFO!$U$9:$U$1000=\"T3 (ALB/MBD)\",COUNTRY_INFO!$V$9:$V$1000=\"T3 (ALB/MBD)\"), \"T3 (ALB/MBD)\", \" \")","v":" "},null,null,null,null,null,0,null,null,null,0," "," "," "," "," "]
[{"$f":"IF(COUNTRY_INFO!A42=0,\" \",COUNTRY_INFO!A42)","v":" Congo"},{"$f":"IF(COUNTRY_INFO!B42=0,\" \",COUNTRY_INFO!B42)","v":"Plateaux"},{"$f":"IF(COUNTRY_INFO!C42=0,\" \",COUNTRY_INFO!C42)","v":"Djambala-Lékana"},{"$f":"IF(OR(COUNTRY_INFO!$U$9:$U$1000=\"T3 (ALB/MBD)\",COUNTRY_INFO!$V$9:$V$1000=\"T3 (ALB/MBD)\"), \"T3 (ALB/MBD)\", \" \")","v":" "},null,null,null,null,null,0,null,null,null,0," "," "," "," "]
[{"$f":"IF(COUNTRY_INFO!A43=0,\" \",COUNTRY_INFO!A43)","v":" Congo"},{"$f":"IF(COUNTRY_INFO!B43=0,\" \",COUNTRY_INFO!B43)","v":"Plateaux"},{"$f":"IF(COUNTRY_INFO!C43=0,\" \",COUNTRY_INFO!C43)","v":"Gamboma"},{"$f":"IF(OR(COUNTRY_INFO!$U$9:$U$1000=\"T3 (ALB/MBD)\",COUNTRY_INFO!$V$9:$V$1000=\"T3 (ALB/MBD)\"), \"T3 (ALB/MBD)\", \" \")","v":" "},null,null,null,null,null,0,null,null,null,0," "," "," "," "]
[{"$f":"IF(COUNTRY_INFO!A44=0,\" \",COUNTRY_INFO!A44)","v":" Congo"},{"$f":"IF(COUNTRY_INFO!B44=0,\" \",COUNTRY_INFO!B44)","v":"Plateaux"},{"$f":"IF(COUNTRY_INFO!C44=0,\" \",COUNTRY_INFO!C44)","v":"Ngo Mpouya"},{"$f":"IF(OR(COUNTRY_INFO!$U$9:$U$1000=\"T3 (ALB/MBD)\",COUNTRY_INFO!$V$9:$V$1000=\"T3 (ALB/MBD)\"), \"T3 (ALB/MBD)\", \" \")","v":" "},null,null,null,null,null,0,null,null,null,0," "," "," "," "]
[{"$f":"IF(COUNTRY_INFO!A45=0,\" \",COUNTRY_INFO!A45)","v":" Congo"},{"$f":"IF(COUNTRY_INFO!B45=0,\" \",COUNTRY_INFO!B45)","v":"Pointe-Noire"},{"$f":"IF(COUNTRY_INFO!C45=0,\" \",COUNTRY_INFO!C45)","v":"Loandjili"},{"$f":"IF(OR(COUNTRY_INFO!$U$9:$U$1000=\"T3 (ALB/MBD)\",COUNTRY_INFO!$V$9:$V$1000=\"T3 (ALB/MBD)\"), \"T3 (ALB/MBD)\", \" \")","v":" "},null,null,null,null,null,0,null,null,null,0," "," "," "," "]
[{"$f":"IF(COUNTRY_INFO!A46=0,\" \",COUNTRY_INFO!A46)","v":" Congo"},{"$f":"IF(COUNTRY_INFO!B46=0,\" \",COUNTRY_INFO!B46)","v":"Pointe-Noire"},{"$f":"IF(COUNTRY_INFO!C46=0,\" \",COUNTRY_INFO!C46)","v":"Lumumba"},{"$f":"IF(OR(COUNTRY_INFO!$U$9:$U$1000=\"T3 (ALB/MBD)\",COUNTRY_INFO!$V$9:$V$1000=\"T3 (ALB/MBD)\"), \"T3 (ALB/MBD)\", \" \")","v":" "},null,null,null,null,null,0,null,null,null,0," "," "," "," ",null," "]
[{"$f":"IF(COUNTRY_INFO!A47=0,\" \",COUNTRY_INFO!A47)","v":" Congo"},{"$f":"IF(COUNTRY_INFO!B47=0,\" \",COUNTRY_INFO!B47)","v":"Pointe-Noire"},{"$f":"IF(COUNTRY_INFO!C47=0,\" \",COUNTRY_INFO!C47)","v":"Mongo-Poukou"},{"$f":"IF(OR(COUNTRY_INFO!$U$9:$U$1000=\"T3 (ALB/MBD)\",COUNTRY_INFO!$V$9:$V$1000=\"T3 (ALB/MBD)\"), \"T3 (ALB/MBD)\", \" \")","v":" "},null,null,null,null,null,0,null,null,null,0," "," "," "," "]
[{"$f":"IF(COUNTRY_INFO!A48=0,\" \",COUNTRY_INFO!A48)","v":" Congo"},{"$f":"IF(COUNTRY_INFO!B48=0,\" \",COUNTRY_INFO!B48)","v":"Pointe-Noire"},{"$f":"IF(COUNTRY_INFO!C48=0,\" \",COUNTRY_INFO!C48)","v":"Mvoumvou"},{"$f":"IF(OR(COUNTRY_INFO!$U$9:$U$1000=\"T3 (ALB/MBD)\",COUNTRY_INFO!$V$9:$V$1000=\"T3 (ALB/MBD)\"), \"T3 (ALB/MBD)\", \" \")","v":" "},null,null,null,null,null,0,null,null,null,0," "," "," "," "]
[{"$f":"IF(COUNTRY_INFO!A49=0,\" \",COUNTRY_INFO!A49)","v":" Congo"},{"$f":"IF(COUNTRY_INFO!B49=0,\" \",COUNTRY_INFO!B49)","v":"Pointe-Noire"},{"$f":"IF(COUNTRY_INFO!C49=0,\" \",COUNTRY_INFO!C49)","v":"Ngoyo"},{"$f":"IF(OR(COUNTRY_INFO!$U$9:$U$1000=\"T3 (ALB/MBD)\",COUNTRY_INFO!$V$9:$V$1000=\"T3 (ALB/MBD)\"), \"T3 (ALB/MBD)\", \" \")","v":" "},null,null,null,null,null,0,null,null,null,0," "," "," "," "]
[{"$f":"IF(COUNTRY_INFO!A50=0,\" \",COUNTRY_INFO!A50)","v":" Congo"},{"$f":"IF(COUNTRY_INFO!B50=0,\" \",COUNTRY_INFO!B50)","v":"Pointe-Noire"},{"$f":"IF(COUNTRY_INFO!C50=0,\" \",COUNTRY_INFO!C50)","v":"Tchiamba Nzassi"},{"$f":"IF(OR(COUNTRY_INFO!$U$9:$U$1000=\"T3 (ALB/MBD)\",COUNTRY_INFO!$V$9:$V$1000=\"T3 (ALB/MBD)\"), \"T3 (ALB/MBD)\", \" \")","v":" "},null,null,null,null,null,0,null,null,null,0," "," "," "," "]
[{"$f":"IF(COUNTRY_INFO!A51=0,\" \",COUNTRY_INFO!A51)","v":" Congo"},{"$f":"IF(COUNTRY_INFO!B51=0,\" \",COUNTRY_INFO!B51)","v":"Pointe-Noire"},{"$f":"IF(COUNTRY_INFO!C51=0,\" \",COUNTRY_INFO!C51)","v":"Tie-Tie"},{"$f":"IF(OR(COUNTRY_INFO!$U$9:$U$1000=\"T3 (ALB/MBD)\",COUNTRY_INFO!$V$9:$V$1000=\"T3 (ALB/MBD)\"), \"T3 (ALB/MBD)\", \" \")","v":" "},null,null,null,null,null,0,null,null,null,0," "," "," "," "]
[{"$f":"IF(COUNTRY_INFO!A52=0,\" \",COUNTRY_INFO!A52)","v":" Congo"},{"$f":"IF(COUNTRY_INFO!B52=0,\" \",COUNTRY_INFO!B52)","v":"Pool"},{"$f":"IF(COUNTRY_INFO!C52=0,\" \",COUNTRY_INFO!C52)","v":"Boko"},{"$f":"IF(OR(COUNTRY_INFO!$U$9:$U$1000=\"T3 (ALB/MBD)\",COUNTRY_INFO!$V$9:$V$1000=\"T3 (ALB/MBD)\"), \"T3 (ALB/MBD)\", \" \")","v":" "},null,null,null,null,null,0,null,null,null,0," "," "," "," "]
[{"$f":"IF(COUNTRY_INFO!A53=0,\" \",COUNTRY_INFO!A53)","v":" Congo"},{"$f":"IF(COUNTRY_INFO!B53=0,\" \",COUNTRY_INFO!B53)","v":"Pool"},{"$f":"IF(COUNTRY_INFO!C53=0,\" \",COUNTRY_INFO!C53)","v":"Goma tsétsé"},{"$f":"IF(OR(COUNTRY_INFO!$U$9:$U$1000=\"T3 (ALB/MBD)\",COUNTRY_INFO!$V$9:$V$1000=\"T3 (ALB/MBD)\"), \"T3 (ALB/MBD)\", \" \")","v":" "},null,null,null,null,null,0,null,null,null,0," "," "," "," "]
[{"$f":"IF(COUNTRY_INFO!A54=0,\" \",COUNTRY_INFO!A54)","v":" Congo"},{"$f":"IF(COUNTRY_INFO!B54=0,\" \",COUNTRY_INFO!B54)","v":"Pool"},{"$f":"IF(COUNTRY_INFO!C54=0,\" \",COUNTRY_INFO!C54)","v":"Ignié"},{"$f":"IF(OR(COUNTRY_INFO!$U$9:$U$1000=\"T3 (ALB/MBD)\",COUNTRY_INFO!$V$9:$V$1000=\"T3 (ALB/MBD)\"), \"T3 (ALB/MBD)\", \" \")","v":" "},null,null,null,null,null,0,null,null,null,0," "," "," "," "]
[{"$f":"IF(COUNTRY_INFO!A55=0,\" \",COUNTRY_INFO!A55)","v":" Congo"},{"$f":"IF(COUNTRY_INFO!B55=0,\" \",COUNTRY_INFO!B55)","v":"Pool"},{"$f":"IF(COUNTRY_INFO!C55=0,\" \",COUNTRY_INFO!C55)","v":"Kindamba"},{"$f":"IF(OR(COUNTRY_INFO!$U$9:$U$1000=\"T3 (ALB/MBD)\",COUNTRY_INFO!$V$9:$V$1000=\"T3 (ALB/MBD)\"), \"T3 (ALB/MBD)\", \" \")","v":" "},null,null,null,null,null,0,null,null,null,0," "," "," "," "]
[{"$f":"IF(COUNTRY_INFO!A56=0,\" \",COUNTRY_INFO!A56)","v":" Congo"},{"$f":"IF(COUNTRY_INFO!B56=0,\" \",COUNTRY_INFO!B56)","v":"Pool"},{"$f":"IF(COUNTRY_INFO!C56=0,\" \",COUNTRY_INFO!C56)","v":"Kinkala"},{"$f":"IF(OR(COUNTRY_INFO!$U$9:$U$1000=\"T3 (ALB/MBD)\",COUNTRY_INFO!$V$9:$V$1000=\"T3 (ALB/MBD)\"), \"T3 (ALB/MBD)\", \" \")","v":" "},null,null,null,null,null,0,null,null,null,0," "," "," "," "]
[{"$f":"IF(COUNTRY_INFO!A57=0,\" \",COUNTRY_INFO!A57)","v":" Congo"},{"$f":"IF(COUNTRY_INFO!B57=0,\" \",COUNTRY_INFO!B57)","v":"Pool"},{"$f":"IF(COUNTRY_INFO!C57=0,\" \",COUNTRY_INFO!C57)","v":"Kintélé"},{"$f":"IF(OR(COUNTRY_INFO!$U$9:$U$1000=\"T3 (ALB/MBD)\",COUNTRY_INFO!$V$9:$V$1000=\"T3 (ALB/MBD)\"), \"T3 (ALB/MBD)\", \" \")","v":" "},null,null,null,null,null,0,null,null,null,0," "," "," "," "]
[{"$f":"IF(COUNTRY_INFO!A58=0,\" \",COUNTRY_INFO!A58)","v":" Congo"},{"$f":"IF(COUNTRY_INFO!B58=0,\" \",COUNTRY_INFO!B58)","v":"Pool"},{"$f":"IF(COUNTRY_INFO!C58=0,\" \",COUNTRY_INFO!C58)","v":"Mindouli"},{"$f":"IF(OR(COUNTRY_INFO!$U$9:$U$1000=\"T3 (ALB/MBD)\",COUNTRY_INFO!$V$9:$V$1000=\"T3 (ALB/MBD)\"), \"T3 (ALB/MBD)\", \" \")","v":" "},null,null,null,null,null,0,null,null,null,0," "," "," "," "]
[{"$f":"IF(COUNTRY_INFO!A59=0,\" \",COUNTRY_INFO!A59)","v":" Congo"},{"$f":"IF(COUNTRY_INFO!B59=0,\" \",COUNTRY_INFO!B59)","v":"Sangha"},{"$f":"IF(COUNTRY_INFO!C59=0,\" \",COUNTRY_INFO!C59)","v":"Ouesso"},{"$f":"IF(OR(COUNTRY_INFO!$U$9:$U$1000=\"T3 (ALB/MBD)\",COUNTRY_INFO!$V$9:$V$1000=\"T3 (ALB/MBD)\"), \"T3 (ALB/MBD)\", \" \")","v":" "},null,null,null,null,null,0,null,null,null,0," "," "," "," "]
[{"$f":"IF(COUNTRY_INFO!A60=0,\" \",COUNTRY_INFO!A60)","v":" Congo"},{"$f":"IF(COUNTRY_INFO!B60=0,\" \",COUNTRY_INFO!B60)","v":"Sangha"},{"$f":"IF(COUNTRY_INFO!C60=0,\" \",COUNTRY_INFO!C60)","v":"Sembé-Souanké"},{"$f":"IF(OR(COUNTRY_INFO!$U$9:$U$1000=\"T3 (ALB/MBD)\",COUNTRY_INFO!$V$9:$V$1000=\"T3 (ALB/MBD)\"), \"T3 (ALB/MBD)\", \" \")","v":" "},null,null,null,null,null,0,null,null,null,0," "," "," "," "]

{"sheet":"T3_R2","index":8,"n_rows":60,"n_cols":18,"rows_kept":60,"cut":false,"hidden":false,"merged":[[5,6,5,9],[5,10,5,13],[5,14,5,17],[3,0,3,2],[5,0,5,2],[5,3,6,3],[5,5,6,5],[5,4,6,4]]}
["T 3 - Albendazole (ALB) ou Mebendazole (MBD) - Tournée 2"]
["Structure administrative, population nécessitant une chimioprévention par groupe d'âge, population traitée par groupe d'âge et couverture"]
[]
["TOTAL",null,null,null,null,null,{"$f":"SUM(G$9:G$1000)","v":0},0,0,0,0,0,0,0,{"$f":"IF(G4<>0, IF(K4/G4*100=0, \"-\", K4/G4*100), \" \")","v":" "},{"$f":"IF(H4<>0, IF(L4/H4*100=0, \"-\", L4/H4*100), \" \")","v":" "},{"$f":"IF(I4<>0, IF(M4/I4*100=0, \"-\", M4/I4*100), \" \")","v":" "},{"$f":"IF(J4<>0, IF(N4/J4*100=0, \"-\", N4/J4*100), \" \")","v":" "}]
[]
["Structure administrative du pays",null,null,"Mise en oeuvre \nde la CP","Médica-ment","Date","Population ciblée pour T3",null,null,null,"Population traitée",null,null,null,"Couverture du Programme (%)"]
["Pays","Région/Département","District",null,null,null,"EAPréS","EAS","Adultes","Total","EAPréS","EAS","Adultes","Total","EAPréS","EAS","Adultes","Total"]
[]
[{"$f":"IF(COUNTRY_INFO!A9=0,\" \",COUNTRY_INFO!A9)","v":" Congo"},{"$f":"IF(COUNTRY_INFO!B9=0,\" \",COUNTRY_INFO!B9)","v":"Bouenza"},{"$f":"IF(COUNTRY_INFO!C9=0,\" \",COUNTRY_INFO!C9)","v":"Loudima"},{"$f":"IF(AND(COUNTRY_INFO!$U$9:$U$1000=\"T3 (ALB/MBD)\",COUNTRY_INFO!$V$9:$V$1000=\"T3 (ALB/MBD)\"), \"T3 (ALB/MBD)\", \" \")","v":" "},null,null,null,null,null,{"$f":"SUM(G9:I9)","v":0},null,null,null,{"$f":"SUM(K9:M9)","v":0},{"$f":"IF(G9<>0, IF(K9/G9*100=0, \"-\", K9/G9*100), \" \")","v":" "}," "," "," "]
[{"$f":"IF(COUNTRY_INFO!A10=0,\" \",COUNTRY_INFO!A10)","v":" Congo"},{"$f":"IF(COUNTRY_INFO!B10=0,\" \",COUNTRY_INFO!B10)","v":"Bouenza"},{"$f":"IF(COUNTRY_INFO!C10=0,\" \",COUNTRY_INFO!C10)","v":"Loutété"},{"$f":"IF(AND(COUNTRY_INFO!$U$9:$U$1000=\"T3 (ALB/MBD)\",COUNTRY_INFO!$V$9:$V$1000=\"T3 (ALB/MBD)\"), \"T3 (ALB/MBD)\", \" \")","v":" "},null,null,null,null,null,{"$f":"SUM(G10:I10)","v":0},null,null,null,{"$f":"SUM(K10:M10)","v":0},{"$f":"IF(G10<>0, IF(K10/G10*100=0, \"-\", K10/G10*100), \" \")","v":" "},{"$f":"IF(H10<>0, IF(L10/H10*100=0, \"-\", L10/H10*100), \" \")","v":" "},{"$f":"IF(I10<>0, IF(M10/I10*100=0, \"-\", M10/I10*100), \" \")","v":" "},{"$f":"IF(J10<>0, IF(N10/J10*100=0, \"-\", N10/J10*100), \" \")","v":" "}]
[{"$f":"IF(COUNTRY_INFO!A11=0,\" \",COUNTRY_INFO!A11)","v":" Congo"},{"$f":"IF(COUNTRY_INFO!B11=0,\" \",COUNTRY_INFO!B11)","v":"Bouenza"},{"$f":"IF(COUNTRY_INFO!C11=0,\" \",COUNTRY_INFO!C11)","v":"Madingou"},{"$f":"IF(AND(COUNTRY_INFO!$U$9:$U$1000=\"T3 (ALB/MBD)\",COUNTRY_INFO!$V$9:$V$1000=\"T3 (ALB/MBD)\"), \"T3 (ALB/MBD)\", \" \")","v":" "},null,null,null,null,null,0,null,null,null,0," "," "," "," "]
[{"$f":"IF(COUNTRY_INFO!A12=0,\" \",COUNTRY_INFO!A12)","v":" Congo"},{"$f":"IF(COUNTRY_INFO!B12=0,\" \",COUNTRY_INFO!B12)","v":"Bouenza"},{"$f":"IF(COUNTRY_INFO!C12=0,\" \",COUNTRY_INFO!C12)","v":"Mouyondzi"},{"$f":"IF(AND(COUNTRY_INFO!$U$9:$U$1000=\"T3 (ALB/MBD)\",COUNTRY_INFO!$V$9:$V$1000=\"T3 (ALB/MBD)\"), \"T3 (ALB/MBD)\", \" \")","v":" "},null,null,null,null,null,0,null,null,null,0," "," "," "," "]
[{"$f":"IF(COUNTRY_INFO!A13=0,\" \",COUNTRY_INFO!A13)","v":" Congo"},{"$f":"IF(COUNTRY_INFO!B13=0,\" \",COUNTRY_INFO!B13)","v":"Bouenza"},{"$f":"IF(COUNTRY_INFO!C13=0,\" \",COUNTRY_INFO!C13)","v":"Nkayi"},{"$f":"IF(AND(COUNTRY_INFO!$U$9:$U$1000=\"T3 (ALB/MBD)\",COUNTRY_INFO!$V$9:$V$1000=\"T3 (ALB/MBD)\"), \"T3 (ALB/MBD)\", \" \")","v":" "},null,null,null,null,null,0,null,null,null,0," "," "," "," "]
[{"$f":"IF(COUNTRY_INFO!A14=0,\" \",COUNTRY_INFO!A14)","v":" Congo"},{"$f":"IF(COUNTRY_INFO!B14=0,\" \",COUNTRY_INFO!B14)","v":"Brazzaville"},{"$f":"IF(COUNTRY_INFO!C14=0,\" \",COUNTRY_INFO!C14)","v":"Bacongo"},{"$f":"IF(AND(COUNTRY_INFO!$U$9:$U$1000=\"T3 (ALB/MBD)\",COUNTRY_INFO!$V$9:$V$1000=\"T3 (ALB/MBD)\"), \"T3 (ALB/MBD)\", \" \")","v":" "},null,null,null,null,null,0,null,null,null,0," "," "," "," "]
[{"$f":"IF(COUNTRY_INFO!A15=0,\" \",COUNTRY_INFO!A15)","v":" Congo"},{"$f":"IF(COUNTRY_INFO!B15=0,\" \",COUNTRY_INFO!B15)","v":"Brazzaville"},{"$f":"IF(COUNTRY_INFO!C15=0,\" \",COUNTRY_INFO!C15)","v":"Djiri"},{"$f":"IF(AND(COUNTRY_INFO!$U$9:$U$1000=\"T3 (ALB/MBD)\",COUNTRY_INFO!$V$9:$V$1000=\"T3 (ALB/MBD)\"), \"T3 (ALB/MBD)\", \" \")","v":" "},null,null,null,null,null,0,null,null,null,0," "," "," "," "]
[{"$f":"IF(COUNTRY_INFO!A16=0,\" \",COUNTRY_INFO!A16)","v":" Congo"},{"$f":"IF(COUNTRY_INFO!B16=0,\" \",COUNTRY_INFO!B16)","v":"Brazzaville"},{"$f":"IF(COUNTRY_INFO!C16=0,\" \",COUNTRY_INFO!C16)","v":"Île Mbamou"},{"$f":"IF(AND(COUNTRY_INFO!$U$9:$U$1000=\"T3 (ALB/MBD)\",COUNTRY_INFO!$V$9:$V$1000=\"T3 (ALB/MBD)\"), \"T3 (ALB/MBD)\", \" \")","v":" "},null,null,null,null,null,0,null,null,null,0," "," "," "," "]
[{"$f":"IF(COUNTRY_INFO!A17=0,\" \",COUNTRY_INFO!A17)","v":" Congo"},{"$f":"IF(COUNTRY_INFO!B17=0,\" \",COUNTRY_INFO!B17)","v":"Brazzaville"},{"$f":"IF(COUNTRY_INFO!C17=0,\" \",COUNTRY_INFO!C17)","v":"Madibou"},{"$f":"IF(AND(COUNTRY_INFO!$U$9:$U$1000=\"T3 (ALB/MBD)\",COUNTRY_INFO!$V$9:$V$1000=\"T3 (ALB/MBD)\"), \"T3 (ALB/MBD)\", \" \")","v":" "},null,null,null,null,null,0,null,null,null,0," "," "," "," "]
[{"$f":"IF(COUNTRY_INFO!A18=0,\" \",COUNTRY_INFO!A18)","v":" Congo"},{"$f":"IF(COUNTRY_INFO!B18=0,\" \",COUNTRY_INFO!B18)","v":"Brazzaville"},{"$f":"IF(COUNTRY_INFO!C18=0,\" \",COUNTRY_INFO!C18)","v":"Makélékélé"},{"$f":"IF(AND(COUNTRY_INFO!$U$9:$U$1000=\"T3 (ALB/MBD)\",COUNTRY_INFO!$V$9:$V$1000=\"T3 (ALB/MBD)\"), \"T3 (ALB/MBD)\", \" \")","v":" "},null,null,null,null,null,0,null,null,null,0," "," "," "," "]
[{"$f":"IF(COUNTRY_INFO!A19=0,\" \",COUNTRY_INFO!A19)","v":" Congo"},{"$f":"IF(COUNTRY_INFO!B19=0,\" \",COUNTRY_INFO!B19)","v":"Brazzaville"},{"$f":"IF(COUNTRY_INFO!C19=0,\" \",COUNTRY_INFO!C19)","v":"Mfilou"},{"$f":"IF(AND(COUNTRY_INFO!$U$9:$U$1000=\"T3 (ALB/MBD)\",COUNTRY_INFO!$V$9:$V$1000=\"T3 (ALB/MBD)\"), \"T3 (ALB/MBD)\", \" \")","v":" "},null,null,null,null,null,0,null,null,null,0," "," "," "," "]
[{"$f":"IF(COUNTRY_INFO!A20=0,\" \",COUNTRY_INFO!A20)","v":" Congo"},{"$f":"IF(COUNTRY_INFO!B20=0,\" \",COUNTRY_INFO!B20)","v":"Brazzaville"},{"$f":"IF(COUNTRY_INFO!C20=0,\" \",COUNTRY_INFO!C20)","v":"Moungali"},{"$f":"IF(AND(COUNTRY_INFO!$U$9:$U$1000=\"T3 (ALB/MBD)\",COUNTRY_INFO!$V$9:$V$1000=\"T3 (ALB/MBD)\"), \"T3 (ALB/MBD)\", \" \")","v":" "},null,null,null,null,null,0,null,null,null,0," "," "," "," "]
[{"$f":"IF(COUNTRY_INFO!A21=0,\" \",COUNTRY_INFO!A21)","v":" Congo"},{"$f":"IF(COUNTRY_INFO!B21=0,\" \",COUNTRY_INFO!B21)","v":"Brazzaville"},{"$f":"IF(COUNTRY_INFO!C21=0,\" \",COUNTRY_INFO!C21)","v":"Ouenzé"},{"$f":"IF(AND(COUNTRY_INFO!$U$9:$U$1000=\"T3 (ALB/MBD)\",COUNTRY_INFO!$V$9:$V$1000=\"T3 (ALB/MBD)\"), \"T3 (ALB/MBD)\", \" \")","v":" "},null,null,null,null,null,0,null,null,null,0," "," "," "," "]
[{"$f":"IF(COUNTRY_INFO!A22=0,\" \",COUNTRY_INFO!A22)","v":" Congo"},{"$f":"IF(COUNTRY_INFO!B22=0,\" \",COUNTRY_INFO!B22)","v":"Brazzaville"},{"$f":"IF(COUNTRY_INFO!C22=0,\" \",COUNTRY_INFO!C22)","v":"Poto-Poto"},{"$f":"IF(AND(COUNTRY_INFO!$U$9:$U$1000=\"T3 (ALB/MBD)\",COUNTRY_INFO!$V$9:$V$1000=\"T3 (ALB/MBD)\"), \"T3 (ALB/MBD)\", \" \")","v":" "},null,null,null,null,null,0,null,null,null,0," "," "," "," "]
[{"$f":"IF(COUNTRY_INFO!A23=0,\" \",COUNTRY_INFO!A23)","v":" Congo"},{"$f":"IF(COUNTRY_INFO!B23=0,\" \",COUNTRY_INFO!B23)","v":"Brazzaville"},{"$f":"IF(COUNTRY_INFO!C23=0,\" \",COUNTRY_INFO!C23)","v":"Talangaî"},{"$f":"IF(AND(COUNTRY_INFO!$U$9:$U$1000=\"T3 (ALB/MBD)\",COUNTRY_INFO!$V$9:$V$1000=\"T3 (ALB/MBD)\"), \"T3 (ALB/MBD)\", \" \")","v":" "},null,null,null,null,null,0,null,null,null,0," "," "," "," "]
[{"$f":"IF(COUNTRY_INFO!A24=0,\" \",COUNTRY_INFO!A24)","v":" Congo"},{"$f":"IF(COUNTRY_INFO!B24=0,\" \",COUNTRY_INFO!B24)","v":"Cuvette"},{"$f":"IF(COUNTRY_INFO!C24=0,\" \",COUNTRY_INFO!C24)","v":"Mossaka"},{"$f":"IF(AND(COUNTRY_INFO!$U$9:$U$1000=\"T3 (ALB/MBD)\",COUNTRY_INFO!$V$9:$V$1000=\"T3 (ALB/MBD)\"), \"T3 (ALB/MBD)\", \" \")","v":" "},null,null,null,null,null,0,null,null,null,0," "," "," "," "]
[{"$f":"IF(COUNTRY_INFO!A25=0,\" \",COUNTRY_INFO!A25)","v":" Congo"},{"$f":"IF(COUNTRY_INFO!B25=0,\" \",COUNTRY_INFO!B25)","v":"Cuvette"},{"$f":"IF(COUNTRY_INFO!C25=0,\" \",COUNTRY_INFO!C25)","v":"Owando"},{"$f":"IF(AND(COUNTRY_INFO!$U$9:$U$1000=\"T3 (ALB/MBD)\",COUNTRY_INFO!$V$9:$V$1000=\"T3 (ALB/MBD)\"), \"T3 (ALB/MBD)\", \" \")","v":" "},null,null,null,null,null,0,null,null,null,0," "," "," "," "]
[{"$f":"IF(COUNTRY_INFO!A26=0,\" \",COUNTRY_INFO!A26)","v":" Congo"},{"$f":"IF(COUNTRY_INFO!B26=0,\" \",COUNTRY_INFO!B26)","v":"Cuvette"},{"$f":"IF(COUNTRY_INFO!C26=0,\" \",COUNTRY_INFO!C26)","v":"Oyo-Alima"},{"$f":"IF(AND(COUNTRY_INFO!$U$9:$U$1000=\"T3 (ALB/MBD)\",COUNTRY_INFO!$V$9:$V$1000=\"T3 (ALB/MBD)\"), \"T3 (ALB/MBD)\", \" \")","v":" "},null,null,null,null,null,0,null,null,null,0," "," "," "," "]
[{"$f":"IF(COUNTRY_INFO!A27=0,\" \",COUNTRY_INFO!A27)","v":" Congo"},{"$f":"IF(COUNTRY_INFO!B27=0,\" \",COUNTRY_INFO!B27)","v":"Cuvette-Ouest"},{"$f":"IF(COUNTRY_INFO!C27=0,\" \",COUNTRY_INFO!C27)","v":"Etoumbi"},{"$f":"IF(AND(COUNTRY_INFO!$U$9:$U$1000=\"T3 (ALB/MBD)\",COUNTRY_INFO!$V$9:$V$1000=\"T3 (ALB/MBD)\"), \"T3 (ALB/MBD)\", \" \")","v":" "},null,null,null,null,null,0,null,null,null,0," "," "," "," "]
[{"$f":"IF(COUNTRY_INFO!A28=0,\" \",COUNTRY_INFO!A28)","v":" Congo"},{"$f":"IF(COUNTRY_INFO!B28=0,\" \",COUNTRY_INFO!B28)","v":"Cuvette-Ouest"},{"$f":"IF(COUNTRY_INFO!C28=0,\" \",COUNTRY_INFO!C28)","v":"Ewo"},{"$f":"IF(AND(COUNTRY_INFO!$U$9:$U$1000=\"T3 (ALB/MBD)\",COUNTRY_INFO!$V$9:$V$1000=\"T3 (ALB/MBD)\"), \"T3 (ALB/MBD)\", \" \")","v":" "},null,null,null,null,null,0,null,null,null,0," "," "," "," "]
[{"$f":"IF(COUNTRY_INFO!A29=0,\" \",COUNTRY_INFO!A29)","v":" Congo"},{"$f":"IF(COUNTRY_INFO!B29=0,\" \",COUNTRY_INFO!B29)","v":"Kouilou"},{"$f":"IF(COUNTRY_INFO!C29=0,\" \",COUNTRY_INFO!C29)","v":"Hinda-Loango"},{"$f":"IF(AND(COUNTRY_INFO!$U$9:$U$1000=\"T3 (ALB/MBD)\",COUNTRY_INFO!$V$9:$V$1000=\"T3 (ALB/MBD)\"), \"T3 (ALB/MBD)\", \" \")","v":" "},null,null,null,null,null,0,null,null,null,0," "," "," "," "]
[{"$f":"IF(COUNTRY_INFO!A30=0,\" \",COUNTRY_INFO!A30)","v":" Congo"},{"$f":"IF(COUNTRY_INFO!B30=0,\" \",COUNTRY_INFO!B30)","v":"Kouilou"},{"$f":"IF(COUNTRY_INFO!C30=0,\" \",COUNTRY_INFO!C30)","v":"Madingo Kayes-Nzambi"},{"$f":"IF(AND(COUNTRY_INFO!$U$9:$U$1000=\"T3 (ALB/MBD)\",COUNTRY_INFO!$V$9:$V$1000=\"T3 (ALB/MBD)\"), \"T3 (ALB/MBD)\", \" \")","v":" "},null,null,null,null,null,0,null,null,null,0," "," "," "," "]
[{"$f":"IF(COUNTRY_INFO!A31=0,\" \",COUNTRY_INFO!A31)","v":" Congo"},{"$f":"IF(COUNTRY_INFO!B31=0,\" \",COUNTRY_INFO!B31)","v":"Kouilou"},{"$f":"IF(COUNTRY_INFO!C31=0,\" \",COUNTRY_INFO!C31)","v":"Mvouti-Kakamouéka"},{"$f":"IF(AND(COUNTRY_INFO!$U$9:$U$1000=\"T3 (ALB/MBD)\",COUNTRY_INFO!$V$9:$V$1000=\"T3 (ALB/MBD)\"), \"T3 (ALB/MBD)\", \" \")","v":" "},null,null,null,null,null,0,null,null,null,0," "," "," "," "]
[{"$f":"IF(COUNTRY_INFO!A32=0,\" \",COUNTRY_INFO!A32)","v":" Congo"},{"$f":"IF(COUNTRY_INFO!B32=0,\" \",COUNTRY_INFO!B32)","v":"Lékoumou"},{"$f":"IF(COUNTRY_INFO!C32=0,\" \",COUNTRY_INFO!C32)","v":"Sibiti"},{"$f":"IF(AND(COUNTRY_INFO!$U$9:$U$1000=\"T3 (ALB/MBD)\",COUNTRY_INFO!$V$9:$V$1000=\"T3 (ALB/MBD)\"), \"T3 (ALB/MBD)\", \" \")","v":" "},null,null,null,null,null,0,null,null,null,0," "," "," "," "]
[{"$f":"IF(COUNTRY_INFO!A33=0,\" \",COUNTRY_INFO!A33)","v":" Congo"},{"$f":"IF(COUNTRY_INFO!B33=0,\" \",COUNTRY_INFO!B33)","v":"Lékoumou"},{"$f":"IF(COUNTRY_INFO!C33=0,\" \",COUNTRY_INFO!C33)","v":"Zanaga"},{"$f":"IF(AND(COUNTRY_INFO!$U$9:$U$1000=\"T3 (ALB/MBD)\",COUNTRY_INFO!$V$9:$V$1000=\"T3 (ALB/MBD)\"), \"T3 (ALB/MBD)\", \" \")","v":" "},null,null,null,null,null,0,null,null,null,0," "," "," "," "]
[{"$f":"IF(COUNTRY_INFO!A34=0,\" \",COUNTRY_INFO!A34)","v":" Congo"},{"$f":"IF(COUNTRY_INFO!B34=0,\" \",COUNTRY_INFO!B34)","v":"Likouala"},{"$f":"IF(COUNTRY_INFO!C34=0,\" \",COUNTRY_INFO!C34)","v":"Bétou"},{"$f":"IF(AND(COUNTRY_INFO!$U$9:$U$1000=\"T3 (ALB/MBD)\",COUNTRY_INFO!$V$9:$V$1000=\"T3 (ALB/MBD)\"), \"T3 (ALB/MBD)\", \" \")","v":" "},null,null,null,null,null,0,null,null,null,0," "," "," "," "]
[{"$f":"IF(COUNTRY_INFO!A35=0,\" \",COUNTRY_INFO!A35)","v":" Congo"},{"$f":"IF(COUNTRY_INFO!B35=0,\" \",COUNTRY_INFO!B35)","v":"Likouala"},{"$f":"IF(COUNTRY_INFO!C35=0,\" \",COUNTRY_INFO!C35)","v":"Impfondo"},{"$f":"IF(AND(COUNTRY_INFO!$U$9:$U$1000=\"T3 (ALB/MBD)\",COUNTRY_INFO!$V$9:$V$1000=\"T3 (ALB/MBD)\"), \"T3 (ALB/MBD)\", \" \")","v":" "},null,null,null,null,null,0,null,null,null,0," "," "," "," "]
[{"$f":"IF(COUNTRY_INFO!A36=0,\" \",COUNTRY_INFO!A36)","v":" Congo"},{"$f":"IF(COUNTRY_INFO!B36=0,\" \",COUNTRY_INFO!B36)","v":"Niari"},{"$f":"IF(COUNTRY_INFO!C36=0,\" \",COUNTRY_INFO!C36)","v":"Dolisie"},{"$f":"IF(AND(COUNTRY_INFO!$U$9:$U$1000=\"T3 (ALB/MBD)\",COUNTRY_INFO!$V$9:$V$1000=\"T3 (ALB/MBD)\"), \"T3 (ALB/MBD)\", \" \")","v":" "},null,null,null,null,null,0,null,null,null,0," "," "," "," "]
[{"$f":"IF(COUNTRY_INFO!A37=0,\" \",COUNTRY_INFO!A37)","v":" Congo"},{"$f":"IF(COUNTRY_INFO!B37=0,\" \",COUNTRY_INFO!B37)","v":"Niari"},{"$f":"IF(COUNTRY_INFO!C37=0,\" \",COUNTRY_INFO!C37)","v":"Kibangou"},{"$f":"IF(AND(COUNTRY_INFO!$U$9:$U$1000=\"T3 (ALB/MBD)\",COUNTRY_INFO!$V$9:$V$1000=\"T3 (ALB/MBD)\"), \"T3 (ALB/MBD)\", \" \")","v":" "},null,null,null,null,null,0,null,null,null,0," "," "," "," "]
[{"$f":"IF(COUNTRY_INFO!A38=0,\" \",COUNTRY_INFO!A38)","v":" Congo"},{"$f":"IF(COUNTRY_INFO!B38=0,\" \",COUNTRY_INFO!B38)","v":"Niari"},{"$f":"IF(COUNTRY_INFO!C38=0,\" \",COUNTRY_INFO!C38)","v":"Kimongo-Londela Nkayes"},{"$f":"IF(AND(COUNTRY_INFO!$U$9:$U$1000=\"T3 (ALB/MBD)\",COUNTRY_INFO!$V$9:$V$1000=\"T3 (ALB/MBD)\"), \"T3 (ALB/MBD)\", \" \")","v":" "},null,null,null,null,null,0,null,null,null,0," "," "," "," "]
[{"$f":"IF(COUNTRY_INFO!A39=0,\" \",COUNTRY_INFO!A39)","v":" Congo"},{"$f":"IF(COUNTRY_INFO!B39=0,\" \",COUNTRY_INFO!B39)","v":"Niari"},{"$f":"IF(COUNTRY_INFO!C39=0,\" \",COUNTRY_INFO!C39)","v":"Mayoko"},{"$f":"IF(AND(COUNTRY_INFO!$U$9:$U$1000=\"T3 (ALB/MBD)\",COUNTRY_INFO!$V$9:$V$1000=\"T3 (ALB/MBD)\"), \"T3 (ALB/MBD)\", \" \")","v":" "},null,null,null,null,null,0,null,null,null,0," "," "," "," "]
[{"$f":"IF(COUNTRY_INFO!A40=0,\" \",COUNTRY_INFO!A40)","v":" Congo"},{"$f":"IF(COUNTRY_INFO!B40=0,\" \",COUNTRY_INFO!B40)","v":"Niari"},{"$f":"IF(COUNTRY_INFO!C40=0,\" \",COUNTRY_INFO!C40)","v":"Mossendjo"},{"$f":"IF(AND(COUNTRY_INFO!$U$9:$U$1000=\"T3 (ALB/MBD)\",COUNTRY_INFO!$V$9:$V$1000=\"T3 (ALB/MBD)\"), \"T3 (ALB/MBD)\", \" \")","v":" "},null,null,null,null,null,0,null,null,null,0," "," "," "," "]
[{"$f":"IF(COUNTRY_INFO!A41=0,\" \",COUNTRY_INFO!A41)","v":" Congo"},{"$f":"IF(COUNTRY_INFO!B41=0,\" \",COUNTRY_INFO!B41)","v":"Plateaux"},{"$f":"IF(COUNTRY_INFO!C41=0,\" \",COUNTRY_INFO!C41)","v":"Abala"},{"$f":"IF(AND(COUNTRY_INFO!$U$9:$U$1000=\"T3 (ALB/MBD)\",COUNTRY_INFO!$V$9:$V$1000=\"T3 (ALB/MBD)\"), \"T3 (ALB/MBD)\", \" \")","v":" "},null,null,null,null,null,0,null,null,null,0," "," "," "," "]
[{"$f":"IF(COUNTRY_INFO!A42=0,\" \",COUNTRY_INFO!A42)","v":" Congo"},{"$f":"IF(COUNTRY_INFO!B42=0,\" \",COUNTRY_INFO!B42)","v":"Plateaux"},{"$f":"IF(COUNTRY_INFO!C42=0,\" \",COUNTRY_INFO!C42)","v":"Djambala-Lékana"},{"$f":"IF(AND(COUNTRY_INFO!$U$9:$U$1000=\"T3 (ALB/MBD)\",COUNTRY_INFO!$V$9:$V$1000=\"T3 (ALB/MBD)\"), \"T3 (ALB/MBD)\", \" \")","v":" "},null,null,null,null,null,0,null,null,null,0," "," "," "," "]
[{"$f":"IF(COUNTRY_INFO!A43=0,\" \",COUNTRY_INFO!A43)","v":" Congo"},{"$f":"IF(COUNTRY_INFO!B43=0,\" \",COUNTRY_INFO!B43)","v":"Plateaux"},{"$f":"IF(COUNTRY_INFO!C43=0,\" \",COUNTRY_INFO!C43)","v":"Gamboma"},{"$f":"IF(AND(COUNTRY_INFO!$U$9:$U$1000=\"T3 (ALB/MBD)\",COUNTRY_INFO!$V$9:$V$1000=\"T3 (ALB/MBD)\"), \"T3 (ALB/MBD)\", \" \")","v":" "},null,null,null,null,null,0,null,null,null,0," "," "," "," "]
[{"$f":"IF(COUNTRY_INFO!A44=0,\" \",COUNTRY_INFO!A44)","v":" Congo"},{"$f":"IF(COUNTRY_INFO!B44=0,\" \",COUNTRY_INFO!B44)","v":"Plateaux"},{"$f":"IF(COUNTRY_INFO!C44=0,\" \",COUNTRY_INFO!C44)","v":"Ngo Mpouya"},{"$f":"IF(AND(COUNTRY_INFO!$U$9:$U$1000=\"T3 (ALB/MBD)\",COUNTRY_INFO!$V$9:$V$1000=\"T3 (ALB/MBD)\"), \"T3 (ALB/MBD)\", \" \")","v":" "},null,null,null,null,null,0,null,null,null,0," "," "," "," "]
[{"$f":"IF(COUNTRY_INFO!A45=0,\" \",COUNTRY_INFO!A45)","v":" Congo"},{"$f":"IF(COUNTRY_INFO!B45=0,\" \",COUNTRY_INFO!B45)","v":"Pointe-Noire"},{"$f":"IF(COUNTRY_INFO!C45=0,\" \",COUNTRY_INFO!C45)","v":"Loandjili"},{"$f":"IF(AND(COUNTRY_INFO!$U$9:$U$1000=\"T3 (ALB/MBD)\",COUNTRY_INFO!$V$9:$V$1000=\"T3 (ALB/MBD)\"), \"T3 (ALB/MBD)\", \" \")","v":" "},null,null,null,null,null,0,null,null,null,0," "," "," "," "]
[{"$f":"IF(COUNTRY_INFO!A46=0,\" \",COUNTRY_INFO!A46)","v":" Congo"},{"$f":"IF(COUNTRY_INFO!B46=0,\" \",COUNTRY_INFO!B46)","v":"Pointe-Noire"},{"$f":"IF(COUNTRY_INFO!C46=0,\" \",COUNTRY_INFO!C46)","v":"Lumumba"},{"$f":"IF(AND(COUNTRY_INFO!$U$9:$U$1000=\"T3 (ALB/MBD)\",COUNTRY_INFO!$V$9:$V$1000=\"T3 (ALB/MBD)\"), \"T3 (ALB/MBD)\", \" \")","v":" "},null,null,null,null,null,0,null,null,null,0," "," "," "," "]
[{"$f":"IF(COUNTRY_INFO!A47=0,\" \",COUNTRY_INFO!A47)","v":" Congo"},{"$f":"IF(COUNTRY_INFO!B47=0,\" \",COUNTRY_INFO!B47)","v":"Pointe-Noire"},{"$f":"IF(COUNTRY_INFO!C47=0,\" \",COUNTRY_INFO!C47)","v":"Mongo-Poukou"},{"$f":"IF(AND(COUNTRY_INFO!$U$9:$U$1000=\"T3 (ALB/MBD)\",COUNTRY_INFO!$V$9:$V$1000=\"T3 (ALB/MBD)\"), \"T3 (ALB/MBD)\", \" \")","v":" "},null,null,null,null,null,0,null,null,null,0," "," "," "," "]
[{"$f":"IF(COUNTRY_INFO!A48=0,\" \",COUNTRY_INFO!A48)","v":" Congo"},{"$f":"IF(COUNTRY_INFO!B48=0,\" \",COUNTRY_INFO!B48)","v":"Pointe-Noire"},{"$f":"IF(COUNTRY_INFO!C48=0,\" \",COUNTRY_INFO!C48)","v":"Mvoumvou"},{"$f":"IF(AND(COUNTRY_INFO!$U$9:$U$1000=\"T3 (ALB/MBD)\",COUNTRY_INFO!$V$9:$V$1000=\"T3 (ALB/MBD)\"), \"T3 (ALB/MBD)\", \" \")","v":" "},null,null,null,null,null,0,null,null,null,0," "," "," "," "]
[{"$f":"IF(COUNTRY_INFO!A49=0,\" \",COUNTRY_INFO!A49)","v":" Congo"},{"$f":"IF(COUNTRY_INFO!B49=0,\" \",COUNTRY_INFO!B49)","v":"Pointe-Noire"},{"$f":"IF(COUNTRY_INFO!C49=0,\" \",COUNTRY_INFO!C49)","v":"Ngoyo"},{"$f":"IF(AND(COUNTRY_INFO!$U$9:$U$1000=\"T3 (ALB/MBD)\",COUNTRY_INFO!$V$9:$V$1000=\"T3 (ALB/MBD)\"), \"T3 (ALB/MBD)\", \" \")","v":" "},null,null,null,null,null,0,null,null,null,0," "," "," "," "]
[{"$f":"IF(COUNTRY_INFO!A50=0,\" \",COUNTRY_INFO!A50)","v":" Congo"},{"$f":"IF(COUNTRY_INFO!B50=0,\" \",COUNTRY_INFO!B50)","v":"Pointe-Noire"},{"$f":"IF(COUNTRY_INFO!C50=0,\" \",COUNTRY_INFO!C50)","v":"Tchiamba Nzassi"},{"$f":"IF(AND(COUNTRY_INFO!$U$9:$U$1000=\"T3 (ALB/MBD)\",COUNTRY_INFO!$V$9:$V$1000=\"T3 (ALB/MBD)\"), \"T3 (ALB/MBD)\", \" \")","v":" "},null,null,null,null,null,0,null,null,null,0," "," "," "," "]
[{"$f":"IF(COUNTRY_INFO!A51=0,\" \",COUNTRY_INFO!A51)","v":" Congo"},{"$f":"IF(COUNTRY_INFO!B51=0,\" \",COUNTRY_INFO!B51)","v":"Pointe-Noire"},{"$f":"IF(COUNTRY_INFO!C51=0,\" \",COUNTRY_INFO!C51)","v":"Tie-Tie"},{"$f":"IF(AND(COUNTRY_INFO!$U$9:$U$1000=\"T3 (ALB/MBD)\",COUNTRY_INFO!$V$9:$V$1000=\"T3 (ALB/MBD)\"), \"T3 (ALB/MBD)\", \" \")","v":" "},null,null,null,null,null,0,null,null,null,0," "," "," "," "]
[{"$f":"IF(COUNTRY_INFO!A52=0,\" \",COUNTRY_INFO!A52)","v":" Congo"},{"$f":"IF(COUNTRY_INFO!B52=0,\" \",COUNTRY_INFO!B52)","v":"Pool"},{"$f":"IF(COUNTRY_INFO!C52=0,\" \",COUNTRY_INFO!C52)","v":"Boko"},{"$f":"IF(AND(COUNTRY_INFO!$U$9:$U$1000=\"T3 (ALB/MBD)\",COUNTRY_INFO!$V$9:$V$1000=\"T3 (ALB/MBD)\"), \"T3 (ALB/MBD)\", \" \")","v":" "},null,null,null,null,null,0,null,null,null,0," "," "," "," "]
[{"$f":"IF(COUNTRY_INFO!A53=0,\" \",COUNTRY_INFO!A53)","v":" Congo"},{"$f":"IF(COUNTRY_INFO!B53=0,\" \",COUNTRY_INFO!B53)","v":"Pool"},{"$f":"IF(COUNTRY_INFO!C53=0,\" \",COUNTRY_INFO!C53)","v":"Goma tsétsé"},{"$f":"IF(AND(COUNTRY_INFO!$U$9:$U$1000=\"T3 (ALB/MBD)\",COUNTRY_INFO!$V$9:$V$1000=\"T3 (ALB/MBD)\"), \"T3 (ALB/MBD)\", \" \")","v":" "},null,null,null,null,null,0,null,null,null,0," "," "," "," "]
[{"$f":"IF(COUNTRY_INFO!A54=0,\" \",COUNTRY_INFO!A54)","v":" Congo"},{"$f":"IF(COUNTRY_INFO!B54=0,\" \",COUNTRY_INFO!B54)","v":"Pool"},{"$f":"IF(COUNTRY_INFO!C54=0,\" \",COUNTRY_INFO!C54)","v":"Ignié"},{"$f":"IF(AND(COUNTRY_INFO!$U$9:$U$1000=\"T3 (ALB/MBD)\",COUNTRY_INFO!$V$9:$V$1000=\"T3 (ALB/MBD)\"), \"T3 (ALB/MBD)\", \" \")","v":" "},null,null,null,null,null,0,null,null,null,0," "," "," "," "]
[{"$f":"IF(COUNTRY_INFO!A55=0,\" \",COUNTRY_INFO!A55)","v":" Congo"},{"$f":"IF(COUNTRY_INFO!B55=0,\" \",COUNTRY_INFO!B55)","v":"Pool"},{"$f":"IF(COUNTRY_INFO!C55=0,\" \",COUNTRY_INFO!C55)","v":"Kindamba"},{"$f":"IF(AND(COUNTRY_INFO!$U$9:$U$1000=\"T3 (ALB/MBD)\",COUNTRY_INFO!$V$9:$V$1000=\"T3 (ALB/MBD)\"), \"T3 (ALB/MBD)\", \" \")","v":" "},null,null,null,null,null,0,null,null,null,0," "," "," "," "]
[{"$f":"IF(COUNTRY_INFO!A56=0,\" \",COUNTRY_INFO!A56)","v":" Congo"},{"$f":"IF(COUNTRY_INFO!B56=0,\" \",COUNTRY_INFO!B56)","v":"Pool"},{"$f":"IF(COUNTRY_INFO!C56=0,\" \",COUNTRY_INFO!C56)","v":"Kinkala"},{"$f":"IF(AND(COUNTRY_INFO!$U$9:$U$1000=\"T3 (ALB/MBD)\",COUNTRY_INFO!$V$9:$V$1000=\"T3 (ALB/MBD)\"), \"T3 (ALB/MBD)\", \" \")","v":" "},null,null,null,null,null,0,null,null,null,0," "," "," "," "]
[{"$f":"IF(COUNTRY_INFO!A57=0,\" \",COUNTRY_INFO!A57)","v":" Congo"},{"$f":"IF(COUNTRY_INFO!B57=0,\" \",COUNTRY_INFO!B57)","v":"Pool"},{"$f":"IF(COUNTRY_INFO!C57=0,\" \",COUNTRY_INFO!C57)","v":"Kintélé"},{"$f":"IF(AND(COUNTRY_INFO!$U$9:$U$1000=\"T3 (ALB/MBD)\",COUNTRY_INFO!$V$9:$V$1000=\"T3 (ALB/MBD)\"), \"T3 (ALB/MBD)\", \" \")","v":" "},null,null,null,null,null,0,null,null,null,0," "," "," "," "]
[{"$f":"IF(COUNTRY_INFO!A58=0,\" \",COUNTRY_INFO!A58)","v":" Congo"},{"$f":"IF(COUNTRY_INFO!B58=0,\" \",COUNTRY_INFO!B58)","v":"Pool"},{"$f":"IF(COUNTRY_INFO!C58=0,\" \",COUNTRY_INFO!C58)","v":"Mindouli"},{"$f":"IF(AND(COUNTRY_INFO!$U$9:$U$1000=\"T3 (ALB/MBD)\",COUNTRY_INFO!$V$9:$V$1000=\"T3 (ALB/MBD)\"), \"T3 (ALB/MBD)\", \" \")","v":" "},null,null,null,null,null,0,null,null,null,0," "," "," "," "]
[{"$f":"IF(COUNTRY_INFO!A59=0,\" \",COUNTRY_INFO!A59)","v":" Congo"},{"$f":"IF(COUNTRY_INFO!B59=0,\" \",COUNTRY_INFO!B59)","v":"Sangha"},{"$f":"IF(COUNTRY_INFO!C59=0,\" \",COUNTRY_INFO!C59)","v":"Ouesso"},{"$f":"IF(AND(COUNTRY_INFO!$U$9:$U$1000=\"T3 (ALB/MBD)\",COUNTRY_INFO!$V$9:$V$1000=\"T3 (ALB/MBD)\"), \"T3 (ALB/MBD)\", \" \")","v":" "},null,null,null,null,null,0,null,null,null,0," "," "," "," "]
[{"$f":"IF(COUNTRY_INFO!A60=0,\" \",COUNTRY_INFO!A60)","v":" Congo"},{"$f":"IF(COUNTRY_INFO!B60=0,\" \",COUNTRY_INFO!B60)","v":"Sangha"},{"$f":"IF(COUNTRY_INFO!C60=0,\" \",COUNTRY_INFO!C60)","v":"Sembé-Souanké"},{"$f":"IF(AND(COUNTRY_INFO!$U$9:$U$1000=\"T3 (ALB/MBD)\",COUNTRY_INFO!$V$9:$V$1000=\"T3 (ALB/MBD)\"), \"T3 (ALB/MBD)\", \" \")","v":" "},null,null,null,null,null,0,null,null,null,0," "," "," "," "]

{"sheet":"DISTRICT","index":9,"n_rows":60,"n_cols":56,"rows_kept":60,"cut":false,"hidden":false,"merged":[[5,26,5,34],[5,3,6,3],[5,9,6,9],[5,15,6,15],[5,25,6,25],[3,0,3,2],[5,0,5,2],[5,4,5,8],[5,10,5,14],[5,16,5,24]]}
["Nombre d'individus traités"]
["Structure administrative, population traitée par groupe d'âge et sexe",null,null,null,null,null,null,null,null," ",null,null,null,null,null,null,null,null,null,null,null,null,null," "]
[]
["TOTAL",null,null,{"$f":"SUM(D$9:D$1000)","v":1031260},{"$f":"SUM(E$9:E$1000)","v":199072},{"$f":"SUM(F$9:F$1000)","v":210522},{"$f":"SUM(G$9:G$1000)","v":532181.92000000004},{"$f":"SUM(H$9:H$1000)","v":486735.92000000004},{"$f":"IF(D4>0, IF(H4/D4*100<>0, H4/D4*100, \"-\"),0)","v":47.198176987374673},{"$f":"SUM(J$9:J$1000)","v":713514},{"$f":"SUM(K$9:K$1000)","v":233802},{"$f":"SUM(L$9:L$1000)","v":349655},{"$f":"SUM(M$9:M$1000)","v":581904},{"$f":"SUM(N$9:N$1000)","v":581904},{"$f":"IF(J4>0, IF(N4/J4*100<>0, N4/J4*100, \"-\"),0)","v":81.554671667269318},{"$f":"SUM(P$9:P$1000)","v":809022},{"$f":"SUM(Q$9:Q$1000)","v":0},{"$f":"SUM(R$9:R$1000)","v":0},{"$f":"SUM(S$9:S$1000)","v":266622},{"$f":"SUM(T$9:T$1000)","v":0},null,54283.919999999991,null,{"$f":"SUM(X$9:X$1000)","v":54283.919999999991},{"$f":"IF(P4>0, IF(X4/P4*100<>0, X4/P4*100, \"-\"),0)","v":6.709820004894798},{"$f":"SUM(Z$9:Z$1000)","v":408975.29},0,0,0,0,null,0,null,0,{"$f":"IF(Z4>0, IF(AH4/Z4*100<>0, AH4/Z4*100, \"-\"),0)","v":"-"}]
[]
["Structure administrative du pays",null,null,"Population nécessitant la CP pour FL","Population traitée pour la filariose lymphatique",null,null,null,null,"Population nécessitant la CP pour ONCHO","Population traitée pour l'onchocercose",null,null,null,null,"Population nécessitant la CP pour STH","Population traitée pour les géohelminthiases",null,null,null,null,null,null,null,null,"Population nécessitant la CP pour SCH","Population traitée pour la schistosomiase",null,null,null,null,null,null,null,null,null,null,null,null,null,null,{"$f":"SUM(AP9:AP1000)","v":75200.577183190588},426856.27989427315,702569.70120054029,990521.82599274884,{"$f":"SUM(AT9:AT1000)","v":2195148.3842707528},{"$f":"COUNTIF(AU9:AU1000,\"Y\")","v":5},{"$f":"SUM(AV9:AV1000)","v":0},228930.08000000005,719271.84000000008,{"$f":"SUM(AY9:AY1000)","v":948201.91999999993},0,228930.08000000005,719271.84000000008,948201.91999999993,{"$f":"IF(AT6<>0,BC6/AT6,0)","v":0.43195345098049071}]
["Pays","Région/Département","District",null,"Masculine","Féminine","Total traité","Total traité ayant besoin de CP","(%)",null,"Masculine","Féminine","Total traité","Total traité ayant besoin de CP","(%)",null,"Masculine","Féminine","Total traité","EAPréS traité ayant besoin de CP","EAPréS (%)","EAS traité ayant besoin de CP","EAS (%)","Total traité ayant besoin de CP","(%)",null,"Masculine","Féminine","Total traité","EAS traité ayant besoin de CP","EAS (%)","Adultes traité ayant besoin de CP","Adultes (%)","Total traité ayant besoin de CP","(%)",null,"LF","ONCHO","STH","SCH-SAC","SCH_Adults","<1","PreSAC","SAC","Adults","Total","Dis","PreSAC","SAC","Adults","Total","PreSAC","SAC","Adults","Total","Coverage"]
[]
[{"$f":"IF(COUNTRY_INFO!A9=0,\" \",COUNTRY_INFO!A9)","v":" Congo"},{"$f":"IF(COUNTRY_INFO!B9=0,\" \",COUNTRY_INFO!B9)","v":"Bouenza"},{"$f":"IF(COUNTRY_INFO!C9=0,\" \",COUNTRY_INFO!C9)","v":"Loudima"},{"$f":"COUNTRY_INFO!M9","v":0},null,null,{"$f":"SUM('MDA1'!M9,'MDA4'!U9)","v":0},{"$f":"IF(AND(COUNTRY_INFO!H9>0,COUNTRY_INFO!H9<4),IF(D9>MAX('MDA1'!M9,'MDA4'!U9),MAX('MDA1'!M9,'MDA4'!U9),D9),0)","v":0},{"$f":"IF(AND(COUNTRY_INFO!H9>0,COUNTRY_INFO!H9<4), IF(G9/D9*100<>0, IF(G9/D9*100>100,100,G9/D9*100), \"-\"),0)","v":0},{"$f":"COUNTRY_INFO!N9","v":16204},6475,6915,{"$f":"MAX('MDA1'!M9,MAX('MDA3'!I9,'MDA3'!L9)+MAX('MDA3'!J9,'MDA3'!M9))","v":13390},{"$f":"IF(AND(COUNTRY_INFO!I9>0,COUNTRY_INFO!I9<4),IF(J9>MAX('MDA1'!M9,MAX('MDA3'!I9,'MDA3'!L9)+MAX('MDA3'!J9,'MDA3'!M9)),MAX('MDA1'!M9,MAX('MDA3'!I9,'MDA3'!L9)+MAX('MDA3'!J9,'MDA3'!M9)),J9),0)","v":13390},{"$f":"IF(AND(COUNTRY_INFO!I9>0,COUNTRY_INFO!I9<4), IF(M9/J9*100<>0, IF(M9/J9*100>100,100,M9/J9*100), \"-\"),0)","v":82.633917551221927},{"$f":"COUNTRY_INFO!O9","v":0},null,null,{"$f":"SUM(MAX('MDA4'!N9, 'T1'!L9, MAX(T3_R1!K9, T3_R2!K9)), MAX('MDA1'!K9, 'MDA4'!O9, 'T1'!M9, MAX(T3_R1!L9, T3_R2!L9)), MAX('MDA1'!L9, 'MDA4'!P9, 'T1'!N9, MAX(T3_R1!M9, T3_R2!M9)))","v":0},{"$f":"IF(AND(COUNTRY_INFO!J9>1,COUNTRY_INFO!J9<4),IF(COUNTRY_INFO!E9>MAX('MDA4'!N9,'T1'!L9,MAX(T3_R1!K9,T3_R2!K9)),MAX('MDA4'!N9,'T1'!L9,MAX(T3_R1!K9,T3_R2!K9)),COUNTRY_INFO!E9),0)","v":0},{"$f":"IF(AND(COUNTRY_INFO!J9>1,COUNTRY_INFO!J9<4), IF(T9/COUNTRY_INFO!E9*100<>0, IF(T9/COUNTRY_INFO!E9*100>100,100,T9/COUNTRY_INFO!E9*100), \"-\"),0)","v":0},{"$f":"IF(AND(COUNTRY_INFO!J9>1,COUNTRY_INFO!J9<4),IF(COUNTRY_INFO!F9>MAX('MDA1'!K9,'MDA4'!O9,'T1'!M9,MAX(T3_R1!L9,T3_R2!L9)),MAX('MDA1'!K9,'MDA4'!O9,'T1'!M9,MAX(T3_R1!L9,T3_R2!L9)),COUNTRY_INFO!F9),0)","v":0},{"$f":"IF(AND(COUNTRY_INFO!J9>1,COUNTRY_INFO!J9<4), IF(V9/COUNTRY_INFO!F9*100<>0, IF(V9/COUNTRY_INFO!F9*100>100,100,V9/COUNTRY_INFO!F9*100), \"-\"),0)","v":0},{"$f":"SUM(T9,V9)","v":0},{"$f":"IF(AND(COUNTRY_INFO!J9>1,COUNTRY_INFO!J9<4), IF(S9/P9*100<>0, IF(X9/P9*100>100,100,X9/P9*100), \"-\"),0)","v":0},{"$f":"COUNTRY_INFO!P9","v":39954},null,null,{"$f":"MAX('T1'!L9,'T2'!J9)+MAX('T1'!M9,'T2'!K9)+MAX('T1'!N9,'T2'!L9)","v":0},{"$f":"IF(COUNTRY_INFO!K9=1,IF(COUNTRY_INFO!F9*0.33>MAX('T1'!M9,'T2'!K9),MAX('T1'!M9,'T2'!K9),COUNTRY_INFO!F9*0.33),IF(COUNTRY_INFO!K9=2,IF(COUNTRY_INFO!F9*0.5>MAX('T1'!M9,'T2'!K9),MAX('T1'!M9,'T2'!K9),COUNTRY_INFO!F9*0.5),IF(COUNTRY_INFO!K9=3,IF(COUNTRY_INFO!F9>MAX('T1'!M9,'T2'!K9),MAX('T1'!M9,'T2'!K9),COUNTRY_INFO!F9),0)))","v":0},{"$f":"IF(AND(COUNTRY_INFO!K9>0,COUNTRY_INFO!K9<4),IF(Z9>0,IF(COUNTRY_INFO!K9=1, AD9/(COUNTRY_INFO!F9*0.33)*100, IF(COUNTRY_INFO!K9=2, AD9/(COUNTRY_INFO!F9*0.5)*100, IF(COUNTRY_INFO!K9=3, AD9/COUNTRY_INFO!F9*100))),\"-\"),0)","v":0},{"$f":"IF(COUNTRY_INFO!K9=2,IF(COUNTRY_INFO!G9*0.2>MAX('T1'!N9,'T2'!L9),MAX('T1'!N9,'T2'!L9),COUNTRY_INFO!G9*0.2),IF(COUNTRY_INFO!K9=3,IF(COUNTRY_INFO!G9>MAX('T1'!N9,'T2'!L9),MAX('T1'!N9,'T2'!L9),COUNTRY_INFO!G9),0))","v":0},{"$f":"IF(AND(COUNTRY_INFO!K9>0,COUNTRY_INFO!K9<4),IF(Z9>0,IF(COUNTRY_INFO!K9=1, 0, IF(COUNTRY_INFO!K9=2, AF9/(COUNTRY_INFO!G9*0.2)*100, IF(COUNTRY_INFO!K9=3, AF9/COUNTRY_INFO!G9*100))),\"-\"),0)","v":0},{"$f":"SUM(AD9,AF9)","v":0},{"$f":"IF(AND(COUNTRY_INFO!K9>0,COUNTRY_INFO!K9<4), IF(AC9/Z9*100<>0, IF(AH9/Z9*100>100,100,AH9/Z9*100), \"-\"),0)","v":"-"},null,{"$f":"IF(AND(D9<>0, D9<>\"Inconnu\",D9<>\"Interrompu\",D9<>\"Non requis\"),D9/COUNTRY_INFO!D9, 0)","v":0},{"$f":"IF(AND(J9<>0,J9<>\"Inconnu\",J9<>\"Interrompu\",J9<>\"Non requis\"),J9/COUNTRY_INFO!D9, 0)","v":0.32161003493172435},{"$f":"IF(AND(P9<>0,P9<>\"Inconnu\",P9<>\"Non requis\"),P9/(COUNTRY_INFO!E9+COUNTRY_INFO!F9), 0)","v":0},{"$f":"IF(AND(Z9<>0,Z9<>\"Inconnu\",Z9<>\"Non requis\"),IF(COUNTRY_INFO!K9=1,1,IF(COUNTRY_INFO!K9=2,0.5*COUNTRY_INFO!F9/(0.5*COUNTRY_INFO!F9+0.2*COUNTRY_INFO!G9),IF(COUNTRY_INFO!K9=3,COUNTRY_INFO!F9/(COUNTRY_INFO!F9+COUNTRY_INFO!G9)))),0)","v":0.30264804525203987},{"$f":"IF(AND(Z9<>0,Z9<>\"Inconnu\",Z9<>\"Non requis\"),IF(COUNTRY_INFO!K9=1,0,IF(COUNTRY_INFO!K9=2,0.2*COUNTRY_INFO!G9/(0.5*COUNTRY_INFO!F9+0.2*COUNTRY_INFO!G9),IF(COUNTRY_INFO!K9=3,COUNTRY_INFO!G9/(COUNTRY_INFO!F9+COUNTRY_INFO!G9)))),0)","v":0.69735195474796019},{"$f":"MAX(COUNTRY_INFO!D9*AK9*PROFILE!$G$7,COUNTRY_INFO!D9*AL9*PROFILE!$G$7)","v":761.59717741041391},{"$f":"MAX(COUNTRY_INFO!D9*AK9*PROFILE!$G$8,COUNTRY_INFO!D9*AL9*PROFILE!$G$8,COUNTRY_INFO!D9*AM9*PROFILE!$G$8)","v":2592.6397564058284},{"$f":"MAX(COUNTRY_INFO!D9*AK9*PROFILE!$G$9,COUNTRY_INFO!D9*AL9*PROFILE!$G$9,COUNTRY_INFO!D9*AM9*PROFILE!$G$9,IF(AND(DISTRICT!Z9<>\"Inconnu\",Z9<>\"Non requis\"),COUNTRY_INFO!P9*DISTRICT!AN9,0))","v":12092},{"$f":"MAX(COUNTRY_INFO!D9*AK9*PROFILE!$G$10,COUNTRY_INFO!D9*AL9*PROFILE!$G$10,IF(AND(DISTRICT!Z9<>\"Inconnu\",Z9<>\"Non requis\"),COUNTRY_INFO!P9*DISTRICT!AO9,0))","v":27862},{"$f":"SUM(AP9:AS9)","v":43308.236933816239},{"$f":"IF(COUNTIFS(AK9:AN9,\">0\")=0,0, IF(COUNTIFS(AK9:AN9,\">0\")<=IF(AND(OR(D9>=0,D9=\"Non requis\",D9=\"Inconnu\",D9=\"Interrompu\"),D9>0,H9>0),1,0)+IF(AND(OR(J9>=0,J9=\"Non requis\",J9=\"Inconnu\",J9=\"Interrompu\"),J9>0,N9>0),1,0)+IF(AND(OR(P9>=0,P9=\"Non requis\",P9=\"Inconnu\"),P9>0,X9>0),1,0)+IF(AND(OR(Z9>=0,Z9=\"Non requis\",Z9=\"Inconnu\"),Z9>0,AH9>0),1,0),\"Y\",0))","v":0},{"$f":"MAX('MDA4'!R9,'T1'!L9,'T2'!J9,T3_R1!K9,T3_R2!K9)","v":0},{"$f":"MAX('MDA1'!K9,'MDA4'!S9,'MDA3'!I9,'MDA3'!L9,'T1'!M9,'T2'!K9,T3_R1!L9,T3_R2!L9)","v":3213.6},{"$f":"MAX('MDA1'!L9,'MDA4'!T9,'MDA3'!J9,'MDA3'!M9,'T1'!N9,'T2'!L9,T3_R1!M9,T3_R2!M9)","v":10176.4},{"$f":"SUM(AV9:AX9)","v":13390},{"$f":"MAX('MDA4'!R9,T9)","v":0},{"$f":"MAX('MDA1'!K9,'MDA4'!S9,'MDA3'!I9,'MDA3'!L9,V9,AD9)","v":3213.6},{"$f":"MAX('MDA1'!L9,'MDA4'!T9,'MDA3'!J9,'MDA3'!M9,AF9)","v":10176.4},{"$f":"IF(AT9<SUM(AZ9:BB9), AT9,SUM(AZ9:BB9))","v":13390},{"$f":"IF(AT9<>0,BC9/AT9*100,0)","v":30.91790603358579}]
[{"$f":"IF(COUNTRY_INFO!A10=0,\" \",COUNTRY_INFO!A10)","v":" Congo"},{"$f":"IF(COUNTRY_INFO!B10=0,\" \",COUNTRY_INFO!B10)","v":"Bouenza"},{"$f":"IF(COUNTRY_INFO!C10=0,\" \",COUNTRY_INFO!C10)","v":"Loutété"},{"$f":"COUNTRY_INFO!M10","v":55614},1312,1322,{"$f":"SUM('MDA1'!M10,'MDA4'!U10)","v":28720},{"$f":"IF(AND(COUNTRY_INFO!H10>0,COUNTRY_INFO!H10<4),IF(D10>MAX('MDA1'!M10,'MDA4'!U10),MAX('MDA1'!M10,'MDA4'!U10),D10),0)","v":25928},{"$f":"IF(AND(COUNTRY_INFO!H10>0,COUNTRY_INFO!H10<4), IF(G10/D10*100<>0, IF(G10/D10*100>100,100,G10/D10*100), \"-\"),0)","v":51.641672960046037},{"$f":"COUNTRY_INFO!N10","v":31821},6222.72,19705.28,{"$f":"MAX('MDA1'!M10,MAX('MDA3'!I10,'MDA3'!L10)+MAX('MDA3'!J10,'MDA3'!M10))","v":25928},{"$f":"IF(AND(COUNTRY_INFO!I10>0,COUNTRY_INFO!I10<4),IF(J10>MAX('MDA1'!M10,MAX('MDA3'!I10,'MDA3'!L10)+MAX('MDA3'!J10,'MDA3'!M10)),MAX('MDA1'!M10,MAX('MDA3'!I10,'MDA3'!L10)+MAX('MDA3'!J10,'MDA3'!M10)),J10),0)","v":25928},{"$f":"IF(AND(COUNTRY_INFO!I10>0,COUNTRY_INFO!I10<4), IF(M10/J10*100<>0, IF(M10/J10*100>100,100,M10/J10*100), \"-\"),0)","v":81.480783130637008},{"$f":"COUNTRY_INFO!O10","v":22245},null,null,{"$f":"SUM(MAX('MDA4'!N10, 'T1'!L10, MAX(T3_R1!K10, T3_R2!K10)), MAX('MDA1'!K10, 'MDA4'!O10, 'T1'!M10, MAX(T3_R1!L10, T3_R2!L10)), MAX('MDA1'!L10, 'MDA4'!P10, 'T1'!N10, MAX(T3_R1!M10, T3_R2!M10)))","v":25928},{"$f":"IF(AND(COUNTRY_INFO!J10>1,COUNTRY_INFO!J10<4),IF(COUNTRY_INFO!E10>MAX('MDA4'!N10,'T1'!L10,MAX(T3_R1!K10,T3_R2!K10)),MAX('MDA4'!N10,'T1'!L10,MAX(T3_R1!K10,T3_R2!K10)),COUNTRY_INFO!E10),0)","v":0},{"$f":"IF(AND(COUNTRY_INFO!J10>1,COUNTRY_INFO!J10<4), IF(T10/COUNTRY_INFO!E10*100<>0, IF(T10/COUNTRY_INFO!E10*100>100,100,T10/COUNTRY_INFO!E10*100), \"-\"),0)","v":"-"},{"$f":"IF(AND(COUNTRY_INFO!J10>1,COUNTRY_INFO!J10<4),IF(COUNTRY_INFO!F10>MAX('MDA1'!K10,'MDA4'!O10,'T1'!M10,MAX(T3_R1!L10,T3_R2!L10)),MAX('MDA1'!K10,'MDA4'!O10,'T1'!M10,MAX(T3_R1!L10,T3_R2!L10)),COUNTRY_INFO!F10),0)","v":6222.72},{"$f":"IF(AND(COUNTRY_INFO!J10>1,COUNTRY_INFO!J10<4), IF(V10/COUNTRY_INFO!F10*100<>0, IF(V10/COUNTRY_INFO!F10*100>100,100,V10/COUNTRY_INFO!F10*100), \"-\"),0)","v":46.622611822881552},{"$f":"SUM(T10,V10)","v":6222.72},{"$f":"IF(AND(COUNTRY_INFO!J10>1,COUNTRY_INFO!J10<4), IF(S10/P10*100<>0, IF(X10/P10*100>100,100,X10/P10*100), \"-\"),0)","v":27.973567093728928},{"$f":"COUNTRY_INFO!P10","v":12824.5},null,null,{"$f":"MAX('T1'!L10,'T2'!J10)+MAX('T1'!M10,'T2'!K10)+MAX('T1'!N10,'T2'!L10)","v":0},{"$f":"IF(COUNTRY_INFO!K10=1,IF(COUNTRY_INFO!F10*0.33>MAX('T1'!M10,'T2'!K10),MAX('T1'!M10,'T2'!K10),COUNTRY_INFO!F10*0.33),IF(COUNTRY_INFO!K10=2,IF(COUNTRY_INFO!F10*0.5>MAX('T1'!M10,'T2'!K10),MAX('T1'!M10,'T2'!K10),COUNTRY_INFO!F10*0.5),IF(COUNTRY_INFO!K10=3,IF(COUNTRY_INFO!F10>MAX('T1'!M10,'T2'!K10),MAX('T1'!M10,'T2'!K10),COUNTRY_INFO!F10),0)))","v":0},{"$f":"IF(AND(COUNTRY_INFO!K10>0,COUNTRY_INFO!K10<4),IF(Z10>0,IF(COUNTRY_INFO!K10=1, AD10/(COUNTRY_INFO!F10*0.33)*100, IF(COUNTRY_INFO!K10=2, AD10/(COUNTRY_INFO!F10*0.5)*100, IF(COUNTRY_INFO!K10=3, AD10/COUNTRY_INFO!F10*100))),\"-\"),0)","v":0},{"$f":"IF(COUNTRY_INFO!K10=2,IF(COUNTRY_INFO!G10*0.2>MAX('T1'!N10,'T2'!L10),MAX('T1'!N10,'T2'!L10),COUNTRY_INFO!G10*0.2),IF(COUNTRY_INFO!K10=3,IF(COUNTRY_INFO!G10>MAX('T1'!N10,'T2'!L10),MAX('T1'!N10,'T2'!L10),COUNTRY_INFO!G10),0))","v":0},{"$f":"IF(AND(COUNTRY_INFO!K10>0,COUNTRY_INFO!K10<4),IF(Z10>0,IF(COUNTRY_INFO!K10=1, 0, IF(COUNTRY_INFO!K10=2, AF10/(COUNTRY_INFO!G10*0.2)*100, IF(COUNTRY_INFO!K10=3, AF10/COUNTRY_INFO!G10*100))),\"-\"),0)","v":0},{"$f":"SUM(AD10,AF10)","v":0},{"$f":"IF(AND(COUNTRY_INFO!K10>0,COUNTRY_INFO!K10<4), IF(AC10/Z10*100<>0, IF(AH10/Z10*100>100,100,AH10/Z10*100), \"-\"),0)","v":"-"},null,{"$f":"IF(AND(D10<>0, D10<>\"Inconnu\",D10<>\"Interrompu\",D10<>\"Non requis\"),D10/COUNTRY_INFO!D10, 0)","v":1},{"$f":"IF(AND(J10<>0,J10<>\"Inconnu\",J10<>\"Interrompu\",J10<>\"Non requis\"),J10/COUNTRY_INFO!D10, 0)","v":0.57217607077354626},{"$f":"IF(AND(P10<>0,P10<>\"Inconnu\",P10<>\"Non requis\"),P10/(COUNTRY_INFO!E10+COUNTRY_INFO!F10), 0)","v":1},{"$f":"IF(AND(Z10<>0,Z10<>\"Inconnu\",Z10<>\"Non requis\"),IF(COUNTRY_INFO!K10=1,1,IF(COUNTRY_INFO!K10=2,0.5*COUNTRY_INFO!F10/(0.5*COUNTRY_INFO!F10+0.2*COUNTRY_INFO!G10),IF(COUNTRY_INFO!K10=3,COUNTRY_INFO!F10/(COUNTRY_INFO!F10+COUNTRY_INFO!G10)))),0)","v":0.5203711645678194},{"$f":"IF(AND(Z10<>0,Z10<>\"Inconnu\",Z10<>\"Non requis\"),IF(COUNTRY_INFO!K10=1,0,IF(COUNTRY_INFO!K10=2,0.2*COUNTRY_INFO!G10/(0.5*COUNTRY_INFO!F10+0.2*COUNTRY_INFO!G10),IF(COUNTRY_INFO!K10=3,COUNTRY_INFO!G10/(COUNTRY_INFO!F10+COUNTRY_INFO!G10)))),0)","v":0.4796288354321806},{"$f":"MAX(COUNTRY_INFO!D10*AK10*PROFILE!$G$7,COUNTRY_INFO!D10*AL10*PROFILE!$G$7)","v":2613.8894979327792},{"$f":"MAX(COUNTRY_INFO!D10*AK10*PROFILE!$G$8,COUNTRY_INFO!D10*AL10*PROFILE!$G$8,COUNTRY_INFO!D10*AM10*PROFILE!$G$8)","v":8898.2391639566613},{"$f":"MAX(COUNTRY_INFO!D10*AK10*PROFILE!$G$9,COUNTRY_INFO!D10*AL10*PROFILE!$G$9,COUNTRY_INFO!D10*AM10*PROFILE!$G$9,IF(AND(DISTRICT!Z10<>\"Inconnu\",Z10<>\"Non requis\"),COUNTRY_INFO!P10*DISTRICT!AN10,0))","v":13347.337844851529},{"$f":"MAX(COUNTRY_INFO!D10*AK10*PROFILE!$G$10,COUNTRY_INFO!D10*AL10*PROFILE!$G$10,IF(AND(DISTRICT!Z10<>\"Inconnu\",Z10<>\"Non requis\"),COUNTRY_INFO!P10*DISTRICT!AO10,0))","v":30754.53349325903},{"$f":"SUM(AP10:AS10)","v":55614},{"$f":"IF(COUNTIFS(AK10:AN10,\">0\")=0,0, IF(COUNTIFS(AK10:AN10,\">0\")<=IF(AND(OR(D10>=0,D10=\"Non requis\",D10=\"Inconnu\",D10=\"Interrompu\"),D10>0,H10>0),1,0)+IF(AND(OR(J10>=0,J10=\"Non requis\",J10=\"Inconnu\",J10=\"Interrompu\"),J10>0,N10>0),1,0)+IF(AND(OR(P10>=0,P10=\"Non requis\",P10=\"Inconnu\"),P10>0,X10>0),1,0)+IF(AND(OR(Z10>=0,Z10=\"Non requis\",Z10=\"Inconnu\"),Z10>0,AH10>0),1,0),\"Y\",0))","v":0},{"$f":"MAX('MDA4'!R10,'T1'!L10,'T2'!J10,T3_R1!K10,T3_R2!K10)","v":0},{"$f":"MAX('MDA1'!K10,'MDA4'!S10,'MDA3'!I10,'MDA3'!L10,'T1'!M10,'T2'!K10,T3_R1!L10,T3_R2!L10)","v":6222.72},{"$f":"MAX('MDA1'!L10,'MDA4'!T10,'MDA3'!J10,'MDA3'!M10,'T1'!N10,'T2'!L10,T3_R1!M10,T3_R2!M10)","v":19705.28},{"$f":"SUM(AV10:AX10)","v":25928},{"$f":"MAX('MDA4'!R10,T10)","v":0},{"$f":"MAX('MDA1'!K10,'MDA4'!S10,'MDA3'!I10,'MDA3'!L10,V10,AD10)","v":6222.72},{"$f":"MAX('MDA1'!L10,'MDA4'!T10,'MDA3'!J10,'MDA3'!M10,AF10)","v":19705.28},{"$f":"IF(AT10<SUM(AZ10:BB10), AT10,SUM(AZ10:BB10))","v":25928},{"$f":"IF(AT10<>0,BC10/AT10*100,0)","v":46.621354335239332}]
[{"$f":"IF(COUNTRY_INFO!A11=0,\" \",COUNTRY_INFO!A11)","v":" Congo"},{"$f":"IF(COUNTRY_INFO!B11=0,\" \",COUNTRY_INFO!B11)","v":"Bouenza"},{"$f":"IF(COUNTRY_INFO!C11=0,\" \",COUNTRY_INFO!C11)","v":"Madingou"},{"$f":"COUNTRY_INFO!M11","v":105844},7760,7861,{"$f":"SUM('MDA1'!M11,'MDA4'!U11)","v":56060},{"$f":"IF(AND(COUNTRY_INFO!H11>0,COUNTRY_INFO!H11<4),IF(D11>MAX('MDA1'!M11,'MDA4'!U11),MAX('MDA1'!M11,'MDA4'!U11),D11),0)","v":40439},{"$f":"IF(AND(COUNTRY_INFO!H11>0,COUNTRY_INFO!H11<4), IF(G11/D11*100<>0, IF(G11/D11*100>100,100,G11/D11*100), \"-\"),0)","v":52.964740561581195},{"$f":"COUNTRY_INFO!N11","v":48422},9705.36,30733.64,{"$f":"MAX('MDA1'!M11,MAX('MDA3'!I11,'MDA3'!L11)+MAX('MDA3'!J11,'MDA3'!M11))","v":40439},{"$f":"IF(AND(COUNTRY_INFO!I11>0,COUNTRY_INFO!I11<4),IF(J11>MAX('MDA1'!M11,MAX('MDA3'!I11,'MDA3'!L11)+MAX('MDA3'!J11,'MDA3'!M11)),MAX('MDA1'!M11,MAX('MDA3'!I11,'MDA3'!L11)+MAX('MDA3'!J11,'MDA3'!M11)),J11),0)","v":40439},{"$f":"IF(AND(COUNTRY_INFO!I11>0,COUNTRY_INFO!I11<4), IF(M11/J11*100<>0, IF(M11/J11*100>100,100,M11/J11*100), \"-\"),0)","v":83.51369212341497},{"$f":"COUNTRY_INFO!O11","v":0},null,null,{"$f":"SUM(MAX('MDA4'!N11, 'T1'!L11, MAX(T3_R1!K11, T3_R2!K11)), MAX('MDA1'!K11, 'MDA4'!O11, 'T1'!M11, MAX(T3_R1!L11, T3_R2!L11)), MAX('MDA1'!L11, 'MDA4'!P11, 'T1'!N11, MAX(T3_R1!M11, T3_R2!M11)))","v":40439},{"$f":"IF(AND(COUNTRY_INFO!J11>1,COUNTRY_INFO!J11<4),IF(COUNTRY_INFO!E11>MAX('MDA4'!N11,'T1'!L11,MAX(T3_R1!K11,T3_R2!K11)),MAX('MDA4'!N11,'T1'!L11,MAX(T3_R1!K11,T3_R2!K11)),COUNTRY_INFO!E11),0)","v":0},{"$f":"IF(AND(COUNTRY_INFO!J11>1,COUNTRY_INFO!J11<4), IF(T11/COUNTRY_INFO!E11*100<>0, IF(T11/COUNTRY_INFO!E11*100>100,100,T11/COUNTRY_INFO!E11*100), \"-\"),0)","v":0},{"$f":"IF(AND(COUNTRY_INFO!J11>1,COUNTRY_INFO!J11<4),IF(COUNTRY_INFO!F11>MAX('MDA1'!K11,'MDA4'!O11,'T1'!M11,MAX(T3_R1!L11,T3_R2!L11)),MAX('MDA1'!K11,'MDA4'!O11,'T1'!M11,MAX(T3_R1!L11,T3_R2!L11)),COUNTRY_INFO!F11),0)","v":0},{"$f":"IF(AND(COUNTRY_INFO!J11>1,COUNTRY_INFO!J11<4), IF(V11/COUNTRY_INFO!F11*100<>0, IF(V11/COUNTRY_INFO!F11*100>100,100,V11/COUNTRY_INFO!F11*100), \"-\"),0)","v":0},0,{"$f":"IF(AND(COUNTRY_INFO!J11>1,COUNTRY_INFO!J11<4), IF(S11/P11*100<>0, IF(X11/P11*100>100,100,X11/P11*100), \"-\"),0)","v":0},{"$f":"COUNTRY_INFO!P11","v":0},null,null,{"$f":"MAX('T1'!L11,'T2'!J11)+MAX('T1'!M11,'T2'!K11)+MAX('T1'!N11,'T2'!L11)","v":0},{"$f":"IF(COUNTRY_INFO!K11=1,IF(COUNTRY_INFO!F11*0.33>MAX('T1'!M11,'T2'!K11),MAX('T1'!M11,'T2'!K11),COUNTRY_INFO!F11*0.33),IF(COUNTRY_INFO!K11=2,IF(COUNTRY_INFO!F11*0.5>MAX('T1'!M11,'T2'!K11),MAX('T1'!M11,'T2'!K11),COUNTRY_INFO!F11*0.5),IF(COUNTRY_INFO!K11=3,IF(COUNTRY_INFO!F11>MAX('T1'!M11,'T2'!K11),MAX('T1'!M11,'T2'!K11),COUNTRY_INFO!F11),0)))","v":0},{"$f":"IF(AND(COUNTRY_INFO!K11>0,COUNTRY_INFO!K11<4),IF(Z11>0,IF(COUNTRY_INFO!K11=1, AD11/(COUNTRY_INFO!F11*0.33)*100, IF(COUNTRY_INFO!K11=2, AD11/(COUNTRY_INFO!F11*0.5)*100, IF(COUNTRY_INFO!K11=3, AD11/COUNTRY_INFO!F11*100))),\"-\"),0)","v":0},{"$f":"IF(COUNTRY_INFO!K11=2,IF(COUNTRY_INFO!G11*0.2>MAX('T1'!N11,'T2'!L11),MAX('T1'!N11,'T2'!L11),COUNTRY_INFO!G11*0.2),IF(COUNTRY_INFO!K11=3,IF(COUNTRY_INFO!G11>MAX('T1'!N11,'T2'!L11),MAX('T1'!N11,'T2'!L11),COUNTRY_INFO!G11),0))","v":0},{"$f":"IF(AND(COUNTRY_INFO!K11>0,COUNTRY_INFO!K11<4),IF(Z11>0,IF(COUNTRY_INFO!K11=1, 0, IF(COUNTRY_INFO!K11=2, AF11/(COUNTRY_INFO!G11*0.2)*100, IF(COUNTRY_INFO!K11=3, AF11/COUNTRY_INFO!G11*100))),\"-\"),0)","v":0},0,{"$f":"IF(AND(COUNTRY_INFO!K11>0,COUNTRY_INFO!K11<4), IF(AC11/Z11*100<>0, IF(AH11/Z11*100>100,100,AH11/Z11*100), \"-\"),0)","v":0},null,{"$f":"IF(AND(D11<>0, D11<>\"Inconnu\",D11<>\"Interrompu\",D11<>\"Non requis\"),D11/COUNTRY_INFO!D11, 0)","v":1},{"$f":"IF(AND(J11<>0,J11<>\"Inconnu\",J11<>\"Interrompu\",J11<>\"Non requis\"),J11/COUNTRY_INFO!D11, 0)","v":0.4574845999773251},{"$f":"IF(AND(P11<>0,P11<>\"Inconnu\",P11<>\"Non requis\"),P11/(COUNTRY_INFO!E11+COUNTRY_INFO!F11), 0)","v":0},{"$f":"IF(AND(Z11<>0,Z11<>\"Inconnu\",Z11<>\"Non requis\"),IF(COUNTRY_INFO!K11=1,1,IF(COUNTRY_INFO!K11=2,0.5*COUNTRY_INFO!F11/(0.5*COUNTRY_INFO!F11+0.2*COUNTRY_INFO!G11),IF(COUNTRY_INFO!K11=3,COUNTRY_INFO!F11/(COUNTRY_INFO!F11+COUNTRY_INFO!G11)))),0)","v":0},{"$f":"IF(AND(Z11<>0,Z11<>\"Inconnu\",Z11<>\"Non requis\"),IF(COUNTRY_INFO!K11=1,0,IF(COUNTRY_INFO!K11=2,0.2*COUNTRY_INFO!G11/(0.5*COUNTRY_INFO!F11+0.2*COUNTRY_INFO!G11),IF(COUNTRY_INFO!K11=3,COUNTRY_INFO!G11/(COUNTRY_INFO!F11+COUNTRY_INFO!G11)))),0)","v":0},{"$f":"MAX(COUNTRY_INFO!D11*AK11*PROFILE!$G$7,COUNTRY_INFO!D11*AL11*PROFILE!$G$7)","v":4974.7279465457814},{"$f":"MAX(COUNTRY_INFO!D11*AK11*PROFILE!$G$8,COUNTRY_INFO!D11*AL11*PROFILE!$G$8,COUNTRY_INFO!D11*AM11*PROFILE!$G$8)","v":16935.038408850807},{"$f":"MAX(COUNTRY_INFO!D11*AK11*PROFILE!$G$9,COUNTRY_INFO!D11*AL11*PROFILE!$G$9,COUNTRY_INFO!D11*AM11*PROFILE!$G$9,IF(AND(DISTRICT!Z11<>\"Inconnu\",Z11<>\"Non requis\"),COUNTRY_INFO!P11*DISTRICT!AN11,0))","v":25402.51783454643},{"$f":"MAX(COUNTRY_INFO!D11*AK11*PROFILE!$G$10,COUNTRY_INFO!D11*AL11*PROFILE!$G$10,IF(AND(DISTRICT!Z11<>\"Inconnu\",Z11<>\"Non requis\"),COUNTRY_INFO!P11*DISTRICT!AO11,0))","v":58531.71581005698},105844,"Y",{"$f":"MAX('MDA4'!R11,'T1'!L11,'T2'!J11,T3_R1!K11,T3_R2!K11)","v":0},{"$f":"MAX('MDA1'!K11,'MDA4'!S11,'MDA3'!I11,'MDA3'!L11,'T1'!M11,'T2'!K11,T3_R1!L11,T3_R2!L11)","v":9705.36},{"$f":"MAX('MDA1'!L11,'MDA4'!T11,'MDA3'!J11,'MDA3'!M11,'T1'!N11,'T2'!L11,T3_R1!M11,T3_R2!M11)","v":30733.64},40439,{"$f":"MAX('MDA4'!R11,T11)","v":0},{"$f":"MAX('MDA1'!K11,'MDA4'!S11,'MDA3'!I11,'MDA3'!L11,V11,AD11)","v":9705.36},{"$f":"MAX('MDA1'!L11,'MDA4'!T11,'MDA3'!J11,'MDA3'!M11,AF11)","v":30733.64},40439,38.206228033709991]
[{"$f":"IF(COUNTRY_INFO!A12=0,\" \",COUNTRY_INFO!A12)","v":" Congo"},{"$f":"IF(COUNTRY_INFO!B12=0,\" \",COUNTRY_INFO!B12)","v":"Bouenza"},{"$f":"IF(COUNTRY_INFO!C12=0,\" \",COUNTRY_INFO!C12)","v":"Mouyondzi"},{"$f":"COUNTRY_INFO!M12","v":84145},3181,3464,{"$f":"SUM('MDA1'!M12,'MDA4'!U12)","v":40328},{"$f":"IF(AND(COUNTRY_INFO!H12>0,COUNTRY_INFO!H12<4),IF(D12>MAX('MDA1'!M12,'MDA4'!U12),MAX('MDA1'!M12,'MDA4'!U12),D12),0)","v":33683},{"$f":"IF(AND(COUNTRY_INFO!H12>0,COUNTRY_INFO!H12<4), IF(G12/D12*100<>0, IF(G12/D12*100>100,100,G12/D12*100), \"-\"),0)","v":47.926793035831004},{"$f":"COUNTRY_INFO!N12","v":40579},8083.92,25599.08,{"$f":"MAX('MDA1'!M12,MAX('MDA3'!I12,'MDA3'!L12)+MAX('MDA3'!J12,'MDA3'!M12))","v":33683},{"$f":"IF(AND(COUNTRY_INFO!I12>0,COUNTRY_INFO!I12<4),IF(J12>MAX('MDA1'!M12,MAX('MDA3'!I12,'MDA3'!L12)+MAX('MDA3'!J12,'MDA3'!M12)),MAX('MDA1'!M12,MAX('MDA3'!I12,'MDA3'!L12)+MAX('MDA3'!J12,'MDA3'!M12)),J12),0)","v":33683},{"$f":"IF(AND(COUNTRY_INFO!I12>0,COUNTRY_INFO!I12<4), IF(M12/J12*100<>0, IF(M12/J12*100>100,100,M12/J12*100), \"-\"),0)","v":83.005988319081297},{"$f":"COUNTRY_INFO!O12","v":33658},null,null,{"$f":"SUM(MAX('MDA4'!N12, 'T1'!L12, MAX(T3_R1!K12, T3_R2!K12)), MAX('MDA1'!K12, 'MDA4'!O12, 'T1'!M12, MAX(T3_R1!L12, T3_R2!L12)), MAX('MDA1'!L12, 'MDA4'!P12, 'T1'!N12, MAX(T3_R1!M12, T3_R2!M12)))","v":33683},{"$f":"IF(AND(COUNTRY_INFO!J12>1,COUNTRY_INFO!J12<4),IF(COUNTRY_INFO!E12>MAX('MDA4'!N12,'T1'!L12,MAX(T3_R1!K12,T3_R2!K12)),MAX('MDA4'!N12,'T1'!L12,MAX(T3_R1!K12,T3_R2!K12)),COUNTRY_INFO!E12),0)","v":0},{"$f":"IF(AND(COUNTRY_INFO!J12>1,COUNTRY_INFO!J12<4), IF(T12/COUNTRY_INFO!E12*100<>0, IF(T12/COUNTRY_INFO!E12*100>100,100,T12/COUNTRY_INFO!E12*100), \"-\"),0)","v":"-"},{"$f":"IF(AND(COUNTRY_INFO!J12>1,COUNTRY_INFO!J12<4),IF(COUNTRY_INFO!F12>MAX('MDA1'!K12,'MDA4'!O12,'T1'!M12,MAX(T3_R1!L12,T3_R2!L12)),MAX('MDA1'!K12,'MDA4'!O12,'T1'!M12,MAX(T3_R1!L12,T3_R2!L12)),COUNTRY_INFO!F12),0)","v":8083.92},{"$f":"IF(AND(COUNTRY_INFO!J12>1,COUNTRY_INFO!J12<4), IF(V12/COUNTRY_INFO!F12*100<>0, IF(V12/COUNTRY_INFO!F12*100>100,100,V12/COUNTRY_INFO!F12*100), \"-\"),0)","v":40.029314186679869},8083.92,{"$f":"IF(AND(COUNTRY_INFO!J12>1,COUNTRY_INFO!J12<4), IF(S12/P12*100<>0, IF(X12/P12*100>100,100,X12/P12*100), \"-\"),0)","v":24.017826371145048},{"$f":"COUNTRY_INFO!P12","v":66727},null,null,{"$f":"MAX('T1'!L12,'T2'!J12)+MAX('T1'!M12,'T2'!K12)+MAX('T1'!N12,'T2'!L12)","v":0},{"$f":"IF(COUNTRY_INFO!K12=1,IF(COUNTRY_INFO!F12*0.33>MAX('T1'!M12,'T2'!K12),MAX('T1'!M12,'T2'!K12),COUNTRY_INFO!F12*0.33),IF(COUNTRY_INFO!K12=2,IF(COUNTRY_INFO!F12*0.5>MAX('T1'!M12,'T2'!K12),MAX('T1'!M12,'T2'!K12),COUNTRY_INFO!F12*0.5),IF(COUNTRY_INFO!K12=3,IF(COUNTRY_INFO!F12>MAX('T1'!M12,'T2'!K12),MAX('T1'!M12,'T2'!K12),COUNTRY_INFO!F12),0)))","v":0},{"$f":"IF(AND(COUNTRY_INFO!K12>0,COUNTRY_INFO!K12<4),IF(Z12>0,IF(COUNTRY_INFO!K12=1, AD12/(COUNTRY_INFO!F12*0.33)*100, IF(COUNTRY_INFO!K12=2, AD12/(COUNTRY_INFO!F12*0.5)*100, IF(COUNTRY_INFO!K12=3, AD12/COUNTRY_INFO!F12*100))),\"-\"),0)","v":0},{"$f":"IF(COUNTRY_INFO!K12=2,IF(COUNTRY_INFO!G12*0.2>MAX('T1'!N12,'T2'!L12),MAX('T1'!N12,'T2'!L12),COUNTRY_INFO!G12*0.2),IF(COUNTRY_INFO!K12=3,IF(COUNTRY_INFO!G12>MAX('T1'!N12,'T2'!L12),MAX('T1'!N12,'T2'!L12),COUNTRY_INFO!G12),0))","v":0},{"$f":"IF(AND(COUNTRY_INFO!K12>0,COUNTRY_INFO!K12<4),IF(Z12>0,IF(COUNTRY_INFO!K12=1, 0, IF(COUNTRY_INFO!K12=2, AF12/(COUNTRY_INFO!G12*0.2)*100, IF(COUNTRY_INFO!K12=3, AF12/COUNTRY_INFO!G12*100))),\"-\"),0)","v":0},0,{"$f":"IF(AND(COUNTRY_INFO!K12>0,COUNTRY_INFO!K12<4), IF(AC12/Z12*100<>0, IF(AH12/Z12*100>100,100,AH12/Z12*100), \"-\"),0)","v":"-"},null,{"$f":"IF(AND(D12<>0, D12<>\"Inconnu\",D12<>\"Interrompu\",D12<>\"Non requis\"),D12/COUNTRY_INFO!D12, 0)","v":1},{"$f":"IF(AND(J12<>0,J12<>\"Inconnu\",J12<>\"Interrompu\",J12<>\"Non requis\"),J12/COUNTRY_INFO!D12, 0)","v":0.48225087646324799},{"$f":"IF(AND(P12<>0,P12<>\"Inconnu\",P12<>\"Non requis\"),P12/(COUNTRY_INFO!E12+COUNTRY_INFO!F12), 0)","v":1},{"$f":"IF(AND(Z12<>0,Z12<>\"Inconnu\",Z12<>\"Non requis\"),IF(COUNTRY_INFO!K12=1,1,IF(COUNTRY_INFO!K12=2,0.5*COUNTRY_INFO!F12/(0.5*COUNTRY_INFO!F12+0.2*COUNTRY_INFO!G12),IF(COUNTRY_INFO!K12=3,COUNTRY_INFO!F12/(COUNTRY_INFO!F12+COUNTRY_INFO!G12)))),0)","v":0.30265110075381779},{"$f":"IF(AND(Z12<>0,Z12<>\"Inconnu\",Z12<>\"Non requis\"),IF(COUNTRY_INFO!K12=1,0,IF(COUNTRY_INFO!K12=2,0.2*COUNTRY_INFO!G12/(0.5*COUNTRY_INFO!F12+0.2*COUNTRY_INFO!G12),IF(COUNTRY_INFO!K12=3,COUNTRY_INFO!G12/(COUNTRY_INFO!F12+COUNTRY_INFO!G12)))),0)","v":0.69734889924618215},{"$f":"MAX(COUNTRY_INFO!D12*AK12*PROFILE!$G$7,COUNTRY_INFO!D12*AL12*PROFILE!$G$7)","v":3954.862656948857},{"$f":"MAX(COUNTRY_INFO!D12*AK12*PROFILE!$G$8,COUNTRY_INFO!D12*AL12*PROFILE!$G$8,COUNTRY_INFO!D12*AM12*PROFILE!$G$8)","v":13463.198735051124},{"$f":"MAX(COUNTRY_INFO!D12*AK12*PROFILE!$G$9,COUNTRY_INFO!D12*AL12*PROFILE!$G$9,COUNTRY_INFO!D12*AM12*PROFILE!$G$9,IF(AND(DISTRICT!Z12<>\"Inconnu\",Z12<>\"Non requis\"),COUNTRY_INFO!P12*DISTRICT!AN12,0))","v":20195},{"$f":"MAX(COUNTRY_INFO!D12*AK12*PROFILE!$G$10,COUNTRY_INFO!D12*AL12*PROFILE!$G$10,IF(AND(DISTRICT!Z12<>\"Inconnu\",Z12<>\"Non requis\"),COUNTRY_INFO!P12*DISTRICT!AO12,0))","v":46532.172129145205},84145.233521145186,0,{"$f":"MAX('MDA4'!R12,'T1'!L12,'T2'!J12,T3_R1!K12,T3_R2!K12)","v":0},{"$f":"MAX('MDA1'!K12,'MDA4'!S12,'MDA3'!I12,'MDA3'!L12,'T1'!M12,'T2'!K12,T3_R1!L12,T3_R2!L12)","v":8083.92},{"$f":"MAX('MDA1'!L12,'MDA4'!T12,'MDA3'!J12,'MDA3'!M12,'T1'!N12,'T2'!L12,T3_R1!M12,T3_R2!M12)","v":25599.08},33683,{"$f":"MAX('MDA4'!R12,T12)","v":0},{"$f":"MAX('MDA1'!K12,'MDA4'!S12,'MDA3'!I12,'MDA3'!L12,V12,AD12)","v":8083.92},{"$f":"MAX('MDA1'!L12,'MDA4'!T12,'MDA3'!J12,'MDA3'!M12,AF12)","v":25599.08},33683,40.029599527507003]
[{"$f":"IF(COUNTRY_INFO!A13=0,\" \",COUNTRY_INFO!A13)","v":" Congo"},{"$f":"IF(COUNTRY_INFO!B13=0,\" \",COUNTRY_INFO!B13)","v":"Bouenza"},{"$f":"IF(COUNTRY_INFO!C13=0,\" \",COUNTRY_INFO!C13)","v":"Nkayi"},{"$f":"COUNTRY_INFO!M13","v":0},null,null,{"$f":"SUM('MDA1'!M13,'MDA4'!U13)","v":0},{"$f":"IF(AND(COUNTRY_INFO!H13>0,COUNTRY_INFO!H13<4),IF(D13>MAX('MDA1'!M13,'MDA4'!U13),MAX('MDA1'!M13,'MDA4'!U13),D13),0)","v":0},{"$f":"IF(AND(COUNTRY_INFO!H13>0,COUNTRY_INFO!H13<4), IF(G13/D13*100<>0, IF(G13/D13*100>100,100,G13/D13*100), \"-\"),0)","v":0},{"$f":"COUNTRY_INFO!N13","v":38249},14188,16090,{"$f":"MAX('MDA1'!M13,MAX('MDA3'!I13,'MDA3'!L13)+MAX('MDA3'!J13,'MDA3'!M13))","v":30278},{"$f":"IF(AND(COUNTRY_INFO!I13>0,COUNTRY_INFO!I13<4),IF(J13>MAX('MDA1'!M13,MAX('MDA3'!I13,'MDA3'!L13)+MAX('MDA3'!J13,'MDA3'!M13)),MAX('MDA1'!M13,MAX('MDA3'!I13,'MDA3'!L13)+MAX('MDA3'!J13,'MDA3'!M13)),J13),0)","v":30278},{"$f":"IF(AND(COUNTRY_INFO!I13>0,COUNTRY_INFO!I13<4), IF(M13/J13*100<>0, IF(M13/J13*100>100,100,M13/J13*100), \"-\"),0)","v":79.160239483385183},{"$f":"COUNTRY_INFO!O13","v":50685},null,null,{"$f":"SUM(MAX('MDA4'!N13, 'T1'!L13, MAX(T3_R1!K13, T3_R2!K13)), MAX('MDA1'!K13, 'MDA4'!O13, 'T1'!M13, MAX(T3_R1!L13, T3_R2!L13)), MAX('MDA1'!L13, 'MDA4'!P13, 'T1'!N13, MAX(T3_R1!M13, T3_R2!M13)))","v":0},{"$f":"IF(AND(COUNTRY_INFO!J13>1,COUNTRY_INFO!J13<4),IF(COUNTRY_INFO!E13>MAX('MDA4'!N13,'T1'!L13,MAX(T3_R1!K13,T3_R2!K13)),MAX('MDA4'!N13,'T1'!L13,MAX(T3_R1!K13,T3_R2!K13)),COUNTRY_INFO!E13),0)","v":0},{"$f":"IF(AND(COUNTRY_INFO!J13>1,COUNTRY_INFO!J13<4), IF(T13/COUNTRY_INFO!E13*100<>0, IF(T13/COUNTRY_INFO!E13*100>100,100,T13/COUNTRY_INFO!E13*100), \"-\"),0)","v":"-"},{"$f":"IF(AND(COUNTRY_INFO!J13>1,COUNTRY_INFO!J13<4),IF(COUNTRY_INFO!F13>MAX('MDA1'!K13,'MDA4'!O13,'T1'!M13,MAX(T3_R1!L13,T3_R2!L13)),MAX('MDA1'!K13,'MDA4'!O13,'T1'!M13,MAX(T3_R1!L13,T3_R2!L13)),COUNTRY_INFO!F13),0)","v":0},{"$f":"IF(AND(COUNTRY_INFO!J13>1,COUNTRY_INFO!J13<4), IF(V13/COUNTRY_INFO!F13*100<>0, IF(V13/COUNTRY_INFO!F13*100>100,100,V13/COUNTRY_INFO!F13*100), \"-\"),0)","v":"-"},0,{"$f":"IF(AND(COUNTRY_INFO!J13>1,COUNTRY_INFO!J13<4), IF(S13/P13*100<>0, IF(X13/P13*100>100,100,X13/P13*100), \"-\"),0)","v":"-"},{"$f":"COUNTRY_INFO!P13","v":0},null,null,{"$f":"MAX('T1'!L13,'T2'!J13)+MAX('T1'!M13,'T2'!K13)+MAX('T1'!N13,'T2'!L13)","v":0},{"$f":"IF(COUNTRY_INFO!K13=1,IF(COUNTRY_INFO!F13*0.33>MAX('T1'!M13,'T2'!K13),MAX('T1'!M13,'T2'!K13),COUNTRY_INFO!F13*0.33),IF(COUNTRY_INFO!K13=2,IF(COUNTRY_INFO!F13*0.5>MAX('T1'!M13,'T2'!K13),MAX('T1'!M13,'T2'!K13),COUNTRY_INFO!F13*0.5),IF(COUNTRY_INFO!K13=3,IF(COUNTRY_INFO!F13>MAX('T1'!M13,'T2'!K13),MAX('T1'!M13,'T2'!K13),COUNTRY_INFO!F13),0)))","v":0},{"$f":"IF(AND(COUNTRY_INFO!K13>0,COUNTRY_INFO!K13<4),IF(Z13>0,IF(COUNTRY_INFO!K13=1, AD13/(COUNTRY_INFO!F13*0.33)*100, IF(COUNTRY_INFO!K13=2, AD13/(COUNTRY_INFO!F13*0.5)*100, IF(COUNTRY_INFO!K13=3, AD13/COUNTRY_INFO!F13*100))),\"-\"),0)","v":0},{"$f":"IF(COUNTRY_INFO!K13=2,IF(COUNTRY_INFO!G13*0.2>MAX('T1'!N13,'T2'!L13),MAX('T1'!N13,'T2'!L13),COUNTRY_INFO!G13*0.2),IF(COUNTRY_INFO!K13=3,IF(COUNTRY_INFO!G13>MAX('T1'!N13,'T2'!L13),MAX('T1'!N13,'T2'!L13),COUNTRY_INFO!G13),0))","v":0},{"$f":"IF(AND(COUNTRY_INFO!K13>0,COUNTRY_INFO!K13<4),IF(Z13>0,IF(COUNTRY_INFO!K13=1, 0, IF(COUNTRY_INFO!K13=2, AF13/(COUNTRY_INFO!G13*0.2)*100, IF(COUNTRY_INFO!K13=3, AF13/COUNTRY_INFO!G13*100))),\"-\"),0)","v":0},0,{"$f":"IF(AND(COUNTRY_INFO!K13>0,COUNTRY_INFO!K13<4), IF(AC13/Z13*100<>0, IF(AH13/Z13*100>100,100,AH13/Z13*100), \"-\"),0)","v":0},null,{"$f":"IF(AND(D13<>0, D13<>\"Inconnu\",D13<>\"Interrompu\",D13<>\"Non requis\"),D13/COUNTRY_INFO!D13, 0)","v":0},{"$f":"IF(AND(J13<>0,J13<>\"Inconnu\",J13<>\"Interrompu\",J13<>\"Non requis\"),J13/COUNTRY_INFO!D13, 0)","v":0.30185299177675712},{"$f":"IF(AND(P13<>0,P13<>\"Inconnu\",P13<>\"Non requis\"),P13/(COUNTRY_INFO!E13+COUNTRY_INFO!F13), 0)","v":1},{"$f":"IF(AND(Z13<>0,Z13<>\"Inconnu\",Z13<>\"Non requis\"),IF(COUNTRY_INFO!K13=1,1,IF(COUNTRY_INFO!K13=2,0.5*COUNTRY_INFO!F13/(0.5*COUNTRY_INFO!F13+0.2*COUNTRY_INFO!G13),IF(COUNTRY_INFO!K13=3,COUNTRY_INFO!F13/(COUNTRY_INFO!F13+COUNTRY_INFO!G13)))),0)","v":0},{"$f":"IF(AND(Z13<>0,Z13<>\"Inconnu\",Z13<>\"Non requis\"),IF(COUNTRY_INFO!K13=1,0,IF(COUNTRY_INFO!K13=2,0.2*COUNTRY_INFO!G13/(0.5*COUNTRY_INFO!F13+0.2*COUNTRY_INFO!G13),IF(COUNTRY_INFO!K13=3,COUNTRY_INFO!G13/(COUNTRY_INFO!F13+COUNTRY_INFO!G13)))),0)","v":0},{"$f":"MAX(COUNTRY_INFO!D13*AK13*PROFILE!$G$7,COUNTRY_INFO!D13*AL13*PROFILE!$G$7)","v":1797.7246629703111},{"$f":"MAX(COUNTRY_INFO!D13*AK13*PROFILE!$G$8,COUNTRY_INFO!D13*AL13*PROFILE!$G$8,COUNTRY_INFO!D13*AM13*PROFILE!$G$8)","v":20274.238095112818},{"$f":"MAX(COUNTRY_INFO!D13*AK13*PROFILE!$G$9,COUNTRY_INFO!D13*AL13*PROFILE!$G$9,COUNTRY_INFO!D13*AM13*PROFILE!$G$9,IF(AND(DISTRICT!Z13<>\"Inconnu\",Z13<>\"Non requis\"),COUNTRY_INFO!P13*DISTRICT!AN13,0))","v":30411.309520489744},{"$f":"MAX(COUNTRY_INFO!D13*AK13*PROFILE!$G$10,COUNTRY_INFO!D13*AL13*PROFILE!$G$10,IF(AND(DISTRICT!Z13<>\"Inconnu\",Z13<>\"Non requis\"),COUNTRY_INFO!P13*DISTRICT!AO13,0))","v":21151.69114941678},73634.963427989656,0,{"$f":"MAX('MDA4'!R13,'T1'!L13,'T2'!J13,T3_R1!K13,T3_R2!K13)","v":0},{"$f":"MAX('MDA1'!K13,'MDA4'!S13,'MDA3'!I13,'MDA3'!L13,'T1'!M13,'T2'!K13,T3_R1!L13,T3_R2!L13)","v":7266.72},{"$f":"MAX('MDA1'!L13,'MDA4'!T13,'MDA3'!J13,'MDA3'!M13,'T1'!N13,'T2'!L13,T3_R1!M13,T3_R2!M13)","v":23011.279999999999},30278,{"$f":"MAX('MDA4'!R13,T13)","v":0},{"$f":"MAX('MDA1'!K13,'MDA4'!S13,'MDA3'!I13,'MDA3'!L13,V13,AD13)","v":7266.72},{"$f":"MAX('MDA1'!L13,'MDA4'!T13,'MDA3'!J13,'MDA3'!M13,AF13)","v":23011.279999999999},30278,41.119053490954705]
[{"$f":"IF(COUNTRY_INFO!A14=0,\" \",COUNTRY_INFO!A14)","v":" Congo"},{"$f":"IF(COUNTRY_INFO!B14=0,\" \",COUNTRY_INFO!B14)","v":"Brazzaville"},{"$f":"IF(COUNTRY_INFO!C14=0,\" \",COUNTRY_INFO!C14)","v":"Bacongo"},{"$f":"COUNTRY_INFO!M14","v":0},null,null,{"$f":"SUM('MDA1'!M14,'MDA4'!U14)","v":0},{"$f":"IF(AND(COUNTRY_INFO!H14>0,COUNTRY_INFO!H14<4),IF(D14>MAX('MDA1'!M14,'MDA4'!U14),MAX('MDA1'!M14,'MDA4'!U14),D14),0)","v":0},{"$f":"IF(AND(COUNTRY_INFO!H14>0,COUNTRY_INFO!H14<4), IF(G14/D14*100<>0, IF(G14/D14*100>100,100,G14/D14*100), \"-\"),0)","v":0},{"$f":"COUNTRY_INFO!N14","v":122326},31248,68429,{"$f":"MAX('MDA1'!M14,MAX('MDA3'!I14,'MDA3'!L14)+MAX('MDA3'!J14,'MDA3'!M14))","v":99677},{"$f":"IF(AND(COUNTRY_INFO!I14>0,COUNTRY_INFO!I14<4),IF(J14>MAX('MDA1'!M14,MAX('MDA3'!I14,'MDA3'!L14)+MAX('MDA3'!J14,'MDA3'!M14)),MAX('MDA1'!M14,MAX('MDA3'!I14,'MDA3'!L14)+MAX('MDA3'!J14,'MDA3'!M14)),J14),0)","v":99677},{"$f":"IF(AND(COUNTRY_INFO!I14>0,COUNTRY_INFO!I14<4), IF(M14/J14*100<>0, IF(M14/J14*100>100,100,M14/J14*100), \"-\"),0)","v":81.484721154946612},{"$f":"COUNTRY_INFO!O14","v":0},null,null,{"$f":"SUM(MAX('MDA4'!N14, 'T1'!L14, MAX(T3_R1!K14, T3_R2!K14)), MAX('MDA1'!K14, 'MDA4'!O14, 'T1'!M14, MAX(T3_R1!L14, T3_R2!L14)), MAX('MDA1'!L14, 'MDA4'!P14, 'T1'!N14, MAX(T3_R1!M14, T3_R2!M14)))","v":0},{"$f":"IF(AND(COUNTRY_INFO!J14>1,COUNTRY_INFO!J14<4),IF(COUNTRY_INFO!E14>MAX('MDA4'!N14,'T1'!L14,MAX(T3_R1!K14,T3_R2!K14)),MAX('MDA4'!N14,'T1'!L14,MAX(T3_R1!K14,T3_R2!K14)),COUNTRY_INFO!E14),0)","v":0},{"$f":"IF(AND(COUNTRY_INFO!J14>1,COUNTRY_INFO!J14<4), IF(T14/COUNTRY_INFO!E14*100<>0, IF(T14/COUNTRY_INFO!E14*100>100,100,T14/COUNTRY_INFO!E14*100), \"-\"),0)","v":0},{"$f":"IF(AND(COUNTRY_INFO!J14>1,COUNTRY_INFO!J14<4),IF(COUNTRY_INFO!F14>MAX('MDA1'!K14,'MDA4'!O14,'T1'!M14,MAX(T3_R1!L14,T3_R2!L14)),MAX('MDA1'!K14,'MDA4'!O14,'T1'!M14,MAX(T3_R1!L14,T3_R2!L14)),COUNTRY_INFO!F14),0)","v":0},{"$f":"IF(AND(COUNTRY_INFO!J14>1,COUNTRY_INFO!J14<4), IF(V14/COUNTRY_INFO!F14*100<>0, IF(V14/COUNTRY_INFO!F14*100>100,100,V14/COUNTRY_INFO!F14*100), \"-\"),0)","v":0},0,{"$f":"IF(AND(COUNTRY_INFO!J14>1,COUNTRY_INFO!J14<4), IF(S14/P14*100<>0, IF(X14/P14*100>100,100,X14/P14*100), \"-\"),0)","v":0},{"$f":"COUNTRY_INFO!P14","v":"Inconnu"},null,null,{"$f":"MAX('T1'!L14,'T2'!J14)+MAX('T1'!M14,'T2'!K14)+MAX('T1'!N14,'T2'!L14)","v":0},{"$f":"IF(COUNTRY_INFO!K14=1,IF(COUNTRY_INFO!F14*0.33>MAX('T1'!M14,'T2'!K14),MAX('T1'!M14,'T2'!K14),COUNTRY_INFO!F14*0.33),IF(COUNTRY_INFO!K14=2,IF(COUNTRY_INFO!F14*0.5>MAX('T1'!M14,'T2'!K14),MAX('T1'!M14,'T2'!K14),COUNTRY_INFO!F14*0.5),IF(COUNTRY_INFO!K14=3,IF(COUNTRY_INFO!F14>MAX('T1'!M14,'T2'!K14),MAX('T1'!M14,'T2'!K14),COUNTRY_INFO!F14),0)))","v":0},{"$f":"IF(AND(COUNTRY_INFO!K14>0,COUNTRY_INFO!K14<4),IF(Z14>0,IF(COUNTRY_INFO!K14=1, AD14/(COUNTRY_INFO!F14*0.33)*100, IF(COUNTRY_INFO!K14=2, AD14/(COUNTRY_INFO!F14*0.5)*100, IF(COUNTRY_INFO!K14=3, AD14/COUNTRY_INFO!F14*100))),\"-\"),0)","v":0},{"$f":"IF(COUNTRY_INFO!K14=2,IF(COUNTRY_INFO!G14*0.2>MAX('T1'!N14,'T2'!L14),MAX('T1'!N14,'T2'!L14),COUNTRY_INFO!G14*0.2),IF(COUNTRY_INFO!K14=3,IF(COUNTRY_INFO!G14>MAX('T1'!N14,'T2'!L14),MAX('T1'!N14,'T2'!L14),COUNTRY_INFO!G14),0))","v":0},{"$f":"IF(AND(COUNTRY_INFO!K14>0,COUNTRY_INFO!K14<4),IF(Z14>0,IF(COUNTRY_INFO!K14=1, 0, IF(COUNTRY_INFO!K14=2, AF14/(COUNTRY_INFO!G14*0.2)*100, IF(COUNTRY_INFO!K14=3, AF14/COUNTRY_INFO!G14*100))),\"-\"),0)","v":0},0,{"$f":"IF(AND(COUNTRY_INFO!K14>0,COUNTRY_INFO!K14<4), IF(AC14/Z14*100<>0, IF(AH14/Z14*100>100,100,AH14/Z14*100), \"-\"),0)","v":0},null,{"$f":"IF(AND(D14<>0, D14<>\"Inconnu\",D14<>\"Interrompu\",D14<>\"Non requis\"),D14/COUNTRY_INFO!D14, 0)","v":0},{"$f":"IF(AND(J14<>0,J14<>\"Inconnu\",J14<>\"Interrompu\",J14<>\"Non requis\"),J14/COUNTRY_INFO!D14, 0)","v":0.76934107332658286},{"$f":"IF(AND(P14<>0,P14<>\"Inconnu\",P14<>\"Non requis\"),P14/(COUNTRY_INFO!E14+COUNTRY_INFO!F14), 0)","v":0},{"$f":"IF(AND(Z14<>0,Z14<>\"Inconnu\",Z14<>\"Non requis\"),IF(COUNTRY_INFO!K14=1,1,IF(COUNTRY_INFO!K14=2,0.5*COUNTRY_INFO!F14/(0.5*COUNTRY_INFO!F14+0.2*COUNTRY_INFO!G14),IF(COUNTRY_INFO!K14=3,COUNTRY_INFO!F14/(COUNTRY_INFO!F14+COUNTRY_INFO!G14)))),0)","v":0},{"$f":"IF(AND(Z14<>0,Z14<>\"Inconnu\",Z14<>\"Non requis\"),IF(COUNTRY_INFO!K14=1,0,IF(COUNTRY_INFO!K14=2,0.2*COUNTRY_INFO!G14/(0.5*COUNTRY_INFO!F14+0.2*COUNTRY_INFO!G14),IF(COUNTRY_INFO!K14=3,COUNTRY_INFO!G14/(COUNTRY_INFO!F14+COUNTRY_INFO!G14)))),0)","v":0},{"$f":"MAX(COUNTRY_INFO!D14*AK14*PROFILE!$G$7,COUNTRY_INFO!D14*AL14*PROFILE!$G$7)","v":5749.3912814062141},{"$f":"MAX(COUNTRY_INFO!D14*AK14*PROFILE!$G$8,COUNTRY_INFO!D14*AL14*PROFILE!$G$8,COUNTRY_INFO!D14*AM14*PROFILE!$G$8)","v":19572.15816107747},{"$f":"MAX(COUNTRY_INFO!D14*AK14*PROFILE!$G$9,COUNTRY_INFO!D14*AL14*PROFILE!$G$9,COUNTRY_INFO!D14*AM14*PROFILE!$G$9,IF(AND(DISTRICT!Z14<>\"Inconnu\",Z14<>\"Non requis\"),COUNTRY_INFO!P14*DISTRICT!AN14,0))","v":29358.19126855303},{"$f":"MAX(COUNTRY_INFO!D14*AK14*PROFILE!$G$10,COUNTRY_INFO!D14*AL14*PROFILE!$G$10,IF(AND(DISTRICT!Z14<>\"Inconnu\",Z14<>\"Non requis\"),COUNTRY_INFO!P14*DISTRICT!AO14,0))","v":67646.259288963294},122326,"Y",{"$f":"MAX('MDA4'!R14,'T1'!L14,'T2'!J14,T3_R1!K14,T3_R2!K14)","v":0},{"$f":"MAX('MDA1'!K14,'MDA4'!S14,'MDA3'!I14,'MDA3'!L14,'T1'!M14,'T2'!K14,T3_R1!L14,T3_R2!L14)","v":23922.48},{"$f":"MAX('MDA1'!L14,'MDA4'!T14,'MDA3'!J14,'MDA3'!M14,'T1'!N14,'T2'!L14,T3_R1!M14,T3_R2!M14)","v":75754.52},99677,{"$f":"MAX('MDA4'!R14,T14)","v":0},{"$f":"MAX('MDA1'!K14,'MDA4'!S14,'MDA3'!I14,'MDA3'!L14,V14,AD14)","v":23922.48},{"$f":"MAX('MDA1'!L14,'MDA4'!T14,'MDA3'!J14,'MDA3'!M14,AF14)","v":75754.52},99677,81.484721154946612]
[{"$f":"IF(COUNTRY_INFO!A15=0,\" \",COUNTRY_INFO!A15)","v":" Congo"},{"$f":"IF(COUNTRY_INFO!B15=0,\" \",COUNTRY_INFO!B15)","v":"Brazzaville"},{"$f":"IF(COUNTRY_INFO!C15=0,\" \",COUNTRY_INFO!C15)","v":"Djiri"},{"$f":"COUNTRY_INFO!M15","v":0},null,null,{"$f":"SUM('MDA1'!M15,'MDA4'!U15)","v":0},{"$f":"IF(AND(COUNTRY_INFO!H15>0,COUNTRY_INFO!H15<4),IF(D15>MAX('MDA1'!M15,'MDA4'!U15),MAX('MDA1'!M15,'MDA4'!U15),D15),0)","v":0},{"$f":"IF(AND(COUNTRY_INFO!H15>0,COUNTRY_INFO!H15<4), IF(G15/D15*100<>0, IF(G15/D15*100>100,100,G15/D15*100), \"-\"),0)","v":0},{"$f":"COUNTRY_INFO!N15","v":0},null,null,{"$f":"MAX('MDA1'!M15,MAX('MDA3'!I15,'MDA3'!L15)+MAX('MDA3'!J15,'MDA3'!M15))","v":0},{"$f":"IF(AND(COUNTRY_INFO!I15>0,COUNTRY_INFO!I15<4),IF(J15>MAX('MDA1'!M15,MAX('MDA3'!I15,'MDA3'!L15)+MAX('MDA3'!J15,'MDA3'!M15)),MAX('MDA1'!M15,MAX('MDA3'!I15,'MDA3'!L15)+MAX('MDA3'!J15,'MDA3'!M15)),J15),0)","v":0},{"$f":"IF(AND(COUNTRY_INFO!I15>0,COUNTRY_INFO!I15<4), IF(M15/J15*100<>0, IF(M15/J15*100>100,100,M15/J15*100), \"-\"),0)","v":0},{"$f":"COUNTRY_INFO!O15","v":0},null,null,{"$f":"SUM(MAX('MDA4'!N15, 'T1'!L15, MAX(T3_R1!K15, T3_R2!K15)), MAX('MDA1'!K15, 'MDA4'!O15, 'T1'!M15, MAX(T3_R1!L15, T3_R2!L15)), MAX('MDA1'!L15, 'MDA4'!P15, 'T1'!N15, MAX(T3_R1!M15, T3_R2!M15)))","v":0},{"$f":"IF(AND(COUNTRY_INFO!J15>1,COUNTRY_INFO!J15<4),IF(COUNTRY_INFO!E15>MAX('MDA4'!N15,'T1'!L15,MAX(T3_R1!K15,T3_R2!K15)),MAX('MDA4'!N15,'T1'!L15,MAX(T3_R1!K15,T3_R2!K15)),COUNTRY_INFO!E15),0)","v":0},{"$f":"IF(AND(COUNTRY_INFO!J15>1,COUNTRY_INFO!J15<4), IF(T15/COUNTRY_INFO!E15*100<>0, IF(T15/COUNTRY_INFO!E15*100>100,100,T15/COUNTRY_INFO!E15*100), \"-\"),0)","v":0},{"$f":"IF(AND(COUNTRY_INFO!J15>1,COUNTRY_INFO!J15<4),IF(COUNTRY_INFO!F15>MAX('MDA1'!K15,'MDA4'!O15,'T1'!M15,MAX(T3_R1!L15,T3_R2!L15)),MAX('MDA1'!K15,'MDA4'!O15,'T1'!M15,MAX(T3_R1!L15,T3_R2!L15)),COUNTRY_INFO!F15),0)","v":0},{"$f":"IF(AND(COUNTRY_INFO!J15>1,COUNTRY_INFO!J15<4), IF(V15/COUNTRY_INFO!F15*100<>0, IF(V15/COUNTRY_INFO!F15*100>100,100,V15/COUNTRY_INFO!F15*100), \"-\"),0)","v":0},0,{"$f":"IF(AND(COUNTRY_INFO!J15>1,COUNTRY_INFO!J15<4), IF(S15/P15*100<>0, IF(X15/P15*100>100,100,X15/P15*100), \"-\"),0)","v":0},{"$f":"COUNTRY_INFO!P15","v":0},null,null,{"$f":"MAX('T1'!L15,'T2'!J15)+MAX('T1'!M15,'T2'!K15)+MAX('T1'!N15,'T2'!L15)","v":0},{"$f":"IF(COUNTRY_INFO!K15=1,IF(COUNTRY_INFO!F15*0.33>MAX('T1'!M15,'T2'!K15),MAX('T1'!M15,'T2'!K15),COUNTRY_INFO!F15*0.33),IF(COUNTRY_INFO!K15=2,IF(COUNTRY_INFO!F15*0.5>MAX('T1'!M15,'T2'!K15),MAX('T1'!M15,'T2'!K15),COUNTRY_INFO!F15*0.5),IF(COUNTRY_INFO!K15=3,IF(COUNTRY_INFO!F15>MAX('T1'!M15,'T2'!K15),MAX('T1'!M15,'T2'!K15),COUNTRY_INFO!F15),0)))","v":0},{"$f":"IF(AND(COUNTRY_INFO!K15>0,COUNTRY_INFO!K15<4),IF(Z15>0,IF(COUNTRY_INFO!K15=1, AD15/(COUNTRY_INFO!F15*0.33)*100, IF(COUNTRY_INFO!K15=2, AD15/(COUNTRY_INFO!F15*0.5)*100, IF(COUNTRY_INFO!K15=3, AD15/COUNTRY_INFO!F15*100))),\"-\"),0)","v":0},{"$f":"IF(COUNTRY_INFO!K15=2,IF(COUNTRY_INFO!G15*0.2>MAX('T1'!N15,'T2'!L15),MAX('T1'!N15,'T2'!L15),COUNTRY_INFO!G15*0.2),IF(COUNTRY_INFO!K15=3,IF(COUNTRY_INFO!G15>MAX('T1'!N15,'T2'!L15),MAX('T1'!N15,'T2'!L15),COUNTRY_INFO!G15),0))","v":0},{"$f":"IF(AND(COUNTRY_INFO!K15>0,COUNTRY_INFO!K15<4),IF(Z15>0,IF(COUNTRY_INFO!K15=1, 0, IF(COUNTRY_INFO!K15=2, AF15/(COUNTRY_INFO!G15*0.2)*100, IF(COUNTRY_INFO!K15=3, AF15/COUNTRY_INFO!G15*100))),\"-\"),0)","v":0},0,{"$f":"IF(AND(COUNTRY_INFO!K15>0,COUNTRY_INFO!K15<4), IF(AC15/Z15*100<>0, IF(AH15/Z15*100>100,100,AH15/Z15*100), \"-\"),0)","v":0},null,{"$f":"IF(AND(D15<>0, D15<>\"Inconnu\",D15<>\"Interrompu\",D15<>\"Non requis\"),D15/COUNTRY_INFO!D15, 0)","v":0},{"$f":"IF(AND(J15<>0,J15<>\"Inconnu\",J15<>\"Interrompu\",J15<>\"Non requis\"),J15/COUNTRY_INFO!D15, 0)","v":0},{"$f":"IF(AND(P15<>0,P15<>\"Inconnu\",P15<>\"Non requis\"),P15/(COUNTRY_INFO!E15+COUNTRY_INFO!F15), 0)","v":0},{"$f":"IF(AND(Z15<>0,Z15<>\"Inconnu\",Z15<>\"Non requis\"),IF(COUNTRY_INFO!K15=1,1,IF(COUNTRY_INFO!K15=2,0.5*COUNTRY_INFO!F15/(0.5*COUNTRY_INFO!F15+0.2*COUNTRY_INFO!G15),IF(COUNTRY_INFO!K15=3,COUNTRY_INFO!F15/(COUNTRY_INFO!F15+COUNTRY_INFO!G15)))),0)","v":0},{"$f":"IF(AND(Z15<>0,Z15<>\"Inconnu\",Z15<>\"Non requis\"),IF(COUNTRY_INFO!K15=1,0,IF(COUNTRY_INFO!K15=2,0.2*COUNTRY_INFO!G15/(0.5*COUNTRY_INFO!F15+0.2*COUNTRY_INFO!G15),IF(COUNTRY_INFO!K15=3,COUNTRY_INFO!G15/(COUNTRY_INFO!F15+COUNTRY_INFO!G15)))),0)","v":0},{"$f":"MAX(COUNTRY_INFO!D15*AK15*PROFILE!$G$7,COUNTRY_INFO!D15*AL15*PROFILE!$G$7)","v":0},{"$f":"MAX(COUNTRY_INFO!D15*AK15*PROFILE!$G$8,COUNTRY_INFO!D15*AL15*PROFILE!$G$8,COUNTRY_INFO!D15*AM15*PROFILE!$G$8)","v":0},{"$f":"MAX(COUNTRY_INFO!D15*AK15*PROFILE!$G$9,COUNTRY_INFO!D15*AL15*PROFILE!$G$9,COUNTRY_INFO!D15*AM15*PROFILE!$G$9,IF(AND(DISTRICT!Z15<>\"Inconnu\",Z15<>\"Non requis\"),COUNTRY_INFO!P15*DISTRICT!AN15,0))","v":0},{"$f":"MAX(COUNTRY_INFO!D15*AK15*PROFILE!$G$10,COUNTRY_INFO!D15*AL15*PROFILE!$G$10,IF(AND(DISTRICT!Z15<>\"Inconnu\",Z15<>\"Non requis\"),COUNTRY_INFO!P15*DISTRICT!AO15,0))","v":0},0,0,{"$f":"MAX('MDA4'!R15,'T1'!L15,'T2'!J15,T3_R1!K15,T3_R2!K15)","v":0},{"$f":"MAX('MDA1'!K15,'MDA4'!S15,'MDA3'!I15,'MDA3'!L15,'T1'!M15,'T2'!K15,T3_R1!L15,T3_R2!L15)","v":0},{"$f":"MAX('MDA1'!L15,'MDA4'!T15,'MDA3'!J15,'MDA3'!M15,'T1'!N15,'T2'!L15,T3_R1!M15,T3_R2!M15)","v":0},0,{"$f":"MAX('MDA4'!R15,T15)","v":0},{"$f":"MAX('MDA1'!K15,'MDA4'!S15,'MDA3'!I15,'MDA3'!L15,V15,AD15)","v":0},{"$f":"MAX('MDA1'!L15,'MDA4'!T15,'MDA3'!J15,'MDA3'!M15,AF15)","v":0},0,0]
[{"$f":"IF(COUNTRY_INFO!A16=0,\" \",COUNTRY_INFO!A16)","v":" Congo"},{"$f":"IF(COUNTRY_INFO!B16=0,\" \",COUNTRY_INFO!B16)","v":"Brazzaville"},{"$f":"IF(COUNTRY_INFO!C16=0,\" \",COUNTRY_INFO!C16)","v":"Île Mbamou"},{"$f":"COUNTRY_INFO!M16","v":0},null,null,{"$f":"SUM('MDA1'!M16,'MDA4'!U16)","v":0},{"$f":"IF(AND(COUNTRY_INFO!H16>0,COUNTRY_INFO!H16<4),IF(D16>MAX('MDA1'!M16,'MDA4'!U16),MAX('MDA1'!M16,'MDA4'!U16),D16),0)","v":0},{"$f":"IF(AND(COUNTRY_INFO!H16>0,COUNTRY_INFO!H16<4), IF(G16/D16*100<>0, IF(G16/D16*100>100,100,G16/D16*100), \"-\"),0)","v":0},{"$f":"COUNTRY_INFO!N16","v":0},null,null,{"$f":"MAX('MDA1'!M16,MAX('MDA3'!I16,'MDA3'!L16)+MAX('MDA3'!J16,'MDA3'!M16))","v":0},{"$f":"IF(AND(COUNTRY_INFO!I16>0,COUNTRY_INFO!I16<4),IF(J16>MAX('MDA1'!M16,MAX('MDA3'!I16,'MDA3'!L16)+MAX('MDA3'!J16,'MDA3'!M16)),MAX('MDA1'!M16,MAX('MDA3'!I16,'MDA3'!L16)+MAX('MDA3'!J16,'MDA3'!M16)),J16),0)","v":0},{"$f":"IF(AND(COUNTRY_INFO!I16>0,COUNTRY_INFO!I16<4), IF(M16/J16*100<>0, IF(M16/J16*100>100,100,M16/J16*100), \"-\"),0)","v":0},{"$f":"COUNTRY_INFO!O16","v":0},null,null,{"$f":"SUM(MAX('MDA4'!N16, 'T1'!L16, MAX(T3_R1!K16, T3_R2!K16)), MAX('MDA1'!K16, 'MDA4'!O16, 'T1'!M16, MAX(T3_R1!L16, T3_R2!L16)), MAX('MDA1'!L16, 'MDA4'!P16, 'T1'!N16, MAX(T3_R1!M16, T3_R2!M16)))","v":0},{"$f":"IF(AND(COUNTRY_INFO!J16>1,COUNTRY_INFO!J16<4),IF(COUNTRY_INFO!E16>MAX('MDA4'!N16,'T1'!L16,MAX(T3_R1!K16,T3_R2!K16)),MAX('MDA4'!N16,'T1'!L16,MAX(T3_R1!K16,T3_R2!K16)),COUNTRY_INFO!E16),0)","v":0},{"$f":"IF(AND(COUNTRY_INFO!J16>1,COUNTRY_INFO!J16<4), IF(T16/COUNTRY_INFO!E16*100<>0, IF(T16/COUNTRY_INFO!E16*100>100,100,T16/COUNTRY_INFO!E16*100), \"-\"),0)","v":0},{"$f":"IF(AND(COUNTRY_INFO!J16>1,COUNTRY_INFO!J16<4),IF(COUNTRY_INFO!F16>MAX('MDA1'!K16,'MDA4'!O16,'T1'!M16,MAX(T3_R1!L16,T3_R2!L16)),MAX('MDA1'!K16,'MDA4'!O16,'T1'!M16,MAX(T3_R1!L16,T3_R2!L16)),COUNTRY_INFO!F16),0)","v":0},{"$f":"IF(AND(COUNTRY_INFO!J16>1,COUNTRY_INFO!J16<4), IF(V16/COUNTRY_INFO!F16*100<>0, IF(V16/COUNTRY_INFO!F16*100>100,100,V16/COUNTRY_INFO!F16*100), \"-\"),0)","v":0},0,{"$f":"IF(AND(COUNTRY_INFO!J16>1,COUNTRY_INFO!J16<4), IF(S16/P16*100<>0, IF(X16/P16*100>100,100,X16/P16*100), \"-\"),0)","v":0},{"$f":"COUNTRY_INFO!P16","v":"Inconnu"},null,null,{"$f":"MAX('T1'!L16,'T2'!J16)+MAX('T1'!M16,'T2'!K16)+MAX('T1'!N16,'T2'!L16)","v":0},{"$f":"IF(COUNTRY_INFO!K16=1,IF(COUNTRY_INFO!F16*0.33>MAX('T1'!M16,'T2'!K16),MAX('T1'!M16,'T2'!K16),COUNTRY_INFO!F16*0.33),IF(COUNTRY_INFO!K16=2,IF(COUNTRY_INFO!F16*0.5>MAX('T1'!M16,'T2'!K16),MAX('T1'!M16,'T2'!K16),COUNTRY_INFO!F16*0.5),IF(COUNTRY_INFO!K16=3,IF(COUNTRY_INFO!F16>MAX('T1'!M16,'T2'!K16),MAX('T1'!M16,'T2'!K16),COUNTRY_INFO!F16),0)))","v":0},{"$f":"IF(AND(COUNTRY_INFO!K16>0,COUNTRY_INFO!K16<4),IF(Z16>0,IF(COUNTRY_INFO!K16=1, AD16/(COUNTRY_INFO!F16*0.33)*100, IF(COUNTRY_INFO!K16=2, AD16/(COUNTRY_INFO!F16*0.5)*100, IF(COUNTRY_INFO!K16=3, AD16/COUNTRY_INFO!F16*100))),\"-\"),0)","v":0},{"$f":"IF(COUNTRY_INFO!K16=2,IF(COUNTRY_INFO!G16*0.2>MAX('T1'!N16,'T2'!L16),MAX('T1'!N16,'T2'!L16),COUNTRY_INFO!G16*0.2),IF(COUNTRY_INFO!K16=3,IF(COUNTRY_INFO!G16>MAX('T1'!N16,'T2'!L16),MAX('T1'!N16,'T2'!L16),COUNTRY_INFO!G16),0))","v":0},{"$f":"IF(AND(COUNTRY_INFO!K16>0,COUNTRY_INFO!K16<4),IF(Z16>0,IF(COUNTRY_INFO!K16=1, 0, IF(COUNTRY_INFO!K16=2, AF16/(COUNTRY_INFO!G16*0.2)*100, IF(COUNTRY_INFO!K16=3, AF16/COUNTRY_INFO!G16*100))),\"-\"),0)","v":0},0,{"$f":"IF(AND(COUNTRY_INFO!K16>0,COUNTRY_INFO!K16<4), IF(AC16/Z16*100<>0, IF(AH16/Z16*100>100,100,AH16/Z16*100), \"-\"),0)","v":0},null,{"$f":"IF(AND(D16<>0, D16<>\"Inconnu\",D16<>\"Interrompu\",D16<>\"Non requis\"),D16/COUNTRY_INFO!D16, 0)","v":0},{"$f":"IF(AND(J16<>0,J16<>\"Inconnu\",J16<>\"Interrompu\",J16<>\"Non requis\"),J16/COUNTRY_INFO!D16, 0)","v":0},{"$f":"IF(AND(P16<>0,P16<>\"Inconnu\",P16<>\"Non requis\"),P16/(COUNTRY_INFO!E16+COUNTRY_INFO!F16), 0)","v":0},{"$f":"IF(AND(Z16<>0,Z16<>\"Inconnu\",Z16<>\"Non requis\"),IF(COUNTRY_INFO!K16=1,1,IF(COUNTRY_INFO!K16=2,0.5*COUNTRY_INFO!F16/(0.5*COUNTRY_INFO!F16+0.2*COUNTRY_INFO!G16),IF(COUNTRY_INFO!K16=3,COUNTRY_INFO!F16/(COUNTRY_INFO!F16+COUNTRY_INFO!G16)))),0)","v":0},{"$f":"IF(AND(Z16<>0,Z16<>\"Inconnu\",Z16<>\"Non requis\"),IF(COUNTRY_INFO!K16=1,0,IF(COUNTRY_INFO!K16=2,0.2*COUNTRY_INFO!G16/(0.5*COUNTRY_INFO!F16+0.2*COUNTRY_INFO!G16),IF(COUNTRY_INFO!K16=3,COUNTRY_INFO!G16/(COUNTRY_INFO!F16+COUNTRY_INFO!G16)))),0)","v":0},{"$f":"MAX(COUNTRY_INFO!D16*AK16*PROFILE!$G$7,COUNTRY_INFO!D16*AL16*PROFILE!$G$7)","v":0},{"$f":"MAX(COUNTRY_INFO!D16*AK16*PROFILE!$G$8,COUNTRY_INFO!D16*AL16*PROFILE!$G$8,COUNTRY_INFO!D16*AM16*PROFILE!$G$8)","v":0},{"$f":"MAX(COUNTRY_INFO!D16*AK16*PROFILE!$G$9,COUNTRY_INFO!D16*AL16*PROFILE!$G$9,COUNTRY_INFO!D16*AM16*PROFILE!$G$9,IF(AND(DISTRICT!Z16<>\"Inconnu\",Z16<>\"Non requis\"),COUNTRY_INFO!P16*DISTRICT!AN16,0))","v":0},{"$f":"MAX(COUNTRY_INFO!D16*AK16*PROFILE!$G$10,COUNTRY_INFO!D16*AL16*PROFILE!$G$10,IF(AND(DISTRICT!Z16<>\"Inconnu\",Z16<>\"Non requis\"),COUNTRY_INFO!P16*DISTRICT!AO16,0))","v":0},0,0,{"$f":"MAX('MDA4'!R16,'T1'!L16,'T2'!J16,T3_R1!K16,T3_R2!K16)","v":0},{"$f":"MAX('MDA1'!K16,'MDA4'!S16,'MDA3'!I16,'MDA3'!L16,'T1'!M16,'T2'!K16,T3_R1!L16,T3_R2!L16)","v":0},{"$f":"MAX('MDA1'!L16,'MDA4'!T16,'MDA3'!J16,'MDA3'!M16,'T1'!N16,'T2'!L16,T3_R1!M16,T3_R2!M16)","v":0},0,{"$f":"MAX('MDA4'!R16,T16)","v":0},{"$f":"MAX('MDA1'!K16,'MDA4'!S16,'MDA3'!I16,'MDA3'!L16,V16,AD16)","v":0},{"$f":"MAX('MDA1'!L16,'MDA4'!T16,'MDA3'!J16,'MDA3'!M16,AF16)","v":0},0,0]
[{"$f":"IF(COUNTRY_INFO!A17=0,\" \",COUNTRY_INFO!A17)","v":" Congo"},{"$f":"IF(COUNTRY_INFO!B17=0,\" \",COUNTRY_INFO!B17)","v":"Brazzaville"},{"$f":"IF(COUNTRY_INFO!C17=0,\" \",COUNTRY_INFO!C17)","v":"Madibou"},{"$f":"COUNTRY_INFO!M17","v":0},null,null,{"$f":"SUM('MDA1'!M17,'MDA4'!U17)","v":0},{"$f":"IF(AND(COUNTRY_INFO!H17>0,COUNTRY_INFO!H17<4),IF(D17>MAX('MDA1'!M17,'MDA4'!U17),MAX('MDA1'!M17,'MDA4'!U17),D17),0)","v":0},{"$f":"IF(AND(COUNTRY_INFO!H17>0,COUNTRY_INFO!H17<4), IF(G17/D17*100<>0, IF(G17/D17*100>100,100,G17/D17*100), \"-\"),0)","v":0},{"$f":"COUNTRY_INFO!N17","v":96961},34028,43286,{"$f":"MAX('MDA1'!M17,MAX('MDA3'!I17,'MDA3'!L17)+MAX('MDA3'!J17,'MDA3'!M17))","v":77314},{"$f":"IF(AND(COUNTRY_INFO!I17>0,COUNTRY_INFO!I17<4),IF(J17>MAX('MDA1'!M17,MAX('MDA3'!I17,'MDA3'!L17)+MAX('MDA3'!J17,'MDA3'!M17)),MAX('MDA1'!M17,MAX('MDA3'!I17,'MDA3'!L17)+MAX('MDA3'!J17,'MDA3'!M17)),J17),0)","v":77314},{"$f":"IF(AND(COUNTRY_INFO!I17>0,COUNTRY_INFO!I17<4), IF(M17/J17*100<>0, IF(M17/J17*100>100,100,M17/J17*100), \"-\"),0)","v":79.73721393137447},{"$f":"COUNTRY_INFO!O17","v":0},null,null,{"$f":"SUM(MAX('MDA4'!N17, 'T1'!L17, MAX(T3_R1!K17, T3_R2!K17)), MAX('MDA1'!K17, 'MDA4'!O17, 'T1'!M17, MAX(T3_R1!L17, T3_R2!L17)), MAX('MDA1'!L17, 'MDA4'!P17, 'T1'!N17, MAX(T3_R1!M17, T3_R2!M17)))","v":0},{"$f":"IF(AND(COUNTRY_INFO!J17>1,COUNTRY_INFO!J17<4),IF(COUNTRY_INFO!E17>MAX('MDA4'!N17,'T1'!L17,MAX(T3_R1!K17,T3_R2!K17)),MAX('MDA4'!N17,'T1'!L17,MAX(T3_R1!K17,T3_R2!K17)),COUNTRY_INFO!E17),0)","v":0},{"$f":"IF(AND(COUNTRY_INFO!J17>1,COUNTRY_INFO!J17<4), IF(T17/COUNTRY_INFO!E17*100<>0, IF(T17/COUNTRY_INFO!E17*100>100,100,T17/COUNTRY_INFO!E17*100), \"-\"),0)","v":0},{"$f":"IF(AND(COUNTRY_INFO!J17>1,COUNTRY_INFO!J17<4),IF(COUNTRY_INFO!F17>MAX('MDA1'!K17,'MDA4'!O17,'T1'!M17,MAX(T3_R1!L17,T3_R2!L17)),MAX('MDA1'!K17,'MDA4'!O17,'T1'!M17,MAX(T3_R1!L17,T3_R2!L17)),COUNTRY_INFO!F17),0)","v":0},{"$f":"IF(AND(COUNTRY_INFO!J17>1,COUNTRY_INFO!J17<4), IF(V17/COUNTRY_INFO!F17*100<>0, IF(V17/COUNTRY_INFO!F17*100>100,100,V17/COUNTRY_INFO!F17*100), \"-\"),0)","v":0},0,{"$f":"IF(AND(COUNTRY_INFO!J17>1,COUNTRY_INFO!J17<4), IF(S17/P17*100<>0, IF(X17/P17*100>100,100,X17/P17*100), \"-\"),0)","v":0},{"$f":"COUNTRY_INFO!P17","v":0},null,null,{"$f":"MAX('T1'!L17,'T2'!J17)+MAX('T1'!M17,'T2'!K17)+MAX('T1'!N17,'T2'!L17)","v":0},{"$f":"IF(COUNTRY_INFO!K17=1,IF(COUNTRY_INFO!F17*0.33>MAX('T1'!M17,'T2'!K17),MAX('T1'!M17,'T2'!K17),COUNTRY_INFO!F17*0.33),IF(COUNTRY_INFO!K17=2,IF(COUNTRY_INFO!F17*0.5>MAX('T1'!M17,'T2'!K17),MAX('T1'!M17,'T2'!K17),COUNTRY_INFO!F17*0.5),IF(COUNTRY_INFO!K17=3,IF(COUNTRY_INFO!F17>MAX('T1'!M17,'T2'!K17),MAX('T1'!M17,'T2'!K17),COUNTRY_INFO!F17),0)))","v":0},{"$f":"IF(AND(COUNTRY_INFO!K17>0,COUNTRY_INFO!K17<4),IF(Z17>0,IF(COUNTRY_INFO!K17=1, AD17/(COUNTRY_INFO!F17*0.33)*100, IF(COUNTRY_INFO!K17=2, AD17/(COUNTRY_INFO!F17*0.5)*100, IF(COUNTRY_INFO!K17=3, AD17/COUNTRY_INFO!F17*100))),\"-\"),0)","v":0},{"$f":"IF(COUNTRY_INFO!K17=2,IF(COUNTRY_INFO!G17*0.2>MAX('T1'!N17,'T2'!L17),MAX('T1'!N17,'T2'!L17),COUNTRY_INFO!G17*0.2),IF(COUNTRY_INFO!K17=3,IF(COUNTRY_INFO!G17>MAX('T1'!N17,'T2'!L17),MAX('T1'!N17,'T2'!L17),COUNTRY_INFO!G17),0))","v":0},{"$f":"IF(AND(COUNTRY_INFO!K17>0,COUNTRY_INFO!K17<4),IF(Z17>0,IF(COUNTRY_INFO!K17=1, 0, IF(COUNTRY_INFO!K17=2, AF17/(COUNTRY_INFO!G17*0.2)*100, IF(COUNTRY_INFO!K17=3, AF17/COUNTRY_INFO!G17*100))),\"-\"),0)","v":0},0,{"$f":"IF(AND(COUNTRY_INFO!K17>0,COUNTRY_INFO!K17<4), IF(AC17/Z17*100<>0, IF(AH17/Z17*100>100,100,AH17/Z17*100), \"-\"),0)","v":0},null,{"$f":"IF(AND(D17<>0, D17<>\"Inconnu\",D17<>\"Interrompu\",D17<>\"Non requis\"),D17/COUNTRY_INFO!D17, 0)","v":0},{"$f":"IF(AND(J17<>0,J17<>\"Inconnu\",J17<>\"Interrompu\",J17<>\"Non requis\"),J17/COUNTRY_INFO!D17, 0)","v":0.54210252654295799},{"$f":"IF(AND(P17<>0,P17<>\"Inconnu\",P17<>\"Non requis\"),P17/(COUNTRY_INFO!E17+COUNTRY_INFO!F17), 0)","v":0},{"$f":"IF(AND(Z17<>0,Z17<>\"Inconnu\",Z17<>\"Non requis\"),IF(COUNTRY_INFO!K17=1,1,IF(COUNTRY_INFO!K17=2,0.5*COUNTRY_INFO!F17/(0.5*COUNTRY_INFO!F17+0.2*COUNTRY_INFO!G17),IF(COUNTRY_INFO!K17=3,COUNTRY_INFO!F17/(COUNTRY_INFO!F17+COUNTRY_INFO!G17)))),0)","v":0},{"$f":"IF(AND(Z17<>0,Z17<>\"Inconnu\",Z17<>\"Non requis\"),IF(COUNTRY_INFO!K17=1,0,IF(COUNTRY_INFO!K17=2,0.2*COUNTRY_INFO!G17/(0.5*COUNTRY_INFO!F17+0.2*COUNTRY_INFO!G17),IF(COUNTRY_INFO!K17=3,COUNTRY_INFO!G17/(COUNTRY_INFO!F17+COUNTRY_INFO!G17)))),0)","v":0},{"$f":"MAX(COUNTRY_INFO!D17*AK17*PROFILE!$G$7,COUNTRY_INFO!D17*AL17*PROFILE!$G$7)","v":4557.2219155079702},{"$f":"MAX(COUNTRY_INFO!D17*AK17*PROFILE!$G$8,COUNTRY_INFO!D17*AL17*PROFILE!$G$8,COUNTRY_INFO!D17*AM17*PROFILE!$G$8)","v":15513.758542388641},{"$f":"MAX(COUNTRY_INFO!D17*AK17*PROFILE!$G$9,COUNTRY_INFO!D17*AL17*PROFILE!$G$9,COUNTRY_INFO!D17*AM17*PROFILE!$G$9,IF(AND(DISTRICT!Z17<>\"Inconnu\",Z17<>\"Non requis\"),COUNTRY_INFO!P17*DISTRICT!AN17,0))","v":23270.601373298978},{"$f":"MAX(COUNTRY_INFO!D17*AK17*PROFILE!$G$10,COUNTRY_INFO!D17*AL17*PROFILE!$G$10,IF(AND(DISTRICT!Z17<>\"Inconnu\",Z17<>\"Non requis\"),COUNTRY_INFO!P17*DISTRICT!AO17,0))","v":53619.418168804426},96961.000000000015,"Y",{"$f":"MAX('MDA4'!R17,'T1'!L17,'T2'!J17,T3_R1!K17,T3_R2!K17)","v":0},{"$f":"MAX('MDA1'!K17,'MDA4'!S17,'MDA3'!I17,'MDA3'!L17,'T1'!M17,'T2'!K17,T3_R1!L17,T3_R2!L17)","v":18555.36},{"$f":"MAX('MDA1'!L17,'MDA4'!T17,'MDA3'!J17,'MDA3'!M17,'T1'!N17,'T2'!L17,T3_R1!M17,T3_R2!M17)","v":58758.64},77314,{"$f":"MAX('MDA4'!R17,T17)","v":0},{"$f":"MAX('MDA1'!K17,'MDA4'!S17,'MDA3'!I17,'MDA3'!L17,V17,AD17)","v":18555.36},{"$f":"MAX('MDA1'!L17,'MDA4'!T17,'MDA3'!J17,'MDA3'!M17,AF17)","v":58758.64},77314,79.737213931374455]
[{"$f":"IF(COUNTRY_INFO!A18=0,\" \",COUNTRY_INFO!A18)","v":" Congo"},{"$f":"IF(COUNTRY_INFO!B18=0,\" \",COUNTRY_INFO!B18)","v":"Brazzaville"},{"$f":"IF(COUNTRY_INFO!C18=0,\" \",COUNTRY_INFO!C18)","v":"Makélékélé"},{"$f":"COUNTRY_INFO!M18","v":0},null,null,{"$f":"SUM('MDA1'!M18,'MDA4'!U18)","v":0},{"$f":"IF(AND(COUNTRY_INFO!H18>0,COUNTRY_INFO!H18<4),IF(D18>MAX('MDA1'!M18,'MDA4'!U18),MAX('MDA1'!M18,'MDA4'!U18),D18),0)","v":0},{"$f":"IF(AND(COUNTRY_INFO!H18>0,COUNTRY_INFO!H18<4), IF(G18/D18*100<>0, IF(G18/D18*100>100,100,G18/D18*100), \"-\"),0)","v":0},{"$f":"COUNTRY_INFO!N18","v":94128},35848,42580,{"$f":"MAX('MDA1'!M18,MAX('MDA3'!I18,'MDA3'!L18)+MAX('MDA3'!J18,'MDA3'!M18))","v":78428},{"$f":"IF(AND(COUNTRY_INFO!I18>0,COUNTRY_INFO!I18<4),IF(J18>MAX('MDA1'!M18,MAX('MDA3'!I18,'MDA3'!L18)+MAX('MDA3'!J18,'MDA3'!M18)),MAX('MDA1'!M18,MAX('MDA3'!I18,'MDA3'!L18)+MAX('MDA3'!J18,'MDA3'!M18)),J18),0)","v":78428},{"$f":"IF(AND(COUNTRY_INFO!I18>0,COUNTRY_INFO!I18<4), IF(M18/J18*100<>0, IF(M18/J18*100>100,100,M18/J18*100), \"-\"),0)","v":83.320584735679077},{"$f":"COUNTRY_INFO!O18","v":0},null,null,{"$f":"SUM(MAX('MDA4'!N18, 'T1'!L18, MAX(T3_R1!K18, T3_R2!K18)), MAX('MDA1'!K18, 'MDA4'!O18, 'T1'!M18, MAX(T3_R1!L18, T3_R2!L18)), MAX('MDA1'!L18, 'MDA4'!P18, 'T1'!N18, MAX(T3_R1!M18, T3_R2!M18)))","v":0},{"$f":"IF(AND(COUNTRY_INFO!J18>1,COUNTRY_INFO!J18<4),IF(COUNTRY_INFO!E18>MAX('MDA4'!N18,'T1'!L18,MAX(T3_R1!K18,T3_R2!K18)),MAX('MDA4'!N18,'T1'!L18,MAX(T3_R1!K18,T3_R2!K18)),COUNTRY_INFO!E18),0)","v":0},{"$f":"IF(AND(COUNTRY_INFO!J18>1,COUNTRY_INFO!J18<4), IF(T18/COUNTRY_INFO!E18*100<>0, IF(T18/COUNTRY_INFO!E18*100>100,100,T18/COUNTRY_INFO!E18*100), \"-\"),0)","v":0},{"$f":"IF(AND(COUNTRY_INFO!J18>1,COUNTRY_INFO!J18<4),IF(COUNTRY_INFO!F18>MAX('MDA1'!K18,'MDA4'!O18,'T1'!M18,MAX(T3_R1!L18,T3_R2!L18)),MAX('MDA1'!K18,'MDA4'!O18,'T1'!M18,MAX(T3_R1!L18,T3_R2!L18)),COUNTRY_INFO!F18),0)","v":0},{"$f":"IF(AND(COUNTRY_INFO!J18>1,COUNTRY_INFO!J18<4), IF(V18/COUNTRY_INFO!F18*100<>0, IF(V18/COUNTRY_INFO!F18*100>100,100,V18/COUNTRY_INFO!F18*100), \"-\"),0)","v":0},0,{"$f":"IF(AND(COUNTRY_INFO!J18>1,COUNTRY_INFO!J18<4), IF(S18/P18*100<>0, IF(X18/P18*100>100,100,X18/P18*100), \"-\"),0)","v":0},{"$f":"COUNTRY_INFO!P18","v":18391.560000000001},null,null,{"$f":"MAX('T1'!L18,'T2'!J18)+MAX('T1'!M18,'T2'!K18)+MAX('T1'!N18,'T2'!L18)","v":0},{"$f":"IF(COUNTRY_INFO!K18=1,IF(COUNTRY_INFO!F18*0.33>MAX('T1'!M18,'T2'!K18),MAX('T1'!M18,'T2'!K18),COUNTRY_INFO!F18*0.33),IF(COUNTRY_INFO!K18=2,IF(COUNTRY_INFO!F18*0.5>MAX('T1'!M18,'T2'!K18),MAX('T1'!M18,'T2'!K18),COUNTRY_INFO!F18*0.5),IF(COUNTRY_INFO!K18=3,IF(COUNTRY_INFO!F18>MAX('T1'!M18,'T2'!K18),MAX('T1'!M18,'T2'!K18),COUNTRY_INFO!F18),0)))","v":0},{"$f":"IF(AND(COUNTRY_INFO!K18>0,COUNTRY_INFO!K18<4),IF(Z18>0,IF(COUNTRY_INFO!K18=1, AD18/(COUNTRY_INFO!F18*0.33)*100, IF(COUNTRY_INFO!K18=2, AD18/(COUNTRY_INFO!F18*0.5)*100, IF(COUNTRY_INFO!K18=3, AD18/COUNTRY_INFO!F18*100))),\"-\"),0)","v":0},{"$f":"IF(COUNTRY_INFO!K18=2,IF(COUNTRY_INFO!G18*0.2>MAX('T1'!N18,'T2'!L18),MAX('T1'!N18,'T2'!L18),COUNTRY_INFO!G18*0.2),IF(COUNTRY_INFO!K18=3,IF(COUNTRY_INFO!G18>MAX('T1'!N18,'T2'!L18),MAX('T1'!N18,'T2'!L18),COUNTRY_INFO!G18),0))","v":0},{"$f":"IF(AND(COUNTRY_INFO!K18>0,COUNTRY_INFO!K18<4),IF(Z18>0,IF(COUNTRY_INFO!K18=1, 0, IF(COUNTRY_INFO!K18=2, AF18/(COUNTRY_INFO!G18*0.2)*100, IF(COUNTRY_INFO!K18=3, AF18/COUNTRY_INFO!G18*100))),\"-\"),0)","v":0},0,{"$f":"IF(AND(COUNTRY_INFO!K18>0,COUNTRY_INFO!K18<4), IF(AC18/Z18*100<>0, IF(AH18/Z18*100>100,100,AH18/Z18*100), \"-\"),0)","v":"-"},null,{"$f":"IF(AND(D18<>0, D18<>\"Inconnu\",D18<>\"Interrompu\",D18<>\"Non requis\"),D18/COUNTRY_INFO!D18, 0)","v":0},{"$f":"IF(AND(J18<>0,J18<>\"Inconnu\",J18<>\"Interrompu\",J18<>\"Non requis\"),J18/COUNTRY_INFO!D18, 0)","v":0.40534325504482854},{"$f":"IF(AND(P18<>0,P18<>\"Inconnu\",P18<>\"Non requis\"),P18/(COUNTRY_INFO!E18+COUNTRY_INFO!F18), 0)","v":0},{"$f":"IF(AND(Z18<>0,Z18<>\"Inconnu\",Z18<>\"Non requis\"),IF(COUNTRY_INFO!K18=1,1,IF(COUNTRY_INFO!K18=2,0.5*COUNTRY_INFO!F18/(0.5*COUNTRY_INFO!F18+0.2*COUNTRY_INFO!G18),IF(COUNTRY_INFO!K18=3,COUNTRY_INFO!F18/(COUNTRY_INFO!F18+COUNTRY_INFO!G18)))),0)","v":1},{"$f":"IF(AND(Z18<>0,Z18<>\"Inconnu\",Z18<>\"Non requis\"),IF(COUNTRY_INFO!K18=1,0,IF(COUNTRY_INFO!K18=2,0.2*COUNTRY_INFO!G18/(0.5*COUNTRY_INFO!F18+0.2*COUNTRY_INFO!G18),IF(COUNTRY_INFO!K18=3,COUNTRY_INFO!G18/(COUNTRY_INFO!F18+COUNTRY_INFO!G18)))),0)","v":0},{"$f":"MAX(COUNTRY_INFO!D18*AK18*PROFILE!$G$7,COUNTRY_INFO!D18*AL18*PROFILE!$G$7)","v":4424.0693109903377},{"$f":"MAX(COUNTRY_INFO!D18*AK18*PROFILE!$G$8,COUNTRY_INFO!D18*AL18*PROFILE!$G$8,COUNTRY_INFO!D18*AM18*PROFILE!$G$8)","v":15060.478584977031},{"$f":"MAX(COUNTRY_INFO!D18*AK18*PROFILE!$G$9,COUNTRY_INFO!D18*AL18*PROFILE!$G$9,COUNTRY_INFO!D18*AM18*PROFILE!$G$9,IF(AND(DISTRICT!Z18<>\"Inconnu\",Z18<>\"Non requis\"),COUNTRY_INFO!P18*DISTRICT!AN18,0))","v":22590.682501891337},{"$f":"MAX(COUNTRY_INFO!D18*AK18*PROFILE!$G$10,COUNTRY_INFO!D18*AL18*PROFILE!$G$10,IF(AND(DISTRICT!Z18<>\"Inconnu\",Z18<>\"Non requis\"),COUNTRY_INFO!P18*DISTRICT!AO18,0))","v":52052.769602141299},94128,0,{"$f":"MAX('MDA4'!R18,'T1'!L18,'T2'!J18,T3_R1!K18,T3_R2!K18)","v":0},{"$f":"MAX('MDA1'!K18,'MDA4'!S18,'MDA3'!I18,'MDA3'!L18,'T1'!M18,'T2'!K18,T3_R1!L18,T3_R2!L18)","v":18822.72},{"$f":"MAX('MDA1'!L18,'MDA4'!T18,'MDA3'!J18,'MDA3'!M18,'T1'!N18,'T2'!L18,T3_R1!M18,T3_R2!M18)","v":59605.279999999999},78428,{"$f":"MAX('MDA4'!R18,T18)","v":0},{"$f":"MAX('MDA1'!K18,'MDA4'!S18,'MDA3'!I18,'MDA3'!L18,V18,AD18)","v":18822.72},{"$f":"MAX('MDA1'!L18,'MDA4'!T18,'MDA3'!J18,'MDA3'!M18,AF18)","v":59605.279999999999},78428,83.320584735679077]
[{"$f":"IF(COUNTRY_INFO!A19=0,\" \",COUNTRY_INFO!A19)","v":" Congo"},{"$f":"IF(COUNTRY_INFO!B19=0,\" \",COUNTRY_INFO!B19)","v":"Brazzaville"},{"$f":"IF(COUNTRY_INFO!C19=0,\" \",COUNTRY_INFO!C19)","v":"Mfilou"},{"$f":"COUNTRY_INFO!M19","v":0},null,null,{"$f":"SUM('MDA1'!M19,'MDA4'!U19)","v":0},{"$f":"IF(AND(COUNTRY_INFO!H19>0,COUNTRY_INFO!H19<4),IF(D19>MAX('MDA1'!M19,'MDA4'!U19),MAX('MDA1'!M19,'MDA4'!U19),D19),0)","v":0},{"$f":"IF(AND(COUNTRY_INFO!H19>0,COUNTRY_INFO!H19<4), IF(G19/D19*100<>0, IF(G19/D19*100>100,100,G19/D19*100), \"-\"),0)","v":0},{"$f":"COUNTRY_INFO!N19","v":87100},33640,36081,{"$f":"MAX('MDA1'!M19,MAX('MDA3'!I19,'MDA3'!L19)+MAX('MDA3'!J19,'MDA3'!M19))","v":71739},{"$f":"IF(AND(COUNTRY_INFO!I19>0,COUNTRY_INFO!I19<4),IF(J19>MAX('MDA1'!M19,MAX('MDA3'!I19,'MDA3'!L19)+MAX('MDA3'!J19,'MDA3'!M19)),MAX('MDA1'!M19,MAX('MDA3'!I19,'MDA3'!L19)+MAX('MDA3'!J19,'MDA3'!M19)),J19),0)","v":71739},{"$f":"IF(AND(COUNTRY_INFO!I19>0,COUNTRY_INFO!I19<4), IF(M19/J19*100<>0, IF(M19/J19*100>100,100,M19/J19*100), \"-\"),0)","v":82.363949483352471},{"$f":"COUNTRY_INFO!O19","v":0},null,null,{"$f":"SUM(MAX('MDA4'!N19, 'T1'!L19, MAX(T3_R1!K19, T3_R2!K19)), MAX('MDA1'!K19, 'MDA4'!O19, 'T1'!M19, MAX(T3_R1!L19, T3_R2!L19)), MAX('MDA1'!L19, 'MDA4'!P19, 'T1'!N19, MAX(T3_R1!M19, T3_R2!M19)))","v":0},{"$f":"IF(AND(COUNTRY_INFO!J19>1,COUNTRY_INFO!J19<4),IF(COUNTRY_INFO!E19>MAX('MDA4'!N19,'T1'!L19,MAX(T3_R1!K19,T3_R2!K19)),MAX('MDA4'!N19,'T1'!L19,MAX(T3_R1!K19,T3_R2!K19)),COUNTRY_INFO!E19),0)","v":0},{"$f":"IF(AND(COUNTRY_INFO!J19>1,COUNTRY_INFO!J19<4), IF(T19/COUNTRY_INFO!E19*100<>0, IF(T19/COUNTRY_INFO!E19*100>100,100,T19/COUNTRY_INFO!E19*100), \"-\"),0)","v":0},{"$f":"IF(AND(COUNTRY_INFO!J19>1,COUNTRY_INFO!J19<4),IF(COUNTRY_INFO!F19>MAX('MDA1'!K19,'MDA4'!O19,'T1'!M19,MAX(T3_R1!L19,T3_R2!L19)),MAX('MDA1'!K19,'MDA4'!O19,'T1'!M19,MAX(T3_R1!L19,T3_R2!L19)),COUNTRY_INFO!F19),0)","v":0},{"$f":"IF(AND(COUNTRY_INFO!J19>1,COUNTRY_INFO!J19<4), IF(V19/COUNTRY_INFO!F19*100<>0, IF(V19/COUNTRY_INFO!F19*100>100,100,V19/COUNTRY_INFO!F19*100), \"-\"),0)","v":0},0,{"$f":"IF(AND(COUNTRY_INFO!J19>1,COUNTRY_INFO!J19<4), IF(S19/P19*100<>0, IF(X19/P19*100>100,100,X19/P19*100), \"-\"),0)","v":0},{"$f":"COUNTRY_INFO!P19","v":0},null,null,{"$f":"MAX('T1'!L19,'T2'!J19)+MAX('T1'!M19,'T2'!K19)+MAX('T1'!N19,'T2'!L19)","v":0},{"$f":"IF(COUNTRY_INFO!K19=1,IF(COUNTRY_INFO!F19*0.33>MAX('T1'!M19,'T2'!K19),MAX('T1'!M19,'T2'!K19),COUNTRY_INFO!F19*0.33),IF(COUNTRY_INFO!K19=2,IF(COUNTRY_INFO!F19*0.5>MAX('T1'!M19,'T2'!K19),MAX('T1'!M19,'T2'!K19),COUNTRY_INFO!F19*0.5),IF(COUNTRY_INFO!K19=3,IF(COUNTRY_INFO!F19>MAX('T1'!M19,'T2'!K19),MAX('T1'!M19,'T2'!K19),COUNTRY_INFO!F19),0)))","v":0},{"$f":"IF(AND(COUNTRY_INFO!K19>0,COUNTRY_INFO!K19<4),IF(Z19>0,IF(COUNTRY_INFO!K19=1, AD19/(COUNTRY_INFO!F19*0.33)*100, IF(COUNTRY_INFO!K19=2, AD19/(COUNTRY_INFO!F19*0.5)*100, IF(COUNTRY_INFO!K19=3, AD19/COUNTRY_INFO!F19*100))),\"-\"),0)","v":0},{"$f":"IF(COUNTRY_INFO!K19=2,IF(COUNTRY_INFO!G19*0.2>MAX('T1'!N19,'T2'!L19),MAX('T1'!N19,'T2'!L19),COUNTRY_INFO!G19*0.2),IF(COUNTRY_INFO!K19=3,IF(COUNTRY_INFO!G19>MAX('T1'!N19,'T2'!L19),MAX('T1'!N19,'T2'!L19),COUNTRY_INFO!G19),0))","v":0},{"$f":"IF(AND(COUNTRY_INFO!K19>0,COUNTRY_INFO!K19<4),IF(Z19>0,IF(COUNTRY_INFO!K19=1, 0, IF(COUNTRY_INFO!K19=2, AF19/(COUNTRY_INFO!G19*0.2)*100, IF(COUNTRY_INFO!K19=3, AF19/COUNTRY_INFO!G19*100))),\"-\"),0)","v":0},0,{"$f":"IF(AND(COUNTRY_INFO!K19>0,COUNTRY_INFO!K19<4), IF(AC19/Z19*100<>0, IF(AH19/Z19*100>100,100,AH19/Z19*100), \"-\"),0)","v":0},null,{"$f":"IF(AND(D19<>0, D19<>\"Inconnu\",D19<>\"Interrompu\",D19<>\"Non requis\"),D19/COUNTRY_INFO!D19, 0)","v":0},{"$f":"IF(AND(J19<>0,J19<>\"Inconnu\",J19<>\"Interrompu\",J19<>\"Non requis\"),J19/COUNTRY_INFO!D19, 0)","v":0.39817506902920258},{"$f":"IF(AND(P19<>0,P19<>\"Inconnu\",P19<>\"Non requis\"),P19/(COUNTRY_INFO!E19+COUNTRY_INFO!F19), 0)","v":0},{"$f":"IF(AND(Z19<>0,Z19<>\"Inconnu\",Z19<>\"Non requis\"),IF(COUNTRY_INFO!K19=1,1,IF(COUNTRY_INFO!K19=2,0.5*COUNTRY_INFO!F19/(0.5*COUNTRY_INFO!F19+0.2*COUNTRY_INFO!G19),IF(COUNTRY_INFO!K19=3,COUNTRY_INFO!F19/(COUNTRY_INFO!F19+COUNTRY_INFO!G19)))),0)","v":0},{"$f":"IF(AND(Z19<>0,Z19<>\"Inconnu\",Z19<>\"Non requis\"),IF(COUNTRY_INFO!K19=1,0,IF(COUNTRY_INFO!K19=2,0.2*COUNTRY_INFO!G19/(0.5*COUNTRY_INFO!F19+0.2*COUNTRY_INFO!G19),IF(COUNTRY_INFO!K19=3,COUNTRY_INFO!G19/(COUNTRY_INFO!F19+COUNTRY_INFO!G19)))),0)","v":0},{"$f":"MAX(COUNTRY_INFO!D19*AK19*PROFILE!$G$7,COUNTRY_INFO!D19*AL19*PROFILE!$G$7)","v":4093.7493305632588},{"$f":"MAX(COUNTRY_INFO!D19*AK19*PROFILE!$G$8,COUNTRY_INFO!D19*AL19*PROFILE!$G$8,COUNTRY_INFO!D19*AM19*PROFILE!$G$8)","v":13935.998690628712},{"$f":"MAX(COUNTRY_INFO!D19*AK19*PROFILE!$G$9,COUNTRY_INFO!D19*AL19*PROFILE!$G$9,COUNTRY_INFO!D19*AM19*PROFILE!$G$9,IF(AND(DISTRICT!Z19<>\"Inconnu\",Z19<>\"Non requis\"),COUNTRY_INFO!P19*DISTRICT!AN19,0))","v":20903.965301660879},{"$f":"MAX(COUNTRY_INFO!D19*AK19*PROFILE!$G$10,COUNTRY_INFO!D19*AL19*PROFILE!$G$10,IF(AND(DISTRICT!Z19<>\"Inconnu\",Z19<>\"Non requis\"),COUNTRY_INFO!P19*DISTRICT!AO19,0))","v":48166.286677147153},87100,"Y",{"$f":"MAX('MDA4'!R19,'T1'!L19,'T2'!J19,T3_R1!K19,T3_R2!K19)","v":0},{"$f":"MAX('MDA1'!K19,'MDA4'!S19,'MDA3'!I19,'MDA3'!L19,'T1'!M19,'T2'!K19,T3_R1!L19,T3_R2!L19)","v":17217.36},{"$f":"MAX('MDA1'!L19,'MDA4'!T19,'MDA3'!J19,'MDA3'!M19,'T1'!N19,'T2'!L19,T3_R1!M19,T3_R2!M19)","v":54521.64},71739,{"$f":"MAX('MDA4'!R19,T19)","v":0},{"$f":"MAX('MDA1'!K19,'MDA4'!S19,'MDA3'!I19,'MDA3'!L19,V19,AD19)","v":17217.36},{"$f":"MAX('MDA1'!L19,'MDA4'!T19,'MDA3'!J19,'MDA3'!M19,AF19)","v":54521.64},71739,82.363949483352471]
[{"$f":"IF(COUNTRY_INFO!A20=0,\" \",COUNTRY_INFO!A20)","v":" Congo"},{"$f":"IF(COUNTRY_INFO!B20=0,\" \",COUNTRY_INFO!B20)","v":"Brazzaville"},{"$f":"IF(COUNTRY_INFO!C20=0,\" \",COUNTRY_INFO!C20)","v":"Moungali"},{"$f":"COUNTRY_INFO!M20","v":0},null,null,{"$f":"SUM('MDA1'!M20,'MDA4'!U20)","v":0},{"$f":"IF(AND(COUNTRY_INFO!H20>0,COUNTRY_INFO!H20<4),IF(D20>MAX('MDA1'!M20,'MDA4'!U20),MAX('MDA1'!M20,'MDA4'!U20),D20),0)","v":0},{"$f":"IF(AND(COUNTRY_INFO!H20>0,COUNTRY_INFO!H20<4), IF(G20/D20*100<>0, IF(G20/D20*100>100,100,G20/D20*100), \"-\"),0)","v":0},{"$f":"COUNTRY_INFO!N20","v":0},null,null,{"$f":"MAX('MDA1'!M20,MAX('MDA3'!I20,'MDA3'!L20)+MAX('MDA3'!J20,'MDA3'!M20))","v":0},{"$f":"IF(AND(COUNTRY_INFO!I20>0,COUNTRY_INFO!I20<4),IF(J20>MAX('MDA1'!M20,MAX('MDA3'!I20,'MDA3'!L20)+MAX('MDA3'!J20,'MDA3'!M20)),MAX('MDA1'!M20,MAX('MDA3'!I20,'MDA3'!L20)+MAX('MDA3'!J20,'MDA3'!M20)),J20),0)","v":0},{"$f":"IF(AND(COUNTRY_INFO!I20>0,COUNTRY_INFO!I20<4), IF(M20/J20*100<>0, IF(M20/J20*100>100,100,M20/J20*100), \"-\"),0)","v":0},{"$f":"COUNTRY_INFO!O20","v":0},null,null,{"$f":"SUM(MAX('MDA4'!N20, 'T1'!L20, MAX(T3_R1!K20, T3_R2!K20)), MAX('MDA1'!K20, 'MDA4'!O20, 'T1'!M20, MAX(T3_R1!L20, T3_R2!L20)), MAX('MDA1'!L20, 'MDA4'!P20, 'T1'!N20, MAX(T3_R1!M20, T3_R2!M20)))","v":0},{"$f":"IF(AND(COUNTRY_INFO!J20>1,COUNTRY_INFO!J20<4),IF(COUNTRY_INFO!E20>MAX('MDA4'!N20,'T1'!L20,MAX(T3_R1!K20,T3_R2!K20)),MAX('MDA4'!N20,'T1'!L20,MAX(T3_R1!K20,T3_R2!K20)),COUNTRY_INFO!E20),0)","v":0},{"$f":"IF(AND(COUNTRY_INFO!J20>1,COUNTRY_INFO!J20<4), IF(T20/COUNTRY_INFO!E20*100<>0, IF(T20/COUNTRY_INFO!E20*100>100,100,T20/COUNTRY_INFO!E20*100), \"-\"),0)","v":0},{"$f":"IF(AND(COUNTRY_INFO!J20>1,COUNTRY_INFO!J20<4),IF(COUNTRY_INFO!F20>MAX('MDA1'!K20,'MDA4'!O20,'T1'!M20,MAX(T3_R1!L20,T3_R2!L20)),MAX('MDA1'!K20,'MDA4'!O20,'T1'!M20,MAX(T3_R1!L20,T3_R2!L20)),COUNTRY_INFO!F20),0)","v":0},{"$f":"IF(AND(COUNTRY_INFO!J20>1,COUNTRY_INFO!J20<4), IF(V20/COUNTRY_INFO!F20*100<>0, IF(V20/COUNTRY_INFO!F20*100>100,100,V20/COUNTRY_INFO!F20*100), \"-\"),0)","v":0},0,{"$f":"IF(AND(COUNTRY_INFO!J20>1,COUNTRY_INFO!J20<4), IF(S20/P20*100<>0, IF(X20/P20*100>100,100,X20/P20*100), \"-\"),0)","v":0},{"$f":"COUNTRY_INFO!P20","v":18310.05},null,null,{"$f":"MAX('T1'!L20,'T2'!J20)+MAX('T1'!M20,'T2'!K20)+MAX('T1'!N20,'T2'!L20)","v":0},{"$f":"IF(COUNTRY_INFO!K20=1,IF(COUNTRY_INFO!F20*0.33>MAX('T1'!M20,'T2'!K20),MAX('T1'!M20,'T2'!K20),COUNTRY_INFO!F20*0.33),IF(COUNTRY_INFO!K20=2,IF(COUNTRY_INFO!F20*0.5>MAX('T1'!M20,'T2'!K20),MAX('T1'!M20,'T2'!K20),COUNTRY_INFO!F20*0.5),IF(COUNTRY_INFO!K20=3,IF(COUNTRY_INFO!F20>MAX('T1'!M20,'T2'!K20),MAX('T1'!M20,'T2'!K20),COUNTRY_INFO!F20),0)))","v":0},{"$f":"IF(AND(COUNTRY_INFO!K20>0,COUNTRY_INFO!K20<4),IF(Z20>0,IF(COUNTRY_INFO!K20=1, AD20/(COUNTRY_INFO!F20*0.33)*100, IF(COUNTRY_INFO!K20=2, AD20/(COUNTRY_INFO!F20*0.5)*100, IF(COUNTRY_INFO!K20=3, AD20/COUNTRY_INFO!F20*100))),\"-\"),0)","v":0},{"$f":"IF(COUNTRY_INFO!K20=2,IF(COUNTRY_INFO!G20*0.2>MAX('T1'!N20,'T2'!L20),MAX('T1'!N20,'T2'!L20),COUNTRY_INFO!G20*0.2),IF(COUNTRY_INFO!K20=3,IF(COUNTRY_INFO!G20>MAX('T1'!N20,'T2'!L20),MAX('T1'!N20,'T2'!L20),COUNTRY_INFO!G20),0))","v":0},{"$f":"IF(AND(COUNTRY_INFO!K20>0,COUNTRY_INFO!K20<4),IF(Z20>0,IF(COUNTRY_INFO!K20=1, 0, IF(COUNTRY_INFO!K20=2, AF20/(COUNTRY_INFO!G20*0.2)*100, IF(COUNTRY_INFO!K20=3, AF20/COUNTRY_INFO!G20*100))),\"-\"),0)","v":0},0,{"$f":"IF(AND(COUNTRY_INFO!K20>0,COUNTRY_INFO!K20<4), IF(AC20/Z20*100<>0, IF(AH20/Z20*100>100,100,AH20/Z20*100), \"-\"),0)","v":"-"},null,{"$f":"IF(AND(D20<>0, D20<>\"Inconnu\",D20<>\"Interrompu\",D20<>\"Non requis\"),D20/COUNTRY_INFO!D20, 0)","v":0},{"$f":"IF(AND(J20<>0,J20<>\"Inconnu\",J20<>\"Interrompu\",J20<>\"Non requis\"),J20/COUNTRY_INFO!D20, 0)","v":0},{"$f":"IF(AND(P20<>0,P20<>\"Inconnu\",P20<>\"Non requis\"),P20/(COUNTRY_INFO!E20+COUNTRY_INFO!F20), 0)","v":0},{"$f":"IF(AND(Z20<>0,Z20<>\"Inconnu\",Z20<>\"Non requis\"),IF(COUNTRY_INFO!K20=1,1,IF(COUNTRY_INFO!K20=2,0.5*COUNTRY_INFO!F20/(0.5*COUNTRY_INFO!F20+0.2*COUNTRY_INFO!G20),IF(COUNTRY_INFO!K20=3,COUNTRY_INFO!F20/(COUNTRY_INFO!F20+COUNTRY_INFO!G20)))),0)","v":1},{"$f":"IF(AND(Z20<>0,Z20<>\"Inconnu\",Z20<>\"Non requis\"),IF(COUNTRY_INFO!K20=1,0,IF(COUNTRY_INFO!K20=2,0.2*COUNTRY_INFO!G20/(0.5*COUNTRY_INFO!F20+0.2*COUNTRY_INFO!G20),IF(COUNTRY_INFO!K20=3,COUNTRY_INFO!G20/(COUNTRY_INFO!F20+COUNTRY_INFO!G20)))),0)","v":0},{"$f":"MAX(COUNTRY_INFO!D20*AK20*PROFILE!$G$7,COUNTRY_INFO!D20*AL20*PROFILE!$G$7)","v":0},{"$f":"MAX(COUNTRY_INFO!D20*AK20*PROFILE!$G$8,COUNTRY_INFO!D20*AL20*PROFILE!$G$8,COUNTRY_INFO!D20*AM20*PROFILE!$G$8)","v":0},{"$f":"MAX(COUNTRY_INFO!D20*AK20*PROFILE!$G$9,COUNTRY_INFO!D20*AL20*PROFILE!$G$9,COUNTRY_INFO!D20*AM20*PROFILE!$G$9,IF(AND(DISTRICT!Z20<>\"Inconnu\",Z20<>\"Non requis\"),COUNTRY_INFO!P20*DISTRICT!AN20,0))","v":18310.05},{"$f":"MAX(COUNTRY_INFO!D20*AK20*PROFILE!$G$10,COUNTRY_INFO!D20*AL20*PROFILE!$G$10,IF(AND(DISTRICT!Z20<>\"Inconnu\",Z20<>\"Non requis\"),COUNTRY_INFO!P20*DISTRICT!AO20,0))","v":0},18310.05,0,{"$f":"MAX('MDA4'!R20,'T1'!L20,'T2'!J20,T3_R1!K20,T3_R2!K20)","v":0},{"$f":"MAX('MDA1'!K20,'MDA4'!S20,'MDA3'!I20,'MDA3'!L20,'T1'!M20,'T2'!K20,T3_R1!L20,T3_R2!L20)","v":0},{"$f":"MAX('MDA1'!L20,'MDA4'!T20,'MDA3'!J20,'MDA3'!M20,'T1'!N20,'T2'!L20,T3_R1!M20,T3_R2!M20)","v":0},0,{"$f":"MAX('MDA4'!R20,T20)","v":0},{"$f":"MAX('MDA1'!K20,'MDA4'!S20,'MDA3'!I20,'MDA3'!L20,V20,AD20)","v":0},{"$f":"MAX('MDA1'!L20,'MDA4'!T20,'MDA3'!J20,'MDA3'!M20,AF20)","v":0},0,0]
[{"$f":"IF(COUNTRY_INFO!A21=0,\" \",COUNTRY_INFO!A21)","v":" Congo"},{"$f":"IF(COUNTRY_INFO!B21=0,\" \",COUNTRY_INFO!B21)","v":"Brazzaville"},{"$f":"IF(COUNTRY_INFO!C21=0,\" \",COUNTRY_INFO!C21)","v":"Ouenzé"},{"$f":"COUNTRY_INFO!M21","v":0},null,null,{"$f":"SUM('MDA1'!M21,'MDA4'!U21)","v":0},{"$f":"IF(AND(COUNTRY_INFO!H21>0,COUNTRY_INFO!H21<4),IF(D21>MAX('MDA1'!M21,'MDA4'!U21),MAX('MDA1'!M21,'MDA4'!U21),D21),0)","v":0},{"$f":"IF(AND(COUNTRY_INFO!H21>0,COUNTRY_INFO!H21<4), IF(G21/D21*100<>0, IF(G21/D21*100>100,100,G21/D21*100), \"-\"),0)","v":0},{"$f":"COUNTRY_INFO!N21","v":0},null,null,{"$f":"MAX('MDA1'!M21,MAX('MDA3'!I21,'MDA3'!L21)+MAX('MDA3'!J21,'MDA3'!M21))","v":0},{"$f":"IF(AND(COUNTRY_INFO!I21>0,COUNTRY_INFO!I21<4),IF(J21>MAX('MDA1'!M21,MAX('MDA3'!I21,'MDA3'!L21)+MAX('MDA3'!J21,'MDA3'!M21)),MAX('MDA1'!M21,MAX('MDA3'!I21,'MDA3'!L21)+MAX('MDA3'!J21,'MDA3'!M21)),J21),0)","v":0},{"$f":"IF(AND(COUNTRY_INFO!I21>0,COUNTRY_INFO!I21<4), IF(M21/J21*100<>0, IF(M21/J21*100>100,100,M21/J21*100), \"-\"),0)","v":0},{"$f":"COUNTRY_INFO!O21","v":0},null,null,{"$f":"SUM(MAX('MDA4'!N21, 'T1'!L21, MAX(T3_R1!K21, T3_R2!K21)), MAX('MDA1'!K21, 'MDA4'!O21, 'T1'!M21, MAX(T3_R1!L21, T3_R2!L21)), MAX('MDA1'!L21, 'MDA4'!P21, 'T1'!N21, MAX(T3_R1!M21, T3_R2!M21)))","v":0},{"$f":"IF(AND(COUNTRY_INFO!J21>1,COUNTRY_INFO!J21<4),IF(COUNTRY_INFO!E21>MAX('MDA4'!N21,'T1'!L21,MAX(T3_R1!K21,T3_R2!K21)),MAX('MDA4'!N21,'T1'!L21,MAX(T3_R1!K21,T3_R2!K21)),COUNTRY_INFO!E21),0)","v":0},{"$f":"IF(AND(COUNTRY_INFO!J21>1,COUNTRY_INFO!J21<4), IF(T21/COUNTRY_INFO!E21*100<>0, IF(T21/COUNTRY_INFO!E21*100>100,100,T21/COUNTRY_INFO!E21*100), \"-\"),0)","v":0},{"$f":"IF(AND(COUNTRY_INFO!J21>1,COUNTRY_INFO!J21<4),IF(COUNTRY_INFO!F21>MAX('MDA1'!K21,'MDA4'!O21,'T1'!M21,MAX(T3_R1!L21,T3_R2!L21)),MAX('MDA1'!K21,'MDA4'!O21,'T1'!M21,MAX(T3_R1!L21,T3_R2!L21)),COUNTRY_INFO!F21),0)","v":0},{"$f":"IF(AND(COUNTRY_INFO!J21>1,COUNTRY_INFO!J21<4), IF(V21/COUNTRY_INFO!F21*100<>0, IF(V21/COUNTRY_INFO!F21*100>100,100,V21/COUNTRY_INFO!F21*100), \"-\"),0)","v":0},0,{"$f":"IF(AND(COUNTRY_INFO!J21>1,COUNTRY_INFO!J21<4), IF(S21/P21*100<>0, IF(X21/P21*100>100,100,X21/P21*100), \"-\"),0)","v":0},{"$f":"COUNTRY_INFO!P21","v":0},null,null,{"$f":"MAX('T1'!L21,'T2'!J21)+MAX('T1'!M21,'T2'!K21)+MAX('T1'!N21,'T2'!L21)","v":0},{"$f":"IF(COUNTRY_INFO!K21=1,IF(COUNTRY_INFO!F21*0.33>MAX('T1'!M21,'T2'!K21),MAX('T1'!M21,'T2'!K21),COUNTRY_INFO!F21*0.33),IF(COUNTRY_INFO!K21=2,IF(COUNTRY_INFO!F21*0.5>MAX('T1'!M21,'T2'!K21),MAX('T1'!M21,'T2'!K21),COUNTRY_INFO!F21*0.5),IF(COUNTRY_INFO!K21=3,IF(COUNTRY_INFO!F21>MAX('T1'!M21,'T2'!K21),MAX('T1'!M21,'T2'!K21),COUNTRY_INFO!F21),0)))","v":0},{"$f":"IF(AND(COUNTRY_INFO!K21>0,COUNTRY_INFO!K21<4),IF(Z21>0,IF(COUNTRY_INFO!K21=1, AD21/(COUNTRY_INFO!F21*0.33)*100, IF(COUNTRY_INFO!K21=2, AD21/(COUNTRY_INFO!F21*0.5)*100, IF(COUNTRY_INFO!K21=3, AD21/COUNTRY_INFO!F21*100))),\"-\"),0)","v":0},{"$f":"IF(COUNTRY_INFO!K21=2,IF(COUNTRY_INFO!G21*0.2>MAX('T1'!N21,'T2'!L21),MAX('T1'!N21,'T2'!L21),COUNTRY_INFO!G21*0.2),IF(COUNTRY_INFO!K21=3,IF(COUNTRY_INFO!G21>MAX('T1'!N21,'T2'!L21),MAX('T1'!N21,'T2'!L21),COUNTRY_INFO!G21),0))","v":0},{"$f":"IF(AND(COUNTRY_INFO!K21>0,COUNTRY_INFO!K21<4),IF(Z21>0,IF(COUNTRY_INFO!K21=1, 0, IF(COUNTRY_INFO!K21=2, AF21/(COUNTRY_INFO!G21*0.2)*100, IF(COUNTRY_INFO!K21=3, AF21/COUNTRY_INFO!G21*100))),\"-\"),0)","v":0},0,{"$f":"IF(AND(COUNTRY_INFO!K21>0,COUNTRY_INFO!K21<4), IF(AC21/Z21*100<>0, IF(AH21/Z21*100>100,100,AH21/Z21*100), \"-\"),0)","v":0},null,{"$f":"IF(AND(D21<>0, D21<>\"Inconnu\",D21<>\"Interrompu\",D21<>\"Non requis\"),D21/COUNTRY_INFO!D21, 0)","v":0},{"$f":"IF(AND(J21<>0,J21<>\"Inconnu\",J21<>\"Interrompu\",J21<>\"Non requis\"),J21/COUNTRY_INFO!D21, 0)","v":0},{"$f":"IF(AND(P21<>0,P21<>\"Inconnu\",P21<>\"Non requis\"),P21/(COUNTRY_INFO!E21+COUNTRY_INFO!F21), 0)","v":0},{"$f":"IF(AND(Z21<>0,Z21<>\"Inconnu\",Z21<>\"Non requis\"),IF(COUNTRY_INFO!K21=1,1,IF(COUNTRY_INFO!K21=2,0.5*COUNTRY_INFO!F21/(0.5*COUNTRY_INFO!F21+0.2*COUNTRY_INFO!G21),IF(COUNTRY_INFO!K21=3,COUNTRY_INFO!F21/(COUNTRY_INFO!F21+COUNTRY_INFO!G21)))),0)","v":0},{"$f":"IF(AND(Z21<>0,Z21<>\"Inconnu\",Z21<>\"Non requis\"),IF(COUNTRY_INFO!K21=1,0,IF(COUNTRY_INFO!K21=2,0.2*COUNTRY_INFO!G21/(0.5*COUNTRY_INFO!F21+0.2*COUNTRY_INFO!G21),IF(COUNTRY_INFO!K21=3,COUNTRY_INFO!G21/(COUNTRY_INFO!F21+COUNTRY_INFO!G21)))),0)","v":0},{"$f":"MAX(COUNTRY_INFO!D21*AK21*PROFILE!$G$7,COUNTRY_INFO!D21*AL21*PROFILE!$G$7)","v":0},{"$f":"MAX(COUNTRY_INFO!D21*AK21*PROFILE!$G$8,COUNTRY_INFO!D21*AL21*PROFILE!$G$8,COUNTRY_INFO!D21*AM21*PROFILE!$G$8)","v":0},{"$f":"MAX(COUNTRY_INFO!D21*AK21*PROFILE!$G$9,COUNTRY_INFO!D21*AL21*PROFILE!$G$9,COUNTRY_INFO!D21*AM21*PROFILE!$G$9,IF(AND(DISTRICT!Z21<>\"Inconnu\",Z21<>\"Non requis\"),COUNTRY_INFO!P21*DISTRICT!AN21,0))","v":0},{"$f":"MAX(COUNTRY_INFO!D21*AK21*PROFILE!$G$10,COUNTRY_INFO!D21*AL21*PROFILE!$G$10,IF(AND(DISTRICT!Z21<>\"Inconnu\",Z21<>\"Non requis\"),COUNTRY_INFO!P21*DISTRICT!AO21,0))","v":0},0,0,{"$f":"MAX('MDA4'!R21,'T1'!L21,'T2'!J21,T3_R1!K21,T3_R2!K21)","v":0},{"$f":"MAX('MDA1'!K21,'MDA4'!S21,'MDA3'!I21,'MDA3'!L21,'T1'!M21,'T2'!K21,T3_R1!L21,T3_R2!L21)","v":0},{"$f":"MAX('MDA1'!L21,'MDA4'!T21,'MDA3'!J21,'MDA3'!M21,'T1'!N21,'T2'!L21,T3_R1!M21,T3_R2!M21)","v":0},0,{"$f":"MAX('MDA4'!R21,T21)","v":0},{"$f":"MAX('MDA1'!K21,'MDA4'!S21,'MDA3'!I21,'MDA3'!L21,V21,AD21)","v":0},{"$f":"MAX('MDA1'!L21,'MDA4'!T21,'MDA3'!J21,'MDA3'!M21,AF21)","v":0},0,0]
[{"$f":"IF(COUNTRY_INFO!A22=0,\" \",COUNTRY_INFO!A22)","v":" Congo"},{"$f":"IF(COUNTRY_INFO!B22=0,\" \",COUNTRY_INFO!B22)","v":"Brazzaville"},{"$f":"IF(COUNTRY_INFO!C22=0,\" \",COUNTRY_INFO!C22)","v":"Poto-Poto"},{"$f":"COUNTRY_INFO!M22","v":0},null,null,{"$f":"SUM('MDA1'!M22,'MDA4'!U22)","v":0},{"$f":"IF(AND(COUNTRY_INFO!H22>0,COUNTRY_INFO!H22<4),IF(D22>MAX('MDA1'!M22,'MDA4'!U22),MAX('MDA1'!M22,'MDA4'!U22),D22),0)","v":0},{"$f":"IF(AND(COUNTRY_INFO!H22>0,COUNTRY_INFO!H22<4), IF(G22/D22*100<>0, IF(G22/D22*100>100,100,G22/D22*100), \"-\"),0)","v":0},{"$f":"COUNTRY_INFO!N22","v":0},null,null,{"$f":"MAX('MDA1'!M22,MAX('MDA3'!I22,'MDA3'!L22)+MAX('MDA3'!J22,'MDA3'!M22))","v":0},{"$f":"IF(AND(COUNTRY_INFO!I22>0,COUNTRY_INFO!I22<4),IF(J22>MAX('MDA1'!M22,MAX('MDA3'!I22,'MDA3'!L22)+MAX('MDA3'!J22,'MDA3'!M22)),MAX('MDA1'!M22,MAX('MDA3'!I22,'MDA3'!L22)+MAX('MDA3'!J22,'MDA3'!M22)),J22),0)","v":0},{"$f":"IF(AND(COUNTRY_INFO!I22>0,COUNTRY_INFO!I22<4), IF(M22/J22*100<>0, IF(M22/J22*100>100,100,M22/J22*100), \"-\"),0)","v":0},{"$f":"COUNTRY_INFO!O22","v":0},null,null,{"$f":"SUM(MAX('MDA4'!N22, 'T1'!L22, MAX(T3_R1!K22, T3_R2!K22)), MAX('MDA1'!K22, 'MDA4'!O22, 'T1'!M22, MAX(T3_R1!L22, T3_R2!L22)), MAX('MDA1'!L22, 'MDA4'!P22, 'T1'!N22, MAX(T3_R1!M22, T3_R2!M22)))","v":0},{"$f":"IF(AND(COUNTRY_INFO!J22>1,COUNTRY_INFO!J22<4),IF(COUNTRY_INFO!E22>MAX('MDA4'!N22,'T1'!L22,MAX(T3_R1!K22,T3_R2!K22)),MAX('MDA4'!N22,'T1'!L22,MAX(T3_R1!K22,T3_R2!K22)),COUNTRY_INFO!E22),0)","v":0},{"$f":"IF(AND(COUNTRY_INFO!J22>1,COUNTRY_INFO!J22<4), IF(T22/COUNTRY_INFO!E22*100<>0, IF(T22/COUNTRY_INFO!E22*100>100,100,T22/COUNTRY_INFO!E22*100), \"-\"),0)","v":0},{"$f":"IF(AND(COUNTRY_INFO!J22>1,COUNTRY_INFO!J22<4),IF(COUNTRY_INFO!F22>MAX('MDA1'!K22,'MDA4'!O22,'T1'!M22,MAX(T3_R1!L22,T3_R2!L22)),MAX('MDA1'!K22,'MDA4'!O22,'T1'!M22,MAX(T3_R1!L22,T3_R2!L22)),COUNTRY_INFO!F22),0)","v":0},{"$f":"IF(AND(COUNTRY_INFO!J22>1,COUNTRY_INFO!J22<4), IF(V22/COUNTRY_INFO!F22*100<>0, IF(V22/COUNTRY_INFO!F22*100>100,100,V22/COUNTRY_INFO!F22*100), \"-\"),0)","v":0},0,{"$f":"IF(AND(COUNTRY_INFO!J22>1,COUNTRY_INFO!J22<4), IF(S22/P22*100<>0, IF(X22/P22*100>100,100,X22/P22*100), \"-\"),0)","v":0},{"$f":"COUNTRY_INFO!P22","v":0},null,null,{"$f":"MAX('T1'!L22,'T2'!J22)+MAX('T1'!M22,'T2'!K22)+MAX('T1'!N22,'T2'!L22)","v":0},{"$f":"IF(COUNTRY_INFO!K22=1,IF(COUNTRY_INFO!F22*0.33>MAX('T1'!M22,'T2'!K22),MAX('T1'!M22,'T2'!K22),COUNTRY_INFO!F22*0.33),IF(COUNTRY_INFO!K22=2,IF(COUNTRY_INFO!F22*0.5>MAX('T1'!M22,'T2'!K22),MAX('T1'!M22,'T2'!K22),COUNTRY_INFO!F22*0.5),IF(COUNTRY_INFO!K22=3,IF(COUNTRY_INFO!F22>MAX('T1'!M22,'T2'!K22),MAX('T1'!M22,'T2'!K22),COUNTRY_INFO!F22),0)))","v":0},{"$f":"IF(AND(COUNTRY_INFO!K22>0,COUNTRY_INFO!K22<4),IF(Z22>0,IF(COUNTRY_INFO!K22=1, AD22/(COUNTRY_INFO!F22*0.33)*100, IF(COUNTRY_INFO!K22=2, AD22/(COUNTRY_INFO!F22*0.5)*100, IF(COUNTRY_INFO!K22=3, AD22/COUNTRY_INFO!F22*100))),\"-\"),0)","v":0},{"$f":"IF(COUNTRY_INFO!K22=2,IF(COUNTRY_INFO!G22*0.2>MAX('T1'!N22,'T2'!L22),MAX('T1'!N22,'T2'!L22),COUNTRY_INFO!G22*0.2),IF(COUNTRY_INFO!K22=3,IF(COUNTRY_INFO!G22>MAX('T1'!N22,'T2'!L22),MAX('T1'!N22,'T2'!L22),COUNTRY_INFO!G22),0))","v":0},{"$f":"IF(AND(COUNTRY_INFO!K22>0,COUNTRY_INFO!K22<4),IF(Z22>0,IF(COUNTRY_INFO!K22=1, 0, IF(COUNTRY_INFO!K22=2, AF22/(COUNTRY_INFO!G22*0.2)*100, IF(COUNTRY_INFO!K22=3, AF22/COUNTRY_INFO!G22*100))),\"-\"),0)","v":0},0,{"$f":"IF(AND(COUNTRY_INFO!K22>0,COUNTRY_INFO!K22<4), IF(AC22/Z22*100<>0, IF(AH22/Z22*100>100,100,AH22/Z22*100), \"-\"),0)","v":0},null,{"$f":"IF(AND(D22<>0, D22<>\"Inconnu\",D22<>\"Interrompu\",D22<>\"Non requis\"),D22/COUNTRY_INFO!D22, 0)","v":0},{"$f":"IF(AND(J22<>0,J22<>\"Inconnu\",J22<>\"Interrompu\",J22<>\"Non requis\"),J22/COUNTRY_INFO!D22, 0)","v":0},{"$f":"IF(AND(P22<>0,P22<>\"Inconnu\",P22<>\"Non requis\"),P22/(COUNTRY_INFO!E22+COUNTRY_INFO!F22), 0)","v":0},{"$f":"IF(AND(Z22<>0,Z22<>\"Inconnu\",Z22<>\"Non requis\"),IF(COUNTRY_INFO!K22=1,1,IF(COUNTRY_INFO!K22=2,0.5*COUNTRY_INFO!F22/(0.5*COUNTRY_INFO!F22+0.2*COUNTRY_INFO!G22),IF(COUNTRY_INFO!K22=3,COUNTRY_INFO!F22/(COUNTRY_INFO!F22+COUNTRY_INFO!G22)))),0)","v":0},{"$f":"IF(AND(Z22<>0,Z22<>\"Inconnu\",Z22<>\"Non requis\"),IF(COUNTRY_INFO!K22=1,0,IF(COUNTRY_INFO!K22=2,0.2*COUNTRY_INFO!G22/(0.5*COUNTRY_INFO!F22+0.2*COUNTRY_INFO!G22),IF(COUNTRY_INFO!K22=3,COUNTRY_INFO!G22/(COUNTRY_INFO!F22+COUNTRY_INFO!G22)))),0)","v":0},{"$f":"MAX(COUNTRY_INFO!D22*AK22*PROFILE!$G$7,COUNTRY_INFO!D22*AL22*PROFILE!$G$7)","v":0},{"$f":"MAX(COUNTRY_INFO!D22*AK22*PROFILE!$G$8,COUNTRY_INFO!D22*AL22*PROFILE!$G$8,COUNTRY_INFO!D22*AM22*PROFILE!$G$8)","v":0},{"$f":"MAX(COUNTRY_INFO!D22*AK22*PROFILE!$G$9,COUNTRY_INFO!D22*AL22*PROFILE!$G$9,COUNTRY_INFO!D22*AM22*PROFILE!$G$9,IF(AND(DISTRICT!Z22<>\"Inconnu\",Z22<>\"Non requis\"),COUNTRY_INFO!P22*DISTRICT!AN22,0))","v":0},{"$f":"MAX(COUNTRY_INFO!D22*AK22*PROFILE!$G$10,COUNTRY_INFO!D22*AL22*PROFILE!$G$10,IF(AND(DISTRICT!Z22<>\"Inconnu\",Z22<>\"Non requis\"),COUNTRY_INFO!P22*DISTRICT!AO22,0))","v":0},0,0,{"$f":"MAX('MDA4'!R22,'T1'!L22,'T2'!J22,T3_R1!K22,T3_R2!K22)","v":0},{"$f":"MAX('MDA1'!K22,'MDA4'!S22,'MDA3'!I22,'MDA3'!L22,'T1'!M22,'T2'!K22,T3_R1!L22,T3_R2!L22)","v":0},{"$f":"MAX('MDA1'!L22,'MDA4'!T22,'MDA3'!J22,'MDA3'!M22,'T1'!N22,'T2'!L22,T3_R1!M22,T3_R2!M22)","v":0},0,{"$f":"MAX('MDA4'!R22,T22)","v":0},{"$f":"MAX('MDA1'!K22,'MDA4'!S22,'MDA3'!I22,'MDA3'!L22,V22,AD22)","v":0},{"$f":"MAX('MDA1'!L22,'MDA4'!T22,'MDA3'!J22,'MDA3'!M22,AF22)","v":0},0,0]
[{"$f":"IF(COUNTRY_INFO!A23=0,\" \",COUNTRY_INFO!A23)","v":" Congo"},{"$f":"IF(COUNTRY_INFO!B23=0,\" \",COUNTRY_INFO!B23)","v":"Brazzaville"},{"$f":"IF(COUNTRY_INFO!C23=0,\" \",COUNTRY_INFO!C23)","v":"Talangaî"},{"$f":"COUNTRY_INFO!M23","v":0},null,null,{"$f":"SUM('MDA1'!M23,'MDA4'!U23)","v":0},{"$f":"IF(AND(COUNTRY_INFO!H23>0,COUNTRY_INFO!H23<4),IF(D23>MAX('MDA1'!M23,'MDA4'!U23),MAX('MDA1'!M23,'MDA4'!U23),D23),0)","v":0},{"$f":"IF(AND(COUNTRY_INFO!H23>0,COUNTRY_INFO!H23<4), IF(G23/D23*100<>0, IF(G23/D23*100>100,100,G23/D23*100), \"-\"),0)","v":0},{"$f":"COUNTRY_INFO!N23","v":0},null,null,{"$f":"MAX('MDA1'!M23,MAX('MDA3'!I23,'MDA3'!L23)+MAX('MDA3'!J23,'MDA3'!M23))","v":0},{"$f":"IF(AND(COUNTRY_INFO!I23>0,COUNTRY_INFO!I23<4),IF(J23>MAX('MDA1'!M23,MAX('MDA3'!I23,'MDA3'!L23)+MAX('MDA3'!J23,'MDA3'!M23)),MAX('MDA1'!M23,MAX('MDA3'!I23,'MDA3'!L23)+MAX('MDA3'!J23,'MDA3'!M23)),J23),0)","v":0},{"$f":"IF(AND(COUNTRY_INFO!I23>0,COUNTRY_INFO!I23<4), IF(M23/J23*100<>0, IF(M23/J23*100>100,100,M23/J23*100), \"-\"),0)","v":0},{"$f":"COUNTRY_INFO!O23","v":0},null,null,{"$f":"SUM(MAX('MDA4'!N23, 'T1'!L23, MAX(T3_R1!K23, T3_R2!K23)), MAX('MDA1'!K23, 'MDA4'!O23, 'T1'!M23, MAX(T3_R1!L23, T3_R2!L23)), MAX('MDA1'!L23, 'MDA4'!P23, 'T1'!N23, MAX(T3_R1!M23, T3_R2!M23)))","v":0},{"$f":"IF(AND(COUNTRY_INFO!J23>1,COUNTRY_INFO!J23<4),IF(COUNTRY_INFO!E23>MAX('MDA4'!N23,'T1'!L23,MAX(T3_R1!K23,T3_R2!K23)),MAX('MDA4'!N23,'T1'!L23,MAX(T3_R1!K23,T3_R2!K23)),COUNTRY_INFO!E23),0)","v":0},{"$f":"IF(AND(COUNTRY_INFO!J23>1,COUNTRY_INFO!J23<4), IF(T23/COUNTRY_INFO!E23*100<>0, IF(T23/COUNTRY_INFO!E23*100>100,100,T23/COUNTRY_INFO!E23*100), \"-\"),0)","v":0},{"$f":"IF(AND(COUNTRY_INFO!J23>1,COUNTRY_INFO!J23<4),IF(COUNTRY_INFO!F23>MAX('MDA1'!K23,'MDA4'!O23,'T1'!M23,MAX(T3_R1!L23,T3_R2!L23)),MAX('MDA1'!K23,'MDA4'!O23,'T1'!M23,MAX(T3_R1!L23,T3_R2!L23)),COUNTRY_INFO!F23),0)","v":0},{"$f":"IF(AND(COUNTRY_INFO!J23>1,COUNTRY_INFO!J23<4), IF(V23/COUNTRY_INFO!F23*100<>0, IF(V23/COUNTRY_INFO!F23*100>100,100,V23/COUNTRY_INFO!F23*100), \"-\"),0)","v":0},0,{"$f":"IF(AND(COUNTRY_INFO!J23>1,COUNTRY_INFO!J23<4), IF(S23/P23*100<>0, IF(X23/P23*100>100,100,X23/P23*100), \"-\"),0)","v":0},{"$f":"COUNTRY_INFO!P23","v":0},null,null,{"$f":"MAX('T1'!L23,'T2'!J23)+MAX('T1'!M23,'T2'!K23)+MAX('T1'!N23,'T2'!L23)","v":0},{"$f":"IF(COUNTRY_INFO!K23=1,IF(COUNTRY_INFO!F23*0.33>MAX('T1'!M23,'T2'!K23),MAX('T1'!M23,'T2'!K23),COUNTRY_INFO!F23*0.33),IF(COUNTRY_INFO!K23=2,IF(COUNTRY_INFO!F23*0.5>MAX('T1'!M23,'T2'!K23),MAX('T1'!M23,'T2'!K23),COUNTRY_INFO!F23*0.5),IF(COUNTRY_INFO!K23=3,IF(COUNTRY_INFO!F23>MAX('T1'!M23,'T2'!K23),MAX('T1'!M23,'T2'!K23),COUNTRY_INFO!F23),0)))","v":0},{"$f":"IF(AND(COUNTRY_INFO!K23>0,COUNTRY_INFO!K23<4),IF(Z23>0,IF(COUNTRY_INFO!K23=1, AD23/(COUNTRY_INFO!F23*0.33)*100, IF(COUNTRY_INFO!K23=2, AD23/(COUNTRY_INFO!F23*0.5)*100, IF(COUNTRY_INFO!K23=3, AD23/COUNTRY_INFO!F23*100))),\"-\"),0)","v":0},{"$f":"IF(COUNTRY_INFO!K23=2,IF(COUNTRY_INFO!G23*0.2>MAX('T1'!N23,'T2'!L23),MAX('T1'!N23,'T2'!L23),COUNTRY_INFO!G23*0.2),IF(COUNTRY_INFO!K23=3,IF(COUNTRY_INFO!G23>MAX('T1'!N23,'T2'!L23),MAX('T1'!N23,'T2'!L23),COUNTRY_INFO!G23),0))","v":0},{"$f":"IF(AND(COUNTRY_INFO!K23>0,COUNTRY_INFO!K23<4),IF(Z23>0,IF(COUNTRY_INFO!K23=1, 0, IF(COUNTRY_INFO!K23=2, AF23/(COUNTRY_INFO!G23*0.2)*100, IF(COUNTRY_INFO!K23=3, AF23/COUNTRY_INFO!G23*100))),\"-\"),0)","v":0},0,{"$f":"IF(AND(COUNTRY_INFO!K23>0,COUNTRY_INFO!K23<4), IF(AC23/Z23*100<>0, IF(AH23/Z23*100>100,100,AH23/Z23*100), \"-\"),0)","v":0},null,{"$f":"IF(AND(D23<>0, D23<>\"Inconnu\",D23<>\"Interrompu\",D23<>\"Non requis\"),D23/COUNTRY_INFO!D23, 0)","v":0},{"$f":"IF(AND(J23<>0,J23<>\"Inconnu\",J23<>\"Interrompu\",J23<>\"Non requis\"),J23/COUNTRY_INFO!D23, 0)","v":0},{"$f":"IF(AND(P23<>0,P23<>\"Inconnu\",P23<>\"Non requis\"),P23/(COUNTRY_INFO!E23+COUNTRY_INFO!F23), 0)","v":0},{"$f":"IF(AND(Z23<>0,Z23<>\"Inconnu\",Z23<>\"Non requis\"),IF(COUNTRY_INFO!K23=1,1,IF(COUNTRY_INFO!K23=2,0.5*COUNTRY_INFO!F23/(0.5*COUNTRY_INFO!F23+0.2*COUNTRY_INFO!G23),IF(COUNTRY_INFO!K23=3,COUNTRY_INFO!F23/(COUNTRY_INFO!F23+COUNTRY_INFO!G23)))),0)","v":0},{"$f":"IF(AND(Z23<>0,Z23<>\"Inconnu\",Z23<>\"Non requis\"),IF(COUNTRY_INFO!K23=1,0,IF(COUNTRY_INFO!K23=2,0.2*COUNTRY_INFO!G23/(0.5*COUNTRY_INFO!F23+0.2*COUNTRY_INFO!G23),IF(COUNTRY_INFO!K23=3,COUNTRY_INFO!G23/(COUNTRY_INFO!F23+COUNTRY_INFO!G23)))),0)","v":0},{"$f":"MAX(COUNTRY_INFO!D23*AK23*PROFILE!$G$7,COUNTRY_INFO!D23*AL23*PROFILE!$G$7)","v":0},{"$f":"MAX(COUNTRY_INFO!D23*AK23*PROFILE!$G$8,COUNTRY_INFO!D23*AL23*PROFILE!$G$8,COUNTRY_INFO!D23*AM23*PROFILE!$G$8)","v":0},{"$f":"MAX(COUNTRY_INFO!D23*AK23*PROFILE!$G$9,COUNTRY_INFO!D23*AL23*PROFILE!$G$9,COUNTRY_INFO!D23*AM23*PROFILE!$G$9,IF(AND(DISTRICT!Z23<>\"Inconnu\",Z23<>\"Non requis\"),COUNTRY_INFO!P23*DISTRICT!AN23,0))","v":0},{"$f":"MAX(COUNTRY_INFO!D23*AK23*PROFILE!$G$10,COUNTRY_INFO!D23*AL23*PROFILE!$G$10,IF(AND(DISTRICT!Z23<>\"Inconnu\",Z23<>\"Non requis\"),COUNTRY_INFO!P23*DISTRICT!AO23,0))","v":0},0,0,{"$f":"MAX('MDA4'!R23,'T1'!L23,'T2'!J23,T3_R1!K23,T3_R2!K23)","v":0},{"$f":"MAX('MDA1'!K23,'MDA4'!S23,'MDA3'!I23,'MDA3'!L23,'T1'!M23,'T2'!K23,T3_R1!L23,T3_R2!L23)","v":0},{"$f":"MAX('MDA1'!L23,'MDA4'!T23,'MDA3'!J23,'MDA3'!M23,'T1'!N23,'T2'!L23,T3_R1!M23,T3_R2!M23)","v":0},0,{"$f":"MAX('MDA4'!R23,T23)","v":0},{"$f":"MAX('MDA1'!K23,'MDA4'!S23,'MDA3'!I23,'MDA3'!L23,V23,AD23)","v":0},{"$f":"MAX('MDA1'!L23,'MDA4'!T23,'MDA3'!J23,'MDA3'!M23,AF23)","v":0},0,0]
[{"$f":"IF(COUNTRY_INFO!A24=0,\" \",COUNTRY_INFO!A24)","v":" Congo"},{"$f":"IF(COUNTRY_INFO!B24=0,\" \",COUNTRY_INFO!B24)","v":"Cuvette"},{"$f":"IF(COUNTRY_INFO!C24=0,\" \",COUNTRY_INFO!C24)","v":"Mossaka"},{"$f":"COUNTRY_INFO!M24","v":0},null,null,{"$f":"SUM('MDA1'!M24,'MDA4'!U24)","v":0},{"$f":"IF(AND(COUNTRY_INFO!H24>0,COUNTRY_INFO!H24<4),IF(D24>MAX('MDA1'!M24,'MDA4'!U24),MAX('MDA1'!M24,'MDA4'!U24),D24),0)","v":0},{"$f":"IF(AND(COUNTRY_INFO!H24>0,COUNTRY_INFO!H24<4), IF(G24/D24*100<>0, IF(G24/D24*100>100,100,G24/D24*100), \"-\"),0)","v":0},{"$f":"COUNTRY_INFO!N24","v":0},null,null,{"$f":"MAX('MDA1'!M24,MAX('MDA3'!I24,'MDA3'!L24)+MAX('MDA3'!J24,'MDA3'!M24))","v":0},{"$f":"IF(AND(COUNTRY_INFO!I24>0,COUNTRY_INFO!I24<4),IF(J24>MAX('MDA1'!M24,MAX('MDA3'!I24,'MDA3'!L24)+MAX('MDA3'!J24,'MDA3'!M24)),MAX('MDA1'!M24,MAX('MDA3'!I24,'MDA3'!L24)+MAX('MDA3'!J24,'MDA3'!M24)),J24),0)","v":0},{"$f":"IF(AND(COUNTRY_INFO!I24>0,COUNTRY_INFO!I24<4), IF(M24/J24*100<>0, IF(M24/J24*100>100,100,M24/J24*100), \"-\"),0)","v":0},{"$f":"COUNTRY_INFO!O24","v":25932},null,null,{"$f":"SUM(MAX('MDA4'!N24, 'T1'!L24, MAX(T3_R1!K24, T3_R2!K24)), MAX('MDA1'!K24, 'MDA4'!O24, 'T1'!M24, MAX(T3_R1!L24, T3_R2!L24)), MAX('MDA1'!L24, 'MDA4'!P24, 'T1'!N24, MAX(T3_R1!M24, T3_R2!M24)))","v":0},{"$f":"IF(AND(COUNTRY_INFO!J24>1,COUNTRY_INFO!J24<4),IF(COUNTRY_INFO!E24>MAX('MDA4'!N24,'T1'!L24,MAX(T3_R1!K24,T3_R2!K24)),MAX('MDA4'!N24,'T1'!L24,MAX(T3_R1!K24,T3_R2!K24)),COUNTRY_INFO!E24),0)","v":0},{"$f":"IF(AND(COUNTRY_INFO!J24>1,COUNTRY_INFO!J24<4), IF(T24/COUNTRY_INFO!E24*100<>0, IF(T24/COUNTRY_INFO!E24*100>100,100,T24/COUNTRY_INFO!E24*100), \"-\"),0)","v":"-"},{"$f":"IF(AND(COUNTRY_INFO!J24>1,COUNTRY_INFO!J24<4),IF(COUNTRY_INFO!F24>MAX('MDA1'!K24,'MDA4'!O24,'T1'!M24,MAX(T3_R1!L24,T3_R2!L24)),MAX('MDA1'!K24,'MDA4'!O24,'T1'!M24,MAX(T3_R1!L24,T3_R2!L24)),COUNTRY_INFO!F24),0)","v":0},{"$f":"IF(AND(COUNTRY_INFO!J24>1,COUNTRY_INFO!J24<4), IF(V24/COUNTRY_INFO!F24*100<>0, IF(V24/COUNTRY_INFO!F24*100>100,100,V24/COUNTRY_INFO!F24*100), \"-\"),0)","v":"-"},0,{"$f":"IF(AND(COUNTRY_INFO!J24>1,COUNTRY_INFO!J24<4), IF(S24/P24*100<>0, IF(X24/P24*100>100,100,X24/P24*100), \"-\"),0)","v":"-"},{"$f":"COUNTRY_INFO!P24","v":5134.47},null,null,{"$f":"MAX('T1'!L24,'T2'!J24)+MAX('T1'!M24,'T2'!K24)+MAX('T1'!N24,'T2'!L24)","v":0},{"$f":"IF(COUNTRY_INFO!K24=1,IF(COUNTRY_INFO!F24*0.33>MAX('T1'!M24,'T2'!K24),MAX('T1'!M24,'T2'!K24),COUNTRY_INFO!F24*0.33),IF(COUNTRY_INFO!K24=2,IF(COUNTRY_INFO!F24*0.5>MAX('T1'!M24,'T2'!K24),MAX('T1'!M24,'T2'!K24),COUNTRY_INFO!F24*0.5),IF(COUNTRY_INFO!K24=3,IF(COUNTRY_INFO!F24>MAX('T1'!M24,'T2'!K24),MAX('T1'!M24,'T2'!K24),COUNTRY_INFO!F24),0)))","v":0},{"$f":"IF(AND(COUNTRY_INFO!K24>0,COUNTRY_INFO!K24<4),IF(Z24>0,IF(COUNTRY_INFO!K24=1, AD24/(COUNTRY_INFO!F24*0.33)*100, IF(COUNTRY_INFO!K24=2, AD24/(COUNTRY_INFO!F24*0.5)*100, IF(COUNTRY_INFO!K24=3, AD24/COUNTRY_INFO!F24*100))),\"-\"),0)","v":0},{"$f":"IF(COUNTRY_INFO!K24=2,IF(COUNTRY_INFO!G24*0.2>MAX('T1'!N24,'T2'!L24),MAX('T1'!N24,'T2'!L24),COUNTRY_INFO!G24*0.2),IF(COUNTRY_INFO!K24=3,IF(COUNTRY_INFO!G24>MAX('T1'!N24,'T2'!L24),MAX('T1'!N24,'T2'!L24),COUNTRY_INFO!G24),0))","v":0},{"$f":"IF(AND(COUNTRY_INFO!K24>0,COUNTRY_INFO!K24<4),IF(Z24>0,IF(COUNTRY_INFO!K24=1, 0, IF(COUNTRY_INFO!K24=2, AF24/(COUNTRY_INFO!G24*0.2)*100, IF(COUNTRY_INFO!K24=3, AF24/COUNTRY_INFO!G24*100))),\"-\"),0)","v":0},0,{"$f":"IF(AND(COUNTRY_INFO!K24>0,COUNTRY_INFO!K24<4), IF(AC24/Z24*100<>0, IF(AH24/Z24*100>100,100,AH24/Z24*100), \"-\"),0)","v":"-"},null,{"$f":"IF(AND(D24<>0, D24<>\"Inconnu\",D24<>\"Interrompu\",D24<>\"Non requis\"),D24/COUNTRY_INFO!D24, 0)","v":0},{"$f":"IF(AND(J24<>0,J24<>\"Inconnu\",J24<>\"Interrompu\",J24<>\"Non requis\"),J24/COUNTRY_INFO!D24, 0)","v":0},{"$f":"IF(AND(P24<>0,P24<>\"Inconnu\",P24<>\"Non requis\"),P24/(COUNTRY_INFO!E24+COUNTRY_INFO!F24), 0)","v":1},{"$f":"IF(AND(Z24<>0,Z24<>\"Inconnu\",Z24<>\"Non requis\"),IF(COUNTRY_INFO!K24=1,1,IF(COUNTRY_INFO!K24=2,0.5*COUNTRY_INFO!F24/(0.5*COUNTRY_INFO!F24+0.2*COUNTRY_INFO!G24),IF(COUNTRY_INFO!K24=3,COUNTRY_INFO!F24/(COUNTRY_INFO!F24+COUNTRY_INFO!G24)))),0)","v":1},{"$f":"IF(AND(Z24<>0,Z24<>\"Inconnu\",Z24<>\"Non requis\"),IF(COUNTRY_INFO!K24=1,0,IF(COUNTRY_INFO!K24=2,0.2*COUNTRY_INFO!G24/(0.5*COUNTRY_INFO!F24+0.2*COUNTRY_INFO!G24),IF(COUNTRY_INFO!K24=3,COUNTRY_INFO!G24/(COUNTRY_INFO!F24+COUNTRY_INFO!G24)))),0)","v":0},{"$f":"MAX(COUNTRY_INFO!D24*AK24*PROFILE!$G$7,COUNTRY_INFO!D24*AL24*PROFILE!$G$7)","v":0},{"$f":"MAX(COUNTRY_INFO!D24*AK24*PROFILE!$G$8,COUNTRY_INFO!D24*AL24*PROFILE!$G$8,COUNTRY_INFO!D24*AM24*PROFILE!$G$8)","v":10372.639025427885},{"$f":"MAX(COUNTRY_INFO!D24*AK24*PROFILE!$G$9,COUNTRY_INFO!D24*AL24*PROFILE!$G$9,COUNTRY_INFO!D24*AM24*PROFILE!$G$9,IF(AND(DISTRICT!Z24<>\"Inconnu\",Z24<>\"Non requis\"),COUNTRY_INFO!P24*DISTRICT!AN24,0))","v":15558.934173838958},{"$f":"MAX(COUNTRY_INFO!D24*AK24*PROFILE!$G$10,COUNTRY_INFO!D24*AL24*PROFILE!$G$10,IF(AND(DISTRICT!Z24<>\"Inconnu\",Z24<>\"Non requis\"),COUNTRY_INFO!P24*DISTRICT!AO24,0))","v":0},25931.573199266844,0,{"$f":"MAX('MDA4'!R24,'T1'!L24,'T2'!J24,T3_R1!K24,T3_R2!K24)","v":0},{"$f":"MAX('MDA1'!K24,'MDA4'!S24,'MDA3'!I24,'MDA3'!L24,'T1'!M24,'T2'!K24,T3_R1!L24,T3_R2!L24)","v":0},{"$f":"MAX('MDA1'!L24,'MDA4'!T24,'MDA3'!J24,'MDA3'!M24,'T1'!N24,'T2'!L24,T3_R1!M24,T3_R2!M24)","v":0},0,{"$f":"MAX('MDA4'!R24,T24)","v":0},{"$f":"MAX('MDA1'!K24,'MDA4'!S24,'MDA3'!I24,'MDA3'!L24,V24,AD24)","v":0},{"$f":"MAX('MDA1'!L24,'MDA4'!T24,'MDA3'!J24,'MDA3'!M24,AF24)","v":0},0,0]
[{"$f":"IF(COUNTRY_INFO!A25=0,\" \",COUNTRY_INFO!A25)","v":" Congo"},{"$f":"IF(COUNTRY_INFO!B25=0,\" \",COUNTRY_INFO!B25)","v":"Cuvette"},{"$f":"IF(COUNTRY_INFO!C25=0,\" \",COUNTRY_INFO!C25)","v":"Owando"},{"$f":"COUNTRY_INFO!M25","v":94456},21088,21432,{"$f":"SUM('MDA1'!M25,'MDA4'!U25)","v":42520},{"$f":"IF(AND(COUNTRY_INFO!H25>0,COUNTRY_INFO!H25<4),IF(D25>MAX('MDA1'!M25,'MDA4'!U25),MAX('MDA1'!M25,'MDA4'!U25),D25),0)","v":42520},{"$f":"IF(AND(COUNTRY_INFO!H25>0,COUNTRY_INFO!H25<4), IF(G25/D25*100<>0, IF(G25/D25*100>100,100,G25/D25*100), \"-\"),0)","v":45.015668671127294},{"$f":"COUNTRY_INFO!N25","v":0},null,null,{"$f":"MAX('MDA1'!M25,MAX('MDA3'!I25,'MDA3'!L25)+MAX('MDA3'!J25,'MDA3'!M25))","v":0},{"$f":"IF(AND(COUNTRY_INFO!I25>0,COUNTRY_INFO!I25<4),IF(J25>MAX('MDA1'!M25,MAX('MDA3'!I25,'MDA3'!L25)+MAX('MDA3'!J25,'MDA3'!M25)),MAX('MDA1'!M25,MAX('MDA3'!I25,'MDA3'!L25)+MAX('MDA3'!J25,'MDA3'!M25)),J25),0)","v":0},{"$f":"IF(AND(COUNTRY_INFO!I25>0,COUNTRY_INFO!I25<4), IF(M25/J25*100<>0, IF(M25/J25*100>100,100,M25/J25*100), \"-\"),0)","v":0},{"$f":"COUNTRY_INFO!O25","v":0},null,null,{"$f":"SUM(MAX('MDA4'!N25, 'T1'!L25, MAX(T3_R1!K25, T3_R2!K25)), MAX('MDA1'!K25, 'MDA4'!O25, 'T1'!M25, MAX(T3_R1!L25, T3_R2!L25)), MAX('MDA1'!L25, 'MDA4'!P25, 'T1'!N25, MAX(T3_R1!M25, T3_R2!M25)))","v":0},{"$f":"IF(AND(COUNTRY_INFO!J25>1,COUNTRY_INFO!J25<4),IF(COUNTRY_INFO!E25>MAX('MDA4'!N25,'T1'!L25,MAX(T3_R1!K25,T3_R2!K25)),MAX('MDA4'!N25,'T1'!L25,MAX(T3_R1!K25,T3_R2!K25)),COUNTRY_INFO!E25),0)","v":0},{"$f":"IF(AND(COUNTRY_INFO!J25>1,COUNTRY_INFO!J25<4), IF(T25/COUNTRY_INFO!E25*100<>0, IF(T25/COUNTRY_INFO!E25*100>100,100,T25/COUNTRY_INFO!E25*100), \"-\"),0)","v":0},{"$f":"IF(AND(COUNTRY_INFO!J25>1,COUNTRY_INFO!J25<4),IF(COUNTRY_INFO!F25>MAX('MDA1'!K25,'MDA4'!O25,'T1'!M25,MAX(T3_R1!L25,T3_R2!L25)),MAX('MDA1'!K25,'MDA4'!O25,'T1'!M25,MAX(T3_R1!L25,T3_R2!L25)),COUNTRY_INFO!F25),0)","v":0},{"$f":"IF(AND(COUNTRY_INFO!J25>1,COUNTRY_INFO!J25<4), IF(V25/COUNTRY_INFO!F25*100<>0, IF(V25/COUNTRY_INFO!F25*100>100,100,V25/COUNTRY_INFO!F25*100), \"-\"),0)","v":0},0,{"$f":"IF(AND(COUNTRY_INFO!J25>1,COUNTRY_INFO!J25<4), IF(S25/P25*100<>0, IF(X25/P25*100>100,100,X25/P25*100), \"-\"),0)","v":0},{"$f":"COUNTRY_INFO!P25","v":7480.77},null,null,{"$f":"MAX('T1'!L25,'T2'!J25)+MAX('T1'!M25,'T2'!K25)+MAX('T1'!N25,'T2'!L25)","v":0},{"$f":"IF(COUNTRY_INFO!K25=1,IF(COUNTRY_INFO!F25*0.33>MAX('T1'!M25,'T2'!K25),MAX('T1'!M25,'T2'!K25),COUNTRY_INFO!F25*0.33),IF(COUNTRY_INFO!K25=2,IF(COUNTRY_INFO!F25*0.5>MAX('T1'!M25,'T2'!K25),MAX('T1'!M25,'T2'!K25),COUNTRY_INFO!F25*0.5),IF(COUNTRY_INFO!K25=3,IF(COUNTRY_INFO!F25>MAX('T1'!M25,'T2'!K25),MAX('T1'!M25,'T2'!K25),COUNTRY_INFO!F25),0)))","v":0},{"$f":"IF(AND(COUNTRY_INFO!K25>0,COUNTRY_INFO!K25<4),IF(Z25>0,IF(COUNTRY_INFO!K25=1, AD25/(COUNTRY_INFO!F25*0.33)*100, IF(COUNTRY_INFO!K25=2, AD25/(COUNTRY_INFO!F25*0.5)*100, IF(COUNTRY_INFO!K25=3, AD25/COUNTRY_INFO!F25*100))),\"-\"),0)","v":0},{"$f":"IF(COUNTRY_INFO!K25=2,IF(COUNTRY_INFO!G25*0.2>MAX('T1'!N25,'T2'!L25),MAX('T1'!N25,'T2'!L25),COUNTRY_INFO!G25*0.2),IF(COUNTRY_INFO!K25=3,IF(COUNTRY_INFO!G25>MAX('T1'!N25,'T2'!L25),MAX('T1'!N25,'T2'!L25),COUNTRY_INFO!G25),0))","v":0},{"$f":"IF(AND(COUNTRY_INFO!K25>0,COUNTRY_INFO!K25<4),IF(Z25>0,IF(COUNTRY_INFO!K25=1, 0, IF(COUNTRY_INFO!K25=2, AF25/(COUNTRY_INFO!G25*0.2)*100, IF(COUNTRY_INFO!K25=3, AF25/COUNTRY_INFO!G25*100))),\"-\"),0)","v":0},0,{"$f":"IF(AND(COUNTRY_INFO!K25>0,COUNTRY_INFO!K25<4), IF(AC25/Z25*100<>0, IF(AH25/Z25*100>100,100,AH25/Z25*100), \"-\"),0)","v":"-"},null,{"$f":"IF(AND(D25<>0, D25<>\"Inconnu\",D25<>\"Interrompu\",D25<>\"Non requis\"),D25/COUNTRY_INFO!D25, 0)","v":1},{"$f":"IF(AND(J25<>0,J25<>\"Inconnu\",J25<>\"Interrompu\",J25<>\"Non requis\"),J25/COUNTRY_INFO!D25, 0)","v":0},{"$f":"IF(AND(P25<>0,P25<>\"Inconnu\",P25<>\"Non requis\"),P25/(COUNTRY_INFO!E25+COUNTRY_INFO!F25), 0)","v":0},{"$f":"IF(AND(Z25<>0,Z25<>\"Inconnu\",Z25<>\"Non requis\"),IF(COUNTRY_INFO!K25=1,1,IF(COUNTRY_INFO!K25=2,0.5*COUNTRY_INFO!F25/(0.5*COUNTRY_INFO!F25+0.2*COUNTRY_INFO!G25),IF(COUNTRY_INFO!K25=3,COUNTRY_INFO!F25/(COUNTRY_INFO!F25+COUNTRY_INFO!G25)))),0)","v":1},{"$f":"IF(AND(Z25<>0,Z25<>\"Inconnu\",Z25<>\"Non requis\"),IF(COUNTRY_INFO!K25=1,0,IF(COUNTRY_INFO!K25=2,0.2*COUNTRY_INFO!G25/(0.5*COUNTRY_INFO!F25+0.2*COUNTRY_INFO!G25),IF(COUNTRY_INFO!K25=3,COUNTRY_INFO!G25/(COUNTRY_INFO!F25+COUNTRY_INFO!G25)))),0)","v":0},{"$f":"MAX(COUNTRY_INFO!D25*AK25*PROFILE!$G$7,COUNTRY_INFO!D25*AL25*PROFILE!$G$7)","v":4439.4854967587044},{"$f":"MAX(COUNTRY_INFO!D25*AK25*PROFILE!$G$8,COUNTRY_INFO!D25*AL25*PROFILE!$G$8,COUNTRY_INFO!D25*AM25*PROFILE!$G$8)","v":15112.958580046217},{"$f":"MAX(COUNTRY_INFO!D25*AK25*PROFILE!$G$9,COUNTRY_INFO!D25*AL25*PROFILE!$G$9,COUNTRY_INFO!D25*AM25*PROFILE!$G$9,IF(AND(DISTRICT!Z25<>\"Inconnu\",Z25<>\"Non requis\"),COUNTRY_INFO!P25*DISTRICT!AN25,0))","v":22669.402371224802},{"$f":"MAX(COUNTRY_INFO!D25*AK25*PROFILE!$G$10,COUNTRY_INFO!D25*AL25*PROFILE!$G$10,IF(AND(DISTRICT!Z25<>\"Inconnu\",Z25<>\"Non requis\"),COUNTRY_INFO!P25*DISTRICT!AO25,0))","v":52234.153551970281},94456,0,{"$f":"MAX('MDA4'!R25,'T1'!L25,'T2'!J25,T3_R1!K25,T3_R2!K25)","v":0},{"$f":"MAX('MDA1'!K25,'MDA4'!S25,'MDA3'!I25,'MDA3'!L25,'T1'!M25,'T2'!K25,T3_R1!L25,T3_R2!L25)","v":10204.799999999999},{"$f":"MAX('MDA1'!L25,'MDA4'!T25,'MDA3'!J25,'MDA3'!M25,'T1'!N25,'T2'!L25,T3_R1!M25,T3_R2!M25)","v":32315.200000000001},42520,{"$f":"MAX('MDA4'!R25,T25)","v":0},{"$f":"MAX('MDA1'!K25,'MDA4'!S25,'MDA3'!I25,'MDA3'!L25,V25,AD25)","v":10204.799999999999},{"$f":"MAX('MDA1'!L25,'MDA4'!T25,'MDA3'!J25,'MDA3'!M25,AF25)","v":32315.200000000001},42520,45.015668671127294]
[{"$f":"IF(COUNTRY_INFO!A26=0,\" \",COUNTRY_INFO!A26)","v":" Congo"},{"$f":"IF(COUNTRY_INFO!B26=0,\" \",COUNTRY_INFO!B26)","v":"Cuvette"},{"$f":"IF(COUNTRY_INFO!C26=0,\" \",COUNTRY_INFO!C26)","v":"Oyo-Alima"},{"$f":"COUNTRY_INFO!M26","v":0},null,null,{"$f":"SUM('MDA1'!M26,'MDA4'!U26)","v":0},{"$f":"IF(AND(COUNTRY_INFO!H26>0,COUNTRY_INFO!H26<4),IF(D26>MAX('MDA1'!M26,'MDA4'!U26),MAX('MDA1'!M26,'MDA4'!U26),D26),0)","v":0},{"$f":"IF(AND(COUNTRY_INFO!H26>0,COUNTRY_INFO!H26<4), IF(G26/D26*100<>0, IF(G26/D26*100>100,100,G26/D26*100), \"-\"),0)","v":0},{"$f":"COUNTRY_INFO!N26","v":0},null,null,{"$f":"MAX('MDA1'!M26,MAX('MDA3'!I26,'MDA3'!L26)+MAX('MDA3'!J26,'MDA3'!M26))","v":0},{"$f":"IF(AND(COUNTRY_INFO!I26>0,COUNTRY_INFO!I26<4),IF(J26>MAX('MDA1'!M26,MAX('MDA3'!I26,'MDA3'!L26)+MAX('MDA3'!J26,'MDA3'!M26)),MAX('MDA1'!M26,MAX('MDA3'!I26,'MDA3'!L26)+MAX('MDA3'!J26,'MDA3'!M26)),J26),0)","v":0},{"$f":"IF(AND(COUNTRY_INFO!I26>0,COUNTRY_INFO!I26<4), IF(M26/J26*100<>0, IF(M26/J26*100>100,100,M26/J26*100), \"-\"),0)","v":0},{"$f":"COUNTRY_INFO!O26","v":0},null,null,{"$f":"SUM(MAX('MDA4'!N26, 'T1'!L26, MAX(T3_R1!K26, T3_R2!K26)), MAX('MDA1'!K26, 'MDA4'!O26, 'T1'!M26, MAX(T3_R1!L26, T3_R2!L26)), MAX('MDA1'!L26, 'MDA4'!P26, 'T1'!N26, MAX(T3_R1!M26, T3_R2!M26)))","v":0},{"$f":"IF(AND(COUNTRY_INFO!J26>1,COUNTRY_INFO!J26<4),IF(COUNTRY_INFO!E26>MAX('MDA4'!N26,'T1'!L26,MAX(T3_R1!K26,T3_R2!K26)),MAX('MDA4'!N26,'T1'!L26,MAX(T3_R1!K26,T3_R2!K26)),COUNTRY_INFO!E26),0)","v":0},{"$f":"IF(AND(COUNTRY_INFO!J26>1,COUNTRY_INFO!J26<4), IF(T26/COUNTRY_INFO!E26*100<>0, IF(T26/COUNTRY_INFO!E26*100>100,100,T26/COUNTRY_INFO!E26*100), \"-\"),0)","v":0},{"$f":"IF(AND(COUNTRY_INFO!J26>1,COUNTRY_INFO!J26<4),IF(COUNTRY_INFO!F26>MAX('MDA1'!K26,'MDA4'!O26,'T1'!M26,MAX(T3_R1!L26,T3_R2!L26)),MAX('MDA1'!K26,'MDA4'!O26,'T1'!M26,MAX(T3_R1!L26,T3_R2!L26)),COUNTRY_INFO!F26),0)","v":0},{"$f":"IF(AND(COUNTRY_INFO!J26>1,COUNTRY_INFO!J26<4), IF(V26/COUNTRY_INFO!F26*100<>0, IF(V26/COUNTRY_INFO!F26*100>100,100,V26/COUNTRY_INFO!F26*100), \"-\"),0)","v":0},0,{"$f":"IF(AND(COUNTRY_INFO!J26>1,COUNTRY_INFO!J26<4), IF(S26/P26*100<>0, IF(X26/P26*100>100,100,X26/P26*100), \"-\"),0)","v":0},{"$f":"COUNTRY_INFO!P26","v":0},null,null,{"$f":"MAX('T1'!L26,'T2'!J26)+MAX('T1'!M26,'T2'!K26)+MAX('T1'!N26,'T2'!L26)","v":0},{"$f":"IF(COUNTRY_INFO!K26=1,IF(COUNTRY_INFO!F26*0.33>MAX('T1'!M26,'T2'!K26),MAX('T1'!M26,'T2'!K26),COUNTRY_INFO!F26*0.33),IF(COUNTRY_INFO!K26=2,IF(COUNTRY_INFO!F26*0.5>MAX('T1'!M26,'T2'!K26),MAX('T1'!M26,'T2'!K26),COUNTRY_INFO!F26*0.5),IF(COUNTRY_INFO!K26=3,IF(COUNTRY_INFO!F26>MAX('T1'!M26,'T2'!K26),MAX('T1'!M26,'T2'!K26),COUNTRY_INFO!F26),0)))","v":0},{"$f":"IF(AND(COUNTRY_INFO!K26>0,COUNTRY_INFO!K26<4),IF(Z26>0,IF(COUNTRY_INFO!K26=1, AD26/(COUNTRY_INFO!F26*0.33)*100, IF(COUNTRY_INFO!K26=2, AD26/(COUNTRY_INFO!F26*0.5)*100, IF(COUNTRY_INFO!K26=3, AD26/COUNTRY_INFO!F26*100))),\"-\"),0)","v":0},{"$f":"IF(COUNTRY_INFO!K26=2,IF(COUNTRY_INFO!G26*0.2>MAX('T1'!N26,'T2'!L26),MAX('T1'!N26,'T2'!L26),COUNTRY_INFO!G26*0.2),IF(COUNTRY_INFO!K26=3,IF(COUNTRY_INFO!G26>MAX('T1'!N26,'T2'!L26),MAX('T1'!N26,'T2'!L26),COUNTRY_INFO!G26),0))","v":0},{"$f":"IF(AND(COUNTRY_INFO!K26>0,COUNTRY_INFO!K26<4),IF(Z26>0,IF(COUNTRY_INFO!K26=1, 0, IF(COUNTRY_INFO!K26=2, AF26/(COUNTRY_INFO!G26*0.2)*100, IF(COUNTRY_INFO!K26=3, AF26/COUNTRY_INFO!G26*100))),\"-\"),0)","v":0},0,{"$f":"IF(AND(COUNTRY_INFO!K26>0,COUNTRY_INFO!K26<4), IF(AC26/Z26*100<>0, IF(AH26/Z26*100>100,100,AH26/Z26*100), \"-\"),0)","v":0},null,{"$f":"IF(AND(D26<>0, D26<>\"Inconnu\",D26<>\"Interrompu\",D26<>\"Non requis\"),D26/COUNTRY_INFO!D26, 0)","v":0},{"$f":"IF(AND(J26<>0,J26<>\"Inconnu\",J26<>\"Interrompu\",J26<>\"Non requis\"),J26/COUNTRY_INFO!D26, 0)","v":0},{"$f":"IF(AND(P26<>0,P26<>\"Inconnu\",P26<>\"Non requis\"),P26/(COUNTRY_INFO!E26+COUNTRY_INFO!F26), 0)","v":0},{"$f":"IF(AND(Z26<>0,Z26<>\"Inconnu\",Z26<>\"Non requis\"),IF(COUNTRY_INFO!K26=1,1,IF(COUNTRY_INFO!K26=2,0.5*COUNTRY_INFO!F26/(0.5*COUNTRY_INFO!F26+0.2*COUNTRY_INFO!G26),IF(COUNTRY_INFO!K26=3,COUNTRY_INFO!F26/(COUNTRY_INFO!F26+COUNTRY_INFO!G26)))),0)","v":0},{"$f":"IF(AND(Z26<>0,Z26<>\"Inconnu\",Z26<>\"Non requis\"),IF(COUNTRY_INFO!K26=1,0,IF(COUNTRY_INFO!K26=2,0.2*COUNTRY_INFO!G26/(0.5*COUNTRY_INFO!F26+0.2*COUNTRY_INFO!G26),IF(COUNTRY_INFO!K26=3,COUNTRY_INFO!G26/(COUNTRY_INFO!F26+COUNTRY_INFO!G26)))),0)","v":0},{"$f":"MAX(COUNTRY_INFO!D26*AK26*PROFILE!$G$7,COUNTRY_INFO!D26*AL26*PROFILE!$G$7)","v":0},{"$f":"MAX(COUNTRY_INFO!D26*AK26*PROFILE!$G$8,COUNTRY_INFO!D26*AL26*PROFILE!$G$8,COUNTRY_INFO!D26*AM26*PROFILE!$G$8)","v":0},{"$f":"MAX(COUNTRY_INFO!D26*AK26*PROFILE!$G$9,COUNTRY_INFO!D26*AL26*PROFILE!$G$9,COUNTRY_INFO!D26*AM26*PROFILE!$G$9,IF(AND(DISTRICT!Z26<>\"Inconnu\",Z26<>\"Non requis\"),COUNTRY_INFO!P26*DISTRICT!AN26,0))","v":0},{"$f":"MAX(COUNTRY_INFO!D26*AK26*PROFILE!$G$10,COUNTRY_INFO!D26*AL26*PROFILE!$G$10,IF(AND(DISTRICT!Z26<>\"Inconnu\",Z26<>\"Non requis\"),COUNTRY_INFO!P26*DISTRICT!AO26,0))","v":0},0,0,{"$f":"MAX('MDA4'!R26,'T1'!L26,'T2'!J26,T3_R1!K26,T3_R2!K26)","v":0},{"$f":"MAX('MDA1'!K26,'MDA4'!S26,'MDA3'!I26,'MDA3'!L26,'T1'!M26,'T2'!K26,T3_R1!L26,T3_R2!L26)","v":0},{"$f":"MAX('MDA1'!L26,'MDA4'!T26,'MDA3'!J26,'MDA3'!M26,'T1'!N26,'T2'!L26,T3_R1!M26,T3_R2!M26)","v":0},0,{"$f":"MAX('MDA4'!R26,T26)","v":0},{"$f":"MAX('MDA1'!K26,'MDA4'!S26,'MDA3'!I26,'MDA3'!L26,V26,AD26)","v":0},{"$f":"MAX('MDA1'!L26,'MDA4'!T26,'MDA3'!J26,'MDA3'!M26,AF26)","v":0},0,0]
[{"$f":"IF(COUNTRY_INFO!A27=0,\" \",COUNTRY_INFO!A27)","v":" Congo"},{"$f":"IF(COUNTRY_INFO!B27=0,\" \",COUNTRY_INFO!B27)","v":"Cuvette-Ouest"},{"$f":"IF(COUNTRY_INFO!C27=0,\" \",COUNTRY_INFO!C27)","v":"Etoumbi"},{"$f":"COUNTRY_INFO!M27","v":42541},10363,11523,{"$f":"SUM('MDA1'!M27,'MDA4'!U27)","v":21886},{"$f":"IF(AND(COUNTRY_INFO!H27>0,COUNTRY_INFO!H27<4),IF(D27>MAX('MDA1'!M27,'MDA4'!U27),MAX('MDA1'!M27,'MDA4'!U27),D27),0)","v":21886},{"$f":"IF(AND(COUNTRY_INFO!H27>0,COUNTRY_INFO!H27<4), IF(G27/D27*100<>0, IF(G27/D27*100>100,100,G27/D27*100), \"-\"),0)","v":51.446839519522349},{"$f":"COUNTRY_INFO!N27","v":0},null,null,{"$f":"MAX('MDA1'!M27,MAX('MDA3'!I27,'MDA3'!L27)+MAX('MDA3'!J27,'MDA3'!M27))","v":0},{"$f":"IF(AND(COUNTRY_INFO!I27>0,COUNTRY_INFO!I27<4),IF(J27>MAX('MDA1'!M27,MAX('MDA3'!I27,'MDA3'!L27)+MAX('MDA3'!J27,'MDA3'!M27)),MAX('MDA1'!M27,MAX('MDA3'!I27,'MDA3'!L27)+MAX('MDA3'!J27,'MDA3'!M27)),J27),0)","v":0},{"$f":"IF(AND(COUNTRY_INFO!I27>0,COUNTRY_INFO!I27<4), IF(M27/J27*100<>0, IF(M27/J27*100>100,100,M27/J27*100), \"-\"),0)","v":0},{"$f":"COUNTRY_INFO!O27","v":17017},null,null,{"$f":"SUM(MAX('MDA4'!N27, 'T1'!L27, MAX(T3_R1!K27, T3_R2!K27)), MAX('MDA1'!K27, 'MDA4'!O27, 'T1'!M27, MAX(T3_R1!L27, T3_R2!L27)), MAX('MDA1'!L27, 'MDA4'!P27, 'T1'!N27, MAX(T3_R1!M27, T3_R2!M27)))","v":0},{"$f":"IF(AND(COUNTRY_INFO!J27>1,COUNTRY_INFO!J27<4),IF(COUNTRY_INFO!E27>MAX('MDA4'!N27,'T1'!L27,MAX(T3_R1!K27,T3_R2!K27)),MAX('MDA4'!N27,'T1'!L27,MAX(T3_R1!K27,T3_R2!K27)),COUNTRY_INFO!E27),0)","v":0},{"$f":"IF(AND(COUNTRY_INFO!J27>1,COUNTRY_INFO!J27<4), IF(T27/COUNTRY_INFO!E27*100<>0, IF(T27/COUNTRY_INFO!E27*100>100,100,T27/COUNTRY_INFO!E27*100), \"-\"),0)","v":"-"},{"$f":"IF(AND(COUNTRY_INFO!J27>1,COUNTRY_INFO!J27<4),IF(COUNTRY_INFO!F27>MAX('MDA1'!K27,'MDA4'!O27,'T1'!M27,MAX(T3_R1!L27,T3_R2!L27)),MAX('MDA1'!K27,'MDA4'!O27,'T1'!M27,MAX(T3_R1!L27,T3_R2!L27)),COUNTRY_INFO!F27),0)","v":0},{"$f":"IF(AND(COUNTRY_INFO!J27>1,COUNTRY_INFO!J27<4), IF(V27/COUNTRY_INFO!F27*100<>0, IF(V27/COUNTRY_INFO!F27*100>100,100,V27/COUNTRY_INFO!F27*100), \"-\"),0)","v":"-"},0,{"$f":"IF(AND(COUNTRY_INFO!J27>1,COUNTRY_INFO!J27<4), IF(S27/P27*100<>0, IF(X27/P27*100>100,100,X27/P27*100), \"-\"),0)","v":"-"},{"$f":"COUNTRY_INFO!P27","v":0},null,null,{"$f":"MAX('T1'!L27,'T2'!J27)+MAX('T1'!M27,'T2'!K27)+MAX('T1'!N27,'T2'!L27)","v":0},{"$f":"IF(COUNTRY_INFO!K27=1,IF(COUNTRY_INFO!F27*0.33>MAX('T1'!M27,'T2'!K27),MAX('T1'!M27,'T2'!K27),COUNTRY_INFO!F27*0.33),IF(COUNTRY_INFO!K27=2,IF(COUNTRY_INFO!F27*0.5>MAX('T1'!M27,'T2'!K27),MAX('T1'!M27,'T2'!K27),COUNTRY_INFO!F27*0.5),IF(COUNTRY_INFO!K27=3,IF(COUNTRY_INFO!F27>MAX('T1'!M27,'T2'!K27),MAX('T1'!M27,'T2'!K27),COUNTRY_INFO!F27),0)))","v":0},{"$f":"IF(AND(COUNTRY_INFO!K27>0,COUNTRY_INFO!K27<4),IF(Z27>0,IF(COUNTRY_INFO!K27=1, AD27/(COUNTRY_INFO!F27*0.33)*100, IF(COUNTRY_INFO!K27=2, AD27/(COUNTRY_INFO!F27*0.5)*100, IF(COUNTRY_INFO!K27=3, AD27/COUNTRY_INFO!F27*100))),\"-\"),0)","v":0},{"$f":"IF(COUNTRY_INFO!K27=2,IF(COUNTRY_INFO!G27*0.2>MAX('T1'!N27,'T2'!L27),MAX('T1'!N27,'T2'!L27),COUNTRY_INFO!G27*0.2),IF(COUNTRY_INFO!K27=3,IF(COUNTRY_INFO!G27>MAX('T1'!N27,'T2'!L27),MAX('T1'!N27,'T2'!L27),COUNTRY_INFO!G27),0))","v":0},{"$f":"IF(AND(COUNTRY_INFO!K27>0,COUNTRY_INFO!K27<4),IF(Z27>0,IF(COUNTRY_INFO!K27=1, 0, IF(COUNTRY_INFO!K27=2, AF27/(COUNTRY_INFO!G27*0.2)*100, IF(COUNTRY_INFO!K27=3, AF27/COUNTRY_INFO!G27*100))),\"-\"),0)","v":0},0,{"$f":"IF(AND(COUNTRY_INFO!K27>0,COUNTRY_INFO!K27<4), IF(AC27/Z27*100<>0, IF(AH27/Z27*100>100,100,AH27/Z27*100), \"-\"),0)","v":0},null,{"$f":"IF(AND(D27<>0, D27<>\"Inconnu\",D27<>\"Interrompu\",D27<>\"Non requis\"),D27/COUNTRY_INFO!D27, 0)","v":1},{"$f":"IF(AND(J27<>0,J27<>\"Inconnu\",J27<>\"Interrompu\",J27<>\"Non requis\"),J27/COUNTRY_INFO!D27, 0)","v":0},{"$f":"IF(AND(P27<>0,P27<>\"Inconnu\",P27<>\"Non requis\"),P27/(COUNTRY_INFO!E27+COUNTRY_INFO!F27), 0)","v":1},{"$f":"IF(AND(Z27<>0,Z27<>\"Inconnu\",Z27<>\"Non requis\"),IF(COUNTRY_INFO!K27=1,1,IF(COUNTRY_INFO!K27=2,0.5*COUNTRY_INFO!F27/(0.5*COUNTRY_INFO!F27+0.2*COUNTRY_INFO!G27),IF(COUNTRY_INFO!K27=3,COUNTRY_INFO!F27/(COUNTRY_INFO!F27+COUNTRY_INFO!G27)))),0)","v":0},{"$f":"IF(AND(Z27<>0,Z27<>\"Inconnu\",Z27<>\"Non requis\"),IF(COUNTRY_INFO!K27=1,0,IF(COUNTRY_INFO!K27=2,0.2*COUNTRY_INFO!G27/(0.5*COUNTRY_INFO!F27+0.2*COUNTRY_INFO!G27),IF(COUNTRY_INFO!K27=3,COUNTRY_INFO!G27/(COUNTRY_INFO!F27+COUNTRY_INFO!G27)))),0)","v":0},{"$f":"MAX(COUNTRY_INFO!D27*AK27*PROFILE!$G$7,COUNTRY_INFO!D27*AL27*PROFILE!$G$7)","v":1999.4510938173548},{"$f":"MAX(COUNTRY_INFO!D27*AK27*PROFILE!$G$8,COUNTRY_INFO!D27*AL27*PROFILE!$G$8,COUNTRY_INFO!D27*AM27*PROFILE!$G$8)","v":6806.5593604826181},{"$f":"MAX(COUNTRY_INFO!D27*AK27*PROFILE!$G$9,COUNTRY_INFO!D27*AL27*PROFILE!$G$9,COUNTRY_INFO!D27*AM27*PROFILE!$G$9,IF(AND(DISTRICT!Z27<>\"Inconnu\",Z27<>\"Non requis\"),COUNTRY_INFO!P27*DISTRICT!AN27,0))","v":10209.823052789387},{"$f":"MAX(COUNTRY_INFO!D27*AK27*PROFILE!$G$10,COUNTRY_INFO!D27*AL27*PROFILE!$G$10,IF(AND(DISTRICT!Z27<>\"Inconnu\",Z27<>\"Non requis\"),COUNTRY_INFO!P27*DISTRICT!AO27,0))","v":23525.166492910641},42541,0,{"$f":"MAX('MDA4'!R27,'T1'!L27,'T2'!J27,T3_R1!K27,T3_R2!K27)","v":0},{"$f":"MAX('MDA1'!K27,'MDA4'!S27,'MDA3'!I27,'MDA3'!L27,'T1'!M27,'T2'!K27,T3_R1!L27,T3_R2!L27)","v":5252.64},{"$f":"MAX('MDA1'!L27,'MDA4'!T27,'MDA3'!J27,'MDA3'!M27,'T1'!N27,'T2'!L27,T3_R1!M27,T3_R2!M27)","v":16633.36},21886,{"$f":"MAX('MDA4'!R27,T27)","v":0},{"$f":"MAX('MDA1'!K27,'MDA4'!S27,'MDA3'!I27,'MDA3'!L27,V27,AD27)","v":5252.64},{"$f":"MAX('MDA1'!L27,'MDA4'!T27,'MDA3'!J27,'MDA3'!M27,AF27)","v":16633.36},21886,51.446839519522349]
[{"$f":"IF(COUNTRY_INFO!A28=0,\" \",COUNTRY_INFO!A28)","v":" Congo"},{"$f":"IF(COUNTRY_INFO!B28=0,\" \",COUNTRY_INFO!B28)","v":"Cuvette-Ouest"},{"$f":"IF(COUNTRY_INFO!C28=0,\" \",COUNTRY_INFO!C28)","v":"Ewo"},{"$f":"COUNTRY_INFO!M28","v":73793},12586,12787,{"$f":"SUM('MDA1'!M28,'MDA4'!U28)","v":25373},{"$f":"IF(AND(COUNTRY_INFO!H28>0,COUNTRY_INFO!H28<4),IF(D28>MAX('MDA1'!M28,'MDA4'!U28),MAX('MDA1'!M28,'MDA4'!U28),D28),0)","v":25373},{"$f":"IF(AND(COUNTRY_INFO!H28>0,COUNTRY_INFO!H28<4), IF(G28/D28*100<>0, IF(G28/D28*100>100,100,G28/D28*100), \"-\"),0)","v":34.384020164514254},{"$f":"COUNTRY_INFO!N28","v":0},null,null,{"$f":"MAX('MDA1'!M28,MAX('MDA3'!I28,'MDA3'!L28)+MAX('MDA3'!J28,'MDA3'!M28))","v":0},{"$f":"IF(AND(COUNTRY_INFO!I28>0,COUNTRY_INFO!I28<4),IF(J28>MAX('MDA1'!M28,MAX('MDA3'!I28,'MDA3'!L28)+MAX('MDA3'!J28,'MDA3'!M28)),MAX('MDA1'!M28,MAX('MDA3'!I28,'MDA3'!L28)+MAX('MDA3'!J28,'MDA3'!M28)),J28),0)","v":0},{"$f":"IF(AND(COUNTRY_INFO!I28>0,COUNTRY_INFO!I28<4), IF(M28/J28*100<>0, IF(M28/J28*100>100,100,M28/J28*100), \"-\"),0)","v":0},{"$f":"COUNTRY_INFO!O28","v":29517},null,null,{"$f":"SUM(MAX('MDA4'!N28, 'T1'!L28, MAX(T3_R1!K28, T3_R2!K28)), MAX('MDA1'!K28, 'MDA4'!O28, 'T1'!M28, MAX(T3_R1!L28, T3_R2!L28)), MAX('MDA1'!L28, 'MDA4'!P28, 'T1'!N28, MAX(T3_R1!M28, T3_R2!M28)))","v":0},{"$f":"IF(AND(COUNTRY_INFO!J28>1,COUNTRY_INFO!J28<4),IF(COUNTRY_INFO!E28>MAX('MDA4'!N28,'T1'!L28,MAX(T3_R1!K28,T3_R2!K28)),MAX('MDA4'!N28,'T1'!L28,MAX(T3_R1!K28,T3_R2!K28)),COUNTRY_INFO!E28),0)","v":0},{"$f":"IF(AND(COUNTRY_INFO!J28>1,COUNTRY_INFO!J28<4), IF(T28/COUNTRY_INFO!E28*100<>0, IF(T28/COUNTRY_INFO!E28*100>100,100,T28/COUNTRY_INFO!E28*100), \"-\"),0)","v":"-"},{"$f":"IF(AND(COUNTRY_INFO!J28>1,COUNTRY_INFO!J28<4),IF(COUNTRY_INFO!F28>MAX('MDA1'!K28,'MDA4'!O28,'T1'!M28,MAX(T3_R1!L28,T3_R2!L28)),MAX('MDA1'!K28,'MDA4'!O28,'T1'!M28,MAX(T3_R1!L28,T3_R2!L28)),COUNTRY_INFO!F28),0)","v":0},{"$f":"IF(AND(COUNTRY_INFO!J28>1,COUNTRY_INFO!J28<4), IF(V28/COUNTRY_INFO!F28*100<>0, IF(V28/COUNTRY_INFO!F28*100>100,100,V28/COUNTRY_INFO!F28*100), \"-\"),0)","v":"-"},0,{"$f":"IF(AND(COUNTRY_INFO!J28>1,COUNTRY_INFO!J28<4), IF(S28/P28*100<>0, IF(X28/P28*100>100,100,X28/P28*100), \"-\"),0)","v":"-"},{"$f":"COUNTRY_INFO!P28","v":5844.3},null,null,{"$f":"MAX('T1'!L28,'T2'!J28)+MAX('T1'!M28,'T2'!K28)+MAX('T1'!N28,'T2'!L28)","v":0},{"$f":"IF(COUNTRY_INFO!K28=1,IF(COUNTRY_INFO!F28*0.33>MAX('T1'!M28,'T2'!K28),MAX('T1'!M28,'T2'!K28),COUNTRY_INFO!F28*0.33),IF(COUNTRY_INFO!K28=2,IF(COUNTRY_INFO!F28*0.5>MAX('T1'!M28,'T2'!K28),MAX('T1'!M28,'T2'!K28),COUNTRY_INFO!F28*0.5),IF(COUNTRY_INFO!K28=3,IF(COUNTRY_INFO!F28>MAX('T1'!M28,'T2'!K28),MAX('T1'!M28,'T2'!K28),COUNTRY_INFO!F28),0)))","v":0},{"$f":"IF(AND(COUNTRY_INFO!K28>0,COUNTRY_INFO!K28<4),IF(Z28>0,IF(COUNTRY_INFO!K28=1, AD28/(COUNTRY_INFO!F28*0.33)*100, IF(COUNTRY_INFO!K28=2, AD28/(COUNTRY_INFO!F28*0.5)*100, IF(COUNTRY_INFO!K28=3, AD28/COUNTRY_INFO!F28*100))),\"-\"),0)","v":0},{"$f":"IF(COUNTRY_INFO!K28=2,IF(COUNTRY_INFO!G28*0.2>MAX('T1'!N28,'T2'!L28),MAX('T1'!N28,'T2'!L28),COUNTRY_INFO!G28*0.2),IF(COUNTRY_INFO!K28=3,IF(COUNTRY_INFO!G28>MAX('T1'!N28,'T2'!L28),MAX('T1'!N28,'T2'!L28),COUNTRY_INFO!G28),0))","v":0},{"$f":"IF(AND(COUNTRY_INFO!K28>0,COUNTRY_INFO!K28<4),IF(Z28>0,IF(COUNTRY_INFO!K28=1, 0, IF(COUNTRY_INFO!K28=2, AF28/(COUNTRY_INFO!G28*0.2)*100, IF(COUNTRY_INFO!K28=3, AF28/COUNTRY_INFO!G28*100))),\"-\"),0)","v":0},0,{"$f":"IF(AND(COUNTRY_INFO!K28>0,COUNTRY_INFO!K28<4), IF(AC28/Z28*100<>0, IF(AH28/Z28*100>100,100,AH28/Z28*100), \"-\"),0)","v":"-"},null,{"$f":"IF(AND(D28<>0, D28<>\"Inconnu\",D28<>\"Interrompu\",D28<>\"Non requis\"),D28/COUNTRY_INFO!D28, 0)","v":1},{"$f":"IF(AND(J28<>0,J28<>\"Inconnu\",J28<>\"Interrompu\",J28<>\"Non requis\"),J28/COUNTRY_INFO!D28, 0)","v":0},{"$f":"IF(AND(P28<>0,P28<>\"Inconnu\",P28<>\"Non requis\"),P28/(COUNTRY_INFO!E28+COUNTRY_INFO!F28), 0)","v":1},{"$f":"IF(AND(Z28<>0,Z28<>\"Inconnu\",Z28<>\"Non requis\"),IF(COUNTRY_INFO!K28=1,1,IF(COUNTRY_INFO!K28=2,0.5*COUNTRY_INFO!F28/(0.5*COUNTRY_INFO!F28+0.2*COUNTRY_INFO!G28),IF(COUNTRY_INFO!K28=3,COUNTRY_INFO!F28/(COUNTRY_INFO!F28+COUNTRY_INFO!G28)))),0)","v":1},{"$f":"IF(AND(Z28<>0,Z28<>\"Inconnu\",Z28<>\"Non requis\"),IF(COUNTRY_INFO!K28=1,0,IF(COUNTRY_INFO!K28=2,0.2*COUNTRY_INFO!G28/(0.5*COUNTRY_INFO!F28+0.2*COUNTRY_INFO!G28),IF(COUNTRY_INFO!K28=3,COUNTRY_INFO!G28/(COUNTRY_INFO!F28+COUNTRY_INFO!G28)))),0)","v":0},{"$f":"MAX(COUNTRY_INFO!D28*AK28*PROFILE!$G$7,COUNTRY_INFO!D28*AL28*PROFILE!$G$7)","v":3468.3127939179631},{"$f":"MAX(COUNTRY_INFO!D28*AK28*PROFILE!$G$8,COUNTRY_INFO!D28*AL28*PROFILE!$G$8,COUNTRY_INFO!D28*AM28*PROFILE!$G$8)","v":11806.878890672382},{"$f":"MAX(COUNTRY_INFO!D28*AK28*PROFILE!$G$9,COUNTRY_INFO!D28*AL28*PROFILE!$G$9,COUNTRY_INFO!D28*AM28*PROFILE!$G$9,IF(AND(DISTRICT!Z28<>\"Inconnu\",Z28<>\"Non requis\"),COUNTRY_INFO!P28*DISTRICT!AN28,0))","v":17710.290602818157},{"$f":"MAX(COUNTRY_INFO!D28*AK28*PROFILE!$G$10,COUNTRY_INFO!D28*AL28*PROFILE!$G$10,IF(AND(DISTRICT!Z28<>\"Inconnu\",Z28<>\"Non requis\"),COUNTRY_INFO!P28*DISTRICT!AO28,0))","v":40807.5177125915},73793,0,{"$f":"MAX('MDA4'!R28,'T1'!L28,'T2'!J28,T3_R1!K28,T3_R2!K28)","v":0},{"$f":"MAX('MDA1'!K28,'MDA4'!S28,'MDA3'!I28,'MDA3'!L28,'T1'!M28,'T2'!K28,T3_R1!L28,T3_R2!L28)","v":6089.52},{"$f":"MAX('MDA1'!L28,'MDA4'!T28,'MDA3'!J28,'MDA3'!M28,'T1'!N28,'T2'!L28,T3_R1!M28,T3_R2!M28)","v":19283.48},25373,{"$f":"MAX('MDA4'!R28,T28)","v":0},{"$f":"MAX('MDA1'!K28,'MDA4'!S28,'MDA3'!I28,'MDA3'!L28,V28,AD28)","v":6089.52},{"$f":"MAX('MDA1'!L28,'MDA4'!T28,'MDA3'!J28,'MDA3'!M28,AF28)","v":19283.48},25373,34.384020164514254]
[{"$f":"IF(COUNTRY_INFO!A29=0,\" \",COUNTRY_INFO!A29)","v":" Congo"},{"$f":"IF(COUNTRY_INFO!B29=0,\" \",COUNTRY_INFO!B29)","v":"Kouilou"},{"$f":"IF(COUNTRY_INFO!C29=0,\" \",COUNTRY_INFO!C29)","v":"Hinda-Loango"},{"$f":"COUNTRY_INFO!M29","v":0},null,null,{"$f":"SUM('MDA1'!M29,'MDA4'!U29)","v":0},{"$f":"IF(AND(COUNTRY_INFO!H29>0,COUNTRY_INFO!H29<4),IF(D29>MAX('MDA1'!M29,'MDA4'!U29),MAX('MDA1'!M29,'MDA4'!U29),D29),0)","v":0},{"$f":"IF(AND(COUNTRY_INFO!H29>0,COUNTRY_INFO!H29<4), IF(G29/D29*100<>0, IF(G29/D29*100>100,100,G29/D29*100), \"-\"),0)","v":0},{"$f":"COUNTRY_INFO!N29","v":0},null,null,{"$f":"MAX('MDA1'!M29,MAX('MDA3'!I29,'MDA3'!L29)+MAX('MDA3'!J29,'MDA3'!M29))","v":0},{"$f":"IF(AND(COUNTRY_INFO!I29>0,COUNTRY_INFO!I29<4),IF(J29>MAX('MDA1'!M29,MAX('MDA3'!I29,'MDA3'!L29)+MAX('MDA3'!J29,'MDA3'!M29)),MAX('MDA1'!M29,MAX('MDA3'!I29,'MDA3'!L29)+MAX('MDA3'!J29,'MDA3'!M29)),J29),0)","v":0},{"$f":"IF(AND(COUNTRY_INFO!I29>0,COUNTRY_INFO!I29<4), IF(M29/J29*100<>0, IF(M29/J29*100>100,100,M29/J29*100), \"-\"),0)","v":0},{"$f":"COUNTRY_INFO!O29","v":18932},null,null,{"$f":"SUM(MAX('MDA4'!N29, 'T1'!L29, MAX(T3_R1!K29, T3_R2!K29)), MAX('MDA1'!K29, 'MDA4'!O29, 'T1'!M29, MAX(T3_R1!L29, T3_R2!L29)), MAX('MDA1'!L29, 'MDA4'!P29, 'T1'!N29, MAX(T3_R1!M29, T3_R2!M29)))","v":0},{"$f":"IF(AND(COUNTRY_INFO!J29>1,COUNTRY_INFO!J29<4),IF(COUNTRY_INFO!E29>MAX('MDA4'!N29,'T1'!L29,MAX(T3_R1!K29,T3_R2!K29)),MAX('MDA4'!N29,'T1'!L29,MAX(T3_R1!K29,T3_R2!K29)),COUNTRY_INFO!E29),0)","v":0},{"$f":"IF(AND(COUNTRY_INFO!J29>1,COUNTRY_INFO!J29<4), IF(T29/COUNTRY_INFO!E29*100<>0, IF(T29/COUNTRY_INFO!E29*100>100,100,T29/COUNTRY_INFO!E29*100), \"-\"),0)","v":"-"},{"$f":"IF(AND(COUNTRY_INFO!J29>1,COUNTRY_INFO!J29<4),IF(COUNTRY_INFO!F29>MAX('MDA1'!K29,'MDA4'!O29,'T1'!M29,MAX(T3_R1!L29,T3_R2!L29)),MAX('MDA1'!K29,'MDA4'!O29,'T1'!M29,MAX(T3_R1!L29,T3_R2!L29)),COUNTRY_INFO!F29),0)","v":0},{"$f":"IF(AND(COUNTRY_INFO!J29>1,COUNTRY_INFO!J29<4), IF(V29/COUNTRY_INFO!F29*100<>0, IF(V29/COUNTRY_INFO!F29*100>100,100,V29/COUNTRY_INFO!F29*100), \"-\"),0)","v":"-"},0,{"$f":"IF(AND(COUNTRY_INFO!J29>1,COUNTRY_INFO!J29<4), IF(S29/P29*100<>0, IF(X29/P29*100>100,100,X29/P29*100), \"-\"),0)","v":"-"},{"$f":"COUNTRY_INFO!P29","v":10914.3},null,null,{"$f":"MAX('T1'!L29,'T2'!J29)+MAX('T1'!M29,'T2'!K29)+MAX('T1'!N29,'T2'!L29)","v":0},{"$f":"IF(COUNTRY_INFO!K29=1,IF(COUNTRY_INFO!F29*0.33>MAX('T1'!M29,'T2'!K29),MAX('T1'!M29,'T2'!K29),COUNTRY_INFO!F29*0.33),IF(COUNTRY_INFO!K29=2,IF(COUNTRY_INFO!F29*0.5>MAX('T1'!M29,'T2'!K29),MAX('T1'!M29,'T2'!K29),COUNTRY_INFO!F29*0.5),IF(COUNTRY_INFO!K29=3,IF(COUNTRY_INFO!F29>MAX('T1'!M29,'T2'!K29),MAX('T1'!M29,'T2'!K29),COUNTRY_INFO!F29),0)))","v":0},{"$f":"IF(AND(COUNTRY_INFO!K29>0,COUNTRY_INFO!K29<4),IF(Z29>0,IF(COUNTRY_INFO!K29=1, AD29/(COUNTRY_INFO!F29*0.33)*100, IF(COUNTRY_INFO!K29=2, AD29/(COUNTRY_INFO!F29*0.5)*100, IF(COUNTRY_INFO!K29=3, AD29/COUNTRY_INFO!F29*100))),\"-\"),0)","v":0},{"$f":"IF(COUNTRY_INFO!K29=2,IF(COUNTRY_INFO!G29*0.2>MAX('T1'!N29,'T2'!L29),MAX('T1'!N29,'T2'!L29),COUNTRY_INFO!G29*0.2),IF(COUNTRY_INFO!K29=3,IF(COUNTRY_INFO!G29>MAX('T1'!N29,'T2'!L29),MAX('T1'!N29,'T2'!L29),COUNTRY_INFO!G29),0))","v":0},{"$f":"IF(AND(COUNTRY_INFO!K29>0,COUNTRY_INFO!K29<4),IF(Z29>0,IF(COUNTRY_INFO!K29=1, 0, IF(COUNTRY_INFO!K29=2, AF29/(COUNTRY_INFO!G29*0.2)*100, IF(COUNTRY_INFO!K29=3, AF29/COUNTRY_INFO!G29*100))),\"-\"),0)","v":0},0,{"$f":"IF(AND(COUNTRY_INFO!K29>0,COUNTRY_INFO!K29<4), IF(AC29/Z29*100<>0, IF(AH29/Z29*100>100,100,AH29/Z29*100), \"-\"),0)","v":"-"},null,{"$f":"IF(AND(D29<>0, D29<>\"Inconnu\",D29<>\"Interrompu\",D29<>\"Non requis\"),D29/COUNTRY_INFO!D29, 0)","v":0},{"$f":"IF(AND(J29<>0,J29<>\"Inconnu\",J29<>\"Interrompu\",J29<>\"Non requis\"),J29/COUNTRY_INFO!D29, 0)","v":0},{"$f":"IF(AND(P29<>0,P29<>\"Inconnu\",P29<>\"Non requis\"),P29/(COUNTRY_INFO!E29+COUNTRY_INFO!F29), 0)","v":1},{"$f":"IF(AND(Z29<>0,Z29<>\"Inconnu\",Z29<>\"Non requis\"),IF(COUNTRY_INFO!K29=1,1,IF(COUNTRY_INFO!K29=2,0.5*COUNTRY_INFO!F29/(0.5*COUNTRY_INFO!F29+0.2*COUNTRY_INFO!G29),IF(COUNTRY_INFO!K29=3,COUNTRY_INFO!F29/(COUNTRY_INFO!F29+COUNTRY_INFO!G29)))),0)","v":0.52037235553356609},{"$f":"IF(AND(Z29<>0,Z29<>\"Inconnu\",Z29<>\"Non requis\"),IF(COUNTRY_INFO!K29=1,0,IF(COUNTRY_INFO!K29=2,0.2*COUNTRY_INFO!G29/(0.5*COUNTRY_INFO!F29+0.2*COUNTRY_INFO!G29),IF(COUNTRY_INFO!K29=3,COUNTRY_INFO!G29/(COUNTRY_INFO!F29+COUNTRY_INFO!G29)))),0)","v":0.47962764446643397},{"$f":"MAX(COUNTRY_INFO!D29*AK29*PROFILE!$G$7,COUNTRY_INFO!D29*AL29*PROFILE!$G$7)","v":0},{"$f":"MAX(COUNTRY_INFO!D29*AK29*PROFILE!$G$8,COUNTRY_INFO!D29*AL29*PROFILE!$G$8,COUNTRY_INFO!D29*AM29*PROFILE!$G$8)","v":7572.9592884747135},{"$f":"MAX(COUNTRY_INFO!D29*AK29*PROFILE!$G$9,COUNTRY_INFO!D29*AL29*PROFILE!$G$9,COUNTRY_INFO!D29*AM29*PROFILE!$G$9,IF(AND(DISTRICT!Z29<>\"Inconnu\",Z29<>\"Non requis\"),COUNTRY_INFO!P29*DISTRICT!AN29,0))","v":11359.421144579921},{"$f":"MAX(COUNTRY_INFO!D29*AK29*PROFILE!$G$10,COUNTRY_INFO!D29*AL29*PROFILE!$G$10,IF(AND(DISTRICT!Z29<>\"Inconnu\",Z29<>\"Non requis\"),COUNTRY_INFO!P29*DISTRICT!AO29,0))","v":5234.8},24167.180433054633,0,{"$f":"MAX('MDA4'!R29,'T1'!L29,'T2'!J29,T3_R1!K29,T3_R2!K29)","v":0},{"$f":"MAX('MDA1'!K29,'MDA4'!S29,'MDA3'!I29,'MDA3'!L29,'T1'!M29,'T2'!K29,T3_R1!L29,T3_R2!L29)","v":0},{"$f":"MAX('MDA1'!L29,'MDA4'!T29,'MDA3'!J29,'MDA3'!M29,'T1'!N29,'T2'!L29,T3_R1!M29,T3_R2!M29)","v":0},0,{"$f":"MAX('MDA4'!R29,T29)","v":0},{"$f":"MAX('MDA1'!K29,'MDA4'!S29,'MDA3'!I29,'MDA3'!L29,V29,AD29)","v":0},{"$f":"MAX('MDA1'!L29,'MDA4'!T29,'MDA3'!J29,'MDA3'!M29,AF29)","v":0},0,0]
[{"$f":"IF(COUNTRY_INFO!A30=0,\" \",COUNTRY_INFO!A30)","v":" Congo"},{"$f":"IF(COUNTRY_INFO!B30=0,\" \",COUNTRY_INFO!B30)","v":"Kouilou"},{"$f":"IF(COUNTRY_INFO!C30=0,\" \",COUNTRY_INFO!C30)","v":"Madingo Kayes-Nzambi"},{"$f":"COUNTRY_INFO!M30","v":0},null,null,{"$f":"SUM('MDA1'!M30,'MDA4'!U30)","v":0},{"$f":"IF(AND(COUNTRY_INFO!H30>0,COUNTRY_INFO!H30<4),IF(D30>MAX('MDA1'!M30,'MDA4'!U30),MAX('MDA1'!M30,'MDA4'!U30),D30),0)","v":0},{"$f":"IF(AND(COUNTRY_INFO!H30>0,COUNTRY_INFO!H30<4), IF(G30/D30*100<>0, IF(G30/D30*100>100,100,G30/D30*100), \"-\"),0)","v":0},{"$f":"COUNTRY_INFO!N30","v":0},null,null,{"$f":"MAX('MDA1'!M30,MAX('MDA3'!I30,'MDA3'!L30)+MAX('MDA3'!J30,'MDA3'!M30))","v":0},{"$f":"IF(AND(COUNTRY_INFO!I30>0,COUNTRY_INFO!I30<4),IF(J30>MAX('MDA1'!M30,MAX('MDA3'!I30,'MDA3'!L30)+MAX('MDA3'!J30,'MDA3'!M30)),MAX('MDA1'!M30,MAX('MDA3'!I30,'MDA3'!L30)+MAX('MDA3'!J30,'MDA3'!M30)),J30),0)","v":0},{"$f":"IF(AND(COUNTRY_INFO!I30>0,COUNTRY_INFO!I30<4), IF(M30/J30*100<>0, IF(M30/J30*100>100,100,M30/J30*100), \"-\"),0)","v":0},{"$f":"COUNTRY_INFO!O30","v":9313},null,null,{"$f":"SUM(MAX('MDA4'!N30, 'T1'!L30, MAX(T3_R1!K30, T3_R2!K30)), MAX('MDA1'!K30, 'MDA4'!O30, 'T1'!M30, MAX(T3_R1!L30, T3_R2!L30)), MAX('MDA1'!L30, 'MDA4'!P30, 'T1'!N30, MAX(T3_R1!M30, T3_R2!M30)))","v":0},{"$f":"IF(AND(COUNTRY_INFO!J30>1,COUNTRY_INFO!J30<4),IF(COUNTRY_INFO!E30>MAX('MDA4'!N30,'T1'!L30,MAX(T3_R1!K30,T3_R2!K30)),MAX('MDA4'!N30,'T1'!L30,MAX(T3_R1!K30,T3_R2!K30)),COUNTRY_INFO!E30),0)","v":0},{"$f":"IF(AND(COUNTRY_INFO!J30>1,COUNTRY_INFO!J30<4), IF(T30/COUNTRY_INFO!E30*100<>0, IF(T30/COUNTRY_INFO!E30*100>100,100,T30/COUNTRY_INFO!E30*100), \"-\"),0)","v":"-"},{"$f":"IF(AND(COUNTRY_INFO!J30>1,COUNTRY_INFO!J30<4),IF(COUNTRY_INFO!F30>MAX('MDA1'!K30,'MDA4'!O30,'T1'!M30,MAX(T3_R1!L30,T3_R2!L30)),MAX('MDA1'!K30,'MDA4'!O30,'T1'!M30,MAX(T3_R1!L30,T3_R2!L30)),COUNTRY_INFO!F30),0)","v":0},{"$f":"IF(AND(COUNTRY_INFO!J30>1,COUNTRY_INFO!J30<4), IF(V30/COUNTRY_INFO!F30*100<>0, IF(V30/COUNTRY_INFO!F30*100>100,100,V30/COUNTRY_INFO!F30*100), \"-\"),0)","v":"-"},0,{"$f":"IF(AND(COUNTRY_INFO!J30>1,COUNTRY_INFO!J30<4), IF(S30/P30*100<>0, IF(X30/P30*100>100,100,X30/P30*100), \"-\"),0)","v":"-"},{"$f":"COUNTRY_INFO!P30","v":18463},null,null,{"$f":"MAX('T1'!L30,'T2'!J30)+MAX('T1'!M30,'T2'!K30)+MAX('T1'!N30,'T2'!L30)","v":0},{"$f":"IF(COUNTRY_INFO!K30=1,IF(COUNTRY_INFO!F30*0.33>MAX('T1'!M30,'T2'!K30),MAX('T1'!M30,'T2'!K30),COUNTRY_INFO!F30*0.33),IF(COUNTRY_INFO!K30=2,IF(COUNTRY_INFO!F30*0.5>MAX('T1'!M30,'T2'!K30),MAX('T1'!M30,'T2'!K30),COUNTRY_INFO!F30*0.5),IF(COUNTRY_INFO!K30=3,IF(COUNTRY_INFO!F30>MAX('T1'!M30,'T2'!K30),MAX('T1'!M30,'T2'!K30),COUNTRY_INFO!F30),0)))","v":0},{"$f":"IF(AND(COUNTRY_INFO!K30>0,COUNTRY_INFO!K30<4),IF(Z30>0,IF(COUNTRY_INFO!K30=1, AD30/(COUNTRY_INFO!F30*0.33)*100, IF(COUNTRY_INFO!K30=2, AD30/(COUNTRY_INFO!F30*0.5)*100, IF(COUNTRY_INFO!K30=3, AD30/COUNTRY_INFO!F30*100))),\"-\"),0)","v":0},{"$f":"IF(COUNTRY_INFO!K30=2,IF(COUNTRY_INFO!G30*0.2>MAX('T1'!N30,'T2'!L30),MAX('T1'!N30,'T2'!L30),COUNTRY_INFO!G30*0.2),IF(COUNTRY_INFO!K30=3,IF(COUNTRY_INFO!G30>MAX('T1'!N30,'T2'!L30),MAX('T1'!N30,'T2'!L30),COUNTRY_INFO!G30),0))","v":0},{"$f":"IF(AND(COUNTRY_INFO!K30>0,COUNTRY_INFO!K30<4),IF(Z30>0,IF(COUNTRY_INFO!K30=1, 0, IF(COUNTRY_INFO!K30=2, AF30/(COUNTRY_INFO!G30*0.2)*100, IF(COUNTRY_INFO!K30=3, AF30/COUNTRY_INFO!G30*100))),\"-\"),0)","v":0},0,{"$f":"IF(AND(COUNTRY_INFO!K30>0,COUNTRY_INFO!K30<4), IF(AC30/Z30*100<>0, IF(AH30/Z30*100>100,100,AH30/Z30*100), \"-\"),0)","v":"-"},null,{"$f":"IF(AND(D30<>0, D30<>\"Inconnu\",D30<>\"Interrompu\",D30<>\"Non requis\"),D30/COUNTRY_INFO!D30, 0)","v":0},{"$f":"IF(AND(J30<>0,J30<>\"Inconnu\",J30<>\"Interrompu\",J30<>\"Non requis\"),J30/COUNTRY_INFO!D30, 0)","v":0},{"$f":"IF(AND(P30<>0,P30<>\"Inconnu\",P30<>\"Non requis\"),P30/(COUNTRY_INFO!E30+COUNTRY_INFO!F30), 0)","v":1},{"$f":"IF(AND(Z30<>0,Z30<>\"Inconnu\",Z30<>\"Non requis\"),IF(COUNTRY_INFO!K30=1,1,IF(COUNTRY_INFO!K30=2,0.5*COUNTRY_INFO!F30/(0.5*COUNTRY_INFO!F30+0.2*COUNTRY_INFO!G30),IF(COUNTRY_INFO!K30=3,COUNTRY_INFO!F30/(COUNTRY_INFO!F30+COUNTRY_INFO!G30)))),0)","v":0.30265937279965338},{"$f":"IF(AND(Z30<>0,Z30<>\"Inconnu\",Z30<>\"Non requis\"),IF(COUNTRY_INFO!K30=1,0,IF(COUNTRY_INFO!K30=2,0.2*COUNTRY_INFO!G30/(0.5*COUNTRY_INFO!F30+0.2*COUNTRY_INFO!G30),IF(COUNTRY_INFO!K30=3,COUNTRY_INFO!G30/(COUNTRY_INFO!F30+COUNTRY_INFO!G30)))),0)","v":0.69734062720034662},{"$f":"MAX(COUNTRY_INFO!D30*AK30*PROFILE!$G$7,COUNTRY_INFO!D30*AL30*PROFILE!$G$7)","v":0},{"$f":"MAX(COUNTRY_INFO!D30*AK30*PROFILE!$G$8,COUNTRY_INFO!D30*AL30*PROFILE!$G$8,COUNTRY_INFO!D30*AM30*PROFILE!$G$8)","v":3725.1196500024989},{"$f":"MAX(COUNTRY_INFO!D30*AK30*PROFILE!$G$9,COUNTRY_INFO!D30*AL30*PROFILE!$G$9,COUNTRY_INFO!D30*AM30*PROFILE!$G$9,IF(AND(DISTRICT!Z30<>\"Inconnu\",Z30<>\"Non requis\"),COUNTRY_INFO!P30*DISTRICT!AN30,0))","v":5588},{"$f":"MAX(COUNTRY_INFO!D30*AK30*PROFILE!$G$10,COUNTRY_INFO!D30*AL30*PROFILE!$G$10,IF(AND(DISTRICT!Z30<>\"Inconnu\",Z30<>\"Non requis\"),COUNTRY_INFO!P30*DISTRICT!AO30,0))","v":12875},22188.1196500025,0,{"$f":"MAX('MDA4'!R30,'T1'!L30,'T2'!J30,T3_R1!K30,T3_R2!K30)","v":0},{"$f":"MAX('MDA1'!K30,'MDA4'!S30,'MDA3'!I30,'MDA3'!L30,'T1'!M30,'T2'!K30,T3_R1!L30,T3_R2!L30)","v":0},{"$f":"MAX('MDA1'!L30,'MDA4'!T30,'MDA3'!J30,'MDA3'!M30,'T1'!N30,'T2'!L30,T3_R1!M30,T3_R2!M30)","v":0},0,{"$f":"MAX('MDA4'!R30,T30)","v":0},{"$f":"MAX('MDA1'!K30,'MDA4'!S30,'MDA3'!I30,'MDA3'!L30,V30,AD30)","v":0},{"$f":"MAX('MDA1'!L30,'MDA4'!T30,'MDA3'!J30,'MDA3'!M30,AF30)","v":0},0,0]
[{"$f":"IF(COUNTRY_INFO!A31=0,\" \",COUNTRY_INFO!A31)","v":" Congo"},{"$f":"IF(COUNTRY_INFO!B31=0,\" \",COUNTRY_INFO!B31)","v":"Kouilou"},{"$f":"IF(COUNTRY_INFO!C31=0,\" \",COUNTRY_INFO!C31)","v":"Mvouti-Kakamouéka"},{"$f":"COUNTRY_INFO!M31","v":0},null,null,{"$f":"SUM('MDA1'!M31,'MDA4'!U31)","v":0},{"$f":"IF(AND(COUNTRY_INFO!H31>0,COUNTRY_INFO!H31<4),IF(D31>MAX('MDA1'!M31,'MDA4'!U31),MAX('MDA1'!M31,'MDA4'!U31),D31),0)","v":0},{"$f":"IF(AND(COUNTRY_INFO!H31>0,COUNTRY_INFO!H31<4), IF(G31/D31*100<>0, IF(G31/D31*100>100,100,G31/D31*100), \"-\"),0)","v":0},{"$f":"COUNTRY_INFO!N31","v":913},432,369,{"$f":"MAX('MDA1'!M31,MAX('MDA3'!I31,'MDA3'!L31)+MAX('MDA3'!J31,'MDA3'!M31))","v":801},{"$f":"IF(AND(COUNTRY_INFO!I31>0,COUNTRY_INFO!I31<4),IF(J31>MAX('MDA1'!M31,MAX('MDA3'!I31,'MDA3'!L31)+MAX('MDA3'!J31,'MDA3'!M31)),MAX('MDA1'!M31,MAX('MDA3'!I31,'MDA3'!L31)+MAX('MDA3'!J31,'MDA3'!M31)),J31),0)","v":801},{"$f":"IF(AND(COUNTRY_INFO!I31>0,COUNTRY_INFO!I31<4), IF(M31/J31*100<>0, IF(M31/J31*100>100,100,M31/J31*100), \"-\"),0)","v":87.732749178532316},{"$f":"COUNTRY_INFO!O31","v":14811},null,null,{"$f":"SUM(MAX('MDA4'!N31, 'T1'!L31, MAX(T3_R1!K31, T3_R2!K31)), MAX('MDA1'!K31, 'MDA4'!O31, 'T1'!M31, MAX(T3_R1!L31, T3_R2!L31)), MAX('MDA1'!L31, 'MDA4'!P31, 'T1'!N31, MAX(T3_R1!M31, T3_R2!M31)))","v":0},{"$f":"IF(AND(COUNTRY_INFO!J31>1,COUNTRY_INFO!J31<4),IF(COUNTRY_INFO!E31>MAX('MDA4'!N31,'T1'!L31,MAX(T3_R1!K31,T3_R2!K31)),MAX('MDA4'!N31,'T1'!L31,MAX(T3_R1!K31,T3_R2!K31)),COUNTRY_INFO!E31),0)","v":0},{"$f":"IF(AND(COUNTRY_INFO!J31>1,COUNTRY_INFO!J31<4), IF(T31/COUNTRY_INFO!E31*100<>0, IF(T31/COUNTRY_INFO!E31*100>100,100,T31/COUNTRY_INFO!E31*100), \"-\"),0)","v":"-"},{"$f":"IF(AND(COUNTRY_INFO!J31>1,COUNTRY_INFO!J31<4),IF(COUNTRY_INFO!F31>MAX('MDA1'!K31,'MDA4'!O31,'T1'!M31,MAX(T3_R1!L31,T3_R2!L31)),MAX('MDA1'!K31,'MDA4'!O31,'T1'!M31,MAX(T3_R1!L31,T3_R2!L31)),COUNTRY_INFO!F31),0)","v":0},{"$f":"IF(AND(COUNTRY_INFO!J31>1,COUNTRY_INFO!J31<4), IF(V31/COUNTRY_INFO!F31*100<>0, IF(V31/COUNTRY_INFO!F31*100>100,100,V31/COUNTRY_INFO!F31*100), \"-\"),0)","v":"-"},0,{"$f":"IF(AND(COUNTRY_INFO!J31>1,COUNTRY_INFO!J31<4), IF(S31/P31*100<>0, IF(X31/P31*100>100,100,X31/P31*100), \"-\"),0)","v":"-"},{"$f":"COUNTRY_INFO!P31","v":29363},null,null,{"$f":"MAX('T1'!L31,'T2'!J31)+MAX('T1'!M31,'T2'!K31)+MAX('T1'!N31,'T2'!L31)","v":0},{"$f":"IF(COUNTRY_INFO!K31=1,IF(COUNTRY_INFO!F31*0.33>MAX('T1'!M31,'T2'!K31),MAX('T1'!M31,'T2'!K31),COUNTRY_INFO!F31*0.33),IF(COUNTRY_INFO!K31=2,IF(COUNTRY_INFO!F31*0.5>MAX('T1'!M31,'T2'!K31),MAX('T1'!M31,'T2'!K31),COUNTRY_INFO!F31*0.5),IF(COUNTRY_INFO!K31=3,IF(COUNTRY_INFO!F31>MAX('T1'!M31,'T2'!K31),MAX('T1'!M31,'T2'!K31),COUNTRY_INFO!F31),0)))","v":0},{"$f":"IF(AND(COUNTRY_INFO!K31>0,COUNTRY_INFO!K31<4),IF(Z31>0,IF(COUNTRY_INFO!K31=1, AD31/(COUNTRY_INFO!F31*0.33)*100, IF(COUNTRY_INFO!K31=2, AD31/(COUNTRY_INFO!F31*0.5)*100, IF(COUNTRY_INFO!K31=3, AD31/COUNTRY_INFO!F31*100))),\"-\"),0)","v":0},{"$f":"IF(COUNTRY_INFO!K31=2,IF(COUNTRY_INFO!G31*0.2>MAX('T1'!N31,'T2'!L31),MAX('T1'!N31,'T2'!L31),COUNTRY_INFO!G31*0.2),IF(COUNTRY_INFO!K31=3,IF(COUNTRY_INFO!G31>MAX('T1'!N31,'T2'!L31),MAX('T1'!N31,'T2'!L31),COUNTRY_INFO!G31),0))","v":0},{"$f":"IF(AND(COUNTRY_INFO!K31>0,COUNTRY_INFO!K31<4),IF(Z31>0,IF(COUNTRY_INFO!K31=1, 0, IF(COUNTRY_INFO!K31=2, AF31/(COUNTRY_INFO!G31*0.2)*100, IF(COUNTRY_INFO!K31=3, AF31/COUNTRY_INFO!G31*100))),\"-\"),0)","v":0},0,{"$f":"IF(AND(COUNTRY_INFO!K31>0,COUNTRY_INFO!K31<4), IF(AC31/Z31*100<>0, IF(AH31/Z31*100>100,100,AH31/Z31*100), \"-\"),0)","v":"-"},null,{"$f":"IF(AND(D31<>0, D31<>\"Inconnu\",D31<>\"Interrompu\",D31<>\"Non requis\"),D31/COUNTRY_INFO!D31, 0)","v":0},{"$f":"IF(AND(J31<>0,J31<>\"Inconnu\",J31<>\"Interrompu\",J31<>\"Non requis\"),J31/COUNTRY_INFO!D31, 0)","v":2.4657016311980123E-2},{"$f":"IF(AND(P31<>0,P31<>\"Inconnu\",P31<>\"Non requis\"),P31/(COUNTRY_INFO!E31+COUNTRY_INFO!F31), 0)","v":1},{"$f":"IF(AND(Z31<>0,Z31<>\"Inconnu\",Z31<>\"Non requis\"),IF(COUNTRY_INFO!K31=1,1,IF(COUNTRY_INFO!K31=2,0.5*COUNTRY_INFO!F31/(0.5*COUNTRY_INFO!F31+0.2*COUNTRY_INFO!G31),IF(COUNTRY_INFO!K31=3,COUNTRY_INFO!F31/(COUNTRY_INFO!F31+COUNTRY_INFO!G31)))),0)","v":0.30265980996492187},{"$f":"IF(AND(Z31<>0,Z31<>\"Inconnu\",Z31<>\"Non requis\"),IF(COUNTRY_INFO!K31=1,0,IF(COUNTRY_INFO!K31=2,0.2*COUNTRY_INFO!G31/(0.5*COUNTRY_INFO!F31+0.2*COUNTRY_INFO!G31),IF(COUNTRY_INFO!K31=3,COUNTRY_INFO!G31/(COUNTRY_INFO!F31+COUNTRY_INFO!G31)))),0)","v":0.69734019003507819},{"$f":"MAX(COUNTRY_INFO!D31*AK31*PROFILE!$G$7,COUNTRY_INFO!D31*AL31*PROFILE!$G$7)","v":42.911517093045411},{"$f":"MAX(COUNTRY_INFO!D31*AK31*PROFILE!$G$8,COUNTRY_INFO!D31*AL31*PROFILE!$G$8,COUNTRY_INFO!D31*AM31*PROFILE!$G$8)","v":5924.4794433593561},{"$f":"MAX(COUNTRY_INFO!D31*AK31*PROFILE!$G$9,COUNTRY_INFO!D31*AL31*PROFILE!$G$9,COUNTRY_INFO!D31*AM31*PROFILE!$G$9,IF(AND(DISTRICT!Z31<>\"Inconnu\",Z31<>\"Non requis\"),COUNTRY_INFO!P31*DISTRICT!AN31,0))","v":8887},{"$f":"MAX(COUNTRY_INFO!D31*AK31*PROFILE!$G$10,COUNTRY_INFO!D31*AL31*PROFILE!$G$10,IF(AND(DISTRICT!Z31<>\"Inconnu\",Z31<>\"Non requis\"),COUNTRY_INFO!P31*DISTRICT!AO31,0))","v":20476},35330.390960452401,0,{"$f":"MAX('MDA4'!R31,'T1'!L31,'T2'!J31,T3_R1!K31,T3_R2!K31)","v":0},{"$f":"MAX('MDA1'!K31,'MDA4'!S31,'MDA3'!I31,'MDA3'!L31,'T1'!M31,'T2'!K31,T3_R1!L31,T3_R2!L31)","v":192},{"$f":"MAX('MDA1'!L31,'MDA4'!T31,'MDA3'!J31,'MDA3'!M31,'T1'!N31,'T2'!L31,T3_R1!M31,T3_R2!M31)","v":609},801,{"$f":"MAX('MDA4'!R31,T31)","v":0},{"$f":"MAX('MDA1'!K31,'MDA4'!S31,'MDA3'!I31,'MDA3'!L31,V31,AD31)","v":192},{"$f":"MAX('MDA1'!L31,'MDA4'!T31,'MDA3'!J31,'MDA3'!M31,AF31)","v":609},801,2.2671699299807107]
[{"$f":"IF(COUNTRY_INFO!A32=0,\" \",COUNTRY_INFO!A32)","v":" Congo"},{"$f":"IF(COUNTRY_INFO!B32=0,\" \",COUNTRY_INFO!B32)","v":"Lékoumou"},{"$f":"IF(COUNTRY_INFO!C32=0,\" \",COUNTRY_INFO!C32)","v":"Sibiti"},{"$f":"COUNTRY_INFO!M32","v":0},null,null,{"$f":"SUM('MDA1'!M32,'MDA4'!U32)","v":0},{"$f":"IF(AND(COUNTRY_INFO!H32>0,COUNTRY_INFO!H32<4),IF(D32>MAX('MDA1'!M32,'MDA4'!U32),MAX('MDA1'!M32,'MDA4'!U32),D32),0)","v":0},{"$f":"IF(AND(COUNTRY_INFO!H32>0,COUNTRY_INFO!H32<4), IF(G32/D32*100<>0, IF(G32/D32*100>100,100,G32/D32*100), \"-\"),0)","v":0},{"$f":"COUNTRY_INFO!N32","v":720},288,322,{"$f":"MAX('MDA1'!M32,MAX('MDA3'!I32,'MDA3'!L32)+MAX('MDA3'!J32,'MDA3'!M32))","v":610},{"$f":"IF(AND(COUNTRY_INFO!I32>0,COUNTRY_INFO!I32<4),IF(J32>MAX('MDA1'!M32,MAX('MDA3'!I32,'MDA3'!L32)+MAX('MDA3'!J32,'MDA3'!M32)),MAX('MDA1'!M32,MAX('MDA3'!I32,'MDA3'!L32)+MAX('MDA3'!J32,'MDA3'!M32)),J32),0)","v":610},{"$f":"IF(AND(COUNTRY_INFO!I32>0,COUNTRY_INFO!I32<4), IF(M32/J32*100<>0, IF(M32/J32*100>100,100,M32/J32*100), \"-\"),0)","v":84.722222222222214},{"$f":"COUNTRY_INFO!O32","v":35545},null,null,{"$f":"SUM(MAX('MDA4'!N32, 'T1'!L32, MAX(T3_R1!K32, T3_R2!K32)), MAX('MDA1'!K32, 'MDA4'!O32, 'T1'!M32, MAX(T3_R1!L32, T3_R2!L32)), MAX('MDA1'!L32, 'MDA4'!P32, 'T1'!N32, MAX(T3_R1!M32, T3_R2!M32)))","v":0},{"$f":"IF(AND(COUNTRY_INFO!J32>1,COUNTRY_INFO!J32<4),IF(COUNTRY_INFO!E32>MAX('MDA4'!N32,'T1'!L32,MAX(T3_R1!K32,T3_R2!K32)),MAX('MDA4'!N32,'T1'!L32,MAX(T3_R1!K32,T3_R2!K32)),COUNTRY_INFO!E32),0)","v":0},{"$f":"IF(AND(COUNTRY_INFO!J32>1,COUNTRY_INFO!J32<4), IF(T32/COUNTRY_INFO!E32*100<>0, IF(T32/COUNTRY_INFO!E32*100>100,100,T32/COUNTRY_INFO!E32*100), \"-\"),0)","v":"-"},{"$f":"IF(AND(COUNTRY_INFO!J32>1,COUNTRY_INFO!J32<4),IF(COUNTRY_INFO!F32>MAX('MDA1'!K32,'MDA4'!O32,'T1'!M32,MAX(T3_R1!L32,T3_R2!L32)),MAX('MDA1'!K32,'MDA4'!O32,'T1'!M32,MAX(T3_R1!L32,T3_R2!L32)),COUNTRY_INFO!F32),0)","v":0},{"$f":"IF(AND(COUNTRY_INFO!J32>1,COUNTRY_INFO!J32<4), IF(V32/COUNTRY_INFO!F32*100<>0, IF(V32/COUNTRY_INFO!F32*100>100,100,V32/COUNTRY_INFO!F32*100), \"-\"),0)","v":"-"},0,{"$f":"IF(AND(COUNTRY_INFO!J32>1,COUNTRY_INFO!J32<4), IF(S32/P32*100<>0, IF(X32/P32*100>100,100,X32/P32*100), \"-\"),0)","v":"-"},{"$f":"COUNTRY_INFO!P32","v":70469},null,null,{"$f":"MAX('T1'!L32,'T2'!J32)+MAX('T1'!M32,'T2'!K32)+MAX('T1'!N32,'T2'!L32)","v":0},{"$f":"IF(COUNTRY_INFO!K32=1,IF(COUNTRY_INFO!F32*0.33>MAX('T1'!M32,'T2'!K32),MAX('T1'!M32,'T2'!K32),COUNTRY_INFO!F32*0.33),IF(COUNTRY_INFO!K32=2,IF(COUNTRY_INFO!F32*0.5>MAX('T1'!M32,'T2'!K32),MAX('T1'!M32,'T2'!K32),COUNTRY_INFO!F32*0.5),IF(COUNTRY_INFO!K32=3,IF(COUNTRY_INFO!F32>MAX('T1'!M32,'T2'!K32),MAX('T1'!M32,'T2'!K32),COUNTRY_INFO!F32),0)))","v":0},{"$f":"IF(AND(COUNTRY_INFO!K32>0,COUNTRY_INFO!K32<4),IF(Z32>0,IF(COUNTRY_INFO!K32=1, AD32/(COUNTRY_INFO!F32*0.33)*100, IF(COUNTRY_INFO!K32=2, AD32/(COUNTRY_INFO!F32*0.5)*100, IF(COUNTRY_INFO!K32=3, AD32/COUNTRY_INFO!F32*100))),\"-\"),0)","v":0},{"$f":"IF(COUNTRY_INFO!K32=2,IF(COUNTRY_INFO!G32*0.2>MAX('T1'!N32,'T2'!L32),MAX('T1'!N32,'T2'!L32),COUNTRY_INFO!G32*0.2),IF(COUNTRY_INFO!K32=3,IF(COUNTRY_INFO!G32>MAX('T1'!N32,'T2'!L32),MAX('T1'!N32,'T2'!L32),COUNTRY_INFO!G32),0))","v":0},{"$f":"IF(AND(COUNTRY_INFO!K32>0,COUNTRY_INFO!K32<4),IF(Z32>0,IF(COUNTRY_INFO!K32=1, 0, IF(COUNTRY_INFO!K32=2, AF32/(COUNTRY_INFO!G32*0.2)*100, IF(COUNTRY_INFO!K32=3, AF32/COUNTRY_INFO!G32*100))),\"-\"),0)","v":0},0,{"$f":"IF(AND(COUNTRY_INFO!K32>0,COUNTRY_INFO!K32<4), IF(AC32/Z32*100<>0, IF(AH32/Z32*100>100,100,AH32/Z32*100), \"-\"),0)","v":"-"},null,{"$f":"IF(AND(D32<>0, D32<>\"Inconnu\",D32<>\"Interrompu\",D32<>\"Non requis\"),D32/COUNTRY_INFO!D32, 0)","v":0},{"$f":"IF(AND(J32<>0,J32<>\"Inconnu\",J32<>\"Interrompu\",J32<>\"Non requis\"),J32/COUNTRY_INFO!D32, 0)","v":8.1022686352178602E-3},{"$f":"IF(AND(P32<>0,P32<>\"Inconnu\",P32<>\"Non requis\"),P32/(COUNTRY_INFO!E32+COUNTRY_INFO!F32), 0)","v":1},{"$f":"IF(AND(Z32<>0,Z32<>\"Inconnu\",Z32<>\"Non requis\"),IF(COUNTRY_INFO!K32=1,1,IF(COUNTRY_INFO!K32=2,0.5*COUNTRY_INFO!F32/(0.5*COUNTRY_INFO!F32+0.2*COUNTRY_INFO!G32),IF(COUNTRY_INFO!K32=3,COUNTRY_INFO!F32/(COUNTRY_INFO!F32+COUNTRY_INFO!G32)))),0)","v":0.3026437156763967},{"$f":"IF(AND(Z32<>0,Z32<>\"Inconnu\",Z32<>\"Non requis\"),IF(COUNTRY_INFO!K32=1,0,IF(COUNTRY_INFO!K32=2,0.2*COUNTRY_INFO!G32/(0.5*COUNTRY_INFO!F32+0.2*COUNTRY_INFO!G32),IF(COUNTRY_INFO!K32=3,COUNTRY_INFO!G32/(COUNTRY_INFO!F32+COUNTRY_INFO!G32)))),0)","v":0.6973562843236033},{"$f":"MAX(COUNTRY_INFO!D32*AK32*PROFILE!$G$7,COUNTRY_INFO!D32*AL32*PROFILE!$G$7)","v":33.840407784219813},{"$f":"MAX(COUNTRY_INFO!D32*AK32*PROFILE!$G$8,COUNTRY_INFO!D32*AL32*PROFILE!$G$8,COUNTRY_INFO!D32*AM32*PROFILE!$G$8)","v":14218.23866411056},{"$f":"MAX(COUNTRY_INFO!D32*AK32*PROFILE!$G$9,COUNTRY_INFO!D32*AL32*PROFILE!$G$9,COUNTRY_INFO!D32*AM32*PROFILE!$G$9,IF(AND(DISTRICT!Z32<>\"Inconnu\",Z32<>\"Non requis\"),COUNTRY_INFO!P32*DISTRICT!AN32,0))","v":21327.324598929878},{"$f":"MAX(COUNTRY_INFO!D32*AK32*PROFILE!$G$10,COUNTRY_INFO!D32*AL32*PROFILE!$G$10,IF(AND(DISTRICT!Z32<>\"Inconnu\",Z32<>\"Non requis\"),COUNTRY_INFO!P32*DISTRICT!AO32,0))","v":49142},84721.403670824657,0,{"$f":"MAX('MDA4'!R32,'T1'!L32,'T2'!J32,T3_R1!K32,T3_R2!K32)","v":0},{"$f":"MAX('MDA1'!K32,'MDA4'!S32,'MDA3'!I32,'MDA3'!L32,'T1'!M32,'T2'!K32,T3_R1!L32,T3_R2!L32)","v":146.4},{"$f":"MAX('MDA1'!L32,'MDA4'!T32,'MDA3'!J32,'MDA3'!M32,'T1'!N32,'T2'!L32,T3_R1!M32,T3_R2!M32)","v":463.6},610,{"$f":"MAX('MDA4'!R32,T32)","v":0},{"$f":"MAX('MDA1'!K32,'MDA4'!S32,'MDA3'!I32,'MDA3'!L32,V32,AD32)","v":146.4},{"$f":"MAX('MDA1'!L32,'MDA4'!T32,'MDA3'!J32,'MDA3'!M32,AF32)","v":463.6},610,0.7200069564122018]
[{"$f":"IF(COUNTRY_INFO!A33=0,\" \",COUNTRY_INFO!A33)","v":" Congo"},{"$f":"IF(COUNTRY_INFO!B33=0,\" \",COUNTRY_INFO!B33)","v":"Lékoumou"},{"$f":"IF(COUNTRY_INFO!C33=0,\" \",COUNTRY_INFO!C33)","v":"Zanaga"},{"$f":"COUNTRY_INFO!M33","v":0},null,null,{"$f":"SUM('MDA1'!M33,'MDA4'!U33)","v":0},{"$f":"IF(AND(COUNTRY_INFO!H33>0,COUNTRY_INFO!H33<4),IF(D33>MAX('MDA1'!M33,'MDA4'!U33),MAX('MDA1'!M33,'MDA4'!U33),D33),0)","v":0},{"$f":"IF(AND(COUNTRY_INFO!H33>0,COUNTRY_INFO!H33<4), IF(G33/D33*100<>0, IF(G33/D33*100>100,100,G33/D33*100), \"-\"),0)","v":0},{"$f":"COUNTRY_INFO!N33","v":0},null,null,{"$f":"MAX('MDA1'!M33,MAX('MDA3'!I33,'MDA3'!L33)+MAX('MDA3'!J33,'MDA3'!M33))","v":0},{"$f":"IF(AND(COUNTRY_INFO!I33>0,COUNTRY_INFO!I33<4),IF(J33>MAX('MDA1'!M33,MAX('MDA3'!I33,'MDA3'!L33)+MAX('MDA3'!J33,'MDA3'!M33)),MAX('MDA1'!M33,MAX('MDA3'!I33,'MDA3'!L33)+MAX('MDA3'!J33,'MDA3'!M33)),J33),0)","v":0},{"$f":"IF(AND(COUNTRY_INFO!I33>0,COUNTRY_INFO!I33<4), IF(M33/J33*100<>0, IF(M33/J33*100>100,100,M33/J33*100), \"-\"),0)","v":0},{"$f":"COUNTRY_INFO!O33","v":13025},null,null,{"$f":"SUM(MAX('MDA4'!N33, 'T1'!L33, MAX(T3_R1!K33, T3_R2!K33)), MAX('MDA1'!K33, 'MDA4'!O33, 'T1'!M33, MAX(T3_R1!L33, T3_R2!L33)), MAX('MDA1'!L33, 'MDA4'!P33, 'T1'!N33, MAX(T3_R1!M33, T3_R2!M33)))","v":0},{"$f":"IF(AND(COUNTRY_INFO!J33>1,COUNTRY_INFO!J33<4),IF(COUNTRY_INFO!E33>MAX('MDA4'!N33,'T1'!L33,MAX(T3_R1!K33,T3_R2!K33)),MAX('MDA4'!N33,'T1'!L33,MAX(T3_R1!K33,T3_R2!K33)),COUNTRY_INFO!E33),0)","v":0},{"$f":"IF(AND(COUNTRY_INFO!J33>1,COUNTRY_INFO!J33<4), IF(T33/COUNTRY_INFO!E33*100<>0, IF(T33/COUNTRY_INFO!E33*100>100,100,T33/COUNTRY_INFO!E33*100), \"-\"),0)","v":"-"},{"$f":"IF(AND(COUNTRY_INFO!J33>1,COUNTRY_INFO!J33<4),IF(COUNTRY_INFO!F33>MAX('MDA1'!K33,'MDA4'!O33,'T1'!M33,MAX(T3_R1!L33,T3_R2!L33)),MAX('MDA1'!K33,'MDA4'!O33,'T1'!M33,MAX(T3_R1!L33,T3_R2!L33)),COUNTRY_INFO!F33),0)","v":0},{"$f":"IF(AND(COUNTRY_INFO!J33>1,COUNTRY_INFO!J33<4), IF(V33/COUNTRY_INFO!F33*100<>0, IF(V33/COUNTRY_INFO!F33*100>100,100,V33/COUNTRY_INFO!F33*100), \"-\"),0)","v":"-"},0,{"$f":"IF(AND(COUNTRY_INFO!J33>1,COUNTRY_INFO!J33<4), IF(S33/P33*100<>0, IF(X33/P33*100>100,100,X33/P33*100), \"-\"),0)","v":"-"},{"$f":"COUNTRY_INFO!P33","v":0},null,null,{"$f":"MAX('T1'!L33,'T2'!J33)+MAX('T1'!M33,'T2'!K33)+MAX('T1'!N33,'T2'!L33)","v":0},{"$f":"IF(COUNTRY_INFO!K33=1,IF(COUNTRY_INFO!F33*0.33>MAX('T1'!M33,'T2'!K33),MAX('T1'!M33,'T2'!K33),COUNTRY_INFO!F33*0.33),IF(COUNTRY_INFO!K33=2,IF(COUNTRY_INFO!F33*0.5>MAX('T1'!M33,'T2'!K33),MAX('T1'!M33,'T2'!K33),COUNTRY_INFO!F33*0.5),IF(COUNTRY_INFO!K33=3,IF(COUNTRY_INFO!F33>MAX('T1'!M33,'T2'!K33),MAX('T1'!M33,'T2'!K33),COUNTRY_INFO!F33),0)))","v":0},{"$f":"IF(AND(COUNTRY_INFO!K33>0,COUNTRY_INFO!K33<4),IF(Z33>0,IF(COUNTRY_INFO!K33=1, AD33/(COUNTRY_INFO!F33*0.33)*100, IF(COUNTRY_INFO!K33=2, AD33/(COUNTRY_INFO!F33*0.5)*100, IF(COUNTRY_INFO!K33=3, AD33/COUNTRY_INFO!F33*100))),\"-\"),0)","v":0},{"$f":"IF(COUNTRY_INFO!K33=2,IF(COUNTRY_INFO!G33*0.2>MAX('T1'!N33,'T2'!L33),MAX('T1'!N33,'T2'!L33),COUNTRY_INFO!G33*0.2),IF(COUNTRY_INFO!K33=3,IF(COUNTRY_INFO!G33>MAX('T1'!N33,'T2'!L33),MAX('T1'!N33,'T2'!L33),COUNTRY_INFO!G33),0))","v":0},{"$f":"IF(AND(COUNTRY_INFO!K33>0,COUNTRY_INFO!K33<4),IF(Z33>0,IF(COUNTRY_INFO!K33=1, 0, IF(COUNTRY_INFO!K33=2, AF33/(COUNTRY_INFO!G33*0.2)*100, IF(COUNTRY_INFO!K33=3, AF33/COUNTRY_INFO!G33*100))),\"-\"),0)","v":0},0,{"$f":"IF(AND(COUNTRY_INFO!K33>0,COUNTRY_INFO!K33<4), IF(AC33/Z33*100<>0, IF(AH33/Z33*100>100,100,AH33/Z33*100), \"-\"),0)","v":0},null,{"$f":"IF(AND(D33<>0, D33<>\"Inconnu\",D33<>\"Interrompu\",D33<>\"Non requis\"),D33/COUNTRY_INFO!D33, 0)","v":0},{"$f":"IF(AND(J33<>0,J33<>\"Inconnu\",J33<>\"Interrompu\",J33<>\"Non requis\"),J33/COUNTRY_INFO!D33, 0)","v":0},{"$f":"IF(AND(P33<>0,P33<>\"Inconnu\",P33<>\"Non requis\"),P33/(COUNTRY_INFO!E33+COUNTRY_INFO!F33), 0)","v":1},{"$f":"IF(AND(Z33<>0,Z33<>\"Inconnu\",Z33<>\"Non requis\"),IF(COUNTRY_INFO!K33=1,1,IF(COUNTRY_INFO!K33=2,0.5*COUNTRY_INFO!F33/(0.5*COUNTRY_INFO!F33+0.2*COUNTRY_INFO!G33),IF(COUNTRY_INFO!K33=3,COUNTRY_INFO!F33/(COUNTRY_INFO!F33+COUNTRY_INFO!G33)))),0)","v":0},{"$f":"IF(AND(Z33<>0,Z33<>\"Inconnu\",Z33<>\"Non requis\"),IF(COUNTRY_INFO!K33=1,0,IF(COUNTRY_INFO!K33=2,0.2*COUNTRY_INFO!G33/(0.5*COUNTRY_INFO!F33+0.2*COUNTRY_INFO!G33),IF(COUNTRY_INFO!K33=3,COUNTRY_INFO!G33/(COUNTRY_INFO!F33+COUNTRY_INFO!G33)))),0)","v":0},{"$f":"MAX(COUNTRY_INFO!D33*AK33*PROFILE!$G$7,COUNTRY_INFO!D33*AL33*PROFILE!$G$7)","v":0},{"$f":"MAX(COUNTRY_INFO!D33*AK33*PROFILE!$G$8,COUNTRY_INFO!D33*AL33*PROFILE!$G$8,COUNTRY_INFO!D33*AM33*PROFILE!$G$8)","v":5210.079510481547},{"$f":"MAX(COUNTRY_INFO!D33*AK33*PROFILE!$G$9,COUNTRY_INFO!D33*AL33*PROFILE!$G$9,COUNTRY_INFO!D33*AM33*PROFILE!$G$9,IF(AND(DISTRICT!Z33<>\"Inconnu\",Z33<>\"Non requis\"),COUNTRY_INFO!P33*DISTRICT!AN33,0))","v":7815.1070277610015},{"$f":"MAX(COUNTRY_INFO!D33*AK33*PROFILE!$G$10,COUNTRY_INFO!D33*AL33*PROFILE!$G$10,IF(AND(DISTRICT!Z33<>\"Inconnu\",Z33<>\"Non requis\"),COUNTRY_INFO!P33*DISTRICT!AO33,0))","v":0},13025.186538242549,0,{"$f":"MAX('MDA4'!R33,'T1'!L33,'T2'!J33,T3_R1!K33,T3_R2!K33)","v":0},{"$f":"MAX('MDA1'!K33,'MDA4'!S33,'MDA3'!I33,'MDA3'!L33,'T1'!M33,'T2'!K33,T3_R1!L33,T3_R2!L33)","v":0},{"$f":"MAX('MDA1'!L33,'MDA4'!T33,'MDA3'!J33,'MDA3'!M33,'T1'!N33,'T2'!L33,T3_R1!M33,T3_R2!M33)","v":0},0,{"$f":"MAX('MDA4'!R33,T33)","v":0},{"$f":"MAX('MDA1'!K33,'MDA4'!S33,'MDA3'!I33,'MDA3'!L33,V33,AD33)","v":0},{"$f":"MAX('MDA1'!L33,'MDA4'!T33,'MDA3'!J33,'MDA3'!M33,AF33)","v":0},0,0]
[{"$f":"IF(COUNTRY_INFO!A34=0,\" \",COUNTRY_INFO!A34)","v":" Congo"},{"$f":"IF(COUNTRY_INFO!B34=0,\" \",COUNTRY_INFO!B34)","v":"Likouala"},{"$f":"IF(COUNTRY_INFO!C34=0,\" \",COUNTRY_INFO!C34)","v":"Bétou"},{"$f":"COUNTRY_INFO!M34","v":0},null,null,{"$f":"SUM('MDA1'!M34,'MDA4'!U34)","v":0},{"$f":"IF(AND(COUNTRY_INFO!H34>0,COUNTRY_INFO!H34<4),IF(D34>MAX('MDA1'!M34,'MDA4'!U34),MAX('MDA1'!M34,'MDA4'!U34),D34),0)","v":0},{"$f":"IF(AND(COUNTRY_INFO!H34>0,COUNTRY_INFO!H34<4), IF(G34/D34*100<>0, IF(G34/D34*100>100,100,G34/D34*100), \"-\"),0)","v":0},{"$f":"COUNTRY_INFO!N34","v":0},null,null,{"$f":"MAX('MDA1'!M34,MAX('MDA3'!I34,'MDA3'!L34)+MAX('MDA3'!J34,'MDA3'!M34))","v":0},{"$f":"IF(AND(COUNTRY_INFO!I34>0,COUNTRY_INFO!I34<4),IF(J34>MAX('MDA1'!M34,MAX('MDA3'!I34,'MDA3'!L34)+MAX('MDA3'!J34,'MDA3'!M34)),MAX('MDA1'!M34,MAX('MDA3'!I34,'MDA3'!L34)+MAX('MDA3'!J34,'MDA3'!M34)),J34),0)","v":0},{"$f":"IF(AND(COUNTRY_INFO!I34>0,COUNTRY_INFO!I34<4), IF(M34/J34*100<>0, IF(M34/J34*100>100,100,M34/J34*100), \"-\"),0)","v":0},{"$f":"COUNTRY_INFO!O34","v":57545},null,null,{"$f":"SUM(MAX('MDA4'!N34, 'T1'!L34, MAX(T3_R1!K34, T3_R2!K34)), MAX('MDA1'!K34, 'MDA4'!O34, 'T1'!M34, MAX(T3_R1!L34, T3_R2!L34)), MAX('MDA1'!L34, 'MDA4'!P34, 'T1'!N34, MAX(T3_R1!M34, T3_R2!M34)))","v":0},{"$f":"IF(AND(COUNTRY_INFO!J34>1,COUNTRY_INFO!J34<4),IF(COUNTRY_INFO!E34>MAX('MDA4'!N34,'T1'!L34,MAX(T3_R1!K34,T3_R2!K34)),MAX('MDA4'!N34,'T1'!L34,MAX(T3_R1!K34,T3_R2!K34)),COUNTRY_INFO!E34),0)","v":0},{"$f":"IF(AND(COUNTRY_INFO!J34>1,COUNTRY_INFO!J34<4), IF(T34/COUNTRY_INFO!E34*100<>0, IF(T34/COUNTRY_INFO!E34*100>100,100,T34/COUNTRY_INFO!E34*100), \"-\"),0)","v":"-"},{"$f":"IF(AND(COUNTRY_INFO!J34>1,COUNTRY_INFO!J34<4),IF(COUNTRY_INFO!F34>MAX('MDA1'!K34,'MDA4'!O34,'T1'!M34,MAX(T3_R1!L34,T3_R2!L34)),MAX('MDA1'!K34,'MDA4'!O34,'T1'!M34,MAX(T3_R1!L34,T3_R2!L34)),COUNTRY_INFO!F34),0)","v":0},{"$f":"IF(AND(COUNTRY_INFO!J34>1,COUNTRY_INFO!J34<4), IF(V34/COUNTRY_INFO!F34*100<>0, IF(V34/COUNTRY_INFO!F34*100>100,100,V34/COUNTRY_INFO!F34*100), \"-\"),0)","v":"-"},0,{"$f":"IF(AND(COUNTRY_INFO!J34>1,COUNTRY_INFO!J34<4), IF(S34/P34*100<>0, IF(X34/P34*100>100,100,X34/P34*100), \"-\"),0)","v":"-"},{"$f":"COUNTRY_INFO!P34","v":0},null,null,{"$f":"MAX('T1'!L34,'T2'!J34)+MAX('T1'!M34,'T2'!K34)+MAX('T1'!N34,'T2'!L34)","v":0},{"$f":"IF(COUNTRY_INFO!K34=1,IF(COUNTRY_INFO!F34*0.33>MAX('T1'!M34,'T2'!K34),MAX('T1'!M34,'T2'!K34),COUNTRY_INFO!F34*0.33),IF(COUNTRY_INFO!K34=2,IF(COUNTRY_INFO!F34*0.5>MAX('T1'!M34,'T2'!K34),MAX('T1'!M34,'T2'!K34),COUNTRY_INFO!F34*0.5),IF(COUNTRY_INFO!K34=3,IF(COUNTRY_INFO!F34>MAX('T1'!M34,'T2'!K34),MAX('T1'!M34,'T2'!K34),COUNTRY_INFO!F34),0)))","v":0},{"$f":"IF(AND(COUNTRY_INFO!K34>0,COUNTRY_INFO!K34<4),IF(Z34>0,IF(COUNTRY_INFO!K34=1, AD34/(COUNTRY_INFO!F34*0.33)*100, IF(COUNTRY_INFO!K34=2, AD34/(COUNTRY_INFO!F34*0.5)*100, IF(COUNTRY_INFO!K34=3, AD34/COUNTRY_INFO!F34*100))),\"-\"),0)","v":0},{"$f":"IF(COUNTRY_INFO!K34=2,IF(COUNTRY_INFO!G34*0.2>MAX('T1'!N34,'T2'!L34),MAX('T1'!N34,'T2'!L34),COUNTRY_INFO!G34*0.2),IF(COUNTRY_INFO!K34=3,IF(COUNTRY_INFO!G34>MAX('T1'!N34,'T2'!L34),MAX('T1'!N34,'T2'!L34),COUNTRY_INFO!G34),0))","v":0},{"$f":"IF(AND(COUNTRY_INFO!K34>0,COUNTRY_INFO!K34<4),IF(Z34>0,IF(COUNTRY_INFO!K34=1, 0, IF(COUNTRY_INFO!K34=2, AF34/(COUNTRY_INFO!G34*0.2)*100, IF(COUNTRY_INFO!K34=3, AF34/COUNTRY_INFO!G34*100))),\"-\"),0)","v":0},0,{"$f":"IF(AND(COUNTRY_INFO!K34>0,COUNTRY_INFO!K34<4), IF(AC34/Z34*100<>0, IF(AH34/Z34*100>100,100,AH34/Z34*100), \"-\"),0)","v":0},null,{"$f":"IF(AND(D34<>0, D34<>\"Inconnu\",D34<>\"Interrompu\",D34<>\"Non requis\"),D34/COUNTRY_INFO!D34, 0)","v":0},{"$f":"IF(AND(J34<>0,J34<>\"Inconnu\",J34<>\"Interrompu\",J34<>\"Non requis\"),J34/COUNTRY_INFO!D34, 0)","v":0},{"$f":"IF(AND(P34<>0,P34<>\"Inconnu\",P34<>\"Non requis\"),P34/(COUNTRY_INFO!E34+COUNTRY_INFO!F34), 0)","v":1},{"$f":"IF(AND(Z34<>0,Z34<>\"Inconnu\",Z34<>\"Non requis\"),IF(COUNTRY_INFO!K34=1,1,IF(COUNTRY_INFO!K34=2,0.5*COUNTRY_INFO!F34/(0.5*COUNTRY_INFO!F34+0.2*COUNTRY_INFO!G34),IF(COUNTRY_INFO!K34=3,COUNTRY_INFO!F34/(COUNTRY_INFO!F34+COUNTRY_INFO!G34)))),0)","v":0},{"$f":"IF(AND(Z34<>0,Z34<>\"Inconnu\",Z34<>\"Non requis\"),IF(COUNTRY_INFO!K34=1,0,IF(COUNTRY_INFO!K34=2,0.2*COUNTRY_INFO!G34/(0.5*COUNTRY_INFO!F34+0.2*COUNTRY_INFO!G34),IF(COUNTRY_INFO!K34=3,COUNTRY_INFO!G34/(COUNTRY_INFO!F34+COUNTRY_INFO!G34)))),0)","v":0},{"$f":"MAX(COUNTRY_INFO!D34*AK34*PROFILE!$G$7,COUNTRY_INFO!D34*AL34*PROFILE!$G$7)","v":0},{"$f":"MAX(COUNTRY_INFO!D34*AK34*PROFILE!$G$8,COUNTRY_INFO!D34*AL34*PROFILE!$G$8,COUNTRY_INFO!D34*AM34*PROFILE!$G$8)","v":23017.75783734256},{"$f":"MAX(COUNTRY_INFO!D34*AK34*PROFILE!$G$9,COUNTRY_INFO!D34*AL34*PROFILE!$G$9,COUNTRY_INFO!D34*AM34*PROFILE!$G$9,IF(AND(DISTRICT!Z34<>\"Inconnu\",Z34<>\"Non requis\"),COUNTRY_INFO!P34*DISTRICT!AN34,0))","v":34526.58268957791},{"$f":"MAX(COUNTRY_INFO!D34*AK34*PROFILE!$G$10,COUNTRY_INFO!D34*AL34*PROFILE!$G$10,IF(AND(DISTRICT!Z34<>\"Inconnu\",Z34<>\"Non requis\"),COUNTRY_INFO!P34*DISTRICT!AO34,0))","v":0},57544.340526920467,0,{"$f":"MAX('MDA4'!R34,'T1'!L34,'T2'!J34,T3_R1!K34,T3_R2!K34)","v":0},{"$f":"MAX('MDA1'!K34,'MDA4'!S34,'MDA3'!I34,'MDA3'!L34,'T1'!M34,'T2'!K34,T3_R1!L34,T3_R2!L34)","v":0},{"$f":"MAX('MDA1'!L34,'MDA4'!T34,'MDA3'!J34,'MDA3'!M34,'T1'!N34,'T2'!L34,T3_R1!M34,T3_R2!M34)","v":0},0,{"$f":"MAX('MDA4'!R34,T34)","v":0},{"$f":"MAX('MDA1'!K34,'MDA4'!S34,'MDA3'!I34,'MDA3'!L34,V34,AD34)","v":0},{"$f":"MAX('MDA1'!L34,'MDA4'!T34,'MDA3'!J34,'MDA3'!M34,AF34)","v":0},0,0]
[{"$f":"IF(COUNTRY_INFO!A35=0,\" \",COUNTRY_INFO!A35)","v":" Congo"},{"$f":"IF(COUNTRY_INFO!B35=0,\" \",COUNTRY_INFO!B35)","v":"Likouala"},{"$f":"IF(COUNTRY_INFO!C35=0,\" \",COUNTRY_INFO!C35)","v":"Impfondo"},{"$f":"COUNTRY_INFO!M35","v":119962},28798,29149,{"$f":"SUM('MDA1'!M35,'MDA4'!U35)","v":57947},{"$f":"IF(AND(COUNTRY_INFO!H35>0,COUNTRY_INFO!H35<4),IF(D35>MAX('MDA1'!M35,'MDA4'!U35),MAX('MDA1'!M35,'MDA4'!U35),D35),0)","v":57947},{"$f":"IF(AND(COUNTRY_INFO!H35>0,COUNTRY_INFO!H35<4), IF(G35/D35*100<>0, IF(G35/D35*100>100,100,G35/D35*100), \"-\"),0)","v":48.304463079975321},{"$f":"COUNTRY_INFO!N35","v":0},null,null,{"$f":"MAX('MDA1'!M35,MAX('MDA3'!I35,'MDA3'!L35)+MAX('MDA3'!J35,'MDA3'!M35))","v":0},{"$f":"IF(AND(COUNTRY_INFO!I35>0,COUNTRY_INFO!I35<4),IF(J35>MAX('MDA1'!M35,MAX('MDA3'!I35,'MDA3'!L35)+MAX('MDA3'!J35,'MDA3'!M35)),MAX('MDA1'!M35,MAX('MDA3'!I35,'MDA3'!L35)+MAX('MDA3'!J35,'MDA3'!M35)),J35),0)","v":0},{"$f":"IF(AND(COUNTRY_INFO!I35>0,COUNTRY_INFO!I35<4), IF(M35/J35*100<>0, IF(M35/J35*100>100,100,M35/J35*100), \"-\"),0)","v":0},{"$f":"COUNTRY_INFO!O35","v":47985},null,null,{"$f":"SUM(MAX('MDA4'!N35, 'T1'!L35, MAX(T3_R1!K35, T3_R2!K35)), MAX('MDA1'!K35, 'MDA4'!O35, 'T1'!M35, MAX(T3_R1!L35, T3_R2!L35)), MAX('MDA1'!L35, 'MDA4'!P35, 'T1'!N35, MAX(T3_R1!M35, T3_R2!M35)))","v":0},{"$f":"IF(AND(COUNTRY_INFO!J35>1,COUNTRY_INFO!J35<4),IF(COUNTRY_INFO!E35>MAX('MDA4'!N35,'T1'!L35,MAX(T3_R1!K35,T3_R2!K35)),MAX('MDA4'!N35,'T1'!L35,MAX(T3_R1!K35,T3_R2!K35)),COUNTRY_INFO!E35),0)","v":0},{"$f":"IF(AND(COUNTRY_INFO!J35>1,COUNTRY_INFO!J35<4), IF(T35/COUNTRY_INFO!E35*100<>0, IF(T35/COUNTRY_INFO!E35*100>100,100,T35/COUNTRY_INFO!E35*100), \"-\"),0)","v":"-"},{"$f":"IF(AND(COUNTRY_INFO!J35>1,COUNTRY_INFO!J35<4),IF(COUNTRY_INFO!F35>MAX('MDA1'!K35,'MDA4'!O35,'T1'!M35,MAX(T3_R1!L35,T3_R2!L35)),MAX('MDA1'!K35,'MDA4'!O35,'T1'!M35,MAX(T3_R1!L35,T3_R2!L35)),COUNTRY_INFO!F35),0)","v":0},{"$f":"IF(AND(COUNTRY_INFO!J35>1,COUNTRY_INFO!J35<4), IF(V35/COUNTRY_INFO!F35*100<>0, IF(V35/COUNTRY_INFO!F35*100>100,100,V35/COUNTRY_INFO!F35*100), \"-\"),0)","v":"-"},0,{"$f":"IF(AND(COUNTRY_INFO!J35>1,COUNTRY_INFO!J35<4), IF(S35/P35*100<>0, IF(X35/P35*100>100,100,X35/P35*100), \"-\"),0)","v":"-"},{"$f":"COUNTRY_INFO!P35","v":0},null,null,{"$f":"MAX('T1'!L35,'T2'!J35)+MAX('T1'!M35,'T2'!K35)+MAX('T1'!N35,'T2'!L35)","v":0},{"$f":"IF(COUNTRY_INFO!K35=1,IF(COUNTRY_INFO!F35*0.33>MAX('T1'!M35,'T2'!K35),MAX('T1'!M35,'T2'!K35),COUNTRY_INFO!F35*0.33),IF(COUNTRY_INFO!K35=2,IF(COUNTRY_INFO!F35*0.5>MAX('T1'!M35,'T2'!K35),MAX('T1'!M35,'T2'!K35),COUNTRY_INFO!F35*0.5),IF(COUNTRY_INFO!K35=3,IF(COUNTRY_INFO!F35>MAX('T1'!M35,'T2'!K35),MAX('T1'!M35,'T2'!K35),COUNTRY_INFO!F35),0)))","v":0},{"$f":"IF(AND(COUNTRY_INFO!K35>0,COUNTRY_INFO!K35<4),IF(Z35>0,IF(COUNTRY_INFO!K35=1, AD35/(COUNTRY_INFO!F35*0.33)*100, IF(COUNTRY_INFO!K35=2, AD35/(COUNTRY_INFO!F35*0.5)*100, IF(COUNTRY_INFO!K35=3, AD35/COUNTRY_INFO!F35*100))),\"-\"),0)","v":0},{"$f":"IF(COUNTRY_INFO!K35=2,IF(COUNTRY_INFO!G35*0.2>MAX('T1'!N35,'T2'!L35),MAX('T1'!N35,'T2'!L35),COUNTRY_INFO!G35*0.2),IF(COUNTRY_INFO!K35=3,IF(COUNTRY_INFO!G35>MAX('T1'!N35,'T2'!L35),MAX('T1'!N35,'T2'!L35),COUNTRY_INFO!G35),0))","v":0},{"$f":"IF(AND(COUNTRY_INFO!K35>0,COUNTRY_INFO!K35<4),IF(Z35>0,IF(COUNTRY_INFO!K35=1, 0, IF(COUNTRY_INFO!K35=2, AF35/(COUNTRY_INFO!G35*0.2)*100, IF(COUNTRY_INFO!K35=3, AF35/COUNTRY_INFO!G35*100))),\"-\"),0)","v":0},0,{"$f":"IF(AND(COUNTRY_INFO!K35>0,COUNTRY_INFO!K35<4), IF(AC35/Z35*100<>0, IF(AH35/Z35*100>100,100,AH35/Z35*100), \"-\"),0)","v":0},null,{"$f":"IF(AND(D35<>0, D35<>\"Inconnu\",D35<>\"Interrompu\",D35<>\"Non requis\"),D35/COUNTRY_INFO!D35, 0)","v":1},{"$f":"IF(AND(J35<>0,J35<>\"Inconnu\",J35<>\"Interrompu\",J35<>\"Non requis\"),J35/COUNTRY_INFO!D35, 0)","v":0},{"$f":"IF(AND(P35<>0,P35<>\"Inconnu\",P35<>\"Non requis\"),P35/(COUNTRY_INFO!E35+COUNTRY_INFO!F35), 0)","v":1},{"$f":"IF(AND(Z35<>0,Z35<>\"Inconnu\",Z35<>\"Non requis\"),IF(COUNTRY_INFO!K35=1,1,IF(COUNTRY_INFO!K35=2,0.5*COUNTRY_INFO!F35/(0.5*COUNTRY_INFO!F35+0.2*COUNTRY_INFO!G35),IF(COUNTRY_INFO!K35=3,COUNTRY_INFO!F35/(COUNTRY_INFO!F35+COUNTRY_INFO!G35)))),0)","v":0},{"$f":"IF(AND(Z35<>0,Z35<>\"Inconnu\",Z35<>\"Non requis\"),IF(COUNTRY_INFO!K35=1,0,IF(COUNTRY_INFO!K35=2,0.2*COUNTRY_INFO!G35/(0.5*COUNTRY_INFO!F35+0.2*COUNTRY_INFO!G35),IF(COUNTRY_INFO!K35=3,COUNTRY_INFO!G35/(COUNTRY_INFO!F35+COUNTRY_INFO!G35)))),0)","v":0},{"$f":"MAX(COUNTRY_INFO!D35*AK35*PROFILE!$G$7,COUNTRY_INFO!D35*AL35*PROFILE!$G$7)","v":5638.2819425146918},{"$f":"MAX(COUNTRY_INFO!D35*AK35*PROFILE!$G$8,COUNTRY_INFO!D35*AL35*PROFILE!$G$8,COUNTRY_INFO!D35*AM35*PROFILE!$G$8)","v":19193.918196615403},{"$f":"MAX(COUNTRY_INFO!D35*AK35*PROFILE!$G$9,COUNTRY_INFO!D35*AL35*PROFILE!$G$9,COUNTRY_INFO!D35*AM35*PROFILE!$G$9,IF(AND(DISTRICT!Z35<>\"Inconnu\",Z35<>\"Non requis\"),COUNTRY_INFO!P35*DISTRICT!AN35,0))","v":28790.832210308181},{"$f":"MAX(COUNTRY_INFO!D35*AK35*PROFILE!$G$10,COUNTRY_INFO!D35*AL35*PROFILE!$G$10,IF(AND(DISTRICT!Z35<>\"Inconnu\",Z35<>\"Non requis\"),COUNTRY_INFO!P35*DISTRICT!AO35,0))","v":66338.967650561724},119962,0,{"$f":"MAX('MDA4'!R35,'T1'!L35,'T2'!J35,T3_R1!K35,T3_R2!K35)","v":0},{"$f":"MAX('MDA1'!K35,'MDA4'!S35,'MDA3'!I35,'MDA3'!L35,'T1'!M35,'T2'!K35,T3_R1!L35,T3_R2!L35)","v":13907.28},{"$f":"MAX('MDA1'!L35,'MDA4'!T35,'MDA3'!J35,'MDA3'!M35,'T1'!N35,'T2'!L35,T3_R1!M35,T3_R2!M35)","v":44039.72},57947,{"$f":"MAX('MDA4'!R35,T35)","v":0},{"$f":"MAX('MDA1'!K35,'MDA4'!S35,'MDA3'!I35,'MDA3'!L35,V35,AD35)","v":13907.28},{"$f":"MAX('MDA1'!L35,'MDA4'!T35,'MDA3'!J35,'MDA3'!M35,AF35)","v":44039.72},57947,48.304463079975321]
[{"$f":"IF(COUNTRY_INFO!A36=0,\" \",COUNTRY_INFO!A36)","v":" Congo"},{"$f":"IF(COUNTRY_INFO!B36=0,\" \",COUNTRY_INFO!B36)","v":"Niari"},{"$f":"IF(COUNTRY_INFO!C36=0,\" \",COUNTRY_INFO!C36)","v":"Dolisie"},{"$f":"COUNTRY_INFO!M36","v":160182},36299,43670,{"$f":"SUM('MDA1'!M36,'MDA4'!U36)","v":89582},{"$f":"IF(AND(COUNTRY_INFO!H36>0,COUNTRY_INFO!H36<4),IF(D36>MAX('MDA1'!M36,'MDA4'!U36),MAX('MDA1'!M36,'MDA4'!U36),D36),0)","v":79969},{"$f":"IF(AND(COUNTRY_INFO!H36>0,COUNTRY_INFO!H36<4), IF(G36/D36*100<>0, IF(G36/D36*100>100,100,G36/D36*100), \"-\"),0)","v":55.925135158756909},{"$f":"COUNTRY_INFO!N36","v":10925},4891,6034,{"$f":"MAX('MDA1'!M36,MAX('MDA3'!I36,'MDA3'!L36)+MAX('MDA3'!J36,'MDA3'!M36))","v":9613},{"$f":"IF(AND(COUNTRY_INFO!I36>0,COUNTRY_INFO!I36<4),IF(J36>MAX('MDA1'!M36,MAX('MDA3'!I36,'MDA3'!L36)+MAX('MDA3'!J36,'MDA3'!M36)),MAX('MDA1'!M36,MAX('MDA3'!I36,'MDA3'!L36)+MAX('MDA3'!J36,'MDA3'!M36)),J36),0)","v":9613},{"$f":"IF(AND(COUNTRY_INFO!I36>0,COUNTRY_INFO!I36<4), IF(M36/J36*100<>0, IF(M36/J36*100>100,100,M36/J36*100), \"-\"),0)","v":87.990846681922193},{"$f":"COUNTRY_INFO!O36","v":64073},null,null,{"$f":"SUM(MAX('MDA4'!N36, 'T1'!L36, MAX(T3_R1!K36, T3_R2!K36)), MAX('MDA1'!K36, 'MDA4'!O36, 'T1'!M36, MAX(T3_R1!L36, T3_R2!L36)), MAX('MDA1'!L36, 'MDA4'!P36, 'T1'!N36, MAX(T3_R1!M36, T3_R2!M36)))","v":79969},{"$f":"IF(AND(COUNTRY_INFO!J36>1,COUNTRY_INFO!J36<4),IF(COUNTRY_INFO!E36>MAX('MDA4'!N36,'T1'!L36,MAX(T3_R1!K36,T3_R2!K36)),MAX('MDA4'!N36,'T1'!L36,MAX(T3_R1!K36,T3_R2!K36)),COUNTRY_INFO!E36),0)","v":0},{"$f":"IF(AND(COUNTRY_INFO!J36>1,COUNTRY_INFO!J36<4), IF(T36/COUNTRY_INFO!E36*100<>0, IF(T36/COUNTRY_INFO!E36*100>100,100,T36/COUNTRY_INFO!E36*100), \"-\"),0)","v":"-"},{"$f":"IF(AND(COUNTRY_INFO!J36>1,COUNTRY_INFO!J36<4),IF(COUNTRY_INFO!F36>MAX('MDA1'!K36,'MDA4'!O36,'T1'!M36,MAX(T3_R1!L36,T3_R2!L36)),MAX('MDA1'!K36,'MDA4'!O36,'T1'!M36,MAX(T3_R1!L36,T3_R2!L36)),COUNTRY_INFO!F36),0)","v":19192.560000000001},{"$f":"IF(AND(COUNTRY_INFO!J36>1,COUNTRY_INFO!J36<4), IF(V36/COUNTRY_INFO!F36*100<>0, IF(V36/COUNTRY_INFO!F36*100>100,100,V36/COUNTRY_INFO!F36*100), \"-\"),0)","v":49.923421080012488},19192.560000000001,{"$f":"IF(AND(COUNTRY_INFO!J36>1,COUNTRY_INFO!J36<4), IF(S36/P36*100<>0, IF(X36/P36*100>100,100,X36/P36*100), \"-\"),0)","v":29.954208480951415},{"$f":"COUNTRY_INFO!P36","v":36938.199999999997},null,null,{"$f":"MAX('T1'!L36,'T2'!J36)+MAX('T1'!M36,'T2'!K36)+MAX('T1'!N36,'T2'!L36)","v":0},{"$f":"IF(COUNTRY_INFO!K36=1,IF(COUNTRY_INFO!F36*0.33>MAX('T1'!M36,'T2'!K36),MAX('T1'!M36,'T2'!K36),COUNTRY_INFO!F36*0.33),IF(COUNTRY_INFO!K36=2,IF(COUNTRY_INFO!F36*0.5>MAX('T1'!M36,'T2'!K36),MAX('T1'!M36,'T2'!K36),COUNTRY_INFO!F36*0.5),IF(COUNTRY_INFO!K36=3,IF(COUNTRY_INFO!F36>MAX('T1'!M36,'T2'!K36),MAX('T1'!M36,'T2'!K36),COUNTRY_INFO!F36),0)))","v":0},{"$f":"IF(AND(COUNTRY_INFO!K36>0,COUNTRY_INFO!K36<4),IF(Z36>0,IF(COUNTRY_INFO!K36=1, AD36/(COUNTRY_INFO!F36*0.33)*100, IF(COUNTRY_INFO!K36=2, AD36/(COUNTRY_INFO!F36*0.5)*100, IF(COUNTRY_INFO!K36=3, AD36/COUNTRY_INFO!F36*100))),\"-\"),0)","v":0},{"$f":"IF(COUNTRY_INFO!K36=2,IF(COUNTRY_INFO!G36*0.2>MAX('T1'!N36,'T2'!L36),MAX('T1'!N36,'T2'!L36),COUNTRY_INFO!G36*0.2),IF(COUNTRY_INFO!K36=3,IF(COUNTRY_INFO!G36>MAX('T1'!N36,'T2'!L36),MAX('T1'!N36,'T2'!L36),COUNTRY_INFO!G36),0))","v":0},{"$f":"IF(AND(COUNTRY_INFO!K36>0,COUNTRY_INFO!K36<4),IF(Z36>0,IF(COUNTRY_INFO!K36=1, 0, IF(COUNTRY_INFO!K36=2, AF36/(COUNTRY_INFO!G36*0.2)*100, IF(COUNTRY_INFO!K36=3, AF36/COUNTRY_INFO!G36*100))),\"-\"),0)","v":0},0,{"$f":"IF(AND(COUNTRY_INFO!K36>0,COUNTRY_INFO!K36<4), IF(AC36/Z36*100<>0, IF(AH36/Z36*100>100,100,AH36/Z36*100), \"-\"),0)","v":"-"},null,{"$f":"IF(AND(D36<>0, D36<>\"Inconnu\",D36<>\"Interrompu\",D36<>\"Non requis\"),D36/COUNTRY_INFO!D36, 0)","v":1},{"$f":"IF(AND(J36<>0,J36<>\"Inconnu\",J36<>\"Interrompu\",J36<>\"Non requis\"),J36/COUNTRY_INFO!D36, 0)","v":6.8203668327277728E-2},{"$f":"IF(AND(P36<>0,P36<>\"Inconnu\",P36<>\"Non requis\"),P36/(COUNTRY_INFO!E36+COUNTRY_INFO!F36), 0)","v":1},{"$f":"IF(AND(Z36<>0,Z36<>\"Inconnu\",Z36<>\"Non requis\"),IF(COUNTRY_INFO!K36=1,1,IF(COUNTRY_INFO!K36=2,0.5*COUNTRY_INFO!F36/(0.5*COUNTRY_INFO!F36+0.2*COUNTRY_INFO!G36),IF(COUNTRY_INFO!K36=3,COUNTRY_INFO!F36/(COUNTRY_INFO!F36+COUNTRY_INFO!G36)))),0)","v":0.52038269325522091},{"$f":"IF(AND(Z36<>0,Z36<>\"Inconnu\",Z36<>\"Non requis\"),IF(COUNTRY_INFO!K36=1,0,IF(COUNTRY_INFO!K36=2,0.2*COUNTRY_INFO!G36/(0.5*COUNTRY_INFO!F36+0.2*COUNTRY_INFO!G36),IF(COUNTRY_INFO!K36=3,COUNTRY_INFO!G36/(COUNTRY_INFO!F36+COUNTRY_INFO!G36)))),0)","v":0.47961730674477915},{"$f":"MAX(COUNTRY_INFO!D36*AK36*PROFILE!$G$7,COUNTRY_INFO!D36*AL36*PROFILE!$G$7)","v":7528.644721794305},{"$f":"MAX(COUNTRY_INFO!D36*AK36*PROFILE!$G$8,COUNTRY_INFO!D36*AL36*PROFILE!$G$8,COUNTRY_INFO!D36*AM36*PROFILE!$G$8)","v":25629.117591989532},{"$f":"MAX(COUNTRY_INFO!D36*AK36*PROFILE!$G$9,COUNTRY_INFO!D36*AL36*PROFILE!$G$9,COUNTRY_INFO!D36*AM36*PROFILE!$G$9,IF(AND(DISTRICT!Z36<>\"Inconnu\",Z36<>\"Non requis\"),COUNTRY_INFO!P36*DISTRICT!AN36,0))","v":38443.616187722655},{"$f":"MAX(COUNTRY_INFO!D36*AK36*PROFILE!$G$10,COUNTRY_INFO!D36*AL36*PROFILE!$G$10,IF(AND(DISTRICT!Z36<>\"Inconnu\",Z36<>\"Non requis\"),COUNTRY_INFO!P36*DISTRICT!AO36,0))","v":88580.621498493507},160182,0,{"$f":"MAX('MDA4'!R36,'T1'!L36,'T2'!J36,T3_R1!K36,T3_R2!K36)","v":0},{"$f":"MAX('MDA1'!K36,'MDA4'!S36,'MDA3'!I36,'MDA3'!L36,'T1'!M36,'T2'!K36,T3_R1!L36,T3_R2!L36)","v":19192.560000000001},{"$f":"MAX('MDA1'!L36,'MDA4'!T36,'MDA3'!J36,'MDA3'!M36,'T1'!N36,'T2'!L36,T3_R1!M36,T3_R2!M36)","v":60776.44},79969,{"$f":"MAX('MDA4'!R36,T36)","v":0},{"$f":"MAX('MDA1'!K36,'MDA4'!S36,'MDA3'!I36,'MDA3'!L36,V36,AD36)","v":19192.560000000001},{"$f":"MAX('MDA1'!L36,'MDA4'!T36,'MDA3'!J36,'MDA3'!M36,AF36)","v":60776.44},79969,49.923836635826746]
[{"$f":"IF(COUNTRY_INFO!A37=0,\" \",COUNTRY_INFO!A37)","v":" Congo"},{"$f":"IF(COUNTRY_INFO!B37=0,\" \",COUNTRY_INFO!B37)","v":"Niari"},{"$f":"IF(COUNTRY_INFO!C37=0,\" \",COUNTRY_INFO!C37)","v":"Kibangou"},{"$f":"COUNTRY_INFO!M37","v":65597},9197,9586,{"$f":"SUM('MDA1'!M37,'MDA4'!U37)","v":27564.32},{"$f":"IF(AND(COUNTRY_INFO!H37>0,COUNTRY_INFO!H37<4),IF(D37>MAX('MDA1'!M37,'MDA4'!U37),MAX('MDA1'!M37,'MDA4'!U37),D37),0)","v":19485.32},{"$f":"IF(AND(COUNTRY_INFO!H37>0,COUNTRY_INFO!H37<4), IF(G37/D37*100<>0, IF(G37/D37*100>100,100,G37/D37*100), \"-\"),0)","v":42.0207021662576},{"$f":"COUNTRY_INFO!N37","v":9899},5096,4803,{"$f":"MAX('MDA1'!M37,MAX('MDA3'!I37,'MDA3'!L37)+MAX('MDA3'!J37,'MDA3'!M37))","v":8079},{"$f":"IF(AND(COUNTRY_INFO!I37>0,COUNTRY_INFO!I37<4),IF(J37>MAX('MDA1'!M37,MAX('MDA3'!I37,'MDA3'!L37)+MAX('MDA3'!J37,'MDA3'!M37)),MAX('MDA1'!M37,MAX('MDA3'!I37,'MDA3'!L37)+MAX('MDA3'!J37,'MDA3'!M37)),J37),0)","v":8079},{"$f":"IF(AND(COUNTRY_INFO!I37>0,COUNTRY_INFO!I37<4), IF(M37/J37*100<>0, IF(M37/J37*100>100,100,M37/J37*100), \"-\"),0)","v":81.614304475199518},{"$f":"COUNTRY_INFO!O37","v":26239},null,null,{"$f":"SUM(MAX('MDA4'!N37, 'T1'!L37, MAX(T3_R1!K37, T3_R2!K37)), MAX('MDA1'!K37, 'MDA4'!O37, 'T1'!M37, MAX(T3_R1!L37, T3_R2!L37)), MAX('MDA1'!L37, 'MDA4'!P37, 'T1'!N37, MAX(T3_R1!M37, T3_R2!M37)))","v":18783},{"$f":"IF(AND(COUNTRY_INFO!J37>1,COUNTRY_INFO!J37<4),IF(COUNTRY_INFO!E37>MAX('MDA4'!N37,'T1'!L37,MAX(T3_R1!K37,T3_R2!K37)),MAX('MDA4'!N37,'T1'!L37,MAX(T3_R1!K37,T3_R2!K37)),COUNTRY_INFO!E37),0)","v":0},{"$f":"IF(AND(COUNTRY_INFO!J37>1,COUNTRY_INFO!J37<4), IF(T37/COUNTRY_INFO!E37*100<>0, IF(T37/COUNTRY_INFO!E37*100>100,100,T37/COUNTRY_INFO!E37*100), \"-\"),0)","v":"-"},{"$f":"IF(AND(COUNTRY_INFO!J37>1,COUNTRY_INFO!J37<4),IF(COUNTRY_INFO!F37>MAX('MDA1'!K37,'MDA4'!O37,'T1'!M37,MAX(T3_R1!L37,T3_R2!L37)),MAX('MDA1'!K37,'MDA4'!O37,'T1'!M37,MAX(T3_R1!L37,T3_R2!L37)),COUNTRY_INFO!F37),0)","v":4507.92},{"$f":"IF(AND(COUNTRY_INFO!J37>1,COUNTRY_INFO!J37<4), IF(V37/COUNTRY_INFO!F37*100<>0, IF(V37/COUNTRY_INFO!F37*100>100,100,V37/COUNTRY_INFO!F37*100), \"-\"),0)","v":28.634440703804863},4507.92,{"$f":"IF(AND(COUNTRY_INFO!J37>1,COUNTRY_INFO!J37<4), IF(S37/P37*100<>0, IF(X37/P37*100>100,100,X37/P37*100), \"-\"),0)","v":17.180227905026868},{"$f":"COUNTRY_INFO!P37","v":5195.1900000000005},null,null,{"$f":"MAX('T1'!L37,'T2'!J37)+MAX('T1'!M37,'T2'!K37)+MAX('T1'!N37,'T2'!L37)","v":0},{"$f":"IF(COUNTRY_INFO!K37=1,IF(COUNTRY_INFO!F37*0.33>MAX('T1'!M37,'T2'!K37),MAX('T1'!M37,'T2'!K37),COUNTRY_INFO!F37*0.33),IF(COUNTRY_INFO!K37=2,IF(COUNTRY_INFO!F37*0.5>MAX('T1'!M37,'T2'!K37),MAX('T1'!M37,'T2'!K37),COUNTRY_INFO!F37*0.5),IF(COUNTRY_INFO!K37=3,IF(COUNTRY_INFO!F37>MAX('T1'!M37,'T2'!K37),MAX('T1'!M37,'T2'!K37),COUNTRY_INFO!F37),0)))","v":0},{"$f":"IF(AND(COUNTRY_INFO!K37>0,COUNTRY_INFO!K37<4),IF(Z37>0,IF(COUNTRY_INFO!K37=1, AD37/(COUNTRY_INFO!F37*0.33)*100, IF(COUNTRY_INFO!K37=2, AD37/(COUNTRY_INFO!F37*0.5)*100, IF(COUNTRY_INFO!K37=3, AD37/COUNTRY_INFO!F37*100))),\"-\"),0)","v":0},{"$f":"IF(COUNTRY_INFO!K37=2,IF(COUNTRY_INFO!G37*0.2>MAX('T1'!N37,'T2'!L37),MAX('T1'!N37,'T2'!L37),COUNTRY_INFO!G37*0.2),IF(COUNTRY_INFO!K37=3,IF(COUNTRY_INFO!G37>MAX('T1'!N37,'T2'!L37),MAX('T1'!N37,'T2'!L37),COUNTRY_INFO!G37),0))","v":0},{"$f":"IF(AND(COUNTRY_INFO!K37>0,COUNTRY_INFO!K37<4),IF(Z37>0,IF(COUNTRY_INFO!K37=1, 0, IF(COUNTRY_INFO!K37=2, AF37/(COUNTRY_INFO!G37*0.2)*100, IF(COUNTRY_INFO!K37=3, AF37/COUNTRY_INFO!G37*100))),\"-\"),0)","v":0},0,{"$f":"IF(AND(COUNTRY_INFO!K37>0,COUNTRY_INFO!K37<4), IF(AC37/Z37*100<>0, IF(AH37/Z37*100>100,100,AH37/Z37*100), \"-\"),0)","v":"-"},null,{"$f":"IF(AND(D37<>0, D37<>\"Inconnu\",D37<>\"Interrompu\",D37<>\"Non requis\"),D37/COUNTRY_INFO!D37, 0)","v":1},{"$f":"IF(AND(J37<>0,J37<>\"Inconnu\",J37<>\"Interrompu\",J37<>\"Non requis\"),J37/COUNTRY_INFO!D37, 0)","v":0.15090629144625517},{"$f":"IF(AND(P37<>0,P37<>\"Inconnu\",P37<>\"Non requis\"),P37/(COUNTRY_INFO!E37+COUNTRY_INFO!F37), 0)","v":1},{"$f":"IF(AND(Z37<>0,Z37<>\"Inconnu\",Z37<>\"Non requis\"),IF(COUNTRY_INFO!K37=1,1,IF(COUNTRY_INFO!K37=2,0.5*COUNTRY_INFO!F37/(0.5*COUNTRY_INFO!F37+0.2*COUNTRY_INFO!G37),IF(COUNTRY_INFO!K37=3,COUNTRY_INFO!F37/(COUNTRY_INFO!F37+COUNTRY_INFO!G37)))),0)","v":1},{"$f":"IF(AND(Z37<>0,Z37<>\"Inconnu\",Z37<>\"Non requis\"),IF(COUNTRY_INFO!K37=1,0,IF(COUNTRY_INFO!K37=2,0.2*COUNTRY_INFO!G37/(0.5*COUNTRY_INFO!F37+0.2*COUNTRY_INFO!G37),IF(COUNTRY_INFO!K37=3,COUNTRY_INFO!G37/(COUNTRY_INFO!F37+COUNTRY_INFO!G37)))),0)","v":0},{"$f":"MAX(COUNTRY_INFO!D37*AK37*PROFILE!$G$7,COUNTRY_INFO!D37*AL37*PROFILE!$G$7)","v":3083.0961519742605},{"$f":"MAX(COUNTRY_INFO!D37*AK37*PROFILE!$G$8,COUNTRY_INFO!D37*AL37*PROFILE!$G$8,COUNTRY_INFO!D37*AM37*PROFILE!$G$8)","v":10495.519013882567},{"$f":"MAX(COUNTRY_INFO!D37*AK37*PROFILE!$G$9,COUNTRY_INFO!D37*AL37*PROFILE!$G$9,COUNTRY_INFO!D37*AM37*PROFILE!$G$9,IF(AND(DISTRICT!Z37<>\"Inconnu\",Z37<>\"Non requis\"),COUNTRY_INFO!P37*DISTRICT!AN37,0))","v":15743.253867888046},{"$f":"MAX(COUNTRY_INFO!D37*AK37*PROFILE!$G$10,COUNTRY_INFO!D37*AL37*PROFILE!$G$10,IF(AND(DISTRICT!Z37<>\"Inconnu\",Z37<>\"Non requis\"),COUNTRY_INFO!P37*DISTRICT!AO37,0))","v":36275.130966255128},65597,0,{"$f":"MAX('MDA4'!R37,'T1'!L37,'T2'!J37,T3_R1!K37,T3_R2!K37)","v":0},{"$f":"MAX('MDA1'!K37,'MDA4'!S37,'MDA3'!I37,'MDA3'!L37,'T1'!M37,'T2'!K37,T3_R1!L37,T3_R2!L37)","v":5210.2400000000007},{"$f":"MAX('MDA1'!L37,'MDA4'!T37,'MDA3'!J37,'MDA3'!M37,'T1'!N37,'T2'!L37,T3_R1!M37,T3_R2!M37)","v":14275.08},19485.32,{"$f":"MAX('MDA4'!R37,T37)","v":0},{"$f":"MAX('MDA1'!K37,'MDA4'!S37,'MDA3'!I37,'MDA3'!L37,V37,AD37)","v":5210.2400000000007},{"$f":"MAX('MDA1'!L37,'MDA4'!T37,'MDA3'!J37,'MDA3'!M37,AF37)","v":14275.08},19485.32,29.704590148939737]
[{"$f":"IF(COUNTRY_INFO!A38=0,\" \",COUNTRY_INFO!A38)","v":" Congo"},{"$f":"IF(COUNTRY_INFO!B38=0,\" \",COUNTRY_INFO!B38)","v":"Niari"},{"$f":"IF(COUNTRY_INFO!C38=0,\" \",COUNTRY_INFO!C38)","v":"Kimongo-Londela Nkayes"},{"$f":"COUNTRY_INFO!M38","v":39084},11002,11350,{"$f":"SUM('MDA1'!M38,'MDA4'!U38)","v":22352},{"$f":"IF(AND(COUNTRY_INFO!H38>0,COUNTRY_INFO!H38<4),IF(D38>MAX('MDA1'!M38,'MDA4'!U38),MAX('MDA1'!M38,'MDA4'!U38),D38),0)","v":22352},{"$f":"IF(AND(COUNTRY_INFO!H38>0,COUNTRY_INFO!H38<4), IF(G38/D38*100<>0, IF(G38/D38*100>100,100,G38/D38*100), \"-\"),0)","v":57.189642820591544},{"$f":"COUNTRY_INFO!N38","v":0},null,null,{"$f":"MAX('MDA1'!M38,MAX('MDA3'!I38,'MDA3'!L38)+MAX('MDA3'!J38,'MDA3'!M38))","v":0},{"$f":"IF(AND(COUNTRY_INFO!I38>0,COUNTRY_INFO!I38<4),IF(J38>MAX('MDA1'!M38,MAX('MDA3'!I38,'MDA3'!L38)+MAX('MDA3'!J38,'MDA3'!M38)),MAX('MDA1'!M38,MAX('MDA3'!I38,'MDA3'!L38)+MAX('MDA3'!J38,'MDA3'!M38)),J38),0)","v":0},{"$f":"IF(AND(COUNTRY_INFO!I38>0,COUNTRY_INFO!I38<4), IF(M38/J38*100<>0, IF(M38/J38*100>100,100,M38/J38*100), \"-\"),0)","v":0},{"$f":"COUNTRY_INFO!O38","v":15633},null,null,{"$f":"SUM(MAX('MDA4'!N38, 'T1'!L38, MAX(T3_R1!K38, T3_R2!K38)), MAX('MDA1'!K38, 'MDA4'!O38, 'T1'!M38, MAX(T3_R1!L38, T3_R2!L38)), MAX('MDA1'!L38, 'MDA4'!P38, 'T1'!N38, MAX(T3_R1!M38, T3_R2!M38)))","v":22352},{"$f":"IF(AND(COUNTRY_INFO!J38>1,COUNTRY_INFO!J38<4),IF(COUNTRY_INFO!E38>MAX('MDA4'!N38,'T1'!L38,MAX(T3_R1!K38,T3_R2!K38)),MAX('MDA4'!N38,'T1'!L38,MAX(T3_R1!K38,T3_R2!K38)),COUNTRY_INFO!E38),0)","v":0},{"$f":"IF(AND(COUNTRY_INFO!J38>1,COUNTRY_INFO!J38<4), IF(T38/COUNTRY_INFO!E38*100<>0, IF(T38/COUNTRY_INFO!E38*100>100,100,T38/COUNTRY_INFO!E38*100), \"-\"),0)","v":"-"},{"$f":"IF(AND(COUNTRY_INFO!J38>1,COUNTRY_INFO!J38<4),IF(COUNTRY_INFO!F38>MAX('MDA1'!K38,'MDA4'!O38,'T1'!M38,MAX(T3_R1!L38,T3_R2!L38)),MAX('MDA1'!K38,'MDA4'!O38,'T1'!M38,MAX(T3_R1!L38,T3_R2!L38)),COUNTRY_INFO!F38),0)","v":5364.48},{"$f":"IF(AND(COUNTRY_INFO!J38>1,COUNTRY_INFO!J38<4), IF(V38/COUNTRY_INFO!F38*100<>0, IF(V38/COUNTRY_INFO!F38*100>100,100,V38/COUNTRY_INFO!F38*100), \"-\"),0)","v":57.190618336886992},5364.48,{"$f":"IF(AND(COUNTRY_INFO!J38>1,COUNTRY_INFO!J38<4), IF(S38/P38*100<>0, IF(X38/P38*100>100,100,X38/P38*100), \"-\"),0)","v":34.315102667434275},{"$f":"COUNTRY_INFO!P38","v":9012.6},null,null,{"$f":"MAX('T1'!L38,'T2'!J38)+MAX('T1'!M38,'T2'!K38)+MAX('T1'!N38,'T2'!L38)","v":0},{"$f":"IF(COUNTRY_INFO!K38=1,IF(COUNTRY_INFO!F38*0.33>MAX('T1'!M38,'T2'!K38),MAX('T1'!M38,'T2'!K38),COUNTRY_INFO!F38*0.33),IF(COUNTRY_INFO!K38=2,IF(COUNTRY_INFO!F38*0.5>MAX('T1'!M38,'T2'!K38),MAX('T1'!M38,'T2'!K38),COUNTRY_INFO!F38*0.5),IF(COUNTRY_INFO!K38=3,IF(COUNTRY_INFO!F38>MAX('T1'!M38,'T2'!K38),MAX('T1'!M38,'T2'!K38),COUNTRY_INFO!F38),0)))","v":0},{"$f":"IF(AND(COUNTRY_INFO!K38>0,COUNTRY_INFO!K38<4),IF(Z38>0,IF(COUNTRY_INFO!K38=1, AD38/(COUNTRY_INFO!F38*0.33)*100, IF(COUNTRY_INFO!K38=2, AD38/(COUNTRY_INFO!F38*0.5)*100, IF(COUNTRY_INFO!K38=3, AD38/COUNTRY_INFO!F38*100))),\"-\"),0)","v":0},{"$f":"IF(COUNTRY_INFO!K38=2,IF(COUNTRY_INFO!G38*0.2>MAX('T1'!N38,'T2'!L38),MAX('T1'!N38,'T2'!L38),COUNTRY_INFO!G38*0.2),IF(COUNTRY_INFO!K38=3,IF(COUNTRY_INFO!G38>MAX('T1'!N38,'T2'!L38),MAX('T1'!N38,'T2'!L38),COUNTRY_INFO!G38),0))","v":0},{"$f":"IF(AND(COUNTRY_INFO!K38>0,COUNTRY_INFO!K38<4),IF(Z38>0,IF(COUNTRY_INFO!K38=1, 0, IF(COUNTRY_INFO!K38=2, AF38/(COUNTRY_INFO!G38*0.2)*100, IF(COUNTRY_INFO!K38=3, AF38/COUNTRY_INFO!G38*100))),\"-\"),0)","v":0},0,{"$f":"IF(AND(COUNTRY_INFO!K38>0,COUNTRY_INFO!K38<4), IF(AC38/Z38*100<>0, IF(AH38/Z38*100>100,100,AH38/Z38*100), \"-\"),0)","v":"-"},null,{"$f":"IF(AND(D38<>0, D38<>\"Inconnu\",D38<>\"Interrompu\",D38<>\"Non requis\"),D38/COUNTRY_INFO!D38, 0)","v":1},{"$f":"IF(AND(J38<>0,J38<>\"Inconnu\",J38<>\"Interrompu\",J38<>\"Non requis\"),J38/COUNTRY_INFO!D38, 0)","v":0},{"$f":"IF(AND(P38<>0,P38<>\"Inconnu\",P38<>\"Non requis\"),P38/(COUNTRY_INFO!E38+COUNTRY_INFO!F38), 0)","v":1},{"$f":"IF(AND(Z38<>0,Z38<>\"Inconnu\",Z38<>\"Non requis\"),IF(COUNTRY_INFO!K38=1,1,IF(COUNTRY_INFO!K38=2,0.5*COUNTRY_INFO!F38/(0.5*COUNTRY_INFO!F38+0.2*COUNTRY_INFO!G38),IF(COUNTRY_INFO!K38=3,COUNTRY_INFO!F38/(COUNTRY_INFO!F38+COUNTRY_INFO!G38)))),0)","v":0.52038257550540357},{"$f":"IF(AND(Z38<>0,Z38<>\"Inconnu\",Z38<>\"Non requis\"),IF(COUNTRY_INFO!K38=1,0,IF(COUNTRY_INFO!K38=2,0.2*COUNTRY_INFO!G38/(0.5*COUNTRY_INFO!F38+0.2*COUNTRY_INFO!G38),IF(COUNTRY_INFO!K38=3,COUNTRY_INFO!G38/(COUNTRY_INFO!F38+COUNTRY_INFO!G38)))),0)","v":0.47961742449459649},{"$f":"MAX(COUNTRY_INFO!D38*AK38*PROFILE!$G$7,COUNTRY_INFO!D38*AL38*PROFILE!$G$7)","v":1836.9701358867326},{"$f":"MAX(COUNTRY_INFO!D38*AK38*PROFILE!$G$8,COUNTRY_INFO!D38*AL38*PROFILE!$G$8,COUNTRY_INFO!D38*AM38*PROFILE!$G$8)","v":6253.4394124515793},{"$f":"MAX(COUNTRY_INFO!D38*AK38*PROFILE!$G$9,COUNTRY_INFO!D38*AL38*PROFILE!$G$9,COUNTRY_INFO!D38*AM38*PROFILE!$G$9,IF(AND(DISTRICT!Z38<>\"Inconnu\",Z38<>\"Non requis\"),COUNTRY_INFO!P38*DISTRICT!AN38,0))","v":9380.1444299668638},{"$f":"MAX(COUNTRY_INFO!D38*AK38*PROFILE!$G$10,COUNTRY_INFO!D38*AL38*PROFILE!$G$10,IF(AND(DISTRICT!Z38<>\"Inconnu\",Z38<>\"Non requis\"),COUNTRY_INFO!P38*DISTRICT!AO38,0))","v":21613.446021694825},39084,0,{"$f":"MAX('MDA4'!R38,'T1'!L38,'T2'!J38,T3_R1!K38,T3_R2!K38)","v":0},{"$f":"MAX('MDA1'!K38,'MDA4'!S38,'MDA3'!I38,'MDA3'!L38,'T1'!M38,'T2'!K38,T3_R1!L38,T3_R2!L38)","v":5364.48},{"$f":"MAX('MDA1'!L38,'MDA4'!T38,'MDA3'!J38,'MDA3'!M38,'T1'!N38,'T2'!L38,T3_R1!M38,T3_R2!M38)","v":16987.52},22352,{"$f":"MAX('MDA4'!R38,T38)","v":0},{"$f":"MAX('MDA1'!K38,'MDA4'!S38,'MDA3'!I38,'MDA3'!L38,V38,AD38)","v":5364.48},{"$f":"MAX('MDA1'!L38,'MDA4'!T38,'MDA3'!J38,'MDA3'!M38,AF38)","v":16987.52},22352,57.189642820591544]
[{"$f":"IF(COUNTRY_INFO!A39=0,\" \",COUNTRY_INFO!A39)","v":" Congo"},{"$f":"IF(COUNTRY_INFO!B39=0,\" \",COUNTRY_INFO!B39)","v":"Niari"},{"$f":"IF(COUNTRY_INFO!C39=0,\" \",COUNTRY_INFO!C39)","v":"Mayoko"},{"$f":"COUNTRY_INFO!M39","v":0},null,null,{"$f":"SUM('MDA1'!M39,'MDA4'!U39)","v":0},{"$f":"IF(AND(COUNTRY_INFO!H39>0,COUNTRY_INFO!H39<4),IF(D39>MAX('MDA1'!M39,'MDA4'!U39),MAX('MDA1'!M39,'MDA4'!U39),D39),0)","v":0},{"$f":"IF(AND(COUNTRY_INFO!H39>0,COUNTRY_INFO!H39<4), IF(G39/D39*100<>0, IF(G39/D39*100>100,100,G39/D39*100), \"-\"),0)","v":0},{"$f":"COUNTRY_INFO!N39","v":0},null,null,{"$f":"MAX('MDA1'!M39,MAX('MDA3'!I39,'MDA3'!L39)+MAX('MDA3'!J39,'MDA3'!M39))","v":0},{"$f":"IF(AND(COUNTRY_INFO!I39>0,COUNTRY_INFO!I39<4),IF(J39>MAX('MDA1'!M39,MAX('MDA3'!I39,'MDA3'!L39)+MAX('MDA3'!J39,'MDA3'!M39)),MAX('MDA1'!M39,MAX('MDA3'!I39,'MDA3'!L39)+MAX('MDA3'!J39,'MDA3'!M39)),J39),0)","v":0},{"$f":"IF(AND(COUNTRY_INFO!I39>0,COUNTRY_INFO!I39<4), IF(M39/J39*100<>0, IF(M39/J39*100>100,100,M39/J39*100), \"-\"),0)","v":0},{"$f":"COUNTRY_INFO!O39","v":6453},null,null,{"$f":"SUM(MAX('MDA4'!N39, 'T1'!L39, MAX(T3_R1!K39, T3_R2!K39)), MAX('MDA1'!K39, 'MDA4'!O39, 'T1'!M39, MAX(T3_R1!L39, T3_R2!L39)), MAX('MDA1'!L39, 'MDA4'!P39, 'T1'!N39, MAX(T3_R1!M39, T3_R2!M39)))","v":0},{"$f":"IF(AND(COUNTRY_INFO!J39>1,COUNTRY_INFO!J39<4),IF(COUNTRY_INFO!E39>MAX('MDA4'!N39,'T1'!L39,MAX(T3_R1!K39,T3_R2!K39)),MAX('MDA4'!N39,'T1'!L39,MAX(T3_R1!K39,T3_R2!K39)),COUNTRY_INFO!E39),0)","v":0},{"$f":"IF(AND(COUNTRY_INFO!J39>1,COUNTRY_INFO!J39<4), IF(T39/COUNTRY_INFO!E39*100<>0, IF(T39/COUNTRY_INFO!E39*100>100,100,T39/COUNTRY_INFO!E39*100), \"-\"),0)","v":"-"},{"$f":"IF(AND(COUNTRY_INFO!J39>1,COUNTRY_INFO!J39<4),IF(COUNTRY_INFO!F39>MAX('MDA1'!K39,'MDA4'!O39,'T1'!M39,MAX(T3_R1!L39,T3_R2!L39)),MAX('MDA1'!K39,'MDA4'!O39,'T1'!M39,MAX(T3_R1!L39,T3_R2!L39)),COUNTRY_INFO!F39),0)","v":0},{"$f":"IF(AND(COUNTRY_INFO!J39>1,COUNTRY_INFO!J39<4), IF(V39/COUNTRY_INFO!F39*100<>0, IF(V39/COUNTRY_INFO!F39*100>100,100,V39/COUNTRY_INFO!F39*100), \"-\"),0)","v":"-"},0,{"$f":"IF(AND(COUNTRY_INFO!J39>1,COUNTRY_INFO!J39<4), IF(S39/P39*100<>0, IF(X39/P39*100>100,100,X39/P39*100), \"-\"),0)","v":"-"},{"$f":"COUNTRY_INFO!P39","v":0},null,null,{"$f":"MAX('T1'!L39,'T2'!J39)+MAX('T1'!M39,'T2'!K39)+MAX('T1'!N39,'T2'!L39)","v":0},{"$f":"IF(COUNTRY_INFO!K39=1,IF(COUNTRY_INFO!F39*0.33>MAX('T1'!M39,'T2'!K39),MAX('T1'!M39,'T2'!K39),COUNTRY_INFO!F39*0.33),IF(COUNTRY_INFO!K39=2,IF(COUNTRY_INFO!F39*0.5>MAX('T1'!M39,'T2'!K39),MAX('T1'!M39,'T2'!K39),COUNTRY_INFO!F39*0.5),IF(COUNTRY_INFO!K39=3,IF(COUNTRY_INFO!F39>MAX('T1'!M39,'T2'!K39),MAX('T1'!M39,'T2'!K39),COUNTRY_INFO!F39),0)))","v":0},{"$f":"IF(AND(COUNTRY_INFO!K39>0,COUNTRY_INFO!K39<4),IF(Z39>0,IF(COUNTRY_INFO!K39=1, AD39/(COUNTRY_INFO!F39*0.33)*100, IF(COUNTRY_INFO!K39=2, AD39/(COUNTRY_INFO!F39*0.5)*100, IF(COUNTRY_INFO!K39=3, AD39/COUNTRY_INFO!F39*100))),\"-\"),0)","v":0},{"$f":"IF(COUNTRY_INFO!K39=2,IF(COUNTRY_INFO!G39*0.2>MAX('T1'!N39,'T2'!L39),MAX('T1'!N39,'T2'!L39),COUNTRY_INFO!G39*0.2),IF(COUNTRY_INFO!K39=3,IF(COUNTRY_INFO!G39>MAX('T1'!N39,'T2'!L39),MAX('T1'!N39,'T2'!L39),COUNTRY_INFO!G39),0))","v":0},{"$f":"IF(AND(COUNTRY_INFO!K39>0,COUNTRY_INFO!K39<4),IF(Z39>0,IF(COUNTRY_INFO!K39=1, 0, IF(COUNTRY_INFO!K39=2, AF39/(COUNTRY_INFO!G39*0.2)*100, IF(COUNTRY_INFO!K39=3, AF39/COUNTRY_INFO!G39*100))),\"-\"),0)","v":0},0,{"$f":"IF(AND(COUNTRY_INFO!K39>0,COUNTRY_INFO!K39<4), IF(AC39/Z39*100<>0, IF(AH39/Z39*100>100,100,AH39/Z39*100), \"-\"),0)","v":0},null,{"$f":"IF(AND(D39<>0, D39<>\"Inconnu\",D39<>\"Interrompu\",D39<>\"Non requis\"),D39/COUNTRY_INFO!D39, 0)","v":0},{"$f":"IF(AND(J39<>0,J39<>\"Inconnu\",J39<>\"Interrompu\",J39<>\"Non requis\"),J39/COUNTRY_INFO!D39, 0)","v":0},{"$f":"IF(AND(P39<>0,P39<>\"Inconnu\",P39<>\"Non requis\"),P39/(COUNTRY_INFO!E39+COUNTRY_INFO!F39), 0)","v":1},{"$f":"IF(AND(Z39<>0,Z39<>\"Inconnu\",Z39<>\"Non requis\"),IF(COUNTRY_INFO!K39=1,1,IF(COUNTRY_INFO!K39=2,0.5*COUNTRY_INFO!F39/(0.5*COUNTRY_INFO!F39+0.2*COUNTRY_INFO!G39),IF(COUNTRY_INFO!K39=3,COUNTRY_INFO!F39/(COUNTRY_INFO!F39+COUNTRY_INFO!G39)))),0)","v":0},{"$f":"IF(AND(Z39<>0,Z39<>\"Inconnu\",Z39<>\"Non requis\"),IF(COUNTRY_INFO!K39=1,0,IF(COUNTRY_INFO!K39=2,0.2*COUNTRY_INFO!G39/(0.5*COUNTRY_INFO!F39+0.2*COUNTRY_INFO!G39),IF(COUNTRY_INFO!K39=3,COUNTRY_INFO!G39/(COUNTRY_INFO!F39+COUNTRY_INFO!G39)))),0)","v":0},{"$f":"MAX(COUNTRY_INFO!D39*AK39*PROFILE!$G$7,COUNTRY_INFO!D39*AL39*PROFILE!$G$7)","v":0},{"$f":"MAX(COUNTRY_INFO!D39*AK39*PROFILE!$G$8,COUNTRY_INFO!D39*AL39*PROFILE!$G$8,COUNTRY_INFO!D39*AM39*PROFILE!$G$8)","v":2581.4397574581358},{"$f":"MAX(COUNTRY_INFO!D39*AK39*PROFILE!$G$9,COUNTRY_INFO!D39*AL39*PROFILE!$G$9,COUNTRY_INFO!D39*AM39*PROFILE!$G$9,IF(AND(DISTRICT!Z39<>\"Inconnu\",Z39<>\"Non requis\"),COUNTRY_INFO!P39*DISTRICT!AN39,0))","v":3872.1535726406046},{"$f":"MAX(COUNTRY_INFO!D39*AK39*PROFILE!$G$10,COUNTRY_INFO!D39*AL39*PROFILE!$G$10,IF(AND(DISTRICT!Z39<>\"Inconnu\",Z39<>\"Non requis\"),COUNTRY_INFO!P39*DISTRICT!AO39,0))","v":0},6453.5933300987399,0,{"$f":"MAX('MDA4'!R39,'T1'!L39,'T2'!J39,T3_R1!K39,T3_R2!K39)","v":0},{"$f":"MAX('MDA1'!K39,'MDA4'!S39,'MDA3'!I39,'MDA3'!L39,'T1'!M39,'T2'!K39,T3_R1!L39,T3_R2!L39)","v":0},{"$f":"MAX('MDA1'!L39,'MDA4'!T39,'MDA3'!J39,'MDA3'!M39,'T1'!N39,'T2'!L39,T3_R1!M39,T3_R2!M39)","v":0},0,{"$f":"MAX('MDA4'!R39,T39)","v":0},{"$f":"MAX('MDA1'!K39,'MDA4'!S39,'MDA3'!I39,'MDA3'!L39,V39,AD39)","v":0},{"$f":"MAX('MDA1'!L39,'MDA4'!T39,'MDA3'!J39,'MDA3'!M39,AF39)","v":0},0,0]
[{"$f":"IF(COUNTRY_INFO!A40=0,\" \",COUNTRY_INFO!A40)","v":" Congo"},{"$f":"IF(COUNTRY_INFO!B40=0,\" \",COUNTRY_INFO!B40)","v":"Niari"},{"$f":"IF(COUNTRY_INFO!C40=0,\" \",COUNTRY_INFO!C40)","v":"Mossendjo"},{"$f":"COUNTRY_INFO!M40","v":0},null,null,{"$f":"SUM('MDA1'!M40,'MDA4'!U40)","v":0},{"$f":"IF(AND(COUNTRY_INFO!H40>0,COUNTRY_INFO!H40<4),IF(D40>MAX('MDA1'!M40,'MDA4'!U40),MAX('MDA1'!M40,'MDA4'!U40),D40),0)","v":0},{"$f":"IF(AND(COUNTRY_INFO!H40>0,COUNTRY_INFO!H40<4), IF(G40/D40*100<>0, IF(G40/D40*100>100,100,G40/D40*100), \"-\"),0)","v":0},{"$f":"COUNTRY_INFO!N40","v":0},null,null,{"$f":"MAX('MDA1'!M40,MAX('MDA3'!I40,'MDA3'!L40)+MAX('MDA3'!J40,'MDA3'!M40))","v":0},{"$f":"IF(AND(COUNTRY_INFO!I40>0,COUNTRY_INFO!I40<4),IF(J40>MAX('MDA1'!M40,MAX('MDA3'!I40,'MDA3'!L40)+MAX('MDA3'!J40,'MDA3'!M40)),MAX('MDA1'!M40,MAX('MDA3'!I40,'MDA3'!L40)+MAX('MDA3'!J40,'MDA3'!M40)),J40),0)","v":0},{"$f":"IF(AND(COUNTRY_INFO!I40>0,COUNTRY_INFO!I40<4), IF(M40/J40*100<>0, IF(M40/J40*100>100,100,M40/J40*100), \"-\"),0)","v":0},{"$f":"COUNTRY_INFO!O40","v":18577},null,null,{"$f":"SUM(MAX('MDA4'!N40, 'T1'!L40, MAX(T3_R1!K40, T3_R2!K40)), MAX('MDA1'!K40, 'MDA4'!O40, 'T1'!M40, MAX(T3_R1!L40, T3_R2!L40)), MAX('MDA1'!L40, 'MDA4'!P40, 'T1'!N40, MAX(T3_R1!M40, T3_R2!M40)))","v":0},{"$f":"IF(AND(COUNTRY_INFO!J40>1,COUNTRY_INFO!J40<4),IF(COUNTRY_INFO!E40>MAX('MDA4'!N40,'T1'!L40,MAX(T3_R1!K40,T3_R2!K40)),MAX('MDA4'!N40,'T1'!L40,MAX(T3_R1!K40,T3_R2!K40)),COUNTRY_INFO!E40),0)","v":0},{"$f":"IF(AND(COUNTRY_INFO!J40>1,COUNTRY_INFO!J40<4), IF(T40/COUNTRY_INFO!E40*100<>0, IF(T40/COUNTRY_INFO!E40*100>100,100,T40/COUNTRY_INFO!E40*100), \"-\"),0)","v":"-"},{"$f":"IF(AND(COUNTRY_INFO!J40>1,COUNTRY_INFO!J40<4),IF(COUNTRY_INFO!F40>MAX('MDA1'!K40,'MDA4'!O40,'T1'!M40,MAX(T3_R1!L40,T3_R2!L40)),MAX('MDA1'!K40,'MDA4'!O40,'T1'!M40,MAX(T3_R1!L40,T3_R2!L40)),COUNTRY_INFO!F40),0)","v":0},{"$f":"IF(AND(COUNTRY_INFO!J40>1,COUNTRY_INFO!J40<4), IF(V40/COUNTRY_INFO!F40*100<>0, IF(V40/COUNTRY_INFO!F40*100>100,100,V40/COUNTRY_INFO!F40*100), \"-\"),0)","v":"-"},0,{"$f":"IF(AND(COUNTRY_INFO!J40>1,COUNTRY_INFO!J40<4), IF(S40/P40*100<>0, IF(X40/P40*100>100,100,X40/P40*100), \"-\"),0)","v":"-"},{"$f":"COUNTRY_INFO!P40","v":0},null,null,{"$f":"MAX('T1'!L40,'T2'!J40)+MAX('T1'!M40,'T2'!K40)+MAX('T1'!N40,'T2'!L40)","v":0},{"$f":"IF(COUNTRY_INFO!K40=1,IF(COUNTRY_INFO!F40*0.33>MAX('T1'!M40,'T2'!K40),MAX('T1'!M40,'T2'!K40),COUNTRY_INFO!F40*0.33),IF(COUNTRY_INFO!K40=2,IF(COUNTRY_INFO!F40*0.5>MAX('T1'!M40,'T2'!K40),MAX('T1'!M40,'T2'!K40),COUNTRY_INFO!F40*0.5),IF(COUNTRY_INFO!K40=3,IF(COUNTRY_INFO!F40>MAX('T1'!M40,'T2'!K40),MAX('T1'!M40,'T2'!K40),COUNTRY_INFO!F40),0)))","v":0},{"$f":"IF(AND(COUNTRY_INFO!K40>0,COUNTRY_INFO!K40<4),IF(Z40>0,IF(COUNTRY_INFO!K40=1, AD40/(COUNTRY_INFO!F40*0.33)*100, IF(COUNTRY_INFO!K40=2, AD40/(COUNTRY_INFO!F40*0.5)*100, IF(COUNTRY_INFO!K40=3, AD40/COUNTRY_INFO!F40*100))),\"-\"),0)","v":0},{"$f":"IF(COUNTRY_INFO!K40=2,IF(COUNTRY_INFO!G40*0.2>MAX('T1'!N40,'T2'!L40),MAX('T1'!N40,'T2'!L40),COUNTRY_INFO!G40*0.2),IF(COUNTRY_INFO!K40=3,IF(COUNTRY_INFO!G40>MAX('T1'!N40,'T2'!L40),MAX('T1'!N40,'T2'!L40),COUNTRY_INFO!G40),0))","v":0},{"$f":"IF(AND(COUNTRY_INFO!K40>0,COUNTRY_INFO!K40<4),IF(Z40>0,IF(COUNTRY_INFO!K40=1, 0, IF(COUNTRY_INFO!K40=2, AF40/(COUNTRY_INFO!G40*0.2)*100, IF(COUNTRY_INFO!K40=3, AF40/COUNTRY_INFO!G40*100))),\"-\"),0)","v":0},0,{"$f":"IF(AND(COUNTRY_INFO!K40>0,COUNTRY_INFO!K40<4), IF(AC40/Z40*100<>0, IF(AH40/Z40*100>100,100,AH40/Z40*100), \"-\"),0)","v":0},null,{"$f":"IF(AND(D40<>0, D40<>\"Inconnu\",D40<>\"Interrompu\",D40<>\"Non requis\"),D40/COUNTRY_INFO!D40, 0)","v":0},{"$f":"IF(AND(J40<>0,J40<>\"Inconnu\",J40<>\"Interrompu\",J40<>\"Non requis\"),J40/COUNTRY_INFO!D40, 0)","v":0},{"$f":"IF(AND(P40<>0,P40<>\"Inconnu\",P40<>\"Non requis\"),P40/(COUNTRY_INFO!E40+COUNTRY_INFO!F40), 0)","v":1},{"$f":"IF(AND(Z40<>0,Z40<>\"Inconnu\",Z40<>\"Non requis\"),IF(COUNTRY_INFO!K40=1,1,IF(COUNTRY_INFO!K40=2,0.5*COUNTRY_INFO!F40/(0.5*COUNTRY_INFO!F40+0.2*COUNTRY_INFO!G40),IF(COUNTRY_INFO!K40=3,COUNTRY_INFO!F40/(COUNTRY_INFO!F40+COUNTRY_INFO!G40)))),0)","v":0},{"$f":"IF(AND(Z40<>0,Z40<>\"Inconnu\",Z40<>\"Non requis\"),IF(COUNTRY_INFO!K40=1,0,IF(COUNTRY_INFO!K40=2,0.2*COUNTRY_INFO!G40/(0.5*COUNTRY_INFO!F40+0.2*COUNTRY_INFO!G40),IF(COUNTRY_INFO!K40=3,COUNTRY_INFO!G40/(COUNTRY_INFO!F40+COUNTRY_INFO!G40)))),0)","v":0},{"$f":"MAX(COUNTRY_INFO!D40*AK40*PROFILE!$G$7,COUNTRY_INFO!D40*AL40*PROFILE!$G$7)","v":0},{"$f":"MAX(COUNTRY_INFO!D40*AK40*PROFILE!$G$8,COUNTRY_INFO!D40*AL40*PROFILE!$G$8,COUNTRY_INFO!D40*AM40*PROFILE!$G$8)","v":7430.8793018239867},{"$f":"MAX(COUNTRY_INFO!D40*AK40*PROFILE!$G$9,COUNTRY_INFO!D40*AL40*PROFILE!$G$9,COUNTRY_INFO!D40*AM40*PROFILE!$G$9,IF(AND(DISTRICT!Z40<>\"Inconnu\",Z40<>\"Non requis\"),COUNTRY_INFO!P40*DISTRICT!AN40,0))","v":11146.301498335662},{"$f":"MAX(COUNTRY_INFO!D40*AK40*PROFILE!$G$10,COUNTRY_INFO!D40*AL40*PROFILE!$G$10,IF(AND(DISTRICT!Z40<>\"Inconnu\",Z40<>\"Non requis\"),COUNTRY_INFO!P40*DISTRICT!AO40,0))","v":0},18577.180800159651,0,{"$f":"MAX('MDA4'!R40,'T1'!L40,'T2'!J40,T3_R1!K40,T3_R2!K40)","v":0},{"$f":"MAX('MDA1'!K40,'MDA4'!S40,'MDA3'!I40,'MDA3'!L40,'T1'!M40,'T2'!K40,T3_R1!L40,T3_R2!L40)","v":0},{"$f":"MAX('MDA1'!L40,'MDA4'!T40,'MDA3'!J40,'MDA3'!M40,'T1'!N40,'T2'!L40,T3_R1!M40,T3_R2!M40)","v":0},0,{"$f":"MAX('MDA4'!R40,T40)","v":0},{"$f":"MAX('MDA1'!K40,'MDA4'!S40,'MDA3'!I40,'MDA3'!L40,V40,AD40)","v":0},{"$f":"MAX('MDA1'!L40,'MDA4'!T40,'MDA3'!J40,'MDA3'!M40,AF40)","v":0},0,0]
[{"$f":"IF(COUNTRY_INFO!A41=0,\" \",COUNTRY_INFO!A41)","v":" Congo"},{"$f":"IF(COUNTRY_INFO!B41=0,\" \",COUNTRY_INFO!B41)","v":"Plateaux"},{"$f":"IF(COUNTRY_INFO!C41=0,\" \",COUNTRY_INFO!C41)","v":"Abala"},{"$f":"COUNTRY_INFO!M41","v":0},null,null,{"$f":"SUM('MDA1'!M41,'MDA4'!U41)","v":0},{"$f":"IF(AND(COUNTRY_INFO!H41>0,COUNTRY_INFO!H41<4),IF(D41>MAX('MDA1'!M41,'MDA4'!U41),MAX('MDA1'!M41,'MDA4'!U41),D41),0)","v":0},{"$f":"IF(AND(COUNTRY_INFO!H41>0,COUNTRY_INFO!H41<4), IF(G41/D41*100<>0, IF(G41/D41*100>100,100,G41/D41*100), \"-\"),0)","v":0},{"$f":"COUNTRY_INFO!N41","v":0},null,null,{"$f":"MAX('MDA1'!M41,MAX('MDA3'!I41,'MDA3'!L41)+MAX('MDA3'!J41,'MDA3'!M41))","v":0},{"$f":"IF(AND(COUNTRY_INFO!I41>0,COUNTRY_INFO!I41<4),IF(J41>MAX('MDA1'!M41,MAX('MDA3'!I41,'MDA3'!L41)+MAX('MDA3'!J41,'MDA3'!M41)),MAX('MDA1'!M41,MAX('MDA3'!I41,'MDA3'!L41)+MAX('MDA3'!J41,'MDA3'!M41)),J41),0)","v":0},{"$f":"IF(AND(COUNTRY_INFO!I41>0,COUNTRY_INFO!I41<4), IF(M41/J41*100<>0, IF(M41/J41*100>100,100,M41/J41*100), \"-\"),0)","v":0},{"$f":"COUNTRY_INFO!O41","v":0},null,null,{"$f":"SUM(MAX('MDA4'!N41, 'T1'!L41, MAX(T3_R1!K41, T3_R2!K41)), MAX('MDA1'!K41, 'MDA4'!O41, 'T1'!M41, MAX(T3_R1!L41, T3_R2!L41)), MAX('MDA1'!L41, 'MDA4'!P41, 'T1'!N41, MAX(T3_R1!M41, T3_R2!M41)))","v":0},{"$f":"IF(AND(COUNTRY_INFO!J41>1,COUNTRY_INFO!J41<4),IF(COUNTRY_INFO!E41>MAX('MDA4'!N41,'T1'!L41,MAX(T3_R1!K41,T3_R2!K41)),MAX('MDA4'!N41,'T1'!L41,MAX(T3_R1!K41,T3_R2!K41)),COUNTRY_INFO!E41),0)","v":0},{"$f":"IF(AND(COUNTRY_INFO!J41>1,COUNTRY_INFO!J41<4), IF(T41/COUNTRY_INFO!E41*100<>0, IF(T41/COUNTRY_INFO!E41*100>100,100,T41/COUNTRY_INFO!E41*100), \"-\"),0)","v":0},{"$f":"IF(AND(COUNTRY_INFO!J41>1,COUNTRY_INFO!J41<4),IF(COUNTRY_INFO!F41>MAX('MDA1'!K41,'MDA4'!O41,'T1'!M41,MAX(T3_R1!L41,T3_R2!L41)),MAX('MDA1'!K41,'MDA4'!O41,'T1'!M41,MAX(T3_R1!L41,T3_R2!L41)),COUNTRY_INFO!F41),0)","v":0},{"$f":"IF(AND(COUNTRY_INFO!J41>1,COUNTRY_INFO!J41<4), IF(V41/COUNTRY_INFO!F41*100<>0, IF(V41/COUNTRY_INFO!F41*100>100,100,V41/COUNTRY_INFO!F41*100), \"-\"),0)","v":0},0,{"$f":"IF(AND(COUNTRY_INFO!J41>1,COUNTRY_INFO!J41<4), IF(S41/P41*100<>0, IF(X41/P41*100>100,100,X41/P41*100), \"-\"),0)","v":0},{"$f":"COUNTRY_INFO!P41","v":0},null,null,{"$f":"MAX('T1'!L41,'T2'!J41)+MAX('T1'!M41,'T2'!K41)+MAX('T1'!N41,'T2'!L41)","v":0},{"$f":"IF(COUNTRY_INFO!K41=1,IF(COUNTRY_INFO!F41*0.33>MAX('T1'!M41,'T2'!K41),MAX('T1'!M41,'T2'!K41),COUNTRY_INFO!F41*0.33),IF(COUNTRY_INFO!K41=2,IF(COUNTRY_INFO!F41*0.5>MAX('T1'!M41,'T2'!K41),MAX('T1'!M41,'T2'!K41),COUNTRY_INFO!F41*0.5),IF(COUNTRY_INFO!K41=3,IF(COUNTRY_INFO!F41>MAX('T1'!M41,'T2'!K41),MAX('T1'!M41,'T2'!K41),COUNTRY_INFO!F41),0)))","v":0},{"$f":"IF(AND(COUNTRY_INFO!K41>0,COUNTRY_INFO!K41<4),IF(Z41>0,IF(COUNTRY_INFO!K41=1, AD41/(COUNTRY_INFO!F41*0.33)*100, IF(COUNTRY_INFO!K41=2, AD41/(COUNTRY_INFO!F41*0.5)*100, IF(COUNTRY_INFO!K41=3, AD41/COUNTRY_INFO!F41*100))),\"-\"),0)","v":0},{"$f":"IF(COUNTRY_INFO!K41=2,IF(COUNTRY_INFO!G41*0.2>MAX('T1'!N41,'T2'!L41),MAX('T1'!N41,'T2'!L41),COUNTRY_INFO!G41*0.2),IF(COUNTRY_INFO!K41=3,IF(COUNTRY_INFO!G41>MAX('T1'!N41,'T2'!L41),MAX('T1'!N41,'T2'!L41),COUNTRY_INFO!G41),0))","v":0},{"$f":"IF(AND(COUNTRY_INFO!K41>0,COUNTRY_INFO!K41<4),IF(Z41>0,IF(COUNTRY_INFO!K41=1, 0, IF(COUNTRY_INFO!K41=2, AF41/(COUNTRY_INFO!G41*0.2)*100, IF(COUNTRY_INFO!K41=3, AF41/COUNTRY_INFO!G41*100))),\"-\"),0)","v":0},0,{"$f":"IF(AND(COUNTRY_INFO!K41>0,COUNTRY_INFO!K41<4), IF(AC41/Z41*100<>0, IF(AH41/Z41*100>100,100,AH41/Z41*100), \"-\"),0)","v":0},null,{"$f":"IF(AND(D41<>0, D41<>\"Inconnu\",D41<>\"Interrompu\",D41<>\"Non requis\"),D41/COUNTRY_INFO!D41, 0)","v":0},{"$f":"IF(AND(J41<>0,J41<>\"Inconnu\",J41<>\"Interrompu\",J41<>\"Non requis\"),J41/COUNTRY_INFO!D41, 0)","v":0},{"$f":"IF(AND(P41<>0,P41<>\"Inconnu\",P41<>\"Non requis\"),P41/(COUNTRY_INFO!E41+COUNTRY_INFO!F41), 0)","v":0},{"$f":"IF(AND(Z41<>0,Z41<>\"Inconnu\",Z41<>\"Non requis\"),IF(COUNTRY_INFO!K41=1,1,IF(COUNTRY_INFO!K41=2,0.5*COUNTRY_INFO!F41/(0.5*COUNTRY_INFO!F41+0.2*COUNTRY_INFO!G41),IF(COUNTRY_INFO!K41=3,COUNTRY_INFO!F41/(COUNTRY_INFO!F41+COUNTRY_INFO!G41)))),0)","v":0},{"$f":"IF(AND(Z41<>0,Z41<>\"Inconnu\",Z41<>\"Non requis\"),IF(COUNTRY_INFO!K41=1,0,IF(COUNTRY_INFO!K41=2,0.2*COUNTRY_INFO!G41/(0.5*COUNTRY_INFO!F41+0.2*COUNTRY_INFO!G41),IF(COUNTRY_INFO!K41=3,COUNTRY_INFO!G41/(COUNTRY_INFO!F41+COUNTRY_INFO!G41)))),0)","v":0},{"$f":"MAX(COUNTRY_INFO!D41*AK41*PROFILE!$G$7,COUNTRY_INFO!D41*AL41*PROFILE!$G$7)","v":0},{"$f":"MAX(COUNTRY_INFO!D41*AK41*PROFILE!$G$8,COUNTRY_INFO!D41*AL41*PROFILE!$G$8,COUNTRY_INFO!D41*AM41*PROFILE!$G$8)","v":0},{"$f":"MAX(COUNTRY_INFO!D41*AK41*PROFILE!$G$9,COUNTRY_INFO!D41*AL41*PROFILE!$G$9,COUNTRY_INFO!D41*AM41*PROFILE!$G$9,IF(AND(DISTRICT!Z41<>\"Inconnu\",Z41<>\"Non requis\"),COUNTRY_INFO!P41*DISTRICT!AN41,0))","v":0},{"$f":"MAX(COUNTRY_INFO!D41*AK41*PROFILE!$G$10,COUNTRY_INFO!D41*AL41*PROFILE!$G$10,IF(AND(DISTRICT!Z41<>\"Inconnu\",Z41<>\"Non requis\"),COUNTRY_INFO!P41*DISTRICT!AO41,0))","v":0},0,0,{"$f":"MAX('MDA4'!R41,'T1'!L41,'T2'!J41,T3_R1!K41,T3_R2!K41)","v":0},{"$f":"MAX('MDA1'!K41,'MDA4'!S41,'MDA3'!I41,'MDA3'!L41,'T1'!M41,'T2'!K41,T3_R1!L41,T3_R2!L41)","v":0},{"$f":"MAX('MDA1'!L41,'MDA4'!T41,'MDA3'!J41,'MDA3'!M41,'T1'!N41,'T2'!L41,T3_R1!M41,T3_R2!M41)","v":0},0,{"$f":"MAX('MDA4'!R41,T41)","v":0},{"$f":"MAX('MDA1'!K41,'MDA4'!S41,'MDA3'!I41,'MDA3'!L41,V41,AD41)","v":0},{"$f":"MAX('MDA1'!L41,'MDA4'!T41,'MDA3'!J41,'MDA3'!M41,AF41)","v":0},0,0]
[{"$f":"IF(COUNTRY_INFO!A42=0,\" \",COUNTRY_INFO!A42)","v":" Congo"},{"$f":"IF(COUNTRY_INFO!B42=0,\" \",COUNTRY_INFO!B42)","v":"Plateaux"},{"$f":"IF(COUNTRY_INFO!C42=0,\" \",COUNTRY_INFO!C42)","v":"Djambala-Lékana"},{"$f":"COUNTRY_INFO!M42","v":0},null,null,{"$f":"SUM('MDA1'!M42,'MDA4'!U42)","v":0},{"$f":"IF(AND(COUNTRY_INFO!H42>0,COUNTRY_INFO!H42<4),IF(D42>MAX('MDA1'!M42,'MDA4'!U42),MAX('MDA1'!M42,'MDA4'!U42),D42),0)","v":0},{"$f":"IF(AND(COUNTRY_INFO!H42>0,COUNTRY_INFO!H42<4), IF(G42/D42*100<>0, IF(G42/D42*100>100,100,G42/D42*100), \"-\"),0)","v":0},{"$f":"COUNTRY_INFO!N42","v":0},null,null,{"$f":"MAX('MDA1'!M42,MAX('MDA3'!I42,'MDA3'!L42)+MAX('MDA3'!J42,'MDA3'!M42))","v":0},{"$f":"IF(AND(COUNTRY_INFO!I42>0,COUNTRY_INFO!I42<4),IF(J42>MAX('MDA1'!M42,MAX('MDA3'!I42,'MDA3'!L42)+MAX('MDA3'!J42,'MDA3'!M42)),MAX('MDA1'!M42,MAX('MDA3'!I42,'MDA3'!L42)+MAX('MDA3'!J42,'MDA3'!M42)),J42),0)","v":0},{"$f":"IF(AND(COUNTRY_INFO!I42>0,COUNTRY_INFO!I42<4), IF(M42/J42*100<>0, IF(M42/J42*100>100,100,M42/J42*100), \"-\"),0)","v":0},{"$f":"COUNTRY_INFO!O42","v":19350},null,null,{"$f":"SUM(MAX('MDA4'!N42, 'T1'!L42, MAX(T3_R1!K42, T3_R2!K42)), MAX('MDA1'!K42, 'MDA4'!O42, 'T1'!M42, MAX(T3_R1!L42, T3_R2!L42)), MAX('MDA1'!L42, 'MDA4'!P42, 'T1'!N42, MAX(T3_R1!M42, T3_R2!M42)))","v":0},{"$f":"IF(AND(COUNTRY_INFO!J42>1,COUNTRY_INFO!J42<4),IF(COUNTRY_INFO!E42>MAX('MDA4'!N42,'T1'!L42,MAX(T3_R1!K42,T3_R2!K42)),MAX('MDA4'!N42,'T1'!L42,MAX(T3_R1!K42,T3_R2!K42)),COUNTRY_INFO!E42),0)","v":0},{"$f":"IF(AND(COUNTRY_INFO!J42>1,COUNTRY_INFO!J42<4), IF(T42/COUNTRY_INFO!E42*100<>0, IF(T42/COUNTRY_INFO!E42*100>100,100,T42/COUNTRY_INFO!E42*100), \"-\"),0)","v":"-"},{"$f":"IF(AND(COUNTRY_INFO!J42>1,COUNTRY_INFO!J42<4),IF(COUNTRY_INFO!F42>MAX('MDA1'!K42,'MDA4'!O42,'T1'!M42,MAX(T3_R1!L42,T3_R2!L42)),MAX('MDA1'!K42,'MDA4'!O42,'T1'!M42,MAX(T3_R1!L42,T3_R2!L42)),COUNTRY_INFO!F42),0)","v":0},{"$f":"IF(AND(COUNTRY_INFO!J42>1,COUNTRY_INFO!J42<4), IF(V42/COUNTRY_INFO!F42*100<>0, IF(V42/COUNTRY_INFO!F42*100>100,100,V42/COUNTRY_INFO!F42*100), \"-\"),0)","v":"-"},0,{"$f":"IF(AND(COUNTRY_INFO!J42>1,COUNTRY_INFO!J42<4), IF(S42/P42*100<>0, IF(X42/P42*100>100,100,X42/P42*100), \"-\"),0)","v":"-"},{"$f":"COUNTRY_INFO!P42","v":0},null,null,{"$f":"MAX('T1'!L42,'T2'!J42)+MAX('T1'!M42,'T2'!K42)+MAX('T1'!N42,'T2'!L42)","v":0},{"$f":"IF(COUNTRY_INFO!K42=1,IF(COUNTRY_INFO!F42*0.33>MAX('T1'!M42,'T2'!K42),MAX('T1'!M42,'T2'!K42),COUNTRY_INFO!F42*0.33),IF(COUNTRY_INFO!K42=2,IF(COUNTRY_INFO!F42*0.5>MAX('T1'!M42,'T2'!K42),MAX('T1'!M42,'T2'!K42),COUNTRY_INFO!F42*0.5),IF(COUNTRY_INFO!K42=3,IF(COUNTRY_INFO!F42>MAX('T1'!M42,'T2'!K42),MAX('T1'!M42,'T2'!K42),COUNTRY_INFO!F42),0)))","v":0},{"$f":"IF(AND(COUNTRY_INFO!K42>0,COUNTRY_INFO!K42<4),IF(Z42>0,IF(COUNTRY_INFO!K42=1, AD42/(COUNTRY_INFO!F42*0.33)*100, IF(COUNTRY_INFO!K42=2, AD42/(COUNTRY_INFO!F42*0.5)*100, IF(COUNTRY_INFO!K42=3, AD42/COUNTRY_INFO!F42*100))),\"-\"),0)","v":0},{"$f":"IF(COUNTRY_INFO!K42=2,IF(COUNTRY_INFO!G42*0.2>MAX('T1'!N42,'T2'!L42),MAX('T1'!N42,'T2'!L42),COUNTRY_INFO!G42*0.2),IF(COUNTRY_INFO!K42=3,IF(COUNTRY_INFO!G42>MAX('T1'!N42,'T2'!L42),MAX('T1'!N42,'T2'!L42),COUNTRY_INFO!G42),0))","v":0},{"$f":"IF(AND(COUNTRY_INFO!K42>0,COUNTRY_INFO!K42<4),IF(Z42>0,IF(COUNTRY_INFO!K42=1, 0, IF(COUNTRY_INFO!K42=2, AF42/(COUNTRY_INFO!G42*0.2)*100, IF(COUNTRY_INFO!K42=3, AF42/COUNTRY_INFO!G42*100))),\"-\"),0)","v":0},0,{"$f":"IF(AND(COUNTRY_INFO!K42>0,COUNTRY_INFO!K42<4), IF(AC42/Z42*100<>0, IF(AH42/Z42*100>100,100,AH42/Z42*100), \"-\"),0)","v":0},null,{"$f":"IF(AND(D42<>0, D42<>\"Inconnu\",D42<>\"Interrompu\",D42<>\"Non requis\"),D42/COUNTRY_INFO!D42, 0)","v":0},{"$f":"IF(AND(J42<>0,J42<>\"Inconnu\",J42<>\"Interrompu\",J42<>\"Non requis\"),J42/COUNTRY_INFO!D42, 0)","v":0},{"$f":"IF(AND(P42<>0,P42<>\"Inconnu\",P42<>\"Non requis\"),P42/(COUNTRY_INFO!E42+COUNTRY_INFO!F42), 0)","v":1},{"$f":"IF(AND(Z42<>0,Z42<>\"Inconnu\",Z42<>\"Non requis\"),IF(COUNTRY_INFO!K42=1,1,IF(COUNTRY_INFO!K42=2,0.5*COUNTRY_INFO!F42/(0.5*COUNTRY_INFO!F42+0.2*COUNTRY_INFO!G42),IF(COUNTRY_INFO!K42=3,COUNTRY_INFO!F42/(COUNTRY_INFO!F42+COUNTRY_INFO!G42)))),0)","v":0},{"$f":"IF(AND(Z42<>0,Z42<>\"Inconnu\",Z42<>\"Non requis\"),IF(COUNTRY_INFO!K42=1,0,IF(COUNTRY_INFO!K42=2,0.2*COUNTRY_INFO!G42/(0.5*COUNTRY_INFO!F42+0.2*COUNTRY_INFO!G42),IF(COUNTRY_INFO!K42=3,COUNTRY_INFO!G42/(COUNTRY_INFO!F42+COUNTRY_INFO!G42)))),0)","v":0},{"$f":"MAX(COUNTRY_INFO!D42*AK42*PROFILE!$G$7,COUNTRY_INFO!D42*AL42*PROFILE!$G$7)","v":0},{"$f":"MAX(COUNTRY_INFO!D42*AK42*PROFILE!$G$8,COUNTRY_INFO!D42*AL42*PROFILE!$G$8,COUNTRY_INFO!D42*AM42*PROFILE!$G$8)","v":7740.1592727652642},{"$f":"MAX(COUNTRY_INFO!D42*AK42*PROFILE!$G$9,COUNTRY_INFO!D42*AL42*PROFILE!$G$9,COUNTRY_INFO!D42*AM42*PROFILE!$G$9,IF(AND(DISTRICT!Z42<>\"Inconnu\",Z42<>\"Non requis\"),COUNTRY_INFO!P42*DISTRICT!AN42,0))","v":11610.220728279526},{"$f":"MAX(COUNTRY_INFO!D42*AK42*PROFILE!$G$10,COUNTRY_INFO!D42*AL42*PROFILE!$G$10,IF(AND(DISTRICT!Z42<>\"Inconnu\",Z42<>\"Non requis\"),COUNTRY_INFO!P42*DISTRICT!AO42,0))","v":0},19350.380001044789,0,{"$f":"MAX('MDA4'!R42,'T1'!L42,'T2'!J42,T3_R1!K42,T3_R2!K42)","v":0},{"$f":"MAX('MDA1'!K42,'MDA4'!S42,'MDA3'!I42,'MDA3'!L42,'T1'!M42,'T2'!K42,T3_R1!L42,T3_R2!L42)","v":0},{"$f":"MAX('MDA1'!L42,'MDA4'!T42,'MDA3'!J42,'MDA3'!M42,'T1'!N42,'T2'!L42,T3_R1!M42,T3_R2!M42)","v":0},0,{"$f":"MAX('MDA4'!R42,T42)","v":0},{"$f":"MAX('MDA1'!K42,'MDA4'!S42,'MDA3'!I42,'MDA3'!L42,V42,AD42)","v":0},{"$f":"MAX('MDA1'!L42,'MDA4'!T42,'MDA3'!J42,'MDA3'!M42,AF42)","v":0},0,0]
[{"$f":"IF(COUNTRY_INFO!A43=0,\" \",COUNTRY_INFO!A43)","v":" Congo"},{"$f":"IF(COUNTRY_INFO!B43=0,\" \",COUNTRY_INFO!B43)","v":"Plateaux"},{"$f":"IF(COUNTRY_INFO!C43=0,\" \",COUNTRY_INFO!C43)","v":"Gamboma"},{"$f":"COUNTRY_INFO!M43","v":0},null,null,{"$f":"SUM('MDA1'!M43,'MDA4'!U43)","v":0},{"$f":"IF(AND(COUNTRY_INFO!H43>0,COUNTRY_INFO!H43<4),IF(D43>MAX('MDA1'!M43,'MDA4'!U43),MAX('MDA1'!M43,'MDA4'!U43),D43),0)","v":0},{"$f":"IF(AND(COUNTRY_INFO!H43>0,COUNTRY_INFO!H43<4), IF(G43/D43*100<>0, IF(G43/D43*100>100,100,G43/D43*100), \"-\"),0)","v":0},{"$f":"COUNTRY_INFO!N43","v":0},null,null,{"$f":"MAX('MDA1'!M43,MAX('MDA3'!I43,'MDA3'!L43)+MAX('MDA3'!J43,'MDA3'!M43))","v":0},{"$f":"IF(AND(COUNTRY_INFO!I43>0,COUNTRY_INFO!I43<4),IF(J43>MAX('MDA1'!M43,MAX('MDA3'!I43,'MDA3'!L43)+MAX('MDA3'!J43,'MDA3'!M43)),MAX('MDA1'!M43,MAX('MDA3'!I43,'MDA3'!L43)+MAX('MDA3'!J43,'MDA3'!M43)),J43),0)","v":0},{"$f":"IF(AND(COUNTRY_INFO!I43>0,COUNTRY_INFO!I43<4), IF(M43/J43*100<>0, IF(M43/J43*100>100,100,M43/J43*100), \"-\"),0)","v":0},{"$f":"COUNTRY_INFO!O43","v":39948},null,null,{"$f":"SUM(MAX('MDA4'!N43, 'T1'!L43, MAX(T3_R1!K43, T3_R2!K43)), MAX('MDA1'!K43, 'MDA4'!O43, 'T1'!M43, MAX(T3_R1!L43, T3_R2!L43)), MAX('MDA1'!L43, 'MDA4'!P43, 'T1'!N43, MAX(T3_R1!M43, T3_R2!M43)))","v":0},{"$f":"IF(AND(COUNTRY_INFO!J43>1,COUNTRY_INFO!J43<4),IF(COUNTRY_INFO!E43>MAX('MDA4'!N43,'T1'!L43,MAX(T3_R1!K43,T3_R2!K43)),MAX('MDA4'!N43,'T1'!L43,MAX(T3_R1!K43,T3_R2!K43)),COUNTRY_INFO!E43),0)","v":0},{"$f":"IF(AND(COUNTRY_INFO!J43>1,COUNTRY_INFO!J43<4), IF(T43/COUNTRY_INFO!E43*100<>0, IF(T43/COUNTRY_INFO!E43*100>100,100,T43/COUNTRY_INFO!E43*100), \"-\"),0)","v":"-"},{"$f":"IF(AND(COUNTRY_INFO!J43>1,COUNTRY_INFO!J43<4),IF(COUNTRY_INFO!F43>MAX('MDA1'!K43,'MDA4'!O43,'T1'!M43,MAX(T3_R1!L43,T3_R2!L43)),MAX('MDA1'!K43,'MDA4'!O43,'T1'!M43,MAX(T3_R1!L43,T3_R2!L43)),COUNTRY_INFO!F43),0)","v":0},{"$f":"IF(AND(COUNTRY_INFO!J43>1,COUNTRY_INFO!J43<4), IF(V43/COUNTRY_INFO!F43*100<>0, IF(V43/COUNTRY_INFO!F43*100>100,100,V43/COUNTRY_INFO!F43*100), \"-\"),0)","v":"-"},0,{"$f":"IF(AND(COUNTRY_INFO!J43>1,COUNTRY_INFO!J43<4), IF(S43/P43*100<>0, IF(X43/P43*100>100,100,X43/P43*100), \"-\"),0)","v":"-"},{"$f":"COUNTRY_INFO!P43","v":0},null,null,{"$f":"MAX('T1'!L43,'T2'!J43)+MAX('T1'!M43,'T2'!K43)+MAX('T1'!N43,'T2'!L43)","v":0},{"$f":"IF(COUNTRY_INFO!K43=1,IF(COUNTRY_INFO!F43*0.33>MAX('T1'!M43,'T2'!K43),MAX('T1'!M43,'T2'!K43),COUNTRY_INFO!F43*0.33),IF(COUNTRY_INFO!K43=2,IF(COUNTRY_INFO!F43*0.5>MAX('T1'!M43,'T2'!K43),MAX('T1'!M43,'T2'!K43),COUNTRY_INFO!F43*0.5),IF(COUNTRY_INFO!K43=3,IF(COUNTRY_INFO!F43>MAX('T1'!M43,'T2'!K43),MAX('T1'!M43,'T2'!K43),COUNTRY_INFO!F43),0)))","v":0},{"$f":"IF(AND(COUNTRY_INFO!K43>0,COUNTRY_INFO!K43<4),IF(Z43>0,IF(COUNTRY_INFO!K43=1, AD43/(COUNTRY_INFO!F43*0.33)*100, IF(COUNTRY_INFO!K43=2, AD43/(COUNTRY_INFO!F43*0.5)*100, IF(COUNTRY_INFO!K43=3, AD43/COUNTRY_INFO!F43*100))),\"-\"),0)","v":0},{"$f":"IF(COUNTRY_INFO!K43=2,IF(COUNTRY_INFO!G43*0.2>MAX('T1'!N43,'T2'!L43),MAX('T1'!N43,'T2'!L43),COUNTRY_INFO!G43*0.2),IF(COUNTRY_INFO!K43=3,IF(COUNTRY_INFO!G43>MAX('T1'!N43,'T2'!L43),MAX('T1'!N43,'T2'!L43),COUNTRY_INFO!G43),0))","v":0},{"$f":"IF(AND(COUNTRY_INFO!K43>0,COUNTRY_INFO!K43<4),IF(Z43>0,IF(COUNTRY_INFO!K43=1, 0, IF(COUNTRY_INFO!K43=2, AF43/(COUNTRY_INFO!G43*0.2)*100, IF(COUNTRY_INFO!K43=3, AF43/COUNTRY_INFO!G43*100))),\"-\"),0)","v":0},0,{"$f":"IF(AND(COUNTRY_INFO!K43>0,COUNTRY_INFO!K43<4), IF(AC43/Z43*100<>0, IF(AH43/Z43*100>100,100,AH43/Z43*100), \"-\"),0)","v":0},null,{"$f":"IF(AND(D43<>0, D43<>\"Inconnu\",D43<>\"Interrompu\",D43<>\"Non requis\"),D43/COUNTRY_INFO!D43, 0)","v":0},{"$f":"IF(AND(J43<>0,J43<>\"Inconnu\",J43<>\"Interrompu\",J43<>\"Non requis\"),J43/COUNTRY_INFO!D43, 0)","v":0},{"$f":"IF(AND(P43<>0,P43<>\"Inconnu\",P43<>\"Non requis\"),P43/(COUNTRY_INFO!E43+COUNTRY_INFO!F43), 0)","v":1},{"$f":"IF(AND(Z43<>0,Z43<>\"Inconnu\",Z43<>\"Non requis\"),IF(COUNTRY_INFO!K43=1,1,IF(COUNTRY_INFO!K43=2,0.5*COUNTRY_INFO!F43/(0.5*COUNTRY_INFO!F43+0.2*COUNTRY_INFO!G43),IF(COUNTRY_INFO!K43=3,COUNTRY_INFO!F43/(COUNTRY_INFO!F43+COUNTRY_INFO!G43)))),0)","v":0},{"$f":"IF(AND(Z43<>0,Z43<>\"Inconnu\",Z43<>\"Non requis\"),IF(COUNTRY_INFO!K43=1,0,IF(COUNTRY_INFO!K43=2,0.2*COUNTRY_INFO!G43/(0.5*COUNTRY_INFO!F43+0.2*COUNTRY_INFO!G43),IF(COUNTRY_INFO!K43=3,COUNTRY_INFO!G43/(COUNTRY_INFO!F43+COUNTRY_INFO!G43)))),0)","v":0},{"$f":"MAX(COUNTRY_INFO!D43*AK43*PROFILE!$G$7,COUNTRY_INFO!D43*AL43*PROFILE!$G$7)","v":0},{"$f":"MAX(COUNTRY_INFO!D43*AK43*PROFILE!$G$8,COUNTRY_INFO!D43*AL43*PROFILE!$G$8,COUNTRY_INFO!D43*AM43*PROFILE!$G$8)","v":15979.198498657743},{"$f":"MAX(COUNTRY_INFO!D43*AK43*PROFILE!$G$9,COUNTRY_INFO!D43*AL43*PROFILE!$G$9,COUNTRY_INFO!D43*AM43*PROFILE!$G$9,IF(AND(DISTRICT!Z43<>\"Inconnu\",Z43<>\"Non requis\"),COUNTRY_INFO!P43*DISTRICT!AN43,0))","v":23968.760214430218},{"$f":"MAX(COUNTRY_INFO!D43*AK43*PROFILE!$G$10,COUNTRY_INFO!D43*AL43*PROFILE!$G$10,IF(AND(DISTRICT!Z43<>\"Inconnu\",Z43<>\"Non requis\"),COUNTRY_INFO!P43*DISTRICT!AO43,0))","v":0},39947.958713087959,0,{"$f":"MAX('MDA4'!R43,'T1'!L43,'T2'!J43,T3_R1!K43,T3_R2!K43)","v":0},{"$f":"MAX('MDA1'!K43,'MDA4'!S43,'MDA3'!I43,'MDA3'!L43,'T1'!M43,'T2'!K43,T3_R1!L43,T3_R2!L43)","v":0},{"$f":"MAX('MDA1'!L43,'MDA4'!T43,'MDA3'!J43,'MDA3'!M43,'T1'!N43,'T2'!L43,T3_R1!M43,T3_R2!M43)","v":0},0,{"$f":"MAX('MDA4'!R43,T43)","v":0},{"$f":"MAX('MDA1'!K43,'MDA4'!S43,'MDA3'!I43,'MDA3'!L43,V43,AD43)","v":0},{"$f":"MAX('MDA1'!L43,'MDA4'!T43,'MDA3'!J43,'MDA3'!M43,AF43)","v":0},0,0]
[{"$f":"IF(COUNTRY_INFO!A44=0,\" \",COUNTRY_INFO!A44)","v":" Congo"},{"$f":"IF(COUNTRY_INFO!B44=0,\" \",COUNTRY_INFO!B44)","v":"Plateaux"},{"$f":"IF(COUNTRY_INFO!C44=0,\" \",COUNTRY_INFO!C44)","v":"Ngo Mpouya"},{"$f":"COUNTRY_INFO!M44","v":0},null,null,{"$f":"SUM('MDA1'!M44,'MDA4'!U44)","v":0},{"$f":"IF(AND(COUNTRY_INFO!H44>0,COUNTRY_INFO!H44<4),IF(D44>MAX('MDA1'!M44,'MDA4'!U44),MAX('MDA1'!M44,'MDA4'!U44),D44),0)","v":0},{"$f":"IF(AND(COUNTRY_INFO!H44>0,COUNTRY_INFO!H44<4), IF(G44/D44*100<>0, IF(G44/D44*100>100,100,G44/D44*100), \"-\"),0)","v":0},{"$f":"COUNTRY_INFO!N44","v":0},null,null,{"$f":"MAX('MDA1'!M44,MAX('MDA3'!I44,'MDA3'!L44)+MAX('MDA3'!J44,'MDA3'!M44))","v":0},{"$f":"IF(AND(COUNTRY_INFO!I44>0,COUNTRY_INFO!I44<4),IF(J44>MAX('MDA1'!M44,MAX('MDA3'!I44,'MDA3'!L44)+MAX('MDA3'!J44,'MDA3'!M44)),MAX('MDA1'!M44,MAX('MDA3'!I44,'MDA3'!L44)+MAX('MDA3'!J44,'MDA3'!M44)),J44),0)","v":0},{"$f":"IF(AND(COUNTRY_INFO!I44>0,COUNTRY_INFO!I44<4), IF(M44/J44*100<>0, IF(M44/J44*100>100,100,M44/J44*100), \"-\"),0)","v":0},{"$f":"COUNTRY_INFO!O44","v":14715},null,null,{"$f":"SUM(MAX('MDA4'!N44, 'T1'!L44, MAX(T3_R1!K44, T3_R2!K44)), MAX('MDA1'!K44, 'MDA4'!O44, 'T1'!M44, MAX(T3_R1!L44, T3_R2!L44)), MAX('MDA1'!L44, 'MDA4'!P44, 'T1'!N44, MAX(T3_R1!M44, T3_R2!M44)))","v":0},{"$f":"IF(AND(COUNTRY_INFO!J44>1,COUNTRY_INFO!J44<4),IF(COUNTRY_INFO!E44>MAX('MDA4'!N44,'T1'!L44,MAX(T3_R1!K44,T3_R2!K44)),MAX('MDA4'!N44,'T1'!L44,MAX(T3_R1!K44,T3_R2!K44)),COUNTRY_INFO!E44),0)","v":0},{"$f":"IF(AND(COUNTRY_INFO!J44>1,COUNTRY_INFO!J44<4), IF(T44/COUNTRY_INFO!E44*100<>0, IF(T44/COUNTRY_INFO!E44*100>100,100,T44/COUNTRY_INFO!E44*100), \"-\"),0)","v":"-"},{"$f":"IF(AND(COUNTRY_INFO!J44>1,COUNTRY_INFO!J44<4),IF(COUNTRY_INFO!F44>MAX('MDA1'!K44,'MDA4'!O44,'T1'!M44,MAX(T3_R1!L44,T3_R2!L44)),MAX('MDA1'!K44,'MDA4'!O44,'T1'!M44,MAX(T3_R1!L44,T3_R2!L44)),COUNTRY_INFO!F44),0)","v":0},{"$f":"IF(AND(COUNTRY_INFO!J44>1,COUNTRY_INFO!J44<4), IF(V44/COUNTRY_INFO!F44*100<>0, IF(V44/COUNTRY_INFO!F44*100>100,100,V44/COUNTRY_INFO!F44*100), \"-\"),0)","v":"-"},0,{"$f":"IF(AND(COUNTRY_INFO!J44>1,COUNTRY_INFO!J44<4), IF(S44/P44*100<>0, IF(X44/P44*100>100,100,X44/P44*100), \"-\"),0)","v":"-"},{"$f":"COUNTRY_INFO!P44","v":0},null,null,{"$f":"MAX('T1'!L44,'T2'!J44)+MAX('T1'!M44,'T2'!K44)+MAX('T1'!N44,'T2'!L44)","v":0},{"$f":"IF(COUNTRY_INFO!K44=1,IF(COUNTRY_INFO!F44*0.33>MAX('T1'!M44,'T2'!K44),MAX('T1'!M44,'T2'!K44),COUNTRY_INFO!F44*0.33),IF(COUNTRY_INFO!K44=2,IF(COUNTRY_INFO!F44*0.5>MAX('T1'!M44,'T2'!K44),MAX('T1'!M44,'T2'!K44),COUNTRY_INFO!F44*0.5),IF(COUNTRY_INFO!K44=3,IF(COUNTRY_INFO!F44>MAX('T1'!M44,'T2'!K44),MAX('T1'!M44,'T2'!K44),COUNTRY_INFO!F44),0)))","v":0},{"$f":"IF(AND(COUNTRY_INFO!K44>0,COUNTRY_INFO!K44<4),IF(Z44>0,IF(COUNTRY_INFO!K44=1, AD44/(COUNTRY_INFO!F44*0.33)*100, IF(COUNTRY_INFO!K44=2, AD44/(COUNTRY_INFO!F44*0.5)*100, IF(COUNTRY_INFO!K44=3, AD44/COUNTRY_INFO!F44*100))),\"-\"),0)","v":0},{"$f":"IF(COUNTRY_INFO!K44=2,IF(COUNTRY_INFO!G44*0.2>MAX('T1'!N44,'T2'!L44),MAX('T1'!N44,'T2'!L44),COUNTRY_INFO!G44*0.2),IF(COUNTRY_INFO!K44=3,IF(COUNTRY_INFO!G44>MAX('T1'!N44,'T2'!L44),MAX('T1'!N44,'T2'!L44),COUNTRY_INFO!G44),0))","v":0},{"$f":"IF(AND(COUNTRY_INFO!K44>0,COUNTRY_INFO!K44<4),IF(Z44>0,IF(COUNTRY_INFO!K44=1, 0, IF(COUNTRY_INFO!K44=2, AF44/(COUNTRY_INFO!G44*0.2)*100, IF(COUNTRY_INFO!K44=3, AF44/COUNTRY_INFO!G44*100))),\"-\"),0)","v":0},0,{"$f":"IF(AND(COUNTRY_INFO!K44>0,COUNTRY_INFO!K44<4), IF(AC44/Z44*100<>0, IF(AH44/Z44*100>100,100,AH44/Z44*100), \"-\"),0)","v":0},null,{"$f":"IF(AND(D44<>0, D44<>\"Inconnu\",D44<>\"Interrompu\",D44<>\"Non requis\"),D44/COUNTRY_INFO!D44, 0)","v":0},{"$f":"IF(AND(J44<>0,J44<>\"Inconnu\",J44<>\"Interrompu\",J44<>\"Non requis\"),J44/COUNTRY_INFO!D44, 0)","v":0},{"$f":"IF(AND(P44<>0,P44<>\"Inconnu\",P44<>\"Non requis\"),P44/(COUNTRY_INFO!E44+COUNTRY_INFO!F44), 0)","v":1},{"$f":"IF(AND(Z44<>0,Z44<>\"Inconnu\",Z44<>\"Non requis\"),IF(COUNTRY_INFO!K44=1,1,IF(COUNTRY_INFO!K44=2,0.5*COUNTRY_INFO!F44/(0.5*COUNTRY_INFO!F44+0.2*COUNTRY_INFO!G44),IF(COUNTRY_INFO!K44=3,COUNTRY_INFO!F44/(COUNTRY_INFO!F44+COUNTRY_INFO!G44)))),0)","v":0},{"$f":"IF(AND(Z44<>0,Z44<>\"Inconnu\",Z44<>\"Non requis\"),IF(COUNTRY_INFO!K44=1,0,IF(COUNTRY_INFO!K44=2,0.2*COUNTRY_INFO!G44/(0.5*COUNTRY_INFO!F44+0.2*COUNTRY_INFO!G44),IF(COUNTRY_INFO!K44=3,COUNTRY_INFO!G44/(COUNTRY_INFO!F44+COUNTRY_INFO!G44)))),0)","v":0},{"$f":"MAX(COUNTRY_INFO!D44*AK44*PROFILE!$G$7,COUNTRY_INFO!D44*AL44*PROFILE!$G$7)","v":0},{"$f":"MAX(COUNTRY_INFO!D44*AK44*PROFILE!$G$8,COUNTRY_INFO!D44*AL44*PROFILE!$G$8,COUNTRY_INFO!D44*AM44*PROFILE!$G$8)","v":5886.0794469672683},{"$f":"MAX(COUNTRY_INFO!D44*AK44*PROFILE!$G$9,COUNTRY_INFO!D44*AL44*PROFILE!$G$9,COUNTRY_INFO!D44*AM44*PROFILE!$G$9,IF(AND(DISTRICT!Z44<>\"Inconnu\",Z44<>\"Non requis\"),COUNTRY_INFO!P44*DISTRICT!AN44,0))","v":8829.1053446326114},{"$f":"MAX(COUNTRY_INFO!D44*AK44*PROFILE!$G$10,COUNTRY_INFO!D44*AL44*PROFILE!$G$10,IF(AND(DISTRICT!Z44<>\"Inconnu\",Z44<>\"Non requis\"),COUNTRY_INFO!P44*DISTRICT!AO44,0))","v":0},14715.184791599881,0,{"$f":"MAX('MDA4'!R44,'T1'!L44,'T2'!J44,T3_R1!K44,T3_R2!K44)","v":0},{"$f":"MAX('MDA1'!K44,'MDA4'!S44,'MDA3'!I44,'MDA3'!L44,'T1'!M44,'T2'!K44,T3_R1!L44,T3_R2!L44)","v":0},{"$f":"MAX('MDA1'!L44,'MDA4'!T44,'MDA3'!J44,'MDA3'!M44,'T1'!N44,'T2'!L44,T3_R1!M44,T3_R2!M44)","v":0},0,{"$f":"MAX('MDA4'!R44,T44)","v":0},{"$f":"MAX('MDA1'!K44,'MDA4'!S44,'MDA3'!I44,'MDA3'!L44,V44,AD44)","v":0},{"$f":"MAX('MDA1'!L44,'MDA4'!T44,'MDA3'!J44,'MDA3'!M44,AF44)","v":0},0,0]
[{"$f":"IF(COUNTRY_INFO!A45=0,\" \",COUNTRY_INFO!A45)","v":" Congo"},{"$f":"IF(COUNTRY_INFO!B45=0,\" \",COUNTRY_INFO!B45)","v":"Pointe-Noire"},{"$f":"IF(COUNTRY_INFO!C45=0,\" \",COUNTRY_INFO!C45)","v":"Loandjili"},{"$f":"COUNTRY_INFO!M45","v":0},null,null,{"$f":"SUM('MDA1'!M45,'MDA4'!U45)","v":0},{"$f":"IF(AND(COUNTRY_INFO!H45>0,COUNTRY_INFO!H45<4),IF(D45>MAX('MDA1'!M45,'MDA4'!U45),MAX('MDA1'!M45,'MDA4'!U45),D45),0)","v":0},{"$f":"IF(AND(COUNTRY_INFO!H45>0,COUNTRY_INFO!H45<4), IF(G45/D45*100<>0, IF(G45/D45*100>100,100,G45/D45*100), \"-\"),0)","v":0},{"$f":"COUNTRY_INFO!N45","v":0},null,null,{"$f":"MAX('MDA1'!M45,MAX('MDA3'!I45,'MDA3'!L45)+MAX('MDA3'!J45,'MDA3'!M45))","v":0},{"$f":"IF(AND(COUNTRY_INFO!I45>0,COUNTRY_INFO!I45<4),IF(J45>MAX('MDA1'!M45,MAX('MDA3'!I45,'MDA3'!L45)+MAX('MDA3'!J45,'MDA3'!M45)),MAX('MDA1'!M45,MAX('MDA3'!I45,'MDA3'!L45)+MAX('MDA3'!J45,'MDA3'!M45)),J45),0)","v":0},{"$f":"IF(AND(COUNTRY_INFO!I45>0,COUNTRY_INFO!I45<4), IF(M45/J45*100<>0, IF(M45/J45*100>100,100,M45/J45*100), \"-\"),0)","v":0},{"$f":"COUNTRY_INFO!O45","v":0},null,null,{"$f":"SUM(MAX('MDA4'!N45, 'T1'!L45, MAX(T3_R1!K45, T3_R2!K45)), MAX('MDA1'!K45, 'MDA4'!O45, 'T1'!M45, MAX(T3_R1!L45, T3_R2!L45)), MAX('MDA1'!L45, 'MDA4'!P45, 'T1'!N45, MAX(T3_R1!M45, T3_R2!M45)))","v":0},{"$f":"IF(AND(COUNTRY_INFO!J45>1,COUNTRY_INFO!J45<4),IF(COUNTRY_INFO!E45>MAX('MDA4'!N45,'T1'!L45,MAX(T3_R1!K45,T3_R2!K45)),MAX('MDA4'!N45,'T1'!L45,MAX(T3_R1!K45,T3_R2!K45)),COUNTRY_INFO!E45),0)","v":0},{"$f":"IF(AND(COUNTRY_INFO!J45>1,COUNTRY_INFO!J45<4), IF(T45/COUNTRY_INFO!E45*100<>0, IF(T45/COUNTRY_INFO!E45*100>100,100,T45/COUNTRY_INFO!E45*100), \"-\"),0)","v":0},{"$f":"IF(AND(COUNTRY_INFO!J45>1,COUNTRY_INFO!J45<4),IF(COUNTRY_INFO!F45>MAX('MDA1'!K45,'MDA4'!O45,'T1'!M45,MAX(T3_R1!L45,T3_R2!L45)),MAX('MDA1'!K45,'MDA4'!O45,'T1'!M45,MAX(T3_R1!L45,T3_R2!L45)),COUNTRY_INFO!F45),0)","v":0},{"$f":"IF(AND(COUNTRY_INFO!J45>1,COUNTRY_INFO!J45<4), IF(V45/COUNTRY_INFO!F45*100<>0, IF(V45/COUNTRY_INFO!F45*100>100,100,V45/COUNTRY_INFO!F45*100), \"-\"),0)","v":0},0,{"$f":"IF(AND(COUNTRY_INFO!J45>1,COUNTRY_INFO!J45<4), IF(S45/P45*100<>0, IF(X45/P45*100>100,100,X45/P45*100), \"-\"),0)","v":0},{"$f":"COUNTRY_INFO!P45","v":21954.240000000002},null,null,{"$f":"MAX('T1'!L45,'T2'!J45)+MAX('T1'!M45,'T2'!K45)+MAX('T1'!N45,'T2'!L45)","v":0},{"$f":"IF(COUNTRY_INFO!K45=1,IF(COUNTRY_INFO!F45*0.33>MAX('T1'!M45,'T2'!K45),MAX('T1'!M45,'T2'!K45),COUNTRY_INFO!F45*0.33),IF(COUNTRY_INFO!K45=2,IF(COUNTRY_INFO!F45*0.5>MAX('T1'!M45,'T2'!K45),MAX('T1'!M45,'T2'!K45),COUNTRY_INFO!F45*0.5),IF(COUNTRY_INFO!K45=3,IF(COUNTRY_INFO!F45>MAX('T1'!M45,'T2'!K45),MAX('T1'!M45,'T2'!K45),COUNTRY_INFO!F45),0)))","v":0},{"$f":"IF(AND(COUNTRY_INFO!K45>0,COUNTRY_INFO!K45<4),IF(Z45>0,IF(COUNTRY_INFO!K45=1, AD45/(COUNTRY_INFO!F45*0.33)*100, IF(COUNTRY_INFO!K45=2, AD45/(COUNTRY_INFO!F45*0.5)*100, IF(COUNTRY_INFO!K45=3, AD45/COUNTRY_INFO!F45*100))),\"-\"),0)","v":0},{"$f":"IF(COUNTRY_INFO!K45=2,IF(COUNTRY_INFO!G45*0.2>MAX('T1'!N45,'T2'!L45),MAX('T1'!N45,'T2'!L45),COUNTRY_INFO!G45*0.2),IF(COUNTRY_INFO!K45=3,IF(COUNTRY_INFO!G45>MAX('T1'!N45,'T2'!L45),MAX('T1'!N45,'T2'!L45),COUNTRY_INFO!G45),0))","v":0},{"$f":"IF(AND(COUNTRY_INFO!K45>0,COUNTRY_INFO!K45<4),IF(Z45>0,IF(COUNTRY_INFO!K45=1, 0, IF(COUNTRY_INFO!K45=2, AF45/(COUNTRY_INFO!G45*0.2)*100, IF(COUNTRY_INFO!K45=3, AF45/COUNTRY_INFO!G45*100))),\"-\"),0)","v":0},0,{"$f":"IF(AND(COUNTRY_INFO!K45>0,COUNTRY_INFO!K45<4), IF(AC45/Z45*100<>0, IF(AH45/Z45*100>100,100,AH45/Z45*100), \"-\"),0)","v":"-"},null,{"$f":"IF(AND(D45<>0, D45<>\"Inconnu\",D45<>\"Interrompu\",D45<>\"Non requis\"),D45/COUNTRY_INFO!D45, 0)","v":0},{"$f":"IF(AND(J45<>0,J45<>\"Inconnu\",J45<>\"Interrompu\",J45<>\"Non requis\"),J45/COUNTRY_INFO!D45, 0)","v":0},{"$f":"IF(AND(P45<>0,P45<>\"Inconnu\",P45<>\"Non requis\"),P45/(COUNTRY_INFO!E45+COUNTRY_INFO!F45), 0)","v":0},{"$f":"IF(AND(Z45<>0,Z45<>\"Inconnu\",Z45<>\"Non requis\"),IF(COUNTRY_INFO!K45=1,1,IF(COUNTRY_INFO!K45=2,0.5*COUNTRY_INFO!F45/(0.5*COUNTRY_INFO!F45+0.2*COUNTRY_INFO!G45),IF(COUNTRY_INFO!K45=3,COUNTRY_INFO!F45/(COUNTRY_INFO!F45+COUNTRY_INFO!G45)))),0)","v":1},{"$f":"IF(AND(Z45<>0,Z45<>\"Inconnu\",Z45<>\"Non requis\"),IF(COUNTRY_INFO!K45=1,0,IF(COUNTRY_INFO!K45=2,0.2*COUNTRY_INFO!G45/(0.5*COUNTRY_INFO!F45+0.2*COUNTRY_INFO!G45),IF(COUNTRY_INFO!K45=3,COUNTRY_INFO!G45/(COUNTRY_INFO!F45+COUNTRY_INFO!G45)))),0)","v":0},{"$f":"MAX(COUNTRY_INFO!D45*AK45*PROFILE!$G$7,COUNTRY_INFO!D45*AL45*PROFILE!$G$7)","v":0},{"$f":"MAX(COUNTRY_INFO!D45*AK45*PROFILE!$G$8,COUNTRY_INFO!D45*AL45*PROFILE!$G$8,COUNTRY_INFO!D45*AM45*PROFILE!$G$8)","v":0},{"$f":"MAX(COUNTRY_INFO!D45*AK45*PROFILE!$G$9,COUNTRY_INFO!D45*AL45*PROFILE!$G$9,COUNTRY_INFO!D45*AM45*PROFILE!$G$9,IF(AND(DISTRICT!Z45<>\"Inconnu\",Z45<>\"Non requis\"),COUNTRY_INFO!P45*DISTRICT!AN45,0))","v":21954.240000000002},{"$f":"MAX(COUNTRY_INFO!D45*AK45*PROFILE!$G$10,COUNTRY_INFO!D45*AL45*PROFILE!$G$10,IF(AND(DISTRICT!Z45<>\"Inconnu\",Z45<>\"Non requis\"),COUNTRY_INFO!P45*DISTRICT!AO45,0))","v":0},21954.240000000002,0,{"$f":"MAX('MDA4'!R45,'T1'!L45,'T2'!J45,T3_R1!K45,T3_R2!K45)","v":0},{"$f":"MAX('MDA1'!K45,'MDA4'!S45,'MDA3'!I45,'MDA3'!L45,'T1'!M45,'T2'!K45,T3_R1!L45,T3_R2!L45)","v":0},{"$f":"MAX('MDA1'!L45,'MDA4'!T45,'MDA3'!J45,'MDA3'!M45,'T1'!N45,'T2'!L45,T3_R1!M45,T3_R2!M45)","v":0},0,{"$f":"MAX('MDA4'!R45,T45)","v":0},{"$f":"MAX('MDA1'!K45,'MDA4'!S45,'MDA3'!I45,'MDA3'!L45,V45,AD45)","v":0},{"$f":"MAX('MDA1'!L45,'MDA4'!T45,'MDA3'!J45,'MDA3'!M45,AF45)","v":0},0,0]
[{"$f":"IF(COUNTRY_INFO!A46=0,\" \",COUNTRY_INFO!A46)","v":" Congo"},{"$f":"IF(COUNTRY_INFO!B46=0,\" \",COUNTRY_INFO!B46)","v":"Pointe-Noire"},{"$f":"IF(COUNTRY_INFO!C46=0,\" \",COUNTRY_INFO!C46)","v":"Lumumba"},{"$f":"COUNTRY_INFO!M46","v":0},null,null,{"$f":"SUM('MDA1'!M46,'MDA4'!U46)","v":0},{"$f":"IF(AND(COUNTRY_INFO!H46>0,COUNTRY_INFO!H46<4),IF(D46>MAX('MDA1'!M46,'MDA4'!U46),MAX('MDA1'!M46,'MDA4'!U46),D46),0)","v":0},{"$f":"IF(AND(COUNTRY_INFO!H46>0,COUNTRY_INFO!H46<4), IF(G46/D46*100<>0, IF(G46/D46*100>100,100,G46/D46*100), \"-\"),0)","v":0},{"$f":"COUNTRY_INFO!N46","v":0},null,null,{"$f":"MAX('MDA1'!M46,MAX('MDA3'!I46,'MDA3'!L46)+MAX('MDA3'!J46,'MDA3'!M46))","v":0},{"$f":"IF(AND(COUNTRY_INFO!I46>0,COUNTRY_INFO!I46<4),IF(J46>MAX('MDA1'!M46,MAX('MDA3'!I46,'MDA3'!L46)+MAX('MDA3'!J46,'MDA3'!M46)),MAX('MDA1'!M46,MAX('MDA3'!I46,'MDA3'!L46)+MAX('MDA3'!J46,'MDA3'!M46)),J46),0)","v":0},{"$f":"IF(AND(COUNTRY_INFO!I46>0,COUNTRY_INFO!I46<4), IF(M46/J46*100<>0, IF(M46/J46*100>100,100,M46/J46*100), \"-\"),0)","v":0},{"$f":"COUNTRY_INFO!O46","v":0},null,null,{"$f":"SUM(MAX('MDA4'!N46, 'T1'!L46, MAX(T3_R1!K46, T3_R2!K46)), MAX('MDA1'!K46, 'MDA4'!O46, 'T1'!M46, MAX(T3_R1!L46, T3_R2!L46)), MAX('MDA1'!L46, 'MDA4'!P46, 'T1'!N46, MAX(T3_R1!M46, T3_R2!M46)))","v":0},{"$f":"IF(AND(COUNTRY_INFO!J46>1,COUNTRY_INFO!J46<4),IF(COUNTRY_INFO!E46>MAX('MDA4'!N46,'T1'!L46,MAX(T3_R1!K46,T3_R2!K46)),MAX('MDA4'!N46,'T1'!L46,MAX(T3_R1!K46,T3_R2!K46)),COUNTRY_INFO!E46),0)","v":0},{"$f":"IF(AND(COUNTRY_INFO!J46>1,COUNTRY_INFO!J46<4), IF(T46/COUNTRY_INFO!E46*100<>0, IF(T46/COUNTRY_INFO!E46*100>100,100,T46/COUNTRY_INFO!E46*100), \"-\"),0)","v":0},{"$f":"IF(AND(COUNTRY_INFO!J46>1,COUNTRY_INFO!J46<4),IF(COUNTRY_INFO!F46>MAX('MDA1'!K46,'MDA4'!O46,'T1'!M46,MAX(T3_R1!L46,T3_R2!L46)),MAX('MDA1'!K46,'MDA4'!O46,'T1'!M46,MAX(T3_R1!L46,T3_R2!L46)),COUNTRY_INFO!F46),0)","v":0},{"$f":"IF(AND(COUNTRY_INFO!J46>1,COUNTRY_INFO!J46<4), IF(V46/COUNTRY_INFO!F46*100<>0, IF(V46/COUNTRY_INFO!F46*100>100,100,V46/COUNTRY_INFO!F46*100), \"-\"),0)","v":0},0,{"$f":"IF(AND(COUNTRY_INFO!J46>1,COUNTRY_INFO!J46<4), IF(S46/P46*100<>0, IF(X46/P46*100>100,100,X46/P46*100), \"-\"),0)","v":0},{"$f":"COUNTRY_INFO!P46","v":13818.09},null,null,{"$f":"MAX('T1'!L46,'T2'!J46)+MAX('T1'!M46,'T2'!K46)+MAX('T1'!N46,'T2'!L46)","v":0},{"$f":"IF(COUNTRY_INFO!K46=1,IF(COUNTRY_INFO!F46*0.33>MAX('T1'!M46,'T2'!K46),MAX('T1'!M46,'T2'!K46),COUNTRY_INFO!F46*0.33),IF(COUNTRY_INFO!K46=2,IF(COUNTRY_INFO!F46*0.5>MAX('T1'!M46,'T2'!K46),MAX('T1'!M46,'T2'!K46),COUNTRY_INFO!F46*0.5),IF(COUNTRY_INFO!K46=3,IF(COUNTRY_INFO!F46>MAX('T1'!M46,'T2'!K46),MAX('T1'!M46,'T2'!K46),COUNTRY_INFO!F46),0)))","v":0},{"$f":"IF(AND(COUNTRY_INFO!K46>0,COUNTRY_INFO!K46<4),IF(Z46>0,IF(COUNTRY_INFO!K46=1, AD46/(COUNTRY_INFO!F46*0.33)*100, IF(COUNTRY_INFO!K46=2, AD46/(COUNTRY_INFO!F46*0.5)*100, IF(COUNTRY_INFO!K46=3, AD46/COUNTRY_INFO!F46*100))),\"-\"),0)","v":0},{"$f":"IF(COUNTRY_INFO!K46=2,IF(COUNTRY_INFO!G46*0.2>MAX('T1'!N46,'T2'!L46),MAX('T1'!N46,'T2'!L46),COUNTRY_INFO!G46*0.2),IF(COUNTRY_INFO!K46=3,IF(COUNTRY_INFO!G46>MAX('T1'!N46,'T2'!L46),MAX('T1'!N46,'T2'!L46),COUNTRY_INFO!G46),0))","v":0},{"$f":"IF(AND(COUNTRY_INFO!K46>0,COUNTRY_INFO!K46<4),IF(Z46>0,IF(COUNTRY_INFO!K46=1, 0, IF(COUNTRY_INFO!K46=2, AF46/(COUNTRY_INFO!G46*0.2)*100, IF(COUNTRY_INFO!K46=3, AF46/COUNTRY_INFO!G46*100))),\"-\"),0)","v":0},0,{"$f":"IF(AND(COUNTRY_INFO!K46>0,COUNTRY_INFO!K46<4), IF(AC46/Z46*100<>0, IF(AH46/Z46*100>100,100,AH46/Z46*100), \"-\"),0)","v":"-"},null,{"$f":"IF(AND(D46<>0, D46<>\"Inconnu\",D46<>\"Interrompu\",D46<>\"Non requis\"),D46/COUNTRY_INFO!D46, 0)","v":0},{"$f":"IF(AND(J46<>0,J46<>\"Inconnu\",J46<>\"Interrompu\",J46<>\"Non requis\"),J46/COUNTRY_INFO!D46, 0)","v":0},{"$f":"IF(AND(P46<>0,P46<>\"Inconnu\",P46<>\"Non requis\"),P46/(COUNTRY_INFO!E46+COUNTRY_INFO!F46), 0)","v":0},{"$f":"IF(AND(Z46<>0,Z46<>\"Inconnu\",Z46<>\"Non requis\"),IF(COUNTRY_INFO!K46=1,1,IF(COUNTRY_INFO!K46=2,0.5*COUNTRY_INFO!F46/(0.5*COUNTRY_INFO!F46+0.2*COUNTRY_INFO!G46),IF(COUNTRY_INFO!K46=3,COUNTRY_INFO!F46/(COUNTRY_INFO!F46+COUNTRY_INFO!G46)))),0)","v":1},{"$f":"IF(AND(Z46<>0,Z46<>\"Inconnu\",Z46<>\"Non requis\"),IF(COUNTRY_INFO!K46=1,0,IF(COUNTRY_INFO!K46=2,0.2*COUNTRY_INFO!G46/(0.5*COUNTRY_INFO!F46+0.2*COUNTRY_INFO!G46),IF(COUNTRY_INFO!K46=3,COUNTRY_INFO!G46/(COUNTRY_INFO!F46+COUNTRY_INFO!G46)))),0)","v":0},{"$f":"MAX(COUNTRY_INFO!D46*AK46*PROFILE!$G$7,COUNTRY_INFO!D46*AL46*PROFILE!$G$7)","v":0},{"$f":"MAX(COUNTRY_INFO!D46*AK46*PROFILE!$G$8,COUNTRY_INFO!D46*AL46*PROFILE!$G$8,COUNTRY_INFO!D46*AM46*PROFILE!$G$8)","v":0},{"$f":"MAX(COUNTRY_INFO!D46*AK46*PROFILE!$G$9,COUNTRY_INFO!D46*AL46*PROFILE!$G$9,COUNTRY_INFO!D46*AM46*PROFILE!$G$9,IF(AND(DISTRICT!Z46<>\"Inconnu\",Z46<>\"Non requis\"),COUNTRY_INFO!P46*DISTRICT!AN46,0))","v":13818.09},{"$f":"MAX(COUNTRY_INFO!D46*AK46*PROFILE!$G$10,COUNTRY_INFO!D46*AL46*PROFILE!$G$10,IF(AND(DISTRICT!Z46<>\"Inconnu\",Z46<>\"Non requis\"),COUNTRY_INFO!P46*DISTRICT!AO46,0))","v":0},13818.09,0,{"$f":"MAX('MDA4'!R46,'T1'!L46,'T2'!J46,T3_R1!K46,T3_R2!K46)","v":0},{"$f":"MAX('MDA1'!K46,'MDA4'!S46,'MDA3'!I46,'MDA3'!L46,'T1'!M46,'T2'!K46,T3_R1!L46,T3_R2!L46)","v":0},{"$f":"MAX('MDA1'!L46,'MDA4'!T46,'MDA3'!J46,'MDA3'!M46,'T1'!N46,'T2'!L46,T3_R1!M46,T3_R2!M46)","v":0},0,{"$f":"MAX('MDA4'!R46,T46)","v":0},{"$f":"MAX('MDA1'!K46,'MDA4'!S46,'MDA3'!I46,'MDA3'!L46,V46,AD46)","v":0},{"$f":"MAX('MDA1'!L46,'MDA4'!T46,'MDA3'!J46,'MDA3'!M46,AF46)","v":0},0,0]
[{"$f":"IF(COUNTRY_INFO!A47=0,\" \",COUNTRY_INFO!A47)","v":" Congo"},{"$f":"IF(COUNTRY_INFO!B47=0,\" \",COUNTRY_INFO!B47)","v":"Pointe-Noire"},{"$f":"IF(COUNTRY_INFO!C47=0,\" \",COUNTRY_INFO!C47)","v":"Mongo-Poukou"},{"$f":"COUNTRY_INFO!M47","v":0},null,null,{"$f":"SUM('MDA1'!M47,'MDA4'!U47)","v":0},{"$f":"IF(AND(COUNTRY_INFO!H47>0,COUNTRY_INFO!H47<4),IF(D47>MAX('MDA1'!M47,'MDA4'!U47),MAX('MDA1'!M47,'MDA4'!U47),D47),0)","v":0},{"$f":"IF(AND(COUNTRY_INFO!H47>0,COUNTRY_INFO!H47<4), IF(G47/D47*100<>0, IF(G47/D47*100>100,100,G47/D47*100), \"-\"),0)","v":0},{"$f":"COUNTRY_INFO!N47","v":0},null,null,{"$f":"MAX('MDA1'!M47,MAX('MDA3'!I47,'MDA3'!L47)+MAX('MDA3'!J47,'MDA3'!M47))","v":0},{"$f":"IF(AND(COUNTRY_INFO!I47>0,COUNTRY_INFO!I47<4),IF(J47>MAX('MDA1'!M47,MAX('MDA3'!I47,'MDA3'!L47)+MAX('MDA3'!J47,'MDA3'!M47)),MAX('MDA1'!M47,MAX('MDA3'!I47,'MDA3'!L47)+MAX('MDA3'!J47,'MDA3'!M47)),J47),0)","v":0},{"$f":"IF(AND(COUNTRY_INFO!I47>0,COUNTRY_INFO!I47<4), IF(M47/J47*100<>0, IF(M47/J47*100>100,100,M47/J47*100), \"-\"),0)","v":0},{"$f":"COUNTRY_INFO!O47","v":0},null,null,{"$f":"SUM(MAX('MDA4'!N47, 'T1'!L47, MAX(T3_R1!K47, T3_R2!K47)), MAX('MDA1'!K47, 'MDA4'!O47, 'T1'!M47, MAX(T3_R1!L47, T3_R2!L47)), MAX('MDA1'!L47, 'MDA4'!P47, 'T1'!N47, MAX(T3_R1!M47, T3_R2!M47)))","v":0},{"$f":"IF(AND(COUNTRY_INFO!J47>1,COUNTRY_INFO!J47<4),IF(COUNTRY_INFO!E47>MAX('MDA4'!N47,'T1'!L47,MAX(T3_R1!K47,T3_R2!K47)),MAX('MDA4'!N47,'T1'!L47,MAX(T3_R1!K47,T3_R2!K47)),COUNTRY_INFO!E47),0)","v":0},{"$f":"IF(AND(COUNTRY_INFO!J47>1,COUNTRY_INFO!J47<4), IF(T47/COUNTRY_INFO!E47*100<>0, IF(T47/COUNTRY_INFO!E47*100>100,100,T47/COUNTRY_INFO!E47*100), \"-\"),0)","v":0},{"$f":"IF(AND(COUNTRY_INFO!J47>1,COUNTRY_INFO!J47<4),IF(COUNTRY_INFO!F47>MAX('MDA1'!K47,'MDA4'!O47,'T1'!M47,MAX(T3_R1!L47,T3_R2!L47)),MAX('MDA1'!K47,'MDA4'!O47,'T1'!M47,MAX(T3_R1!L47,T3_R2!L47)),COUNTRY_INFO!F47),0)","v":0},{"$f":"IF(AND(COUNTRY_INFO!J47>1,COUNTRY_INFO!J47<4), IF(V47/COUNTRY_INFO!F47*100<>0, IF(V47/COUNTRY_INFO!F47*100>100,100,V47/COUNTRY_INFO!F47*100), \"-\"),0)","v":0},0,{"$f":"IF(AND(COUNTRY_INFO!J47>1,COUNTRY_INFO!J47<4), IF(S47/P47*100<>0, IF(X47/P47*100>100,100,X47/P47*100), \"-\"),0)","v":0},{"$f":"COUNTRY_INFO!P47","v":"Inconnu"},null,null,{"$f":"MAX('T1'!L47,'T2'!J47)+MAX('T1'!M47,'T2'!K47)+MAX('T1'!N47,'T2'!L47)","v":0},{"$f":"IF(COUNTRY_INFO!K47=1,IF(COUNTRY_INFO!F47*0.33>MAX('T1'!M47,'T2'!K47),MAX('T1'!M47,'T2'!K47),COUNTRY_INFO!F47*0.33),IF(COUNTRY_INFO!K47=2,IF(COUNTRY_INFO!F47*0.5>MAX('T1'!M47,'T2'!K47),MAX('T1'!M47,'T2'!K47),COUNTRY_INFO!F47*0.5),IF(COUNTRY_INFO!K47=3,IF(COUNTRY_INFO!F47>MAX('T1'!M47,'T2'!K47),MAX('T1'!M47,'T2'!K47),COUNTRY_INFO!F47),0)))","v":0},{"$f":"IF(AND(COUNTRY_INFO!K47>0,COUNTRY_INFO!K47<4),IF(Z47>0,IF(COUNTRY_INFO!K47=1, AD47/(COUNTRY_INFO!F47*0.33)*100, IF(COUNTRY_INFO!K47=2, AD47/(COUNTRY_INFO!F47*0.5)*100, IF(COUNTRY_INFO!K47=3, AD47/COUNTRY_INFO!F47*100))),\"-\"),0)","v":0},{"$f":"IF(COUNTRY_INFO!K47=2,IF(COUNTRY_INFO!G47*0.2>MAX('T1'!N47,'T2'!L47),MAX('T1'!N47,'T2'!L47),COUNTRY_INFO!G47*0.2),IF(COUNTRY_INFO!K47=3,IF(COUNTRY_INFO!G47>MAX('T1'!N47,'T2'!L47),MAX('T1'!N47,'T2'!L47),COUNTRY_INFO!G47),0))","v":0},{"$f":"IF(AND(COUNTRY_INFO!K47>0,COUNTRY_INFO!K47<4),IF(Z47>0,IF(COUNTRY_INFO!K47=1, 0, IF(COUNTRY_INFO!K47=2, AF47/(COUNTRY_INFO!G47*0.2)*100, IF(COUNTRY_INFO!K47=3, AF47/COUNTRY_INFO!G47*100))),\"-\"),0)","v":0},0,{"$f":"IF(AND(COUNTRY_INFO!K47>0,COUNTRY_INFO!K47<4), IF(AC47/Z47*100<>0, IF(AH47/Z47*100>100,100,AH47/Z47*100), \"-\"),0)","v":0},null,{"$f":"IF(AND(D47<>0, D47<>\"Inconnu\",D47<>\"Interrompu\",D47<>\"Non requis\"),D47/COUNTRY_INFO!D47, 0)","v":0},{"$f":"IF(AND(J47<>0,J47<>\"Inconnu\",J47<>\"Interrompu\",J47<>\"Non requis\"),J47/COUNTRY_INFO!D47, 0)","v":0},{"$f":"IF(AND(P47<>0,P47<>\"Inconnu\",P47<>\"Non requis\"),P47/(COUNTRY_INFO!E47+COUNTRY_INFO!F47), 0)","v":0},{"$f":"IF(AND(Z47<>0,Z47<>\"Inconnu\",Z47<>\"Non requis\"),IF(COUNTRY_INFO!K47=1,1,IF(COUNTRY_INFO!K47=2,0.5*COUNTRY_INFO!F47/(0.5*COUNTRY_INFO!F47+0.2*COUNTRY_INFO!G47),IF(COUNTRY_INFO!K47=3,COUNTRY_INFO!F47/(COUNTRY_INFO!F47+COUNTRY_INFO!G47)))),0)","v":0},{"$f":"IF(AND(Z47<>0,Z47<>\"Inconnu\",Z47<>\"Non requis\"),IF(COUNTRY_INFO!K47=1,0,IF(COUNTRY_INFO!K47=2,0.2*COUNTRY_INFO!G47/(0.5*COUNTRY_INFO!F47+0.2*COUNTRY_INFO!G47),IF(COUNTRY_INFO!K47=3,COUNTRY_INFO!G47/(COUNTRY_INFO!F47+COUNTRY_INFO!G47)))),0)","v":0},{"$f":"MAX(COUNTRY_INFO!D47*AK47*PROFILE!$G$7,COUNTRY_INFO!D47*AL47*PROFILE!$G$7)","v":0},{"$f":"MAX(COUNTRY_INFO!D47*AK47*PROFILE!$G$8,COUNTRY_INFO!D47*AL47*PROFILE!$G$8,COUNTRY_INFO!D47*AM47*PROFILE!$G$8)","v":0},{"$f":"MAX(COUNTRY_INFO!D47*AK47*PROFILE!$G$9,COUNTRY_INFO!D47*AL47*PROFILE!$G$9,COUNTRY_INFO!D47*AM47*PROFILE!$G$9,IF(AND(DISTRICT!Z47<>\"Inconnu\",Z47<>\"Non requis\"),COUNTRY_INFO!P47*DISTRICT!AN47,0))","v":0},{"$f":"MAX(COUNTRY_INFO!D47*AK47*PROFILE!$G$10,COUNTRY_INFO!D47*AL47*PROFILE!$G$10,IF(AND(DISTRICT!Z47<>\"Inconnu\",Z47<>\"Non requis\"),COUNTRY_INFO!P47*DISTRICT!AO47,0))","v":0},0,0,{"$f":"MAX('MDA4'!R47,'T1'!L47,'T2'!J47,T3_R1!K47,T3_R2!K47)","v":0},{"$f":"MAX('MDA1'!K47,'MDA4'!S47,'MDA3'!I47,'MDA3'!L47,'T1'!M47,'T2'!K47,T3_R1!L47,T3_R2!L47)","v":0},{"$f":"MAX('MDA1'!L47,'MDA4'!T47,'MDA3'!J47,'MDA3'!M47,'T1'!N47,'T2'!L47,T3_R1!M47,T3_R2!M47)","v":0},0,{"$f":"MAX('MDA4'!R47,T47)","v":0},{"$f":"MAX('MDA1'!K47,'MDA4'!S47,'MDA3'!I47,'MDA3'!L47,V47,AD47)","v":0},{"$f":"MAX('MDA1'!L47,'MDA4'!T47,'MDA3'!J47,'MDA3'!M47,AF47)","v":0},0,0]
[{"$f":"IF(COUNTRY_INFO!A48=0,\" \",COUNTRY_INFO!A48)","v":" Congo"},{"$f":"IF(COUNTRY_INFO!B48=0,\" \",COUNTRY_INFO!B48)","v":"Pointe-Noire"},{"$f":"IF(COUNTRY_INFO!C48=0,\" \",COUNTRY_INFO!C48)","v":"Mvoumvou"},{"$f":"COUNTRY_INFO!M48","v":0},null,null,{"$f":"SUM('MDA1'!M48,'MDA4'!U48)","v":0},{"$f":"IF(AND(COUNTRY_INFO!H48>0,COUNTRY_INFO!H48<4),IF(D48>MAX('MDA1'!M48,'MDA4'!U48),MAX('MDA1'!M48,'MDA4'!U48),D48),0)","v":0},{"$f":"IF(AND(COUNTRY_INFO!H48>0,COUNTRY_INFO!H48<4), IF(G48/D48*100<>0, IF(G48/D48*100>100,100,G48/D48*100), \"-\"),0)","v":0},{"$f":"COUNTRY_INFO!N48","v":0},null,null,{"$f":"MAX('MDA1'!M48,MAX('MDA3'!I48,'MDA3'!L48)+MAX('MDA3'!J48,'MDA3'!M48))","v":0},{"$f":"IF(AND(COUNTRY_INFO!I48>0,COUNTRY_INFO!I48<4),IF(J48>MAX('MDA1'!M48,MAX('MDA3'!I48,'MDA3'!L48)+MAX('MDA3'!J48,'MDA3'!M48)),MAX('MDA1'!M48,MAX('MDA3'!I48,'MDA3'!L48)+MAX('MDA3'!J48,'MDA3'!M48)),J48),0)","v":0},{"$f":"IF(AND(COUNTRY_INFO!I48>0,COUNTRY_INFO!I48<4), IF(M48/J48*100<>0, IF(M48/J48*100>100,100,M48/J48*100), \"-\"),0)","v":0},{"$f":"COUNTRY_INFO!O48","v":0},null,null,{"$f":"SUM(MAX('MDA4'!N48, 'T1'!L48, MAX(T3_R1!K48, T3_R2!K48)), MAX('MDA1'!K48, 'MDA4'!O48, 'T1'!M48, MAX(T3_R1!L48, T3_R2!L48)), MAX('MDA1'!L48, 'MDA4'!P48, 'T1'!N48, MAX(T3_R1!M48, T3_R2!M48)))","v":0},{"$f":"IF(AND(COUNTRY_INFO!J48>1,COUNTRY_INFO!J48<4),IF(COUNTRY_INFO!E48>MAX('MDA4'!N48,'T1'!L48,MAX(T3_R1!K48,T3_R2!K48)),MAX('MDA4'!N48,'T1'!L48,MAX(T3_R1!K48,T3_R2!K48)),COUNTRY_INFO!E48),0)","v":0},{"$f":"IF(AND(COUNTRY_INFO!J48>1,COUNTRY_INFO!J48<4), IF(T48/COUNTRY_INFO!E48*100<>0, IF(T48/COUNTRY_INFO!E48*100>100,100,T48/COUNTRY_INFO!E48*100), \"-\"),0)","v":0},{"$f":"IF(AND(COUNTRY_INFO!J48>1,COUNTRY_INFO!J48<4),IF(COUNTRY_INFO!F48>MAX('MDA1'!K48,'MDA4'!O48,'T1'!M48,MAX(T3_R1!L48,T3_R2!L48)),MAX('MDA1'!K48,'MDA4'!O48,'T1'!M48,MAX(T3_R1!L48,T3_R2!L48)),COUNTRY_INFO!F48),0)","v":0},{"$f":"IF(AND(COUNTRY_INFO!J48>1,COUNTRY_INFO!J48<4), IF(V48/COUNTRY_INFO!F48*100<>0, IF(V48/COUNTRY_INFO!F48*100>100,100,V48/COUNTRY_INFO!F48*100), \"-\"),0)","v":0},0,{"$f":"IF(AND(COUNTRY_INFO!J48>1,COUNTRY_INFO!J48<4), IF(S48/P48*100<>0, IF(X48/P48*100>100,100,X48/P48*100), \"-\"),0)","v":0},{"$f":"COUNTRY_INFO!P48","v":"Inconnu"},null,null,{"$f":"MAX('T1'!L48,'T2'!J48)+MAX('T1'!M48,'T2'!K48)+MAX('T1'!N48,'T2'!L48)","v":0},{"$f":"IF(COUNTRY_INFO!K48=1,IF(COUNTRY_INFO!F48*0.33>MAX('T1'!M48,'T2'!K48),MAX('T1'!M48,'T2'!K48),COUNTRY_INFO!F48*0.33),IF(COUNTRY_INFO!K48=2,IF(COUNTRY_INFO!F48*0.5>MAX('T1'!M48,'T2'!K48),MAX('T1'!M48,'T2'!K48),COUNTRY_INFO!F48*0.5),IF(COUNTRY_INFO!K48=3,IF(COUNTRY_INFO!F48>MAX('T1'!M48,'T2'!K48),MAX('T1'!M48,'T2'!K48),COUNTRY_INFO!F48),0)))","v":0},{"$f":"IF(AND(COUNTRY_INFO!K48>0,COUNTRY_INFO!K48<4),IF(Z48>0,IF(COUNTRY_INFO!K48=1, AD48/(COUNTRY_INFO!F48*0.33)*100, IF(COUNTRY_INFO!K48=2, AD48/(COUNTRY_INFO!F48*0.5)*100, IF(COUNTRY_INFO!K48=3, AD48/COUNTRY_INFO!F48*100))),\"-\"),0)","v":0},{"$f":"IF(COUNTRY_INFO!K48=2,IF(COUNTRY_INFO!G48*0.2>MAX('T1'!N48,'T2'!L48),MAX('T1'!N48,'T2'!L48),COUNTRY_INFO!G48*0.2),IF(COUNTRY_INFO!K48=3,IF(COUNTRY_INFO!G48>MAX('T1'!N48,'T2'!L48),MAX('T1'!N48,'T2'!L48),COUNTRY_INFO!G48),0))","v":0},{"$f":"IF(AND(COUNTRY_INFO!K48>0,COUNTRY_INFO!K48<4),IF(Z48>0,IF(COUNTRY_INFO!K48=1, 0, IF(COUNTRY_INFO!K48=2, AF48/(COUNTRY_INFO!G48*0.2)*100, IF(COUNTRY_INFO!K48=3, AF48/COUNTRY_INFO!G48*100))),\"-\"),0)","v":0},0,{"$f":"IF(AND(COUNTRY_INFO!K48>0,COUNTRY_INFO!K48<4), IF(AC48/Z48*100<>0, IF(AH48/Z48*100>100,100,AH48/Z48*100), \"-\"),0)","v":0},null,{"$f":"IF(AND(D48<>0, D48<>\"Inconnu\",D48<>\"Interrompu\",D48<>\"Non requis\"),D48/COUNTRY_INFO!D48, 0)","v":0},{"$f":"IF(AND(J48<>0,J48<>\"Inconnu\",J48<>\"Interrompu\",J48<>\"Non requis\"),J48/COUNTRY_INFO!D48, 0)","v":0},{"$f":"IF(AND(P48<>0,P48<>\"Inconnu\",P48<>\"Non requis\"),P48/(COUNTRY_INFO!E48+COUNTRY_INFO!F48), 0)","v":0},{"$f":"IF(AND(Z48<>0,Z48<>\"Inconnu\",Z48<>\"Non requis\"),IF(COUNTRY_INFO!K48=1,1,IF(COUNTRY_INFO!K48=2,0.5*COUNTRY_INFO!F48/(0.5*COUNTRY_INFO!F48+0.2*COUNTRY_INFO!G48),IF(COUNTRY_INFO!K48=3,COUNTRY_INFO!F48/(COUNTRY_INFO!F48+COUNTRY_INFO!G48)))),0)","v":0},{"$f":"IF(AND(Z48<>0,Z48<>\"Inconnu\",Z48<>\"Non requis\"),IF(COUNTRY_INFO!K48=1,0,IF(COUNTRY_INFO!K48=2,0.2*COUNTRY_INFO!G48/(0.5*COUNTRY_INFO!F48+0.2*COUNTRY_INFO!G48),IF(COUNTRY_INFO!K48=3,COUNTRY_INFO!G48/(COUNTRY_INFO!F48+COUNTRY_INFO!G48)))),0)","v":0},{"$f":"MAX(COUNTRY_INFO!D48*AK48*PROFILE!$G$7,COUNTRY_INFO!D48*AL48*PROFILE!$G$7)","v":0},{"$f":"MAX(COUNTRY_INFO!D48*AK48*PROFILE!$G$8,COUNTRY_INFO!D48*AL48*PROFILE!$G$8,COUNTRY_INFO!D48*AM48*PROFILE!$G$8)","v":0},{"$f":"MAX(COUNTRY_INFO!D48*AK48*PROFILE!$G$9,COUNTRY_INFO!D48*AL48*PROFILE!$G$9,COUNTRY_INFO!D48*AM48*PROFILE!$G$9,IF(AND(DISTRICT!Z48<>\"Inconnu\",Z48<>\"Non requis\"),COUNTRY_INFO!P48*DISTRICT!AN48,0))","v":0},{"$f":"MAX(COUNTRY_INFO!D48*AK48*PROFILE!$G$10,COUNTRY_INFO!D48*AL48*PROFILE!$G$10,IF(AND(DISTRICT!Z48<>\"Inconnu\",Z48<>\"Non requis\"),COUNTRY_INFO!P48*DISTRICT!AO48,0))","v":0},0,0,{"$f":"MAX('MDA4'!R48,'T1'!L48,'T2'!J48,T3_R1!K48,T3_R2!K48)","v":0},{"$f":"MAX('MDA1'!K48,'MDA4'!S48,'MDA3'!I48,'MDA3'!L48,'T1'!M48,'T2'!K48,T3_R1!L48,T3_R2!L48)","v":0},{"$f":"MAX('MDA1'!L48,'MDA4'!T48,'MDA3'!J48,'MDA3'!M48,'T1'!N48,'T2'!L48,T3_R1!M48,T3_R2!M48)","v":0},0,{"$f":"MAX('MDA4'!R48,T48)","v":0},{"$f":"MAX('MDA1'!K48,'MDA4'!S48,'MDA3'!I48,'MDA3'!L48,V48,AD48)","v":0},{"$f":"MAX('MDA1'!L48,'MDA4'!T48,'MDA3'!J48,'MDA3'!M48,AF48)","v":0},0,0]
[{"$f":"IF(COUNTRY_INFO!A49=0,\" \",COUNTRY_INFO!A49)","v":" Congo"},{"$f":"IF(COUNTRY_INFO!B49=0,\" \",COUNTRY_INFO!B49)","v":"Pointe-Noire"},{"$f":"IF(COUNTRY_INFO!C49=0,\" \",COUNTRY_INFO!C49)","v":"Ngoyo"},{"$f":"COUNTRY_INFO!M49","v":0},null,null,{"$f":"SUM('MDA1'!M49,'MDA4'!U49)","v":0},{"$f":"IF(AND(COUNTRY_INFO!H49>0,COUNTRY_INFO!H49<4),IF(D49>MAX('MDA1'!M49,'MDA4'!U49),MAX('MDA1'!M49,'MDA4'!U49),D49),0)","v":0},{"$f":"IF(AND(COUNTRY_INFO!H49>0,COUNTRY_INFO!H49<4), IF(G49/D49*100<>0, IF(G49/D49*100>100,100,G49/D49*100), \"-\"),0)","v":0},{"$f":"COUNTRY_INFO!N49","v":0},null,null,{"$f":"MAX('MDA1'!M49,MAX('MDA3'!I49,'MDA3'!L49)+MAX('MDA3'!J49,'MDA3'!M49))","v":0},{"$f":"IF(AND(COUNTRY_INFO!I49>0,COUNTRY_INFO!I49<4),IF(J49>MAX('MDA1'!M49,MAX('MDA3'!I49,'MDA3'!L49)+MAX('MDA3'!J49,'MDA3'!M49)),MAX('MDA1'!M49,MAX('MDA3'!I49,'MDA3'!L49)+MAX('MDA3'!J49,'MDA3'!M49)),J49),0)","v":0},{"$f":"IF(AND(COUNTRY_INFO!I49>0,COUNTRY_INFO!I49<4), IF(M49/J49*100<>0, IF(M49/J49*100>100,100,M49/J49*100), \"-\"),0)","v":0},{"$f":"COUNTRY_INFO!O49","v":80357},null,null,{"$f":"SUM(MAX('MDA4'!N49, 'T1'!L49, MAX(T3_R1!K49, T3_R2!K49)), MAX('MDA1'!K49, 'MDA4'!O49, 'T1'!M49, MAX(T3_R1!L49, T3_R2!L49)), MAX('MDA1'!L49, 'MDA4'!P49, 'T1'!N49, MAX(T3_R1!M49, T3_R2!M49)))","v":0},{"$f":"IF(AND(COUNTRY_INFO!J49>1,COUNTRY_INFO!J49<4),IF(COUNTRY_INFO!E49>MAX('MDA4'!N49,'T1'!L49,MAX(T3_R1!K49,T3_R2!K49)),MAX('MDA4'!N49,'T1'!L49,MAX(T3_R1!K49,T3_R2!K49)),COUNTRY_INFO!E49),0)","v":0},{"$f":"IF(AND(COUNTRY_INFO!J49>1,COUNTRY_INFO!J49<4), IF(T49/COUNTRY_INFO!E49*100<>0, IF(T49/COUNTRY_INFO!E49*100>100,100,T49/COUNTRY_INFO!E49*100), \"-\"),0)","v":"-"},{"$f":"IF(AND(COUNTRY_INFO!J49>1,COUNTRY_INFO!J49<4),IF(COUNTRY_INFO!F49>MAX('MDA1'!K49,'MDA4'!O49,'T1'!M49,MAX(T3_R1!L49,T3_R2!L49)),MAX('MDA1'!K49,'MDA4'!O49,'T1'!M49,MAX(T3_R1!L49,T3_R2!L49)),COUNTRY_INFO!F49),0)","v":0},{"$f":"IF(AND(COUNTRY_INFO!J49>1,COUNTRY_INFO!J49<4), IF(V49/COUNTRY_INFO!F49*100<>0, IF(V49/COUNTRY_INFO!F49*100>100,100,V49/COUNTRY_INFO!F49*100), \"-\"),0)","v":"-"},0,{"$f":"IF(AND(COUNTRY_INFO!J49>1,COUNTRY_INFO!J49<4), IF(S49/P49*100<>0, IF(X49/P49*100>100,100,X49/P49*100), \"-\"),0)","v":"-"},{"$f":"COUNTRY_INFO!P49","v":0},null,null,{"$f":"MAX('T1'!L49,'T2'!J49)+MAX('T1'!M49,'T2'!K49)+MAX('T1'!N49,'T2'!L49)","v":0},{"$f":"IF(COUNTRY_INFO!K49=1,IF(COUNTRY_INFO!F49*0.33>MAX('T1'!M49,'T2'!K49),MAX('T1'!M49,'T2'!K49),COUNTRY_INFO!F49*0.33),IF(COUNTRY_INFO!K49=2,IF(COUNTRY_INFO!F49*0.5>MAX('T1'!M49,'T2'!K49),MAX('T1'!M49,'T2'!K49),COUNTRY_INFO!F49*0.5),IF(COUNTRY_INFO!K49=3,IF(COUNTRY_INFO!F49>MAX('T1'!M49,'T2'!K49),MAX('T1'!M49,'T2'!K49),COUNTRY_INFO!F49),0)))","v":0},{"$f":"IF(AND(COUNTRY_INFO!K49>0,COUNTRY_INFO!K49<4),IF(Z49>0,IF(COUNTRY_INFO!K49=1, AD49/(COUNTRY_INFO!F49*0.33)*100, IF(COUNTRY_INFO!K49=2, AD49/(COUNTRY_INFO!F49*0.5)*100, IF(COUNTRY_INFO!K49=3, AD49/COUNTRY_INFO!F49*100))),\"-\"),0)","v":0},{"$f":"IF(COUNTRY_INFO!K49=2,IF(COUNTRY_INFO!G49*0.2>MAX('T1'!N49,'T2'!L49),MAX('T1'!N49,'T2'!L49),COUNTRY_INFO!G49*0.2),IF(COUNTRY_INFO!K49=3,IF(COUNTRY_INFO!G49>MAX('T1'!N49,'T2'!L49),MAX('T1'!N49,'T2'!L49),COUNTRY_INFO!G49),0))","v":0},{"$f":"IF(AND(COUNTRY_INFO!K49>0,COUNTRY_INFO!K49<4),IF(Z49>0,IF(COUNTRY_INFO!K49=1, 0, IF(COUNTRY_INFO!K49=2, AF49/(COUNTRY_INFO!G49*0.2)*100, IF(COUNTRY_INFO!K49=3, AF49/COUNTRY_INFO!G49*100))),\"-\"),0)","v":0},0,{"$f":"IF(AND(COUNTRY_INFO!K49>0,COUNTRY_INFO!K49<4), IF(AC49/Z49*100<>0, IF(AH49/Z49*100>100,100,AH49/Z49*100), \"-\"),0)","v":0},null,{"$f":"IF(AND(D49<>0, D49<>\"Inconnu\",D49<>\"Interrompu\",D49<>\"Non requis\"),D49/COUNTRY_INFO!D49, 0)","v":0},{"$f":"IF(AND(J49<>0,J49<>\"Inconnu\",J49<>\"Interrompu\",J49<>\"Non requis\"),J49/COUNTRY_INFO!D49, 0)","v":0},{"$f":"IF(AND(P49<>0,P49<>\"Inconnu\",P49<>\"Non requis\"),P49/(COUNTRY_INFO!E49+COUNTRY_INFO!F49), 0)","v":1},{"$f":"IF(AND(Z49<>0,Z49<>\"Inconnu\",Z49<>\"Non requis\"),IF(COUNTRY_INFO!K49=1,1,IF(COUNTRY_INFO!K49=2,0.5*COUNTRY_INFO!F49/(0.5*COUNTRY_INFO!F49+0.2*COUNTRY_INFO!G49),IF(COUNTRY_INFO!K49=3,COUNTRY_INFO!F49/(COUNTRY_INFO!F49+COUNTRY_INFO!G49)))),0)","v":0},{"$f":"IF(AND(Z49<>0,Z49<>\"Inconnu\",Z49<>\"Non requis\"),IF(COUNTRY_INFO!K49=1,0,IF(COUNTRY_INFO!K49=2,0.2*COUNTRY_INFO!G49/(0.5*COUNTRY_INFO!F49+0.2*COUNTRY_INFO!G49),IF(COUNTRY_INFO!K49=3,COUNTRY_INFO!G49/(COUNTRY_INFO!F49+COUNTRY_INFO!G49)))),0)","v":0},{"$f":"MAX(COUNTRY_INFO!D49*AK49*PROFILE!$G$7,COUNTRY_INFO!D49*AL49*PROFILE!$G$7)","v":0},{"$f":"MAX(COUNTRY_INFO!D49*AK49*PROFILE!$G$8,COUNTRY_INFO!D49*AL49*PROFILE!$G$8,COUNTRY_INFO!D49*AM49*PROFILE!$G$8)","v":32142.876979982477},{"$f":"MAX(COUNTRY_INFO!D49*AK49*PROFILE!$G$9,COUNTRY_INFO!D49*AL49*PROFILE!$G$9,COUNTRY_INFO!D49*AM49*PROFILE!$G$9,IF(AND(DISTRICT!Z49<>\"Inconnu\",Z49<>\"Non requis\"),COUNTRY_INFO!P49*DISTRICT!AN49,0))","v":48214.239969535694},{"$f":"MAX(COUNTRY_INFO!D49*AK49*PROFILE!$G$10,COUNTRY_INFO!D49*AL49*PROFILE!$G$10,IF(AND(DISTRICT!Z49<>\"Inconnu\",Z49<>\"Non requis\"),COUNTRY_INFO!P49*DISTRICT!AO49,0))","v":0},80357.116949518168,0,{"$f":"MAX('MDA4'!R49,'T1'!L49,'T2'!J49,T3_R1!K49,T3_R2!K49)","v":0},{"$f":"MAX('MDA1'!K49,'MDA4'!S49,'MDA3'!I49,'MDA3'!L49,'T1'!M49,'T2'!K49,T3_R1!L49,T3_R2!L49)","v":0},{"$f":"MAX('MDA1'!L49,'MDA4'!T49,'MDA3'!J49,'MDA3'!M49,'T1'!N49,'T2'!L49,T3_R1!M49,T3_R2!M49)","v":0},0,{"$f":"MAX('MDA4'!R49,T49)","v":0},{"$f":"MAX('MDA1'!K49,'MDA4'!S49,'MDA3'!I49,'MDA3'!L49,V49,AD49)","v":0},{"$f":"MAX('MDA1'!L49,'MDA4'!T49,'MDA3'!J49,'MDA3'!M49,AF49)","v":0},0,0]
[{"$f":"IF(COUNTRY_INFO!A50=0,\" \",COUNTRY_INFO!A50)","v":" Congo"},{"$f":"IF(COUNTRY_INFO!B50=0,\" \",COUNTRY_INFO!B50)","v":"Pointe-Noire"},{"$f":"IF(COUNTRY_INFO!C50=0,\" \",COUNTRY_INFO!C50)","v":"Tchiamba Nzassi"},{"$f":"COUNTRY_INFO!M50","v":0},null,null,{"$f":"SUM('MDA1'!M50,'MDA4'!U50)","v":0},{"$f":"IF(AND(COUNTRY_INFO!H50>0,COUNTRY_INFO!H50<4),IF(D50>MAX('MDA1'!M50,'MDA4'!U50),MAX('MDA1'!M50,'MDA4'!U50),D50),0)","v":0},{"$f":"IF(AND(COUNTRY_INFO!H50>0,COUNTRY_INFO!H50<4), IF(G50/D50*100<>0, IF(G50/D50*100>100,100,G50/D50*100), \"-\"),0)","v":0},{"$f":"COUNTRY_INFO!N50","v":0},null,null,{"$f":"MAX('MDA1'!M50,MAX('MDA3'!I50,'MDA3'!L50)+MAX('MDA3'!J50,'MDA3'!M50))","v":0},{"$f":"IF(AND(COUNTRY_INFO!I50>0,COUNTRY_INFO!I50<4),IF(J50>MAX('MDA1'!M50,MAX('MDA3'!I50,'MDA3'!L50)+MAX('MDA3'!J50,'MDA3'!M50)),MAX('MDA1'!M50,MAX('MDA3'!I50,'MDA3'!L50)+MAX('MDA3'!J50,'MDA3'!M50)),J50),0)","v":0},{"$f":"IF(AND(COUNTRY_INFO!I50>0,COUNTRY_INFO!I50<4), IF(M50/J50*100<>0, IF(M50/J50*100>100,100,M50/J50*100), \"-\"),0)","v":0},{"$f":"COUNTRY_INFO!O50","v":10668},null,null,{"$f":"SUM(MAX('MDA4'!N50, 'T1'!L50, MAX(T3_R1!K50, T3_R2!K50)), MAX('MDA1'!K50, 'MDA4'!O50, 'T1'!M50, MAX(T3_R1!L50, T3_R2!L50)), MAX('MDA1'!L50, 'MDA4'!P50, 'T1'!N50, MAX(T3_R1!M50, T3_R2!M50)))","v":0},{"$f":"IF(AND(COUNTRY_INFO!J50>1,COUNTRY_INFO!J50<4),IF(COUNTRY_INFO!E50>MAX('MDA4'!N50,'T1'!L50,MAX(T3_R1!K50,T3_R2!K50)),MAX('MDA4'!N50,'T1'!L50,MAX(T3_R1!K50,T3_R2!K50)),COUNTRY_INFO!E50),0)","v":0},{"$f":"IF(AND(COUNTRY_INFO!J50>1,COUNTRY_INFO!J50<4), IF(T50/COUNTRY_INFO!E50*100<>0, IF(T50/COUNTRY_INFO!E50*100>100,100,T50/COUNTRY_INFO!E50*100), \"-\"),0)","v":"-"},{"$f":"IF(AND(COUNTRY_INFO!J50>1,COUNTRY_INFO!J50<4),IF(COUNTRY_INFO!F50>MAX('MDA1'!K50,'MDA4'!O50,'T1'!M50,MAX(T3_R1!L50,T3_R2!L50)),MAX('MDA1'!K50,'MDA4'!O50,'T1'!M50,MAX(T3_R1!L50,T3_R2!L50)),COUNTRY_INFO!F50),0)","v":0},{"$f":"IF(AND(COUNTRY_INFO!J50>1,COUNTRY_INFO!J50<4), IF(V50/COUNTRY_INFO!F50*100<>0, IF(V50/COUNTRY_INFO!F50*100>100,100,V50/COUNTRY_INFO!F50*100), \"-\"),0)","v":"-"},0,{"$f":"IF(AND(COUNTRY_INFO!J50>1,COUNTRY_INFO!J50<4), IF(S50/P50*100<>0, IF(X50/P50*100>100,100,X50/P50*100), \"-\"),0)","v":"-"},{"$f":"COUNTRY_INFO!P50","v":2112.33},null,null,{"$f":"MAX('T1'!L50,'T2'!J50)+MAX('T1'!M50,'T2'!K50)+MAX('T1'!N50,'T2'!L50)","v":0},{"$f":"IF(COUNTRY_INFO!K50=1,IF(COUNTRY_INFO!F50*0.33>MAX('T1'!M50,'T2'!K50),MAX('T1'!M50,'T2'!K50),COUNTRY_INFO!F50*0.33),IF(COUNTRY_INFO!K50=2,IF(COUNTRY_INFO!F50*0.5>MAX('T1'!M50,'T2'!K50),MAX('T1'!M50,'T2'!K50),COUNTRY_INFO!F50*0.5),IF(COUNTRY_INFO!K50=3,IF(COUNTRY_INFO!F50>MAX('T1'!M50,'T2'!K50),MAX('T1'!M50,'T2'!K50),COUNTRY_INFO!F50),0)))","v":0},{"$f":"IF(AND(COUNTRY_INFO!K50>0,COUNTRY_INFO!K50<4),IF(Z50>0,IF(COUNTRY_INFO!K50=1, AD50/(COUNTRY_INFO!F50*0.33)*100, IF(COUNTRY_INFO!K50=2, AD50/(COUNTRY_INFO!F50*0.5)*100, IF(COUNTRY_INFO!K50=3, AD50/COUNTRY_INFO!F50*100))),\"-\"),0)","v":0},{"$f":"IF(COUNTRY_INFO!K50=2,IF(COUNTRY_INFO!G50*0.2>MAX('T1'!N50,'T2'!L50),MAX('T1'!N50,'T2'!L50),COUNTRY_INFO!G50*0.2),IF(COUNTRY_INFO!K50=3,IF(COUNTRY_INFO!G50>MAX('T1'!N50,'T2'!L50),MAX('T1'!N50,'T2'!L50),COUNTRY_INFO!G50),0))","v":0},{"$f":"IF(AND(COUNTRY_INFO!K50>0,COUNTRY_INFO!K50<4),IF(Z50>0,IF(COUNTRY_INFO!K50=1, 0, IF(COUNTRY_INFO!K50=2, AF50/(COUNTRY_INFO!G50*0.2)*100, IF(COUNTRY_INFO!K50=3, AF50/COUNTRY_INFO!G50*100))),\"-\"),0)","v":0},0,{"$f":"IF(AND(COUNTRY_INFO!K50>0,COUNTRY_INFO!K50<4), IF(AC50/Z50*100<>0, IF(AH50/Z50*100>100,100,AH50/Z50*100), \"-\"),0)","v":"-"},null,{"$f":"IF(AND(D50<>0, D50<>\"Inconnu\",D50<>\"Interrompu\",D50<>\"Non requis\"),D50/COUNTRY_INFO!D50, 0)","v":0},{"$f":"IF(AND(J50<>0,J50<>\"Inconnu\",J50<>\"Interrompu\",J50<>\"Non requis\"),J50/COUNTRY_INFO!D50, 0)","v":0},{"$f":"IF(AND(P50<>0,P50<>\"Inconnu\",P50<>\"Non requis\"),P50/(COUNTRY_INFO!E50+COUNTRY_INFO!F50), 0)","v":1},{"$f":"IF(AND(Z50<>0,Z50<>\"Inconnu\",Z50<>\"Non requis\"),IF(COUNTRY_INFO!K50=1,1,IF(COUNTRY_INFO!K50=2,0.5*COUNTRY_INFO!F50/(0.5*COUNTRY_INFO!F50+0.2*COUNTRY_INFO!G50),IF(COUNTRY_INFO!K50=3,COUNTRY_INFO!F50/(COUNTRY_INFO!F50+COUNTRY_INFO!G50)))),0)","v":1},{"$f":"IF(AND(Z50<>0,Z50<>\"Inconnu\",Z50<>\"Non requis\"),IF(COUNTRY_INFO!K50=1,0,IF(COUNTRY_INFO!K50=2,0.2*COUNTRY_INFO!G50/(0.5*COUNTRY_INFO!F50+0.2*COUNTRY_INFO!G50),IF(COUNTRY_INFO!K50=3,COUNTRY_INFO!G50/(COUNTRY_INFO!F50+COUNTRY_INFO!G50)))),0)","v":0},{"$f":"MAX(COUNTRY_INFO!D50*AK50*PROFILE!$G$7,COUNTRY_INFO!D50*AL50*PROFILE!$G$7)","v":0},{"$f":"MAX(COUNTRY_INFO!D50*AK50*PROFILE!$G$8,COUNTRY_INFO!D50*AL50*PROFILE!$G$8,COUNTRY_INFO!D50*AM50*PROFILE!$G$8)","v":4267.0395990858451},{"$f":"MAX(COUNTRY_INFO!D50*AK50*PROFILE!$G$9,COUNTRY_INFO!D50*AL50*PROFILE!$G$9,COUNTRY_INFO!D50*AM50*PROFILE!$G$9,IF(AND(DISTRICT!Z50<>\"Inconnu\",Z50<>\"Non requis\"),COUNTRY_INFO!P50*DISTRICT!AN50,0))","v":6400.5493757749027},{"$f":"MAX(COUNTRY_INFO!D50*AK50*PROFILE!$G$10,COUNTRY_INFO!D50*AL50*PROFILE!$G$10,IF(AND(DISTRICT!Z50<>\"Inconnu\",Z50<>\"Non requis\"),COUNTRY_INFO!P50*DISTRICT!AO50,0))","v":0},10667.588974860748,0,{"$f":"MAX('MDA4'!R50,'T1'!L50,'T2'!J50,T3_R1!K50,T3_R2!K50)","v":0},{"$f":"MAX('MDA1'!K50,'MDA4'!S50,'MDA3'!I50,'MDA3'!L50,'T1'!M50,'T2'!K50,T3_R1!L50,T3_R2!L50)","v":0},{"$f":"MAX('MDA1'!L50,'MDA4'!T50,'MDA3'!J50,'MDA3'!M50,'T1'!N50,'T2'!L50,T3_R1!M50,T3_R2!M50)","v":0},0,{"$f":"MAX('MDA4'!R50,T50)","v":0},{"$f":"MAX('MDA1'!K50,'MDA4'!S50,'MDA3'!I50,'MDA3'!L50,V50,AD50)","v":0},{"$f":"MAX('MDA1'!L50,'MDA4'!T50,'MDA3'!J50,'MDA3'!M50,AF50)","v":0},0,0]
[{"$f":"IF(COUNTRY_INFO!A51=0,\" \",COUNTRY_INFO!A51)","v":" Congo"},{"$f":"IF(COUNTRY_INFO!B51=0,\" \",COUNTRY_INFO!B51)","v":"Pointe-Noire"},{"$f":"IF(COUNTRY_INFO!C51=0,\" \",COUNTRY_INFO!C51)","v":"Tie-Tie"},{"$f":"COUNTRY_INFO!M51","v":0},null,null,{"$f":"SUM('MDA1'!M51,'MDA4'!U51)","v":0},{"$f":"IF(AND(COUNTRY_INFO!H51>0,COUNTRY_INFO!H51<4),IF(D51>MAX('MDA1'!M51,'MDA4'!U51),MAX('MDA1'!M51,'MDA4'!U51),D51),0)","v":0},{"$f":"IF(AND(COUNTRY_INFO!H51>0,COUNTRY_INFO!H51<4), IF(G51/D51*100<>0, IF(G51/D51*100>100,100,G51/D51*100), \"-\"),0)","v":0},{"$f":"COUNTRY_INFO!N51","v":0},null,null,{"$f":"MAX('MDA1'!M51,MAX('MDA3'!I51,'MDA3'!L51)+MAX('MDA3'!J51,'MDA3'!M51))","v":0},{"$f":"IF(AND(COUNTRY_INFO!I51>0,COUNTRY_INFO!I51<4),IF(J51>MAX('MDA1'!M51,MAX('MDA3'!I51,'MDA3'!L51)+MAX('MDA3'!J51,'MDA3'!M51)),MAX('MDA1'!M51,MAX('MDA3'!I51,'MDA3'!L51)+MAX('MDA3'!J51,'MDA3'!M51)),J51),0)","v":0},{"$f":"IF(AND(COUNTRY_INFO!I51>0,COUNTRY_INFO!I51<4), IF(M51/J51*100<>0, IF(M51/J51*100>100,100,M51/J51*100), \"-\"),0)","v":0},{"$f":"COUNTRY_INFO!O51","v":0},null,null,{"$f":"SUM(MAX('MDA4'!N51, 'T1'!L51, MAX(T3_R1!K51, T3_R2!K51)), MAX('MDA1'!K51, 'MDA4'!O51, 'T1'!M51, MAX(T3_R1!L51, T3_R2!L51)), MAX('MDA1'!L51, 'MDA4'!P51, 'T1'!N51, MAX(T3_R1!M51, T3_R2!M51)))","v":0},{"$f":"IF(AND(COUNTRY_INFO!J51>1,COUNTRY_INFO!J51<4),IF(COUNTRY_INFO!E51>MAX('MDA4'!N51,'T1'!L51,MAX(T3_R1!K51,T3_R2!K51)),MAX('MDA4'!N51,'T1'!L51,MAX(T3_R1!K51,T3_R2!K51)),COUNTRY_INFO!E51),0)","v":0},{"$f":"IF(AND(COUNTRY_INFO!J51>1,COUNTRY_INFO!J51<4), IF(T51/COUNTRY_INFO!E51*100<>0, IF(T51/COUNTRY_INFO!E51*100>100,100,T51/COUNTRY_INFO!E51*100), \"-\"),0)","v":0},{"$f":"IF(AND(COUNTRY_INFO!J51>1,COUNTRY_INFO!J51<4),IF(COUNTRY_INFO!F51>MAX('MDA1'!K51,'MDA4'!O51,'T1'!M51,MAX(T3_R1!L51,T3_R2!L51)),MAX('MDA1'!K51,'MDA4'!O51,'T1'!M51,MAX(T3_R1!L51,T3_R2!L51)),COUNTRY_INFO!F51),0)","v":0},{"$f":"IF(AND(COUNTRY_INFO!J51>1,COUNTRY_INFO!J51<4), IF(V51/COUNTRY_INFO!F51*100<>0, IF(V51/COUNTRY_INFO!F51*100>100,100,V51/COUNTRY_INFO!F51*100), \"-\"),0)","v":0},0,{"$f":"IF(AND(COUNTRY_INFO!J51>1,COUNTRY_INFO!J51<4), IF(S51/P51*100<>0, IF(X51/P51*100>100,100,X51/P51*100), \"-\"),0)","v":0},{"$f":"COUNTRY_INFO!P51","v":0},null,null,{"$f":"MAX('T1'!L51,'T2'!J51)+MAX('T1'!M51,'T2'!K51)+MAX('T1'!N51,'T2'!L51)","v":0},{"$f":"IF(COUNTRY_INFO!K51=1,IF(COUNTRY_INFO!F51*0.33>MAX('T1'!M51,'T2'!K51),MAX('T1'!M51,'T2'!K51),COUNTRY_INFO!F51*0.33),IF(COUNTRY_INFO!K51=2,IF(COUNTRY_INFO!F51*0.5>MAX('T1'!M51,'T2'!K51),MAX('T1'!M51,'T2'!K51),COUNTRY_INFO!F51*0.5),IF(COUNTRY_INFO!K51=3,IF(COUNTRY_INFO!F51>MAX('T1'!M51,'T2'!K51),MAX('T1'!M51,'T2'!K51),COUNTRY_INFO!F51),0)))","v":0},{"$f":"IF(AND(COUNTRY_INFO!K51>0,COUNTRY_INFO!K51<4),IF(Z51>0,IF(COUNTRY_INFO!K51=1, AD51/(COUNTRY_INFO!F51*0.33)*100, IF(COUNTRY_INFO!K51=2, AD51/(COUNTRY_INFO!F51*0.5)*100, IF(COUNTRY_INFO!K51=3, AD51/COUNTRY_INFO!F51*100))),\"-\"),0)","v":0},{"$f":"IF(COUNTRY_INFO!K51=2,IF(COUNTRY_INFO!G51*0.2>MAX('T1'!N51,'T2'!L51),MAX('T1'!N51,'T2'!L51),COUNTRY_INFO!G51*0.2),IF(COUNTRY_INFO!K51=3,IF(COUNTRY_INFO!G51>MAX('T1'!N51,'T2'!L51),MAX('T1'!N51,'T2'!L51),COUNTRY_INFO!G51),0))","v":0},{"$f":"IF(AND(COUNTRY_INFO!K51>0,COUNTRY_INFO!K51<4),IF(Z51>0,IF(COUNTRY_INFO!K51=1, 0, IF(COUNTRY_INFO!K51=2, AF51/(COUNTRY_INFO!G51*0.2)*100, IF(COUNTRY_INFO!K51=3, AF51/COUNTRY_INFO!G51*100))),\"-\"),0)","v":0},0,{"$f":"IF(AND(COUNTRY_INFO!K51>0,COUNTRY_INFO!K51<4), IF(AC51/Z51*100<>0, IF(AH51/Z51*100>100,100,AH51/Z51*100), \"-\"),0)","v":0},null,{"$f":"IF(AND(D51<>0, D51<>\"Inconnu\",D51<>\"Interrompu\",D51<>\"Non requis\"),D51/COUNTRY_INFO!D51, 0)","v":0},{"$f":"IF(AND(J51<>0,J51<>\"Inconnu\",J51<>\"Interrompu\",J51<>\"Non requis\"),J51/COUNTRY_INFO!D51, 0)","v":0},{"$f":"IF(AND(P51<>0,P51<>\"Inconnu\",P51<>\"Non requis\"),P51/(COUNTRY_INFO!E51+COUNTRY_INFO!F51), 0)","v":0},{"$f":"IF(AND(Z51<>0,Z51<>\"Inconnu\",Z51<>\"Non requis\"),IF(COUNTRY_INFO!K51=1,1,IF(COUNTRY_INFO!K51=2,0.5*COUNTRY_INFO!F51/(0.5*COUNTRY_INFO!F51+0.2*COUNTRY_INFO!G51),IF(COUNTRY_INFO!K51=3,COUNTRY_INFO!F51/(COUNTRY_INFO!F51+COUNTRY_INFO!G51)))),0)","v":0},{"$f":"IF(AND(Z51<>0,Z51<>\"Inconnu\",Z51<>\"Non requis\"),IF(COUNTRY_INFO!K51=1,0,IF(COUNTRY_INFO!K51=2,0.2*COUNTRY_INFO!G51/(0.5*COUNTRY_INFO!F51+0.2*COUNTRY_INFO!G51),IF(COUNTRY_INFO!K51=3,COUNTRY_INFO!G51/(COUNTRY_INFO!F51+COUNTRY_INFO!G51)))),0)","v":0},{"$f":"MAX(COUNTRY_INFO!D51*AK51*PROFILE!$G$7,COUNTRY_INFO!D51*AL51*PROFILE!$G$7)","v":0},{"$f":"MAX(COUNTRY_INFO!D51*AK51*PROFILE!$G$8,COUNTRY_INFO!D51*AL51*PROFILE!$G$8,COUNTRY_INFO!D51*AM51*PROFILE!$G$8)","v":0},{"$f":"MAX(COUNTRY_INFO!D51*AK51*PROFILE!$G$9,COUNTRY_INFO!D51*AL51*PROFILE!$G$9,COUNTRY_INFO!D51*AM51*PROFILE!$G$9,IF(AND(DISTRICT!Z51<>\"Inconnu\",Z51<>\"Non requis\"),COUNTRY_INFO!P51*DISTRICT!AN51,0))","v":0},{"$f":"MAX(COUNTRY_INFO!D51*AK51*PROFILE!$G$10,COUNTRY_INFO!D51*AL51*PROFILE!$G$10,IF(AND(DISTRICT!Z51<>\"Inconnu\",Z51<>\"Non requis\"),COUNTRY_INFO!P51*DISTRICT!AO51,0))","v":0},0,0,{"$f":"MAX('MDA4'!R51,'T1'!L51,'T2'!J51,T3_R1!K51,T3_R2!K51)","v":0},{"$f":"MAX('MDA1'!K51,'MDA4'!S51,'MDA3'!I51,'MDA3'!L51,'T1'!M51,'T2'!K51,T3_R1!L51,T3_R2!L51)","v":0},{"$f":"MAX('MDA1'!L51,'MDA4'!T51,'MDA3'!J51,'MDA3'!M51,'T1'!N51,'T2'!L51,T3_R1!M51,T3_R2!M51)","v":0},0,{"$f":"MAX('MDA4'!R51,T51)","v":0},{"$f":"MAX('MDA1'!K51,'MDA4'!S51,'MDA3'!I51,'MDA3'!L51,V51,AD51)","v":0},{"$f":"MAX('MDA1'!L51,'MDA4'!T51,'MDA3'!J51,'MDA3'!M51,AF51)","v":0},0,0]
[{"$f":"IF(COUNTRY_INFO!A52=0,\" \",COUNTRY_INFO!A52)","v":" Congo"},{"$f":"IF(COUNTRY_INFO!B52=0,\" \",COUNTRY_INFO!B52)","v":"Pool"},{"$f":"IF(COUNTRY_INFO!C52=0,\" \",COUNTRY_INFO!C52)","v":"Boko"},{"$f":"COUNTRY_INFO!M52","v":0},null,null,{"$f":"SUM('MDA1'!M52,'MDA4'!U52)","v":0},{"$f":"IF(AND(COUNTRY_INFO!H52>0,COUNTRY_INFO!H52<4),IF(D52>MAX('MDA1'!M52,'MDA4'!U52),MAX('MDA1'!M52,'MDA4'!U52),D52),0)","v":0},{"$f":"IF(AND(COUNTRY_INFO!H52>0,COUNTRY_INFO!H52<4), IF(G52/D52*100<>0, IF(G52/D52*100>100,100,G52/D52*100), \"-\"),0)","v":0},{"$f":"COUNTRY_INFO!N52","v":17828},7165,8165,{"$f":"MAX('MDA1'!M52,MAX('MDA3'!I52,'MDA3'!L52)+MAX('MDA3'!J52,'MDA3'!M52))","v":15330},{"$f":"IF(AND(COUNTRY_INFO!I52>0,COUNTRY_INFO!I52<4),IF(J52>MAX('MDA1'!M52,MAX('MDA3'!I52,'MDA3'!L52)+MAX('MDA3'!J52,'MDA3'!M52)),MAX('MDA1'!M52,MAX('MDA3'!I52,'MDA3'!L52)+MAX('MDA3'!J52,'MDA3'!M52)),J52),0)","v":15330},{"$f":"IF(AND(COUNTRY_INFO!I52>0,COUNTRY_INFO!I52<4), IF(M52/J52*100<>0, IF(M52/J52*100>100,100,M52/J52*100), \"-\"),0)","v":85.988332959389723},{"$f":"COUNTRY_INFO!O52","v":11493},null,null,{"$f":"SUM(MAX('MDA4'!N52, 'T1'!L52, MAX(T3_R1!K52, T3_R2!K52)), MAX('MDA1'!K52, 'MDA4'!O52, 'T1'!M52, MAX(T3_R1!L52, T3_R2!L52)), MAX('MDA1'!L52, 'MDA4'!P52, 'T1'!N52, MAX(T3_R1!M52, T3_R2!M52)))","v":0},{"$f":"IF(AND(COUNTRY_INFO!J52>1,COUNTRY_INFO!J52<4),IF(COUNTRY_INFO!E52>MAX('MDA4'!N52,'T1'!L52,MAX(T3_R1!K52,T3_R2!K52)),MAX('MDA4'!N52,'T1'!L52,MAX(T3_R1!K52,T3_R2!K52)),COUNTRY_INFO!E52),0)","v":0},{"$f":"IF(AND(COUNTRY_INFO!J52>1,COUNTRY_INFO!J52<4), IF(T52/COUNTRY_INFO!E52*100<>0, IF(T52/COUNTRY_INFO!E52*100>100,100,T52/COUNTRY_INFO!E52*100), \"-\"),0)","v":"-"},{"$f":"IF(AND(COUNTRY_INFO!J52>1,COUNTRY_INFO!J52<4),IF(COUNTRY_INFO!F52>MAX('MDA1'!K52,'MDA4'!O52,'T1'!M52,MAX(T3_R1!L52,T3_R2!L52)),MAX('MDA1'!K52,'MDA4'!O52,'T1'!M52,MAX(T3_R1!L52,T3_R2!L52)),COUNTRY_INFO!F52),0)","v":0},{"$f":"IF(AND(COUNTRY_INFO!J52>1,COUNTRY_INFO!J52<4), IF(V52/COUNTRY_INFO!F52*100<>0, IF(V52/COUNTRY_INFO!F52*100>100,100,V52/COUNTRY_INFO!F52*100), \"-\"),0)","v":"-"},0,{"$f":"IF(AND(COUNTRY_INFO!J52>1,COUNTRY_INFO!J52<4), IF(S52/P52*100<>0, IF(X52/P52*100>100,100,X52/P52*100), \"-\"),0)","v":"-"},{"$f":"COUNTRY_INFO!P52","v":0},null,null,{"$f":"MAX('T1'!L52,'T2'!J52)+MAX('T1'!M52,'T2'!K52)+MAX('T1'!N52,'T2'!L52)","v":0},{"$f":"IF(COUNTRY_INFO!K52=1,IF(COUNTRY_INFO!F52*0.33>MAX('T1'!M52,'T2'!K52),MAX('T1'!M52,'T2'!K52),COUNTRY_INFO!F52*0.33),IF(COUNTRY_INFO!K52=2,IF(COUNTRY_INFO!F52*0.5>MAX('T1'!M52,'T2'!K52),MAX('T1'!M52,'T2'!K52),COUNTRY_INFO!F52*0.5),IF(COUNTRY_INFO!K52=3,IF(COUNTRY_INFO!F52>MAX('T1'!M52,'T2'!K52),MAX('T1'!M52,'T2'!K52),COUNTRY_INFO!F52),0)))","v":0},{"$f":"IF(AND(COUNTRY_INFO!K52>0,COUNTRY_INFO!K52<4),IF(Z52>0,IF(COUNTRY_INFO!K52=1, AD52/(COUNTRY_INFO!F52*0.33)*100, IF(COUNTRY_INFO!K52=2, AD52/(COUNTRY_INFO!F52*0.5)*100, IF(COUNTRY_INFO!K52=3, AD52/COUNTRY_INFO!F52*100))),\"-\"),0)","v":0},{"$f":"IF(COUNTRY_INFO!K52=2,IF(COUNTRY_INFO!G52*0.2>MAX('T1'!N52,'T2'!L52),MAX('T1'!N52,'T2'!L52),COUNTRY_INFO!G52*0.2),IF(COUNTRY_INFO!K52=3,IF(COUNTRY_INFO!G52>MAX('T1'!N52,'T2'!L52),MAX('T1'!N52,'T2'!L52),COUNTRY_INFO!G52),0))","v":0},{"$f":"IF(AND(COUNTRY_INFO!K52>0,COUNTRY_INFO!K52<4),IF(Z52>0,IF(COUNTRY_INFO!K52=1, 0, IF(COUNTRY_INFO!K52=2, AF52/(COUNTRY_INFO!G52*0.2)*100, IF(COUNTRY_INFO!K52=3, AF52/COUNTRY_INFO!G52*100))),\"-\"),0)","v":0},0,{"$f":"IF(AND(COUNTRY_INFO!K52>0,COUNTRY_INFO!K52<4), IF(AC52/Z52*100<>0, IF(AH52/Z52*100>100,100,AH52/Z52*100), \"-\"),0)","v":0},null,{"$f":"IF(AND(D52<>0, D52<>\"Inconnu\",D52<>\"Interrompu\",D52<>\"Non requis\"),D52/COUNTRY_INFO!D52, 0)","v":0},{"$f":"IF(AND(J52<>0,J52<>\"Inconnu\",J52<>\"Interrompu\",J52<>\"Non requis\"),J52/COUNTRY_INFO!D52, 0)","v":0.62049283029374913},{"$f":"IF(AND(P52<>0,P52<>\"Inconnu\",P52<>\"Non requis\"),P52/(COUNTRY_INFO!E52+COUNTRY_INFO!F52), 0)","v":1},{"$f":"IF(AND(Z52<>0,Z52<>\"Inconnu\",Z52<>\"Non requis\"),IF(COUNTRY_INFO!K52=1,1,IF(COUNTRY_INFO!K52=2,0.5*COUNTRY_INFO!F52/(0.5*COUNTRY_INFO!F52+0.2*COUNTRY_INFO!G52),IF(COUNTRY_INFO!K52=3,COUNTRY_INFO!F52/(COUNTRY_INFO!F52+COUNTRY_INFO!G52)))),0)","v":0},{"$f":"IF(AND(Z52<>0,Z52<>\"Inconnu\",Z52<>\"Non requis\"),IF(COUNTRY_INFO!K52=1,0,IF(COUNTRY_INFO!K52=2,0.2*COUNTRY_INFO!G52/(0.5*COUNTRY_INFO!F52+0.2*COUNTRY_INFO!G52),IF(COUNTRY_INFO!K52=3,COUNTRY_INFO!G52/(COUNTRY_INFO!F52+COUNTRY_INFO!G52)))),0)","v":0},{"$f":"MAX(COUNTRY_INFO!D52*AK52*PROFILE!$G$7,COUNTRY_INFO!D52*AL52*PROFILE!$G$7)","v":837.92609719037637},{"$f":"MAX(COUNTRY_INFO!D52*AK52*PROFILE!$G$8,COUNTRY_INFO!D52*AL52*PROFILE!$G$8,COUNTRY_INFO!D52*AM52*PROFILE!$G$8)","v":4597.1195680728379},{"$f":"MAX(COUNTRY_INFO!D52*AK52*PROFILE!$G$9,COUNTRY_INFO!D52*AL52*PROFILE!$G$9,COUNTRY_INFO!D52*AM52*PROFILE!$G$9,IF(AND(DISTRICT!Z52<>\"Inconnu\",Z52<>\"Non requis\"),COUNTRY_INFO!P52*DISTRICT!AN52,0))","v":6895.6685539301998},{"$f":"MAX(COUNTRY_INFO!D52*AK52*PROFILE!$G$10,COUNTRY_INFO!D52*AL52*PROFILE!$G$10,IF(AND(DISTRICT!Z52<>\"Inconnu\",Z52<>\"Non requis\"),COUNTRY_INFO!P52*DISTRICT!AO52,0))","v":9858.8812730215777},22189.59549221499,0,{"$f":"MAX('MDA4'!R52,'T1'!L52,'T2'!J52,T3_R1!K52,T3_R2!K52)","v":0},{"$f":"MAX('MDA1'!K52,'MDA4'!S52,'MDA3'!I52,'MDA3'!L52,'T1'!M52,'T2'!K52,T3_R1!L52,T3_R2!L52)","v":3679.2},{"$f":"MAX('MDA1'!L52,'MDA4'!T52,'MDA3'!J52,'MDA3'!M52,'T1'!N52,'T2'!L52,T3_R1!M52,T3_R2!M52)","v":11650.8},15330,{"$f":"MAX('MDA4'!R52,T52)","v":0},{"$f":"MAX('MDA1'!K52,'MDA4'!S52,'MDA3'!I52,'MDA3'!L52,V52,AD52)","v":3679.2},{"$f":"MAX('MDA1'!L52,'MDA4'!T52,'MDA3'!J52,'MDA3'!M52,AF52)","v":11650.8},15330,69.086432897699225]
[{"$f":"IF(COUNTRY_INFO!A53=0,\" \",COUNTRY_INFO!A53)","v":" Congo"},{"$f":"IF(COUNTRY_INFO!B53=0,\" \",COUNTRY_INFO!B53)","v":"Pool"},{"$f":"IF(COUNTRY_INFO!C53=0,\" \",COUNTRY_INFO!C53)","v":"Goma tsétsé"},{"$f":"COUNTRY_INFO!M53","v":0},null,null,{"$f":"SUM('MDA1'!M53,'MDA4'!U53)","v":0},{"$f":"IF(AND(COUNTRY_INFO!H53>0,COUNTRY_INFO!H53<4),IF(D53>MAX('MDA1'!M53,'MDA4'!U53),MAX('MDA1'!M53,'MDA4'!U53),D53),0)","v":0},{"$f":"IF(AND(COUNTRY_INFO!H53>0,COUNTRY_INFO!H53<4), IF(G53/D53*100<>0, IF(G53/D53*100>100,100,G53/D53*100), \"-\"),0)","v":0},{"$f":"COUNTRY_INFO!N53","v":28276},9693,11147,{"$f":"MAX('MDA1'!M53,MAX('MDA3'!I53,'MDA3'!L53)+MAX('MDA3'!J53,'MDA3'!M53))","v":20840},{"$f":"IF(AND(COUNTRY_INFO!I53>0,COUNTRY_INFO!I53<4),IF(J53>MAX('MDA1'!M53,MAX('MDA3'!I53,'MDA3'!L53)+MAX('MDA3'!J53,'MDA3'!M53)),MAX('MDA1'!M53,MAX('MDA3'!I53,'MDA3'!L53)+MAX('MDA3'!J53,'MDA3'!M53)),J53),0)","v":20840},{"$f":"IF(AND(COUNTRY_INFO!I53>0,COUNTRY_INFO!I53<4), IF(M53/J53*100<>0, IF(M53/J53*100>100,100,M53/J53*100), \"-\"),0)","v":73.702079502051205},{"$f":"COUNTRY_INFO!O53","v":0},null,null,{"$f":"SUM(MAX('MDA4'!N53, 'T1'!L53, MAX(T3_R1!K53, T3_R2!K53)), MAX('MDA1'!K53, 'MDA4'!O53, 'T1'!M53, MAX(T3_R1!L53, T3_R2!L53)), MAX('MDA1'!L53, 'MDA4'!P53, 'T1'!N53, MAX(T3_R1!M53, T3_R2!M53)))","v":0},{"$f":"IF(AND(COUNTRY_INFO!J53>1,COUNTRY_INFO!J53<4),IF(COUNTRY_INFO!E53>MAX('MDA4'!N53,'T1'!L53,MAX(T3_R1!K53,T3_R2!K53)),MAX('MDA4'!N53,'T1'!L53,MAX(T3_R1!K53,T3_R2!K53)),COUNTRY_INFO!E53),0)","v":0},{"$f":"IF(AND(COUNTRY_INFO!J53>1,COUNTRY_INFO!J53<4), IF(T53/COUNTRY_INFO!E53*100<>0, IF(T53/COUNTRY_INFO!E53*100>100,100,T53/COUNTRY_INFO!E53*100), \"-\"),0)","v":0},{"$f":"IF(AND(COUNTRY_INFO!J53>1,COUNTRY_INFO!J53<4),IF(COUNTRY_INFO!F53>MAX('MDA1'!K53,'MDA4'!O53,'T1'!M53,MAX(T3_R1!L53,T3_R2!L53)),MAX('MDA1'!K53,'MDA4'!O53,'T1'!M53,MAX(T3_R1!L53,T3_R2!L53)),COUNTRY_INFO!F53),0)","v":0},{"$f":"IF(AND(COUNTRY_INFO!J53>1,COUNTRY_INFO!J53<4), IF(V53/COUNTRY_INFO!F53*100<>0, IF(V53/COUNTRY_INFO!F53*100>100,100,V53/COUNTRY_INFO!F53*100), \"-\"),0)","v":0},0,{"$f":"IF(AND(COUNTRY_INFO!J53>1,COUNTRY_INFO!J53<4), IF(S53/P53*100<>0, IF(X53/P53*100>100,100,X53/P53*100), \"-\"),0)","v":0},{"$f":"COUNTRY_INFO!P53","v":0},null,null,{"$f":"MAX('T1'!L53,'T2'!J53)+MAX('T1'!M53,'T2'!K53)+MAX('T1'!N53,'T2'!L53)","v":0},{"$f":"IF(COUNTRY_INFO!K53=1,IF(COUNTRY_INFO!F53*0.33>MAX('T1'!M53,'T2'!K53),MAX('T1'!M53,'T2'!K53),COUNTRY_INFO!F53*0.33),IF(COUNTRY_INFO!K53=2,IF(COUNTRY_INFO!F53*0.5>MAX('T1'!M53,'T2'!K53),MAX('T1'!M53,'T2'!K53),COUNTRY_INFO!F53*0.5),IF(COUNTRY_INFO!K53=3,IF(COUNTRY_INFO!F53>MAX('T1'!M53,'T2'!K53),MAX('T1'!M53,'T2'!K53),COUNTRY_INFO!F53),0)))","v":0},{"$f":"IF(AND(COUNTRY_INFO!K53>0,COUNTRY_INFO!K53<4),IF(Z53>0,IF(COUNTRY_INFO!K53=1, AD53/(COUNTRY_INFO!F53*0.33)*100, IF(COUNTRY_INFO!K53=2, AD53/(COUNTRY_INFO!F53*0.5)*100, IF(COUNTRY_INFO!K53=3, AD53/COUNTRY_INFO!F53*100))),\"-\"),0)","v":0},{"$f":"IF(COUNTRY_INFO!K53=2,IF(COUNTRY_INFO!G53*0.2>MAX('T1'!N53,'T2'!L53),MAX('T1'!N53,'T2'!L53),COUNTRY_INFO!G53*0.2),IF(COUNTRY_INFO!K53=3,IF(COUNTRY_INFO!G53>MAX('T1'!N53,'T2'!L53),MAX('T1'!N53,'T2'!L53),COUNTRY_INFO!G53),0))","v":0},{"$f":"IF(AND(COUNTRY_INFO!K53>0,COUNTRY_INFO!K53<4),IF(Z53>0,IF(COUNTRY_INFO!K53=1, 0, IF(COUNTRY_INFO!K53=2, AF53/(COUNTRY_INFO!G53*0.2)*100, IF(COUNTRY_INFO!K53=3, AF53/COUNTRY_INFO!G53*100))),\"-\"),0)","v":0},0,{"$f":"IF(AND(COUNTRY_INFO!K53>0,COUNTRY_INFO!K53<4), IF(AC53/Z53*100<>0, IF(AH53/Z53*100>100,100,AH53/Z53*100), \"-\"),0)","v":0},null,{"$f":"IF(AND(D53<>0, D53<>\"Inconnu\",D53<>\"Interrompu\",D53<>\"Non requis\"),D53/COUNTRY_INFO!D53, 0)","v":0},{"$f":"IF(AND(J53<>0,J53<>\"Inconnu\",J53<>\"Interrompu\",J53<>\"Non requis\"),J53/COUNTRY_INFO!D53, 0)","v":0.78011366771505819},{"$f":"IF(AND(P53<>0,P53<>\"Inconnu\",P53<>\"Non requis\"),P53/(COUNTRY_INFO!E53+COUNTRY_INFO!F53), 0)","v":0},{"$f":"IF(AND(Z53<>0,Z53<>\"Inconnu\",Z53<>\"Non requis\"),IF(COUNTRY_INFO!K53=1,1,IF(COUNTRY_INFO!K53=2,0.5*COUNTRY_INFO!F53/(0.5*COUNTRY_INFO!F53+0.2*COUNTRY_INFO!G53),IF(COUNTRY_INFO!K53=3,COUNTRY_INFO!F53/(COUNTRY_INFO!F53+COUNTRY_INFO!G53)))),0)","v":0},{"$f":"IF(AND(Z53<>0,Z53<>\"Inconnu\",Z53<>\"Non requis\"),IF(COUNTRY_INFO!K53=1,0,IF(COUNTRY_INFO!K53=2,0.2*COUNTRY_INFO!G53/(0.5*COUNTRY_INFO!F53+0.2*COUNTRY_INFO!G53),IF(COUNTRY_INFO!K53=3,COUNTRY_INFO!G53/(COUNTRY_INFO!F53+COUNTRY_INFO!G53)))),0)","v":0},{"$f":"MAX(COUNTRY_INFO!D53*AK53*PROFILE!$G$7,COUNTRY_INFO!D53*AL53*PROFILE!$G$7)","v":1328.9880145924994},{"$f":"MAX(COUNTRY_INFO!D53*AK53*PROFILE!$G$8,COUNTRY_INFO!D53*AL53*PROFILE!$G$8,COUNTRY_INFO!D53*AM53*PROFILE!$G$8)","v":4524.1595749278695},{"$f":"MAX(COUNTRY_INFO!D53*AK53*PROFILE!$G$9,COUNTRY_INFO!D53*AL53*PROFILE!$G$9,COUNTRY_INFO!D53*AM53*PROFILE!$G$9,IF(AND(DISTRICT!Z53<>\"Inconnu\",Z53<>\"Non requis\"),COUNTRY_INFO!P53*DISTRICT!AN53,0))","v":6786.2287355885537},{"$f":"MAX(COUNTRY_INFO!D53*AK53*PROFILE!$G$10,COUNTRY_INFO!D53*AL53*PROFILE!$G$10,IF(AND(DISTRICT!Z53<>\"Inconnu\",Z53<>\"Non requis\"),COUNTRY_INFO!P53*DISTRICT!AO53,0))","v":15636.623674891078},28276,"Y",{"$f":"MAX('MDA4'!R53,'T1'!L53,'T2'!J53,T3_R1!K53,T3_R2!K53)","v":0},{"$f":"MAX('MDA1'!K53,'MDA4'!S53,'MDA3'!I53,'MDA3'!L53,'T1'!M53,'T2'!K53,T3_R1!L53,T3_R2!L53)","v":5001.6000000000004},{"$f":"MAX('MDA1'!L53,'MDA4'!T53,'MDA3'!J53,'MDA3'!M53,'T1'!N53,'T2'!L53,T3_R1!M53,T3_R2!M53)","v":15838.4},20840,{"$f":"MAX('MDA4'!R53,T53)","v":0},{"$f":"MAX('MDA1'!K53,'MDA4'!S53,'MDA3'!I53,'MDA3'!L53,V53,AD53)","v":5001.6000000000004},{"$f":"MAX('MDA1'!L53,'MDA4'!T53,'MDA3'!J53,'MDA3'!M53,AF53)","v":15838.4},20840,73.702079502051205]
[{"$f":"IF(COUNTRY_INFO!A54=0,\" \",COUNTRY_INFO!A54)","v":" Congo"},{"$f":"IF(COUNTRY_INFO!B54=0,\" \",COUNTRY_INFO!B54)","v":"Pool"},{"$f":"IF(COUNTRY_INFO!C54=0,\" \",COUNTRY_INFO!C54)","v":"Ignié"},{"$f":"COUNTRY_INFO!M54","v":77529},22705,22763,{"$f":"SUM('MDA1'!M54,'MDA4'!U54)","v":49253.600000000006},{"$f":"IF(AND(COUNTRY_INFO!H54>0,COUNTRY_INFO!H54<4),IF(D54>MAX('MDA1'!M54,'MDA4'!U54),MAX('MDA1'!M54,'MDA4'!U54),D54),0)","v":46557.600000000006},{"$f":"IF(AND(COUNTRY_INFO!H54>0,COUNTRY_INFO!H54<4), IF(G54/D54*100<>0, IF(G54/D54*100>100,100,G54/D54*100), \"-\"),0)","v":63.529260018831671},{"$f":"COUNTRY_INFO!N54","v":3135},1520,1615,{"$f":"MAX('MDA1'!M54,MAX('MDA3'!I54,'MDA3'!L54)+MAX('MDA3'!J54,'MDA3'!M54))","v":2696},{"$f":"IF(AND(COUNTRY_INFO!I54>0,COUNTRY_INFO!I54<4),IF(J54>MAX('MDA1'!M54,MAX('MDA3'!I54,'MDA3'!L54)+MAX('MDA3'!J54,'MDA3'!M54)),MAX('MDA1'!M54,MAX('MDA3'!I54,'MDA3'!L54)+MAX('MDA3'!J54,'MDA3'!M54)),J54),0)","v":2696},{"$f":"IF(AND(COUNTRY_INFO!I54>0,COUNTRY_INFO!I54<4), IF(M54/J54*100<>0, IF(M54/J54*100>100,100,M54/J54*100), \"-\"),0)","v":85.996810207336523},{"$f":"COUNTRY_INFO!O54","v":31012},null,null,{"$f":"SUM(MAX('MDA4'!N54, 'T1'!L54, MAX(T3_R1!K54, T3_R2!K54)), MAX('MDA1'!K54, 'MDA4'!O54, 'T1'!M54, MAX(T3_R1!L54, T3_R2!L54)), MAX('MDA1'!L54, 'MDA4'!P54, 'T1'!N54, MAX(T3_R1!M54, T3_R2!M54)))","v":45468},{"$f":"IF(AND(COUNTRY_INFO!J54>1,COUNTRY_INFO!J54<4),IF(COUNTRY_INFO!E54>MAX('MDA4'!N54,'T1'!L54,MAX(T3_R1!K54,T3_R2!K54)),MAX('MDA4'!N54,'T1'!L54,MAX(T3_R1!K54,T3_R2!K54)),COUNTRY_INFO!E54),0)","v":0},{"$f":"IF(AND(COUNTRY_INFO!J54>1,COUNTRY_INFO!J54<4), IF(T54/COUNTRY_INFO!E54*100<>0, IF(T54/COUNTRY_INFO!E54*100>100,100,T54/COUNTRY_INFO!E54*100), \"-\"),0)","v":"-"},{"$f":"IF(AND(COUNTRY_INFO!J54>1,COUNTRY_INFO!J54<4),IF(COUNTRY_INFO!F54>MAX('MDA1'!K54,'MDA4'!O54,'T1'!M54,MAX(T3_R1!L54,T3_R2!L54)),MAX('MDA1'!K54,'MDA4'!O54,'T1'!M54,MAX(T3_R1!L54,T3_R2!L54)),COUNTRY_INFO!F54),0)","v":10912.32},{"$f":"IF(AND(COUNTRY_INFO!J54>1,COUNTRY_INFO!J54<4), IF(V54/COUNTRY_INFO!F54*100<>0, IF(V54/COUNTRY_INFO!F54*100>100,100,V54/COUNTRY_INFO!F54*100), \"-\"),0)","v":58.646315902617296},10912.32,{"$f":"IF(AND(COUNTRY_INFO!J54>1,COUNTRY_INFO!J54<4), IF(S54/P54*100<>0, IF(X54/P54*100>100,100,X54/P54*100), \"-\"),0)","v":35.187411324648522},{"$f":"COUNTRY_INFO!P54","v":6140.31},null,null,{"$f":"MAX('T1'!L54,'T2'!J54)+MAX('T1'!M54,'T2'!K54)+MAX('T1'!N54,'T2'!L54)","v":0},{"$f":"IF(COUNTRY_INFO!K54=1,IF(COUNTRY_INFO!F54*0.33>MAX('T1'!M54,'T2'!K54),MAX('T1'!M54,'T2'!K54),COUNTRY_INFO!F54*0.33),IF(COUNTRY_INFO!K54=2,IF(COUNTRY_INFO!F54*0.5>MAX('T1'!M54,'T2'!K54),MAX('T1'!M54,'T2'!K54),COUNTRY_INFO!F54*0.5),IF(COUNTRY_INFO!K54=3,IF(COUNTRY_INFO!F54>MAX('T1'!M54,'T2'!K54),MAX('T1'!M54,'T2'!K54),COUNTRY_INFO!F54),0)))","v":0},{"$f":"IF(AND(COUNTRY_INFO!K54>0,COUNTRY_INFO!K54<4),IF(Z54>0,IF(COUNTRY_INFO!K54=1, AD54/(COUNTRY_INFO!F54*0.33)*100, IF(COUNTRY_INFO!K54=2, AD54/(COUNTRY_INFO!F54*0.5)*100, IF(COUNTRY_INFO!K54=3, AD54/COUNTRY_INFO!F54*100))),\"-\"),0)","v":0},{"$f":"IF(COUNTRY_INFO!K54=2,IF(COUNTRY_INFO!G54*0.2>MAX('T1'!N54,'T2'!L54),MAX('T1'!N54,'T2'!L54),COUNTRY_INFO!G54*0.2),IF(COUNTRY_INFO!K54=3,IF(COUNTRY_INFO!G54>MAX('T1'!N54,'T2'!L54),MAX('T1'!N54,'T2'!L54),COUNTRY_INFO!G54),0))","v":0},{"$f":"IF(AND(COUNTRY_INFO!K54>0,COUNTRY_INFO!K54<4),IF(Z54>0,IF(COUNTRY_INFO!K54=1, 0, IF(COUNTRY_INFO!K54=2, AF54/(COUNTRY_INFO!G54*0.2)*100, IF(COUNTRY_INFO!K54=3, AF54/COUNTRY_INFO!G54*100))),\"-\"),0)","v":0},0,{"$f":"IF(AND(COUNTRY_INFO!K54>0,COUNTRY_INFO!K54<4), IF(AC54/Z54*100<>0, IF(AH54/Z54*100>100,100,AH54/Z54*100), \"-\"),0)","v":"-"},null,{"$f":"IF(AND(D54<>0, D54<>\"Inconnu\",D54<>\"Interrompu\",D54<>\"Non requis\"),D54/COUNTRY_INFO!D54, 0)","v":1},{"$f":"IF(AND(J54<>0,J54<>\"Inconnu\",J54<>\"Interrompu\",J54<>\"Non requis\"),J54/COUNTRY_INFO!D54, 0)","v":4.0436481832604572E-2},{"$f":"IF(AND(P54<>0,P54<>\"Inconnu\",P54<>\"Non requis\"),P54/(COUNTRY_INFO!E54+COUNTRY_INFO!F54), 0)","v":1},{"$f":"IF(AND(Z54<>0,Z54<>\"Inconnu\",Z54<>\"Non requis\"),IF(COUNTRY_INFO!K54=1,1,IF(COUNTRY_INFO!K54=2,0.5*COUNTRY_INFO!F54/(0.5*COUNTRY_INFO!F54+0.2*COUNTRY_INFO!G54),IF(COUNTRY_INFO!K54=3,COUNTRY_INFO!F54/(COUNTRY_INFO!F54+COUNTRY_INFO!G54)))),0)","v":1},{"$f":"IF(AND(Z54<>0,Z54<>\"Inconnu\",Z54<>\"Non requis\"),IF(COUNTRY_INFO!K54=1,0,IF(COUNTRY_INFO!K54=2,0.2*COUNTRY_INFO!G54/(0.5*COUNTRY_INFO!F54+0.2*COUNTRY_INFO!G54),IF(COUNTRY_INFO!K54=3,COUNTRY_INFO!G54/(COUNTRY_INFO!F54+COUNTRY_INFO!G54)))),0)","v":0},{"$f":"MAX(COUNTRY_INFO!D54*AK54*PROFILE!$G$7,COUNTRY_INFO!D54*AL54*PROFILE!$G$7)","v":3643.9069098649702},{"$f":"MAX(COUNTRY_INFO!D54*AK54*PROFILE!$G$8,COUNTRY_INFO!D54*AL54*PROFILE!$G$8,COUNTRY_INFO!D54*AM54*PROFILE!$G$8)","v":12404.638834509224},{"$f":"MAX(COUNTRY_INFO!D54*AK54*PROFILE!$G$9,COUNTRY_INFO!D54*AL54*PROFILE!$G$9,COUNTRY_INFO!D54*AM54*PROFILE!$G$9,IF(AND(DISTRICT!Z54<>\"Inconnu\",Z54<>\"Non requis\"),COUNTRY_INFO!P54*DISTRICT!AN54,0))","v":18606.929114494447},{"$f":"MAX(COUNTRY_INFO!D54*AK54*PROFILE!$G$10,COUNTRY_INFO!D54*AL54*PROFILE!$G$10,IF(AND(DISTRICT!Z54<>\"Inconnu\",Z54<>\"Non requis\"),COUNTRY_INFO!P54*DISTRICT!AO54,0))","v":42873.525141131358},77529,0,{"$f":"MAX('MDA4'!R54,'T1'!L54,'T2'!J54,T3_R1!K54,T3_R2!K54)","v":0},{"$f":"MAX('MDA1'!K54,'MDA4'!S54,'MDA3'!I54,'MDA3'!L54,'T1'!M54,'T2'!K54,T3_R1!L54,T3_R2!L54)","v":12001.920000000002},{"$f":"MAX('MDA1'!L54,'MDA4'!T54,'MDA3'!J54,'MDA3'!M54,'T1'!N54,'T2'!L54,T3_R1!M54,T3_R2!M54)","v":34555.68},46557.600000000006,{"$f":"MAX('MDA4'!R54,T54)","v":0},{"$f":"MAX('MDA1'!K54,'MDA4'!S54,'MDA3'!I54,'MDA3'!L54,V54,AD54)","v":12001.920000000002},{"$f":"MAX('MDA1'!L54,'MDA4'!T54,'MDA3'!J54,'MDA3'!M54,AF54)","v":34555.68},46557.600000000006,60.051851565220758]
[{"$f":"IF(COUNTRY_INFO!A55=0,\" \",COUNTRY_INFO!A55)","v":" Congo"},{"$f":"IF(COUNTRY_INFO!B55=0,\" \",COUNTRY_INFO!B55)","v":"Pool"},{"$f":"IF(COUNTRY_INFO!C55=0,\" \",COUNTRY_INFO!C55)","v":"Kindamba"},{"$f":"COUNTRY_INFO!M55","v":0},null,null,{"$f":"SUM('MDA1'!M55,'MDA4'!U55)","v":0},{"$f":"IF(AND(COUNTRY_INFO!H55>0,COUNTRY_INFO!H55<4),IF(D55>MAX('MDA1'!M55,'MDA4'!U55),MAX('MDA1'!M55,'MDA4'!U55),D55),0)","v":0},{"$f":"IF(AND(COUNTRY_INFO!H55>0,COUNTRY_INFO!H55<4), IF(G55/D55*100<>0, IF(G55/D55*100>100,100,G55/D55*100), \"-\"),0)","v":0},{"$f":"COUNTRY_INFO!N55","v":5566},2387,2523,{"$f":"MAX('MDA1'!M55,MAX('MDA3'!I55,'MDA3'!L55)+MAX('MDA3'!J55,'MDA3'!M55))","v":4910},{"$f":"IF(AND(COUNTRY_INFO!I55>0,COUNTRY_INFO!I55<4),IF(J55>MAX('MDA1'!M55,MAX('MDA3'!I55,'MDA3'!L55)+MAX('MDA3'!J55,'MDA3'!M55)),MAX('MDA1'!M55,MAX('MDA3'!I55,'MDA3'!L55)+MAX('MDA3'!J55,'MDA3'!M55)),J55),0)","v":4910},{"$f":"IF(AND(COUNTRY_INFO!I55>0,COUNTRY_INFO!I55<4), IF(M55/J55*100<>0, IF(M55/J55*100>100,100,M55/J55*100), \"-\"),0)","v":88.214157384117868},{"$f":"COUNTRY_INFO!O55","v":12607},null,null,{"$f":"SUM(MAX('MDA4'!N55, 'T1'!L55, MAX(T3_R1!K55, T3_R2!K55)), MAX('MDA1'!K55, 'MDA4'!O55, 'T1'!M55, MAX(T3_R1!L55, T3_R2!L55)), MAX('MDA1'!L55, 'MDA4'!P55, 'T1'!N55, MAX(T3_R1!M55, T3_R2!M55)))","v":0},{"$f":"IF(AND(COUNTRY_INFO!J55>1,COUNTRY_INFO!J55<4),IF(COUNTRY_INFO!E55>MAX('MDA4'!N55,'T1'!L55,MAX(T3_R1!K55,T3_R2!K55)),MAX('MDA4'!N55,'T1'!L55,MAX(T3_R1!K55,T3_R2!K55)),COUNTRY_INFO!E55),0)","v":0},{"$f":"IF(AND(COUNTRY_INFO!J55>1,COUNTRY_INFO!J55<4), IF(T55/COUNTRY_INFO!E55*100<>0, IF(T55/COUNTRY_INFO!E55*100>100,100,T55/COUNTRY_INFO!E55*100), \"-\"),0)","v":"-"},{"$f":"IF(AND(COUNTRY_INFO!J55>1,COUNTRY_INFO!J55<4),IF(COUNTRY_INFO!F55>MAX('MDA1'!K55,'MDA4'!O55,'T1'!M55,MAX(T3_R1!L55,T3_R2!L55)),MAX('MDA1'!K55,'MDA4'!O55,'T1'!M55,MAX(T3_R1!L55,T3_R2!L55)),COUNTRY_INFO!F55),0)","v":0},{"$f":"IF(AND(COUNTRY_INFO!J55>1,COUNTRY_INFO!J55<4), IF(V55/COUNTRY_INFO!F55*100<>0, IF(V55/COUNTRY_INFO!F55*100>100,100,V55/COUNTRY_INFO!F55*100), \"-\"),0)","v":"-"},0,{"$f":"IF(AND(COUNTRY_INFO!J55>1,COUNTRY_INFO!J55<4), IF(S55/P55*100<>0, IF(X55/P55*100>100,100,X55/P55*100), \"-\"),0)","v":"-"},{"$f":"COUNTRY_INFO!P55","v":0},null,null,{"$f":"MAX('T1'!L55,'T2'!J55)+MAX('T1'!M55,'T2'!K55)+MAX('T1'!N55,'T2'!L55)","v":0},{"$f":"IF(COUNTRY_INFO!K55=1,IF(COUNTRY_INFO!F55*0.33>MAX('T1'!M55,'T2'!K55),MAX('T1'!M55,'T2'!K55),COUNTRY_INFO!F55*0.33),IF(COUNTRY_INFO!K55=2,IF(COUNTRY_INFO!F55*0.5>MAX('T1'!M55,'T2'!K55),MAX('T1'!M55,'T2'!K55),COUNTRY_INFO!F55*0.5),IF(COUNTRY_INFO!K55=3,IF(COUNTRY_INFO!F55>MAX('T1'!M55,'T2'!K55),MAX('T1'!M55,'T2'!K55),COUNTRY_INFO!F55),0)))","v":0},{"$f":"IF(AND(COUNTRY_INFO!K55>0,COUNTRY_INFO!K55<4),IF(Z55>0,IF(COUNTRY_INFO!K55=1, AD55/(COUNTRY_INFO!F55*0.33)*100, IF(COUNTRY_INFO!K55=2, AD55/(COUNTRY_INFO!F55*0.5)*100, IF(COUNTRY_INFO!K55=3, AD55/COUNTRY_INFO!F55*100))),\"-\"),0)","v":0},{"$f":"IF(COUNTRY_INFO!K55=2,IF(COUNTRY_INFO!G55*0.2>MAX('T1'!N55,'T2'!L55),MAX('T1'!N55,'T2'!L55),COUNTRY_INFO!G55*0.2),IF(COUNTRY_INFO!K55=3,IF(COUNTRY_INFO!G55>MAX('T1'!N55,'T2'!L55),MAX('T1'!N55,'T2'!L55),COUNTRY_INFO!G55),0))","v":0},{"$f":"IF(AND(COUNTRY_INFO!K55>0,COUNTRY_INFO!K55<4),IF(Z55>0,IF(COUNTRY_INFO!K55=1, 0, IF(COUNTRY_INFO!K55=2, AF55/(COUNTRY_INFO!G55*0.2)*100, IF(COUNTRY_INFO!K55=3, AF55/COUNTRY_INFO!G55*100))),\"-\"),0)","v":0},0,{"$f":"IF(AND(COUNTRY_INFO!K55>0,COUNTRY_INFO!K55<4), IF(AC55/Z55*100<>0, IF(AH55/Z55*100>100,100,AH55/Z55*100), \"-\"),0)","v":0},null,{"$f":"IF(AND(D55<>0, D55<>\"Inconnu\",D55<>\"Interrompu\",D55<>\"Non requis\"),D55/COUNTRY_INFO!D55, 0)","v":0},{"$f":"IF(AND(J55<>0,J55<>\"Inconnu\",J55<>\"Interrompu\",J55<>\"Non requis\"),J55/COUNTRY_INFO!D55, 0)","v":0.17660870668866607},{"$f":"IF(AND(P55<>0,P55<>\"Inconnu\",P55<>\"Non requis\"),P55/(COUNTRY_INFO!E55+COUNTRY_INFO!F55), 0)","v":1},{"$f":"IF(AND(Z55<>0,Z55<>\"Inconnu\",Z55<>\"Non requis\"),IF(COUNTRY_INFO!K55=1,1,IF(COUNTRY_INFO!K55=2,0.5*COUNTRY_INFO!F55/(0.5*COUNTRY_INFO!F55+0.2*COUNTRY_INFO!G55),IF(COUNTRY_INFO!K55=3,COUNTRY_INFO!F55/(COUNTRY_INFO!F55+COUNTRY_INFO!G55)))),0)","v":0},{"$f":"IF(AND(Z55<>0,Z55<>\"Inconnu\",Z55<>\"Non requis\"),IF(COUNTRY_INFO!K55=1,0,IF(COUNTRY_INFO!K55=2,0.2*COUNTRY_INFO!G55/(0.5*COUNTRY_INFO!F55+0.2*COUNTRY_INFO!G55),IF(COUNTRY_INFO!K55=3,COUNTRY_INFO!G55/(COUNTRY_INFO!F55+COUNTRY_INFO!G55)))),0)","v":0},{"$f":"MAX(COUNTRY_INFO!D55*AK55*PROFILE!$G$7,COUNTRY_INFO!D55*AL55*PROFILE!$G$7)","v":261.60515239856602},{"$f":"MAX(COUNTRY_INFO!D55*AK55*PROFILE!$G$8,COUNTRY_INFO!D55*AL55*PROFILE!$G$8,COUNTRY_INFO!D55*AM55*PROFILE!$G$8)","v":5042.5595262210618},{"$f":"MAX(COUNTRY_INFO!D55*AK55*PROFILE!$G$9,COUNTRY_INFO!D55*AL55*PROFILE!$G$9,COUNTRY_INFO!D55*AM55*PROFILE!$G$9,IF(AND(DISTRICT!Z55<>\"Inconnu\",Z55<>\"Non requis\"),COUNTRY_INFO!P55*DISTRICT!AN55,0))","v":7563.8274448581433},{"$f":"MAX(COUNTRY_INFO!D55*AK55*PROFILE!$G$10,COUNTRY_INFO!D55*AL55*PROFILE!$G$10,IF(AND(DISTRICT!Z55<>\"Inconnu\",Z55<>\"Non requis\"),COUNTRY_INFO!P55*DISTRICT!AO55,0))","v":3077.9971486222853},15945.989272100058,0,{"$f":"MAX('MDA4'!R55,'T1'!L55,'T2'!J55,T3_R1!K55,T3_R2!K55)","v":0},{"$f":"MAX('MDA1'!K55,'MDA4'!S55,'MDA3'!I55,'MDA3'!L55,'T1'!M55,'T2'!K55,T3_R1!L55,T3_R2!L55)","v":1178.4000000000001},{"$f":"MAX('MDA1'!L55,'MDA4'!T55,'MDA3'!J55,'MDA3'!M55,'T1'!N55,'T2'!L55,T3_R1!M55,T3_R2!M55)","v":3731.6},4910,{"$f":"MAX('MDA4'!R55,T55)","v":0},{"$f":"MAX('MDA1'!K55,'MDA4'!S55,'MDA3'!I55,'MDA3'!L55,V55,AD55)","v":1178.4000000000001},{"$f":"MAX('MDA1'!L55,'MDA4'!T55,'MDA3'!J55,'MDA3'!M55,AF55)","v":3731.6},4910,30.791441761413914]
[{"$f":"IF(COUNTRY_INFO!A56=0,\" \",COUNTRY_INFO!A56)","v":" Congo"},{"$f":"IF(COUNTRY_INFO!B56=0,\" \",COUNTRY_INFO!B56)","v":"Pool"},{"$f":"IF(COUNTRY_INFO!C56=0,\" \",COUNTRY_INFO!C56)","v":"Kinkala"},{"$f":"COUNTRY_INFO!M56","v":0},null,null,{"$f":"SUM('MDA1'!M56,'MDA4'!U56)","v":0},{"$f":"IF(AND(COUNTRY_INFO!H56>0,COUNTRY_INFO!H56<4),IF(D56>MAX('MDA1'!M56,'MDA4'!U56),MAX('MDA1'!M56,'MDA4'!U56),D56),0)","v":0},{"$f":"IF(AND(COUNTRY_INFO!H56>0,COUNTRY_INFO!H56<4), IF(G56/D56*100<>0, IF(G56/D56*100>100,100,G56/D56*100), \"-\"),0)","v":0},{"$f":"COUNTRY_INFO!N56","v":18023},6663,7180,{"$f":"MAX('MDA1'!M56,MAX('MDA3'!I56,'MDA3'!L56)+MAX('MDA3'!J56,'MDA3'!M56))","v":13843},{"$f":"IF(AND(COUNTRY_INFO!I56>0,COUNTRY_INFO!I56<4),IF(J56>MAX('MDA1'!M56,MAX('MDA3'!I56,'MDA3'!L56)+MAX('MDA3'!J56,'MDA3'!M56)),MAX('MDA1'!M56,MAX('MDA3'!I56,'MDA3'!L56)+MAX('MDA3'!J56,'MDA3'!M56)),J56),0)","v":13843},{"$f":"IF(AND(COUNTRY_INFO!I56>0,COUNTRY_INFO!I56<4), IF(M56/J56*100<>0, IF(M56/J56*100>100,100,M56/J56*100), \"-\"),0)","v":76.807412750374525},{"$f":"COUNTRY_INFO!O56","v":17482},null,null,{"$f":"SUM(MAX('MDA4'!N56, 'T1'!L56, MAX(T3_R1!K56, T3_R2!K56)), MAX('MDA1'!K56, 'MDA4'!O56, 'T1'!M56, MAX(T3_R1!L56, T3_R2!L56)), MAX('MDA1'!L56, 'MDA4'!P56, 'T1'!N56, MAX(T3_R1!M56, T3_R2!M56)))","v":0},{"$f":"IF(AND(COUNTRY_INFO!J56>1,COUNTRY_INFO!J56<4),IF(COUNTRY_INFO!E56>MAX('MDA4'!N56,'T1'!L56,MAX(T3_R1!K56,T3_R2!K56)),MAX('MDA4'!N56,'T1'!L56,MAX(T3_R1!K56,T3_R2!K56)),COUNTRY_INFO!E56),0)","v":0},{"$f":"IF(AND(COUNTRY_INFO!J56>1,COUNTRY_INFO!J56<4), IF(T56/COUNTRY_INFO!E56*100<>0, IF(T56/COUNTRY_INFO!E56*100>100,100,T56/COUNTRY_INFO!E56*100), \"-\"),0)","v":"-"},{"$f":"IF(AND(COUNTRY_INFO!J56>1,COUNTRY_INFO!J56<4),IF(COUNTRY_INFO!F56>MAX('MDA1'!K56,'MDA4'!O56,'T1'!M56,MAX(T3_R1!L56,T3_R2!L56)),MAX('MDA1'!K56,'MDA4'!O56,'T1'!M56,MAX(T3_R1!L56,T3_R2!L56)),COUNTRY_INFO!F56),0)","v":0},{"$f":"IF(AND(COUNTRY_INFO!J56>1,COUNTRY_INFO!J56<4), IF(V56/COUNTRY_INFO!F56*100<>0, IF(V56/COUNTRY_INFO!F56*100>100,100,V56/COUNTRY_INFO!F56*100), \"-\"),0)","v":"-"},0,{"$f":"IF(AND(COUNTRY_INFO!J56>1,COUNTRY_INFO!J56<4), IF(S56/P56*100<>0, IF(X56/P56*100>100,100,X56/P56*100), \"-\"),0)","v":"-"},{"$f":"COUNTRY_INFO!P56","v":0},null,null,{"$f":"MAX('T1'!L56,'T2'!J56)+MAX('T1'!M56,'T2'!K56)+MAX('T1'!N56,'T2'!L56)","v":0},{"$f":"IF(COUNTRY_INFO!K56=1,IF(COUNTRY_INFO!F56*0.33>MAX('T1'!M56,'T2'!K56),MAX('T1'!M56,'T2'!K56),COUNTRY_INFO!F56*0.33),IF(COUNTRY_INFO!K56=2,IF(COUNTRY_INFO!F56*0.5>MAX('T1'!M56,'T2'!K56),MAX('T1'!M56,'T2'!K56),COUNTRY_INFO!F56*0.5),IF(COUNTRY_INFO!K56=3,IF(COUNTRY_INFO!F56>MAX('T1'!M56,'T2'!K56),MAX('T1'!M56,'T2'!K56),COUNTRY_INFO!F56),0)))","v":0},{"$f":"IF(AND(COUNTRY_INFO!K56>0,COUNTRY_INFO!K56<4),IF(Z56>0,IF(COUNTRY_INFO!K56=1, AD56/(COUNTRY_INFO!F56*0.33)*100, IF(COUNTRY_INFO!K56=2, AD56/(COUNTRY_INFO!F56*0.5)*100, IF(COUNTRY_INFO!K56=3, AD56/COUNTRY_INFO!F56*100))),\"-\"),0)","v":0},{"$f":"IF(COUNTRY_INFO!K56=2,IF(COUNTRY_INFO!G56*0.2>MAX('T1'!N56,'T2'!L56),MAX('T1'!N56,'T2'!L56),COUNTRY_INFO!G56*0.2),IF(COUNTRY_INFO!K56=3,IF(COUNTRY_INFO!G56>MAX('T1'!N56,'T2'!L56),MAX('T1'!N56,'T2'!L56),COUNTRY_INFO!G56),0))","v":0},{"$f":"IF(AND(COUNTRY_INFO!K56>0,COUNTRY_INFO!K56<4),IF(Z56>0,IF(COUNTRY_INFO!K56=1, 0, IF(COUNTRY_INFO!K56=2, AF56/(COUNTRY_INFO!G56*0.2)*100, IF(COUNTRY_INFO!K56=3, AF56/COUNTRY_INFO!G56*100))),\"-\"),0)","v":0},0,{"$f":"IF(AND(COUNTRY_INFO!K56>0,COUNTRY_INFO!K56<4), IF(AC56/Z56*100<>0, IF(AH56/Z56*100>100,100,AH56/Z56*100), \"-\"),0)","v":0},null,{"$f":"IF(AND(D56<>0, D56<>\"Inconnu\",D56<>\"Interrompu\",D56<>\"Non requis\"),D56/COUNTRY_INFO!D56, 0)","v":0},{"$f":"IF(AND(J56<>0,J56<>\"Inconnu\",J56<>\"Interrompu\",J56<>\"Non requis\"),J56/COUNTRY_INFO!D56, 0)","v":0.41238788211605343},{"$f":"IF(AND(P56<>0,P56<>\"Inconnu\",P56<>\"Non requis\"),P56/(COUNTRY_INFO!E56+COUNTRY_INFO!F56), 0)","v":1},{"$f":"IF(AND(Z56<>0,Z56<>\"Inconnu\",Z56<>\"Non requis\"),IF(COUNTRY_INFO!K56=1,1,IF(COUNTRY_INFO!K56=2,0.5*COUNTRY_INFO!F56/(0.5*COUNTRY_INFO!F56+0.2*COUNTRY_INFO!G56),IF(COUNTRY_INFO!K56=3,COUNTRY_INFO!F56/(COUNTRY_INFO!F56+COUNTRY_INFO!G56)))),0)","v":0},{"$f":"IF(AND(Z56<>0,Z56<>\"Inconnu\",Z56<>\"Non requis\"),IF(COUNTRY_INFO!K56=1,0,IF(COUNTRY_INFO!K56=2,0.2*COUNTRY_INFO!G56/(0.5*COUNTRY_INFO!F56+0.2*COUNTRY_INFO!G56),IF(COUNTRY_INFO!K56=3,COUNTRY_INFO!G56/(COUNTRY_INFO!F56+COUNTRY_INFO!G56)))),0)","v":0},{"$f":"MAX(COUNTRY_INFO!D56*AK56*PROFILE!$G$7,COUNTRY_INFO!D56*AL56*PROFILE!$G$7)","v":847.09120763193584},{"$f":"MAX(COUNTRY_INFO!D56*AK56*PROFILE!$G$8,COUNTRY_INFO!D56*AL56*PROFILE!$G$8,COUNTRY_INFO!D56*AM56*PROFILE!$G$8)","v":6992.6393429992795},{"$f":"MAX(COUNTRY_INFO!D56*AK56*PROFILE!$G$9,COUNTRY_INFO!D56*AL56*PROFILE!$G$9,COUNTRY_INFO!D56*AM56*PROFILE!$G$9,IF(AND(DISTRICT!Z56<>\"Inconnu\",Z56<>\"Non requis\"),COUNTRY_INFO!P56*DISTRICT!AN56,0))","v":10488.942589480908},{"$f":"MAX(COUNTRY_INFO!D56*AK56*PROFILE!$G$10,COUNTRY_INFO!D56*AL56*PROFILE!$G$10,IF(AND(DISTRICT!Z56<>\"Inconnu\",Z56<>\"Non requis\"),COUNTRY_INFO!P56*DISTRICT!AO56,0))","v":9966.7162431942961},28295.389383306418,0,{"$f":"MAX('MDA4'!R56,'T1'!L56,'T2'!J56,T3_R1!K56,T3_R2!K56)","v":0},{"$f":"MAX('MDA1'!K56,'MDA4'!S56,'MDA3'!I56,'MDA3'!L56,'T1'!M56,'T2'!K56,T3_R1!L56,T3_R2!L56)","v":3322.32},{"$f":"MAX('MDA1'!L56,'MDA4'!T56,'MDA3'!J56,'MDA3'!M56,'T1'!N56,'T2'!L56,T3_R1!M56,T3_R2!M56)","v":10520.68},13843,{"$f":"MAX('MDA4'!R56,T56)","v":0},{"$f":"MAX('MDA1'!K56,'MDA4'!S56,'MDA3'!I56,'MDA3'!L56,V56,AD56)","v":3322.32},{"$f":"MAX('MDA1'!L56,'MDA4'!T56,'MDA3'!J56,'MDA3'!M56,AF56)","v":10520.68},13843,48.923164874935523]
[{"$f":"IF(COUNTRY_INFO!A57=0,\" \",COUNTRY_INFO!A57)","v":" Congo"},{"$f":"IF(COUNTRY_INFO!B57=0,\" \",COUNTRY_INFO!B57)","v":"Pool"},{"$f":"IF(COUNTRY_INFO!C57=0,\" \",COUNTRY_INFO!C57)","v":"Kintélé"},{"$f":"COUNTRY_INFO!M57","v":0},null,null,{"$f":"SUM('MDA1'!M57,'MDA4'!U57)","v":0},{"$f":"IF(AND(COUNTRY_INFO!H57>0,COUNTRY_INFO!H57<4),IF(D57>MAX('MDA1'!M57,'MDA4'!U57),MAX('MDA1'!M57,'MDA4'!U57),D57),0)","v":0},{"$f":"IF(AND(COUNTRY_INFO!H57>0,COUNTRY_INFO!H57<4), IF(G57/D57*100<>0, IF(G57/D57*100>100,100,G57/D57*100), \"-\"),0)","v":0},{"$f":"COUNTRY_INFO!N57","v":0},null,null,{"$f":"MAX('MDA1'!M57,MAX('MDA3'!I57,'MDA3'!L57)+MAX('MDA3'!J57,'MDA3'!M57))","v":0},{"$f":"IF(AND(COUNTRY_INFO!I57>0,COUNTRY_INFO!I57<4),IF(J57>MAX('MDA1'!M57,MAX('MDA3'!I57,'MDA3'!L57)+MAX('MDA3'!J57,'MDA3'!M57)),MAX('MDA1'!M57,MAX('MDA3'!I57,'MDA3'!L57)+MAX('MDA3'!J57,'MDA3'!M57)),J57),0)","v":0},{"$f":"IF(AND(COUNTRY_INFO!I57>0,COUNTRY_INFO!I57<4), IF(M57/J57*100<>0, IF(M57/J57*100>100,100,M57/J57*100), \"-\"),0)","v":0},{"$f":"COUNTRY_INFO!O57","v":0},null,null,{"$f":"SUM(MAX('MDA4'!N57, 'T1'!L57, MAX(T3_R1!K57, T3_R2!K57)), MAX('MDA1'!K57, 'MDA4'!O57, 'T1'!M57, MAX(T3_R1!L57, T3_R2!L57)), MAX('MDA1'!L57, 'MDA4'!P57, 'T1'!N57, MAX(T3_R1!M57, T3_R2!M57)))","v":0},{"$f":"IF(AND(COUNTRY_INFO!J57>1,COUNTRY_INFO!J57<4),IF(COUNTRY_INFO!E57>MAX('MDA4'!N57,'T1'!L57,MAX(T3_R1!K57,T3_R2!K57)),MAX('MDA4'!N57,'T1'!L57,MAX(T3_R1!K57,T3_R2!K57)),COUNTRY_INFO!E57),0)","v":0},{"$f":"IF(AND(COUNTRY_INFO!J57>1,COUNTRY_INFO!J57<4), IF(T57/COUNTRY_INFO!E57*100<>0, IF(T57/COUNTRY_INFO!E57*100>100,100,T57/COUNTRY_INFO!E57*100), \"-\"),0)","v":0},{"$f":"IF(AND(COUNTRY_INFO!J57>1,COUNTRY_INFO!J57<4),IF(COUNTRY_INFO!F57>MAX('MDA1'!K57,'MDA4'!O57,'T1'!M57,MAX(T3_R1!L57,T3_R2!L57)),MAX('MDA1'!K57,'MDA4'!O57,'T1'!M57,MAX(T3_R1!L57,T3_R2!L57)),COUNTRY_INFO!F57),0)","v":0},{"$f":"IF(AND(COUNTRY_INFO!J57>1,COUNTRY_INFO!J57<4), IF(V57/COUNTRY_INFO!F57*100<>0, IF(V57/COUNTRY_INFO!F57*100>100,100,V57/COUNTRY_INFO!F57*100), \"-\"),0)","v":0},0,{"$f":"IF(AND(COUNTRY_INFO!J57>1,COUNTRY_INFO!J57<4), IF(S57/P57*100<>0, IF(X57/P57*100>100,100,X57/P57*100), \"-\"),0)","v":0},{"$f":"COUNTRY_INFO!P57","v":"Inconnu"},null,null,{"$f":"MAX('T1'!L57,'T2'!J57)+MAX('T1'!M57,'T2'!K57)+MAX('T1'!N57,'T2'!L57)","v":0},{"$f":"IF(COUNTRY_INFO!K57=1,IF(COUNTRY_INFO!F57*0.33>MAX('T1'!M57,'T2'!K57),MAX('T1'!M57,'T2'!K57),COUNTRY_INFO!F57*0.33),IF(COUNTRY_INFO!K57=2,IF(COUNTRY_INFO!F57*0.5>MAX('T1'!M57,'T2'!K57),MAX('T1'!M57,'T2'!K57),COUNTRY_INFO!F57*0.5),IF(COUNTRY_INFO!K57=3,IF(COUNTRY_INFO!F57>MAX('T1'!M57,'T2'!K57),MAX('T1'!M57,'T2'!K57),COUNTRY_INFO!F57),0)))","v":0},{"$f":"IF(AND(COUNTRY_INFO!K57>0,COUNTRY_INFO!K57<4),IF(Z57>0,IF(COUNTRY_INFO!K57=1, AD57/(COUNTRY_INFO!F57*0.33)*100, IF(COUNTRY_INFO!K57=2, AD57/(COUNTRY_INFO!F57*0.5)*100, IF(COUNTRY_INFO!K57=3, AD57/COUNTRY_INFO!F57*100))),\"-\"),0)","v":0},{"$f":"IF(COUNTRY_INFO!K57=2,IF(COUNTRY_INFO!G57*0.2>MAX('T1'!N57,'T2'!L57),MAX('T1'!N57,'T2'!L57),COUNTRY_INFO!G57*0.2),IF(COUNTRY_INFO!K57=3,IF(COUNTRY_INFO!G57>MAX('T1'!N57,'T2'!L57),MAX('T1'!N57,'T2'!L57),COUNTRY_INFO!G57),0))","v":0},{"$f":"IF(AND(COUNTRY_INFO!K57>0,COUNTRY_INFO!K57<4),IF(Z57>0,IF(COUNTRY_INFO!K57=1, 0, IF(COUNTRY_INFO!K57=2, AF57/(COUNTRY_INFO!G57*0.2)*100, IF(COUNTRY_INFO!K57=3, AF57/COUNTRY_INFO!G57*100))),\"-\"),0)","v":0},0,{"$f":"IF(AND(COUNTRY_INFO!K57>0,COUNTRY_INFO!K57<4), IF(AC57/Z57*100<>0, IF(AH57/Z57*100>100,100,AH57/Z57*100), \"-\"),0)","v":0},null,{"$f":"IF(AND(D57<>0, D57<>\"Inconnu\",D57<>\"Interrompu\",D57<>\"Non requis\"),D57/COUNTRY_INFO!D57, 0)","v":0},{"$f":"IF(AND(J57<>0,J57<>\"Inconnu\",J57<>\"Interrompu\",J57<>\"Non requis\"),J57/COUNTRY_INFO!D57, 0)","v":0},{"$f":"IF(AND(P57<>0,P57<>\"Inconnu\",P57<>\"Non requis\"),P57/(COUNTRY_INFO!E57+COUNTRY_INFO!F57), 0)","v":0},{"$f":"IF(AND(Z57<>0,Z57<>\"Inconnu\",Z57<>\"Non requis\"),IF(COUNTRY_INFO!K57=1,1,IF(COUNTRY_INFO!K57=2,0.5*COUNTRY_INFO!F57/(0.5*COUNTRY_INFO!F57+0.2*COUNTRY_INFO!G57),IF(COUNTRY_INFO!K57=3,COUNTRY_INFO!F57/(COUNTRY_INFO!F57+COUNTRY_INFO!G57)))),0)","v":0},{"$f":"IF(AND(Z57<>0,Z57<>\"Inconnu\",Z57<>\"Non requis\"),IF(COUNTRY_INFO!K57=1,0,IF(COUNTRY_INFO!K57=2,0.2*COUNTRY_INFO!G57/(0.5*COUNTRY_INFO!F57+0.2*COUNTRY_INFO!G57),IF(COUNTRY_INFO!K57=3,COUNTRY_INFO!G57/(COUNTRY_INFO!F57+COUNTRY_INFO!G57)))),0)","v":0},{"$f":"MAX(COUNTRY_INFO!D57*AK57*PROFILE!$G$7,COUNTRY_INFO!D57*AL57*PROFILE!$G$7)","v":0},{"$f":"MAX(COUNTRY_INFO!D57*AK57*PROFILE!$G$8,COUNTRY_INFO!D57*AL57*PROFILE!$G$8,COUNTRY_INFO!D57*AM57*PROFILE!$G$8)","v":0},{"$f":"MAX(COUNTRY_INFO!D57*AK57*PROFILE!$G$9,COUNTRY_INFO!D57*AL57*PROFILE!$G$9,COUNTRY_INFO!D57*AM57*PROFILE!$G$9,IF(AND(DISTRICT!Z57<>\"Inconnu\",Z57<>\"Non requis\"),COUNTRY_INFO!P57*DISTRICT!AN57,0))","v":0},{"$f":"MAX(COUNTRY_INFO!D57*AK57*PROFILE!$G$10,COUNTRY_INFO!D57*AL57*PROFILE!$G$10,IF(AND(DISTRICT!Z57<>\"Inconnu\",Z57<>\"Non requis\"),COUNTRY_INFO!P57*DISTRICT!AO57,0))","v":0},0,0,{"$f":"MAX('MDA4'!R57,'T1'!L57,'T2'!J57,T3_R1!K57,T3_R2!K57)","v":0},{"$f":"MAX('MDA1'!K57,'MDA4'!S57,'MDA3'!I57,'MDA3'!L57,'T1'!M57,'T2'!K57,T3_R1!L57,T3_R2!L57)","v":0},{"$f":"MAX('MDA1'!L57,'MDA4'!T57,'MDA3'!J57,'MDA3'!M57,'T1'!N57,'T2'!L57,T3_R1!M57,T3_R2!M57)","v":0},0,{"$f":"MAX('MDA4'!R57,T57)","v":0},{"$f":"MAX('MDA1'!K57,'MDA4'!S57,'MDA3'!I57,'MDA3'!L57,V57,AD57)","v":0},{"$f":"MAX('MDA1'!L57,'MDA4'!T57,'MDA3'!J57,'MDA3'!M57,AF57)","v":0},0,0]
[{"$f":"IF(COUNTRY_INFO!A58=0,\" \",COUNTRY_INFO!A58)","v":" Congo"},{"$f":"IF(COUNTRY_INFO!B58=0,\" \",COUNTRY_INFO!B58)","v":"Pool"},{"$f":"IF(COUNTRY_INFO!C58=0,\" \",COUNTRY_INFO!C58)","v":"Mindouli"},{"$f":"COUNTRY_INFO!M58","v":0},null,null,{"$f":"SUM('MDA1'!M58,'MDA4'!U58)","v":0},{"$f":"IF(AND(COUNTRY_INFO!H58>0,COUNTRY_INFO!H58<4),IF(D58>MAX('MDA1'!M58,'MDA4'!U58),MAX('MDA1'!M58,'MDA4'!U58),D58),0)","v":0},{"$f":"IF(AND(COUNTRY_INFO!H58>0,COUNTRY_INFO!H58<4), IF(G58/D58*100<>0, IF(G58/D58*100>100,100,G58/D58*100), \"-\"),0)","v":0},{"$f":"COUNTRY_INFO!N58","v":42439},16228,18078,{"$f":"MAX('MDA1'!M58,MAX('MDA3'!I58,'MDA3'!L58)+MAX('MDA3'!J58,'MDA3'!M58))","v":34306},{"$f":"IF(AND(COUNTRY_INFO!I58>0,COUNTRY_INFO!I58<4),IF(J58>MAX('MDA1'!M58,MAX('MDA3'!I58,'MDA3'!L58)+MAX('MDA3'!J58,'MDA3'!M58)),MAX('MDA1'!M58,MAX('MDA3'!I58,'MDA3'!L58)+MAX('MDA3'!J58,'MDA3'!M58)),J58),0)","v":34306},{"$f":"IF(AND(COUNTRY_INFO!I58>0,COUNTRY_INFO!I58<4), IF(M58/J58*100<>0, IF(M58/J58*100>100,100,M58/J58*100), \"-\"),0)","v":80.836023468979008},{"$f":"COUNTRY_INFO!O58","v":19200},null,null,{"$f":"SUM(MAX('MDA4'!N58, 'T1'!L58, MAX(T3_R1!K58, T3_R2!K58)), MAX('MDA1'!K58, 'MDA4'!O58, 'T1'!M58, MAX(T3_R1!L58, T3_R2!L58)), MAX('MDA1'!L58, 'MDA4'!P58, 'T1'!N58, MAX(T3_R1!M58, T3_R2!M58)))","v":0},{"$f":"IF(AND(COUNTRY_INFO!J58>1,COUNTRY_INFO!J58<4),IF(COUNTRY_INFO!E58>MAX('MDA4'!N58,'T1'!L58,MAX(T3_R1!K58,T3_R2!K58)),MAX('MDA4'!N58,'T1'!L58,MAX(T3_R1!K58,T3_R2!K58)),COUNTRY_INFO!E58),0)","v":0},{"$f":"IF(AND(COUNTRY_INFO!J58>1,COUNTRY_INFO!J58<4), IF(T58/COUNTRY_INFO!E58*100<>0, IF(T58/COUNTRY_INFO!E58*100>100,100,T58/COUNTRY_INFO!E58*100), \"-\"),0)","v":"-"},{"$f":"IF(AND(COUNTRY_INFO!J58>1,COUNTRY_INFO!J58<4),IF(COUNTRY_INFO!F58>MAX('MDA1'!K58,'MDA4'!O58,'T1'!M58,MAX(T3_R1!L58,T3_R2!L58)),MAX('MDA1'!K58,'MDA4'!O58,'T1'!M58,MAX(T3_R1!L58,T3_R2!L58)),COUNTRY_INFO!F58),0)","v":0},{"$f":"IF(AND(COUNTRY_INFO!J58>1,COUNTRY_INFO!J58<4), IF(V58/COUNTRY_INFO!F58*100<>0, IF(V58/COUNTRY_INFO!F58*100>100,100,V58/COUNTRY_INFO!F58*100), \"-\"),0)","v":"-"},0,{"$f":"IF(AND(COUNTRY_INFO!J58>1,COUNTRY_INFO!J58<4), IF(S58/P58*100<>0, IF(X58/P58*100>100,100,X58/P58*100), \"-\"),0)","v":"-"},{"$f":"COUNTRY_INFO!P58","v":3801.6000000000004},null,null,{"$f":"MAX('T1'!L58,'T2'!J58)+MAX('T1'!M58,'T2'!K58)+MAX('T1'!N58,'T2'!L58)","v":0},{"$f":"IF(COUNTRY_INFO!K58=1,IF(COUNTRY_INFO!F58*0.33>MAX('T1'!M58,'T2'!K58),MAX('T1'!M58,'T2'!K58),COUNTRY_INFO!F58*0.33),IF(COUNTRY_INFO!K58=2,IF(COUNTRY_INFO!F58*0.5>MAX('T1'!M58,'T2'!K58),MAX('T1'!M58,'T2'!K58),COUNTRY_INFO!F58*0.5),IF(COUNTRY_INFO!K58=3,IF(COUNTRY_INFO!F58>MAX('T1'!M58,'T2'!K58),MAX('T1'!M58,'T2'!K58),COUNTRY_INFO!F58),0)))","v":0},{"$f":"IF(AND(COUNTRY_INFO!K58>0,COUNTRY_INFO!K58<4),IF(Z58>0,IF(COUNTRY_INFO!K58=1, AD58/(COUNTRY_INFO!F58*0.33)*100, IF(COUNTRY_INFO!K58=2, AD58/(COUNTRY_INFO!F58*0.5)*100, IF(COUNTRY_INFO!K58=3, AD58/COUNTRY_INFO!F58*100))),\"-\"),0)","v":0},{"$f":"IF(COUNTRY_INFO!K58=2,IF(COUNTRY_INFO!G58*0.2>MAX('T1'!N58,'T2'!L58),MAX('T1'!N58,'T2'!L58),COUNTRY_INFO!G58*0.2),IF(COUNTRY_INFO!K58=3,IF(COUNTRY_INFO!G58>MAX('T1'!N58,'T2'!L58),MAX('T1'!N58,'T2'!L58),COUNTRY_INFO!G58),0))","v":0},{"$f":"IF(AND(COUNTRY_INFO!K58>0,COUNTRY_INFO!K58<4),IF(Z58>0,IF(COUNTRY_INFO!K58=1, 0, IF(COUNTRY_INFO!K58=2, AF58/(COUNTRY_INFO!G58*0.2)*100, IF(COUNTRY_INFO!K58=3, AF58/COUNTRY_INFO!G58*100))),\"-\"),0)","v":0},0,{"$f":"IF(AND(COUNTRY_INFO!K58>0,COUNTRY_INFO!K58<4), IF(AC58/Z58*100<>0, IF(AH58/Z58*100>100,100,AH58/Z58*100), \"-\"),0)","v":"-"},null,{"$f":"IF(AND(D58<>0, D58<>\"Inconnu\",D58<>\"Interrompu\",D58<>\"Non requis\"),D58/COUNTRY_INFO!D58, 0)","v":0},{"$f":"IF(AND(J58<>0,J58<>\"Inconnu\",J58<>\"Interrompu\",J58<>\"Non requis\"),J58/COUNTRY_INFO!D58, 0)","v":0.8841458333333333},{"$f":"IF(AND(P58<>0,P58<>\"Inconnu\",P58<>\"Non requis\"),P58/(COUNTRY_INFO!E58+COUNTRY_INFO!F58), 0)","v":1},{"$f":"IF(AND(Z58<>0,Z58<>\"Inconnu\",Z58<>\"Non requis\"),IF(COUNTRY_INFO!K58=1,1,IF(COUNTRY_INFO!K58=2,0.5*COUNTRY_INFO!F58/(0.5*COUNTRY_INFO!F58+0.2*COUNTRY_INFO!G58),IF(COUNTRY_INFO!K58=3,COUNTRY_INFO!F58/(COUNTRY_INFO!F58+COUNTRY_INFO!G58)))),0)","v":1},{"$f":"IF(AND(Z58<>0,Z58<>\"Inconnu\",Z58<>\"Non requis\"),IF(COUNTRY_INFO!K58=1,0,IF(COUNTRY_INFO!K58=2,0.2*COUNTRY_INFO!G58/(0.5*COUNTRY_INFO!F58+0.2*COUNTRY_INFO!G58),IF(COUNTRY_INFO!K58=3,COUNTRY_INFO!G58/(COUNTRY_INFO!F58+COUNTRY_INFO!G58)))),0)","v":0},{"$f":"MAX(COUNTRY_INFO!D58*AK58*PROFILE!$G$7,COUNTRY_INFO!D58*AL58*PROFILE!$G$7)","v":1994.6570360479236},{"$f":"MAX(COUNTRY_INFO!D58*AK58*PROFILE!$G$8,COUNTRY_INFO!D58*AL58*PROFILE!$G$8,COUNTRY_INFO!D58*AM58*PROFILE!$G$8)","v":7679.9992784176593},{"$f":"MAX(COUNTRY_INFO!D58*AK58*PROFILE!$G$9,COUNTRY_INFO!D58*AL58*PROFILE!$G$9,COUNTRY_INFO!D58*AM58*PROFILE!$G$9,IF(AND(DISTRICT!Z58<>\"Inconnu\",Z58<>\"Non requis\"),COUNTRY_INFO!P58*DISTRICT!AN58,0))","v":11519.980878067994},{"$f":"MAX(COUNTRY_INFO!D58*AK58*PROFILE!$G$10,COUNTRY_INFO!D58*AL58*PROFILE!$G$10,IF(AND(DISTRICT!Z58<>\"Inconnu\",Z58<>\"Non requis\"),COUNTRY_INFO!P58*DISTRICT!AO58,0))","v":23468.760508512605},44663.397701046182,0,{"$f":"MAX('MDA4'!R58,'T1'!L58,'T2'!J58,T3_R1!K58,T3_R2!K58)","v":0},{"$f":"MAX('MDA1'!K58,'MDA4'!S58,'MDA3'!I58,'MDA3'!L58,'T1'!M58,'T2'!K58,T3_R1!L58,T3_R2!L58)","v":8233.44},{"$f":"MAX('MDA1'!L58,'MDA4'!T58,'MDA3'!J58,'MDA3'!M58,'T1'!N58,'T2'!L58,T3_R1!M58,T3_R2!M58)","v":26072.559999999998},34306,{"$f":"MAX('MDA4'!R58,T58)","v":0},{"$f":"MAX('MDA1'!K58,'MDA4'!S58,'MDA3'!I58,'MDA3'!L58,V58,AD58)","v":8233.44},{"$f":"MAX('MDA1'!L58,'MDA4'!T58,'MDA3'!J58,'MDA3'!M58,AF58)","v":26072.559999999998},34306,76.810099020291119]
[{"$f":"IF(COUNTRY_INFO!A59=0,\" \",COUNTRY_INFO!A59)","v":" Congo"},{"$f":"IF(COUNTRY_INFO!B59=0,\" \",COUNTRY_INFO!B59)","v":"Sangha"},{"$f":"IF(COUNTRY_INFO!C59=0,\" \",COUNTRY_INFO!C59)","v":"Ouesso"},{"$f":"COUNTRY_INFO!M59","v":77357},23481,25132,{"$f":"SUM('MDA1'!M59,'MDA4'!U59)","v":48813},{"$f":"IF(AND(COUNTRY_INFO!H59>0,COUNTRY_INFO!H59<4),IF(D59>MAX('MDA1'!M59,'MDA4'!U59),MAX('MDA1'!M59,'MDA4'!U59),D59),0)","v":48813},{"$f":"IF(AND(COUNTRY_INFO!H59>0,COUNTRY_INFO!H59<4), IF(G59/D59*100<>0, IF(G59/D59*100>100,100,G59/D59*100), \"-\"),0)","v":63.100947554843131},{"$f":"COUNTRY_INFO!N59","v":0},null,null,{"$f":"MAX('MDA1'!M59,MAX('MDA3'!I59,'MDA3'!L59)+MAX('MDA3'!J59,'MDA3'!M59))","v":0},{"$f":"IF(AND(COUNTRY_INFO!I59>0,COUNTRY_INFO!I59<4),IF(J59>MAX('MDA1'!M59,MAX('MDA3'!I59,'MDA3'!L59)+MAX('MDA3'!J59,'MDA3'!M59)),MAX('MDA1'!M59,MAX('MDA3'!I59,'MDA3'!L59)+MAX('MDA3'!J59,'MDA3'!M59)),J59),0)","v":0},{"$f":"IF(AND(COUNTRY_INFO!I59>0,COUNTRY_INFO!I59<4), IF(M59/J59*100<>0, IF(M59/J59*100>100,100,M59/J59*100), \"-\"),0)","v":0},{"$f":"COUNTRY_INFO!O59","v":30943},null,null,{"$f":"SUM(MAX('MDA4'!N59, 'T1'!L59, MAX(T3_R1!K59, T3_R2!K59)), MAX('MDA1'!K59, 'MDA4'!O59, 'T1'!M59, MAX(T3_R1!L59, T3_R2!L59)), MAX('MDA1'!L59, 'MDA4'!P59, 'T1'!N59, MAX(T3_R1!M59, T3_R2!M59)))","v":0},{"$f":"IF(AND(COUNTRY_INFO!J59>1,COUNTRY_INFO!J59<4),IF(COUNTRY_INFO!E59>MAX('MDA4'!N59,'T1'!L59,MAX(T3_R1!K59,T3_R2!K59)),MAX('MDA4'!N59,'T1'!L59,MAX(T3_R1!K59,T3_R2!K59)),COUNTRY_INFO!E59),0)","v":0},{"$f":"IF(AND(COUNTRY_INFO!J59>1,COUNTRY_INFO!J59<4), IF(T59/COUNTRY_INFO!E59*100<>0, IF(T59/COUNTRY_INFO!E59*100>100,100,T59/COUNTRY_INFO!E59*100), \"-\"),0)","v":"-"},{"$f":"IF(AND(COUNTRY_INFO!J59>1,COUNTRY_INFO!J59<4),IF(COUNTRY_INFO!F59>MAX('MDA1'!K59,'MDA4'!O59,'T1'!M59,MAX(T3_R1!L59,T3_R2!L59)),MAX('MDA1'!K59,'MDA4'!O59,'T1'!M59,MAX(T3_R1!L59,T3_R2!L59)),COUNTRY_INFO!F59),0)","v":0},{"$f":"IF(AND(COUNTRY_INFO!J59>1,COUNTRY_INFO!J59<4), IF(V59/COUNTRY_INFO!F59*100<>0, IF(V59/COUNTRY_INFO!F59*100>100,100,V59/COUNTRY_INFO!F59*100), \"-\"),0)","v":"-"},0,{"$f":"IF(AND(COUNTRY_INFO!J59>1,COUNTRY_INFO!J59<4), IF(S59/P59*100<>0, IF(X59/P59*100>100,100,X59/P59*100), \"-\"),0)","v":"-"},{"$f":"COUNTRY_INFO!P59","v":6126.7800000000007},null,null,{"$f":"MAX('T1'!L59,'T2'!J59)+MAX('T1'!M59,'T2'!K59)+MAX('T1'!N59,'T2'!L59)","v":0},{"$f":"IF(COUNTRY_INFO!K59=1,IF(COUNTRY_INFO!F59*0.33>MAX('T1'!M59,'T2'!K59),MAX('T1'!M59,'T2'!K59),COUNTRY_INFO!F59*0.33),IF(COUNTRY_INFO!K59=2,IF(COUNTRY_INFO!F59*0.5>MAX('T1'!M59,'T2'!K59),MAX('T1'!M59,'T2'!K59),COUNTRY_INFO!F59*0.5),IF(COUNTRY_INFO!K59=3,IF(COUNTRY_INFO!F59>MAX('T1'!M59,'T2'!K59),MAX('T1'!M59,'T2'!K59),COUNTRY_INFO!F59),0)))","v":0},{"$f":"IF(AND(COUNTRY_INFO!K59>0,COUNTRY_INFO!K59<4),IF(Z59>0,IF(COUNTRY_INFO!K59=1, AD59/(COUNTRY_INFO!F59*0.33)*100, IF(COUNTRY_INFO!K59=2, AD59/(COUNTRY_INFO!F59*0.5)*100, IF(COUNTRY_INFO!K59=3, AD59/COUNTRY_INFO!F59*100))),\"-\"),0)","v":0},{"$f":"IF(COUNTRY_INFO!K59=2,IF(COUNTRY_INFO!G59*0.2>MAX('T1'!N59,'T2'!L59),MAX('T1'!N59,'T2'!L59),COUNTRY_INFO!G59*0.2),IF(COUNTRY_INFO!K59=3,IF(COUNTRY_INFO!G59>MAX('T1'!N59,'T2'!L59),MAX('T1'!N59,'T2'!L59),COUNTRY_INFO!G59),0))","v":0},{"$f":"IF(AND(COUNTRY_INFO!K59>0,COUNTRY_INFO!K59<4),IF(Z59>0,IF(COUNTRY_INFO!K59=1, 0, IF(COUNTRY_INFO!K59=2, AF59/(COUNTRY_INFO!G59*0.2)*100, IF(COUNTRY_INFO!K59=3, AF59/COUNTRY_INFO!G59*100))),\"-\"),0)","v":0},0,{"$f":"IF(AND(COUNTRY_INFO!K59>0,COUNTRY_INFO!K59<4), IF(AC59/Z59*100<>0, IF(AH59/Z59*100>100,100,AH59/Z59*100), \"-\"),0)","v":"-"},null,{"$f":"IF(AND(D59<>0, D59<>\"Inconnu\",D59<>\"Interrompu\",D59<>\"Non requis\"),D59/COUNTRY_INFO!D59, 0)","v":1},{"$f":"IF(AND(J59<>0,J59<>\"Inconnu\",J59<>\"Interrompu\",J59<>\"Non requis\"),J59/COUNTRY_INFO!D59, 0)","v":0},{"$f":"IF(AND(P59<>0,P59<>\"Inconnu\",P59<>\"Non requis\"),P59/(COUNTRY_INFO!E59+COUNTRY_INFO!F59), 0)","v":1},{"$f":"IF(AND(Z59<>0,Z59<>\"Inconnu\",Z59<>\"Non requis\"),IF(COUNTRY_INFO!K59=1,1,IF(COUNTRY_INFO!K59=2,0.5*COUNTRY_INFO!F59/(0.5*COUNTRY_INFO!F59+0.2*COUNTRY_INFO!G59),IF(COUNTRY_INFO!K59=3,COUNTRY_INFO!F59/(COUNTRY_INFO!F59+COUNTRY_INFO!G59)))),0)","v":1},{"$f":"IF(AND(Z59<>0,Z59<>\"Inconnu\",Z59<>\"Non requis\"),IF(COUNTRY_INFO!K59=1,0,IF(COUNTRY_INFO!K59=2,0.2*COUNTRY_INFO!G59/(0.5*COUNTRY_INFO!F59+0.2*COUNTRY_INFO!G59),IF(COUNTRY_INFO!K59=3,COUNTRY_INFO!G59/(COUNTRY_INFO!F59+COUNTRY_INFO!G59)))),0)","v":0},{"$f":"MAX(COUNTRY_INFO!D59*AK59*PROFILE!$G$7,COUNTRY_INFO!D59*AL59*PROFILE!$G$7)","v":3635.822812449851},{"$f":"MAX(COUNTRY_INFO!D59*AK59*PROFILE!$G$8,COUNTRY_INFO!D59*AL59*PROFILE!$G$8,COUNTRY_INFO!D59*AM59*PROFILE!$G$8)","v":12377.118837094893},{"$f":"MAX(COUNTRY_INFO!D59*AK59*PROFILE!$G$9,COUNTRY_INFO!D59*AL59*PROFILE!$G$9,COUNTRY_INFO!D59*AM59*PROFILE!$G$9,IF(AND(DISTRICT!Z59<>\"Inconnu\",Z59<>\"Non requis\"),COUNTRY_INFO!P59*DISTRICT!AN59,0))","v":18565.649183014702},{"$f":"MAX(COUNTRY_INFO!D59*AK59*PROFILE!$G$10,COUNTRY_INFO!D59*AL59*PROFILE!$G$10,IF(AND(DISTRICT!Z59<>\"Inconnu\",Z59<>\"Non requis\"),COUNTRY_INFO!P59*DISTRICT!AO59,0))","v":42778.40916744055},77357,0,{"$f":"MAX('MDA4'!R59,'T1'!L59,'T2'!J59,T3_R1!K59,T3_R2!K59)","v":0},{"$f":"MAX('MDA1'!K59,'MDA4'!S59,'MDA3'!I59,'MDA3'!L59,'T1'!M59,'T2'!K59,T3_R1!L59,T3_R2!L59)","v":11715.12},{"$f":"MAX('MDA1'!L59,'MDA4'!T59,'MDA3'!J59,'MDA3'!M59,'T1'!N59,'T2'!L59,T3_R1!M59,T3_R2!M59)","v":37097.879999999997},48813,{"$f":"MAX('MDA4'!R59,T59)","v":0},{"$f":"MAX('MDA1'!K59,'MDA4'!S59,'MDA3'!I59,'MDA3'!L59,V59,AD59)","v":11715.12},{"$f":"MAX('MDA1'!L59,'MDA4'!T59,'MDA3'!J59,'MDA3'!M59,AF59)","v":37097.879999999997},48813,63.100947554843131]
[{"$f":"IF(COUNTRY_INFO!A60=0,\" \",COUNTRY_INFO!A60)","v":" Congo"},{"$f":"IF(COUNTRY_INFO!B60=0,\" \",COUNTRY_INFO!B60)","v":"Sangha"},{"$f":"IF(COUNTRY_INFO!C60=0,\" \",COUNTRY_INFO!C60)","v":"Sembé-Souanké"},{"$f":"COUNTRY_INFO!M60","v":35156},11300,10483,{"$f":"SUM('MDA1'!M60,'MDA4'!U60)","v":21783},{"$f":"IF(AND(COUNTRY_INFO!H60>0,COUNTRY_INFO!H60<4),IF(D60>MAX('MDA1'!M60,'MDA4'!U60),MAX('MDA1'!M60,'MDA4'!U60),D60),0)","v":21783},{"$f":"IF(AND(COUNTRY_INFO!H60>0,COUNTRY_INFO!H60<4), IF(G60/D60*100<>0, IF(G60/D60*100>100,100,G60/D60*100), \"-\"),0)","v":61.960973944703611},{"$f":"COUNTRY_INFO!N60","v":0},null,null,{"$f":"MAX('MDA1'!M60,MAX('MDA3'!I60,'MDA3'!L60)+MAX('MDA3'!J60,'MDA3'!M60))","v":0},{"$f":"IF(AND(COUNTRY_INFO!I60>0,COUNTRY_INFO!I60<4),IF(J60>MAX('MDA1'!M60,MAX('MDA3'!I60,'MDA3'!L60)+MAX('MDA3'!J60,'MDA3'!M60)),MAX('MDA1'!M60,MAX('MDA3'!I60,'MDA3'!L60)+MAX('MDA3'!J60,'MDA3'!M60)),J60),0)","v":0},{"$f":"IF(AND(COUNTRY_INFO!I60>0,COUNTRY_INFO!I60<4), IF(M60/J60*100<>0, IF(M60/J60*100>100,100,M60/J60*100), \"-\"),0)","v":0},{"$f":"COUNTRY_INFO!O60","v":14062},null,null,{"$f":"SUM(MAX('MDA4'!N60, 'T1'!L60, MAX(T3_R1!K60, T3_R2!K60)), MAX('MDA1'!K60, 'MDA4'!O60, 'T1'!M60, MAX(T3_R1!L60, T3_R2!L60)), MAX('MDA1'!L60, 'MDA4'!P60, 'T1'!N60, MAX(T3_R1!M60, T3_R2!M60)))","v":0},{"$f":"IF(AND(COUNTRY_INFO!J60>1,COUNTRY_INFO!J60<4),IF(COUNTRY_INFO!E60>MAX('MDA4'!N60,'T1'!L60,MAX(T3_R1!K60,T3_R2!K60)),MAX('MDA4'!N60,'T1'!L60,MAX(T3_R1!K60,T3_R2!K60)),COUNTRY_INFO!E60),0)","v":0},{"$f":"IF(AND(COUNTRY_INFO!J60>1,COUNTRY_INFO!J60<4), IF(T60/COUNTRY_INFO!E60*100<>0, IF(T60/COUNTRY_INFO!E60*100>100,100,T60/COUNTRY_INFO!E60*100), \"-\"),0)","v":"-"},{"$f":"IF(AND(COUNTRY_INFO!J60>1,COUNTRY_INFO!J60<4),IF(COUNTRY_INFO!F60>MAX('MDA1'!K60,'MDA4'!O60,'T1'!M60,MAX(T3_R1!L60,T3_R2!L60)),MAX('MDA1'!K60,'MDA4'!O60,'T1'!M60,MAX(T3_R1!L60,T3_R2!L60)),COUNTRY_INFO!F60),0)","v":0},{"$f":"IF(AND(COUNTRY_INFO!J60>1,COUNTRY_INFO!J60<4), IF(V60/COUNTRY_INFO!F60*100<>0, IF(V60/COUNTRY_INFO!F60*100>100,100,V60/COUNTRY_INFO!F60*100), \"-\"),0)","v":"-"},0,{"$f":"IF(AND(COUNTRY_INFO!J60>1,COUNTRY_INFO!J60<4), IF(S60/P60*100<>0, IF(X60/P60*100>100,100,X60/P60*100), \"-\"),0)","v":"-"},{"$f":"COUNTRY_INFO!P60","v":0},null,null,{"$f":"MAX('T1'!L60,'T2'!J60)+MAX('T1'!M60,'T2'!K60)+MAX('T1'!N60,'T2'!L60)","v":0},{"$f":"IF(COUNTRY_INFO!K60=1,IF(COUNTRY_INFO!F60*0.33>MAX('T1'!M60,'T2'!K60),MAX('T1'!M60,'T2'!K60),COUNTRY_INFO!F60*0.33),IF(COUNTRY_INFO!K60=2,IF(COUNTRY_INFO!F60*0.5>MAX('T1'!M60,'T2'!K60),MAX('T1'!M60,'T2'!K60),COUNTRY_INFO!F60*0.5),IF(COUNTRY_INFO!K60=3,IF(COUNTRY_INFO!F60>MAX('T1'!M60,'T2'!K60),MAX('T1'!M60,'T2'!K60),COUNTRY_INFO!F60),0)))","v":0},{"$f":"IF(AND(COUNTRY_INFO!K60>0,COUNTRY_INFO!K60<4),IF(Z60>0,IF(COUNTRY_INFO!K60=1, AD60/(COUNTRY_INFO!F60*0.33)*100, IF(COUNTRY_INFO!K60=2, AD60/(COUNTRY_INFO!F60*0.5)*100, IF(COUNTRY_INFO!K60=3, AD60/COUNTRY_INFO!F60*100))),\"-\"),0)","v":0},{"$f":"IF(COUNTRY_INFO!K60=2,IF(COUNTRY_INFO!G60*0.2>MAX('T1'!N60,'T2'!L60),MAX('T1'!N60,'T2'!L60),COUNTRY_INFO!G60*0.2),IF(COUNTRY_INFO!K60=3,IF(COUNTRY_INFO!G60>MAX('T1'!N60,'T2'!L60),MAX('T1'!N60,'T2'!L60),COUNTRY_INFO!G60),0))","v":0},{"$f":"IF(AND(COUNTRY_INFO!K60>0,COUNTRY_INFO!K60<4),IF(Z60>0,IF(COUNTRY_INFO!K60=1, 0, IF(COUNTRY_INFO!K60=2, AF60/(COUNTRY_INFO!G60*0.2)*100, IF(COUNTRY_INFO!K60=3, AF60/COUNTRY_INFO!G60*100))),\"-\"),0)","v":0},0,{"$f":"IF(AND(COUNTRY_INFO!K60>0,COUNTRY_INFO!K60<4), IF(AC60/Z60*100<>0, IF(AH60/Z60*100>100,100,AH60/Z60*100), \"-\"),0)","v":0},null,{"$f":"IF(AND(D60<>0, D60<>\"Inconnu\",D60<>\"Interrompu\",D60<>\"Non requis\"),D60/COUNTRY_INFO!D60, 0)","v":1},{"$f":"IF(AND(J60<>0,J60<>\"Inconnu\",J60<>\"Interrompu\",J60<>\"Non requis\"),J60/COUNTRY_INFO!D60, 0)","v":0},{"$f":"IF(AND(P60<>0,P60<>\"Inconnu\",P60<>\"Non requis\"),P60/(COUNTRY_INFO!E60+COUNTRY_INFO!F60), 0)","v":1},{"$f":"IF(AND(Z60<>0,Z60<>\"Inconnu\",Z60<>\"Non requis\"),IF(COUNTRY_INFO!K60=1,1,IF(COUNTRY_INFO!K60=2,0.5*COUNTRY_INFO!F60/(0.5*COUNTRY_INFO!F60+0.2*COUNTRY_INFO!G60),IF(COUNTRY_INFO!K60=3,COUNTRY_INFO!F60/(COUNTRY_INFO!F60+COUNTRY_INFO!G60)))),0)","v":0},{"$f":"IF(AND(Z60<>0,Z60<>\"Inconnu\",Z60<>\"Non requis\"),IF(COUNTRY_INFO!K60=1,0,IF(COUNTRY_INFO!K60=2,0.2*COUNTRY_INFO!G60/(0.5*COUNTRY_INFO!F60+0.2*COUNTRY_INFO!G60),IF(COUNTRY_INFO!K60=3,COUNTRY_INFO!G60/(COUNTRY_INFO!F60+COUNTRY_INFO!G60)))),0)","v":0},{"$f":"MAX(COUNTRY_INFO!D60*AK60*PROFILE!$G$7,COUNTRY_INFO!D60*AL60*PROFILE!$G$7)","v":1652.3519111972666},{"$f":"MAX(COUNTRY_INFO!D60*AK60*PROFILE!$G$8,COUNTRY_INFO!D60*AL60*PROFILE!$G$8,COUNTRY_INFO!D60*AM60*PROFILE!$G$8)","v":5624.9594715010671},{"$f":"MAX(COUNTRY_INFO!D60*AK60*PROFILE!$G$9,COUNTRY_INFO!D60*AL60*PROFILE!$G$9,COUNTRY_INFO!D60*AM60*PROFILE!$G$9,IF(AND(DISTRICT!Z60<>\"Inconnu\",Z60<>\"Non requis\"),COUNTRY_INFO!P60*DISTRICT!AN60,0))","v":8437.4259947782994},{"$f":"MAX(COUNTRY_INFO!D60*AK60*PROFILE!$G$10,COUNTRY_INFO!D60*AL60*PROFILE!$G$10,IF(AND(DISTRICT!Z60<>\"Inconnu\",Z60<>\"Non requis\"),COUNTRY_INFO!P60*DISTRICT!AO60,0))","v":19441.262622523365},35156,0,{"$f":"MAX('MDA4'!R60,'T1'!L60,'T2'!J60,T3_R1!K60,T3_R2!K60)","v":0},{"$f":"MAX('MDA1'!K60,'MDA4'!S60,'MDA3'!I60,'MDA3'!L60,'T1'!M60,'T2'!K60,T3_R1!L60,T3_R2!L60)","v":5227.92},{"$f":"MAX('MDA1'!L60,'MDA4'!T60,'MDA3'!J60,'MDA3'!M60,'T1'!N60,'T2'!L60,T3_R1!M60,T3_R2!M60)","v":16555.080000000002},21783,{"$f":"MAX('MDA4'!R60,T60)","v":0},{"$f":"MAX('MDA1'!K60,'MDA4'!S60,'MDA3'!I60,'MDA3'!L60,V60,AD60)","v":5227.92},{"$f":"MAX('MDA1'!L60,'MDA4'!T60,'MDA3'!J60,'MDA3'!M60,AF60)","v":16555.080000000002},21783,61.960973944703611]

{"sheet":"SUMMARY","index":10,"n_rows":70,"n_cols":8,"rows_kept":70,"cut":false,"hidden":false,"merged":[[15,1,15,3],[1,1,1,7],[5,1,11,7],[3,3,3,5],[0,3,0,7],[32,1,32,2],[33,1,33,2],[34,1,34,2],[35,1,35,2],[23,1,23,5],[31,1,31,2],[24,1,24,5],[25,1,25,5],[26,1,26,5],[27,1,27,5],[69,1,69,2],[36,1,36,2],[37,1,37,2],[38,1,38,2],[66,1,66,7],[54,1,60,7],[68,1,68,2],[49,1,49,7],[50,3,50,4],[62,1,62,3],[62,4,62,7],[63,4,64,7],[64,1,64,3]]}
[null,null,null,"Cette version sera utilisée par les pays endémiques à la Loase"]
[null,"Formulaire de Rapport Commun v.3 (L)"]
[]
[null,"Pays",null,{"$f":"IF(INTRO!$E$34<>0,INTRO!$E$34,\" \")","v":" Congo"},null,null,"Année",{"$f":"IF(INTRO!$E$36<>0,INTRO!$E$36,\" \")","v":2019}]
[]
[null,"Les autorités nationales sont priées de compléter ce formulaire de rapport commun et de le soumettre à l'Organisation mondiale de la Santé avant le 15 août de l'année en cours pour rapporter les données des activités de chimioprévention mises en oeuvre l'année précédente. "]
[]
[]
[]
[]
[]
[]
[]
[null,"Nombre de personnes ayant reçu un traitement (au moins une fois) pour les maladies"]
[]
[null,null,null,null,"EAPréS","EAS","Adultes","Total"]
[null,"Filariose lymphatique",null,null,0,129197,402985,{"$f":"SUM(E17:G17)","v":532182}]
[null,"Onchocercose",null,null,"Not eligible",139655,442249,{"$f":"SUM(E18:G18)","v":581904}]
[null,"Géohelminthiases",null,null,0,129197,402985,{"$f":"SUM(E19:G19)","v":532182}]
[null,"Schistosomiase",null,null,"Not targeted",0,0,{"$f":"SUM(E20:G20)","v":0}]
[]
[null,"Couverture des interventions de CP contre les maladies (%) "]
[]
[null,null,null,null,null,null,"Géographique","National"]
[null,"Filariose lymphatique",null,null,null,null,100,52.3429182947865]
[null,"Onchocercose",null,null,null,null,100,81.554671667269318]
[null,"Géohelminthiases",null,null,null,null,20,7.3916767283074556]
[null,"Schistosomiase",null,null,null,null,0,"-"]
[]
[null,"Nombre de personnes traitées et couverture du programme en pourcentage, par intervention de CP"]
[]
[null,null,null,"EAPréS","EAS","Adultes","Total","Couverture"]
[null,"MDA 1 (IVM+ALB)",null,"Non admissible",{"$f":"'MDA1'!$K$4","v":28905.119999999999},{"$f":"'MDA1'!$L$4","v":91532.88},{"$f":"'MDA1'!$M$4","v":120438},{"$f":"'MDA1'!$Q$4","v":99.031344878520969}]
[null,"MDA 4 (ALB/2*ALB)",null,{"$f":"'MDA4'!$R$4","v":0},{"$f":"'MDA4'!$S$4","v":100292.08},{"$f":"'MDA4'!$T$4","v":311451.83999999997},{"$f":"'MDA4'!$U$4","v":411743.92000000004},{"$f":"'MDA4'!$Y$4","v":45.412914276151277}]
[null,"MDA 3 (IVM)",null,"Non admissible",{"$f":"'MDA3'!$O$4","v":110751.6},{"$f":"'MDA3'!$P$4","v":350714.39999999997},{"$f":"'MDA3'!$Q$4","v":461466},{"$f":"'MDA3'!$T$4","v":96.594409980480421}]
[null,"T 1 (PZQ+ALB/MBD)",null,{"$f":"IF('T1'!$L$4<>0,'T1'!$L$4,\"Non ciblé\")","v":"Non ciblé"},{"$f":"'T1'!$M$4","v":0},{"$f":"IF('T1'!$N$4<>0,'T1'!$N$4,\"Non ciblé\")","v":"Non ciblé"},{"$f":"'T1'!$O$4","v":0},{"$f":"'T1'!$S$4","v":" "}]
[null,"T 2 (PZQ)",null,{"$f":"IF('T2'!$J$4<>0,'T2'!$J$4,\"Non ciblé\")","v":"Non ciblé"},{"$f":"'T2'!$K$4","v":0},{"$f":"'T2'!$L$4","v":0},{"$f":"'T2'!$M$4","v":0},{"$f":"'T2'!$Q$4","v":" "}]
[null,"T 3 (ALB/MBD) - tournée 1",null,{"$f":"T3_R1!$K$4","v":0},{"$f":"T3_R1!$L$4","v":0},{"$f":"IF(T3_R1!$M$4<>0,T3_R1!$M$4,\"Non ciblé\")","v":"Non ciblé"},{"$f":"T3_R1!$N$4","v":0},{"$f":"T3_R1!$R$4","v":" "}]
[null,"T 3 (ALB/MBD) - tournée 2",null,{"$f":"T3_R2!$K$4","v":0},{"$f":"T3_R2!$L$4","v":0},{"$f":"IF(T3_R2!$M$4<>0,T3_R2!$M$4,\"Non ciblé\")","v":"Non ciblé"},{"$f":"T3_R2!$N$4","v":0},{"$f":"T3_R2!$R$4","v":" "}]
[]
[null,"Inventaire des médicaments pour la chimiothérapie préventive dans le pays"]
[]
[null,null,"IVM","DEC","ALB (FL)","ALB (STH)","MBD","PZQ"]
[null,"Disponible",47000,null,451800,null,null,181000]
[null,"Distribué",1713500,null,870000,null,null,0]
[null,"Gaspillé",81000,null,null,null,null,181000]
[null,"Reçus",1772000,null,1299000,528000,null,396000]
[null,"Restant",{"$f":"C44-C45-C46+C47","v":24500},0,{"$f":"E44-E45-E46+E47","v":880800},528000,null,396000]
[]
[null,"Veuillez indiquer le médicament qui a été utilisé pour traiter les EAPréS, et les mécanismes de distribution"]
[null,"Médicament",null,"Mécanismes de distribution",null,null,"Source"]
[]
[null,"Remarques supplémentaires évenuelles concernant le rapport"]
[]
[null," "]
[]
[]
[]
[]
[]
[]
[]
[null,"Nom et signature du Coordonnateur MTN \nou du Représentant du Ministère de la Santé :",null,null,"Dr François MISSAMOU"]
[null,null,null,null,"2020-08-19"]
[null,"Date:"]
[]
[null,"Veuillez envoyer le rapport national (signé et sous format électronique) au représentant de l'OMS du pays en mettant en copie :"]
[]
[null,"Siège de l'OMS ",null,"PC_JointForms@who.int"]
[null,"Bureau régional de l'OMS",null,"Conseiller régional MTN"]

{"sheet":"PROFILE","index":11,"n_rows":124,"n_cols":8,"rows_kept":124,"cut":false,"hidden":false,"merged":[[16,1,16,6],[18,1,18,6],[14,1,14,6],[15,1,15,6],[7,4,7,5],[8,4,8,5],[9,4,9,5],[7,1,7,3],[8,1,8,3],[9,1,9,3],[17,1,17,6],[63,1,63,3],[25,1,25,3],[0,1,0,5],[1,1,1,7],[3,3,3,5],[5,3,5,5],[4,1,4,7],[5,1,5,2],[11,1,11,6],[6,1,6,3],[6,4,6,5],[12,1,12,6],[47,1,47,3],[51,1,51,3],[13,1,13,6],[27,1,27,3],[28,1,28,3],[59,1,59,3],[30,1,30,3],[34,1,34,3],[42,1,42,3],[81,1,81,3],[19,1,19,6],[43,1,43,3],[77,1,77,3],[80,1,80,3],[78,1,78,3],[23,1,23,3],[20,1,20,6],[79,1,79,3],[55,1,55,3],[65,1,65,3],[29,1,29,3],[21,1,21,6],[69,1,69,3],[73,1,73,3],[26,1,26,3],[123,1,124,7],[85,6,85,7],[87,6,87,7],[89,6,89,7],[86,6,86,7],[88,6,88,7]]}
[]
[null,"Formulaire de Rapport Commun v.3 - CP"]
[]
[null,"Pays",null,{"$f":"IF(INTRO!$E$34<>0,INTRO!$E$34,\" \")","v":" Congo"},null,null,"Année",{"$f":"IF(INTRO!$E$36<>0,INTRO!$E$36,\" \")","v":2019}]
[null,"!!! ATTENTION !!!\nAvant d’analyser les données dans le profil du pays, merci de vous assurer que le rapport dans l’onglet SUMMARY est bien mis à jour"]
[null,"Population totale ",null,null,null,null,1,{"$f":"COUNTRY_INFO!D4","v":5321638}]
[null,"Population — autres groupes d’âge",null,null,null,null,{"$f":"IF($H$6<>0,H7/$H$6,0)","v":4.7000566366971974E-2},{"$f":"H6-SUM(H8:H10)","v":250120}]
[null,"Population — EAPréS",null,null,{"$f":"INTRO!B48","v":"1-4 ans"},null,{"$f":"IF($H$6<>0,H8/$H$6,0)","v":0.15999998496703458},{"$f":"COUNTRY_INFO!E4","v":851462}]
[null,"Population — EAS",null,null,{"$f":"INTRO!B49","v":"5-14 ans"},null,{"$f":"IF($H$6<>0,H9/$H$6,0)","v":0.23999960162641654},{"$f":"COUNTRY_INFO!F4","v":1277191}]
[null,"Population — Adults",null,null,{"$f":"INTRO!B50","v":"15 ans et plus"},null,0.55299984703957694,{"$f":"COUNTRY_INFO!G4","v":2942865}]
[]
[null,"Nombre total d’individus nécessitant une CP pour au moins une des maladies (FL, Oncho, STH, SCH)",null,null,null,null,null,{"$f":"DISTRICT!AT6","v":2195148.3842707528}]
[null,"Proportion du nombre d’individus nécessitant un CP pour au moins une maladie parmi la population totale",null,null,null,null,null,{"$f":"IF(H6<>0,H12/H6,0)","v":0.41249487174263877}]
[null,"Nombre d’UMOs nécessitant une CP pour au moins une des maladies (FL, Oncho, STH, SCH)",null,null,null,null,null,{"$f":"COUNTIF(DISTRICT!AT9:AT1000,\">0\")","v":41}]
[null,"Nombre d’UMOs ayant reçu une CP pour au moins une des maladies (FL, Oncho, STH, SCH)",null,null,null,null,null,{"$f":"COUNTIF(DISTRICT!AY9:AY1000,\">0\")","v":26}]
[null,"Proportion d’UMOs nécessitant une CP pour au moins une maladie et l’ayant reçue",null,null,null,null,null,{"$f":"IF(H14<>0,H15/H14,0)","v":0.63414634146341464}]
[null,"Nombre total d’individus ayant été traités pour au moins une maladie (FL, Oncho, STH, SCH)",null,null,null,null,null,{"$f":"DISTRICT!AY6","v":948201.91999999993}]
[null,"Nombre total d’individus nécessitant un traitement ayant reçu une CP pour au moins une maladie (FL, Oncho, STH, SCH)",null,null,null,null,null,{"$f":"DISTRICT!BC6","v":948201.91999999993}]
[null,"Couverture CP pour au moins une maladie (FL, Oncho, STH, SCH)",null,null,null,null,null,{"$f":"DISTRICT!BD6","v":0.43195345098049071}]
[null,"Nombre d’UMOs ayant été traitées pour toutes les maladies nécessitant une CP dans ces unités",null,null,null,null,null,{"$f":"DISTRICT!AU6","v":5}]
[null,"Population nécessitant une CP dans des UMOs qui ont été traitées pour toutes les maladies requérant une CP",null,null,null,null,null,{"$f":"SUMIF(DISTRICT!AU9:AU1000,\"Y\",DISTRICT!AT9:AT1000)","v":440507}]
[null,"Population ayant reçu une CP dans des UMOs qui ont été traitées pour toutes les maladies nécessitant une CP",null,null,null,null,null,{"$f":"SUMIF(DISTRICT!AU9:AU1000,\"Y\",DISTRICT!AY9:AY1000)","v":310009}]
[]
[null,null,null,null,"FL","ONCHO","STH","SCH"]
[]
[null,"Maladies nécessitant une CP dans la pays",null,null,{"$f":"IF(INTRO!E38=\"Endémique\",\"Yes\",\"No\")","v":"Yes"},{"$f":"IF(INTRO!E40=\"Endémique\",\"Yes\",\"No\")","v":"Yes"},{"$f":"IF(INTRO!E42=\"Endémique\",\"Yes\",\"No\")","v":"Yes"},{"$f":"IF(INTRO!E44=\"Endémique\",\"Yes\",\"No\")","v":"Yes"}]
[null,"Nombre d’UMOs dans le pays",null,null,{"$f":"IF(E26=\"Yes\",INTRO!$E$46,\"-\")","v":52},{"$f":"IF(F26=\"Yes\",INTRO!$E$46,\"-\")","v":52},{"$f":"IF(G26=\"Yes\",INTRO!$E$46,\"-\")","v":52},{"$f":"IF(H26=\"Yes\",INTRO!$E$46,\"-\")","v":52}]
[null,"Nombre d’UMOs dont le statut d’endémicité est connu",null,null,{"$f":"IF(E26=\"Yes\",E27-E29,\"-\")","v":52},{"$f":"IF(F26=\"Yes\",F27-F29,\"-\")","v":19},{"$f":"IF(G26=\"Yes\",G27-G29,\"-\")","v":52},{"$f":"IF(H26=\"Yes\",H27-H29,\"-\")","v":47}]
[null,"Nombre d’UMOs dont le statut d’endémicité est inconnu",null,null,{"$f":"IF(E26=\"Yes\",E27-(992-COUNTIF(COUNTRY_INFO!H$9:H$1000,\"\"))+COUNTIF(COUNTRY_INFO!H$9:H$1000,\"=4\"),\"-\")","v":0},{"$f":"IF(F26=\"Yes\",F27-(992-COUNTIF(COUNTRY_INFO!I$9:I$1000,\"\"))+COUNTIF(COUNTRY_INFO!I$9:I$1000,\"=4\"),\"-\")","v":33},{"$f":"IF(G26=\"Yes\",G27-(992-COUNTIF(COUNTRY_INFO!J$9:J$1000,\"\"))+COUNTIF(COUNTRY_INFO!J$9:J$1000,\"=4\")+COUNTIF(COUNTRY_INFO!J$9:J$1000,\"=5\"),\"-\")","v":0},{"$f":"IF(H26=\"Yes\",H27-(992-COUNTIF(COUNTRY_INFO!K$9:K$1000,\"\"))+COUNTIF(COUNTRY_INFO!K$9:K$1000,\"=4\")+COUNTIF(COUNTRY_INFO!K$9:K$1000,\"=5\"),\"-\")","v":5}]
[null,"Nombre d’UMOs non-endémiques",null,null,{"$f":"IF(E26=\"Yes\",COUNTIF(COUNTRY_INFO!H$9:H$1000,\"=0\"),\"-\")","v":39},{"$f":"IF(F26=\"Yes\",COUNTIF(COUNTRY_INFO!I$9:I$1000,\"=0\"),\"-\")","v":0},{"$f":"IF(G26=\"Yes\",COUNTIF(COUNTRY_INFO!J$9:J$1000,\"=0\"),\"-\")","v":1},{"$f":"IF(H26=\"Yes\",COUNTIF(COUNTRY_INFO!K$9:K$1000,\"=0\"),\"-\")","v":26}]
[null,"Nombre d’UMOs nécessitant une CP (total)",null,null,{"$f":"COUNTIF(COUNTRY_INFO!H$9:H$1000,\"=1\")","v":13},{"$f":"COUNTIF(COUNTRY_INFO!I$9:I$1000,\"=1\")","v":19},{"$f":"SUM(G33:G34)","v":30},{"$f":"SUM(H32:H34)","v":21}]
[null,null,null,"prevalence basse",null,null,{"$f":"COUNTIF(COUNTRY_INFO!J$9:J$1000,\"=1\")","v":21},{"$f":"COUNTIF(COUNTRY_INFO!K$9:K$1000,\"=1\")","v":12}]
[null,null,null,"prevalence modérée",null,null,{"$f":"COUNTIF(COUNTRY_INFO!J$9:J$1000,\"=2\")","v":22},{"$f":"COUNTIF(COUNTRY_INFO!K$9:K$1000,\"=2\")","v":4}]
[null,null,null,"prevalence haute",null,null,{"$f":"COUNTIF(COUNTRY_INFO!J$9:J$1000,\"=3\")","v":8},{"$f":"COUNTIF(COUNTRY_INFO!K$9:K$1000,\"=3\")","v":5}]
[null,"Population nécessitant une CP dans le pays (total) ",null,null,{"$f":"COUNTRY_INFO!M4","v":1031260},{"$f":"COUNTRY_INFO!N4","v":713514},{"$f":"COUNTRY_INFO!O4","v":809022},{"$f":"COUNTRY_INFO!P4","v":408975.29}]
[null,null,"EAPréS","prevalence modérée",null,null,{"$f":"SUMIF(COUNTRY_INFO!J$9:J$1000,\"=2\",COUNTRY_INFO!E$9:E$1000)","v":262848}]
[null,null,null,"prevalence haute",null,null,{"$f":"SUMIF(COUNTRY_INFO!J$9:J$1000,\"=3\",COUNTRY_INFO!E$9:E$1000)","v":60761}]
[null,null,"EAS","prevalence basse",null,null,null,{"$f":"SUMIF(COUNTRY_INFO!K$9:K$1000,\"=1\",COUNTRY_INFO!F$9:F$1000)*0.33","v":114309.69}]
[null,null,null,"prevalence modérée",null,null,{"$f":"SUMIF(COUNTRY_INFO!J$9:J$1000,\"=2\",COUNTRY_INFO!F$9:F$1000)","v":394272},{"$f":"SUMIF(COUNTRY_INFO!K$9:K$1000,\"=2\",COUNTRY_INFO!F$9:F$1000)*0.5","v":36265}]
[null,null,null,"prevalence haute",null,null,{"$f":"SUMIF(COUNTRY_INFO!J$9:J$1000,\"=3\",COUNTRY_INFO!F$9:F$1000)","v":91141},{"$f":"SUMIF(COUNTRY_INFO!K$9:K$1000,\"=3\",COUNTRY_INFO!F$9:F$1000)","v":68089}]
[null,null,"Adults","prevalence modérée",null,null,null,{"$f":"SUMIF(COUNTRY_INFO!K$9:K$1000,\"=2\",COUNTRY_INFO!G$9:G$1000)*0.2","v":33424.6}]
[null,null,null,"prevalence haute",null,null,null,{"$f":"SUMIF(COUNTRY_INFO!K$9:K$1000,\"=3\",COUNTRY_INFO!G$9:G$1000)","v":156887}]
[null,"Nombre d’UMOs où une CP a été mise en oeuvre (total)",null,null,{"$f":"COUNTIF(DISTRICT!G$9:G$1000,\">0\")","v":13},{"$f":"COUNTIF(DISTRICT!M$9:M$1000,\">0\")","v":19},{"$f":"COUNTIF(DISTRICT!S$9:S$1000,\">0\")","v":7},{"$f":"COUNTIF(DISTRICT!AC$9:AC$1000,\">0\")","v":0}]
[null,"Nombre d’UMOs nécessitant une CP et  où elle a été mise en oeuvre",null,null,{"$f":"COUNTIF(DISTRICT!H$9:H$1000,\">0\")","v":13},{"$f":"COUNTIF(DISTRICT!N$9:N$1000,\">0\")","v":19},{"$f":"COUNTIF(DISTRICT!X$9:X$1000,\">0\")","v":6},{"$f":"COUNTIF(DISTRICT!AH$9:AH$1000,\">0\")","v":0}]
[null,null,"EAPréS",null,null,null,{"$f":"COUNTIF(DISTRICT!T$9:T$1000,\">0\")","v":0}]
[null,null,"EAS",null,null,null,{"$f":"COUNTIF(DISTRICT!V$9:V$1000,\">0\")","v":6},{"$f":"COUNTIF(DISTRICT!AD$9:AD$1000,\">0\")","v":0}]
[null,null,"Adults",null,null,null,null,{"$f":"COUNTIF(DISTRICT!AF$9:AF$1000,\">0\")","v":0}]
[null,"Nombre d’individus traités (total)",null,null,{"$f":"DISTRICT!G4","v":532181.92000000004},{"$f":"DISTRICT!M4","v":581904},{"$f":"DISTRICT!S4","v":266622},{"$f":"DISTRICT!AC4","v":0}]
[null,null,"EAPréS",null,{"$f":"SUMMARY!$E17","v":0},{"$f":"SUMMARY!$E18","v":"Not eligible"},{"$f":"SUMMARY!$E19","v":0},{"$f":"SUMMARY!$E20","v":"Not targeted"}]
[null,null,"EAS",null,{"$f":"SUMMARY!$F17","v":129197},{"$f":"SUMMARY!$F18","v":139655},{"$f":"SUMMARY!$F19","v":129197},{"$f":"SUMMARY!$F20","v":0}]
[null,null,"Adults",null,{"$f":"SUMMARY!$G17","v":402985},{"$f":"SUMMARY!$G18","v":442249},{"$f":"SUMMARY!$G19","v":402985},{"$f":"SUMMARY!$G20","v":0}]
[null,"Nombre d’individus nécessitant CP et traités (total)",null,null,{"$f":"DISTRICT!H4","v":486735.92000000004},{"$f":"DISTRICT!N4","v":581904},{"$f":"DISTRICT!X4","v":54283.919999999991},{"$f":"DISTRICT!AH4","v":0}]
[null,null,"EAPréS",null,null,null,{"$f":"DISTRICT!T4","v":0}]
[null,null,"EAS",null,null,null,{"$f":"DISTRICT!V4","v":54283.919999999991},{"$f":"DISTRICT!AD4","v":0}]
[null,null,"Adults",null,null,null,null,{"$f":"DISTRICT!AF4","v":0}]
[null,"Couverture géographique (tous âges)",null,null,{"$f":"IF(E31<>0,E44/E31,0)","v":1},{"$f":"IF(F31<>0,F44/F31,0)","v":1},{"$f":"IF(G31<>0,G44/G31,0)","v":0.2},{"$f":"IF(H31<>0,H44/H31,0)","v":0}]
[null,null,"EAPréS",null,null,null,{"$f":"IF(G31<>0,G45/G31,0)","v":0}]
[null,null,"EAS",null,null,null,{"$f":"IF(G31<>0,G46/G31,0)","v":0.2},{"$f":"IF(H31<>0,H46/H31,0)","v":0}]
[null,null,"Adults",null,null,null,null,{"$f":"IF(SUM(H33:H34)<>0,H47/SUM(H33:H34),0)","v":0}]
[null,"Couverture nationale (total)",null,null,{"$f":"IF(E35<>0,E52/E35,0)","v":0.47198176987374674},{"$f":"IF(F35<>0,F52/F35,0)","v":0.81554671667269318},{"$f":"IF(G35<>0,G52/G35,0)","v":6.7098200048947981E-2},{"$f":"IF(H35<>0,H52/H35,0)","v":0}]
[null,null,"EAPréS",null,null,null,{"$f":"IF(SUM(G36:G37)<>0,G53/SUM(G36:G37),0)","v":0}]
[null,null,"EAS",null,null,null,{"$f":"IF(SUM(G39:G40)<>0,G54/SUM(G39:G40),0)","v":0.11183037949127854},{"$f":"IF(SUM(H38:H40)<>0,H54/SUM(H38:H40),0)","v":0}]
[null,null,"Adults",null,null,null,null,{"$f":"IF(SUM(H41:H42)<>0,H55/SUM(H41:H42),0)","v":0}]
[null,null,null,null,"FL","ONCHO","STH","SCH"]
[]
[null,"Nombre d’UMOs ayant réalisé une couverture efficace (tous âges)",null,null,{"$f":"COUNTIF(DISTRICT!I$9:I$1000,\">=65\")","v":0},{"$f":"COUNTIF(DISTRICT!O$9:O$1000,\">=65\")","v":19},{"$f":"COUNTIF(DISTRICT!Y$9:Y$1000,\">=75\")","v":0},{"$f":"COUNTIF(DISTRICT!AI$9:AI$1000,\">=75\")","v":0}]
[null,null,"EAPréS",null,null,null,{"$f":"COUNTIF(DISTRICT!U$9:U$1000,\">=75\")","v":0}]
[null,null,"EAS",null,null,null,{"$f":"COUNTIF(DISTRICT!W$9:W$1000,\">=75\")","v":0},{"$f":"COUNTIF(DISTRICT!AE$9:AE$1000,\">=75\")","v":0}]
[null,null,"Adults",null,null,null,null,{"$f":"COUNTIF(DISTRICT!AG$9:AG$1000,\">=75\")","v":0}]
[null,"Nombre d’individus nécessitant un traitement dans des UMOs ayant réalisé une couverture efficace (total)",null,null,{"$f":"SUMIF(DISTRICT!I9:I1000,\">=65\",DISTRICT!H9:H1000)","v":0},{"$f":"SUMIF(DISTRICT!O9:O1000,\">=65\",DISTRICT!N9:N1000)","v":581904},{"$f":"SUMIF(DISTRICT!Y9:Y1000,\">=75\",DISTRICT!X9:X1000)","v":0},{"$f":"SUMIF(DISTRICT!AI9:AI1000,\">=75\",DISTRICT!AH9:AH1000)","v":0}]
[null,null,"EAPréS",null,null,null,{"$f":"SUMIF(DISTRICT!U9:U1000,\">=75\",DISTRICT!T9:T1000)","v":0}]
[null,null,"EAS",null,null,null,{"$f":"SUMIF(DISTRICT!W9:W1000,\">=75\",DISTRICT!V9:V1000)","v":0},{"$f":"SUMIF(DISTRICT!AE9:AE1000,\">=75\",DISTRICT!AD9:AD1000)","v":0}]
[null,null,"Adults",null,null,null,null,{"$f":"SUMIF(DISTRICT!AG9:AG1000,\">=75\",DISTRICT!AF9:AF1000)","v":0}]
[null,"Proportion d’UMOs nécessitant une CP and ayant réalisé une couverture efficace (total)",null,null,{"$f":"IF(E44<>0,E66/E44,0)","v":0},{"$f":"IF(F44<>0,F66/F44,0)","v":1},{"$f":"IF(G44<>0,G66/G44,0)","v":0},{"$f":"IF(H44<>0,H66/H44,0)","v":0}]
[null,null,"EAPréS",null,null,null,{"$f":"IF(G45<>0,G67/G45,0)","v":0}]
[null,null,"EAS",null,null,null,{"$f":"IF(G46<>0,G68/G46,0)","v":0},{"$f":"IF(H46<>0,H68/H46,0)","v":0}]
[null,null,"Adults",null,null,null,null,{"$f":"IF(H47<>0,H69/H47,0)","v":0}]
[null,"Nombre d’UMOs où la CP a été stoppée (càd sous surveillance)",null,null,{"$f":"COUNTIF(COUNTRY_INFO!H$9:H$1000,\"=99\")","v":0},{"$f":"COUNTIF(COUNTRY_INFO!I$9:I$1000,\"=99\")","v":0}]
[null,"Nombre d’individus dans les UMOs ne nécessitant plus de CP (stoppée)",null,null,{"$f":"SUMIF(COUNTRY_INFO!H$9:H$1000,\"=99\",COUNTRY_INFO!D$9:D$1000)","v":0},{"$f":"SUMIF(COUNTRY_INFO!I$9:I$1000,\"=99\",COUNTRY_INFO!D$9:D$1000)","v":0}]
[null,"Nombre d’individus nécessitant une CP vivants dans des UMOs ciblées pour la CP",null,null,{"$f":"SUMIF(DISTRICT!H$9:H$1000,\">0\",DISTRICT!D$9:D$1000)","v":1031260},{"$f":"SUMIF(DISTRICT!N$9:N$1000,\">0\",DISTRICT!J$9:J$1000)","v":713514},{"$f":"SUMIF(DISTRICT!X$9:X$1000,\">0\",DISTRICT!P$9:P$1000)","v":192860},{"$f":"SUMIF(DISTRICT!AH$9:AH$1000,\">0\",DISTRICT!Z$9:Z$1000)","v":0}]
[null,"Nombre d’individus nécessitant une CP vivant dans des UMOs non ciblées pour la CP",null,null,{"$f":"SUMIF(DISTRICT!H$9:H$1000,\"=0\",DISTRICT!D$9:D$1000)","v":0},{"$f":"SUMIF(DISTRICT!N$9:N$1000,\"=0\",DISTRICT!J$9:J$1000)","v":0},{"$f":"SUMIF(DISTRICT!X$9:X$1000,\"=0\",DISTRICT!P$9:P$1000)","v":616162},{"$f":"SUMIF(DISTRICT!AH$9:AH$1000,\"=0\",DISTRICT!Z$9:Z$1000)","v":408975.29}]
[null,null,null,null,{"$f":"E35-E52","v":544524.07999999996},{"$f":"F35-F52","v":131610},754738.08,408975.29]
[null,"Nombre d’UMOs nécessitant et recevant la CP",null,null,{"$f":"E31-E44","v":0},{"$f":"F31-F44","v":0},24,21]
[null,null,null,null,{"$f":"E27-E31-E29","v":39},0,22,{"$f":"H27-H31-H29","v":26}]
[]
[null,null,null,null,null,null,"Nécessitant et recevant une CP"]
[null,null,null,null,null,null,"Nécessitant mais ne recevant pas de CP"]
[null,null,null,null,null,null,"Ne nécessitant pas de CP"]
[null,null,null,null,null,null,"Statut inconnu"]
[]
[]
[]
[]
[]
[]
[]
[]
[]
[]
[]
[]
[]
[]
[]
[]
[]
[]
[]
[]
[]
[]
[]
[]
[]
[]
[]
[]
[]
[]
[]
[]
[]
[]
[null,"Cliquer ici pour accéder au portail des données de la CP"]