{"text_format":"1","workbook":"xlsx","n_sheets":10,"sheets":["INTRO","COUNTRY_INFO","DEC","ALB_MBD","PZQ","IVM","IVM+","SUMMARY","SHIPMENT","DATA_POLICY"],"not_rendered":{"charts":0,"images":3,"macros":1,"external_links":1,"defined_names":10,"comments":9,"pivot_tables":0},"unopened":[],"bounds":{"document_bytes":16777216,"sheet_cells":100000,"rows_first":2000,"rows_last":500,"rows_between":2000,"halvings":0,"cell_chars":16384,"cell_head_chars":4096},"cells_cut":0,"cells_raw":0,"read":"whole","date_system":"1900"}

{"sheet":"INTRO","index":0,"n_rows":51,"n_cols":5,"rows_kept":51,"cut":false,"hidden":false,"merged":[[21,1,21,4],[46,1,46,4],[38,1,38,2],[40,1,40,2],[42,1,42,2],[44,1,44,2],[36,1,36,2],[22,2,23,4],[25,2,26,4],[27,1,27,4],[32,1,32,2],[29,1,29,4],[30,1,30,4],[28,2,28,4],[24,1,24,4],[34,1,34,2],[0,1,0,4],[2,1,2,4],[1,1,1,4],[5,1,5,4],[3,1,3,4],[7,2,7,4],[11,1,11,4],[4,1,4,4],[10,2,10,4],[20,2,20,4],[17,1,17,4],[13,1,13,4],[18,2,18,4],[8,2,8,4],[9,2,9,4],[19,1,19,4],[12,1,12,4],[16,1,16,4],[14,1,14,4],[15,1,15,4]]}
[]
[null,"Formulaire de demande commune de médicaments pour CP v.4.1"]
[]
[null,"Dans le cadre des efforts mondiaux entrepris pour accélérer l'expansion de la chimioprévention (CP) pour l'élimination de la filariose lymphatique et la lutte contre la schistosomiase et les géohelminthiases, l'Organisation mondiale de la Santé (OMS) facilite l'approvisionnement en albendazole, comprimés de 400 mg (GSK), pour les programmes nationaux d'élimination de la filariose lymphatique et programmes nationaux de lutte contre les géohelminthiases; en diethylcarbamazine, comprimés de 100 mg (Eisai), pour les programmes nationaux d'élimination de la filariose lymphatique; en mebendazole, comprimés de 500 mg (J&J) pour les programmes nationaux de lutte contre les géohelminthiases et en praziquantel, comprimés de 600 mg (Merck KGaA), destinés aux enfants d'âge scolaire, pour les programmes nationaux de lutte contre la schistosomiase. L'OMS contribue également à l'approvisionnement en ivermectine, comprimés de 3 mg (Merck), pour les programmes de donation pour l'onchocercose et la filariose lymphatique. \nCet outil Excel est concu pour aider les pays à quantifier le nombre de comprimés nécessaires, selon le traitement de chimioprévention requis, pour atteindre les objectifs de couverture de traitement de populations et districts pour l'année de la demande de médicaments. Le résultat de cet outil est une demande commune de médicaments pour la chimioprévention des maladies tropicales négligées, qui peut être imprimée, signée et soumise à l'OMS pour la demande de ces médicaments. "]
[]
[null,"Structure de l'application (feuilles de travail) :"]
[]
[null,"INTRO","Cette feuille contient des instructions pour compléter le formulaire de demande de médicaments pour la chimioprévention et des informations sur le statut de la chimioprévention pour les maladies d'endémie du pays."]
[null,"COUNTRY_INFO","Cette feuille contient des informations sur la structure administrative du pays, la population par groupe d'âge, le statut d'endémicité pour chaque maladie, la population devant être traitée par chimioprévention et les interventions prévues."]
[null,"DEC, ALB_MBD, PZQ et IVM","Ces feuilles contiennent des informations sur l'endémicité des districts ciblés pour le traitement aux médicaments spécifiques à la chimioprévention, les plans de traitement, et le nombre de comprimés requis et demandés."]
[null,"SUMMARY","Cette feuille inclut un résumé du nombre de comprimés demandés, des informations concernant le stock et les dates de soumission de la demande de médicaments. Avant de générer le rapport (run macros), veuillez sélectionner le médicament pour lequel le rapport est nécessaire. Veuillez suivre la même règle pour voir le nombre de personnes à traiter pour les maladies spécifiques. \nCette feuille doit être imprimée et soumise en tant que \"Formulaire de demande commune de médicaments pour chimioprévention\" (voir les instructions pour la soumission du formulaire sous la feuille SUMMARY)."]
[]
[null,"Instructions pour la saisie des données"]
[]
[null,"La plupart des cellules des feuilles de travail mentionnées ci-dessus contiennent des formules calculées automatiquement en fonction du protocole de traitement recommandé par l'OMS pour chaque maladie.\nVoir : https://www.who.int/publications/i/item/9789241599993."]
[]
[null,"Veuillez entrer vos données dans les cellules en fonction de leur code de couleur :"]
[]
[null,null,"Blanc - la cellule n'est pas protégée. Veuillez entrer la valeur de l'indicateur demandé."]
[]
[null,null,"Jaune - la cellule est protégée et inclut le nom de l'indicateur. Aucune entrée de données requise."]
[]
[null,null,"Orange - la cellule n'est pas protégée et contient un menu déroulant. Veuillez sélectionner la valeur dans le menu déroulant. "]
[]
[]
[null,null,"Vert - la cellule n'est pas protégée et contient des formules. Veuillez changer la valeur indiquée uniquement si vos données sont différentes de celles calculées automatiquement.  "]
[]
[]
[null,null,"Bleu - la cellule est protégée et contient des formules. Aucune entrée de données requise. "]
[]
[null,"Données pays"]
[]
[null,"PAYS",null,null,"NIGER"]
[null,null,null,null,5]
[null,"Année de la demande de médicaments",null,null,2024]
[]
[null,"Le pays est-il endémique à la filariose lymphatique (FL) ?",null,null,"Endémique"]
[]
[null,"Le pays est-il endémique à l'onchocercose (ONCHO) ? ",null,null,"Endémique mais pas de CP"]
[]
[null,"Le pays est-il endémique aux géohelminthiases (STH) ?",null,null,"Endémique"]
[]
[null,"Le pays est-il endémique à la schistosomiase (SCH) ?",null,null,"Endémique"]
[]
[null,"Combien d'unités administratives compte le pays ?",null,null,72]
[]
[null,"Si les données démographiques par groupe d'âge ne sont pas disponibles au second niveau administratif, veuillez entrer la proportion (%) de population, par groupe d'âge, du pays. Si les données sont disponibles, veuillez laisser les cellules vierges."]
[null,"1-4 ans","Enfants d'âge pré-scolaire (EAPréS)",null,0.18]
[null,"5-14 ans","Enfants d'âge scolaire (EAS)",null,0.3]
[null,"15 ans et plus","Adultes",null,0.5]
[null,"15-49 ans","Femmes en âge de procréer (FAP)",null,0.2092]

{"sheet":"COUNTRY_INFO","index":1,"n_rows":81,"n_cols":32,"rows_kept":81,"cut":false,"hidden":false,"merged":[[3,0,3,2],[3,7,3,10],[3,21,3,24],[5,0,5,2],[3,26,3,29],[5,26,5,29],[5,3,5,6],[5,7,5,10],[5,11,5,20],[5,21,5,24],[6,3,7,3],[6,2,7,2],[6,1,7,1],[6,0,7,0],[6,21,7,21],[6,13,6,16],[6,11,7,11],[6,12,7,12],[6,7,7,7],[6,8,7,8],[6,9,7,9],[6,10,7,10],[6,6,7,6],[6,5,7,5],[6,4,7,4],[6,28,7,28],[6,29,7,29],[6,17,6,20],[6,25,7,25],[6,22,7,22],[6,23,7,23],[6,24,7,24],[6,26,7,26],[6,27,7,27]]}
["INFORMATIONS PAYS"]
["Struture administrative, population par groupe d'âge, statut d'endémicité et interventions planifiées"]
[]
["TOTAL",null,null,{"$f":"SUBTOTAL(9,D$10:D$1010)","v":26312032.493196901},{"$f":"SUBTOTAL(9,E$10:E$1010)","v":4736172},7893605,13156019,null,null,null,null,{"$f":"SUBTOTAL(9,L$10:L$1010)","v":0},0,443062,738436,514936,1696434,2927990,7584789,13265379,23342659]
[]
["Structure administrative du pays",null,null,"Population",null,null,null,"Endémicité",null,null,null,"Population nécessitant la CP",null,null,null,null,null,null,null,null,null,"Nombre de tournées de traitement prévues pour l'année",null,null,null,"Criteria to apply for \nIVM+DEC+ALB therapy","Enquêtes épidémiologiques planifiées pour l’année"]
["Pays","Région/Département","District","Total","EAPréS","EAS","Adultes","FL","Oncho","STH","SCH","FL","ONCHO","STH",null,null,null,"SCH",null,null,null,"FL","Oncho","STH","SCH","FL","FL","Oncho","STH","SCH"]
[null,null,null,null,null,null,null,null,null,null,null,null,null,"EAPréS","EAS","FAP","TOTAL","EAPréS","EAS","Adultes","TOTAL"]
[null,null,null,null,null,null,null,null,null,null,null,null,null,null,null,null,null,null,null,null,null,null,null,null,null,null,null,null,null,null,"IU_ID","IU_Name"]
[{"$f":"IF(INTRO!$E$33<>0,INTRO!$E$33, \" \")","v":"NIGER"},"Agadez","Agadez",173256,{"$f":"IF([1]INTRO!$E$48=\"\",\"\",ROUND($D10*[1]INTRO!$E$48,0))","v":31186},{"$f":"IF([1]INTRO!$E$49=\"\",\"\",ROUND($D10*[1]INTRO!$E$49,0))","v":51977},{"$f":"IF([1]INTRO!$E$50=\"\",\"\",ROUND($D10*[1]INTRO!$E$50,0))","v":86628},0,null,99,21,{"$f":"IF(INTRO!$E$37=\"Endémique\",IF($H10>0,IF($H10=4,\"Inconnu\",IF($H10=99,\"Interrompu\",$D10)),0),\"Non requis\")","v":0},{"$f":"IF(INTRO!$E$39=\"Endémique\", IF($I10>0, IF($I10=4,\"Inconnu\",IF($I10=99,\"Interrompu\",$D10)), 0),\"Non requis\")","v":"Non requis"},{"$f":"IF(INTRO!$E$41=\"Endémique\", IF($J10>1, IF($J10=4, \"Inconnu\", IF($J10=99, \"Surveillance\", E10)), 0),\"Non requis\")","v":"Surveillance"},{"$f":"IF(INTRO!$E$41=\"Endémique\", IF($J10>1, IF($J10=4, \"Inconnu\", IF($J10=99, \"Surveillance\", F10)), 0),\"Non requis\")","v":"Surveillance"},{"$f":"IF(INTRO!$E$41=\"Endémique\", IF($J10>1, IF($J10=4, \"Inconnu\", IF($J10=99, \"Surveillance\", ROUND(D10*INTRO!$E$51,0))), 0),\"Non requis\")","v":"Surveillance"},{"$f":"IF(INTRO!$E$41=\"Endémique\", IF($J10>1, IF($J10=4, \"Inconnu\", IF($J10=99, \"Surveillance\", SUM($N10:$P10))), 0),\"Non requis\")","v":"Surveillance"},19326,50063,87556,{"$f":"IF(INTRO!$E$43=\"Endémique\", IF($K10>1, IF($K10=4, \"Inconnu\", IF($K10=99, \"Surveillance\", SUM($R10:$T10))), 0),\"Non requis\")","v":156945},0,null,0,0,null,null,null,null,null,35294,"Agadez"]
[{"$f":"IF(INTRO!$E$33<>0,INTRO!$E$33, \" \")","v":"NIGER"},"Agadez","Arlit",153893,{"$f":"IF([1]INTRO!$E$48=\"\",\"\",ROUND($D11*[1]INTRO!$E$48,0))","v":27701},{"$f":"IF([1]INTRO!$E$49=\"\",\"\",ROUND($D11*[1]INTRO!$E$49,0))","v":46168},{"$f":"IF([1]INTRO!$E$50=\"\",\"\",ROUND($D11*[1]INTRO!$E$50,0))","v":76947},99,null,99,11,{"$f":"IF(INTRO!$E$37=\"Endémique\",IF($H11>0,IF($H11=4,\"Inconnu\",IF($H11=99,\"Interrompu\",$D11)),0),\"Non requis\")","v":"Interrompu"},{"$f":"IF(INTRO!$E$39=\"Endémique\", IF($I11>0, IF($I11=4,\"Inconnu\",IF($I11=99,\"Interrompu\",$D11)), 0),\"Non requis\")","v":"Non requis"},{"$f":"IF(INTRO!$E$41=\"Endémique\", IF($J11>1, IF($J11=4, \"Inconnu\", IF($J11=99, \"Surveillance\", E11)), 0),\"Non requis\")","v":"Surveillance"},{"$f":"IF(INTRO!$E$41=\"Endémique\", IF($J11>1, IF($J11=4, \"Inconnu\", IF($J11=99, \"Surveillance\", F11)), 0),\"Non requis\")","v":"Surveillance"},{"$f":"IF(INTRO!$E$41=\"Endémique\", IF($J11>1, IF($J11=4, \"Inconnu\", IF($J11=99, \"Surveillance\", ROUND(D11*INTRO!$E$51,0))), 0),\"Non requis\")","v":"Surveillance"},{"$f":"IF(INTRO!$E$41=\"Endémique\", IF($J11>1, IF($J11=4, \"Inconnu\", IF($J11=99, \"Surveillance\", SUM($N11:$P11))), 0),\"Non requis\")","v":"Surveillance"},17049,44166,77244,{"$f":"IF(INTRO!$E$43=\"Endémique\", IF($K11>1, IF($K11=4, \"Inconnu\", IF($K11=99, \"Surveillance\", SUM($R11:$T11))), 0),\"Non requis\")","v":138459},0,null,0,0,null,null,null,null,null,35337,"Arlit"]
[{"$f":"IF(INTRO!$E$33<>0,INTRO!$E$33, \" \")","v":"NIGER"},"Agadez","Iférouane",47961,{"$f":"IF([1]INTRO!$E$48=\"\",\"\",ROUND($D12*[1]INTRO!$E$48,0))","v":8633},{"$f":"IF([1]INTRO!$E$49=\"\",\"\",ROUND($D12*[1]INTRO!$E$49,0))","v":14388},{"$f":"IF([1]INTRO!$E$50=\"\",\"\",ROUND($D12*[1]INTRO!$E$50,0))","v":23981},99,null,99,11,{"$f":"IF(INTRO!$E$37=\"Endémique\",IF($H12>0,IF($H12=4,\"Inconnu\",IF($H12=99,\"Interrompu\",$D12)),0),\"Non requis\")","v":"Interrompu"},{"$f":"IF(INTRO!$E$39=\"Endémique\", IF($I12>0, IF($I12=4,\"Inconnu\",IF($I12=99,\"Interrompu\",$D12)), 0),\"Non requis\")","v":"Non requis"},{"$f":"IF(INTRO!$E$41=\"Endémique\", IF($J12>1, IF($J12=4, \"Inconnu\", IF($J12=99, \"Surveillance\", E12)), 0),\"Non requis\")","v":"Surveillance"},{"$f":"IF(INTRO!$E$41=\"Endémique\", IF($J12>1, IF($J12=4, \"Inconnu\", IF($J12=99, \"Surveillance\", F12)), 0),\"Non requis\")","v":"Surveillance"},{"$f":"IF(INTRO!$E$41=\"Endémique\", IF($J12>1, IF($J12=4, \"Inconnu\", IF($J12=99, \"Surveillance\", ROUND(D12*INTRO!$E$51,0))), 0),\"Non requis\")","v":"Surveillance"},{"$f":"IF(INTRO!$E$41=\"Endémique\", IF($J12>1, IF($J12=4, \"Inconnu\", IF($J12=99, \"Surveillance\", SUM($N12:$P12))), 0),\"Non requis\")","v":"Surveillance"},4323,11198,19582,{"$f":"IF(INTRO!$E$43=\"Endémique\", IF($K12>1, IF($K12=4, \"Inconnu\", IF($K12=99, \"Surveillance\", SUM($R12:$T12))), 0),\"Non requis\")","v":35103},0,null,0,0,null,null,null,null,null,35338,"Iférouane"]
[{"$f":"IF(INTRO!$E$33<>0,INTRO!$E$33, \" \")","v":"NIGER"},"Agadez","Bilma",26280,{"$f":"IF([1]INTRO!$E$48=\"\",\"\",ROUND($D13*[1]INTRO!$E$48,0))","v":4730},{"$f":"IF([1]INTRO!$E$49=\"\",\"\",ROUND($D13*[1]INTRO!$E$49,0))","v":7884},{"$f":"IF([1]INTRO!$E$50=\"\",\"\",ROUND($D13*[1]INTRO!$E$50,0))","v":13140},0,null,11,0,{"$f":"IF(INTRO!$E$37=\"Endémique\",IF($H13>0,IF($H13=4,\"Inconnu\",IF($H13=99,\"Interrompu\",$D13)),0),\"Non requis\")","v":0},{"$f":"IF(INTRO!$E$39=\"Endémique\", IF($I13>0, IF($I13=4,\"Inconnu\",IF($I13=99,\"Interrompu\",$D13)), 0),\"Non requis\")","v":"Non requis"},{"$f":"IF(INTRO!$E$41=\"Endémique\", IF($J13>1, IF($J13=4, \"Inconnu\", IF($J13=99, \"Surveillance\", E13)), 0),\"Non requis\")","v":4730},{"$f":"IF(INTRO!$E$41=\"Endémique\", IF($J13>1, IF($J13=4, \"Inconnu\", IF($J13=99, \"Surveillance\", F13)), 0),\"Non requis\")","v":7884},{"$f":"IF(INTRO!$E$41=\"Endémique\", IF($J13>1, IF($J13=4, \"Inconnu\", IF($J13=99, \"Surveillance\", ROUND(D13*INTRO!$E$51,0))), 0),\"Non requis\")","v":5498},{"$f":"IF(INTRO!$E$41=\"Endémique\", IF($J13>1, IF($J13=4, \"Inconnu\", IF($J13=99, \"Surveillance\", SUM($N13:$P13))), 0),\"Non requis\")","v":18112},0,0,0,{"$f":"IF(INTRO!$E$43=\"Endémique\", IF($K13>1, IF($K13=4, \"Inconnu\", IF($K13=99, \"Surveillance\", SUM($R13:$T13))), 0),\"Non requis\")","v":0},0,null,0,0,null,null,null,null,null,35296,"Bilma"]
[{"$f":"IF(INTRO!$E$33<>0,INTRO!$E$33, \" \")","v":"NIGER"},"Agadez","Tchirozérine",185311,{"$f":"IF([1]INTRO!$E$48=\"\",\"\",ROUND($D14*[1]INTRO!$E$48,0))","v":33356},{"$f":"IF([1]INTRO!$E$49=\"\",\"\",ROUND($D14*[1]INTRO!$E$49,0))","v":55593},{"$f":"IF([1]INTRO!$E$50=\"\",\"\",ROUND($D14*[1]INTRO!$E$50,0))","v":92656},0,null,99,31,{"$f":"IF(INTRO!$E$37=\"Endémique\",IF($H14>0,IF($H14=4,\"Inconnu\",IF($H14=99,\"Interrompu\",$D14)),0),\"Non requis\")","v":0},{"$f":"IF(INTRO!$E$39=\"Endémique\", IF($I14>0, IF($I14=4,\"Inconnu\",IF($I14=99,\"Interrompu\",$D14)), 0),\"Non requis\")","v":"Non requis"},{"$f":"IF(INTRO!$E$41=\"Endémique\", IF($J14>1, IF($J14=4, \"Inconnu\", IF($J14=99, \"Surveillance\", E14)), 0),\"Non requis\")","v":"Surveillance"},{"$f":"IF(INTRO!$E$41=\"Endémique\", IF($J14>1, IF($J14=4, \"Inconnu\", IF($J14=99, \"Surveillance\", F14)), 0),\"Non requis\")","v":"Surveillance"},{"$f":"IF(INTRO!$E$41=\"Endémique\", IF($J14>1, IF($J14=4, \"Inconnu\", IF($J14=99, \"Surveillance\", ROUND(D14*INTRO!$E$51,0))), 0),\"Non requis\")","v":"Surveillance"},{"$f":"IF(INTRO!$E$41=\"Endémique\", IF($J14>1, IF($J14=4, \"Inconnu\", IF($J14=99, \"Surveillance\", SUM($N14:$P14))), 0),\"Non requis\")","v":"Surveillance"},17414,45112,78897,{"$f":"IF(INTRO!$E$43=\"Endémique\", IF($K14>1, IF($K14=4, \"Inconnu\", IF($K14=99, \"Surveillance\", SUM($R14:$T14))), 0),\"Non requis\")","v":141423},0,null,0,0,null,null,null,null,null,35339,"Tchirozérine"]
[{"$f":"IF(INTRO!$E$33<>0,INTRO!$E$33, \" \")","v":"NIGER"},"Agadez","Aderbissinat",51754,{"$f":"IF([1]INTRO!$E$48=\"\",\"\",ROUND($D15*[1]INTRO!$E$48,0))","v":9316},{"$f":"IF([1]INTRO!$E$49=\"\",\"\",ROUND($D15*[1]INTRO!$E$49,0))","v":15526},{"$f":"IF([1]INTRO!$E$50=\"\",\"\",ROUND($D15*[1]INTRO!$E$50,0))","v":25877},0,null,99,21,{"$f":"IF(INTRO!$E$37=\"Endémique\",IF($H15>0,IF($H15=4,\"Inconnu\",IF($H15=99,\"Interrompu\",$D15)),0),\"Non requis\")","v":0},{"$f":"IF(INTRO!$E$39=\"Endémique\", IF($I15>0, IF($I15=4,\"Inconnu\",IF($I15=99,\"Interrompu\",$D15)), 0),\"Non requis\")","v":"Non requis"},{"$f":"IF(INTRO!$E$41=\"Endémique\", IF($J15>1, IF($J15=4, \"Inconnu\", IF($J15=99, \"Surveillance\", E15)), 0),\"Non requis\")","v":"Surveillance"},{"$f":"IF(INTRO!$E$41=\"Endémique\", IF($J15>1, IF($J15=4, \"Inconnu\", IF($J15=99, \"Surveillance\", F15)), 0),\"Non requis\")","v":"Surveillance"},{"$f":"IF(INTRO!$E$41=\"Endémique\", IF($J15>1, IF($J15=4, \"Inconnu\", IF($J15=99, \"Surveillance\", ROUND(D15*INTRO!$E$51,0))), 0),\"Non requis\")","v":"Surveillance"},{"$f":"IF(INTRO!$E$41=\"Endémique\", IF($J15>1, IF($J15=4, \"Inconnu\", IF($J15=99, \"Surveillance\", SUM($N15:$P15))), 0),\"Non requis\")","v":"Surveillance"},5800,15027,26281,{"$f":"IF(INTRO!$E$43=\"Endémique\", IF($K15>1, IF($K15=4, \"Inconnu\", IF($K15=99, \"Surveillance\", SUM($R15:$T15))), 0),\"Non requis\")","v":47108},0,null,0,0,null,null,null,null,null,35341,"Aderbissinat"]
[{"$f":"IF(INTRO!$E$33<>0,INTRO!$E$33, \" \")","v":"NIGER"},"Agadez","Ingall",76053,{"$f":"IF([1]INTRO!$E$48=\"\",\"\",ROUND($D16*[1]INTRO!$E$48,0))","v":13690},{"$f":"IF([1]INTRO!$E$49=\"\",\"\",ROUND($D16*[1]INTRO!$E$49,0))","v":22816},{"$f":"IF([1]INTRO!$E$50=\"\",\"\",ROUND($D16*[1]INTRO!$E$50,0))","v":38027},0,null,99,21,{"$f":"IF(INTRO!$E$37=\"Endémique\",IF($H16>0,IF($H16=4,\"Inconnu\",IF($H16=99,\"Interrompu\",$D16)),0),\"Non requis\")","v":0},{"$f":"IF(INTRO!$E$39=\"Endémique\", IF($I16>0, IF($I16=4,\"Inconnu\",IF($I16=99,\"Interrompu\",$D16)), 0),\"Non requis\")","v":"Non requis"},{"$f":"IF(INTRO!$E$41=\"Endémique\", IF($J16>1, IF($J16=4, \"Inconnu\", IF($J16=99, \"Surveillance\", E16)), 0),\"Non requis\")","v":"Surveillance"},{"$f":"IF(INTRO!$E$41=\"Endémique\", IF($J16>1, IF($J16=4, \"Inconnu\", IF($J16=99, \"Surveillance\", F16)), 0),\"Non requis\")","v":"Surveillance"},{"$f":"IF(INTRO!$E$41=\"Endémique\", IF($J16>1, IF($J16=4, \"Inconnu\", IF($J16=99, \"Surveillance\", ROUND(D16*INTRO!$E$51,0))), 0),\"Non requis\")","v":"Surveillance"},{"$f":"IF(INTRO!$E$41=\"Endémique\", IF($J16>1, IF($J16=4, \"Inconnu\", IF($J16=99, \"Surveillance\", SUM($N16:$P16))), 0),\"Non requis\")","v":"Surveillance"},8523,22081,38619,{"$f":"IF(INTRO!$E$43=\"Endémique\", IF($K16>1, IF($K16=4, \"Inconnu\", IF($K16=99, \"Surveillance\", SUM($R16:$T16))), 0),\"Non requis\")","v":69223},0,null,0,0,null,null,null,null,null,35340,"Ingall"]
[{"$f":"IF(INTRO!$E$33<>0,INTRO!$E$33, \" \")","v":"NIGER"},"Diffa","Diffa",234725.47650554628,{"$f":"IF([1]INTRO!$E$48=\"\",\"\",ROUND($D17*[1]INTRO!$E$48,0))","v":42251},{"$f":"IF([1]INTRO!$E$49=\"\",\"\",ROUND($D17*[1]INTRO!$E$49,0))","v":70418},{"$f":"IF([1]INTRO!$E$50=\"\",\"\",ROUND($D17*[1]INTRO!$E$50,0))","v":117363},99,null,99,31,{"$f":"IF(INTRO!$E$37=\"Endémique\",IF($H17>0,IF($H17=4,\"Inconnu\",IF($H17=99,\"Interrompu\",$D17)),0),\"Non requis\")","v":"Interrompu"},{"$f":"IF(INTRO!$E$39=\"Endémique\", IF($I17>0, IF($I17=4,\"Inconnu\",IF($I17=99,\"Interrompu\",$D17)), 0),\"Non requis\")","v":"Non requis"},{"$f":"IF(INTRO!$E$41=\"Endémique\", IF($J17>1, IF($J17=4, \"Inconnu\", IF($J17=99, \"Surveillance\", E17)), 0),\"Non requis\")","v":"Surveillance"},{"$f":"IF(INTRO!$E$41=\"Endémique\", IF($J17>1, IF($J17=4, \"Inconnu\", IF($J17=99, \"Surveillance\", F17)), 0),\"Non requis\")","v":"Surveillance"},{"$f":"IF(INTRO!$E$41=\"Endémique\", IF($J17>1, IF($J17=4, \"Inconnu\", IF($J17=99, \"Surveillance\", ROUND(D17*INTRO!$E$51,0))), 0),\"Non requis\")","v":"Surveillance"},{"$f":"IF(INTRO!$E$41=\"Endémique\", IF($J17>1, IF($J17=4, \"Inconnu\", IF($J17=99, \"Surveillance\", SUM($N17:$P17))), 0),\"Non requis\")","v":"Surveillance"},26054,67487,118034,{"$f":"IF(INTRO!$E$43=\"Endémique\", IF($K17>1, IF($K17=4, \"Inconnu\", IF($K17=99, \"Surveillance\", SUM($R17:$T17))), 0),\"Non requis\")","v":211575},0,null,0,1,null,"TAS",null,null,null,35342,"Diffa"]
[{"$f":"IF(INTRO!$E$33<>0,INTRO!$E$33, \" \")","v":"NIGER"},"Diffa","Bosso",112768.80730051648,{"$f":"IF([1]INTRO!$E$48=\"\",\"\",ROUND($D18*[1]INTRO!$E$48,0))","v":20298},{"$f":"IF([1]INTRO!$E$49=\"\",\"\",ROUND($D18*[1]INTRO!$E$49,0))","v":33831},{"$f":"IF([1]INTRO!$E$50=\"\",\"\",ROUND($D18*[1]INTRO!$E$50,0))","v":56384},99,null,99,21,{"$f":"IF(INTRO!$E$37=\"Endémique\",IF($H18>0,IF($H18=4,\"Inconnu\",IF($H18=99,\"Interrompu\",$D18)),0),\"Non requis\")","v":"Interrompu"},{"$f":"IF(INTRO!$E$39=\"Endémique\", IF($I18>0, IF($I18=4,\"Inconnu\",IF($I18=99,\"Interrompu\",$D18)), 0),\"Non requis\")","v":"Non requis"},{"$f":"IF(INTRO!$E$41=\"Endémique\", IF($J18>1, IF($J18=4, \"Inconnu\", IF($J18=99, \"Surveillance\", E18)), 0),\"Non requis\")","v":"Surveillance"},{"$f":"IF(INTRO!$E$41=\"Endémique\", IF($J18>1, IF($J18=4, \"Inconnu\", IF($J18=99, \"Surveillance\", F18)), 0),\"Non requis\")","v":"Surveillance"},{"$f":"IF(INTRO!$E$41=\"Endémique\", IF($J18>1, IF($J18=4, \"Inconnu\", IF($J18=99, \"Surveillance\", ROUND(D18*INTRO!$E$51,0))), 0),\"Non requis\")","v":"Surveillance"},{"$f":"IF(INTRO!$E$41=\"Endémique\", IF($J18>1, IF($J18=4, \"Inconnu\", IF($J18=99, \"Surveillance\", SUM($N18:$P18))), 0),\"Non requis\")","v":"Surveillance"},12599,32637,57079,{"$f":"IF(INTRO!$E$43=\"Endémique\", IF($K18>1, IF($K18=4, \"Inconnu\", IF($K18=99, \"Surveillance\", SUM($R18:$T18))), 0),\"Non requis\")","v":102315},0,null,0,1,null,"TAS",null,null,null,35343,"Bosso"]
[{"$f":"IF(INTRO!$E$33<>0,INTRO!$E$33, \" \")","v":"NIGER"},"Diffa","Mainé Soroa",147780.2631567425,{"$f":"IF([1]INTRO!$E$48=\"\",\"\",ROUND($D19*[1]INTRO!$E$48,0))","v":26600},{"$f":"IF([1]INTRO!$E$49=\"\",\"\",ROUND($D19*[1]INTRO!$E$49,0))","v":44334},{"$f":"IF([1]INTRO!$E$50=\"\",\"\",ROUND($D19*[1]INTRO!$E$50,0))","v":73890},99,null,99,31,{"$f":"IF(INTRO!$E$37=\"Endémique\",IF($H19>0,IF($H19=4,\"Inconnu\",IF($H19=99,\"Interrompu\",$D19)),0),\"Non requis\")","v":"Interrompu"},{"$f":"IF(INTRO!$E$39=\"Endémique\", IF($I19>0, IF($I19=4,\"Inconnu\",IF($I19=99,\"Interrompu\",$D19)), 0),\"Non requis\")","v":"Non requis"},{"$f":"IF(INTRO!$E$41=\"Endémique\", IF($J19>1, IF($J19=4, \"Inconnu\", IF($J19=99, \"Surveillance\", E19)), 0),\"Non requis\")","v":"Surveillance"},{"$f":"IF(INTRO!$E$41=\"Endémique\", IF($J19>1, IF($J19=4, \"Inconnu\", IF($J19=99, \"Surveillance\", F19)), 0),\"Non requis\")","v":"Surveillance"},{"$f":"IF(INTRO!$E$41=\"Endémique\", IF($J19>1, IF($J19=4, \"Inconnu\", IF($J19=99, \"Surveillance\", ROUND(D19*INTRO!$E$51,0))), 0),\"Non requis\")","v":"Surveillance"},{"$f":"IF(INTRO!$E$41=\"Endémique\", IF($J19>1, IF($J19=4, \"Inconnu\", IF($J19=99, \"Surveillance\", SUM($N19:$P19))), 0),\"Non requis\")","v":"Surveillance"},19734,51118,89402,{"$f":"IF(INTRO!$E$43=\"Endémique\", IF($K19>1, IF($K19=4, \"Inconnu\", IF($K19=99, \"Surveillance\", SUM($R19:$T19))), 0),\"Non requis\")","v":160254},0,null,0,1,null,"TAS",null,null,null,35344,"Mainé Soroa "]
[{"$f":"IF(INTRO!$E$33<>0,INTRO!$E$33, \" \")","v":"NIGER"},"Diffa","Goudoumaria",193491.78659562394,{"$f":"IF([1]INTRO!$E$48=\"\",\"\",ROUND($D20*[1]INTRO!$E$48,0))","v":34829},{"$f":"IF([1]INTRO!$E$49=\"\",\"\",ROUND($D20*[1]INTRO!$E$49,0))","v":58048},{"$f":"IF([1]INTRO!$E$50=\"\",\"\",ROUND($D20*[1]INTRO!$E$50,0))","v":96746},99,null,99,31,{"$f":"IF(INTRO!$E$37=\"Endémique\",IF($H20>0,IF($H20=4,\"Inconnu\",IF($H20=99,\"Interrompu\",$D20)),0),\"Non requis\")","v":"Interrompu"},{"$f":"IF(INTRO!$E$39=\"Endémique\", IF($I20>0, IF($I20=4,\"Inconnu\",IF($I20=99,\"Interrompu\",$D20)), 0),\"Non requis\")","v":"Non requis"},{"$f":"IF(INTRO!$E$41=\"Endémique\", IF($J20>1, IF($J20=4, \"Inconnu\", IF($J20=99, \"Surveillance\", E20)), 0),\"Non requis\")","v":"Surveillance"},{"$f":"IF(INTRO!$E$41=\"Endémique\", IF($J20>1, IF($J20=4, \"Inconnu\", IF($J20=99, \"Surveillance\", F20)), 0),\"Non requis\")","v":"Surveillance"},{"$f":"IF(INTRO!$E$41=\"Endémique\", IF($J20>1, IF($J20=4, \"Inconnu\", IF($J20=99, \"Surveillance\", ROUND(D20*INTRO!$E$51,0))), 0),\"Non requis\")","v":"Surveillance"},{"$f":"IF(INTRO!$E$41=\"Endémique\", IF($J20>1, IF($J20=4, \"Inconnu\", IF($J20=99, \"Surveillance\", SUM($N20:$P20))), 0),\"Non requis\")","v":"Surveillance"},16558,42893,75019,{"$f":"IF(INTRO!$E$43=\"Endémique\", IF($K20>1, IF($K20=4, \"Inconnu\", IF($K20=99, \"Surveillance\", SUM($R20:$T20))), 0),\"Non requis\")","v":134470},0,null,0,1,null,"TAS",null,null,null,35345,"Goudoumaria"]
[{"$f":"IF(INTRO!$E$33<>0,INTRO!$E$33, \" \")","v":"NIGER"},"Diffa","N'Guigmi",107829.52325364041,{"$f":"IF([1]INTRO!$E$48=\"\",\"\",ROUND($D21*[1]INTRO!$E$48,0))","v":19409},{"$f":"IF([1]INTRO!$E$49=\"\",\"\",ROUND($D21*[1]INTRO!$E$49,0))","v":32349},{"$f":"IF([1]INTRO!$E$50=\"\",\"\",ROUND($D21*[1]INTRO!$E$50,0))","v":53915},99,null,99,21,{"$f":"IF(INTRO!$E$37=\"Endémique\",IF($H21>0,IF($H21=4,\"Inconnu\",IF($H21=99,\"Interrompu\",$D21)),0),\"Non requis\")","v":"Interrompu"},{"$f":"IF(INTRO!$E$39=\"Endémique\", IF($I21>0, IF($I21=4,\"Inconnu\",IF($I21=99,\"Interrompu\",$D21)), 0),\"Non requis\")","v":"Non requis"},{"$f":"IF(INTRO!$E$41=\"Endémique\", IF($J21>1, IF($J21=4, \"Inconnu\", IF($J21=99, \"Surveillance\", E21)), 0),\"Non requis\")","v":"Surveillance"},{"$f":"IF(INTRO!$E$41=\"Endémique\", IF($J21>1, IF($J21=4, \"Inconnu\", IF($J21=99, \"Surveillance\", F21)), 0),\"Non requis\")","v":"Surveillance"},{"$f":"IF(INTRO!$E$41=\"Endémique\", IF($J21>1, IF($J21=4, \"Inconnu\", IF($J21=99, \"Surveillance\", ROUND(D21*INTRO!$E$51,0))), 0),\"Non requis\")","v":"Surveillance"},{"$f":"IF(INTRO!$E$41=\"Endémique\", IF($J21>1, IF($J21=4, \"Inconnu\", IF($J21=99, \"Surveillance\", SUM($N21:$P21))), 0),\"Non requis\")","v":"Surveillance"},12440,32229,56366,{"$f":"IF(INTRO!$E$43=\"Endémique\", IF($K21>1, IF($K21=4, \"Inconnu\", IF($K21=99, \"Surveillance\", SUM($R21:$T21))), 0),\"Non requis\")","v":101035},0,null,0,1,null,"TAS",null,null,null,35346,"N'Guigmi "]
[{"$f":"IF(INTRO!$E$33<>0,INTRO!$E$33, \" \")","v":"NIGER"},"Diffa","N'Gourti",76076.143187930371,{"$f":"IF([1]INTRO!$E$48=\"\",\"\",ROUND($D22*[1]INTRO!$E$48,0))","v":13694},{"$f":"IF([1]INTRO!$E$49=\"\",\"\",ROUND($D22*[1]INTRO!$E$49,0))","v":22823},{"$f":"IF([1]INTRO!$E$50=\"\",\"\",ROUND($D22*[1]INTRO!$E$50,0))","v":38038},99,null,99,0,{"$f":"IF(INTRO!$E$37=\"Endémique\",IF($H22>0,IF($H22=4,\"Inconnu\",IF($H22=99,\"Interrompu\",$D22)),0),\"Non requis\")","v":"Interrompu"},{"$f":"IF(INTRO!$E$39=\"Endémique\", IF($I22>0, IF($I22=4,\"Inconnu\",IF($I22=99,\"Interrompu\",$D22)), 0),\"Non requis\")","v":"Non requis"},{"$f":"IF(INTRO!$E$41=\"Endémique\", IF($J22>1, IF($J22=4, \"Inconnu\", IF($J22=99, \"Surveillance\", E22)), 0),\"Non requis\")","v":"Surveillance"},{"$f":"IF(INTRO!$E$41=\"Endémique\", IF($J22>1, IF($J22=4, \"Inconnu\", IF($J22=99, \"Surveillance\", F22)), 0),\"Non requis\")","v":"Surveillance"},{"$f":"IF(INTRO!$E$41=\"Endémique\", IF($J22>1, IF($J22=4, \"Inconnu\", IF($J22=99, \"Surveillance\", ROUND(D22*INTRO!$E$51,0))), 0),\"Non requis\")","v":"Surveillance"},{"$f":"IF(INTRO!$E$41=\"Endémique\", IF($J22>1, IF($J22=4, \"Inconnu\", IF($J22=99, \"Surveillance\", SUM($N22:$P22))), 0),\"Non requis\")","v":"Surveillance"},0,0,0,{"$f":"IF(INTRO!$E$43=\"Endémique\", IF($K22>1, IF($K22=4, \"Inconnu\", IF($K22=99, \"Surveillance\", SUM($R22:$T22))), 0),\"Non requis\")","v":0},0,null,0,0,null,"TAS",null,null,null,35347,"N'Gourti"]
[{"$f":"IF(INTRO!$E$33<>0,INTRO!$E$33, \" \")","v":"NIGER"},"Dosso","Boboye",393284.22949934739,{"$f":"IF([1]INTRO!$E$48=\"\",\"\",ROUND($D23*[1]INTRO!$E$48,0))","v":70791},{"$f":"IF([1]INTRO!$E$49=\"\",\"\",ROUND($D23*[1]INTRO!$E$49,0))","v":117985},{"$f":"IF([1]INTRO!$E$50=\"\",\"\",ROUND($D23*[1]INTRO!$E$50,0))","v":196642},99,null,11,31,{"$f":"IF(INTRO!$E$37=\"Endémique\",IF($H23>0,IF($H23=4,\"Inconnu\",IF($H23=99,\"Interrompu\",$D23)),0),\"Non requis\")","v":"Interrompu"},{"$f":"IF(INTRO!$E$39=\"Endémique\", IF($I23>0, IF($I23=4,\"Inconnu\",IF($I23=99,\"Interrompu\",$D23)), 0),\"Non requis\")","v":"Non requis"},{"$f":"IF(INTRO!$E$41=\"Endémique\", IF($J23>1, IF($J23=4, \"Inconnu\", IF($J23=99, \"Surveillance\", E23)), 0),\"Non requis\")","v":70791},{"$f":"IF(INTRO!$E$41=\"Endémique\", IF($J23>1, IF($J23=4, \"Inconnu\", IF($J23=99, \"Surveillance\", F23)), 0),\"Non requis\")","v":117985},{"$f":"IF(INTRO!$E$41=\"Endémique\", IF($J23>1, IF($J23=4, \"Inconnu\", IF($J23=99, \"Surveillance\", ROUND(D23*INTRO!$E$51,0))), 0),\"Non requis\")","v":82275},{"$f":"IF(INTRO!$E$41=\"Endémique\", IF($J23>1, IF($J23=4, \"Inconnu\", IF($J23=99, \"Surveillance\", SUM($N23:$P23))), 0),\"Non requis\")","v":271051},42771,110793,193770,{"$f":"IF(INTRO!$E$43=\"Endémique\", IF($K23>1, IF($K23=4, \"Inconnu\", IF($K23=99, \"Surveillance\", SUM($R23:$T23))), 0),\"Non requis\")","v":347334},0,null,0,1,null,"TAS",null,null,null,35348,"Boboye"]
[{"$f":"IF(INTRO!$E$33<>0,INTRO!$E$33, \" \")","v":"NIGER"},"Dosso","Falmey",160789.14502004022,{"$f":"IF([1]INTRO!$E$48=\"\",\"\",ROUND($D24*[1]INTRO!$E$48,0))","v":28942},{"$f":"IF([1]INTRO!$E$49=\"\",\"\",ROUND($D24*[1]INTRO!$E$49,0))","v":48237},{"$f":"IF([1]INTRO!$E$50=\"\",\"\",ROUND($D24*[1]INTRO!$E$50,0))","v":80395},99,null,11,31,{"$f":"IF(INTRO!$E$37=\"Endémique\",IF($H24>0,IF($H24=4,\"Inconnu\",IF($H24=99,\"Interrompu\",$D24)),0),\"Non requis\")","v":"Interrompu"},{"$f":"IF(INTRO!$E$39=\"Endémique\", IF($I24>0, IF($I24=4,\"Inconnu\",IF($I24=99,\"Interrompu\",$D24)), 0),\"Non requis\")","v":"Non requis"},{"$f":"IF(INTRO!$E$41=\"Endémique\", IF($J24>1, IF($J24=4, \"Inconnu\", IF($J24=99, \"Surveillance\", E24)), 0),\"Non requis\")","v":28942},{"$f":"IF(INTRO!$E$41=\"Endémique\", IF($J24>1, IF($J24=4, \"Inconnu\", IF($J24=99, \"Surveillance\", F24)), 0),\"Non requis\")","v":48237},{"$f":"IF(INTRO!$E$41=\"Endémique\", IF($J24>1, IF($J24=4, \"Inconnu\", IF($J24=99, \"Surveillance\", ROUND(D24*INTRO!$E$51,0))), 0),\"Non requis\")","v":33637},{"$f":"IF(INTRO!$E$41=\"Endémique\", IF($J24>1, IF($J24=4, \"Inconnu\", IF($J24=99, \"Surveillance\", SUM($N24:$P24))), 0),\"Non requis\")","v":110816},17488,45296,79222,{"$f":"IF(INTRO!$E$43=\"Endémique\", IF($K24>1, IF($K24=4, \"Inconnu\", IF($K24=99, \"Surveillance\", SUM($R24:$T24))), 0),\"Non requis\")","v":142006},0,null,0,1,null,"TAS",null,null,null,35349,"Falmey"]
[{"$f":"IF(INTRO!$E$33<>0,INTRO!$E$33, \" \")","v":"NIGER"},"Dosso","Dosso",766897.78612651199,{"$f":"IF([1]INTRO!$E$48=\"\",\"\",ROUND($D25*[1]INTRO!$E$48,0))","v":138042},{"$f":"IF([1]INTRO!$E$49=\"\",\"\",ROUND($D25*[1]INTRO!$E$49,0))","v":230069},{"$f":"IF([1]INTRO!$E$50=\"\",\"\",ROUND($D25*[1]INTRO!$E$50,0))","v":383449},0,null,99,21,{"$f":"IF(INTRO!$E$37=\"Endémique\",IF($H25>0,IF($H25=4,\"Inconnu\",IF($H25=99,\"Interrompu\",$D25)),0),\"Non requis\")","v":0},{"$f":"IF(INTRO!$E$39=\"Endémique\", IF($I25>0, IF($I25=4,\"Inconnu\",IF($I25=99,\"Interrompu\",$D25)), 0),\"Non requis\")","v":"Non requis"},{"$f":"IF(INTRO!$E$41=\"Endémique\", IF($J25>1, IF($J25=4, \"Inconnu\", IF($J25=99, \"Surveillance\", E25)), 0),\"Non requis\")","v":"Surveillance"},{"$f":"IF(INTRO!$E$41=\"Endémique\", IF($J25>1, IF($J25=4, \"Inconnu\", IF($J25=99, \"Surveillance\", F25)), 0),\"Non requis\")","v":"Surveillance"},{"$f":"IF(INTRO!$E$41=\"Endémique\", IF($J25>1, IF($J25=4, \"Inconnu\", IF($J25=99, \"Surveillance\", ROUND(D25*INTRO!$E$51,0))), 0),\"Non requis\")","v":"Surveillance"},{"$f":"IF(INTRO!$E$41=\"Endémique\", IF($J25>1, IF($J25=4, \"Inconnu\", IF($J25=99, \"Surveillance\", SUM($N25:$P25))), 0),\"Non requis\")","v":"Surveillance"},83808,217104,379697,{"$f":"IF(INTRO!$E$43=\"Endémique\", IF($K25>1, IF($K25=4, \"Inconnu\", IF($K25=99, \"Surveillance\", SUM($R25:$T25))), 0),\"Non requis\")","v":680609},0,null,0,0,null,null,null,null,null,35302,"Dosso"]
[{"$f":"IF(INTRO!$E$33<>0,INTRO!$E$33, \" \")","v":"NIGER"},"Dosso","Doutchi",579926.74819697149,{"$f":"IF([1]INTRO!$E$48=\"\",\"\",ROUND($D26*[1]INTRO!$E$48,0))","v":104387},{"$f":"IF([1]INTRO!$E$49=\"\",\"\",ROUND($D26*[1]INTRO!$E$49,0))","v":173978},{"$f":"IF([1]INTRO!$E$50=\"\",\"\",ROUND($D26*[1]INTRO!$E$50,0))","v":289963},0,null,99,21,{"$f":"IF(INTRO!$E$37=\"Endémique\",IF($H26>0,IF($H26=4,\"Inconnu\",IF($H26=99,\"Interrompu\",$D26)),0),\"Non requis\")","v":0},{"$f":"IF(INTRO!$E$39=\"Endémique\", IF($I26>0, IF($I26=4,\"Inconnu\",IF($I26=99,\"Interrompu\",$D26)), 0),\"Non requis\")","v":"Non requis"},{"$f":"IF(INTRO!$E$41=\"Endémique\", IF($J26>1, IF($J26=4, \"Inconnu\", IF($J26=99, \"Surveillance\", E26)), 0),\"Non requis\")","v":"Surveillance"},{"$f":"IF(INTRO!$E$41=\"Endémique\", IF($J26>1, IF($J26=4, \"Inconnu\", IF($J26=99, \"Surveillance\", F26)), 0),\"Non requis\")","v":"Surveillance"},{"$f":"IF(INTRO!$E$41=\"Endémique\", IF($J26>1, IF($J26=4, \"Inconnu\", IF($J26=99, \"Surveillance\", ROUND(D26*INTRO!$E$51,0))), 0),\"Non requis\")","v":"Surveillance"},{"$f":"IF(INTRO!$E$41=\"Endémique\", IF($J26>1, IF($J26=4, \"Inconnu\", IF($J26=99, \"Surveillance\", SUM($N26:$P26))), 0),\"Non requis\")","v":"Surveillance"},63007,163219,285456,{"$f":"IF(INTRO!$E$43=\"Endémique\", IF($K26>1, IF($K26=4, \"Inconnu\", IF($K26=99, \"Surveillance\", SUM($R26:$T26))), 0),\"Non requis\")","v":511682},0,null,0,1,null,null,null,null,null,35350,"Doutchi"]
[{"$f":"IF(INTRO!$E$33<>0,INTRO!$E$33, \" \")","v":"NIGER"},"Dosso","Tibiri(Doutchi)",420404.97120906337,{"$f":"IF([1]INTRO!$E$48=\"\",\"\",ROUND($D27*[1]INTRO!$E$48,0))","v":75673},{"$f":"IF([1]INTRO!$E$49=\"\",\"\",ROUND($D27*[1]INTRO!$E$49,0))","v":126121},{"$f":"IF([1]INTRO!$E$50=\"\",\"\",ROUND($D27*[1]INTRO!$E$50,0))","v":210202},0,null,99,21,{"$f":"IF(INTRO!$E$37=\"Endémique\",IF($H27>0,IF($H27=4,\"Inconnu\",IF($H27=99,\"Interrompu\",$D27)),0),\"Non requis\")","v":0},{"$f":"IF(INTRO!$E$39=\"Endémique\", IF($I27>0, IF($I27=4,\"Inconnu\",IF($I27=99,\"Interrompu\",$D27)), 0),\"Non requis\")","v":"Non requis"},{"$f":"IF(INTRO!$E$41=\"Endémique\", IF($J27>1, IF($J27=4, \"Inconnu\", IF($J27=99, \"Surveillance\", E27)), 0),\"Non requis\")","v":"Surveillance"},{"$f":"IF(INTRO!$E$41=\"Endémique\", IF($J27>1, IF($J27=4, \"Inconnu\", IF($J27=99, \"Surveillance\", F27)), 0),\"Non requis\")","v":"Surveillance"},{"$f":"IF(INTRO!$E$41=\"Endémique\", IF($J27>1, IF($J27=4, \"Inconnu\", IF($J27=99, \"Surveillance\", ROUND(D27*INTRO!$E$51,0))), 0),\"Non requis\")","v":"Surveillance"},{"$f":"IF(INTRO!$E$41=\"Endémique\", IF($J27>1, IF($J27=4, \"Inconnu\", IF($J27=99, \"Surveillance\", SUM($N27:$P27))), 0),\"Non requis\")","v":"Surveillance"},45677,118320,206935,{"$f":"IF(INTRO!$E$43=\"Endémique\", IF($K27>1, IF($K27=4, \"Inconnu\", IF($K27=99, \"Surveillance\", SUM($R27:$T27))), 0),\"Non requis\")","v":370932},0,null,0,1,null,null,null,null,null,35351,"Tibiri(Doutchi)"]
[{"$f":"IF(INTRO!$E$33<>0,INTRO!$E$33, \" \")","v":"NIGER"},"Dosso","Gaya",407360.73364984634,{"$f":"IF([1]INTRO!$E$48=\"\",\"\",ROUND($D28*[1]INTRO!$E$48,0))","v":73325},{"$f":"IF([1]INTRO!$E$49=\"\",\"\",ROUND($D28*[1]INTRO!$E$49,0))","v":122208},{"$f":"IF([1]INTRO!$E$50=\"\",\"\",ROUND($D28*[1]INTRO!$E$50,0))","v":203680},99,null,99,21,{"$f":"IF(INTRO!$E$37=\"Endémique\",IF($H28>0,IF($H28=4,\"Inconnu\",IF($H28=99,\"Interrompu\",$D28)),0),\"Non requis\")","v":"Interrompu"},{"$f":"IF(INTRO!$E$39=\"Endémique\", IF($I28>0, IF($I28=4,\"Inconnu\",IF($I28=99,\"Interrompu\",$D28)), 0),\"Non requis\")","v":"Non requis"},{"$f":"IF(INTRO!$E$41=\"Endémique\", IF($J28>1, IF($J28=4, \"Inconnu\", IF($J28=99, \"Surveillance\", E28)), 0),\"Non requis\")","v":"Surveillance"},{"$f":"IF(INTRO!$E$41=\"Endémique\", IF($J28>1, IF($J28=4, \"Inconnu\", IF($J28=99, \"Surveillance\", F28)), 0),\"Non requis\")","v":"Surveillance"},{"$f":"IF(INTRO!$E$41=\"Endémique\", IF($J28>1, IF($J28=4, \"Inconnu\", IF($J28=99, \"Surveillance\", ROUND(D28*INTRO!$E$51,0))), 0),\"Non requis\")","v":"Surveillance"},{"$f":"IF(INTRO!$E$41=\"Endémique\", IF($J28>1, IF($J28=4, \"Inconnu\", IF($J28=99, \"Surveillance\", SUM($N28:$P28))), 0),\"Non requis\")","v":"Surveillance"},44733,115881,202669,{"$f":"IF(INTRO!$E$43=\"Endémique\", IF($K28>1, IF($K28=4, \"Inconnu\", IF($K28=99, \"Surveillance\", SUM($R28:$T28))), 0),\"Non requis\")","v":363283},0,null,0,1,null,null,null,null,null,35352,"Gaya"]
[{"$f":"IF(INTRO!$E$33<>0,INTRO!$E$33, \" \")","v":"NIGER"},"Dosso","Dioundiou",170666.51946211144,{"$f":"IF([1]INTRO!$E$48=\"\",\"\",ROUND($D29*[1]INTRO!$E$48,0))","v":30720},{"$f":"IF([1]INTRO!$E$49=\"\",\"\",ROUND($D29*[1]INTRO!$E$49,0))","v":51200},{"$f":"IF([1]INTRO!$E$50=\"\",\"\",ROUND($D29*[1]INTRO!$E$50,0))","v":85333},99,null,99,21,{"$f":"IF(INTRO!$E$37=\"Endémique\",IF($H29>0,IF($H29=4,\"Inconnu\",IF($H29=99,\"Interrompu\",$D29)),0),\"Non requis\")","v":"Interrompu"},{"$f":"IF(INTRO!$E$39=\"Endémique\", IF($I29>0, IF($I29=4,\"Inconnu\",IF($I29=99,\"Interrompu\",$D29)), 0),\"Non requis\")","v":"Non requis"},{"$f":"IF(INTRO!$E$41=\"Endémique\", IF($J29>1, IF($J29=4, \"Inconnu\", IF($J29=99, \"Surveillance\", E29)), 0),\"Non requis\")","v":"Surveillance"},{"$f":"IF(INTRO!$E$41=\"Endémique\", IF($J29>1, IF($J29=4, \"Inconnu\", IF($J29=99, \"Surveillance\", F29)), 0),\"Non requis\")","v":"Surveillance"},{"$f":"IF(INTRO!$E$41=\"Endémique\", IF($J29>1, IF($J29=4, \"Inconnu\", IF($J29=99, \"Surveillance\", ROUND(D29*INTRO!$E$51,0))), 0),\"Non requis\")","v":"Surveillance"},{"$f":"IF(INTRO!$E$41=\"Endémique\", IF($J29>1, IF($J29=4, \"Inconnu\", IF($J29=99, \"Surveillance\", SUM($N29:$P29))), 0),\"Non requis\")","v":"Surveillance"},18743,48550,84911,{"$f":"IF(INTRO!$E$43=\"Endémique\", IF($K29>1, IF($K29=4, \"Inconnu\", IF($K29=99, \"Surveillance\", SUM($R29:$T29))), 0),\"Non requis\")","v":152204},0,null,0,1,null,null,null,null,null,35353,"Dioundiou"]
[{"$f":"IF(INTRO!$E$33<>0,INTRO!$E$33, \" \")","v":"NIGER"},"Dosso","Loga",273313.98828570388,{"$f":"IF([1]INTRO!$E$48=\"\",\"\",ROUND($D30*[1]INTRO!$E$48,0))","v":49197},{"$f":"IF([1]INTRO!$E$49=\"\",\"\",ROUND($D30*[1]INTRO!$E$49,0))","v":81994},{"$f":"IF([1]INTRO!$E$50=\"\",\"\",ROUND($D30*[1]INTRO!$E$50,0))","v":136657},0,null,1,31,{"$f":"IF(INTRO!$E$37=\"Endémique\",IF($H30>0,IF($H30=4,\"Inconnu\",IF($H30=99,\"Interrompu\",$D30)),0),\"Non requis\")","v":0},{"$f":"IF(INTRO!$E$39=\"Endémique\", IF($I30>0, IF($I30=4,\"Inconnu\",IF($I30=99,\"Interrompu\",$D30)), 0),\"Non requis\")","v":"Non requis"},{"$f":"IF(INTRO!$E$41=\"Endémique\", IF($J30>1, IF($J30=4, \"Inconnu\", IF($J30=99, \"Surveillance\", E30)), 0),\"Non requis\")","v":0},{"$f":"IF(INTRO!$E$41=\"Endémique\", IF($J30>1, IF($J30=4, \"Inconnu\", IF($J30=99, \"Surveillance\", F30)), 0),\"Non requis\")","v":0},{"$f":"IF(INTRO!$E$41=\"Endémique\", IF($J30>1, IF($J30=4, \"Inconnu\", IF($J30=99, \"Surveillance\", ROUND(D30*INTRO!$E$51,0))), 0),\"Non requis\")","v":0},{"$f":"IF(INTRO!$E$41=\"Endémique\", IF($J30>1, IF($J30=4, \"Inconnu\", IF($J30=99, \"Surveillance\", SUM($N30:$P30))), 0),\"Non requis\")","v":0},28764,74512,130316,{"$f":"IF(INTRO!$E$43=\"Endémique\", IF($K30>1, IF($K30=4, \"Inconnu\", IF($K30=99, \"Surveillance\", SUM($R30:$T30))), 0),\"Non requis\")","v":233592},0,null,0,1,null,null,null,null,null,35305,"Loga"]
[{"$f":"IF(INTRO!$E$33<>0,INTRO!$E$33, \" \")","v":"NIGER"},"Maradi","Aguié",379571.05335339415,{"$f":"IF([1]INTRO!$E$48=\"\",\"\",ROUND($D31*[1]INTRO!$E$48,0))","v":68323},{"$f":"IF([1]INTRO!$E$49=\"\",\"\",ROUND($D31*[1]INTRO!$E$49,0))","v":113871},{"$f":"IF([1]INTRO!$E$50=\"\",\"\",ROUND($D31*[1]INTRO!$E$50,0))","v":189786},99,null,0,21,{"$f":"IF(INTRO!$E$37=\"Endémique\",IF($H31>0,IF($H31=4,\"Inconnu\",IF($H31=99,\"Interrompu\",$D31)),0),\"Non requis\")","v":"Interrompu"},{"$f":"IF(INTRO!$E$39=\"Endémique\", IF($I31>0, IF($I31=4,\"Inconnu\",IF($I31=99,\"Interrompu\",$D31)), 0),\"Non requis\")","v":"Non requis"},{"$f":"IF(INTRO!$E$41=\"Endémique\", IF($J31>1, IF($J31=4, \"Inconnu\", IF($J31=99, \"Surveillance\", E31)), 0),\"Non requis\")","v":0},{"$f":"IF(INTRO!$E$41=\"Endémique\", IF($J31>1, IF($J31=4, \"Inconnu\", IF($J31=99, \"Surveillance\", F31)), 0),\"Non requis\")","v":0},{"$f":"IF(INTRO!$E$41=\"Endémique\", IF($J31>1, IF($J31=4, \"Inconnu\", IF($J31=99, \"Surveillance\", ROUND(D31*INTRO!$E$51,0))), 0),\"Non requis\")","v":0},{"$f":"IF(INTRO!$E$41=\"Endémique\", IF($J31>1, IF($J31=4, \"Inconnu\", IF($J31=99, \"Surveillance\", SUM($N31:$P31))), 0),\"Non requis\")","v":0},43025,111453,194924,{"$f":"IF(INTRO!$E$43=\"Endémique\", IF($K31>1, IF($K31=4, \"Inconnu\", IF($K31=99, \"Surveillance\", SUM($R31:$T31))), 0),\"Non requis\")","v":349402},0,null,0,0,null,"TAS",null,null,null,35354,"Aguié"]
[{"$f":"IF(INTRO!$E$33<>0,INTRO!$E$33, \" \")","v":"NIGER"},"Maradi","Gazaoua",247706.54246874133,{"$f":"IF([1]INTRO!$E$48=\"\",\"\",ROUND($D32*[1]INTRO!$E$48,0))","v":44587},{"$f":"IF([1]INTRO!$E$49=\"\",\"\",ROUND($D32*[1]INTRO!$E$49,0))","v":74312},{"$f":"IF([1]INTRO!$E$50=\"\",\"\",ROUND($D32*[1]INTRO!$E$50,0))","v":123853},99,null,0,31,{"$f":"IF(INTRO!$E$37=\"Endémique\",IF($H32>0,IF($H32=4,\"Inconnu\",IF($H32=99,\"Interrompu\",$D32)),0),\"Non requis\")","v":"Interrompu"},{"$f":"IF(INTRO!$E$39=\"Endémique\", IF($I32>0, IF($I32=4,\"Inconnu\",IF($I32=99,\"Interrompu\",$D32)), 0),\"Non requis\")","v":"Non requis"},{"$f":"IF(INTRO!$E$41=\"Endémique\", IF($J32>1, IF($J32=4, \"Inconnu\", IF($J32=99, \"Surveillance\", E32)), 0),\"Non requis\")","v":0},{"$f":"IF(INTRO!$E$41=\"Endémique\", IF($J32>1, IF($J32=4, \"Inconnu\", IF($J32=99, \"Surveillance\", F32)), 0),\"Non requis\")","v":0},{"$f":"IF(INTRO!$E$41=\"Endémique\", IF($J32>1, IF($J32=4, \"Inconnu\", IF($J32=99, \"Surveillance\", ROUND(D32*INTRO!$E$51,0))), 0),\"Non requis\")","v":0},{"$f":"IF(INTRO!$E$41=\"Endémique\", IF($J32>1, IF($J32=4, \"Inconnu\", IF($J32=99, \"Surveillance\", SUM($N32:$P32))), 0),\"Non requis\")","v":0},28077,72734,127205,{"$f":"IF(INTRO!$E$43=\"Endémique\", IF($K32>1, IF($K32=4, \"Inconnu\", IF($K32=99, \"Surveillance\", SUM($R32:$T32))), 0),\"Non requis\")","v":228016},0,null,0,0,null,null,null,null,null,35355,"Gazaoua"]
[{"$f":"IF(INTRO!$E$33<>0,INTRO!$E$33, \" \")","v":"NIGER"},"Maradi","Dakoro",972737.6177909401,{"$f":"IF([1]INTRO!$E$48=\"\",\"\",ROUND($D33*[1]INTRO!$E$48,0))","v":175093},{"$f":"IF([1]INTRO!$E$49=\"\",\"\",ROUND($D33*[1]INTRO!$E$49,0))","v":291821},{"$f":"IF([1]INTRO!$E$50=\"\",\"\",ROUND($D33*[1]INTRO!$E$50,0))","v":486369},99,null,11,31,{"$f":"IF(INTRO!$E$37=\"Endémique\",IF($H33>0,IF($H33=4,\"Inconnu\",IF($H33=99,\"Interrompu\",$D33)),0),\"Non requis\")","v":"Interrompu"},{"$f":"IF(INTRO!$E$39=\"Endémique\", IF($I33>0, IF($I33=4,\"Inconnu\",IF($I33=99,\"Interrompu\",$D33)), 0),\"Non requis\")","v":"Non requis"},{"$f":"IF(INTRO!$E$41=\"Endémique\", IF($J33>1, IF($J33=4, \"Inconnu\", IF($J33=99, \"Surveillance\", E33)), 0),\"Non requis\")","v":175093},{"$f":"IF(INTRO!$E$41=\"Endémique\", IF($J33>1, IF($J33=4, \"Inconnu\", IF($J33=99, \"Surveillance\", F33)), 0),\"Non requis\")","v":291821},{"$f":"IF(INTRO!$E$41=\"Endémique\", IF($J33>1, IF($J33=4, \"Inconnu\", IF($J33=99, \"Surveillance\", ROUND(D33*INTRO!$E$51,0))), 0),\"Non requis\")","v":203497},{"$f":"IF(INTRO!$E$41=\"Endémique\", IF($J33>1, IF($J33=4, \"Inconnu\", IF($J33=99, \"Surveillance\", SUM($N33:$P33))), 0),\"Non requis\")","v":670411},110900,287273,502427,{"$f":"IF(INTRO!$E$43=\"Endémique\", IF($K33>1, IF($K33=4, \"Inconnu\", IF($K33=99, \"Surveillance\", SUM($R33:$T33))), 0),\"Non requis\")","v":900600},0,null,0,0,null,null,null,null,null,35356,"Dakoro"]
[{"$f":"IF(INTRO!$E$33<>0,INTRO!$E$33, \" \")","v":"NIGER"},"Maradi","Bermo",80658.617388068611,{"$f":"IF([1]INTRO!$E$48=\"\",\"\",ROUND($D34*[1]INTRO!$E$48,0))","v":14519},{"$f":"IF([1]INTRO!$E$49=\"\",\"\",ROUND($D34*[1]INTRO!$E$49,0))","v":24198},{"$f":"IF([1]INTRO!$E$50=\"\",\"\",ROUND($D34*[1]INTRO!$E$50,0))","v":40329},99,null,11,31,{"$f":"IF(INTRO!$E$37=\"Endémique\",IF($H34>0,IF($H34=4,\"Inconnu\",IF($H34=99,\"Interrompu\",$D34)),0),\"Non requis\")","v":"Interrompu"},{"$f":"IF(INTRO!$E$39=\"Endémique\", IF($I34>0, IF($I34=4,\"Inconnu\",IF($I34=99,\"Interrompu\",$D34)), 0),\"Non requis\")","v":"Non requis"},{"$f":"IF(INTRO!$E$41=\"Endémique\", IF($J34>1, IF($J34=4, \"Inconnu\", IF($J34=99, \"Surveillance\", E34)), 0),\"Non requis\")","v":14519},{"$f":"IF(INTRO!$E$41=\"Endémique\", IF($J34>1, IF($J34=4, \"Inconnu\", IF($J34=99, \"Surveillance\", F34)), 0),\"Non requis\")","v":24198},{"$f":"IF(INTRO!$E$41=\"Endémique\", IF($J34>1, IF($J34=4, \"Inconnu\", IF($J34=99, \"Surveillance\", ROUND(D34*INTRO!$E$51,0))), 0),\"Non requis\")","v":16874},{"$f":"IF(INTRO!$E$41=\"Endémique\", IF($J34>1, IF($J34=4, \"Inconnu\", IF($J34=99, \"Surveillance\", SUM($N34:$P34))), 0),\"Non requis\")","v":55591},7635,19777,34592,{"$f":"IF(INTRO!$E$43=\"Endémique\", IF($K34>1, IF($K34=4, \"Inconnu\", IF($K34=99, \"Surveillance\", SUM($R34:$T34))), 0),\"Non requis\")","v":62004},0,null,0,0,null,null,null,null,null,35357,"Bermo"]
[{"$f":"IF(INTRO!$E$33<>0,INTRO!$E$33, \" \")","v":"NIGER"},"Maradi","Guidan Roumdji",808093.68180409248,{"$f":"IF([1]INTRO!$E$48=\"\",\"\",ROUND($D35*[1]INTRO!$E$48,0))","v":145457},{"$f":"IF([1]INTRO!$E$49=\"\",\"\",ROUND($D35*[1]INTRO!$E$49,0))","v":242428},{"$f":"IF([1]INTRO!$E$50=\"\",\"\",ROUND($D35*[1]INTRO!$E$50,0))","v":404047},99,null,1,21,{"$f":"IF(INTRO!$E$37=\"Endémique\",IF($H35>0,IF($H35=4,\"Inconnu\",IF($H35=99,\"Interrompu\",$D35)),0),\"Non requis\")","v":"Interrompu"},{"$f":"IF(INTRO!$E$39=\"Endémique\", IF($I35>0, IF($I35=4,\"Inconnu\",IF($I35=99,\"Interrompu\",$D35)), 0),\"Non requis\")","v":"Non requis"},{"$f":"IF(INTRO!$E$41=\"Endémique\", IF($J35>1, IF($J35=4, \"Inconnu\", IF($J35=99, \"Surveillance\", E35)), 0),\"Non requis\")","v":0},{"$f":"IF(INTRO!$E$41=\"Endémique\", IF($J35>1, IF($J35=4, \"Inconnu\", IF($J35=99, \"Surveillance\", F35)), 0),\"Non requis\")","v":0},{"$f":"IF(INTRO!$E$41=\"Endémique\", IF($J35>1, IF($J35=4, \"Inconnu\", IF($J35=99, \"Surveillance\", ROUND(D35*INTRO!$E$51,0))), 0),\"Non requis\")","v":0},{"$f":"IF(INTRO!$E$41=\"Endémique\", IF($J35>1, IF($J35=4, \"Inconnu\", IF($J35=99, \"Surveillance\", SUM($N35:$P35))), 0),\"Non requis\")","v":0},91773,237735,415782,{"$f":"IF(INTRO!$E$43=\"Endémique\", IF($K35>1, IF($K35=4, \"Inconnu\", IF($K35=99, \"Surveillance\", SUM($R35:$T35))), 0),\"Non requis\")","v":745290},0,null,0,0,null,null,null,null,null,35308,"Guidan Roumdji"]
[{"$f":"IF(INTRO!$E$33<>0,INTRO!$E$33, \" \")","v":"NIGER"},"Maradi","Madarounfa",692594.19552092138,{"$f":"IF([1]INTRO!$E$48=\"\",\"\",ROUND($D36*[1]INTRO!$E$48,0))","v":124667},{"$f":"IF([1]INTRO!$E$49=\"\",\"\",ROUND($D36*[1]INTRO!$E$49,0))","v":207778},{"$f":"IF([1]INTRO!$E$50=\"\",\"\",ROUND($D36*[1]INTRO!$E$50,0))","v":346297},99,null,99,31,{"$f":"IF(INTRO!$E$37=\"Endémique\",IF($H36>0,IF($H36=4,\"Inconnu\",IF($H36=99,\"Interrompu\",$D36)),0),\"Non requis\")","v":"Interrompu"},{"$f":"IF(INTRO!$E$39=\"Endémique\", IF($I36>0, IF($I36=4,\"Inconnu\",IF($I36=99,\"Interrompu\",$D36)), 0),\"Non requis\")","v":"Non requis"},{"$f":"IF(INTRO!$E$41=\"Endémique\", IF($J36>1, IF($J36=4, \"Inconnu\", IF($J36=99, \"Surveillance\", E36)), 0),\"Non requis\")","v":"Surveillance"},{"$f":"IF(INTRO!$E$41=\"Endémique\", IF($J36>1, IF($J36=4, \"Inconnu\", IF($J36=99, \"Surveillance\", F36)), 0),\"Non requis\")","v":"Surveillance"},{"$f":"IF(INTRO!$E$41=\"Endémique\", IF($J36>1, IF($J36=4, \"Inconnu\", IF($J36=99, \"Surveillance\", ROUND(D36*INTRO!$E$51,0))), 0),\"Non requis\")","v":"Surveillance"},{"$f":"IF(INTRO!$E$41=\"Endémique\", IF($J36>1, IF($J36=4, \"Inconnu\", IF($J36=99, \"Surveillance\", SUM($N36:$P36))), 0),\"Non requis\")","v":"Surveillance"},79099,204900,358361,{"$f":"IF(INTRO!$E$43=\"Endémique\", IF($K36>1, IF($K36=4, \"Inconnu\", IF($K36=99, \"Surveillance\", SUM($R36:$T36))), 0),\"Non requis\")","v":642360},0,null,0,0,null,null,null,null,null,35309,"Madarounfa"]
[{"$f":"IF(INTRO!$E$33<>0,INTRO!$E$33, \" \")","v":"NIGER"},"Maradi","Maradi",412364.36542724777,{"$f":"IF([1]INTRO!$E$48=\"\",\"\",ROUND($D37*[1]INTRO!$E$48,0))","v":74226},{"$f":"IF([1]INTRO!$E$49=\"\",\"\",ROUND($D37*[1]INTRO!$E$49,0))","v":123709},{"$f":"IF([1]INTRO!$E$50=\"\",\"\",ROUND($D37*[1]INTRO!$E$50,0))","v":206182},0,null,4,11,{"$f":"IF(INTRO!$E$37=\"Endémique\",IF($H37>0,IF($H37=4,\"Inconnu\",IF($H37=99,\"Interrompu\",$D37)),0),\"Non requis\")","v":0},{"$f":"IF(INTRO!$E$39=\"Endémique\", IF($I37>0, IF($I37=4,\"Inconnu\",IF($I37=99,\"Interrompu\",$D37)), 0),\"Non requis\")","v":"Non requis"},{"$f":"IF(INTRO!$E$41=\"Endémique\", IF($J37>1, IF($J37=4, \"Inconnu\", IF($J37=99, \"Surveillance\", E37)), 0),\"Non requis\")","v":"Inconnu"},{"$f":"IF(INTRO!$E$41=\"Endémique\", IF($J37>1, IF($J37=4, \"Inconnu\", IF($J37=99, \"Surveillance\", F37)), 0),\"Non requis\")","v":"Inconnu"},{"$f":"IF(INTRO!$E$41=\"Endémique\", IF($J37>1, IF($J37=4, \"Inconnu\", IF($J37=99, \"Surveillance\", ROUND(D37*INTRO!$E$51,0))), 0),\"Non requis\")","v":"Inconnu"},{"$f":"IF(INTRO!$E$41=\"Endémique\", IF($J37>1, IF($J37=4, \"Inconnu\", IF($J37=99, \"Surveillance\", SUM($N37:$P37))), 0),\"Non requis\")","v":"Inconnu"},46088,119387,208805,{"$f":"IF(INTRO!$E$43=\"Endémique\", IF($K37>1, IF($K37=4, \"Inconnu\", IF($K37=99, \"Surveillance\", SUM($R37:$T37))), 0),\"Non requis\")","v":374280},0,null,0,0,null,null,null,null,null,35310,"Maradi"]
[{"$f":"IF(INTRO!$E$33<>0,INTRO!$E$33, \" \")","v":"NIGER"},"Maradi","Mayahi",859736.24340950372,{"$f":"IF([1]INTRO!$E$48=\"\",\"\",ROUND($D38*[1]INTRO!$E$48,0))","v":154753},{"$f":"IF([1]INTRO!$E$49=\"\",\"\",ROUND($D38*[1]INTRO!$E$49,0))","v":257921},{"$f":"IF([1]INTRO!$E$50=\"\",\"\",ROUND($D38*[1]INTRO!$E$50,0))","v":429868},99,null,1,21,{"$f":"IF(INTRO!$E$37=\"Endémique\",IF($H38>0,IF($H38=4,\"Inconnu\",IF($H38=99,\"Interrompu\",$D38)),0),\"Non requis\")","v":"Interrompu"},{"$f":"IF(INTRO!$E$39=\"Endémique\", IF($I38>0, IF($I38=4,\"Inconnu\",IF($I38=99,\"Interrompu\",$D38)), 0),\"Non requis\")","v":"Non requis"},{"$f":"IF(INTRO!$E$41=\"Endémique\", IF($J38>1, IF($J38=4, \"Inconnu\", IF($J38=99, \"Surveillance\", E38)), 0),\"Non requis\")","v":0},{"$f":"IF(INTRO!$E$41=\"Endémique\", IF($J38>1, IF($J38=4, \"Inconnu\", IF($J38=99, \"Surveillance\", F38)), 0),\"Non requis\")","v":0},{"$f":"IF(INTRO!$E$41=\"Endémique\", IF($J38>1, IF($J38=4, \"Inconnu\", IF($J38=99, \"Surveillance\", ROUND(D38*INTRO!$E$51,0))), 0),\"Non requis\")","v":0},{"$f":"IF(INTRO!$E$41=\"Endémique\", IF($J38>1, IF($J38=4, \"Inconnu\", IF($J38=99, \"Surveillance\", SUM($N38:$P38))), 0),\"Non requis\")","v":0},97166,251703,440219,{"$f":"IF(INTRO!$E$43=\"Endémique\", IF($K38>1, IF($K38=4, \"Inconnu\", IF($K38=99, \"Surveillance\", SUM($R38:$T38))), 0),\"Non requis\")","v":789088},0,null,0,0,null,null,null,null,null,35311,"Mayahi"]
[{"$f":"IF(INTRO!$E$33<>0,INTRO!$E$33, \" \")","v":"NIGER"},"Maradi","Tessaoua",795958.01157114375,{"$f":"IF([1]INTRO!$E$48=\"\",\"\",ROUND($D39*[1]INTRO!$E$48,0))","v":143272},{"$f":"IF([1]INTRO!$E$49=\"\",\"\",ROUND($D39*[1]INTRO!$E$49,0))","v":238787},{"$f":"IF([1]INTRO!$E$50=\"\",\"\",ROUND($D39*[1]INTRO!$E$50,0))","v":397979},99,null,99,31,{"$f":"IF(INTRO!$E$37=\"Endémique\",IF($H39>0,IF($H39=4,\"Inconnu\",IF($H39=99,\"Interrompu\",$D39)),0),\"Non requis\")","v":"Interrompu"},{"$f":"IF(INTRO!$E$39=\"Endémique\", IF($I39>0, IF($I39=4,\"Inconnu\",IF($I39=99,\"Interrompu\",$D39)), 0),\"Non requis\")","v":"Non requis"},{"$f":"IF(INTRO!$E$41=\"Endémique\", IF($J39>1, IF($J39=4, \"Inconnu\", IF($J39=99, \"Surveillance\", E39)), 0),\"Non requis\")","v":"Surveillance"},{"$f":"IF(INTRO!$E$41=\"Endémique\", IF($J39>1, IF($J39=4, \"Inconnu\", IF($J39=99, \"Surveillance\", F39)), 0),\"Non requis\")","v":"Surveillance"},{"$f":"IF(INTRO!$E$41=\"Endémique\", IF($J39>1, IF($J39=4, \"Inconnu\", IF($J39=99, \"Surveillance\", ROUND(D39*INTRO!$E$51,0))), 0),\"Non requis\")","v":"Surveillance"},{"$f":"IF(INTRO!$E$41=\"Endémique\", IF($J39>1, IF($J39=4, \"Inconnu\", IF($J39=99, \"Surveillance\", SUM($N39:$P39))), 0),\"Non requis\")","v":"Surveillance"},90399,234163,409538,{"$f":"IF(INTRO!$E$43=\"Endémique\", IF($K39>1, IF($K39=4, \"Inconnu\", IF($K39=99, \"Surveillance\", SUM($R39:$T39))), 0),\"Non requis\")","v":734100},0,null,0,1,null,null,null,null,null,35312,"Tessaoua"]
[{"$f":"IF(INTRO!$E$33<>0,INTRO!$E$33, \" \")","v":"NIGER"},"Niamey","Niamey 1",305241.66018729162,{"$f":"IF([1]INTRO!$E$48=\"\",\"\",ROUND($D40*[1]INTRO!$E$48,0))","v":54943},{"$f":"IF([1]INTRO!$E$49=\"\",\"\",ROUND($D40*[1]INTRO!$E$49,0))","v":91572},{"$f":"IF([1]INTRO!$E$50=\"\",\"\",ROUND($D40*[1]INTRO!$E$50,0))","v":152621},0,null,99,31,{"$f":"IF(INTRO!$E$37=\"Endémique\",IF($H40>0,IF($H40=4,\"Inconnu\",IF($H40=99,\"Interrompu\",$D40)),0),\"Non requis\")","v":0},{"$f":"IF(INTRO!$E$39=\"Endémique\", IF($I40>0, IF($I40=4,\"Inconnu\",IF($I40=99,\"Interrompu\",$D40)), 0),\"Non requis\")","v":"Non requis"},{"$f":"IF(INTRO!$E$41=\"Endémique\", IF($J40>1, IF($J40=4, \"Inconnu\", IF($J40=99, \"Surveillance\", E40)), 0),\"Non requis\")","v":"Surveillance"},{"$f":"IF(INTRO!$E$41=\"Endémique\", IF($J40>1, IF($J40=4, \"Inconnu\", IF($J40=99, \"Surveillance\", F40)), 0),\"Non requis\")","v":"Surveillance"},{"$f":"IF(INTRO!$E$41=\"Endémique\", IF($J40>1, IF($J40=4, \"Inconnu\", IF($J40=99, \"Surveillance\", ROUND(D40*INTRO!$E$51,0))), 0),\"Non requis\")","v":"Surveillance"},{"$f":"IF(INTRO!$E$41=\"Endémique\", IF($J40>1, IF($J40=4, \"Inconnu\", IF($J40=99, \"Surveillance\", SUM($N40:$P40))), 0),\"Non requis\")","v":"Surveillance"},34324,88915,155509,{"$f":"IF(INTRO!$E$43=\"Endémique\", IF($K40>1, IF($K40=4, \"Inconnu\", IF($K40=99, \"Surveillance\", SUM($R40:$T40))), 0),\"Non requis\")","v":278748},0,null,0,1,null,null,null,null,null,35358,"Niamey 1"]
[{"$f":"IF(INTRO!$E$33<>0,INTRO!$E$33, \" \")","v":"NIGER"},"Niamey","Niamey 2",358839.89818551525,{"$f":"IF([1]INTRO!$E$48=\"\",\"\",ROUND($D41*[1]INTRO!$E$48,0))","v":64591},{"$f":"IF([1]INTRO!$E$49=\"\",\"\",ROUND($D41*[1]INTRO!$E$49,0))","v":107652},{"$f":"IF([1]INTRO!$E$50=\"\",\"\",ROUND($D41*[1]INTRO!$E$50,0))","v":179420},99,null,99,21,{"$f":"IF(INTRO!$E$37=\"Endémique\",IF($H41>0,IF($H41=4,\"Inconnu\",IF($H41=99,\"Interrompu\",$D41)),0),\"Non requis\")","v":"Interrompu"},{"$f":"IF(INTRO!$E$39=\"Endémique\", IF($I41>0, IF($I41=4,\"Inconnu\",IF($I41=99,\"Interrompu\",$D41)), 0),\"Non requis\")","v":"Non requis"},{"$f":"IF(INTRO!$E$41=\"Endémique\", IF($J41>1, IF($J41=4, \"Inconnu\", IF($J41=99, \"Surveillance\", E41)), 0),\"Non requis\")","v":"Surveillance"},{"$f":"IF(INTRO!$E$41=\"Endémique\", IF($J41>1, IF($J41=4, \"Inconnu\", IF($J41=99, \"Surveillance\", F41)), 0),\"Non requis\")","v":"Surveillance"},{"$f":"IF(INTRO!$E$41=\"Endémique\", IF($J41>1, IF($J41=4, \"Inconnu\", IF($J41=99, \"Surveillance\", ROUND(D41*INTRO!$E$51,0))), 0),\"Non requis\")","v":"Surveillance"},{"$f":"IF(INTRO!$E$41=\"Endémique\", IF($J41>1, IF($J41=4, \"Inconnu\", IF($J41=99, \"Surveillance\", SUM($N41:$P41))), 0),\"Non requis\")","v":"Surveillance"},40350,104526,182809,{"$f":"IF(INTRO!$E$43=\"Endémique\", IF($K41>1, IF($K41=4, \"Inconnu\", IF($K41=99, \"Surveillance\", SUM($R41:$T41))), 0),\"Non requis\")","v":327685},0,null,0,1,null,"TAS",null,null,null,35359,"Niamey 2"]
[{"$f":"IF(INTRO!$E$33<>0,INTRO!$E$33, \" \")","v":"NIGER"},"Niamey","Niamey 3",237157.45120017763,{"$f":"IF([1]INTRO!$E$48=\"\",\"\",ROUND($D42*[1]INTRO!$E$48,0))","v":42688},{"$f":"IF([1]INTRO!$E$49=\"\",\"\",ROUND($D42*[1]INTRO!$E$49,0))","v":71147},{"$f":"IF([1]INTRO!$E$50=\"\",\"\",ROUND($D42*[1]INTRO!$E$50,0))","v":118579},99,null,99,21,{"$f":"IF(INTRO!$E$37=\"Endémique\",IF($H42>0,IF($H42=4,\"Inconnu\",IF($H42=99,\"Interrompu\",$D42)),0),\"Non requis\")","v":"Interrompu"},{"$f":"IF(INTRO!$E$39=\"Endémique\", IF($I42>0, IF($I42=4,\"Inconnu\",IF($I42=99,\"Interrompu\",$D42)), 0),\"Non requis\")","v":"Non requis"},{"$f":"IF(INTRO!$E$41=\"Endémique\", IF($J42>1, IF($J42=4, \"Inconnu\", IF($J42=99, \"Surveillance\", E42)), 0),\"Non requis\")","v":"Surveillance"},{"$f":"IF(INTRO!$E$41=\"Endémique\", IF($J42>1, IF($J42=4, \"Inconnu\", IF($J42=99, \"Surveillance\", F42)), 0),\"Non requis\")","v":"Surveillance"},{"$f":"IF(INTRO!$E$41=\"Endémique\", IF($J42>1, IF($J42=4, \"Inconnu\", IF($J42=99, \"Surveillance\", ROUND(D42*INTRO!$E$51,0))), 0),\"Non requis\")","v":"Surveillance"},{"$f":"IF(INTRO!$E$41=\"Endémique\", IF($J42>1, IF($J42=4, \"Inconnu\", IF($J42=99, \"Surveillance\", SUM($N42:$P42))), 0),\"Non requis\")","v":"Surveillance"},26667,69081,120819,{"$f":"IF(INTRO!$E$43=\"Endémique\", IF($K42>1, IF($K42=4, \"Inconnu\", IF($K42=99, \"Surveillance\", SUM($R42:$T42))), 0),\"Non requis\")","v":216567},0,null,0,1,null,"TAS",null,null,null,35360,"Niamey 3"]
[{"$f":"IF(INTRO!$E$33<>0,INTRO!$E$33, \" \")","v":"NIGER"},"Niamey","Niamey 4",398933.20567016734,{"$f":"IF([1]INTRO!$E$48=\"\",\"\",ROUND($D43*[1]INTRO!$E$48,0))","v":71808},{"$f":"IF([1]INTRO!$E$49=\"\",\"\",ROUND($D43*[1]INTRO!$E$49,0))","v":119680},{"$f":"IF([1]INTRO!$E$50=\"\",\"\",ROUND($D43*[1]INTRO!$E$50,0))","v":199467},99,null,99,21,{"$f":"IF(INTRO!$E$37=\"Endémique\",IF($H43>0,IF($H43=4,\"Inconnu\",IF($H43=99,\"Interrompu\",$D43)),0),\"Non requis\")","v":"Interrompu"},{"$f":"IF(INTRO!$E$39=\"Endémique\", IF($I43>0, IF($I43=4,\"Inconnu\",IF($I43=99,\"Interrompu\",$D43)), 0),\"Non requis\")","v":"Non requis"},{"$f":"IF(INTRO!$E$41=\"Endémique\", IF($J43>1, IF($J43=4, \"Inconnu\", IF($J43=99, \"Surveillance\", E43)), 0),\"Non requis\")","v":"Surveillance"},{"$f":"IF(INTRO!$E$41=\"Endémique\", IF($J43>1, IF($J43=4, \"Inconnu\", IF($J43=99, \"Surveillance\", F43)), 0),\"Non requis\")","v":"Surveillance"},{"$f":"IF(INTRO!$E$41=\"Endémique\", IF($J43>1, IF($J43=4, \"Inconnu\", IF($J43=99, \"Surveillance\", ROUND(D43*INTRO!$E$51,0))), 0),\"Non requis\")","v":"Surveillance"},{"$f":"IF(INTRO!$E$41=\"Endémique\", IF($J43>1, IF($J43=4, \"Inconnu\", IF($J43=99, \"Surveillance\", SUM($N43:$P43))), 0),\"Non requis\")","v":"Surveillance"},45172,117017,204657,{"$f":"IF(INTRO!$E$43=\"Endémique\", IF($K43>1, IF($K43=4, \"Inconnu\", IF($K43=99, \"Surveillance\", SUM($R43:$T43))), 0),\"Non requis\")","v":366846},0,null,0,1,null,"TAS",null,null,null,35361,"Niamey 4"]
[{"$f":"IF(INTRO!$E$33<>0,INTRO!$E$33, \" \")","v":"NIGER"},"Niamey","Niamey 5",192241.78475684815,{"$f":"IF([1]INTRO!$E$48=\"\",\"\",ROUND($D44*[1]INTRO!$E$48,0))","v":34604},{"$f":"IF([1]INTRO!$E$49=\"\",\"\",ROUND($D44*[1]INTRO!$E$49,0))","v":57673},{"$f":"IF([1]INTRO!$E$50=\"\",\"\",ROUND($D44*[1]INTRO!$E$50,0))","v":96121},99,null,99,31,{"$f":"IF(INTRO!$E$37=\"Endémique\",IF($H44>0,IF($H44=4,\"Inconnu\",IF($H44=99,\"Interrompu\",$D44)),0),\"Non requis\")","v":"Interrompu"},{"$f":"IF(INTRO!$E$39=\"Endémique\", IF($I44>0, IF($I44=4,\"Inconnu\",IF($I44=99,\"Interrompu\",$D44)), 0),\"Non requis\")","v":"Non requis"},{"$f":"IF(INTRO!$E$41=\"Endémique\", IF($J44>1, IF($J44=4, \"Inconnu\", IF($J44=99, \"Surveillance\", E44)), 0),\"Non requis\")","v":"Surveillance"},{"$f":"IF(INTRO!$E$41=\"Endémique\", IF($J44>1, IF($J44=4, \"Inconnu\", IF($J44=99, \"Surveillance\", F44)), 0),\"Non requis\")","v":"Surveillance"},{"$f":"IF(INTRO!$E$41=\"Endémique\", IF($J44>1, IF($J44=4, \"Inconnu\", IF($J44=99, \"Surveillance\", ROUND(D44*INTRO!$E$51,0))), 0),\"Non requis\")","v":"Surveillance"},{"$f":"IF(INTRO!$E$41=\"Endémique\", IF($J44>1, IF($J44=4, \"Inconnu\", IF($J44=99, \"Surveillance\", SUM($N44:$P44))), 0),\"Non requis\")","v":"Surveillance"},21642,56065,98057,{"$f":"IF(INTRO!$E$43=\"Endémique\", IF($K44>1, IF($K44=4, \"Inconnu\", IF($K44=99, \"Surveillance\", SUM($R44:$T44))), 0),\"Non requis\")","v":175764},0,null,0,1,null,"TAS",null,null,null,35315,"Niamey 5 (ex Niamey 3)"]
[{"$f":"IF(INTRO!$E$33<>0,INTRO!$E$33, \" \")","v":"NIGER"},"Tahoua","Abalak",395694.5876284602,{"$f":"IF([1]INTRO!$E$48=\"\",\"\",ROUND($D45*[1]INTRO!$E$48,0))","v":71225},{"$f":"IF([1]INTRO!$E$49=\"\",\"\",ROUND($D45*[1]INTRO!$E$49,0))","v":118708},{"$f":"IF([1]INTRO!$E$50=\"\",\"\",ROUND($D45*[1]INTRO!$E$50,0))","v":197847},0,null,99,31,{"$f":"IF(INTRO!$E$37=\"Endémique\",IF($H45>0,IF($H45=4,\"Inconnu\",IF($H45=99,\"Interrompu\",$D45)),0),\"Non requis\")","v":0},{"$f":"IF(INTRO!$E$39=\"Endémique\", IF($I45>0, IF($I45=4,\"Inconnu\",IF($I45=99,\"Interrompu\",$D45)), 0),\"Non requis\")","v":"Non requis"},{"$f":"IF(INTRO!$E$41=\"Endémique\", IF($J45>1, IF($J45=4, \"Inconnu\", IF($J45=99, \"Surveillance\", E45)), 0),\"Non requis\")","v":"Surveillance"},{"$f":"IF(INTRO!$E$41=\"Endémique\", IF($J45>1, IF($J45=4, \"Inconnu\", IF($J45=99, \"Surveillance\", F45)), 0),\"Non requis\")","v":"Surveillance"},{"$f":"IF(INTRO!$E$41=\"Endémique\", IF($J45>1, IF($J45=4, \"Inconnu\", IF($J45=99, \"Surveillance\", ROUND(D45*INTRO!$E$51,0))), 0),\"Non requis\")","v":"Surveillance"},{"$f":"IF(INTRO!$E$41=\"Endémique\", IF($J45>1, IF($J45=4, \"Inconnu\", IF($J45=99, \"Surveillance\", SUM($N45:$P45))), 0),\"Non requis\")","v":"Surveillance"},48607,125914,220216,{"$f":"IF(INTRO!$E$43=\"Endémique\", IF($K45>1, IF($K45=4, \"Inconnu\", IF($K45=99, \"Surveillance\", SUM($R45:$T45))), 0),\"Non requis\")","v":394737},0,null,0,1,null,null,null,null,null,35316,"Abalak"]
[{"$f":"IF(INTRO!$E$33<>0,INTRO!$E$33, \" \")","v":"NIGER"},"Tahoua","Birnin' Konni",483054.28673598001,{"$f":"IF([1]INTRO!$E$48=\"\",\"\",ROUND($D46*[1]INTRO!$E$48,0))","v":86950},{"$f":"IF([1]INTRO!$E$49=\"\",\"\",ROUND($D46*[1]INTRO!$E$49,0))","v":144916},{"$f":"IF([1]INTRO!$E$50=\"\",\"\",ROUND($D46*[1]INTRO!$E$50,0))","v":241527},99,null,99,21,{"$f":"IF(INTRO!$E$37=\"Endémique\",IF($H46>0,IF($H46=4,\"Inconnu\",IF($H46=99,\"Interrompu\",$D46)),0),\"Non requis\")","v":"Interrompu"},{"$f":"IF(INTRO!$E$39=\"Endémique\", IF($I46>0, IF($I46=4,\"Inconnu\",IF($I46=99,\"Interrompu\",$D46)), 0),\"Non requis\")","v":"Non requis"},{"$f":"IF(INTRO!$E$41=\"Endémique\", IF($J46>1, IF($J46=4, \"Inconnu\", IF($J46=99, \"Surveillance\", E46)), 0),\"Non requis\")","v":"Surveillance"},{"$f":"IF(INTRO!$E$41=\"Endémique\", IF($J46>1, IF($J46=4, \"Inconnu\", IF($J46=99, \"Surveillance\", F46)), 0),\"Non requis\")","v":"Surveillance"},{"$f":"IF(INTRO!$E$41=\"Endémique\", IF($J46>1, IF($J46=4, \"Inconnu\", IF($J46=99, \"Surveillance\", ROUND(D46*INTRO!$E$51,0))), 0),\"Non requis\")","v":"Surveillance"},{"$f":"IF(INTRO!$E$41=\"Endémique\", IF($J46>1, IF($J46=4, \"Inconnu\", IF($J46=99, \"Surveillance\", SUM($N46:$P46))), 0),\"Non requis\")","v":"Surveillance"},53537,138677,242542,{"$f":"IF(INTRO!$E$43=\"Endémique\", IF($K46>1, IF($K46=4, \"Inconnu\", IF($K46=99, \"Surveillance\", SUM($R46:$T46))), 0),\"Non requis\")","v":434756},0,null,0,0,null,null,null,null,null,35362,"Birnin' Konni"]
[{"$f":"IF(INTRO!$E$33<>0,INTRO!$E$33, \" \")","v":"NIGER"},"Tahoua","Malbaza",358805.43590141105,{"$f":"IF([1]INTRO!$E$48=\"\",\"\",ROUND($D47*[1]INTRO!$E$48,0))","v":64585},{"$f":"IF([1]INTRO!$E$49=\"\",\"\",ROUND($D47*[1]INTRO!$E$49,0))","v":107642},{"$f":"IF([1]INTRO!$E$50=\"\",\"\",ROUND($D47*[1]INTRO!$E$50,0))","v":179403},99,null,99,21,{"$f":"IF(INTRO!$E$37=\"Endémique\",IF($H47>0,IF($H47=4,\"Inconnu\",IF($H47=99,\"Interrompu\",$D47)),0),\"Non requis\")","v":"Interrompu"},{"$f":"IF(INTRO!$E$39=\"Endémique\", IF($I47>0, IF($I47=4,\"Inconnu\",IF($I47=99,\"Interrompu\",$D47)), 0),\"Non requis\")","v":"Non requis"},{"$f":"IF(INTRO!$E$41=\"Endémique\", IF($J47>1, IF($J47=4, \"Inconnu\", IF($J47=99, \"Surveillance\", E47)), 0),\"Non requis\")","v":"Surveillance"},{"$f":"IF(INTRO!$E$41=\"Endémique\", IF($J47>1, IF($J47=4, \"Inconnu\", IF($J47=99, \"Surveillance\", F47)), 0),\"Non requis\")","v":"Surveillance"},{"$f":"IF(INTRO!$E$41=\"Endémique\", IF($J47>1, IF($J47=4, \"Inconnu\", IF($J47=99, \"Surveillance\", ROUND(D47*INTRO!$E$51,0))), 0),\"Non requis\")","v":"Surveillance"},{"$f":"IF(INTRO!$E$41=\"Endémique\", IF($J47>1, IF($J47=4, \"Inconnu\", IF($J47=99, \"Surveillance\", SUM($N47:$P47))), 0),\"Non requis\")","v":"Surveillance"},39368,101982,178361,{"$f":"IF(INTRO!$E$43=\"Endémique\", IF($K47>1, IF($K47=4, \"Inconnu\", IF($K47=99, \"Surveillance\", SUM($R47:$T47))), 0),\"Non requis\")","v":319711},0,null,0,0,null,null,null,null,null,35363,"Malbaza"]
[{"$f":"IF(INTRO!$E$33<>0,INTRO!$E$33, \" \")","v":"NIGER"},"Tahoua","Bouza",687581.11997211853,{"$f":"IF([1]INTRO!$E$48=\"\",\"\",ROUND($D48*[1]INTRO!$E$48,0))","v":123765},{"$f":"IF([1]INTRO!$E$49=\"\",\"\",ROUND($D48*[1]INTRO!$E$49,0))","v":206274},{"$f":"IF([1]INTRO!$E$50=\"\",\"\",ROUND($D48*[1]INTRO!$E$50,0))","v":343791},99,null,99,21,{"$f":"IF(INTRO!$E$37=\"Endémique\",IF($H48>0,IF($H48=4,\"Inconnu\",IF($H48=99,\"Interrompu\",$D48)),0),\"Non requis\")","v":"Interrompu"},{"$f":"IF(INTRO!$E$39=\"Endémique\", IF($I48>0, IF($I48=4,\"Inconnu\",IF($I48=99,\"Interrompu\",$D48)), 0),\"Non requis\")","v":"Non requis"},{"$f":"IF(INTRO!$E$41=\"Endémique\", IF($J48>1, IF($J48=4, \"Inconnu\", IF($J48=99, \"Surveillance\", E48)), 0),\"Non requis\")","v":"Surveillance"},{"$f":"IF(INTRO!$E$41=\"Endémique\", IF($J48>1, IF($J48=4, \"Inconnu\", IF($J48=99, \"Surveillance\", F48)), 0),\"Non requis\")","v":"Surveillance"},{"$f":"IF(INTRO!$E$41=\"Endémique\", IF($J48>1, IF($J48=4, \"Inconnu\", IF($J48=99, \"Surveillance\", ROUND(D48*INTRO!$E$51,0))), 0),\"Non requis\")","v":"Surveillance"},{"$f":"IF(INTRO!$E$41=\"Endémique\", IF($J48>1, IF($J48=4, \"Inconnu\", IF($J48=99, \"Surveillance\", SUM($N48:$P48))), 0),\"Non requis\")","v":"Surveillance"},77003,199469,348860,{"$f":"IF(INTRO!$E$43=\"Endémique\", IF($K48>1, IF($K48=4, \"Inconnu\", IF($K48=99, \"Surveillance\", SUM($R48:$T48))), 0),\"Non requis\")","v":625332},0,null,0,0,null,"TAS",null,null,null,35318,"Bouza"]
[{"$f":"IF(INTRO!$E$33<>0,INTRO!$E$33, \" \")","v":"NIGER"},"Tahoua","Illela",519697.96365242393,{"$f":"IF([1]INTRO!$E$48=\"\",\"\",ROUND($D49*[1]INTRO!$E$48,0))","v":93546},{"$f":"IF([1]INTRO!$E$49=\"\",\"\",ROUND($D49*[1]INTRO!$E$49,0))","v":155909},{"$f":"IF([1]INTRO!$E$50=\"\",\"\",ROUND($D49*[1]INTRO!$E$50,0))","v":259849},99,null,99,11,{"$f":"IF(INTRO!$E$37=\"Endémique\",IF($H49>0,IF($H49=4,\"Inconnu\",IF($H49=99,\"Interrompu\",$D49)),0),\"Non requis\")","v":"Interrompu"},{"$f":"IF(INTRO!$E$39=\"Endémique\", IF($I49>0, IF($I49=4,\"Inconnu\",IF($I49=99,\"Interrompu\",$D49)), 0),\"Non requis\")","v":"Non requis"},{"$f":"IF(INTRO!$E$41=\"Endémique\", IF($J49>1, IF($J49=4, \"Inconnu\", IF($J49=99, \"Surveillance\", E49)), 0),\"Non requis\")","v":"Surveillance"},{"$f":"IF(INTRO!$E$41=\"Endémique\", IF($J49>1, IF($J49=4, \"Inconnu\", IF($J49=99, \"Surveillance\", F49)), 0),\"Non requis\")","v":"Surveillance"},{"$f":"IF(INTRO!$E$41=\"Endémique\", IF($J49>1, IF($J49=4, \"Inconnu\", IF($J49=99, \"Surveillance\", ROUND(D49*INTRO!$E$51,0))), 0),\"Non requis\")","v":"Surveillance"},{"$f":"IF(INTRO!$E$41=\"Endémique\", IF($J49>1, IF($J49=4, \"Inconnu\", IF($J49=99, \"Surveillance\", SUM($N49:$P49))), 0),\"Non requis\")","v":"Surveillance"},57175,148115,259041,{"$f":"IF(INTRO!$E$43=\"Endémique\", IF($K49>1, IF($K49=4, \"Inconnu\", IF($K49=99, \"Surveillance\", SUM($R49:$T49))), 0),\"Non requis\")","v":464331},0,null,0,0,null,null,null,null,null,35364,"Illela"]
[{"$f":"IF(INTRO!$E$33<>0,INTRO!$E$33, \" \")","v":"NIGER"},"Tahoua","Bagaroua",111610.75775523417,{"$f":"IF([1]INTRO!$E$48=\"\",\"\",ROUND($D50*[1]INTRO!$E$48,0))","v":20090},{"$f":"IF([1]INTRO!$E$49=\"\",\"\",ROUND($D50*[1]INTRO!$E$49,0))","v":33483},{"$f":"IF([1]INTRO!$E$50=\"\",\"\",ROUND($D50*[1]INTRO!$E$50,0))","v":55805},99,null,99,2,{"$f":"IF(INTRO!$E$37=\"Endémique\",IF($H50>0,IF($H50=4,\"Inconnu\",IF($H50=99,\"Interrompu\",$D50)),0),\"Non requis\")","v":"Interrompu"},{"$f":"IF(INTRO!$E$39=\"Endémique\", IF($I50>0, IF($I50=4,\"Inconnu\",IF($I50=99,\"Interrompu\",$D50)), 0),\"Non requis\")","v":"Non requis"},{"$f":"IF(INTRO!$E$41=\"Endémique\", IF($J50>1, IF($J50=4, \"Inconnu\", IF($J50=99, \"Surveillance\", E50)), 0),\"Non requis\")","v":"Surveillance"},{"$f":"IF(INTRO!$E$41=\"Endémique\", IF($J50>1, IF($J50=4, \"Inconnu\", IF($J50=99, \"Surveillance\", F50)), 0),\"Non requis\")","v":"Surveillance"},{"$f":"IF(INTRO!$E$41=\"Endémique\", IF($J50>1, IF($J50=4, \"Inconnu\", IF($J50=99, \"Surveillance\", ROUND(D50*INTRO!$E$51,0))), 0),\"Non requis\")","v":"Surveillance"},{"$f":"IF(INTRO!$E$41=\"Endémique\", IF($J50>1, IF($J50=4, \"Inconnu\", IF($J50=99, \"Surveillance\", SUM($N50:$P50))), 0),\"Non requis\")","v":"Surveillance"},11820,30622,53556,{"$f":"IF(INTRO!$E$43=\"Endémique\", IF($K50>1, IF($K50=4, \"Inconnu\", IF($K50=99, \"Surveillance\", SUM($R50:$T50))), 0),\"Non requis\")","v":95998},0,null,0,0,null,null,null,null,null,35365,"Bagaroua"]
[{"$f":"IF(INTRO!$E$33<>0,INTRO!$E$33, \" \")","v":"NIGER"},"Tahoua","Keita",520434.38808423956,{"$f":"IF([1]INTRO!$E$48=\"\",\"\",ROUND($D51*[1]INTRO!$E$48,0))","v":93678},{"$f":"IF([1]INTRO!$E$49=\"\",\"\",ROUND($D51*[1]INTRO!$E$49,0))","v":156130},{"$f":"IF([1]INTRO!$E$50=\"\",\"\",ROUND($D51*[1]INTRO!$E$50,0))","v":260217},99,null,99,21,{"$f":"IF(INTRO!$E$37=\"Endémique\",IF($H51>0,IF($H51=4,\"Inconnu\",IF($H51=99,\"Interrompu\",$D51)),0),\"Non requis\")","v":"Interrompu"},{"$f":"IF(INTRO!$E$39=\"Endémique\", IF($I51>0, IF($I51=4,\"Inconnu\",IF($I51=99,\"Interrompu\",$D51)), 0),\"Non requis\")","v":"Non requis"},{"$f":"IF(INTRO!$E$41=\"Endémique\", IF($J51>1, IF($J51=4, \"Inconnu\", IF($J51=99, \"Surveillance\", E51)), 0),\"Non requis\")","v":"Surveillance"},{"$f":"IF(INTRO!$E$41=\"Endémique\", IF($J51>1, IF($J51=4, \"Inconnu\", IF($J51=99, \"Surveillance\", F51)), 0),\"Non requis\")","v":"Surveillance"},{"$f":"IF(INTRO!$E$41=\"Endémique\", IF($J51>1, IF($J51=4, \"Inconnu\", IF($J51=99, \"Surveillance\", ROUND(D51*INTRO!$E$51,0))), 0),\"Non requis\")","v":"Surveillance"},{"$f":"IF(INTRO!$E$41=\"Endémique\", IF($J51>1, IF($J51=4, \"Inconnu\", IF($J51=99, \"Surveillance\", SUM($N51:$P51))), 0),\"Non requis\")","v":"Surveillance"},56638,146717,256600,{"$f":"IF(INTRO!$E$43=\"Endémique\", IF($K51>1, IF($K51=4, \"Inconnu\", IF($K51=99, \"Surveillance\", SUM($R51:$T51))), 0),\"Non requis\")","v":459955},0,null,0,0,null,"TAS",null,null,null,35320,"Keita"]
[{"$f":"IF(INTRO!$E$33<>0,INTRO!$E$33, \" \")","v":"NIGER"},"Tahoua","Madaoua",842237.96998706576,{"$f":"IF([1]INTRO!$E$48=\"\",\"\",ROUND($D52*[1]INTRO!$E$48,0))","v":151603},{"$f":"IF([1]INTRO!$E$49=\"\",\"\",ROUND($D52*[1]INTRO!$E$49,0))","v":252671},{"$f":"IF([1]INTRO!$E$50=\"\",\"\",ROUND($D52*[1]INTRO!$E$50,0))","v":421119},99,null,99,31,{"$f":"IF(INTRO!$E$37=\"Endémique\",IF($H52>0,IF($H52=4,\"Inconnu\",IF($H52=99,\"Interrompu\",$D52)),0),\"Non requis\")","v":"Interrompu"},{"$f":"IF(INTRO!$E$39=\"Endémique\", IF($I52>0, IF($I52=4,\"Inconnu\",IF($I52=99,\"Interrompu\",$D52)), 0),\"Non requis\")","v":"Non requis"},{"$f":"IF(INTRO!$E$41=\"Endémique\", IF($J52>1, IF($J52=4, \"Inconnu\", IF($J52=99, \"Surveillance\", E52)), 0),\"Non requis\")","v":"Surveillance"},{"$f":"IF(INTRO!$E$41=\"Endémique\", IF($J52>1, IF($J52=4, \"Inconnu\", IF($J52=99, \"Surveillance\", F52)), 0),\"Non requis\")","v":"Surveillance"},{"$f":"IF(INTRO!$E$41=\"Endémique\", IF($J52>1, IF($J52=4, \"Inconnu\", IF($J52=99, \"Surveillance\", ROUND(D52*INTRO!$E$51,0))), 0),\"Non requis\")","v":"Surveillance"},{"$f":"IF(INTRO!$E$41=\"Endémique\", IF($J52>1, IF($J52=4, \"Inconnu\", IF($J52=99, \"Surveillance\", SUM($N52:$P52))), 0),\"Non requis\")","v":"Surveillance"},101331,262492,459088,{"$f":"IF(INTRO!$E$43=\"Endémique\", IF($K52>1, IF($K52=4, \"Inconnu\", IF($K52=99, \"Surveillance\", SUM($R52:$T52))), 0),\"Non requis\")","v":822911},0,null,0,0,null,"TAS",null,null,null,35321,"Madaoua"]
[{"$f":"IF(INTRO!$E$33<>0,INTRO!$E$33, \" \")","v":"NIGER"},"Tahoua","Tahoua département",666677.1644023417,{"$f":"IF([1]INTRO!$E$48=\"\",\"\",ROUND($D53*[1]INTRO!$E$48,0))","v":120002},{"$f":"IF([1]INTRO!$E$49=\"\",\"\",ROUND($D53*[1]INTRO!$E$49,0))","v":200003},{"$f":"IF([1]INTRO!$E$50=\"\",\"\",ROUND($D53*[1]INTRO!$E$50,0))","v":333339},99,null,99,21,{"$f":"IF(INTRO!$E$37=\"Endémique\",IF($H53>0,IF($H53=4,\"Inconnu\",IF($H53=99,\"Interrompu\",$D53)),0),\"Non requis\")","v":"Interrompu"},{"$f":"IF(INTRO!$E$39=\"Endémique\", IF($I53>0, IF($I53=4,\"Inconnu\",IF($I53=99,\"Interrompu\",$D53)), 0),\"Non requis\")","v":"Non requis"},{"$f":"IF(INTRO!$E$41=\"Endémique\", IF($J53>1, IF($J53=4, \"Inconnu\", IF($J53=99, \"Surveillance\", E53)), 0),\"Non requis\")","v":"Surveillance"},{"$f":"IF(INTRO!$E$41=\"Endémique\", IF($J53>1, IF($J53=4, \"Inconnu\", IF($J53=99, \"Surveillance\", F53)), 0),\"Non requis\")","v":"Surveillance"},{"$f":"IF(INTRO!$E$41=\"Endémique\", IF($J53>1, IF($J53=4, \"Inconnu\", IF($J53=99, \"Surveillance\", ROUND(D53*INTRO!$E$51,0))), 0),\"Non requis\")","v":"Surveillance"},{"$f":"IF(INTRO!$E$41=\"Endémique\", IF($J53>1, IF($J53=4, \"Inconnu\", IF($J53=99, \"Surveillance\", SUM($N53:$P53))), 0),\"Non requis\")","v":"Surveillance"},75995,196859,344297,{"$f":"IF(INTRO!$E$43=\"Endémique\", IF($K53>1, IF($K53=4, \"Inconnu\", IF($K53=99, \"Surveillance\", SUM($R53:$T53))), 0),\"Non requis\")","v":617151},0,null,0,0,null,null,null,null,null,35366,"Tahoua"]
[{"$f":"IF(INTRO!$E$33<>0,INTRO!$E$33, \" \")","v":"NIGER"},"Tahoua","Tahoua commune",223993.44887715139,{"$f":"IF([1]INTRO!$E$48=\"\",\"\",ROUND($D54*[1]INTRO!$E$48,0))","v":40319},{"$f":"IF([1]INTRO!$E$49=\"\",\"\",ROUND($D54*[1]INTRO!$E$49,0))","v":67198},{"$f":"IF([1]INTRO!$E$50=\"\",\"\",ROUND($D54*[1]INTRO!$E$50,0))","v":111997},99,null,99,21,{"$f":"IF(INTRO!$E$37=\"Endémique\",IF($H54>0,IF($H54=4,\"Inconnu\",IF($H54=99,\"Interrompu\",$D54)),0),\"Non requis\")","v":"Interrompu"},{"$f":"IF(INTRO!$E$39=\"Endémique\", IF($I54>0, IF($I54=4,\"Inconnu\",IF($I54=99,\"Interrompu\",$D54)), 0),\"Non requis\")","v":"Non requis"},{"$f":"IF(INTRO!$E$41=\"Endémique\", IF($J54>1, IF($J54=4, \"Inconnu\", IF($J54=99, \"Surveillance\", E54)), 0),\"Non requis\")","v":"Surveillance"},{"$f":"IF(INTRO!$E$41=\"Endémique\", IF($J54>1, IF($J54=4, \"Inconnu\", IF($J54=99, \"Surveillance\", F54)), 0),\"Non requis\")","v":"Surveillance"},{"$f":"IF(INTRO!$E$41=\"Endémique\", IF($J54>1, IF($J54=4, \"Inconnu\", IF($J54=99, \"Surveillance\", ROUND(D54*INTRO!$E$51,0))), 0),\"Non requis\")","v":"Surveillance"},{"$f":"IF(INTRO!$E$41=\"Endémique\", IF($J54>1, IF($J54=4, \"Inconnu\", IF($J54=99, \"Surveillance\", SUM($N54:$P54))), 0),\"Non requis\")","v":"Surveillance"},25472,65984,115399,{"$f":"IF(INTRO!$E$43=\"Endémique\", IF($K54>1, IF($K54=4, \"Inconnu\", IF($K54=99, \"Surveillance\", SUM($R54:$T54))), 0),\"Non requis\")","v":206855},0,null,0,0,null,null,null,null,null,35367,"Tahoua commune"]
[{"$f":"IF(INTRO!$E$33<>0,INTRO!$E$33, \" \")","v":"NIGER"},"Tahoua","TCHINTABARADEN",230804.98890476252,{"$f":"IF([1]INTRO!$E$48=\"\",\"\",ROUND($D55*[1]INTRO!$E$48,0))","v":41545},{"$f":"IF([1]INTRO!$E$49=\"\",\"\",ROUND($D55*[1]INTRO!$E$49,0))","v":69241},{"$f":"IF([1]INTRO!$E$50=\"\",\"\",ROUND($D55*[1]INTRO!$E$50,0))","v":115402},99,null,11,31,{"$f":"IF(INTRO!$E$37=\"Endémique\",IF($H55>0,IF($H55=4,\"Inconnu\",IF($H55=99,\"Interrompu\",$D55)),0),\"Non requis\")","v":"Interrompu"},{"$f":"IF(INTRO!$E$39=\"Endémique\", IF($I55>0, IF($I55=4,\"Inconnu\",IF($I55=99,\"Interrompu\",$D55)), 0),\"Non requis\")","v":"Non requis"},{"$f":"IF(INTRO!$E$41=\"Endémique\", IF($J55>1, IF($J55=4, \"Inconnu\", IF($J55=99, \"Surveillance\", E55)), 0),\"Non requis\")","v":41545},{"$f":"IF(INTRO!$E$41=\"Endémique\", IF($J55>1, IF($J55=4, \"Inconnu\", IF($J55=99, \"Surveillance\", F55)), 0),\"Non requis\")","v":69241},{"$f":"IF(INTRO!$E$41=\"Endémique\", IF($J55>1, IF($J55=4, \"Inconnu\", IF($J55=99, \"Surveillance\", ROUND(D55*INTRO!$E$51,0))), 0),\"Non requis\")","v":48284},{"$f":"IF(INTRO!$E$41=\"Endémique\", IF($J55>1, IF($J55=4, \"Inconnu\", IF($J55=99, \"Surveillance\", SUM($N55:$P55))), 0),\"Non requis\")","v":159070},25645,66432,116185,{"$f":"IF(INTRO!$E$43=\"Endémique\", IF($K55>1, IF($K55=4, \"Inconnu\", IF($K55=99, \"Surveillance\", SUM($R55:$T55))), 0),\"Non requis\")","v":208262},0,null,0,1,null,null,null,null,null,35368,"Tchintabaraden"]
[{"$f":"IF(INTRO!$E$33<>0,INTRO!$E$33, \" \")","v":"NIGER"},"Tahoua","Tassara",37758.348697934271,{"$f":"IF([1]INTRO!$E$48=\"\",\"\",ROUND($D56*[1]INTRO!$E$48,0))","v":6797},{"$f":"IF([1]INTRO!$E$49=\"\",\"\",ROUND($D56*[1]INTRO!$E$49,0))","v":11328},{"$f":"IF([1]INTRO!$E$50=\"\",\"\",ROUND($D56*[1]INTRO!$E$50,0))","v":18879},99,null,11,31,{"$f":"IF(INTRO!$E$37=\"Endémique\",IF($H56>0,IF($H56=4,\"Inconnu\",IF($H56=99,\"Interrompu\",$D56)),0),\"Non requis\")","v":"Interrompu"},{"$f":"IF(INTRO!$E$39=\"Endémique\", IF($I56>0, IF($I56=4,\"Inconnu\",IF($I56=99,\"Interrompu\",$D56)), 0),\"Non requis\")","v":"Non requis"},{"$f":"IF(INTRO!$E$41=\"Endémique\", IF($J56>1, IF($J56=4, \"Inconnu\", IF($J56=99, \"Surveillance\", E56)), 0),\"Non requis\")","v":6797},{"$f":"IF(INTRO!$E$41=\"Endémique\", IF($J56>1, IF($J56=4, \"Inconnu\", IF($J56=99, \"Surveillance\", F56)), 0),\"Non requis\")","v":11328},{"$f":"IF(INTRO!$E$41=\"Endémique\", IF($J56>1, IF($J56=4, \"Inconnu\", IF($J56=99, \"Surveillance\", ROUND(D56*INTRO!$E$51,0))), 0),\"Non requis\")","v":7899},{"$f":"IF(INTRO!$E$41=\"Endémique\", IF($J56>1, IF($J56=4, \"Inconnu\", IF($J56=99, \"Surveillance\", SUM($N56:$P56))), 0),\"Non requis\")","v":26024},4299,11137,19477,{"$f":"IF(INTRO!$E$43=\"Endémique\", IF($K56>1, IF($K56=4, \"Inconnu\", IF($K56=99, \"Surveillance\", SUM($R56:$T56))), 0),\"Non requis\")","v":34913},0,null,0,1,null,null,null,null,null,35369,"Tassara"]
[{"$f":"IF(INTRO!$E$33<>0,INTRO!$E$33, \" \")","v":"NIGER"},"Tahoua","Tillia",60201.539400877002,{"$f":"IF([1]INTRO!$E$48=\"\",\"\",ROUND($D57*[1]INTRO!$E$48,0))","v":10836},{"$f":"IF([1]INTRO!$E$49=\"\",\"\",ROUND($D57*[1]INTRO!$E$49,0))","v":18060},{"$f":"IF([1]INTRO!$E$50=\"\",\"\",ROUND($D57*[1]INTRO!$E$50,0))","v":30101},99,null,11,31,{"$f":"IF(INTRO!$E$37=\"Endémique\",IF($H57>0,IF($H57=4,\"Inconnu\",IF($H57=99,\"Interrompu\",$D57)),0),\"Non requis\")","v":"Interrompu"},{"$f":"IF(INTRO!$E$39=\"Endémique\", IF($I57>0, IF($I57=4,\"Inconnu\",IF($I57=99,\"Interrompu\",$D57)), 0),\"Non requis\")","v":"Non requis"},{"$f":"IF(INTRO!$E$41=\"Endémique\", IF($J57>1, IF($J57=4, \"Inconnu\", IF($J57=99, \"Surveillance\", E57)), 0),\"Non requis\")","v":10836},{"$f":"IF(INTRO!$E$41=\"Endémique\", IF($J57>1, IF($J57=4, \"Inconnu\", IF($J57=99, \"Surveillance\", F57)), 0),\"Non requis\")","v":18060},{"$f":"IF(INTRO!$E$41=\"Endémique\", IF($J57>1, IF($J57=4, \"Inconnu\", IF($J57=99, \"Surveillance\", ROUND(D57*INTRO!$E$51,0))), 0),\"Non requis\")","v":12594},{"$f":"IF(INTRO!$E$41=\"Endémique\", IF($J57>1, IF($J57=4, \"Inconnu\", IF($J57=99, \"Surveillance\", SUM($N57:$P57))), 0),\"Non requis\")","v":41490},8979,23261,40680,{"$f":"IF(INTRO!$E$43=\"Endémique\", IF($K57>1, IF($K57=4, \"Inconnu\", IF($K57=99, \"Surveillance\", SUM($R57:$T57))), 0),\"Non requis\")","v":72920},0,null,0,1,null,null,null,null,null,35370,"Tillia"]
[{"$f":"IF(INTRO!$E$33<>0,INTRO!$E$33, \" \")","v":"NIGER"},"Tillabery","Fillingue",473508.44998747396,{"$f":"IF([1]INTRO!$E$48=\"\",\"\",ROUND($D58*[1]INTRO!$E$48,0))","v":85232},{"$f":"IF([1]INTRO!$E$49=\"\",\"\",ROUND($D58*[1]INTRO!$E$49,0))","v":142053},{"$f":"IF([1]INTRO!$E$50=\"\",\"\",ROUND($D58*[1]INTRO!$E$50,0))","v":236754},0,null,99,21,{"$f":"IF(INTRO!$E$37=\"Endémique\",IF($H58>0,IF($H58=4,\"Inconnu\",IF($H58=99,\"Interrompu\",$D58)),0),\"Non requis\")","v":0},{"$f":"IF(INTRO!$E$39=\"Endémique\", IF($I58>0, IF($I58=4,\"Inconnu\",IF($I58=99,\"Interrompu\",$D58)), 0),\"Non requis\")","v":"Non requis"},{"$f":"IF(INTRO!$E$41=\"Endémique\", IF($J58>1, IF($J58=4, \"Inconnu\", IF($J58=99, \"Surveillance\", E58)), 0),\"Non requis\")","v":"Surveillance"},{"$f":"IF(INTRO!$E$41=\"Endémique\", IF($J58>1, IF($J58=4, \"Inconnu\", IF($J58=99, \"Surveillance\", F58)), 0),\"Non requis\")","v":"Surveillance"},{"$f":"IF(INTRO!$E$41=\"Endémique\", IF($J58>1, IF($J58=4, \"Inconnu\", IF($J58=99, \"Surveillance\", ROUND(D58*INTRO!$E$51,0))), 0),\"Non requis\")","v":"Surveillance"},{"$f":"IF(INTRO!$E$41=\"Endémique\", IF($J58>1, IF($J58=4, \"Inconnu\", IF($J58=99, \"Surveillance\", SUM($N58:$P58))), 0),\"Non requis\")","v":"Surveillance"},50823,131656,230257,{"$f":"IF(INTRO!$E$43=\"Endémique\", IF($K58>1, IF($K58=4, \"Inconnu\", IF($K58=99, \"Surveillance\", SUM($R58:$T58))), 0),\"Non requis\")","v":412736},0,null,0,1,null,null,null,null,null,35371,"Fillingue"]
[{"$f":"IF(INTRO!$E$33<>0,INTRO!$E$33, \" \")","v":"NIGER"},"Tillabery","Balleyara",165388.1779860789,{"$f":"IF([1]INTRO!$E$48=\"\",\"\",ROUND($D59*[1]INTRO!$E$48,0))","v":29770},{"$f":"IF([1]INTRO!$E$49=\"\",\"\",ROUND($D59*[1]INTRO!$E$49,0))","v":49616},{"$f":"IF([1]INTRO!$E$50=\"\",\"\",ROUND($D59*[1]INTRO!$E$50,0))","v":82694},0,null,99,21,{"$f":"IF(INTRO!$E$37=\"Endémique\",IF($H59>0,IF($H59=4,\"Inconnu\",IF($H59=99,\"Interrompu\",$D59)),0),\"Non requis\")","v":0},{"$f":"IF(INTRO!$E$39=\"Endémique\", IF($I59>0, IF($I59=4,\"Inconnu\",IF($I59=99,\"Interrompu\",$D59)), 0),\"Non requis\")","v":"Non requis"},{"$f":"IF(INTRO!$E$41=\"Endémique\", IF($J59>1, IF($J59=4, \"Inconnu\", IF($J59=99, \"Surveillance\", E59)), 0),\"Non requis\")","v":"Surveillance"},{"$f":"IF(INTRO!$E$41=\"Endémique\", IF($J59>1, IF($J59=4, \"Inconnu\", IF($J59=99, \"Surveillance\", F59)), 0),\"Non requis\")","v":"Surveillance"},{"$f":"IF(INTRO!$E$41=\"Endémique\", IF($J59>1, IF($J59=4, \"Inconnu\", IF($J59=99, \"Surveillance\", ROUND(D59*INTRO!$E$51,0))), 0),\"Non requis\")","v":"Surveillance"},{"$f":"IF(INTRO!$E$41=\"Endémique\", IF($J59>1, IF($J59=4, \"Inconnu\", IF($J59=99, \"Surveillance\", SUM($N59:$P59))), 0),\"Non requis\")","v":"Surveillance"},18194,47126,82426,{"$f":"IF(INTRO!$E$43=\"Endémique\", IF($K59>1, IF($K59=4, \"Inconnu\", IF($K59=99, \"Surveillance\", SUM($R59:$T59))), 0),\"Non requis\")","v":147746},0,null,0,1,null,null,null,null,null,35373,"Baleyara"]
[{"$f":"IF(INTRO!$E$33<>0,INTRO!$E$33, \" \")","v":"NIGER"},"Tillabery","Abala",222743.14444599627,{"$f":"IF([1]INTRO!$E$48=\"\",\"\",ROUND($D60*[1]INTRO!$E$48,0))","v":40094},{"$f":"IF([1]INTRO!$E$49=\"\",\"\",ROUND($D60*[1]INTRO!$E$49,0))","v":66823},{"$f":"IF([1]INTRO!$E$50=\"\",\"\",ROUND($D60*[1]INTRO!$E$50,0))","v":111372},0,null,99,31,{"$f":"IF(INTRO!$E$37=\"Endémique\",IF($H60>0,IF($H60=4,\"Inconnu\",IF($H60=99,\"Interrompu\",$D60)),0),\"Non requis\")","v":0},{"$f":"IF(INTRO!$E$39=\"Endémique\", IF($I60>0, IF($I60=4,\"Inconnu\",IF($I60=99,\"Interrompu\",$D60)), 0),\"Non requis\")","v":"Non requis"},{"$f":"IF(INTRO!$E$41=\"Endémique\", IF($J60>1, IF($J60=4, \"Inconnu\", IF($J60=99, \"Surveillance\", E60)), 0),\"Non requis\")","v":"Surveillance"},{"$f":"IF(INTRO!$E$41=\"Endémique\", IF($J60>1, IF($J60=4, \"Inconnu\", IF($J60=99, \"Surveillance\", F60)), 0),\"Non requis\")","v":"Surveillance"},{"$f":"IF(INTRO!$E$41=\"Endémique\", IF($J60>1, IF($J60=4, \"Inconnu\", IF($J60=99, \"Surveillance\", ROUND(D60*INTRO!$E$51,0))), 0),\"Non requis\")","v":"Surveillance"},{"$f":"IF(INTRO!$E$41=\"Endémique\", IF($J60>1, IF($J60=4, \"Inconnu\", IF($J60=99, \"Surveillance\", SUM($N60:$P60))), 0),\"Non requis\")","v":"Surveillance"},24502,63473,111009,{"$f":"IF(INTRO!$E$43=\"Endémique\", IF($K60>1, IF($K60=4, \"Inconnu\", IF($K60=99, \"Surveillance\", SUM($R60:$T60))), 0),\"Non requis\")","v":198984},0,null,0,1,null,null,null,null,null,35372,"Abala"]
[{"$f":"IF(INTRO!$E$33<>0,INTRO!$E$33, \" \")","v":"NIGER"},"Tillabery","Kollo",718459.99072696932,{"$f":"IF([1]INTRO!$E$48=\"\",\"\",ROUND($D61*[1]INTRO!$E$48,0))","v":129323},{"$f":"IF([1]INTRO!$E$49=\"\",\"\",ROUND($D61*[1]INTRO!$E$49,0))","v":215538},{"$f":"IF([1]INTRO!$E$50=\"\",\"\",ROUND($D61*[1]INTRO!$E$50,0))","v":359230},99,null,99,31,{"$f":"IF(INTRO!$E$37=\"Endémique\",IF($H61>0,IF($H61=4,\"Inconnu\",IF($H61=99,\"Interrompu\",$D61)),0),\"Non requis\")","v":"Interrompu"},{"$f":"IF(INTRO!$E$39=\"Endémique\", IF($I61>0, IF($I61=4,\"Inconnu\",IF($I61=99,\"Interrompu\",$D61)), 0),\"Non requis\")","v":"Non requis"},{"$f":"IF(INTRO!$E$41=\"Endémique\", IF($J61>1, IF($J61=4, \"Inconnu\", IF($J61=99, \"Surveillance\", E61)), 0),\"Non requis\")","v":"Surveillance"},{"$f":"IF(INTRO!$E$41=\"Endémique\", IF($J61>1, IF($J61=4, \"Inconnu\", IF($J61=99, \"Surveillance\", F61)), 0),\"Non requis\")","v":"Surveillance"},{"$f":"IF(INTRO!$E$41=\"Endémique\", IF($J61>1, IF($J61=4, \"Inconnu\", IF($J61=99, \"Surveillance\", ROUND(D61*INTRO!$E$51,0))), 0),\"Non requis\")","v":"Surveillance"},{"$f":"IF(INTRO!$E$41=\"Endémique\", IF($J61>1, IF($J61=4, \"Inconnu\", IF($J61=99, \"Surveillance\", SUM($N61:$P61))), 0),\"Non requis\")","v":"Surveillance"},79341,205528,359462,{"$f":"IF(INTRO!$E$43=\"Endémique\", IF($K61>1, IF($K61=4, \"Inconnu\", IF($K61=99, \"Surveillance\", SUM($R61:$T61))), 0),\"Non requis\")","v":644331},0,null,0,1,null,"TAS",null,null,null,35326,"Kollo"]
[{"$f":"IF(INTRO!$E$33<>0,INTRO!$E$33, \" \")","v":"NIGER"},"Tillabery","Ouallam",505152.25001695706,{"$f":"IF([1]INTRO!$E$48=\"\",\"\",ROUND($D62*[1]INTRO!$E$48,0))","v":90927},{"$f":"IF([1]INTRO!$E$49=\"\",\"\",ROUND($D62*[1]INTRO!$E$49,0))","v":151546},{"$f":"IF([1]INTRO!$E$50=\"\",\"\",ROUND($D62*[1]INTRO!$E$50,0))","v":252576},0,null,99,31,{"$f":"IF(INTRO!$E$37=\"Endémique\",IF($H62>0,IF($H62=4,\"Inconnu\",IF($H62=99,\"Interrompu\",$D62)),0),\"Non requis\")","v":0},{"$f":"IF(INTRO!$E$39=\"Endémique\", IF($I62>0, IF($I62=4,\"Inconnu\",IF($I62=99,\"Interrompu\",$D62)), 0),\"Non requis\")","v":"Non requis"},{"$f":"IF(INTRO!$E$41=\"Endémique\", IF($J62>1, IF($J62=4, \"Inconnu\", IF($J62=99, \"Surveillance\", E62)), 0),\"Non requis\")","v":"Surveillance"},{"$f":"IF(INTRO!$E$41=\"Endémique\", IF($J62>1, IF($J62=4, \"Inconnu\", IF($J62=99, \"Surveillance\", F62)), 0),\"Non requis\")","v":"Surveillance"},{"$f":"IF(INTRO!$E$41=\"Endémique\", IF($J62>1, IF($J62=4, \"Inconnu\", IF($J62=99, \"Surveillance\", ROUND(D62*INTRO!$E$51,0))), 0),\"Non requis\")","v":"Surveillance"},{"$f":"IF(INTRO!$E$41=\"Endémique\", IF($J62>1, IF($J62=4, \"Inconnu\", IF($J62=99, \"Surveillance\", SUM($N62:$P62))), 0),\"Non requis\")","v":"Surveillance"},55620,144089,252005,{"$f":"IF(INTRO!$E$43=\"Endémique\", IF($K62>1, IF($K62=4, \"Inconnu\", IF($K62=99, \"Surveillance\", SUM($R62:$T62))), 0),\"Non requis\")","v":451714},0,null,0,1,null,null,null,null,null,35374,"Ouallam"]
[{"$f":"IF(INTRO!$E$33<>0,INTRO!$E$33, \" \")","v":"NIGER"},"Tillabery","Banibangou",103352.55967283959,{"$f":"IF([1]INTRO!$E$48=\"\",\"\",ROUND($D63*[1]INTRO!$E$48,0))","v":18603},{"$f":"IF([1]INTRO!$E$49=\"\",\"\",ROUND($D63*[1]INTRO!$E$49,0))","v":31006},{"$f":"IF([1]INTRO!$E$50=\"\",\"\",ROUND($D63*[1]INTRO!$E$50,0))","v":51676},0,null,99,21,{"$f":"IF(INTRO!$E$37=\"Endémique\",IF($H63>0,IF($H63=4,\"Inconnu\",IF($H63=99,\"Interrompu\",$D63)),0),\"Non requis\")","v":0},{"$f":"IF(INTRO!$E$39=\"Endémique\", IF($I63>0, IF($I63=4,\"Inconnu\",IF($I63=99,\"Interrompu\",$D63)), 0),\"Non requis\")","v":"Non requis"},{"$f":"IF(INTRO!$E$41=\"Endémique\", IF($J63>1, IF($J63=4, \"Inconnu\", IF($J63=99, \"Surveillance\", E63)), 0),\"Non requis\")","v":"Surveillance"},{"$f":"IF(INTRO!$E$41=\"Endémique\", IF($J63>1, IF($J63=4, \"Inconnu\", IF($J63=99, \"Surveillance\", F63)), 0),\"Non requis\")","v":"Surveillance"},{"$f":"IF(INTRO!$E$41=\"Endémique\", IF($J63>1, IF($J63=4, \"Inconnu\", IF($J63=99, \"Surveillance\", ROUND(D63*INTRO!$E$51,0))), 0),\"Non requis\")","v":"Surveillance"},{"$f":"IF(INTRO!$E$41=\"Endémique\", IF($J63>1, IF($J63=4, \"Inconnu\", IF($J63=99, \"Surveillance\", SUM($N63:$P63))), 0),\"Non requis\")","v":"Surveillance"},11380,29481,51560,{"$f":"IF(INTRO!$E$43=\"Endémique\", IF($K63>1, IF($K63=4, \"Inconnu\", IF($K63=99, \"Surveillance\", SUM($R63:$T63))), 0),\"Non requis\")","v":92421},0,null,0,1,null,null,null,null,null,35375,"Banibangou"]
[{"$f":"IF(INTRO!$E$33<>0,INTRO!$E$33, \" \")","v":"NIGER"},"Tillabery","Say",271121.20110147202,{"$f":"IF([1]INTRO!$E$48=\"\",\"\",ROUND($D64*[1]INTRO!$E$48,0))","v":48802},{"$f":"IF([1]INTRO!$E$49=\"\",\"\",ROUND($D64*[1]INTRO!$E$49,0))","v":81336},{"$f":"IF([1]INTRO!$E$50=\"\",\"\",ROUND($D64*[1]INTRO!$E$50,0))","v":135561},99,null,99,21,{"$f":"IF(INTRO!$E$37=\"Endémique\",IF($H64>0,IF($H64=4,\"Inconnu\",IF($H64=99,\"Interrompu\",$D64)),0),\"Non requis\")","v":"Interrompu"},{"$f":"IF(INTRO!$E$39=\"Endémique\", IF($I64>0, IF($I64=4,\"Inconnu\",IF($I64=99,\"Interrompu\",$D64)), 0),\"Non requis\")","v":"Non requis"},{"$f":"IF(INTRO!$E$41=\"Endémique\", IF($J64>1, IF($J64=4, \"Inconnu\", IF($J64=99, \"Surveillance\", E64)), 0),\"Non requis\")","v":"Surveillance"},{"$f":"IF(INTRO!$E$41=\"Endémique\", IF($J64>1, IF($J64=4, \"Inconnu\", IF($J64=99, \"Surveillance\", F64)), 0),\"Non requis\")","v":"Surveillance"},{"$f":"IF(INTRO!$E$41=\"Endémique\", IF($J64>1, IF($J64=4, \"Inconnu\", IF($J64=99, \"Surveillance\", ROUND(D64*INTRO!$E$51,0))), 0),\"Non requis\")","v":"Surveillance"},{"$f":"IF(INTRO!$E$41=\"Endémique\", IF($J64>1, IF($J64=4, \"Inconnu\", IF($J64=99, \"Surveillance\", SUM($N64:$P64))), 0),\"Non requis\")","v":"Surveillance"},30173,78162,136701,{"$f":"IF(INTRO!$E$43=\"Endémique\", IF($K64>1, IF($K64=4, \"Inconnu\", IF($K64=99, \"Surveillance\", SUM($R64:$T64))), 0),\"Non requis\")","v":245036},0,null,0,1,null,"TAS",null,null,null,35376,"Say"]
[{"$f":"IF(INTRO!$E$33<>0,INTRO!$E$33, \" \")","v":"NIGER"},"Tillabery","Torodi",281908.93037291453,{"$f":"IF([1]INTRO!$E$48=\"\",\"\",ROUND($D65*[1]INTRO!$E$48,0))","v":50744},{"$f":"IF([1]INTRO!$E$49=\"\",\"\",ROUND($D65*[1]INTRO!$E$49,0))","v":84573},{"$f":"IF([1]INTRO!$E$50=\"\",\"\",ROUND($D65*[1]INTRO!$E$50,0))","v":140954},99,null,99,21,{"$f":"IF(INTRO!$E$37=\"Endémique\",IF($H65>0,IF($H65=4,\"Inconnu\",IF($H65=99,\"Interrompu\",$D65)),0),\"Non requis\")","v":"Interrompu"},{"$f":"IF(INTRO!$E$39=\"Endémique\", IF($I65>0, IF($I65=4,\"Inconnu\",IF($I65=99,\"Interrompu\",$D65)), 0),\"Non requis\")","v":"Non requis"},{"$f":"IF(INTRO!$E$41=\"Endémique\", IF($J65>1, IF($J65=4, \"Inconnu\", IF($J65=99, \"Surveillance\", E65)), 0),\"Non requis\")","v":"Surveillance"},{"$f":"IF(INTRO!$E$41=\"Endémique\", IF($J65>1, IF($J65=4, \"Inconnu\", IF($J65=99, \"Surveillance\", F65)), 0),\"Non requis\")","v":"Surveillance"},{"$f":"IF(INTRO!$E$41=\"Endémique\", IF($J65>1, IF($J65=4, \"Inconnu\", IF($J65=99, \"Surveillance\", ROUND(D65*INTRO!$E$51,0))), 0),\"Non requis\")","v":"Surveillance"},{"$f":"IF(INTRO!$E$41=\"Endémique\", IF($J65>1, IF($J65=4, \"Inconnu\", IF($J65=99, \"Surveillance\", SUM($N65:$P65))), 0),\"Non requis\")","v":"Surveillance"},31373,81270,142139,{"$f":"IF(INTRO!$E$43=\"Endémique\", IF($K65>1, IF($K65=4, \"Inconnu\", IF($K65=99, \"Surveillance\", SUM($R65:$T65))), 0),\"Non requis\")","v":254782},0,null,0,1,null,"TAS",null,null,null,35377,"Torodi"]
[{"$f":"IF(INTRO!$E$33<>0,INTRO!$E$33, \" \")","v":"NIGER"},"Tillabery","Tera",519019.76175785117,{"$f":"IF([1]INTRO!$E$48=\"\",\"\",ROUND($D66*[1]INTRO!$E$48,0))","v":93424},{"$f":"IF([1]INTRO!$E$49=\"\",\"\",ROUND($D66*[1]INTRO!$E$49,0))","v":155706},{"$f":"IF([1]INTRO!$E$50=\"\",\"\",ROUND($D66*[1]INTRO!$E$50,0))","v":259510},99,null,99,31,{"$f":"IF(INTRO!$E$37=\"Endémique\",IF($H66>0,IF($H66=4,\"Inconnu\",IF($H66=99,\"Interrompu\",$D66)),0),\"Non requis\")","v":"Interrompu"},{"$f":"IF(INTRO!$E$39=\"Endémique\", IF($I66>0, IF($I66=4,\"Inconnu\",IF($I66=99,\"Interrompu\",$D66)), 0),\"Non requis\")","v":"Non requis"},{"$f":"IF(INTRO!$E$41=\"Endémique\", IF($J66>1, IF($J66=4, \"Inconnu\", IF($J66=99, \"Surveillance\", E66)), 0),\"Non requis\")","v":"Surveillance"},{"$f":"IF(INTRO!$E$41=\"Endémique\", IF($J66>1, IF($J66=4, \"Inconnu\", IF($J66=99, \"Surveillance\", F66)), 0),\"Non requis\")","v":"Surveillance"},{"$f":"IF(INTRO!$E$41=\"Endémique\", IF($J66>1, IF($J66=4, \"Inconnu\", IF($J66=99, \"Surveillance\", ROUND(D66*INTRO!$E$51,0))), 0),\"Non requis\")","v":"Surveillance"},{"$f":"IF(INTRO!$E$41=\"Endémique\", IF($J66>1, IF($J66=4, \"Inconnu\", IF($J66=99, \"Surveillance\", SUM($N66:$P66))), 0),\"Non requis\")","v":"Surveillance"},57762,149630,261692,{"$f":"IF(INTRO!$E$43=\"Endémique\", IF($K66>1, IF($K66=4, \"Inconnu\", IF($K66=99, \"Surveillance\", SUM($R66:$T66))), 0),\"Non requis\")","v":469084},0,null,0,1,null,"TAS",null,null,null,35378,"Tera"]
[{"$f":"IF(INTRO!$E$33<>0,INTRO!$E$33, \" \")","v":"NIGER"},"Tillabery","Bankilare",131053.62064118015,{"$f":"IF([1]INTRO!$E$48=\"\",\"\",ROUND($D67*[1]INTRO!$E$48,0))","v":23590},{"$f":"IF([1]INTRO!$E$49=\"\",\"\",ROUND($D67*[1]INTRO!$E$49,0))","v":39316},{"$f":"IF([1]INTRO!$E$50=\"\",\"\",ROUND($D67*[1]INTRO!$E$50,0))","v":65527},99,null,99,31,{"$f":"IF(INTRO!$E$37=\"Endémique\",IF($H67>0,IF($H67=4,\"Inconnu\",IF($H67=99,\"Interrompu\",$D67)),0),\"Non requis\")","v":"Interrompu"},{"$f":"IF(INTRO!$E$39=\"Endémique\", IF($I67>0, IF($I67=4,\"Inconnu\",IF($I67=99,\"Interrompu\",$D67)), 0),\"Non requis\")","v":"Non requis"},{"$f":"IF(INTRO!$E$41=\"Endémique\", IF($J67>1, IF($J67=4, \"Inconnu\", IF($J67=99, \"Surveillance\", E67)), 0),\"Non requis\")","v":"Surveillance"},{"$f":"IF(INTRO!$E$41=\"Endémique\", IF($J67>1, IF($J67=4, \"Inconnu\", IF($J67=99, \"Surveillance\", F67)), 0),\"Non requis\")","v":"Surveillance"},{"$f":"IF(INTRO!$E$41=\"Endémique\", IF($J67>1, IF($J67=4, \"Inconnu\", IF($J67=99, \"Surveillance\", ROUND(D67*INTRO!$E$51,0))), 0),\"Non requis\")","v":"Surveillance"},{"$f":"IF(INTRO!$E$41=\"Endémique\", IF($J67>1, IF($J67=4, \"Inconnu\", IF($J67=99, \"Surveillance\", SUM($N67:$P67))), 0),\"Non requis\")","v":"Surveillance"},14584,37781,66077,{"$f":"IF(INTRO!$E$43=\"Endémique\", IF($K67>1, IF($K67=4, \"Inconnu\", IF($K67=99, \"Surveillance\", SUM($R67:$T67))), 0),\"Non requis\")","v":118442},0,null,0,1,null,"TAS",null,null,null,35379,"Bankilare"]
[{"$f":"IF(INTRO!$E$33<>0,INTRO!$E$33, \" \")","v":"NIGER"},"Tillabery","Gothèye",372110.27858848189,{"$f":"IF([1]INTRO!$E$48=\"\",\"\",ROUND($D68*[1]INTRO!$E$48,0))","v":66980},{"$f":"IF([1]INTRO!$E$49=\"\",\"\",ROUND($D68*[1]INTRO!$E$49,0))","v":111633},{"$f":"IF([1]INTRO!$E$50=\"\",\"\",ROUND($D68*[1]INTRO!$E$50,0))","v":186055},99,null,99,31,{"$f":"IF(INTRO!$E$37=\"Endémique\",IF($H68>0,IF($H68=4,\"Inconnu\",IF($H68=99,\"Interrompu\",$D68)),0),\"Non requis\")","v":"Interrompu"},{"$f":"IF(INTRO!$E$39=\"Endémique\", IF($I68>0, IF($I68=4,\"Inconnu\",IF($I68=99,\"Interrompu\",$D68)), 0),\"Non requis\")","v":"Non requis"},{"$f":"IF(INTRO!$E$41=\"Endémique\", IF($J68>1, IF($J68=4, \"Inconnu\", IF($J68=99, \"Surveillance\", E68)), 0),\"Non requis\")","v":"Surveillance"},{"$f":"IF(INTRO!$E$41=\"Endémique\", IF($J68>1, IF($J68=4, \"Inconnu\", IF($J68=99, \"Surveillance\", F68)), 0),\"Non requis\")","v":"Surveillance"},{"$f":"IF(INTRO!$E$41=\"Endémique\", IF($J68>1, IF($J68=4, \"Inconnu\", IF($J68=99, \"Surveillance\", ROUND(D68*INTRO!$E$51,0))), 0),\"Non requis\")","v":"Surveillance"},{"$f":"IF(INTRO!$E$41=\"Endémique\", IF($J68>1, IF($J68=4, \"Inconnu\", IF($J68=99, \"Surveillance\", SUM($N68:$P68))), 0),\"Non requis\")","v":"Surveillance"},41412,107273,187618,{"$f":"IF(INTRO!$E$43=\"Endémique\", IF($K68>1, IF($K68=4, \"Inconnu\", IF($K68=99, \"Surveillance\", SUM($R68:$T68))), 0),\"Non requis\")","v":336303},0,null,0,1,null,"TAS",null,null,null,35380,"Gothèye"]
[{"$f":"IF(INTRO!$E$33<>0,INTRO!$E$33, \" \")","v":"NIGER"},"Tillabery","Tillaberi",350974.78896980424,{"$f":"IF([1]INTRO!$E$48=\"\",\"\",ROUND($D69*[1]INTRO!$E$48,0))","v":63175},{"$f":"IF([1]INTRO!$E$49=\"\",\"\",ROUND($D69*[1]INTRO!$E$49,0))","v":105292},{"$f":"IF([1]INTRO!$E$50=\"\",\"\",ROUND($D69*[1]INTRO!$E$50,0))","v":175487},99,null,1,31,{"$f":"IF(INTRO!$E$37=\"Endémique\",IF($H69>0,IF($H69=4,\"Inconnu\",IF($H69=99,\"Interrompu\",$D69)),0),\"Non requis\")","v":"Interrompu"},{"$f":"IF(INTRO!$E$39=\"Endémique\", IF($I69>0, IF($I69=4,\"Inconnu\",IF($I69=99,\"Interrompu\",$D69)), 0),\"Non requis\")","v":"Non requis"},{"$f":"IF(INTRO!$E$41=\"Endémique\", IF($J69>1, IF($J69=4, \"Inconnu\", IF($J69=99, \"Surveillance\", E69)), 0),\"Non requis\")","v":0},{"$f":"IF(INTRO!$E$41=\"Endémique\", IF($J69>1, IF($J69=4, \"Inconnu\", IF($J69=99, \"Surveillance\", F69)), 0),\"Non requis\")","v":0},{"$f":"IF(INTRO!$E$41=\"Endémique\", IF($J69>1, IF($J69=4, \"Inconnu\", IF($J69=99, \"Surveillance\", ROUND(D69*INTRO!$E$51,0))), 0),\"Non requis\")","v":0},{"$f":"IF(INTRO!$E$41=\"Endémique\", IF($J69>1, IF($J69=4, \"Inconnu\", IF($J69=99, \"Surveillance\", SUM($N69:$P69))), 0),\"Non requis\")","v":0},37511,97171,169946,{"$f":"IF(INTRO!$E$43=\"Endémique\", IF($K69>1, IF($K69=4, \"Inconnu\", IF($K69=99, \"Surveillance\", SUM($R69:$T69))), 0),\"Non requis\")","v":304628},0,null,0,1,null,"TAS",null,null,null,35381,"Tillaberi"]
[{"$f":"IF(INTRO!$E$33<>0,INTRO!$E$33, \" \")","v":"NIGER"},"Tillabery","Ayorou",88040.097359811814,{"$f":"IF([1]INTRO!$E$48=\"\",\"\",ROUND($D70*[1]INTRO!$E$48,0))","v":15847},{"$f":"IF([1]INTRO!$E$49=\"\",\"\",ROUND($D70*[1]INTRO!$E$49,0))","v":26412},{"$f":"IF([1]INTRO!$E$50=\"\",\"\",ROUND($D70*[1]INTRO!$E$50,0))","v":44020},99,null,1,3,{"$f":"IF(INTRO!$E$37=\"Endémique\",IF($H70>0,IF($H70=4,\"Inconnu\",IF($H70=99,\"Interrompu\",$D70)),0),\"Non requis\")","v":"Interrompu"},{"$f":"IF(INTRO!$E$39=\"Endémique\", IF($I70>0, IF($I70=4,\"Inconnu\",IF($I70=99,\"Interrompu\",$D70)), 0),\"Non requis\")","v":"Non requis"},{"$f":"IF(INTRO!$E$41=\"Endémique\", IF($J70>1, IF($J70=4, \"Inconnu\", IF($J70=99, \"Surveillance\", E70)), 0),\"Non requis\")","v":0},{"$f":"IF(INTRO!$E$41=\"Endémique\", IF($J70>1, IF($J70=4, \"Inconnu\", IF($J70=99, \"Surveillance\", F70)), 0),\"Non requis\")","v":0},{"$f":"IF(INTRO!$E$41=\"Endémique\", IF($J70>1, IF($J70=4, \"Inconnu\", IF($J70=99, \"Surveillance\", ROUND(D70*INTRO!$E$51,0))), 0),\"Non requis\")","v":0},{"$f":"IF(INTRO!$E$41=\"Endémique\", IF($J70>1, IF($J70=4, \"Inconnu\", IF($J70=99, \"Surveillance\", SUM($N70:$P70))), 0),\"Non requis\")","v":0},9638,24966,43664,{"$f":"IF(INTRO!$E$43=\"Endémique\", IF($K70>1, IF($K70=4, \"Inconnu\", IF($K70=99, \"Surveillance\", SUM($R70:$T70))), 0),\"Non requis\")","v":78268},0,null,0,1,null,"TAS",null,null,null,35382,"Ayerou"]
[{"$f":"IF(INTRO!$E$33<>0,INTRO!$E$33, \" \")","v":"NIGER"},"Zinder","Goure",506483.75643528317,{"$f":"IF([1]INTRO!$E$48=\"\",\"\",ROUND($D71*[1]INTRO!$E$48,0))","v":91167},{"$f":"IF([1]INTRO!$E$49=\"\",\"\",ROUND($D71*[1]INTRO!$E$49,0))","v":151945},{"$f":"IF([1]INTRO!$E$50=\"\",\"\",ROUND($D71*[1]INTRO!$E$50,0))","v":253242},99,null,1,21,{"$f":"IF(INTRO!$E$37=\"Endémique\",IF($H71>0,IF($H71=4,\"Inconnu\",IF($H71=99,\"Interrompu\",$D71)),0),\"Non requis\")","v":"Interrompu"},{"$f":"IF(INTRO!$E$39=\"Endémique\", IF($I71>0, IF($I71=4,\"Inconnu\",IF($I71=99,\"Interrompu\",$D71)), 0),\"Non requis\")","v":"Non requis"},{"$f":"IF(INTRO!$E$41=\"Endémique\", IF($J71>1, IF($J71=4, \"Inconnu\", IF($J71=99, \"Surveillance\", E71)), 0),\"Non requis\")","v":0},{"$f":"IF(INTRO!$E$41=\"Endémique\", IF($J71>1, IF($J71=4, \"Inconnu\", IF($J71=99, \"Surveillance\", F71)), 0),\"Non requis\")","v":0},{"$f":"IF(INTRO!$E$41=\"Endémique\", IF($J71>1, IF($J71=4, \"Inconnu\", IF($J71=99, \"Surveillance\", ROUND(D71*INTRO!$E$51,0))), 0),\"Non requis\")","v":0},{"$f":"IF(INTRO!$E$41=\"Endémique\", IF($J71>1, IF($J71=4, \"Inconnu\", IF($J71=99, \"Surveillance\", SUM($N71:$P71))), 0),\"Non requis\")","v":0},57375,148628,259947,{"$f":"IF(INTRO!$E$43=\"Endémique\", IF($K71>1, IF($K71=4, \"Inconnu\", IF($K71=99, \"Surveillance\", SUM($R71:$T71))), 0),\"Non requis\")","v":465950},0,null,0,0,null,"TAS",null,null,null,35383,"Goure"]
[{"$f":"IF(INTRO!$E$33<>0,INTRO!$E$33, \" \")","v":"NIGER"},"Zinder","Tesker",57369.500283556525,{"$f":"IF([1]INTRO!$E$48=\"\",\"\",ROUND($D72*[1]INTRO!$E$48,0))","v":10327},{"$f":"IF([1]INTRO!$E$49=\"\",\"\",ROUND($D72*[1]INTRO!$E$49,0))","v":17211},{"$f":"IF([1]INTRO!$E$50=\"\",\"\",ROUND($D72*[1]INTRO!$E$50,0))","v":28685},99,null,1,0,{"$f":"IF(INTRO!$E$37=\"Endémique\",IF($H72>0,IF($H72=4,\"Inconnu\",IF($H72=99,\"Interrompu\",$D72)),0),\"Non requis\")","v":"Interrompu"},{"$f":"IF(INTRO!$E$39=\"Endémique\", IF($I72>0, IF($I72=4,\"Inconnu\",IF($I72=99,\"Interrompu\",$D72)), 0),\"Non requis\")","v":"Non requis"},{"$f":"IF(INTRO!$E$41=\"Endémique\", IF($J72>1, IF($J72=4, \"Inconnu\", IF($J72=99, \"Surveillance\", E72)), 0),\"Non requis\")","v":0},{"$f":"IF(INTRO!$E$41=\"Endémique\", IF($J72>1, IF($J72=4, \"Inconnu\", IF($J72=99, \"Surveillance\", F72)), 0),\"Non requis\")","v":0},{"$f":"IF(INTRO!$E$41=\"Endémique\", IF($J72>1, IF($J72=4, \"Inconnu\", IF($J72=99, \"Surveillance\", ROUND(D72*INTRO!$E$51,0))), 0),\"Non requis\")","v":0},{"$f":"IF(INTRO!$E$41=\"Endémique\", IF($J72>1, IF($J72=4, \"Inconnu\", IF($J72=99, \"Surveillance\", SUM($N72:$P72))), 0),\"Non requis\")","v":0},0,0,0,{"$f":"IF(INTRO!$E$43=\"Endémique\", IF($K72>1, IF($K72=4, \"Inconnu\", IF($K72=99, \"Surveillance\", SUM($R72:$T72))), 0),\"Non requis\")","v":0},0,null,0,0,null,"TAS",null,null,null,35384,"Tesker"]
[{"$f":"IF(INTRO!$E$33<>0,INTRO!$E$33, \" \")","v":"NIGER"},"Zinder","Magaria",892621.65254558879,{"$f":"IF([1]INTRO!$E$48=\"\",\"\",ROUND($D73*[1]INTRO!$E$48,0))","v":160672},{"$f":"IF([1]INTRO!$E$49=\"\",\"\",ROUND($D73*[1]INTRO!$E$49,0))","v":267786},{"$f":"IF([1]INTRO!$E$50=\"\",\"\",ROUND($D73*[1]INTRO!$E$50,0))","v":446311},99,null,1,2,{"$f":"IF(INTRO!$E$37=\"Endémique\",IF($H73>0,IF($H73=4,\"Inconnu\",IF($H73=99,\"Interrompu\",$D73)),0),\"Non requis\")","v":"Interrompu"},{"$f":"IF(INTRO!$E$39=\"Endémique\", IF($I73>0, IF($I73=4,\"Inconnu\",IF($I73=99,\"Interrompu\",$D73)), 0),\"Non requis\")","v":"Non requis"},{"$f":"IF(INTRO!$E$41=\"Endémique\", IF($J73>1, IF($J73=4, \"Inconnu\", IF($J73=99, \"Surveillance\", E73)), 0),\"Non requis\")","v":0},{"$f":"IF(INTRO!$E$41=\"Endémique\", IF($J73>1, IF($J73=4, \"Inconnu\", IF($J73=99, \"Surveillance\", F73)), 0),\"Non requis\")","v":0},{"$f":"IF(INTRO!$E$41=\"Endémique\", IF($J73>1, IF($J73=4, \"Inconnu\", IF($J73=99, \"Surveillance\", ROUND(D73*INTRO!$E$51,0))), 0),\"Non requis\")","v":0},{"$f":"IF(INTRO!$E$41=\"Endémique\", IF($J73>1, IF($J73=4, \"Inconnu\", IF($J73=99, \"Surveillance\", SUM($N73:$P73))), 0),\"Non requis\")","v":0},102381,265211,463844,{"$f":"IF(INTRO!$E$43=\"Endémique\", IF($K73>1, IF($K73=4, \"Inconnu\", IF($K73=99, \"Surveillance\", SUM($R73:$T73))), 0),\"Non requis\")","v":831436},0,null,0,0,null,"TAS",null,null,null,35385,"Magaria"]
[{"$f":"IF(INTRO!$E$33<>0,INTRO!$E$33, \" \")","v":"NIGER"},"Zinder","Dungass",546729.8544878083,{"$f":"IF([1]INTRO!$E$48=\"\",\"\",ROUND($D74*[1]INTRO!$E$48,0))","v":98411},{"$f":"IF([1]INTRO!$E$49=\"\",\"\",ROUND($D74*[1]INTRO!$E$49,0))","v":164019},{"$f":"IF([1]INTRO!$E$50=\"\",\"\",ROUND($D74*[1]INTRO!$E$50,0))","v":273365},99,null,1,21,{"$f":"IF(INTRO!$E$37=\"Endémique\",IF($H74>0,IF($H74=4,\"Inconnu\",IF($H74=99,\"Interrompu\",$D74)),0),\"Non requis\")","v":"Interrompu"},{"$f":"IF(INTRO!$E$39=\"Endémique\", IF($I74>0, IF($I74=4,\"Inconnu\",IF($I74=99,\"Interrompu\",$D74)), 0),\"Non requis\")","v":"Non requis"},{"$f":"IF(INTRO!$E$41=\"Endémique\", IF($J74>1, IF($J74=4, \"Inconnu\", IF($J74=99, \"Surveillance\", E74)), 0),\"Non requis\")","v":0},{"$f":"IF(INTRO!$E$41=\"Endémique\", IF($J74>1, IF($J74=4, \"Inconnu\", IF($J74=99, \"Surveillance\", F74)), 0),\"Non requis\")","v":0},{"$f":"IF(INTRO!$E$41=\"Endémique\", IF($J74>1, IF($J74=4, \"Inconnu\", IF($J74=99, \"Surveillance\", ROUND(D74*INTRO!$E$51,0))), 0),\"Non requis\")","v":0},{"$f":"IF(INTRO!$E$41=\"Endémique\", IF($J74>1, IF($J74=4, \"Inconnu\", IF($J74=99, \"Surveillance\", SUM($N74:$P74))), 0),\"Non requis\")","v":0},62708,162440,284099,{"$f":"IF(INTRO!$E$43=\"Endémique\", IF($K74>1, IF($K74=4, \"Inconnu\", IF($K74=99, \"Surveillance\", SUM($R74:$T74))), 0),\"Non requis\")","v":509247},0,null,0,0,null,"TAS",null,null,null,35386,"Dungass"]
[{"$f":"IF(INTRO!$E$33<>0,INTRO!$E$33, \" \")","v":"NIGER"},"Zinder","Matamaye",616740.6682293003,{"$f":"IF([1]INTRO!$E$48=\"\",\"\",ROUND($D75*[1]INTRO!$E$48,0))","v":111013},{"$f":"IF([1]INTRO!$E$49=\"\",\"\",ROUND($D75*[1]INTRO!$E$49,0))","v":185022},{"$f":"IF([1]INTRO!$E$50=\"\",\"\",ROUND($D75*[1]INTRO!$E$50,0))","v":308370},99,null,1,21,{"$f":"IF(INTRO!$E$37=\"Endémique\",IF($H75>0,IF($H75=4,\"Inconnu\",IF($H75=99,\"Interrompu\",$D75)),0),\"Non requis\")","v":"Interrompu"},{"$f":"IF(INTRO!$E$39=\"Endémique\", IF($I75>0, IF($I75=4,\"Inconnu\",IF($I75=99,\"Interrompu\",$D75)), 0),\"Non requis\")","v":"Non requis"},{"$f":"IF(INTRO!$E$41=\"Endémique\", IF($J75>1, IF($J75=4, \"Inconnu\", IF($J75=99, \"Surveillance\", E75)), 0),\"Non requis\")","v":0},{"$f":"IF(INTRO!$E$41=\"Endémique\", IF($J75>1, IF($J75=4, \"Inconnu\", IF($J75=99, \"Surveillance\", F75)), 0),\"Non requis\")","v":0},{"$f":"IF(INTRO!$E$41=\"Endémique\", IF($J75>1, IF($J75=4, \"Inconnu\", IF($J75=99, \"Surveillance\", ROUND(D75*INTRO!$E$51,0))), 0),\"Non requis\")","v":0},{"$f":"IF(INTRO!$E$41=\"Endémique\", IF($J75>1, IF($J75=4, \"Inconnu\", IF($J75=99, \"Surveillance\", SUM($N75:$P75))), 0),\"Non requis\")","v":0},69869,180986,316530,{"$f":"IF(INTRO!$E$43=\"Endémique\", IF($K75>1, IF($K75=4, \"Inconnu\", IF($K75=99, \"Surveillance\", SUM($R75:$T75))), 0),\"Non requis\")","v":567385},0,null,0,0,null,"TAS",null,null,null,35333,"Matamaye"]
[{"$f":"IF(INTRO!$E$33<>0,INTRO!$E$33, \" \")","v":"NIGER"},"Zinder","Miriah",784093.61263612658,{"$f":"IF([1]INTRO!$E$48=\"\",\"\",ROUND($D76*[1]INTRO!$E$48,0))","v":141137},{"$f":"IF([1]INTRO!$E$49=\"\",\"\",ROUND($D76*[1]INTRO!$E$49,0))","v":235228},{"$f":"IF([1]INTRO!$E$50=\"\",\"\",ROUND($D76*[1]INTRO!$E$50,0))","v":392047},99,null,99,21,{"$f":"IF(INTRO!$E$37=\"Endémique\",IF($H76>0,IF($H76=4,\"Inconnu\",IF($H76=99,\"Interrompu\",$D76)),0),\"Non requis\")","v":"Interrompu"},{"$f":"IF(INTRO!$E$39=\"Endémique\", IF($I76>0, IF($I76=4,\"Inconnu\",IF($I76=99,\"Interrompu\",$D76)), 0),\"Non requis\")","v":"Non requis"},{"$f":"IF(INTRO!$E$41=\"Endémique\", IF($J76>1, IF($J76=4, \"Inconnu\", IF($J76=99, \"Surveillance\", E76)), 0),\"Non requis\")","v":"Surveillance"},{"$f":"IF(INTRO!$E$41=\"Endémique\", IF($J76>1, IF($J76=4, \"Inconnu\", IF($J76=99, \"Surveillance\", F76)), 0),\"Non requis\")","v":"Surveillance"},{"$f":"IF(INTRO!$E$41=\"Endémique\", IF($J76>1, IF($J76=4, \"Inconnu\", IF($J76=99, \"Surveillance\", ROUND(D76*INTRO!$E$51,0))), 0),\"Non requis\")","v":"Surveillance"},{"$f":"IF(INTRO!$E$41=\"Endémique\", IF($J76>1, IF($J76=4, \"Inconnu\", IF($J76=99, \"Surveillance\", SUM($N76:$P76))), 0),\"Non requis\")","v":"Surveillance"},89164,230980,403973,{"$f":"IF(INTRO!$E$43=\"Endémique\", IF($K76>1, IF($K76=4, \"Inconnu\", IF($K76=99, \"Surveillance\", SUM($R76:$T76))), 0),\"Non requis\")","v":724117},0,null,0,1,null,"TAS",null,null,null,35387,"Mirriah"]
[{"$f":"IF(INTRO!$E$33<>0,INTRO!$E$33, \" \")","v":"NIGER"},"Zinder","Damagaram Takaya",372609.7439913025,{"$f":"IF([1]INTRO!$E$48=\"\",\"\",ROUND($D77*[1]INTRO!$E$48,0))","v":67070},{"$f":"IF([1]INTRO!$E$49=\"\",\"\",ROUND($D77*[1]INTRO!$E$49,0))","v":111783},{"$f":"IF([1]INTRO!$E$50=\"\",\"\",ROUND($D77*[1]INTRO!$E$50,0))","v":186305},99,null,99,31,{"$f":"IF(INTRO!$E$37=\"Endémique\",IF($H77>0,IF($H77=4,\"Inconnu\",IF($H77=99,\"Interrompu\",$D77)),0),\"Non requis\")","v":"Interrompu"},{"$f":"IF(INTRO!$E$39=\"Endémique\", IF($I77>0, IF($I77=4,\"Inconnu\",IF($I77=99,\"Interrompu\",$D77)), 0),\"Non requis\")","v":"Non requis"},{"$f":"IF(INTRO!$E$41=\"Endémique\", IF($J77>1, IF($J77=4, \"Inconnu\", IF($J77=99, \"Surveillance\", E77)), 0),\"Non requis\")","v":"Surveillance"},{"$f":"IF(INTRO!$E$41=\"Endémique\", IF($J77>1, IF($J77=4, \"Inconnu\", IF($J77=99, \"Surveillance\", F77)), 0),\"Non requis\")","v":"Surveillance"},{"$f":"IF(INTRO!$E$41=\"Endémique\", IF($J77>1, IF($J77=4, \"Inconnu\", IF($J77=99, \"Surveillance\", ROUND(D77*INTRO!$E$51,0))), 0),\"Non requis\")","v":"Surveillance"},{"$f":"IF(INTRO!$E$41=\"Endémique\", IF($J77>1, IF($J77=4, \"Inconnu\", IF($J77=99, \"Surveillance\", SUM($N77:$P77))), 0),\"Non requis\")","v":"Surveillance"},42373,109766,191970,{"$f":"IF(INTRO!$E$43=\"Endémique\", IF($K77>1, IF($K77=4, \"Inconnu\", IF($K77=99, \"Surveillance\", SUM($R77:$T77))), 0),\"Non requis\")","v":344109},0,null,0,1,null,"TAS",null,null,null,35388,"Damagaram Takaya"]
[{"$f":"IF(INTRO!$E$33<>0,INTRO!$E$33, \" \")","v":"NIGER"},"Zinder","Takeita",381337.53422888229,{"$f":"IF([1]INTRO!$E$48=\"\",\"\",ROUND($D78*[1]INTRO!$E$48,0))","v":68641},{"$f":"IF([1]INTRO!$E$49=\"\",\"\",ROUND($D78*[1]INTRO!$E$49,0))","v":114401},{"$f":"IF([1]INTRO!$E$50=\"\",\"\",ROUND($D78*[1]INTRO!$E$50,0))","v":190669},99,null,99,31,{"$f":"IF(INTRO!$E$37=\"Endémique\",IF($H78>0,IF($H78=4,\"Inconnu\",IF($H78=99,\"Interrompu\",$D78)),0),\"Non requis\")","v":"Interrompu"},{"$f":"IF(INTRO!$E$39=\"Endémique\", IF($I78>0, IF($I78=4,\"Inconnu\",IF($I78=99,\"Interrompu\",$D78)), 0),\"Non requis\")","v":"Non requis"},{"$f":"IF(INTRO!$E$41=\"Endémique\", IF($J78>1, IF($J78=4, \"Inconnu\", IF($J78=99, \"Surveillance\", E78)), 0),\"Non requis\")","v":"Surveillance"},{"$f":"IF(INTRO!$E$41=\"Endémique\", IF($J78>1, IF($J78=4, \"Inconnu\", IF($J78=99, \"Surveillance\", F78)), 0),\"Non requis\")","v":"Surveillance"},{"$f":"IF(INTRO!$E$41=\"Endémique\", IF($J78>1, IF($J78=4, \"Inconnu\", IF($J78=99, \"Surveillance\", ROUND(D78*INTRO!$E$51,0))), 0),\"Non requis\")","v":"Surveillance"},{"$f":"IF(INTRO!$E$41=\"Endémique\", IF($J78>1, IF($J78=4, \"Inconnu\", IF($J78=99, \"Surveillance\", SUM($N78:$P78))), 0),\"Non requis\")","v":"Surveillance"},43365,112333,196464,{"$f":"IF(INTRO!$E$43=\"Endémique\", IF($K78>1, IF($K78=4, \"Inconnu\", IF($K78=99, \"Surveillance\", SUM($R78:$T78))), 0),\"Non requis\")","v":352162},0,null,0,1,null,"TAS",null,null,null,35389,"Takeita"]
[{"$f":"IF(INTRO!$E$33<>0,INTRO!$E$33, \" \")","v":"NIGER"},"Zinder","Tanout",663043.22543057974,{"$f":"IF([1]INTRO!$E$48=\"\",\"\",ROUND($D79*[1]INTRO!$E$48,0))","v":119348},{"$f":"IF([1]INTRO!$E$49=\"\",\"\",ROUND($D79*[1]INTRO!$E$49,0))","v":198913},{"$f":"IF([1]INTRO!$E$50=\"\",\"\",ROUND($D79*[1]INTRO!$E$50,0))","v":331522},99,null,1,2,{"$f":"IF(INTRO!$E$37=\"Endémique\",IF($H79>0,IF($H79=4,\"Inconnu\",IF($H79=99,\"Interrompu\",$D79)),0),\"Non requis\")","v":"Interrompu"},{"$f":"IF(INTRO!$E$39=\"Endémique\", IF($I79>0, IF($I79=4,\"Inconnu\",IF($I79=99,\"Interrompu\",$D79)), 0),\"Non requis\")","v":"Non requis"},{"$f":"IF(INTRO!$E$41=\"Endémique\", IF($J79>1, IF($J79=4, \"Inconnu\", IF($J79=99, \"Surveillance\", E79)), 0),\"Non requis\")","v":0},{"$f":"IF(INTRO!$E$41=\"Endémique\", IF($J79>1, IF($J79=4, \"Inconnu\", IF($J79=99, \"Surveillance\", F79)), 0),\"Non requis\")","v":0},{"$f":"IF(INTRO!$E$41=\"Endémique\", IF($J79>1, IF($J79=4, \"Inconnu\", IF($J79=99, \"Surveillance\", ROUND(D79*INTRO!$E$51,0))), 0),\"Non requis\")","v":0},{"$f":"IF(INTRO!$E$41=\"Endémique\", IF($J79>1, IF($J79=4, \"Inconnu\", IF($J79=99, \"Surveillance\", SUM($N79:$P79))), 0),\"Non requis\")","v":0},74968,194201,339644,{"$f":"IF(INTRO!$E$43=\"Endémique\", IF($K79>1, IF($K79=4, \"Inconnu\", IF($K79=99, \"Surveillance\", SUM($R79:$T79))), 0),\"Non requis\")","v":608813},0,null,0,0,null,"TAS",null,null,null,35390,"Tanout"]
[{"$f":"IF(INTRO!$E$33<>0,INTRO!$E$33, \" \")","v":"NIGER"},"Zinder","Belbéji",149019.79536113309,{"$f":"IF([1]INTRO!$E$48=\"\",\"\",ROUND($D80*[1]INTRO!$E$48,0))","v":26824},{"$f":"IF([1]INTRO!$E$49=\"\",\"\",ROUND($D80*[1]INTRO!$E$49,0))","v":44706},{"$f":"IF([1]INTRO!$E$50=\"\",\"\",ROUND($D80*[1]INTRO!$E$50,0))","v":74510},99,null,1,2,{"$f":"IF(INTRO!$E$37=\"Endémique\",IF($H80>0,IF($H80=4,\"Inconnu\",IF($H80=99,\"Interrompu\",$D80)),0),\"Non requis\")","v":"Interrompu"},{"$f":"IF(INTRO!$E$39=\"Endémique\", IF($I80>0, IF($I80=4,\"Inconnu\",IF($I80=99,\"Interrompu\",$D80)), 0),\"Non requis\")","v":"Non requis"},{"$f":"IF(INTRO!$E$41=\"Endémique\", IF($J80>1, IF($J80=4, \"Inconnu\", IF($J80=99, \"Surveillance\", E80)), 0),\"Non requis\")","v":0},{"$f":"IF(INTRO!$E$41=\"Endémique\", IF($J80>1, IF($J80=4, \"Inconnu\", IF($J80=99, \"Surveillance\", F80)), 0),\"Non requis\")","v":0},{"$f":"IF(INTRO!$E$41=\"Endémique\", IF($J80>1, IF($J80=4, \"Inconnu\", IF($J80=99, \"Surveillance\", ROUND(D80*INTRO!$E$51,0))), 0),\"Non requis\")","v":0},{"$f":"IF(INTRO!$E$41=\"Endémique\", IF($J80>1, IF($J80=4, \"Inconnu\", IF($J80=99, \"Surveillance\", SUM($N80:$P80))), 0),\"Non requis\")","v":0},16849,43646,76336,{"$f":"IF(INTRO!$E$43=\"Endémique\", IF($K80>1, IF($K80=4, \"Inconnu\", IF($K80=99, \"Surveillance\", SUM($R80:$T80))), 0),\"Non requis\")","v":136831},0,null,0,0,null,"TAS",null,null,null,35391,"Belbéji"]
[{"$f":"IF(INTRO!$E$33<>0,INTRO!$E$33, \" \")","v":"NIGER"},"Zinder","Zinder",498939.44775585283,{"$f":"IF([1]INTRO!$E$48=\"\",\"\",ROUND($D81*[1]INTRO!$E$48,0))","v":89809},{"$f":"IF([1]INTRO!$E$49=\"\",\"\",ROUND($D81*[1]INTRO!$E$49,0))","v":149682},{"$f":"IF([1]INTRO!$E$50=\"\",\"\",ROUND($D81*[1]INTRO!$E$50,0))","v":249470},99,null,22,0,{"$f":"IF(INTRO!$E$37=\"Endémique\",IF($H81>0,IF($H81=4,\"Inconnu\",IF($H81=99,\"Interrompu\",$D81)),0),\"Non requis\")","v":"Interrompu"},{"$f":"IF(INTRO!$E$39=\"Endémique\", IF($I81>0, IF($I81=4,\"Inconnu\",IF($I81=99,\"Interrompu\",$D81)), 0),\"Non requis\")","v":"Non requis"},{"$f":"IF(INTRO!$E$41=\"Endémique\", IF($J81>1, IF($J81=4, \"Inconnu\", IF($J81=99, \"Surveillance\", E81)), 0),\"Non requis\")","v":89809},{"$f":"IF(INTRO!$E$41=\"Endémique\", IF($J81>1, IF($J81=4, \"Inconnu\", IF($J81=99, \"Surveillance\", F81)), 0),\"Non requis\")","v":149682},{"$f":"IF(INTRO!$E$41=\"Endémique\", IF($J81>1, IF($J81=4, \"Inconnu\", IF($J81=99, \"Surveillance\", ROUND(D81*INTRO!$E$51,0))), 0),\"Non requis\")","v":104378},{"$f":"IF(INTRO!$E$41=\"Endémique\", IF($J81>1, IF($J81=4, \"Inconnu\", IF($J81=99, \"Surveillance\", SUM($N81:$P81))), 0),\"Non requis\")","v":343869},53628,138916,242955,{"$f":"IF(INTRO!$E$43=\"Endémique\", IF($K81>1, IF($K81=4, \"Inconnu\", IF($K81=99, \"Surveillance\", SUM($R81:$T81))), 0),\"Non requis\")","v":0},0,null,0,0,null,"TAS",null,null,null,35336,"Zinder"]

{"sheet":"DEC","index":2,"n_rows":81,"n_cols":12,"rows_kept":81,"cut":false,"hidden":true,"merged":[[3,0,3,2],[5,0,5,2],[6,5,7,5],[6,2,7,2],[6,1,7,1],[6,10,7,10],[6,0,7,0],[6,11,7,11],[5,3,5,6],[5,9,5,11],[6,4,7,4],[6,3,7,3],[6,8,7,8],[6,7,7,7],[6,6,7,6],[6,9,7,9]]}
["Diethylcarbamazine (DEC)"]
["Structure administrative, population ciblée par groupe d'âge, plan de traitement et information sur les comprimés"]
[]
["TOTAL",null,null,{"$f":"SUBTOTAL(9,D$10:D$1010)","v":0},0,0,0,null,{"$f":"SUBTOTAL(9,I$10:I$1010)","v":0},0,0,0]
[]
["Structure administrative du pays",null,null,"Population nécessitant un traitement avec DEC",null,null,null,"Plan de traitement","Population cible","Diethylcarbamazine (DEC)"]
["Pays","Région/Département","District","EAPréS","EAS","Adultes","Total","FL","FL","Total requis","Reste en stock","Comprimés devant être fournis"]
[]
[]
[{"$f":"IF(INTRO!$E$39<>\"Non endémique\", \" \", IF(INTRO!$E$37=\"Non endémique\",\" \", IF(COUNTRY_INFO!A10=0,\" \",COUNTRY_INFO!A10)))","v":" "},{"$f":"IF(INTRO!$E$39<>\"Non endémique\", \" \", IF(INTRO!$E$37=\"Non endémique\",\" \", IF(COUNTRY_INFO!B10=0,\" \",COUNTRY_INFO!B10)))","v":" "},{"$f":"IF(INTRO!$E$39<>\"Non endémique\", \" \", IF(INTRO!$E$37=\"Non endémique\",\" \", IF(COUNTRY_INFO!C10=0,\" \",COUNTRY_INFO!C10)))","v":" "},{"$f":"IF(INTRO!$E$39<>\"Non endémique\", 0, IF(INTRO!$E$37=\"Non endémique\",0,IF(COUNTRY_INFO!$H10=1,COUNTRY_INFO!E10,0)))","v":0},{"$f":"IF(INTRO!$E$39<>\"Non endémique\", 0, IF(INTRO!$E$37=\"Non endémique\",0,IF(COUNTRY_INFO!$H10=1,COUNTRY_INFO!F10,0)))","v":0},{"$f":"IF(INTRO!$E$39<>\"Non endémique\", 0, IF(INTRO!$E$37=\"Non endémique\",0,IF(COUNTRY_INFO!$H10=1,COUNTRY_INFO!G10,0)))","v":0},{"$f":"SUM(D10:F10)","v":0},{"$f":"IF(INTRO!$E$39=\"Non endémique\",IF(INTRO!$E$37=\"Non endémique\",\"Non requis\",COUNTRY_INFO!V10),\"Traiter avec IVM\")","v":"Traiter avec IVM"},{"$f":"IF(H10=1,G10,0)","v":0},{"$f":"IF(I10>0,I10*2.5,0)","v":0},null,{"$f":"IF($J10>$K10,$J10-$K10,0)","v":0}]
[{"$f":"IF(INTRO!$E$39<>\"Non endémique\", \" \", IF(INTRO!$E$37=\"Non endémique\",\" \", IF(COUNTRY_INFO!A11=0,\" \",COUNTRY_INFO!A11)))","v":" "},{"$f":"IF(INTRO!$E$39<>\"Non endémique\", \" \", IF(INTRO!$E$37=\"Non endémique\",\" \", IF(COUNTRY_INFO!B11=0,\" \",COUNTRY_INFO!B11)))","v":" "},{"$f":"IF(INTRO!$E$39<>\"Non endémique\", \" \", IF(INTRO!$E$37=\"Non endémique\",\" \", IF(COUNTRY_INFO!C11=0,\" \",COUNTRY_INFO!C11)))","v":" "},{"$f":"IF(INTRO!$E$39<>\"Non endémique\", 0, IF(INTRO!$E$37=\"Non endémique\",0,IF(COUNTRY_INFO!$H11=1,COUNTRY_INFO!E11,0)))","v":0},{"$f":"IF(INTRO!$E$39<>\"Non endémique\", 0, IF(INTRO!$E$37=\"Non endémique\",0,IF(COUNTRY_INFO!$H11=1,COUNTRY_INFO!F11,0)))","v":0},{"$f":"IF(INTRO!$E$39<>\"Non endémique\", 0, IF(INTRO!$E$37=\"Non endémique\",0,IF(COUNTRY_INFO!$H11=1,COUNTRY_INFO!G11,0)))","v":0},{"$f":"SUM(D11:F11)","v":0},{"$f":"IF(INTRO!$E$39=\"Non endémique\",IF(INTRO!$E$37=\"Non endémique\",\"Non requis\",COUNTRY_INFO!V11),\"Traiter avec IVM\")","v":"Traiter avec IVM"},{"$f":"IF(H11=1,G11,0)","v":0},{"$f":"IF(I11>0,I11*2.5,0)","v":0},null,0]
[{"$f":"IF(INTRO!$E$39<>\"Non endémique\", \" \", IF(INTRO!$E$37=\"Non endémique\",\" \", IF(COUNTRY_INFO!A12=0,\" \",COUNTRY_INFO!A12)))","v":" "},{"$f":"IF(INTRO!$E$39<>\"Non endémique\", \" \", IF(INTRO!$E$37=\"Non endémique\",\" \", IF(COUNTRY_INFO!B12=0,\" \",COUNTRY_INFO!B12)))","v":" "},{"$f":"IF(INTRO!$E$39<>\"Non endémique\", \" \", IF(INTRO!$E$37=\"Non endémique\",\" \", IF(COUNTRY_INFO!C12=0,\" \",COUNTRY_INFO!C12)))","v":" "},{"$f":"IF(INTRO!$E$39<>\"Non endémique\", 0, IF(INTRO!$E$37=\"Non endémique\",0,IF(COUNTRY_INFO!$H12=1,COUNTRY_INFO!E12,0)))","v":0},{"$f":"IF(INTRO!$E$39<>\"Non endémique\", 0, IF(INTRO!$E$37=\"Non endémique\",0,IF(COUNTRY_INFO!$H12=1,COUNTRY_INFO!F12,0)))","v":0},{"$f":"IF(INTRO!$E$39<>\"Non endémique\", 0, IF(INTRO!$E$37=\"Non endémique\",0,IF(COUNTRY_INFO!$H12=1,COUNTRY_INFO!G12,0)))","v":0},0,{"$f":"IF(INTRO!$E$39=\"Non endémique\",IF(INTRO!$E$37=\"Non endémique\",\"Non requis\",COUNTRY_INFO!V12),\"Traiter avec IVM\")","v":"Traiter avec IVM"},0,0,null,0]
[{"$f":"IF(INTRO!$E$39<>\"Non endémique\", \" \", IF(INTRO!$E$37=\"Non endémique\",\" \", IF(COUNTRY_INFO!A13=0,\" \",COUNTRY_INFO!A13)))","v":" "},{"$f":"IF(INTRO!$E$39<>\"Non endémique\", \" \", IF(INTRO!$E$37=\"Non endémique\",\" \", IF(COUNTRY_INFO!B13=0,\" \",COUNTRY_INFO!B13)))","v":" "},{"$f":"IF(INTRO!$E$39<>\"Non endémique\", \" \", IF(INTRO!$E$37=\"Non endémique\",\" \", IF(COUNTRY_INFO!C13=0,\" \",COUNTRY_INFO!C13)))","v":" "},{"$f":"IF(INTRO!$E$39<>\"Non endémique\", 0, IF(INTRO!$E$37=\"Non endémique\",0,IF(COUNTRY_INFO!$H13=1,COUNTRY_INFO!E13,0)))","v":0},{"$f":"IF(INTRO!$E$39<>\"Non endémique\", 0, IF(INTRO!$E$37=\"Non endémique\",0,IF(COUNTRY_INFO!$H13=1,COUNTRY_INFO!F13,0)))","v":0},{"$f":"IF(INTRO!$E$39<>\"Non endémique\", 0, IF(INTRO!$E$37=\"Non endémique\",0,IF(COUNTRY_INFO!$H13=1,COUNTRY_INFO!G13,0)))","v":0},0,{"$f":"IF(INTRO!$E$39=\"Non endémique\",IF(INTRO!$E$37=\"Non endémique\",\"Non requis\",COUNTRY_INFO!V13),\"Traiter avec IVM\")","v":"Traiter avec IVM"},0,0,null,0]
[{"$f":"IF(INTRO!$E$39<>\"Non endémique\", \" \", IF(INTRO!$E$37=\"Non endémique\",\" \", IF(COUNTRY_INFO!A14=0,\" \",COUNTRY_INFO!A14)))","v":" "},{"$f":"IF(INTRO!$E$39<>\"Non endémique\", \" \", IF(INTRO!$E$37=\"Non endémique\",\" \", IF(COUNTRY_INFO!B14=0,\" \",COUNTRY_INFO!B14)))","v":" "},{"$f":"IF(INTRO!$E$39<>\"Non endémique\", \" \", IF(INTRO!$E$37=\"Non endémique\",\" \", IF(COUNTRY_INFO!C14=0,\" \",COUNTRY_INFO!C14)))","v":" "},{"$f":"IF(INTRO!$E$39<>\"Non endémique\", 0, IF(INTRO!$E$37=\"Non endémique\",0,IF(COUNTRY_INFO!$H14=1,COUNTRY_INFO!E14,0)))","v":0},{"$f":"IF(INTRO!$E$39<>\"Non endémique\", 0, IF(INTRO!$E$37=\"Non endémique\",0,IF(COUNTRY_INFO!$H14=1,COUNTRY_INFO!F14,0)))","v":0},{"$f":"IF(INTRO!$E$39<>\"Non endémique\", 0, IF(INTRO!$E$37=\"Non endémique\",0,IF(COUNTRY_INFO!$H14=1,COUNTRY_INFO!G14,0)))","v":0},0,{"$f":"IF(INTRO!$E$39=\"Non endémique\",IF(INTRO!$E$37=\"Non endémique\",\"Non requis\",COUNTRY_INFO!V14),\"Traiter avec IVM\")","v":"Traiter avec IVM"},0,0,null,0]
[{"$f":"IF(INTRO!$E$39<>\"Non endémique\", \" \", IF(INTRO!$E$37=\"Non endémique\",\" \", IF(COUNTRY_INFO!A15=0,\" \",COUNTRY_INFO!A15)))","v":" "},{"$f":"IF(INTRO!$E$39<>\"Non endémique\", \" \", IF(INTRO!$E$37=\"Non endémique\",\" \", IF(COUNTRY_INFO!B15=0,\" \",COUNTRY_INFO!B15)))","v":" "},{"$f":"IF(INTRO!$E$39<>\"Non endémique\", \" \", IF(INTRO!$E$37=\"Non endémique\",\" \", IF(COUNTRY_INFO!C15=0,\" \",COUNTRY_INFO!C15)))","v":" "},{"$f":"IF(INTRO!$E$39<>\"Non endémique\", 0, IF(INTRO!$E$37=\"Non endémique\",0,IF(COUNTRY_INFO!$H15=1,COUNTRY_INFO!E15,0)))","v":0},{"$f":"IF(INTRO!$E$39<>\"Non endémique\", 0, IF(INTRO!$E$37=\"Non endémique\",0,IF(COUNTRY_INFO!$H15=1,COUNTRY_INFO!F15,0)))","v":0},{"$f":"IF(INTRO!$E$39<>\"Non endémique\", 0, IF(INTRO!$E$37=\"Non endémique\",0,IF(COUNTRY_INFO!$H15=1,COUNTRY_INFO!G15,0)))","v":0},0,{"$f":"IF(INTRO!$E$39=\"Non endémique\",IF(INTRO!$E$37=\"Non endémique\",\"Non requis\",COUNTRY_INFO!V15),\"Traiter avec IVM\")","v":"Traiter avec IVM"},0,0,null,0]
[{"$f":"IF(INTRO!$E$39<>\"Non endémique\", \" \", IF(INTRO!$E$37=\"Non endémique\",\" \", IF(COUNTRY_INFO!A16=0,\" \",COUNTRY_INFO!A16)))","v":" "},{"$f":"IF(INTRO!$E$39<>\"Non endémique\", \" \", IF(INTRO!$E$37=\"Non endémique\",\" \", IF(COUNTRY_INFO!B16=0,\" \",COUNTRY_INFO!B16)))","v":" "},{"$f":"IF(INTRO!$E$39<>\"Non endémique\", \" \", IF(INTRO!$E$37=\"Non endémique\",\" \", IF(COUNTRY_INFO!C16=0,\" \",COUNTRY_INFO!C16)))","v":" "},{"$f":"IF(INTRO!$E$39<>\"Non endémique\", 0, IF(INTRO!$E$37=\"Non endémique\",0,IF(COUNTRY_INFO!$H16=1,COUNTRY_INFO!E16,0)))","v":0},{"$f":"IF(INTRO!$E$39<>\"Non endémique\", 0, IF(INTRO!$E$37=\"Non endémique\",0,IF(COUNTRY_INFO!$H16=1,COUNTRY_INFO!F16,0)))","v":0},{"$f":"IF(INTRO!$E$39<>\"Non endémique\", 0, IF(INTRO!$E$37=\"Non endémique\",0,IF(COUNTRY_INFO!$H16=1,COUNTRY_INFO!G16,0)))","v":0},0,{"$f":"IF(INTRO!$E$39=\"Non endémique\",IF(INTRO!$E$37=\"Non endémique\",\"Non requis\",COUNTRY_INFO!V16),\"Traiter avec IVM\")","v":"Traiter avec IVM"},0,0,null,0]
[{"$f":"IF(INTRO!$E$39<>\"Non endémique\", \" \", IF(INTRO!$E$37=\"Non endémique\",\" \", IF(COUNTRY_INFO!A17=0,\" \",COUNTRY_INFO!A17)))","v":" "},{"$f":"IF(INTRO!$E$39<>\"Non endémique\", \" \", IF(INTRO!$E$37=\"Non endémique\",\" \", IF(COUNTRY_INFO!B17=0,\" \",COUNTRY_INFO!B17)))","v":" "},{"$f":"IF(INTRO!$E$39<>\"Non endémique\", \" \", IF(INTRO!$E$37=\"Non endémique\",\" \", IF(COUNTRY_INFO!C17=0,\" \",COUNTRY_INFO!C17)))","v":" "},{"$f":"IF(INTRO!$E$39<>\"Non endémique\", 0, IF(INTRO!$E$37=\"Non endémique\",0,IF(COUNTRY_INFO!$H17=1,COUNTRY_INFO!E17,0)))","v":0},{"$f":"IF(INTRO!$E$39<>\"Non endémique\", 0, IF(INTRO!$E$37=\"Non endémique\",0,IF(COUNTRY_INFO!$H17=1,COUNTRY_INFO!F17,0)))","v":0},{"$f":"IF(INTRO!$E$39<>\"Non endémique\", 0, IF(INTRO!$E$37=\"Non endémique\",0,IF(COUNTRY_INFO!$H17=1,COUNTRY_INFO!G17,0)))","v":0},0,{"$f":"IF(INTRO!$E$39=\"Non endémique\",IF(INTRO!$E$37=\"Non endémique\",\"Non requis\",COUNTRY_INFO!V17),\"Traiter avec IVM\")","v":"Traiter avec IVM"},0,0,null,0]
[{"$f":"IF(INTRO!$E$39<>\"Non endémique\", \" \", IF(INTRO!$E$37=\"Non endémique\",\" \", IF(COUNTRY_INFO!A18=0,\" \",COUNTRY_INFO!A18)))","v":" "},{"$f":"IF(INTRO!$E$39<>\"Non endémique\", \" \", IF(INTRO!$E$37=\"Non endémique\",\" \", IF(COUNTRY_INFO!B18=0,\" \",COUNTRY_INFO!B18)))","v":" "},{"$f":"IF(INTRO!$E$39<>\"Non endémique\", \" \", IF(INTRO!$E$37=\"Non endémique\",\" \", IF(COUNTRY_INFO!C18=0,\" \",COUNTRY_INFO!C18)))","v":" "},{"$f":"IF(INTRO!$E$39<>\"Non endémique\", 0, IF(INTRO!$E$37=\"Non endémique\",0,IF(COUNTRY_INFO!$H18=1,COUNTRY_INFO!E18,0)))","v":0},{"$f":"IF(INTRO!$E$39<>\"Non endémique\", 0, IF(INTRO!$E$37=\"Non endémique\",0,IF(COUNTRY_INFO!$H18=1,COUNTRY_INFO!F18,0)))","v":0},{"$f":"IF(INTRO!$E$39<>\"Non endémique\", 0, IF(INTRO!$E$37=\"Non endémique\",0,IF(COUNTRY_INFO!$H18=1,COUNTRY_INFO!G18,0)))","v":0},0,{"$f":"IF(INTRO!$E$39=\"Non endémique\",IF(INTRO!$E$37=\"Non endémique\",\"Non requis\",COUNTRY_INFO!V18),\"Traiter avec IVM\")","v":"Traiter avec IVM"},0,0,null,0]
[{"$f":"IF(INTRO!$E$39<>\"Non endémique\", \" \", IF(INTRO!$E$37=\"Non endémique\",\" \", IF(COUNTRY_INFO!A19=0,\" \",COUNTRY_INFO!A19)))","v":" "},{"$f":"IF(INTRO!$E$39<>\"Non endémique\", \" \", IF(INTRO!$E$37=\"Non endémique\",\" \", IF(COUNTRY_INFO!B19=0,\" \",COUNTRY_INFO!B19)))","v":" "},{"$f":"IF(INTRO!$E$39<>\"Non endémique\", \" \", IF(INTRO!$E$37=\"Non endémique\",\" \", IF(COUNTRY_INFO!C19=0,\" \",COUNTRY_INFO!C19)))","v":" "},{"$f":"IF(INTRO!$E$39<>\"Non endémique\", 0, IF(INTRO!$E$37=\"Non endémique\",0,IF(COUNTRY_INFO!$H19=1,COUNTRY_INFO!E19,0)))","v":0},{"$f":"IF(INTRO!$E$39<>\"Non endémique\", 0, IF(INTRO!$E$37=\"Non endémique\",0,IF(COUNTRY_INFO!$H19=1,COUNTRY_INFO!F19,0)))","v":0},{"$f":"IF(INTRO!$E$39<>\"Non endémique\", 0, IF(INTRO!$E$37=\"Non endémique\",0,IF(COUNTRY_INFO!$H19=1,COUNTRY_INFO!G19,0)))","v":0},0,{"$f":"IF(INTRO!$E$39=\"Non endémique\",IF(INTRO!$E$37=\"Non endémique\",\"Non requis\",COUNTRY_INFO!V19),\"Traiter avec IVM\")","v":"Traiter avec IVM"},0,0,null,0]
[{"$f":"IF(INTRO!$E$39<>\"Non endémique\", \" \", IF(INTRO!$E$37=\"Non endémique\",\" \", IF(COUNTRY_INFO!A20=0,\" \",COUNTRY_INFO!A20)))","v":" "},{"$f":"IF(INTRO!$E$39<>\"Non endémique\", \" \", IF(INTRO!$E$37=\"Non endémique\",\" \", IF(COUNTRY_INFO!B20=0,\" \",COUNTRY_INFO!B20)))","v":" "},{"$f":"IF(INTRO!$E$39<>\"Non endémique\", \" \", IF(INTRO!$E$37=\"Non endémique\",\" \", IF(COUNTRY_INFO!C20=0,\" \",COUNTRY_INFO!C20)))","v":" "},{"$f":"IF(INTRO!$E$39<>\"Non endémique\", 0, IF(INTRO!$E$37=\"Non endémique\",0,IF(COUNTRY_INFO!$H20=1,COUNTRY_INFO!E20,0)))","v":0},{"$f":"IF(INTRO!$E$39<>\"Non endémique\", 0, IF(INTRO!$E$37=\"Non endémique\",0,IF(COUNTRY_INFO!$H20=1,COUNTRY_INFO!F20,0)))","v":0},{"$f":"IF(INTRO!$E$39<>\"Non endémique\", 0, IF(INTRO!$E$37=\"Non endémique\",0,IF(COUNTRY_INFO!$H20=1,COUNTRY_INFO!G20,0)))","v":0},0,{"$f":"IF(INTRO!$E$39=\"Non endémique\",IF(INTRO!$E$37=\"Non endémique\",\"Non requis\",COUNTRY_INFO!V20),\"Traiter avec IVM\")","v":"Traiter avec IVM"},0,0,null,0]
[{"$f":"IF(INTRO!$E$39<>\"Non endémique\", \" \", IF(INTRO!$E$37=\"Non endémique\",\" \", IF(COUNTRY_INFO!A21=0,\" \",COUNTRY_INFO!A21)))","v":" "},{"$f":"IF(INTRO!$E$39<>\"Non endémique\", \" \", IF(INTRO!$E$37=\"Non endémique\",\" \", IF(COUNTRY_INFO!B21=0,\" \",COUNTRY_INFO!B21)))","v":" "},{"$f":"IF(INTRO!$E$39<>\"Non endémique\", \" \", IF(INTRO!$E$37=\"Non endémique\",\" \", IF(COUNTRY_INFO!C21=0,\" \",COUNTRY_INFO!C21)))","v":" "},{"$f":"IF(INTRO!$E$39<>\"Non endémique\", 0, IF(INTRO!$E$37=\"Non endémique\",0,IF(COUNTRY_INFO!$H21=1,COUNTRY_INFO!E21,0)))","v":0},{"$f":"IF(INTRO!$E$39<>\"Non endémique\", 0, IF(INTRO!$E$37=\"Non endémique\",0,IF(COUNTRY_INFO!$H21=1,COUNTRY_INFO!F21,0)))","v":0},{"$f":"IF(INTRO!$E$39<>\"Non endémique\", 0, IF(INTRO!$E$37=\"Non endémique\",0,IF(COUNTRY_INFO!$H21=1,COUNTRY_INFO!G21,0)))","v":0},0,{"$f":"IF(INTRO!$E$39=\"Non endémique\",IF(INTRO!$E$37=\"Non endémique\",\"Non requis\",COUNTRY_INFO!V21),\"Traiter avec IVM\")","v":"Traiter avec IVM"},0,0,null,0]
[{"$f":"IF(INTRO!$E$39<>\"Non endémique\", \" \", IF(INTRO!$E$37=\"Non endémique\",\" \", IF(COUNTRY_INFO!A22=0,\" \",COUNTRY_INFO!A22)))","v":" "},{"$f":"IF(INTRO!$E$39<>\"Non endémique\", \" \", IF(INTRO!$E$37=\"Non endémique\",\" \", IF(COUNTRY_INFO!B22=0,\" \",COUNTRY_INFO!B22)))","v":" "},{"$f":"IF(INTRO!$E$39<>\"Non endémique\", \" \", IF(INTRO!$E$37=\"Non endémique\",\" \", IF(COUNTRY_INFO!C22=0,\" \",COUNTRY_INFO!C22)))","v":" "},{"$f":"IF(INTRO!$E$39<>\"Non endémique\", 0, IF(INTRO!$E$37=\"Non endémique\",0,IF(COUNTRY_INFO!$H22=1,COUNTRY_INFO!E22,0)))","v":0},{"$f":"IF(INTRO!$E$39<>\"Non endémique\", 0, IF(INTRO!$E$37=\"Non endémique\",0,IF(COUNTRY_INFO!$H22=1,COUNTRY_INFO!F22,0)))","v":0},{"$f":"IF(INTRO!$E$39<>\"Non endémique\", 0, IF(INTRO!$E$37=\"Non endémique\",0,IF(COUNTRY_INFO!$H22=1,COUNTRY_INFO!G22,0)))","v":0},0,{"$f":"IF(INTRO!$E$39=\"Non endémique\",IF(INTRO!$E$37=\"Non endémique\",\"Non requis\",COUNTRY_INFO!V22),\"Traiter avec IVM\")","v":"Traiter avec IVM"},0,0,null,0]
[{"$f":"IF(INTRO!$E$39<>\"Non endémique\", \" \", IF(INTRO!$E$37=\"Non endémique\",\" \", IF(COUNTRY_INFO!A23=0,\" \",COUNTRY_INFO!A23)))","v":" "},{"$f":"IF(INTRO!$E$39<>\"Non endémique\", \" \", IF(INTRO!$E$37=\"Non endémique\",\" \", IF(COUNTRY_INFO!B23=0,\" \",COUNTRY_INFO!B23)))","v":" "},{"$f":"IF(INTRO!$E$39<>\"Non endémique\", \" \", IF(INTRO!$E$37=\"Non endémique\",\" \", IF(COUNTRY_INFO!C23=0,\" \",COUNTRY_INFO!C23)))","v":" "},{"$f":"IF(INTRO!$E$39<>\"Non endémique\", 0, IF(INTRO!$E$37=\"Non endémique\",0,IF(COUNTRY_INFO!$H23=1,COUNTRY_INFO!E23,0)))","v":0},{"$f":"IF(INTRO!$E$39<>\"Non endémique\", 0, IF(INTRO!$E$37=\"Non endémique\",0,IF(COUNTRY_INFO!$H23=1,COUNTRY_INFO!F23,0)))","v":0},{"$f":"IF(INTRO!$E$39<>\"Non endémique\", 0, IF(INTRO!$E$37=\"Non endémique\",0,IF(COUNTRY_INFO!$H23=1,COUNTRY_INFO!G23,0)))","v":0},0,{"$f":"IF(INTRO!$E$39=\"Non endémique\",IF(INTRO!$E$37=\"Non endémique\",\"Non requis\",COUNTRY_INFO!V23),\"Traiter avec IVM\")","v":"Traiter avec IVM"},0,0,null,0]
[{"$f":"IF(INTRO!$E$39<>\"Non endémique\", \" \", IF(INTRO!$E$37=\"Non endémique\",\" \", IF(COUNTRY_INFO!A24=0,\" \",COUNTRY_INFO!A24)))","v":" "},{"$f":"IF(INTRO!$E$39<>\"Non endémique\", \" \", IF(INTRO!$E$37=\"Non endémique\",\" \", IF(COUNTRY_INFO!B24=0,\" \",COUNTRY_INFO!B24)))","v":" "},{"$f":"IF(INTRO!$E$39<>\"Non endémique\", \" \", IF(INTRO!$E$37=\"Non endémique\",\" \", IF(COUNTRY_INFO!C24=0,\" \",COUNTRY_INFO!C24)))","v":" "},{"$f":"IF(INTRO!$E$39<>\"Non endémique\", 0, IF(INTRO!$E$37=\"Non endémique\",0,IF(COUNTRY_INFO!$H24=1,COUNTRY_INFO!E24,0)))","v":0},{"$f":"IF(INTRO!$E$39<>\"Non endémique\", 0, IF(INTRO!$E$37=\"Non endémique\",0,IF(COUNTRY_INFO!$H24=1,COUNTRY_INFO!F24,0)))","v":0},{"$f":"IF(INTRO!$E$39<>\"Non endémique\", 0, IF(INTRO!$E$37=\"Non endémique\",0,IF(COUNTRY_INFO!$H24=1,COUNTRY_INFO!G24,0)))","v":0},0,{"$f":"IF(INTRO!$E$39=\"Non endémique\",IF(INTRO!$E$37=\"Non endémique\",\"Non requis\",COUNTRY_INFO!V24),\"Traiter avec IVM\")","v":"Traiter avec IVM"},0,0,null,0]
[{"$f":"IF(INTRO!$E$39<>\"Non endémique\", \" \", IF(INTRO!$E$37=\"Non endémique\",\" \", IF(COUNTRY_INFO!A25=0,\" \",COUNTRY_INFO!A25)))","v":" "},{"$f":"IF(INTRO!$E$39<>\"Non endémique\", \" \", IF(INTRO!$E$37=\"Non endémique\",\" \", IF(COUNTRY_INFO!B25=0,\" \",COUNTRY_INFO!B25)))","v":" "},{"$f":"IF(INTRO!$E$39<>\"Non endémique\", \" \", IF(INTRO!$E$37=\"Non endémique\",\" \", IF(COUNTRY_INFO!C25=0,\" \",COUNTRY_INFO!C25)))","v":" "},{"$f":"IF(INTRO!$E$39<>\"Non endémique\", 0, IF(INTRO!$E$37=\"Non endémique\",0,IF(COUNTRY_INFO!$H25=1,COUNTRY_INFO!E25,0)))","v":0},{"$f":"IF(INTRO!$E$39<>\"Non endémique\", 0, IF(INTRO!$E$37=\"Non endémique\",0,IF(COUNTRY_INFO!$H25=1,COUNTRY_INFO!F25,0)))","v":0},{"$f":"IF(INTRO!$E$39<>\"Non endémique\", 0, IF(INTRO!$E$37=\"Non endémique\",0,IF(COUNTRY_INFO!$H25=1,COUNTRY_INFO!G25,0)))","v":0},0,{"$f":"IF(INTRO!$E$39=\"Non endémique\",IF(INTRO!$E$37=\"Non endémique\",\"Non requis\",COUNTRY_INFO!V25),\"Traiter avec IVM\")","v":"Traiter avec IVM"},0,0,null,0]
[{"$f":"IF(INTRO!$E$39<>\"Non endémique\", \" \", IF(INTRO!$E$37=\"Non endémique\",\" \", IF(COUNTRY_INFO!A26=0,\" \",COUNTRY_INFO!A26)))","v":" "},{"$f":"IF(INTRO!$E$39<>\"Non endémique\", \" \", IF(INTRO!$E$37=\"Non endémique\",\" \", IF(COUNTRY_INFO!B26=0,\" \",COUNTRY_INFO!B26)))","v":" "},{"$f":"IF(INTRO!$E$39<>\"Non endémique\", \" \", IF(INTRO!$E$37=\"Non endémique\",\" \", IF(COUNTRY_INFO!C26=0,\" \",COUNTRY_INFO!C26)))","v":" "},{"$f":"IF(INTRO!$E$39<>\"Non endémique\", 0, IF(INTRO!$E$37=\"Non endémique\",0,IF(COUNTRY_INFO!$H26=1,COUNTRY_INFO!E26,0)))","v":0},{"$f":"IF(INTRO!$E$39<>\"Non endémique\", 0, IF(INTRO!$E$37=\"Non endémique\",0,IF(COUNTRY_INFO!$H26=1,COUNTRY_INFO!F26,0)))","v":0},{"$f":"IF(INTRO!$E$39<>\"Non endémique\", 0, IF(INTRO!$E$37=\"Non endémique\",0,IF(COUNTRY_INFO!$H26=1,COUNTRY_INFO!G26,0)))","v":0},0,{"$f":"IF(INTRO!$E$39=\"Non endémique\",IF(INTRO!$E$37=\"Non endémique\",\"Non requis\",COUNTRY_INFO!V26),\"Traiter avec IVM\")","v":"Traiter avec IVM"},0,0,null,0]
[{"$f":"IF(INTRO!$E$39<>\"Non endémique\", \" \", IF(INTRO!$E$37=\"Non endémique\",\" \", IF(COUNTRY_INFO!A27=0,\" \",COUNTRY_INFO!A27)))","v":" "},{"$f":"IF(INTRO!$E$39<>\"Non endémique\", \" \", IF(INTRO!$E$37=\"Non endémique\",\" \", IF(COUNTRY_INFO!B27=0,\" \",COUNTRY_INFO!B27)))","v":" "},{"$f":"IF(INTRO!$E$39<>\"Non endémique\", \" \", IF(INTRO!$E$37=\"Non endémique\",\" \", IF(COUNTRY_INFO!C27=0,\" \",COUNTRY_INFO!C27)))","v":" "},{"$f":"IF(INTRO!$E$39<>\"Non endémique\", 0, IF(INTRO!$E$37=\"Non endémique\",0,IF(COUNTRY_INFO!$H27=1,COUNTRY_INFO!E27,0)))","v":0},{"$f":"IF(INTRO!$E$39<>\"Non endémique\", 0, IF(INTRO!$E$37=\"Non endémique\",0,IF(COUNTRY_INFO!$H27=1,COUNTRY_INFO!F27,0)))","v":0},{"$f":"IF(INTRO!$E$39<>\"Non endémique\", 0, IF(INTRO!$E$37=\"Non endémique\",0,IF(COUNTRY_INFO!$H27=1,COUNTRY_INFO!G27,0)))","v":0},0,{"$f":"IF(INTRO!$E$39=\"Non endémique\",IF(INTRO!$E$37=\"Non endémique\",\"Non requis\",COUNTRY_INFO!V27),\"Traiter avec IVM\")","v":"Traiter avec IVM"},0,0,null,0]
[{"$f":"IF(INTRO!$E$39<>\"Non endémique\", \" \", IF(INTRO!$E$37=\"Non endémique\",\" \", IF(COUNTRY_INFO!A28=0,\" \",COUNTRY_INFO!A28)))","v":" "},{"$f":"IF(INTRO!$E$39<>\"Non endémique\", \" \", IF(INTRO!$E$37=\"Non endémique\",\" \", IF(COUNTRY_INFO!B28=0,\" \",COUNTRY_INFO!B28)))","v":" "},{"$f":"IF(INTRO!$E$39<>\"Non endémique\", \" \", IF(INTRO!$E$37=\"Non endémique\",\" \", IF(COUNTRY_INFO!C28=0,\" \",COUNTRY_INFO!C28)))","v":" "},{"$f":"IF(INTRO!$E$39<>\"Non endémique\", 0, IF(INTRO!$E$37=\"Non endémique\",0,IF(COUNTRY_INFO!$H28=1,COUNTRY_INFO!E28,0)))","v":0},{"$f":"IF(INTRO!$E$39<>\"Non endémique\", 0, IF(INTRO!$E$37=\"Non endémique\",0,IF(COUNTRY_INFO!$H28=1,COUNTRY_INFO!F28,0)))","v":0},{"$f":"IF(INTRO!$E$39<>\"Non endémique\", 0, IF(INTRO!$E$37=\"Non endémique\",0,IF(COUNTRY_INFO!$H28=1,COUNTRY_INFO!G28,0)))","v":0},0,{"$f":"IF(INTRO!$E$39=\"Non endémique\",IF(INTRO!$E$37=\"Non endémique\",\"Non requis\",COUNTRY_INFO!V28),\"Traiter avec IVM\")","v":"Traiter avec IVM"},0,0,null,0]
[{"$f":"IF(INTRO!$E$39<>\"Non endémique\", \" \", IF(INTRO!$E$37=\"Non endémique\",\" \", IF(COUNTRY_INFO!A29=0,\" \",COUNTRY_INFO!A29)))","v":" "},{"$f":"IF(INTRO!$E$39<>\"Non endémique\", \" \", IF(INTRO!$E$37=\"Non endémique\",\" \", IF(COUNTRY_INFO!B29=0,\" \",COUNTRY_INFO!B29)))","v":" "},{"$f":"IF(INTRO!$E$39<>\"Non endémique\", \" \", IF(INTRO!$E$37=\"Non endémique\",\" \", IF(COUNTRY_INFO!C29=0,\" \",COUNTRY_INFO!C29)))","v":" "},{"$f":"IF(INTRO!$E$39<>\"Non endémique\", 0, IF(INTRO!$E$37=\"Non endémique\",0,IF(COUNTRY_INFO!$H29=1,COUNTRY_INFO!E29,0)))","v":0},{"$f":"IF(INTRO!$E$39<>\"Non endémique\", 0, IF(INTRO!$E$37=\"Non endémique\",0,IF(COUNTRY_INFO!$H29=1,COUNTRY_INFO!F29,0)))","v":0},{"$f":"IF(INTRO!$E$39<>\"Non endémique\", 0, IF(INTRO!$E$37=\"Non endémique\",0,IF(COUNTRY_INFO!$H29=1,COUNTRY_INFO!G29,0)))","v":0},0,{"$f":"IF(INTRO!$E$39=\"Non endémique\",IF(INTRO!$E$37=\"Non endémique\",\"Non requis\",COUNTRY_INFO!V29),\"Traiter avec IVM\")","v":"Traiter avec IVM"},0,0,null,0]
[{"$f":"IF(INTRO!$E$39<>\"Non endémique\", \" \", IF(INTRO!$E$37=\"Non endémique\",\" \", IF(COUNTRY_INFO!A30=0,\" \",COUNTRY_INFO!A30)))","v":" "},{"$f":"IF(INTRO!$E$39<>\"Non endémique\", \" \", IF(INTRO!$E$37=\"Non endémique\",\" \", IF(COUNTRY_INFO!B30=0,\" \",COUNTRY_INFO!B30)))","v":" "},{"$f":"IF(INTRO!$E$39<>\"Non endémique\", \" \", IF(INTRO!$E$37=\"Non endémique\",\" \", IF(COUNTRY_INFO!C30=0,\" \",COUNTRY_INFO!C30)))","v":" "},{"$f":"IF(INTRO!$E$39<>\"Non endémique\", 0, IF(INTRO!$E$37=\"Non endémique\",0,IF(COUNTRY_INFO!$H30=1,COUNTRY_INFO!E30,0)))","v":0},{"$f":"IF(INTRO!$E$39<>\"Non endémique\", 0, IF(INTRO!$E$37=\"Non endémique\",0,IF(COUNTRY_INFO!$H30=1,COUNTRY_INFO!F30,0)))","v":0},{"$f":"IF(INTRO!$E$39<>\"Non endémique\", 0, IF(INTRO!$E$37=\"Non endémique\",0,IF(COUNTRY_INFO!$H30=1,COUNTRY_INFO!G30,0)))","v":0},0,{"$f":"IF(INTRO!$E$39=\"Non endémique\",IF(INTRO!$E$37=\"Non endémique\",\"Non requis\",COUNTRY_INFO!V30),\"Traiter avec IVM\")","v":"Traiter avec IVM"},0,0,null,0]
[{"$f":"IF(INTRO!$E$39<>\"Non endémique\", \" \", IF(INTRO!$E$37=\"Non endémique\",\" \", IF(COUNTRY_INFO!A31=0,\" \",COUNTRY_INFO!A31)))","v":" "},{"$f":"IF(INTRO!$E$39<>\"Non endémique\", \" \", IF(INTRO!$E$37=\"Non endémique\",\" \", IF(COUNTRY_INFO!B31=0,\" \",COUNTRY_INFO!B31)))","v":" "},{"$f":"IF(INTRO!$E$39<>\"Non endémique\", \" \", IF(INTRO!$E$37=\"Non endémique\",\" \", IF(COUNTRY_INFO!C31=0,\" \",COUNTRY_INFO!C31)))","v":" "},{"$f":"IF(INTRO!$E$39<>\"Non endémique\", 0, IF(INTRO!$E$37=\"Non endémique\",0,IF(COUNTRY_INFO!$H31=1,COUNTRY_INFO!E31,0)))","v":0},{"$f":"IF(INTRO!$E$39<>\"Non endémique\", 0, IF(INTRO!$E$37=\"Non endémique\",0,IF(COUNTRY_INFO!$H31=1,COUNTRY_INFO!F31,0)))","v":0},{"$f":"IF(INTRO!$E$39<>\"Non endémique\", 0, IF(INTRO!$E$37=\"Non endémique\",0,IF(COUNTRY_INFO!$H31=1,COUNTRY_INFO!G31,0)))","v":0},0,{"$f":"IF(INTRO!$E$39=\"Non endémique\",IF(INTRO!$E$37=\"Non endémique\",\"Non requis\",COUNTRY_INFO!V31),\"Traiter avec IVM\")","v":"Traiter avec IVM"},0,0,null,0]
[{"$f":"IF(INTRO!$E$39<>\"Non endémique\", \" \", IF(INTRO!$E$37=\"Non endémique\",\" \", IF(COUNTRY_INFO!A32=0,\" \",COUNTRY_INFO!A32)))","v":" "},{"$f":"IF(INTRO!$E$39<>\"Non endémique\", \" \", IF(INTRO!$E$37=\"Non endémique\",\" \", IF(COUNTRY_INFO!B32=0,\" \",COUNTRY_INFO!B32)))","v":" "},{"$f":"IF(INTRO!$E$39<>\"Non endémique\", \" \", IF(INTRO!$E$37=\"Non endémique\",\" \", IF(COUNTRY_INFO!C32=0,\" \",COUNTRY_INFO!C32)))","v":" "},{"$f":"IF(INTRO!$E$39<>\"Non endémique\", 0, IF(INTRO!$E$37=\"Non endémique\",0,IF(COUNTRY_INFO!$H32=1,COUNTRY_INFO!E32,0)))","v":0},{"$f":"IF(INTRO!$E$39<>\"Non endémique\", 0, IF(INTRO!$E$37=\"Non endémique\",0,IF(COUNTRY_INFO!$H32=1,COUNTRY_INFO!F32,0)))","v":0},{"$f":"IF(INTRO!$E$39<>\"Non endémique\", 0, IF(INTRO!$E$37=\"Non endémique\",0,IF(COUNTRY_INFO!$H32=1,COUNTRY_INFO!G32,0)))","v":0},0,{"$f":"IF(INTRO!$E$39=\"Non endémique\",IF(INTRO!$E$37=\"Non endémique\",\"Non requis\",COUNTRY_INFO!V32),\"Traiter avec IVM\")","v":"Traiter avec IVM"},0,0,null,0]
[{"$f":"IF(INTRO!$E$39<>\"Non endémique\", \" \", IF(INTRO!$E$37=\"Non endémique\",\" \", IF(COUNTRY_INFO!A33=0,\" \",COUNTRY_INFO!A33)))","v":" "},{"$f":"IF(INTRO!$E$39<>\"Non endémique\", \" \", IF(INTRO!$E$37=\"Non endémique\",\" \", IF(COUNTRY_INFO!B33=0,\" \",COUNTRY_INFO!B33)))","v":" "},{"$f":"IF(INTRO!$E$39<>\"Non endémique\", \" \", IF(INTRO!$E$37=\"Non endémique\",\" \", IF(COUNTRY_INFO!C33=0,\" \",COUNTRY_INFO!C33)))","v":" "},{"$f":"IF(INTRO!$E$39<>\"Non endémique\", 0, IF(INTRO!$E$37=\"Non endémique\",0,IF(COUNTRY_INFO!$H33=1,COUNTRY_INFO!E33,0)))","v":0},{"$f":"IF(INTRO!$E$39<>\"Non endémique\", 0, IF(INTRO!$E$37=\"Non endémique\",0,IF(COUNTRY_INFO!$H33=1,COUNTRY_INFO!F33,0)))","v":0},{"$f":"IF(INTRO!$E$39<>\"Non endémique\", 0, IF(INTRO!$E$37=\"Non endémique\",0,IF(COUNTRY_INFO!$H33=1,COUNTRY_INFO!G33,0)))","v":0},0,{"$f":"IF(INTRO!$E$39=\"Non endémique\",IF(INTRO!$E$37=\"Non endémique\",\"Non requis\",COUNTRY_INFO!V33),\"Traiter avec IVM\")","v":"Traiter avec IVM"},0,0,null,0]
[{"$f":"IF(INTRO!$E$39<>\"Non endémique\", \" \", IF(INTRO!$E$37=\"Non endémique\",\" \", IF(COUNTRY_INFO!A34=0,\" \",COUNTRY_INFO!A34)))","v":" "},{"$f":"IF(INTRO!$E$39<>\"Non endémique\", \" \", IF(INTRO!$E$37=\"Non endémique\",\" \", IF(COUNTRY_INFO!B34=0,\" \",COUNTRY_INFO!B34)))","v":" "},{"$f":"IF(INTRO!$E$39<>\"Non endémique\", \" \", IF(INTRO!$E$37=\"Non endémique\",\" \", IF(COUNTRY_INFO!C34=0,\" \",COUNTRY_INFO!C34)))","v":" "},{"$f":"IF(INTRO!$E$39<>\"Non endémique\", 0, IF(INTRO!$E$37=\"Non endémique\",0,IF(COUNTRY_INFO!$H34=1,COUNTRY_INFO!E34,0)))","v":0},{"$f":"IF(INTRO!$E$39<>\"Non endémique\", 0, IF(INTRO!$E$37=\"Non endémique\",0,IF(COUNTRY_INFO!$H34=1,COUNTRY_INFO!F34,0)))","v":0},{"$f":"IF(INTRO!$E$39<>\"Non endémique\", 0, IF(INTRO!$E$37=\"Non endémique\",0,IF(COUNTRY_INFO!$H34=1,COUNTRY_INFO!G34,0)))","v":0},0,{"$f":"IF(INTRO!$E$39=\"Non endémique\",IF(INTRO!$E$37=\"Non endémique\",\"Non requis\",COUNTRY_INFO!V34),\"Traiter avec IVM\")","v":"Traiter avec IVM"},0,0,null,0]
[{"$f":"IF(INTRO!$E$39<>\"Non endémique\", \" \", IF(INTRO!$E$37=\"Non endémique\",\" \", IF(COUNTRY_INFO!A35=0,\" \",COUNTRY_INFO!A35)))","v":" "},{"$f":"IF(INTRO!$E$39<>\"Non endémique\", \" \", IF(INTRO!$E$37=\"Non endémique\",\" \", IF(COUNTRY_INFO!B35=0,\" \",COUNTRY_INFO!B35)))","v":" "},{"$f":"IF(INTRO!$E$39<>\"Non endémique\", \" \", IF(INTRO!$E$37=\"Non endémique\",\" \", IF(COUNTRY_INFO!C35=0,\" \",COUNTRY_INFO!C35)))","v":" "},{"$f":"IF(INTRO!$E$39<>\"Non endémique\", 0, IF(INTRO!$E$37=\"Non endémique\",0,IF(COUNTRY_INFO!$H35=1,COUNTRY_INFO!E35,0)))","v":0},{"$f":"IF(INTRO!$E$39<>\"Non endémique\", 0, IF(INTRO!$E$37=\"Non endémique\",0,IF(COUNTRY_INFO!$H35=1,COUNTRY_INFO!F35,0)))","v":0},{"$f":"IF(INTRO!$E$39<>\"Non endémique\", 0, IF(INTRO!$E$37=\"Non endémique\",0,IF(COUNTRY_INFO!$H35=1,COUNTRY_INFO!G35,0)))","v":0},0,{"$f":"IF(INTRO!$E$39=\"Non endémique\",IF(INTRO!$E$37=\"Non endémique\",\"Non requis\",COUNTRY_INFO!V35),\"Traiter avec IVM\")","v":"Traiter avec IVM"},0,0,null,0]
[{"$f":"IF(INTRO!$E$39<>\"Non endémique\", \" \", IF(INTRO!$E$37=\"Non endémique\",\" \", IF(COUNTRY_INFO!A36=0,\" \",COUNTRY_INFO!A36)))","v":" "},{"$f":"IF(INTRO!$E$39<>\"Non endémique\", \" \", IF(INTRO!$E$37=\"Non endémique\",\" \", IF(COUNTRY_INFO!B36=0,\" \",COUNTRY_INFO!B36)))","v":" "},{"$f":"IF(INTRO!$E$39<>\"Non endémique\", \" \", IF(INTRO!$E$37=\"Non endémique\",\" \", IF(COUNTRY_INFO!C36=0,\" \",COUNTRY_INFO!C36)))","v":" "},{"$f":"IF(INTRO!$E$39<>\"Non endémique\", 0, IF(INTRO!$E$37=\"Non endémique\",0,IF(COUNTRY_INFO!$H36=1,COUNTRY_INFO!E36,0)))","v":0},{"$f":"IF(INTRO!$E$39<>\"Non endémique\", 0, IF(INTRO!$E$37=\"Non endémique\",0,IF(COUNTRY_INFO!$H36=1,COUNTRY_INFO!F36,0)))","v":0},{"$f":"IF(INTRO!$E$39<>\"Non endémique\", 0, IF(INTRO!$E$37=\"Non endémique\",0,IF(COUNTRY_INFO!$H36=1,COUNTRY_INFO!G36,0)))","v":0},0,{"$f":"IF(INTRO!$E$39=\"Non endémique\",IF(INTRO!$E$37=\"Non endémique\",\"Non requis\",COUNTRY_INFO!V36),\"Traiter avec IVM\")","v":"Traiter avec IVM"},0,0,null,0]
[{"$f":"IF(INTRO!$E$39<>\"Non endémique\", \" \", IF(INTRO!$E$37=\"Non endémique\",\" \", IF(COUNTRY_INFO!A37=0,\" \",COUNTRY_INFO!A37)))","v":" "},{"$f":"IF(INTRO!$E$39<>\"Non endémique\", \" \", IF(INTRO!$E$37=\"Non endémique\",\" \", IF(COUNTRY_INFO!B37=0,\" \",COUNTRY_INFO!B37)))","v":" "},{"$f":"IF(INTRO!$E$39<>\"Non endémique\", \" \", IF(INTRO!$E$37=\"Non endémique\",\" \", IF(COUNTRY_INFO!C37=0,\" \",COUNTRY_INFO!C37)))","v":" "},{"$f":"IF(INTRO!$E$39<>\"Non endémique\", 0, IF(INTRO!$E$37=\"Non endémique\",0,IF(COUNTRY_INFO!$H37=1,COUNTRY_INFO!E37,0)))","v":0},{"$f":"IF(INTRO!$E$39<>\"Non endémique\", 0, IF(INTRO!$E$37=\"Non endémique\",0,IF(COUNTRY_INFO!$H37=1,COUNTRY_INFO!F37,0)))","v":0},{"$f":"IF(INTRO!$E$39<>\"Non endémique\", 0, IF(INTRO!$E$37=\"Non endémique\",0,IF(COUNTRY_INFO!$H37=1,COUNTRY_INFO!G37,0)))","v":0},0,{"$f":"IF(INTRO!$E$39=\"Non endémique\",IF(INTRO!$E$37=\"Non endémique\",\"Non requis\",COUNTRY_INFO!V37),\"Traiter avec IVM\")","v":"Traiter avec IVM"},0,0,null,0]
[{"$f":"IF(INTRO!$E$39<>\"Non endémique\", \" \", IF(INTRO!$E$37=\"Non endémique\",\" \", IF(COUNTRY_INFO!A38=0,\" \",COUNTRY_INFO!A38)))","v":" "},{"$f":"IF(INTRO!$E$39<>\"Non endémique\", \" \", IF(INTRO!$E$37=\"Non endémique\",\" \", IF(COUNTRY_INFO!B38=0,\" \",COUNTRY_INFO!B38)))","v":" "},{"$f":"IF(INTRO!$E$39<>\"Non endémique\", \" \", IF(INTRO!$E$37=\"Non endémique\",\" \", IF(COUNTRY_INFO!C38=0,\" \",COUNTRY_INFO!C38)))","v":" "},{"$f":"IF(INTRO!$E$39<>\"Non endémique\", 0, IF(INTRO!$E$37=\"Non endémique\",0,IF(COUNTRY_INFO!$H38=1,COUNTRY_INFO!E38,0)))","v":0},{"$f":"IF(INTRO!$E$39<>\"Non endémique\", 0, IF(INTRO!$E$37=\"Non endémique\",0,IF(COUNTRY_INFO!$H38=1,COUNTRY_INFO!F38,0)))","v":0},{"$f":"IF(INTRO!$E$39<>\"Non endémique\", 0, IF(INTRO!$E$37=\"Non endémique\",0,IF(COUNTRY_INFO!$H38=1,COUNTRY_INFO!G38,0)))","v":0},0,{"$f":"IF(INTRO!$E$39=\"Non endémique\",IF(INTRO!$E$37=\"Non endémique\",\"Non requis\",COUNTRY_INFO!V38),\"Traiter avec IVM\")","v":"Traiter avec IVM"},0,0,null,0]
[{"$f":"IF(INTRO!$E$39<>\"Non endémique\", \" \", IF(INTRO!$E$37=\"Non endémique\",\" \", IF(COUNTRY_INFO!A39=0,\" \",COUNTRY_INFO!A39)))","v":" "},{"$f":"IF(INTRO!$E$39<>\"Non endémique\", \" \", IF(INTRO!$E$37=\"Non endémique\",\" \", IF(COUNTRY_INFO!B39=0,\" \",COUNTRY_INFO!B39)))","v":" "},{"$f":"IF(INTRO!$E$39<>\"Non endémique\", \" \", IF(INTRO!$E$37=\"Non endémique\",\" \", IF(COUNTRY_INFO!C39=0,\" \",COUNTRY_INFO!C39)))","v":" "},{"$f":"IF(INTRO!$E$39<>\"Non endémique\", 0, IF(INTRO!$E$37=\"Non endémique\",0,IF(COUNTRY_INFO!$H39=1,COUNTRY_INFO!E39,0)))","v":0},{"$f":"IF(INTRO!$E$39<>\"Non endémique\", 0, IF(INTRO!$E$37=\"Non endémique\",0,IF(COUNTRY_INFO!$H39=1,COUNTRY_INFO!F39,0)))","v":0},{"$f":"IF(INTRO!$E$39<>\"Non endémique\", 0, IF(INTRO!$E$37=\"Non endémique\",0,IF(COUNTRY_INFO!$H39=1,COUNTRY_INFO!G39,0)))","v":0},0,{"$f":"IF(INTRO!$E$39=\"Non endémique\",IF(INTRO!$E$37=\"Non endémique\",\"Non requis\",COUNTRY_INFO!V39),\"Traiter avec IVM\")","v":"Traiter avec IVM"},0,0,null,0]
[{"$f":"IF(INTRO!$E$39<>\"Non endémique\", \" \", IF(INTRO!$E$37=\"Non endémique\",\" \", IF(COUNTRY_INFO!A40=0,\" \",COUNTRY_INFO!A40)))","v":" "},{"$f":"IF(INTRO!$E$39<>\"Non endémique\", \" \", IF(INTRO!$E$37=\"Non endémique\",\" \", IF(COUNTRY_INFO!B40=0,\" \",COUNTRY_INFO!B40)))","v":" "},{"$f":"IF(INTRO!$E$39<>\"Non endémique\", \" \", IF(INTRO!$E$37=\"Non endémique\",\" \", IF(COUNTRY_INFO!C40=0,\" \",COUNTRY_INFO!C40)))","v":" "},{"$f":"IF(INTRO!$E$39<>\"Non endémique\", 0, IF(INTRO!$E$37=\"Non endémique\",0,IF(COUNTRY_INFO!$H40=1,COUNTRY_INFO!E40,0)))","v":0},{"$f":"IF(INTRO!$E$39<>\"Non endémique\", 0, IF(INTRO!$E$37=\"Non endémique\",0,IF(COUNTRY_INFO!$H40=1,COUNTRY_INFO!F40,0)))","v":0},{"$f":"IF(INTRO!$E$39<>\"Non endémique\", 0, IF(INTRO!$E$37=\"Non endémique\",0,IF(COUNTRY_INFO!$H40=1,COUNTRY_INFO!G40,0)))","v":0},0,{"$f":"IF(INTRO!$E$39=\"Non endémique\",IF(INTRO!$E$37=\"Non endémique\",\"Non requis\",COUNTRY_INFO!V40),\"Traiter avec IVM\")","v":"Traiter avec IVM"},0,0,null,0]
[{"$f":"IF(INTRO!$E$39<>\"Non endémique\", \" \", IF(INTRO!$E$37=\"Non endémique\",\" \", IF(COUNTRY_INFO!A41=0,\" \",COUNTRY_INFO!A41)))","v":" "},{"$f":"IF(INTRO!$E$39<>\"Non endémique\", \" \", IF(INTRO!$E$37=\"Non endémique\",\" \", IF(COUNTRY_INFO!B41=0,\" \",COUNTRY_INFO!B41)))","v":" "},{"$f":"IF(INTRO!$E$39<>\"Non endémique\", \" \", IF(INTRO!$E$37=\"Non endémique\",\" \", IF(COUNTRY_INFO!C41=0,\" \",COUNTRY_INFO!C41)))","v":" "},{"$f":"IF(INTRO!$E$39<>\"Non endémique\", 0, IF(INTRO!$E$37=\"Non endémique\",0,IF(COUNTRY_INFO!$H41=1,COUNTRY_INFO!E41,0)))","v":0},{"$f":"IF(INTRO!$E$39<>\"Non endémique\", 0, IF(INTRO!$E$37=\"Non endémique\",0,IF(COUNTRY_INFO!$H41=1,COUNTRY_INFO!F41,0)))","v":0},{"$f":"IF(INTRO!$E$39<>\"Non endémique\", 0, IF(INTRO!$E$37=\"Non endémique\",0,IF(COUNTRY_INFO!$H41=1,COUNTRY_INFO!G41,0)))","v":0},0,{"$f":"IF(INTRO!$E$39=\"Non endémique\",IF(INTRO!$E$37=\"Non endémique\",\"Non requis\",COUNTRY_INFO!V41),\"Traiter avec IVM\")","v":"Traiter avec IVM"},0,0,null,0]
[{"$f":"IF(INTRO!$E$39<>\"Non endémique\", \" \", IF(INTRO!$E$37=\"Non endémique\",\" \", IF(COUNTRY_INFO!A42=0,\" \",COUNTRY_INFO!A42)))","v":" "},{"$f":"IF(INTRO!$E$39<>\"Non endémique\", \" \", IF(INTRO!$E$37=\"Non endémique\",\" \", IF(COUNTRY_INFO!B42=0,\" \",COUNTRY_INFO!B42)))","v":" "},{"$f":"IF(INTRO!$E$39<>\"Non endémique\", \" \", IF(INTRO!$E$37=\"Non endémique\",\" \", IF(COUNTRY_INFO!C42=0,\" \",COUNTRY_INFO!C42)))","v":" "},{"$f":"IF(INTRO!$E$39<>\"Non endémique\", 0, IF(INTRO!$E$37=\"Non endémique\",0,IF(COUNTRY_INFO!$H42=1,COUNTRY_INFO!E42,0)))","v":0},{"$f":"IF(INTRO!$E$39<>\"Non endémique\", 0, IF(INTRO!$E$37=\"Non endémique\",0,IF(COUNTRY_INFO!$H42=1,COUNTRY_INFO!F42,0)))","v":0},{"$f":"IF(INTRO!$E$39<>\"Non endémique\", 0, IF(INTRO!$E$37=\"Non endémique\",0,IF(COUNTRY_INFO!$H42=1,COUNTRY_INFO!G42,0)))","v":0},0,{"$f":"IF(INTRO!$E$39=\"Non endémique\",IF(INTRO!$E$37=\"Non endémique\",\"Non requis\",COUNTRY_INFO!V42),\"Traiter avec IVM\")","v":"Traiter avec IVM"},0,0,null,0]
[{"$f":"IF(INTRO!$E$39<>\"Non endémique\", \" \", IF(INTRO!$E$37=\"Non endémique\",\" \", IF(COUNTRY_INFO!A43=0,\" \",COUNTRY_INFO!A43)))","v":" "},{"$f":"IF(INTRO!$E$39<>\"Non endémique\", \" \", IF(INTRO!$E$37=\"Non endémique\",\" \", IF(COUNTRY_INFO!B43=0,\" \",COUNTRY_INFO!B43)))","v":" "},{"$f":"IF(INTRO!$E$39<>\"Non endémique\", \" \", IF(INTRO!$E$37=\"Non endémique\",\" \", IF(COUNTRY_INFO!C43=0,\" \",COUNTRY_INFO!C43)))","v":" "},{"$f":"IF(INTRO!$E$39<>\"Non endémique\", 0, IF(INTRO!$E$37=\"Non endémique\",0,IF(COUNTRY_INFO!$H43=1,COUNTRY_INFO!E43,0)))","v":0},{"$f":"IF(INTRO!$E$39<>\"Non endémique\", 0, IF(INTRO!$E$37=\"Non endémique\",0,IF(COUNTRY_INFO!$H43=1,COUNTRY_INFO!F43,0)))","v":0},{"$f":"IF(INTRO!$E$39<>\"Non endémique\", 0, IF(INTRO!$E$37=\"Non endémique\",0,IF(COUNTRY_INFO!$H43=1,COUNTRY_INFO!G43,0)))","v":0},0,{"$f":"IF(INTRO!$E$39=\"Non endémique\",IF(INTRO!$E$37=\"Non endémique\",\"Non requis\",COUNTRY_INFO!V43),\"Traiter avec IVM\")","v":"Traiter avec IVM"},0,0,null,0]
[{"$f":"IF(INTRO!$E$39<>\"Non endémique\", \" \", IF(INTRO!$E$37=\"Non endémique\",\" \", IF(COUNTRY_INFO!A44=0,\" \",COUNTRY_INFO!A44)))","v":" "},{"$f":"IF(INTRO!$E$39<>\"Non endémique\", \" \", IF(INTRO!$E$37=\"Non endémique\",\" \", IF(COUNTRY_INFO!B44=0,\" \",COUNTRY_INFO!B44)))","v":" "},{"$f":"IF(INTRO!$E$39<>\"Non endémique\", \" \", IF(INTRO!$E$37=\"Non endémique\",\" \", IF(COUNTRY_INFO!C44=0,\" \",COUNTRY_INFO!C44)))","v":" "},{"$f":"IF(INTRO!$E$39<>\"Non endémique\", 0, IF(INTRO!$E$37=\"Non endémique\",0,IF(COUNTRY_INFO!$H44=1,COUNTRY_INFO!E44,0)))","v":0},{"$f":"IF(INTRO!$E$39<>\"Non endémique\", 0, IF(INTRO!$E$37=\"Non endémique\",0,IF(COUNTRY_INFO!$H44=1,COUNTRY_INFO!F44,0)))","v":0},{"$f":"IF(INTRO!$E$39<>\"Non endémique\", 0, IF(INTRO!$E$37=\"Non endémique\",0,IF(COUNTRY_INFO!$H44=1,COUNTRY_INFO!G44,0)))","v":0},0,{"$f":"IF(INTRO!$E$39=\"Non endémique\",IF(INTRO!$E$37=\"Non endémique\",\"Non requis\",COUNTRY_INFO!V44),\"Traiter avec IVM\")","v":"Traiter avec IVM"},0,0,null,0]
[{"$f":"IF(INTRO!$E$39<>\"Non endémique\", \" \", IF(INTRO!$E$37=\"Non endémique\",\" \", IF(COUNTRY_INFO!A45=0,\" \",COUNTRY_INFO!A45)))","v":" "},{"$f":"IF(INTRO!$E$39<>\"Non endémique\", \" \", IF(INTRO!$E$37=\"Non endémique\",\" \", IF(COUNTRY_INFO!B45=0,\" \",COUNTRY_INFO!B45)))","v":" "},{"$f":"IF(INTRO!$E$39<>\"Non endémique\", \" \", IF(INTRO!$E$37=\"Non endémique\",\" \", IF(COUNTRY_INFO!C45=0,\" \",COUNTRY_INFO!C45)))","v":" "},{"$f":"IF(INTRO!$E$39<>\"Non endémique\", 0, IF(INTRO!$E$37=\"Non endémique\",0,IF(COUNTRY_INFO!$H45=1,COUNTRY_INFO!E45,0)))","v":0},{"$f":"IF(INTRO!$E$39<>\"Non endémique\", 0, IF(INTRO!$E$37=\"Non endémique\",0,IF(COUNTRY_INFO!$H45=1,COUNTRY_INFO!F45,0)))","v":0},{"$f":"IF(INTRO!$E$39<>\"Non endémique\", 0, IF(INTRO!$E$37=\"Non endémique\",0,IF(COUNTRY_INFO!$H45=1,COUNTRY_INFO!G45,0)))","v":0},0,{"$f":"IF(INTRO!$E$39=\"Non endémique\",IF(INTRO!$E$37=\"Non endémique\",\"Non requis\",COUNTRY_INFO!V45),\"Traiter avec IVM\")","v":"Traiter avec IVM"},0,0,null,0]
[{"$f":"IF(INTRO!$E$39<>\"Non endémique\", \" \", IF(INTRO!$E$37=\"Non endémique\",\" \", IF(COUNTRY_INFO!A46=0,\" \",COUNTRY_INFO!A46)))","v":" "},{"$f":"IF(INTRO!$E$39<>\"Non endémique\", \" \", IF(INTRO!$E$37=\"Non endémique\",\" \", IF(COUNTRY_INFO!B46=0,\" \",COUNTRY_INFO!B46)))","v":" "},{"$f":"IF(INTRO!$E$39<>\"Non endémique\", \" \", IF(INTRO!$E$37=\"Non endémique\",\" \", IF(COUNTRY_INFO!C46=0,\" \",COUNTRY_INFO!C46)))","v":" "},{"$f":"IF(INTRO!$E$39<>\"Non endémique\", 0, IF(INTRO!$E$37=\"Non endémique\",0,IF(COUNTRY_INFO!$H46=1,COUNTRY_INFO!E46,0)))","v":0},{"$f":"IF(INTRO!$E$39<>\"Non endémique\", 0, IF(INTRO!$E$37=\"Non endémique\",0,IF(COUNTRY_INFO!$H46=1,COUNTRY_INFO!F46,0)))","v":0},{"$f":"IF(INTRO!$E$39<>\"Non endémique\", 0, IF(INTRO!$E$37=\"Non endémique\",0,IF(COUNTRY_INFO!$H46=1,COUNTRY_INFO!G46,0)))","v":0},0,{"$f":"IF(INTRO!$E$39=\"Non endémique\",IF(INTRO!$E$37=\"Non endémique\",\"Non requis\",COUNTRY_INFO!V46),\"Traiter avec IVM\")","v":"Traiter avec IVM"},0,0,null,0]
[{"$f":"IF(INTRO!$E$39<>\"Non endémique\", \" \", IF(INTRO!$E$37=\"Non endémique\",\" \", IF(COUNTRY_INFO!A47=0,\" \",COUNTRY_INFO!A47)))","v":" "},{"$f":"IF(INTRO!$E$39<>\"Non endémique\", \" \", IF(INTRO!$E$37=\"Non endémique\",\" \", IF(COUNTRY_INFO!B47=0,\" \",COUNTRY_INFO!B47)))","v":" "},{"$f":"IF(INTRO!$E$39<>\"Non endémique\", \" \", IF(INTRO!$E$37=\"Non endémique\",\" \", IF(COUNTRY_INFO!C47=0,\" \",COUNTRY_INFO!C47)))","v":" "},{"$f":"IF(INTRO!$E$39<>\"Non endémique\", 0, IF(INTRO!$E$37=\"Non endémique\",0,IF(COUNTRY_INFO!$H47=1,COUNTRY_INFO!E47,0)))","v":0},{"$f":"IF(INTRO!$E$39<>\"Non endémique\", 0, IF(INTRO!$E$37=\"Non endémique\",0,IF(COUNTRY_INFO!$H47=1,COUNTRY_INFO!F47,0)))","v":0},{"$f":"IF(INTRO!$E$39<>\"Non endémique\", 0, IF(INTRO!$E$37=\"Non endémique\",0,IF(COUNTRY_INFO!$H47=1,COUNTRY_INFO!G47,0)))","v":0},0,{"$f":"IF(INTRO!$E$39=\"Non endémique\",IF(INTRO!$E$37=\"Non endémique\",\"Non requis\",COUNTRY_INFO!V47),\"Traiter avec IVM\")","v":"Traiter avec IVM"},0,0,null,0]
[{"$f":"IF(INTRO!$E$39<>\"Non endémique\", \" \", IF(INTRO!$E$37=\"Non endémique\",\" \", IF(COUNTRY_INFO!A48=0,\" \",COUNTRY_INFO!A48)))","v":" "},{"$f":"IF(INTRO!$E$39<>\"Non endémique\", \" \", IF(INTRO!$E$37=\"Non endémique\",\" \", IF(COUNTRY_INFO!B48=0,\" \",COUNTRY_INFO!B48)))","v":" "},{"$f":"IF(INTRO!$E$39<>\"Non endémique\", \" \", IF(INTRO!$E$37=\"Non endémique\",\" \", IF(COUNTRY_INFO!C48=0,\" \",COUNTRY_INFO!C48)))","v":" "},{"$f":"IF(INTRO!$E$39<>\"Non endémique\", 0, IF(INTRO!$E$37=\"Non endémique\",0,IF(COUNTRY_INFO!$H48=1,COUNTRY_INFO!E48,0)))","v":0},{"$f":"IF(INTRO!$E$39<>\"Non endémique\", 0, IF(INTRO!$E$37=\"Non endémique\",0,IF(COUNTRY_INFO!$H48=1,COUNTRY_INFO!F48,0)))","v":0},{"$f":"IF(INTRO!$E$39<>\"Non endémique\", 0, IF(INTRO!$E$37=\"Non endémique\",0,IF(COUNTRY_INFO!$H48=1,COUNTRY_INFO!G48,0)))","v":0},0,{"$f":"IF(INTRO!$E$39=\"Non endémique\",IF(INTRO!$E$37=\"Non endémique\",\"Non requis\",COUNTRY_INFO!V48),\"Traiter avec IVM\")","v":"Traiter avec IVM"},0,0,null,0]
[{"$f":"IF(INTRO!$E$39<>\"Non endémique\", \" \", IF(INTRO!$E$37=\"Non endémique\",\" \", IF(COUNTRY_INFO!A49=0,\" \",COUNTRY_INFO!A49)))","v":" "},{"$f":"IF(INTRO!$E$39<>\"Non endémique\", \" \", IF(INTRO!$E$37=\"Non endémique\",\" \", IF(COUNTRY_INFO!B49=0,\" \",COUNTRY_INFO!B49)))","v":" "},{"$f":"IF(INTRO!$E$39<>\"Non endémique\", \" \", IF(INTRO!$E$37=\"Non endémique\",\" \", IF(COUNTRY_INFO!C49=0,\" \",COUNTRY_INFO!C49)))","v":" "},{"$f":"IF(INTRO!$E$39<>\"Non endémique\", 0, IF(INTRO!$E$37=\"Non endémique\",0,IF(COUNTRY_INFO!$H49=1,COUNTRY_INFO!E49,0)))","v":0},{"$f":"IF(INTRO!$E$39<>\"Non endémique\", 0, IF(INTRO!$E$37=\"Non endémique\",0,IF(COUNTRY_INFO!$H49=1,COUNTRY_INFO!F49,0)))","v":0},{"$f":"IF(INTRO!$E$39<>\"Non endémique\", 0, IF(INTRO!$E$37=\"Non endémique\",0,IF(COUNTRY_INFO!$H49=1,COUNTRY_INFO!G49,0)))","v":0},0,{"$f":"IF(INTRO!$E$39=\"Non endémique\",IF(INTRO!$E$37=\"Non endémique\",\"Non requis\",COUNTRY_INFO!V49),\"Traiter avec IVM\")","v":"Traiter avec IVM"},0,0,null,0]
[{"$f":"IF(INTRO!$E$39<>\"Non endémique\", \" \", IF(INTRO!$E$37=\"Non endémique\",\" \", IF(COUNTRY_INFO!A50=0,\" \",COUNTRY_INFO!A50)))","v":" "},{"$f":"IF(INTRO!$E$39<>\"Non endémique\", \" \", IF(INTRO!$E$37=\"Non endémique\",\" \", IF(COUNTRY_INFO!B50=0,\" \",COUNTRY_INFO!B50)))","v":" "},{"$f":"IF(INTRO!$E$39<>\"Non endémique\", \" \", IF(INTRO!$E$37=\"Non endémique\",\" \", IF(COUNTRY_INFO!C50=0,\" \",COUNTRY_INFO!C50)))","v":" "},{"$f":"IF(INTRO!$E$39<>\"Non endémique\", 0, IF(INTRO!$E$37=\"Non endémique\",0,IF(COUNTRY_INFO!$H50=1,COUNTRY_INFO!E50,0)))","v":0},{"$f":"IF(INTRO!$E$39<>\"Non endémique\", 0, IF(INTRO!$E$37=\"Non endémique\",0,IF(COUNTRY_INFO!$H50=1,COUNTRY_INFO!F50,0)))","v":0},{"$f":"IF(INTRO!$E$39<>\"Non endémique\", 0, IF(INTRO!$E$37=\"Non endémique\",0,IF(COUNTRY_INFO!$H50=1,COUNTRY_INFO!G50,0)))","v":0},0,{"$f":"IF(INTRO!$E$39=\"Non endémique\",IF(INTRO!$E$37=\"Non endémique\",\"Non requis\",COUNTRY_INFO!V50),\"Traiter avec IVM\")","v":"Traiter avec IVM"},0,0,null,0]
[{"$f":"IF(INTRO!$E$39<>\"Non endémique\", \" \", IF(INTRO!$E$37=\"Non endémique\",\" \", IF(COUNTRY_INFO!A51=0,\" \",COUNTRY_INFO!A51)))","v":" "},{"$f":"IF(INTRO!$E$39<>\"Non endémique\", \" \", IF(INTRO!$E$37=\"Non endémique\",\" \", IF(COUNTRY_INFO!B51=0,\" \",COUNTRY_INFO!B51)))","v":" "},{"$f":"IF(INTRO!$E$39<>\"Non endémique\", \" \", IF(INTRO!$E$37=\"Non endémique\",\" \", IF(COUNTRY_INFO!C51=0,\" \",COUNTRY_INFO!C51)))","v":" "},{"$f":"IF(INTRO!$E$39<>\"Non endémique\", 0, IF(INTRO!$E$37=\"Non endémique\",0,IF(COUNTRY_INFO!$H51=1,COUNTRY_INFO!E51,0)))","v":0},{"$f":"IF(INTRO!$E$39<>\"Non endémique\", 0, IF(INTRO!$E$37=\"Non endémique\",0,IF(COUNTRY_INFO!$H51=1,COUNTRY_INFO!F51,0)))","v":0},{"$f":"IF(INTRO!$E$39<>\"Non endémique\", 0, IF(INTRO!$E$37=\"Non endémique\",0,IF(COUNTRY_INFO!$H51=1,COUNTRY_INFO!G51,0)))","v":0},0,{"$f":"IF(INTRO!$E$39=\"Non endémique\",IF(INTRO!$E$37=\"Non endémique\",\"Non requis\",COUNTRY_INFO!V51),\"Traiter avec IVM\")","v":"Traiter avec IVM"},0,0,null,0]
[{"$f":"IF(INTRO!$E$39<>\"Non endémique\", \" \", IF(INTRO!$E$37=\"Non endémique\",\" \", IF(COUNTRY_INFO!A52=0,\" \",COUNTRY_INFO!A52)))","v":" "},{"$f":"IF(INTRO!$E$39<>\"Non endémique\", \" \", IF(INTRO!$E$37=\"Non endémique\",\" \", IF(COUNTRY_INFO!B52=0,\" \",COUNTRY_INFO!B52)))","v":" "},{"$f":"IF(INTRO!$E$39<>\"Non endémique\", \" \", IF(INTRO!$E$37=\"Non endémique\",\" \", IF(COUNTRY_INFO!C52=0,\" \",COUNTRY_INFO!C52)))","v":" "},{"$f":"IF(INTRO!$E$39<>\"Non endémique\", 0, IF(INTRO!$E$37=\"Non endémique\",0,IF(COUNTRY_INFO!$H52=1,COUNTRY_INFO!E52,0)))","v":0},{"$f":"IF(INTRO!$E$39<>\"Non endémique\", 0, IF(INTRO!$E$37=\"Non endémique\",0,IF(COUNTRY_INFO!$H52=1,COUNTRY_INFO!F52,0)))","v":0},{"$f":"IF(INTRO!$E$39<>\"Non endémique\", 0, IF(INTRO!$E$37=\"Non endémique\",0,IF(COUNTRY_INFO!$H52=1,COUNTRY_INFO!G52,0)))","v":0},0,{"$f":"IF(INTRO!$E$39=\"Non endémique\",IF(INTRO!$E$37=\"Non endémique\",\"Non requis\",COUNTRY_INFO!V52),\"Traiter avec IVM\")","v":"Traiter avec IVM"},0,0,null,0]
[{"$f":"IF(INTRO!$E$39<>\"Non endémique\", \" \", IF(INTRO!$E$37=\"Non endémique\",\" \", IF(COUNTRY_INFO!A53=0,\" \",COUNTRY_INFO!A53)))","v":" "},{"$f":"IF(INTRO!$E$39<>\"Non endémique\", \" \", IF(INTRO!$E$37=\"Non endémique\",\" \", IF(COUNTRY_INFO!B53=0,\" \",COUNTRY_INFO!B53)))","v":" "},{"$f":"IF(INTRO!$E$39<>\"Non endémique\", \" \", IF(INTRO!$E$37=\"Non endémique\",\" \", IF(COUNTRY_INFO!C53=0,\" \",COUNTRY_INFO!C53)))","v":" "},{"$f":"IF(INTRO!$E$39<>\"Non endémique\", 0, IF(INTRO!$E$37=\"Non endémique\",0,IF(COUNTRY_INFO!$H53=1,COUNTRY_INFO!E53,0)))","v":0},{"$f":"IF(INTRO!$E$39<>\"Non endémique\", 0, IF(INTRO!$E$37=\"Non endémique\",0,IF(COUNTRY_INFO!$H53=1,COUNTRY_INFO!F53,0)))","v":0},{"$f":"IF(INTRO!$E$39<>\"Non endémique\", 0, IF(INTRO!$E$37=\"Non endémique\",0,IF(COUNTRY_INFO!$H53=1,COUNTRY_INFO!G53,0)))","v":0},0,{"$f":"IF(INTRO!$E$39=\"Non endémique\",IF(INTRO!$E$37=\"Non endémique\",\"Non requis\",COUNTRY_INFO!V53),\"Traiter avec IVM\")","v":"Traiter avec IVM"},0,0,null,0]
[{"$f":"IF(INTRO!$E$39<>\"Non endémique\", \" \", IF(INTRO!$E$37=\"Non endémique\",\" \", IF(COUNTRY_INFO!A54=0,\" \",COUNTRY_INFO!A54)))","v":" "},{"$f":"IF(INTRO!$E$39<>\"Non endémique\", \" \", IF(INTRO!$E$37=\"Non endémique\",\" \", IF(COUNTRY_INFO!B54=0,\" \",COUNTRY_INFO!B54)))","v":" "},{"$f":"IF(INTRO!$E$39<>\"Non endémique\", \" \", IF(INTRO!$E$37=\"Non endémique\",\" \", IF(COUNTRY_INFO!C54=0,\" \",COUNTRY_INFO!C54)))","v":" "},{"$f":"IF(INTRO!$E$39<>\"Non endémique\", 0, IF(INTRO!$E$37=\"Non endémique\",0,IF(COUNTRY_INFO!$H54=1,COUNTRY_INFO!E54,0)))","v":0},{"$f":"IF(INTRO!$E$39<>\"Non endémique\", 0, IF(INTRO!$E$37=\"Non endémique\",0,IF(COUNTRY_INFO!$H54=1,COUNTRY_INFO!F54,0)))","v":0},{"$f":"IF(INTRO!$E$39<>\"Non endémique\", 0, IF(INTRO!$E$37=\"Non endémique\",0,IF(COUNTRY_INFO!$H54=1,COUNTRY_INFO!G54,0)))","v":0},0,{"$f":"IF(INTRO!$E$39=\"Non endémique\",IF(INTRO!$E$37=\"Non endémique\",\"Non requis\",COUNTRY_INFO!V54),\"Traiter avec IVM\")","v":"Traiter avec IVM"},0,0,null,0]
[{"$f":"IF(INTRO!$E$39<>\"Non endémique\", \" \", IF(INTRO!$E$37=\"Non endémique\",\" \", IF(COUNTRY_INFO!A55=0,\" \",COUNTRY_INFO!A55)))","v":" "},{"$f":"IF(INTRO!$E$39<>\"Non endémique\", \" \", IF(INTRO!$E$37=\"Non endémique\",\" \", IF(COUNTRY_INFO!B55=0,\" \",COUNTRY_INFO!B55)))","v":" "},{"$f":"IF(INTRO!$E$39<>\"Non endémique\", \" \", IF(INTRO!$E$37=\"Non endémique\",\" \", IF(COUNTRY_INFO!C55=0,\" \",COUNTRY_INFO!C55)))","v":" "},{"$f":"IF(INTRO!$E$39<>\"Non endémique\", 0, IF(INTRO!$E$37=\"Non endémique\",0,IF(COUNTRY_INFO!$H55=1,COUNTRY_INFO!E55,0)))","v":0},{"$f":"IF(INTRO!$E$39<>\"Non endémique\", 0, IF(INTRO!$E$37=\"Non endémique\",0,IF(COUNTRY_INFO!$H55=1,COUNTRY_INFO!F55,0)))","v":0},{"$f":"IF(INTRO!$E$39<>\"Non endémique\", 0, IF(INTRO!$E$37=\"Non endémique\",0,IF(COUNTRY_INFO!$H55=1,COUNTRY_INFO!G55,0)))","v":0},0,{"$f":"IF(INTRO!$E$39=\"Non endémique\",IF(INTRO!$E$37=\"Non endémique\",\"Non requis\",COUNTRY_INFO!V55),\"Traiter avec IVM\")","v":"Traiter avec IVM"},0,0,null,0]
[{"$f":"IF(INTRO!$E$39<>\"Non endémique\", \" \", IF(INTRO!$E$37=\"Non endémique\",\" \", IF(COUNTRY_INFO!A56=0,\" \",COUNTRY_INFO!A56)))","v":" "},{"$f":"IF(INTRO!$E$39<>\"Non endémique\", \" \", IF(INTRO!$E$37=\"Non endémique\",\" \", IF(COUNTRY_INFO!B56=0,\" \",COUNTRY_INFO!B56)))","v":" "},{"$f":"IF(INTRO!$E$39<>\"Non endémique\", \" \", IF(INTRO!$E$37=\"Non endémique\",\" \", IF(COUNTRY_INFO!C56=0,\" \",COUNTRY_INFO!C56)))","v":" "},{"$f":"IF(INTRO!$E$39<>\"Non endémique\", 0, IF(INTRO!$E$37=\"Non endémique\",0,IF(COUNTRY_INFO!$H56=1,COUNTRY_INFO!E56,0)))","v":0},{"$f":"IF(INTRO!$E$39<>\"Non endémique\", 0, IF(INTRO!$E$37=\"Non endémique\",0,IF(COUNTRY_INFO!$H56=1,COUNTRY_INFO!F56,0)))","v":0},{"$f":"IF(INTRO!$E$39<>\"Non endémique\", 0, IF(INTRO!$E$37=\"Non endémique\",0,IF(COUNTRY_INFO!$H56=1,COUNTRY_INFO!G56,0)))","v":0},0,{"$f":"IF(INTRO!$E$39=\"Non endémique\",IF(INTRO!$E$37=\"Non endémique\",\"Non requis\",COUNTRY_INFO!V56),\"Traiter avec IVM\")","v":"Traiter avec IVM"},0,0,null,0]
[{"$f":"IF(INTRO!$E$39<>\"Non endémique\", \" \", IF(INTRO!$E$37=\"Non endémique\",\" \", IF(COUNTRY_INFO!A57=0,\" \",COUNTRY_INFO!A57)))","v":" "},{"$f":"IF(INTRO!$E$39<>\"Non endémique\", \" \", IF(INTRO!$E$37=\"Non endémique\",\" \", IF(COUNTRY_INFO!B57=0,\" \",COUNTRY_INFO!B57)))","v":" "},{"$f":"IF(INTRO!$E$39<>\"Non endémique\", \" \", IF(INTRO!$E$37=\"Non endémique\",\" \", IF(COUNTRY_INFO!C57=0,\" \",COUNTRY_INFO!C57)))","v":" "},{"$f":"IF(INTRO!$E$39<>\"Non endémique\", 0, IF(INTRO!$E$37=\"Non endémique\",0,IF(COUNTRY_INFO!$H57=1,COUNTRY_INFO!E57,0)))","v":0},{"$f":"IF(INTRO!$E$39<>\"Non endémique\", 0, IF(INTRO!$E$37=\"Non endémique\",0,IF(COUNTRY_INFO!$H57=1,COUNTRY_INFO!F57,0)))","v":0},{"$f":"IF(INTRO!$E$39<>\"Non endémique\", 0, IF(INTRO!$E$37=\"Non endémique\",0,IF(COUNTRY_INFO!$H57=1,COUNTRY_INFO!G57,0)))","v":0},0,{"$f":"IF(INTRO!$E$39=\"Non endémique\",IF(INTRO!$E$37=\"Non endémique\",\"Non requis\",COUNTRY_INFO!V57),\"Traiter avec IVM\")","v":"Traiter avec IVM"},0,0,null,0]
[{"$f":"IF(INTRO!$E$39<>\"Non endémique\", \" \", IF(INTRO!$E$37=\"Non endémique\",\" \", IF(COUNTRY_INFO!A58=0,\" \",COUNTRY_INFO!A58)))","v":" "},{"$f":"IF(INTRO!$E$39<>\"Non endémique\", \" \", IF(INTRO!$E$37=\"Non endémique\",\" \", IF(COUNTRY_INFO!B58=0,\" \",COUNTRY_INFO!B58)))","v":" "},{"$f":"IF(INTRO!$E$39<>\"Non endémique\", \" \", IF(INTRO!$E$37=\"Non endémique\",\" \", IF(COUNTRY_INFO!C58=0,\" \",COUNTRY_INFO!C58)))","v":" "},{"$f":"IF(INTRO!$E$39<>\"Non endémique\", 0, IF(INTRO!$E$37=\"Non endémique\",0,IF(COUNTRY_INFO!$H58=1,COUNTRY_INFO!E58,0)))","v":0},{"$f":"IF(INTRO!$E$39<>\"Non endémique\", 0, IF(INTRO!$E$37=\"Non endémique\",0,IF(COUNTRY_INFO!$H58=1,COUNTRY_INFO!F58,0)))","v":0},{"$f":"IF(INTRO!$E$39<>\"Non endémique\", 0, IF(INTRO!$E$37=\"Non endémique\",0,IF(COUNTRY_INFO!$H58=1,COUNTRY_INFO!G58,0)))","v":0},0,{"$f":"IF(INTRO!$E$39=\"Non endémique\",IF(INTRO!$E$37=\"Non endémique\",\"Non requis\",COUNTRY_INFO!V58),\"Traiter avec IVM\")","v":"Traiter avec IVM"},0,0,null,0]
[{"$f":"IF(INTRO!$E$39<>\"Non endémique\", \" \", IF(INTRO!$E$37=\"Non endémique\",\" \", IF(COUNTRY_INFO!A59=0,\" \",COUNTRY_INFO!A59)))","v":" "},{"$f":"IF(INTRO!$E$39<>\"Non endémique\", \" \", IF(INTRO!$E$37=\"Non endémique\",\" \", IF(COUNTRY_INFO!B59=0,\" \",COUNTRY_INFO!B59)))","v":" "},{"$f":"IF(INTRO!$E$39<>\"Non endémique\", \" \", IF(INTRO!$E$37=\"Non endémique\",\" \", IF(COUNTRY_INFO!C59=0,\" \",COUNTRY_INFO!C59)))","v":" "},{"$f":"IF(INTRO!$E$39<>\"Non endémique\", 0, IF(INTRO!$E$37=\"Non endémique\",0,IF(COUNTRY_INFO!$H59=1,COUNTRY_INFO!E59,0)))","v":0},{"$f":"IF(INTRO!$E$39<>\"Non endémique\", 0, IF(INTRO!$E$37=\"Non endémique\",0,IF(COUNTRY_INFO!$H59=1,COUNTRY_INFO!F59,0)))","v":0},{"$f":"IF(INTRO!$E$39<>\"Non endémique\", 0, IF(INTRO!$E$37=\"Non endémique\",0,IF(COUNTRY_INFO!$H59=1,COUNTRY_INFO!G59,0)))","v":0},0,{"$f":"IF(INTRO!$E$39=\"Non endémique\",IF(INTRO!$E$37=\"Non endémique\",\"Non requis\",COUNTRY_INFO!V59),\"Traiter avec IVM\")","v":"Traiter avec IVM"},0,0,null,0]
[{"$f":"IF(INTRO!$E$39<>\"Non endémique\", \" \", IF(INTRO!$E$37=\"Non endémique\",\" \", IF(COUNTRY_INFO!A60=0,\" \",COUNTRY_INFO!A60)))","v":" "},{"$f":"IF(INTRO!$E$39<>\"Non endémique\", \" \", IF(INTRO!$E$37=\"Non endémique\",\" \", IF(COUNTRY_INFO!B60=0,\" \",COUNTRY_INFO!B60)))","v":" "},{"$f":"IF(INTRO!$E$39<>\"Non endémique\", \" \", IF(INTRO!$E$37=\"Non endémique\",\" \", IF(COUNTRY_INFO!C60=0,\" \",COUNTRY_INFO!C60)))","v":" "},{"$f":"IF(INTRO!$E$39<>\"Non endémique\", 0, IF(INTRO!$E$37=\"Non endémique\",0,IF(COUNTRY_INFO!$H60=1,COUNTRY_INFO!E60,0)))","v":0},{"$f":"IF(INTRO!$E$39<>\"Non endémique\", 0, IF(INTRO!$E$37=\"Non endémique\",0,IF(COUNTRY_INFO!$H60=1,COUNTRY_INFO!F60,0)))","v":0},{"$f":"IF(INTRO!$E$39<>\"Non endémique\", 0, IF(INTRO!$E$37=\"Non endémique\",0,IF(COUNTRY_INFO!$H60=1,COUNTRY_INFO!G60,0)))","v":0},0,{"$f":"IF(INTRO!$E$39=\"Non endémique\",IF(INTRO!$E$37=\"Non endémique\",\"Non requis\",COUNTRY_INFO!V60),\"Traiter avec IVM\")","v":"Traiter avec IVM"},0,0,null,0]
[{"$f":"IF(INTRO!$E$39<>\"Non endémique\", \" \", IF(INTRO!$E$37=\"Non endémique\",\" \", IF(COUNTRY_INFO!A61=0,\" \",COUNTRY_INFO!A61)))","v":" "},{"$f":"IF(INTRO!$E$39<>\"Non endémique\", \" \", IF(INTRO!$E$37=\"Non endémique\",\" \", IF(COUNTRY_INFO!B61=0,\" \",COUNTRY_INFO!B61)))","v":" "},{"$f":"IF(INTRO!$E$39<>\"Non endémique\", \" \", IF(INTRO!$E$37=\"Non endémique\",\" \", IF(COUNTRY_INFO!C61=0,\" \",COUNTRY_INFO!C61)))","v":" "},{"$f":"IF(INTRO!$E$39<>\"Non endémique\", 0, IF(INTRO!$E$37=\"Non endémique\",0,IF(COUNTRY_INFO!$H61=1,COUNTRY_INFO!E61,0)))","v":0},{"$f":"IF(INTRO!$E$39<>\"Non endémique\", 0, IF(INTRO!$E$37=\"Non endémique\",0,IF(COUNTRY_INFO!$H61=1,COUNTRY_INFO!F61,0)))","v":0},{"$f":"IF(INTRO!$E$39<>\"Non endémique\", 0, IF(INTRO!$E$37=\"Non endémique\",0,IF(COUNTRY_INFO!$H61=1,COUNTRY_INFO!G61,0)))","v":0},0,{"$f":"IF(INTRO!$E$39=\"Non endémique\",IF(INTRO!$E$37=\"Non endémique\",\"Non requis\",COUNTRY_INFO!V61),\"Traiter avec IVM\")","v":"Traiter avec IVM"},0,0,null,0]
[{"$f":"IF(INTRO!$E$39<>\"Non endémique\", \" \", IF(INTRO!$E$37=\"Non endémique\",\" \", IF(COUNTRY_INFO!A62=0,\" \",COUNTRY_INFO!A62)))","v":" "},{"$f":"IF(INTRO!$E$39<>\"Non endémique\", \" \", IF(INTRO!$E$37=\"Non endémique\",\" \", IF(COUNTRY_INFO!B62=0,\" \",COUNTRY_INFO!B62)))","v":" "},{"$f":"IF(INTRO!$E$39<>\"Non endémique\", \" \", IF(INTRO!$E$37=\"Non endémique\",\" \", IF(COUNTRY_INFO!C62=0,\" \",COUNTRY_INFO!C62)))","v":" "},{"$f":"IF(INTRO!$E$39<>\"Non endémique\", 0, IF(INTRO!$E$37=\"Non endémique\",0,IF(COUNTRY_INFO!$H62=1,COUNTRY_INFO!E62,0)))","v":0},{"$f":"IF(INTRO!$E$39<>\"Non endémique\", 0, IF(INTRO!$E$37=\"Non endémique\",0,IF(COUNTRY_INFO!$H62=1,COUNTRY_INFO!F62,0)))","v":0},{"$f":"IF(INTRO!$E$39<>\"Non endémique\", 0, IF(INTRO!$E$37=\"Non endémique\",0,IF(COUNTRY_INFO!$H62=1,COUNTRY_INFO!G62,0)))","v":0},0,{"$f":"IF(INTRO!$E$39=\"Non endémique\",IF(INTRO!$E$37=\"Non endémique\",\"Non requis\",COUNTRY_INFO!V62),\"Traiter avec IVM\")","v":"Traiter avec IVM"},0,0,null,0]
[{"$f":"IF(INTRO!$E$39<>\"Non endémique\", \" \", IF(INTRO!$E$37=\"Non endémique\",\" \", IF(COUNTRY_INFO!A63=0,\" \",COUNTRY_INFO!A63)))","v":" "},{"$f":"IF(INTRO!$E$39<>\"Non endémique\", \" \", IF(INTRO!$E$37=\"Non endémique\",\" \", IF(COUNTRY_INFO!B63=0,\" \",COUNTRY_INFO!B63)))","v":" "},{"$f":"IF(INTRO!$E$39<>\"Non endémique\", \" \", IF(INTRO!$E$37=\"Non endémique\",\" \", IF(COUNTRY_INFO!C63=0,\" \",COUNTRY_INFO!C63)))","v":" "},{"$f":"IF(INTRO!$E$39<>\"Non endémique\", 0, IF(INTRO!$E$37=\"Non endémique\",0,IF(COUNTRY_INFO!$H63=1,COUNTRY_INFO!E63,0)))","v":0},{"$f":"IF(INTRO!$E$39<>\"Non endémique\", 0, IF(INTRO!$E$37=\"Non endémique\",0,IF(COUNTRY_INFO!$H63=1,COUNTRY_INFO!F63,0)))","v":0},{"$f":"IF(INTRO!$E$39<>\"Non endémique\", 0, IF(INTRO!$E$37=\"Non endémique\",0,IF(COUNTRY_INFO!$H63=1,COUNTRY_INFO!G63,0)))","v":0},0,{"$f":"IF(INTRO!$E$39=\"Non endémique\",IF(INTRO!$E$37=\"Non endémique\",\"Non requis\",COUNTRY_INFO!V63),\"Traiter avec IVM\")","v":"Traiter avec IVM"},0,0,null,0]
[{"$f":"IF(INTRO!$E$39<>\"Non endémique\", \" \", IF(INTRO!$E$37=\"Non endémique\",\" \", IF(COUNTRY_INFO!A64=0,\" \",COUNTRY_INFO!A64)))","v":" "},{"$f":"IF(INTRO!$E$39<>\"Non endémique\", \" \", IF(INTRO!$E$37=\"Non endémique\",\" \", IF(COUNTRY_INFO!B64=0,\" \",COUNTRY_INFO!B64)))","v":" "},{"$f":"IF(INTRO!$E$39<>\"Non endémique\", \" \", IF(INTRO!$E$37=\"Non endémique\",\" \", IF(COUNTRY_INFO!C64=0,\" \",COUNTRY_INFO!C64)))","v":" "},{"$f":"IF(INTRO!$E$39<>\"Non endémique\", 0, IF(INTRO!$E$37=\"Non endémique\",0,IF(COUNTRY_INFO!$H64=1,COUNTRY_INFO!E64,0)))","v":0},{"$f":"IF(INTRO!$E$39<>\"Non endémique\", 0, IF(INTRO!$E$37=\"Non endémique\",0,IF(COUNTRY_INFO!$H64=1,COUNTRY_INFO!F64,0)))","v":0},{"$f":"IF(INTRO!$E$39<>\"Non endémique\", 0, IF(INTRO!$E$37=\"Non endémique\",0,IF(COUNTRY_INFO!$H64=1,COUNTRY_INFO!G64,0)))","v":0},0,{"$f":"IF(INTRO!$E$39=\"Non endémique\",IF(INTRO!$E$37=\"Non endémique\",\"Non requis\",COUNTRY_INFO!V64),\"Traiter avec IVM\")","v":"Traiter avec IVM"},0,0,null,0]
[{"$f":"IF(INTRO!$E$39<>\"Non endémique\", \" \", IF(INTRO!$E$37=\"Non endémique\",\" \", IF(COUNTRY_INFO!A65=0,\" \",COUNTRY_INFO!A65)))","v":" "},{"$f":"IF(INTRO!$E$39<>\"Non endémique\", \" \", IF(INTRO!$E$37=\"Non endémique\",\" \", IF(COUNTRY_INFO!B65=0,\" \",COUNTRY_INFO!B65)))","v":" "},{"$f":"IF(INTRO!$E$39<>\"Non endémique\", \" \", IF(INTRO!$E$37=\"Non endémique\",\" \", IF(COUNTRY_INFO!C65=0,\" \",COUNTRY_INFO!C65)))","v":" "},{"$f":"IF(INTRO!$E$39<>\"Non endémique\", 0, IF(INTRO!$E$37=\"Non endémique\",0,IF(COUNTRY_INFO!$H65=1,COUNTRY_INFO!E65,0)))","v":0},{"$f":"IF(INTRO!$E$39<>\"Non endémique\", 0, IF(INTRO!$E$37=\"Non endémique\",0,IF(COUNTRY_INFO!$H65=1,COUNTRY_INFO!F65,0)))","v":0},{"$f":"IF(INTRO!$E$39<>\"Non endémique\", 0, IF(INTRO!$E$37=\"Non endémique\",0,IF(COUNTRY_INFO!$H65=1,COUNTRY_INFO!G65,0)))","v":0},0,{"$f":"IF(INTRO!$E$39=\"Non endémique\",IF(INTRO!$E$37=\"Non endémique\",\"Non requis\",COUNTRY_INFO!V65),\"Traiter avec IVM\")","v":"Traiter avec IVM"},0,0,null,0]
[{"$f":"IF(INTRO!$E$39<>\"Non endémique\", \" \", IF(INTRO!$E$37=\"Non endémique\",\" \", IF(COUNTRY_INFO!A66=0,\" \",COUNTRY_INFO!A66)))","v":" "},{"$f":"IF(INTRO!$E$39<>\"Non endémique\", \" \", IF(INTRO!$E$37=\"Non endémique\",\" \", IF(COUNTRY_INFO!B66=0,\" \",COUNTRY_INFO!B66)))","v":" "},{"$f":"IF(INTRO!$E$39<>\"Non endémique\", \" \", IF(INTRO!$E$37=\"Non endémique\",\" \", IF(COUNTRY_INFO!C66=0,\" \",COUNTRY_INFO!C66)))","v":" "},{"$f":"IF(INTRO!$E$39<>\"Non endémique\", 0, IF(INTRO!$E$37=\"Non endémique\",0,IF(COUNTRY_INFO!$H66=1,COUNTRY_INFO!E66,0)))","v":0},{"$f":"IF(INTRO!$E$39<>\"Non endémique\", 0, IF(INTRO!$E$37=\"Non endémique\",0,IF(COUNTRY_INFO!$H66=1,COUNTRY_INFO!F66,0)))","v":0},{"$f":"IF(INTRO!$E$39<>\"Non endémique\", 0, IF(INTRO!$E$37=\"Non endémique\",0,IF(COUNTRY_INFO!$H66=1,COUNTRY_INFO!G66,0)))","v":0},0,{"$f":"IF(INTRO!$E$39=\"Non endémique\",IF(INTRO!$E$37=\"Non endémique\",\"Non requis\",COUNTRY_INFO!V66),\"Traiter avec IVM\")","v":"Traiter avec IVM"},0,0,null,0]
[{"$f":"IF(INTRO!$E$39<>\"Non endémique\", \" \", IF(INTRO!$E$37=\"Non endémique\",\" \", IF(COUNTRY_INFO!A67=0,\" \",COUNTRY_INFO!A67)))","v":" "},{"$f":"IF(INTRO!$E$39<>\"Non endémique\", \" \", IF(INTRO!$E$37=\"Non endémique\",\" \", IF(COUNTRY_INFO!B67=0,\" \",COUNTRY_INFO!B67)))","v":" "},{"$f":"IF(INTRO!$E$39<>\"Non endémique\", \" \", IF(INTRO!$E$37=\"Non endémique\",\" \", IF(COUNTRY_INFO!C67=0,\" \",COUNTRY_INFO!C67)))","v":" "},{"$f":"IF(INTRO!$E$39<>\"Non endémique\", 0, IF(INTRO!$E$37=\"Non endémique\",0,IF(COUNTRY_INFO!$H67=1,COUNTRY_INFO!E67,0)))","v":0},{"$f":"IF(INTRO!$E$39<>\"Non endémique\", 0, IF(INTRO!$E$37=\"Non endémique\",0,IF(COUNTRY_INFO!$H67=1,COUNTRY_INFO!F67,0)))","v":0},{"$f":"IF(INTRO!$E$39<>\"Non endémique\", 0, IF(INTRO!$E$37=\"Non endémique\",0,IF(COUNTRY_INFO!$H67=1,COUNTRY_INFO!G67,0)))","v":0},0,{"$f":"IF(INTRO!$E$39=\"Non endémique\",IF(INTRO!$E$37=\"Non endémique\",\"Non requis\",COUNTRY_INFO!V67),\"Traiter avec IVM\")","v":"Traiter avec IVM"},0,0,null,0]
[{"$f":"IF(INTRO!$E$39<>\"Non endémique\", \" \", IF(INTRO!$E$37=\"Non endémique\",\" \", IF(COUNTRY_INFO!A68=0,\" \",COUNTRY_INFO!A68)))","v":" "},{"$f":"IF(INTRO!$E$39<>\"Non endémique\", \" \", IF(INTRO!$E$37=\"Non endémique\",\" \", IF(COUNTRY_INFO!B68=0,\" \",COUNTRY_INFO!B68)))","v":" "},{"$f":"IF(INTRO!$E$39<>\"Non endémique\", \" \", IF(INTRO!$E$37=\"Non endémique\",\" \", IF(COUNTRY_INFO!C68=0,\" \",COUNTRY_INFO!C68)))","v":" "},{"$f":"IF(INTRO!$E$39<>\"Non endémique\", 0, IF(INTRO!$E$37=\"Non endémique\",0,IF(COUNTRY_INFO!$H68=1,COUNTRY_INFO!E68,0)))","v":0},{"$f":"IF(INTRO!$E$39<>\"Non endémique\", 0, IF(INTRO!$E$37=\"Non endémique\",0,IF(COUNTRY_INFO!$H68=1,COUNTRY_INFO!F68,0)))","v":0},{"$f":"IF(INTRO!$E$39<>\"Non endémique\", 0, IF(INTRO!$E$37=\"Non endémique\",0,IF(COUNTRY_INFO!$H68=1,COUNTRY_INFO!G68,0)))","v":0},0,{"$f":"IF(INTRO!$E$39=\"Non endémique\",IF(INTRO!$E$37=\"Non endémique\",\"Non requis\",COUNTRY_INFO!V68),\"Traiter avec IVM\")","v":"Traiter avec IVM"},0,0,null,0]
[{"$f":"IF(INTRO!$E$39<>\"Non endémique\", \" \", IF(INTRO!$E$37=\"Non endémique\",\" \", IF(COUNTRY_INFO!A69=0,\" \",COUNTRY_INFO!A69)))","v":" "},{"$f":"IF(INTRO!$E$39<>\"Non endémique\", \" \", IF(INTRO!$E$37=\"Non endémique\",\" \", IF(COUNTRY_INFO!B69=0,\" \",COUNTRY_INFO!B69)))","v":" "},{"$f":"IF(INTRO!$E$39<>\"Non endémique\", \" \", IF(INTRO!$E$37=\"Non endémique\",\" \", IF(COUNTRY_INFO!C69=0,\" \",COUNTRY_INFO!C69)))","v":" "},{"$f":"IF(INTRO!$E$39<>\"Non endémique\", 0, IF(INTRO!$E$37=\"Non endémique\",0,IF(COUNTRY_INFO!$H69=1,COUNTRY_INFO!E69,0)))","v":0},{"$f":"IF(INTRO!$E$39<>\"Non endémique\", 0, IF(INTRO!$E$37=\"Non endémique\",0,IF(COUNTRY_INFO!$H69=1,COUNTRY_INFO!F69,0)))","v":0},{"$f":"IF(INTRO!$E$39<>\"Non endémique\", 0, IF(INTRO!$E$37=\"Non endémique\",0,IF(COUNTRY_INFO!$H69=1,COUNTRY_INFO!G69,0)))","v":0},0,{"$f":"IF(INTRO!$E$39=\"Non endémique\",IF(INTRO!$E$37=\"Non endémique\",\"Non requis\",COUNTRY_INFO!V69),\"Traiter avec IVM\")","v":"Traiter avec IVM"},0,0,null,0]
[{"$f":"IF(INTRO!$E$39<>\"Non endémique\", \" \", IF(INTRO!$E$37=\"Non endémique\",\" \", IF(COUNTRY_INFO!A70=0,\" \",COUNTRY_INFO!A70)))","v":" "},{"$f":"IF(INTRO!$E$39<>\"Non endémique\", \" \", IF(INTRO!$E$37=\"Non endémique\",\" \", IF(COUNTRY_INFO!B70=0,\" \",COUNTRY_INFO!B70)))","v":" "},{"$f":"IF(INTRO!$E$39<>\"Non endémique\", \" \", IF(INTRO!$E$37=\"Non endémique\",\" \", IF(COUNTRY_INFO!C70=0,\" \",COUNTRY_INFO!C70)))","v":" "},{"$f":"IF(INTRO!$E$39<>\"Non endémique\", 0, IF(INTRO!$E$37=\"Non endémique\",0,IF(COUNTRY_INFO!$H70=1,COUNTRY_INFO!E70,0)))","v":0},{"$f":"IF(INTRO!$E$39<>\"Non endémique\", 0, IF(INTRO!$E$37=\"Non endémique\",0,IF(COUNTRY_INFO!$H70=1,COUNTRY_INFO!F70,0)))","v":0},{"$f":"IF(INTRO!$E$39<>\"Non endémique\", 0, IF(INTRO!$E$37=\"Non endémique\",0,IF(COUNTRY_INFO!$H70=1,COUNTRY_INFO!G70,0)))","v":0},0,{"$f":"IF(INTRO!$E$39=\"Non endémique\",IF(INTRO!$E$37=\"Non endémique\",\"Non requis\",COUNTRY_INFO!V70),\"Traiter avec IVM\")","v":"Traiter avec IVM"},0,0,null,0]
[{"$f":"IF(INTRO!$E$39<>\"Non endémique\", \" \", IF(INTRO!$E$37=\"Non endémique\",\" \", IF(COUNTRY_INFO!A71=0,\" \",COUNTRY_INFO!A71)))","v":" "},{"$f":"IF(INTRO!$E$39<>\"Non endémique\", \" \", IF(INTRO!$E$37=\"Non endémique\",\" \", IF(COUNTRY_INFO!B71=0,\" \",COUNTRY_INFO!B71)))","v":" "},{"$f":"IF(INTRO!$E$39<>\"Non endémique\", \" \", IF(INTRO!$E$37=\"Non endémique\",\" \", IF(COUNTRY_INFO!C71=0,\" \",COUNTRY_INFO!C71)))","v":" "},{"$f":"IF(INTRO!$E$39<>\"Non endémique\", 0, IF(INTRO!$E$37=\"Non endémique\",0,IF(COUNTRY_INFO!$H71=1,COUNTRY_INFO!E71,0)))","v":0},{"$f":"IF(INTRO!$E$39<>\"Non endémique\", 0, IF(INTRO!$E$37=\"Non endémique\",0,IF(COUNTRY_INFO!$H71=1,COUNTRY_INFO!F71,0)))","v":0},{"$f":"IF(INTRO!$E$39<>\"Non endémique\", 0, IF(INTRO!$E$37=\"Non endémique\",0,IF(COUNTRY_INFO!$H71=1,COUNTRY_INFO!G71,0)))","v":0},0,{"$f":"IF(INTRO!$E$39=\"Non endémique\",IF(INTRO!$E$37=\"Non endémique\",\"Non requis\",COUNTRY_INFO!V71),\"Traiter avec IVM\")","v":"Traiter avec IVM"},0,0,null,0]
[{"$f":"IF(INTRO!$E$39<>\"Non endémique\", \" \", IF(INTRO!$E$37=\"Non endémique\",\" \", IF(COUNTRY_INFO!A72=0,\" \",COUNTRY_INFO!A72)))","v":" "},{"$f":"IF(INTRO!$E$39<>\"Non endémique\", \" \", IF(INTRO!$E$37=\"Non endémique\",\" \", IF(COUNTRY_INFO!B72=0,\" \",COUNTRY_INFO!B72)))","v":" "},{"$f":"IF(INTRO!$E$39<>\"Non endémique\", \" \", IF(INTRO!$E$37=\"Non endémique\",\" \", IF(COUNTRY_INFO!C72=0,\" \",COUNTRY_INFO!C72)))","v":" "},{"$f":"IF(INTRO!$E$39<>\"Non endémique\", 0, IF(INTRO!$E$37=\"Non endémique\",0,IF(COUNTRY_INFO!$H72=1,COUNTRY_INFO!E72,0)))","v":0},{"$f":"IF(INTRO!$E$39<>\"Non endémique\", 0, IF(INTRO!$E$37=\"Non endémique\",0,IF(COUNTRY_INFO!$H72=1,COUNTRY_INFO!F72,0)))","v":0},{"$f":"IF(INTRO!$E$39<>\"Non endémique\", 0, IF(INTRO!$E$37=\"Non endémique\",0,IF(COUNTRY_INFO!$H72=1,COUNTRY_INFO!G72,0)))","v":0},0,{"$f":"IF(INTRO!$E$39=\"Non endémique\",IF(INTRO!$E$37=\"Non endémique\",\"Non requis\",COUNTRY_INFO!V72),\"Traiter avec IVM\")","v":"Traiter avec IVM"},0,0,null,0]
[{"$f":"IF(INTRO!$E$39<>\"Non endémique\", \" \", IF(INTRO!$E$37=\"Non endémique\",\" \", IF(COUNTRY_INFO!A73=0,\" \",COUNTRY_INFO!A73)))","v":" "},{"$f":"IF(INTRO!$E$39<>\"Non endémique\", \" \", IF(INTRO!$E$37=\"Non endémique\",\" \", IF(COUNTRY_INFO!B73=0,\" \",COUNTRY_INFO!B73)))","v":" "},{"$f":"IF(INTRO!$E$39<>\"Non endémique\", \" \", IF(INTRO!$E$37=\"Non endémique\",\" \", IF(COUNTRY_INFO!C73=0,\" \",COUNTRY_INFO!C73)))","v":" "},{"$f":"IF(INTRO!$E$39<>\"Non endémique\", 0, IF(INTRO!$E$37=\"Non endémique\",0,IF(COUNTRY_INFO!$H73=1,COUNTRY_INFO!E73,0)))","v":0},{"$f":"IF(INTRO!$E$39<>\"Non endémique\", 0, IF(INTRO!$E$37=\"Non endémique\",0,IF(COUNTRY_INFO!$H73=1,COUNTRY_INFO!F73,0)))","v":0},{"$f":"IF(INTRO!$E$39<>\"Non endémique\", 0, IF(INTRO!$E$37=\"Non endémique\",0,IF(COUNTRY_INFO!$H73=1,COUNTRY_INFO!G73,0)))","v":0},0,{"$f":"IF(INTRO!$E$39=\"Non endémique\",IF(INTRO!$E$37=\"Non endémique\",\"Non requis\",COUNTRY_INFO!V73),\"Traiter avec IVM\")","v":"Traiter avec IVM"},0,0,null,0]
[{"$f":"IF(INTRO!$E$39<>\"Non endémique\", \" \", IF(INTRO!$E$37=\"Non endémique\",\" \", IF(COUNTRY_INFO!A74=0,\" \",COUNTRY_INFO!A74)))","v":" "},{"$f":"IF(INTRO!$E$39<>\"Non endémique\", \" \", IF(INTRO!$E$37=\"Non endémique\",\" \", IF(COUNTRY_INFO!B74=0,\" \",COUNTRY_INFO!B74)))","v":" "},{"$f":"IF(INTRO!$E$39<>\"Non endémique\", \" \", IF(INTRO!$E$37=\"Non endémique\",\" \", IF(COUNTRY_INFO!C74=0,\" \",COUNTRY_INFO!C74)))","v":" "},{"$f":"IF(INTRO!$E$39<>\"Non endémique\", 0, IF(INTRO!$E$37=\"Non endémique\",0,IF(COUNTRY_INFO!$H74=1,COUNTRY_INFO!E74,0)))","v":0},{"$f":"IF(INTRO!$E$39<>\"Non endémique\", 0, IF(INTRO!$E$37=\"Non endémique\",0,IF(COUNTRY_INFO!$H74=1,COUNTRY_INFO!F74,0)))","v":0},{"$f":"IF(INTRO!$E$39<>\"Non endémique\", 0, IF(INTRO!$E$37=\"Non endémique\",0,IF(COUNTRY_INFO!$H74=1,COUNTRY_INFO!G74,0)))","v":0},0,{"$f":"IF(INTRO!$E$39=\"Non endémique\",IF(INTRO!$E$37=\"Non endémique\",\"Non requis\",COUNTRY_INFO!V74),\"Traiter avec IVM\")","v":"Traiter avec IVM"},0,0,null,0]
[{"$f":"IF(INTRO!$E$39<>\"Non endémique\", \" \", IF(INTRO!$E$37=\"Non endémique\",\" \", IF(COUNTRY_INFO!A75=0,\" \",COUNTRY_INFO!A75)))","v":" "},{"$f":"IF(INTRO!$E$39<>\"Non endémique\", \" \", IF(INTRO!$E$37=\"Non endémique\",\" \", IF(COUNTRY_INFO!B75=0,\" \",COUNTRY_INFO!B75)))","v":" "},{"$f":"IF(INTRO!$E$39<>\"Non endémique\", \" \", IF(INTRO!$E$37=\"Non endémique\",\" \", IF(COUNTRY_INFO!C75=0,\" \",COUNTRY_INFO!C75)))","v":" "},{"$f":"IF(INTRO!$E$39<>\"Non endémique\", 0, IF(INTRO!$E$37=\"Non endémique\",0,IF(COUNTRY_INFO!$H75=1,COUNTRY_INFO!E75,0)))","v":0},{"$f":"IF(INTRO!$E$39<>\"Non endémique\", 0, IF(INTRO!$E$37=\"Non endémique\",0,IF(COUNTRY_INFO!$H75=1,COUNTRY_INFO!F75,0)))","v":0},{"$f":"IF(INTRO!$E$39<>\"Non endémique\", 0, IF(INTRO!$E$37=\"Non endémique\",0,IF(COUNTRY_INFO!$H75=1,COUNTRY_INFO!G75,0)))","v":0},{"$f":"SUM(D75:F75)","v":0},{"$f":"IF(INTRO!$E$39=\"Non endémique\",IF(INTRO!$E$37=\"Non endémique\",\"Non requis\",COUNTRY_INFO!V75),\"Traiter avec IVM\")","v":"Traiter avec IVM"},{"$f":"IF(H75=1,G75,0)","v":0},{"$f":"IF(I75>0,I75*2.5,0)","v":0},null,0]
[{"$f":"IF(INTRO!$E$39<>\"Non endémique\", \" \", IF(INTRO!$E$37=\"Non endémique\",\" \", IF(COUNTRY_INFO!A76=0,\" \",COUNTRY_INFO!A76)))","v":" "},{"$f":"IF(INTRO!$E$39<>\"Non endémique\", \" \", IF(INTRO!$E$37=\"Non endémique\",\" \", IF(COUNTRY_INFO!B76=0,\" \",COUNTRY_INFO!B76)))","v":" "},{"$f":"IF(INTRO!$E$39<>\"Non endémique\", \" \", IF(INTRO!$E$37=\"Non endémique\",\" \", IF(COUNTRY_INFO!C76=0,\" \",COUNTRY_INFO!C76)))","v":" "},{"$f":"IF(INTRO!$E$39<>\"Non endémique\", 0, IF(INTRO!$E$37=\"Non endémique\",0,IF(COUNTRY_INFO!$H76=1,COUNTRY_INFO!E76,0)))","v":0},{"$f":"IF(INTRO!$E$39<>\"Non endémique\", 0, IF(INTRO!$E$37=\"Non endémique\",0,IF(COUNTRY_INFO!$H76=1,COUNTRY_INFO!F76,0)))","v":0},{"$f":"IF(INTRO!$E$39<>\"Non endémique\", 0, IF(INTRO!$E$37=\"Non endémique\",0,IF(COUNTRY_INFO!$H76=1,COUNTRY_INFO!G76,0)))","v":0},0,{"$f":"IF(INTRO!$E$39=\"Non endémique\",IF(INTRO!$E$37=\"Non endémique\",\"Non requis\",COUNTRY_INFO!V76),\"Traiter avec IVM\")","v":"Traiter avec IVM"},0,0,null,0]
[{"$f":"IF(INTRO!$E$39<>\"Non endémique\", \" \", IF(INTRO!$E$37=\"Non endémique\",\" \", IF(COUNTRY_INFO!A77=0,\" \",COUNTRY_INFO!A77)))","v":" "},{"$f":"IF(INTRO!$E$39<>\"Non endémique\", \" \", IF(INTRO!$E$37=\"Non endémique\",\" \", IF(COUNTRY_INFO!B77=0,\" \",COUNTRY_INFO!B77)))","v":" "},{"$f":"IF(INTRO!$E$39<>\"Non endémique\", \" \", IF(INTRO!$E$37=\"Non endémique\",\" \", IF(COUNTRY_INFO!C77=0,\" \",COUNTRY_INFO!C77)))","v":" "},{"$f":"IF(INTRO!$E$39<>\"Non endémique\", 0, IF(INTRO!$E$37=\"Non endémique\",0,IF(COUNTRY_INFO!$H77=1,COUNTRY_INFO!E77,0)))","v":0},{"$f":"IF(INTRO!$E$39<>\"Non endémique\", 0, IF(INTRO!$E$37=\"Non endémique\",0,IF(COUNTRY_INFO!$H77=1,COUNTRY_INFO!F77,0)))","v":0},{"$f":"IF(INTRO!$E$39<>\"Non endémique\", 0, IF(INTRO!$E$37=\"Non endémique\",0,IF(COUNTRY_INFO!$H77=1,COUNTRY_INFO!G77,0)))","v":0},0,{"$f":"IF(INTRO!$E$39=\"Non endémique\",IF(INTRO!$E$37=\"Non endémique\",\"Non requis\",COUNTRY_INFO!V77),\"Traiter avec IVM\")","v":"Traiter avec IVM"},0,0,null,0]
[{"$f":"IF(INTRO!$E$39<>\"Non endémique\", \" \", IF(INTRO!$E$37=\"Non endémique\",\" \", IF(COUNTRY_INFO!A78=0,\" \",COUNTRY_INFO!A78)))","v":" "},{"$f":"IF(INTRO!$E$39<>\"Non endémique\", \" \", IF(INTRO!$E$37=\"Non endémique\",\" \", IF(COUNTRY_INFO!B78=0,\" \",COUNTRY_INFO!B78)))","v":" "},{"$f":"IF(INTRO!$E$39<>\"Non endémique\", \" \", IF(INTRO!$E$37=\"Non endémique\",\" \", IF(COUNTRY_INFO!C78=0,\" \",COUNTRY_INFO!C78)))","v":" "},{"$f":"IF(INTRO!$E$39<>\"Non endémique\", 0, IF(INTRO!$E$37=\"Non endémique\",0,IF(COUNTRY_INFO!$H78=1,COUNTRY_INFO!E78,0)))","v":0},{"$f":"IF(INTRO!$E$39<>\"Non endémique\", 0, IF(INTRO!$E$37=\"Non endémique\",0,IF(COUNTRY_INFO!$H78=1,COUNTRY_INFO!F78,0)))","v":0},{"$f":"IF(INTRO!$E$39<>\"Non endémique\", 0, IF(INTRO!$E$37=\"Non endémique\",0,IF(COUNTRY_INFO!$H78=1,COUNTRY_INFO!G78,0)))","v":0},0,{"$f":"IF(INTRO!$E$39=\"Non endémique\",IF(INTRO!$E$37=\"Non endémique\",\"Non requis\",COUNTRY_INFO!V78),\"Traiter avec IVM\")","v":"Traiter avec IVM"},0,0,null,0]
[{"$f":"IF(INTRO!$E$39<>\"Non endémique\", \" \", IF(INTRO!$E$37=\"Non endémique\",\" \", IF(COUNTRY_INFO!A79=0,\" \",COUNTRY_INFO!A79)))","v":" "},{"$f":"IF(INTRO!$E$39<>\"Non endémique\", \" \", IF(INTRO!$E$37=\"Non endémique\",\" \", IF(COUNTRY_INFO!B79=0,\" \",COUNTRY_INFO!B79)))","v":" "},{"$f":"IF(INTRO!$E$39<>\"Non endémique\", \" \", IF(INTRO!$E$37=\"Non endémique\",\" \", IF(COUNTRY_INFO!C79=0,\" \",COUNTRY_INFO!C79)))","v":" "},{"$f":"IF(INTRO!$E$39<>\"Non endémique\", 0, IF(INTRO!$E$37=\"Non endémique\",0,IF(COUNTRY_INFO!$H79=1,COUNTRY_INFO!E79,0)))","v":0},{"$f":"IF(INTRO!$E$39<>\"Non endémique\", 0, IF(INTRO!$E$37=\"Non endémique\",0,IF(COUNTRY_INFO!$H79=1,COUNTRY_INFO!F79,0)))","v":0},{"$f":"IF(INTRO!$E$39<>\"Non endémique\", 0, IF(INTRO!$E$37=\"Non endémique\",0,IF(COUNTRY_INFO!$H79=1,COUNTRY_INFO!G79,0)))","v":0},0,{"$f":"IF(INTRO!$E$39=\"Non endémique\",IF(INTRO!$E$37=\"Non endémique\",\"Non requis\",COUNTRY_INFO!V79),\"Traiter avec IVM\")","v":"Traiter avec IVM"},0,0,null,0]
[{"$f":"IF(INTRO!$E$39<>\"Non endémique\", \" \", IF(INTRO!$E$37=\"Non endémique\",\" \", IF(COUNTRY_INFO!A80=0,\" \",COUNTRY_INFO!A80)))","v":" "},{"$f":"IF(INTRO!$E$39<>\"Non endémique\", \" \", IF(INTRO!$E$37=\"Non endémique\",\" \", IF(COUNTRY_INFO!B80=0,\" \",COUNTRY_INFO!B80)))","v":" "},{"$f":"IF(INTRO!$E$39<>\"Non endémique\", \" \", IF(INTRO!$E$37=\"Non endémique\",\" \", IF(COUNTRY_INFO!C80=0,\" \",COUNTRY_INFO!C80)))","v":" "},{"$f":"IF(INTRO!$E$39<>\"Non endémique\", 0, IF(INTRO!$E$37=\"Non endémique\",0,IF(COUNTRY_INFO!$H80=1,COUNTRY_INFO!E80,0)))","v":0},{"$f":"IF(INTRO!$E$39<>\"Non endémique\", 0, IF(INTRO!$E$37=\"Non endémique\",0,IF(COUNTRY_INFO!$H80=1,COUNTRY_INFO!F80,0)))","v":0},{"$f":"IF(INTRO!$E$39<>\"Non endémique\", 0, IF(INTRO!$E$37=\"Non endémique\",0,IF(COUNTRY_INFO!$H80=1,COUNTRY_INFO!G80,0)))","v":0},0,{"$f":"IF(INTRO!$E$39=\"Non endémique\",IF(INTRO!$E$37=\"Non endémique\",\"Non requis\",COUNTRY_INFO!V80),\"Traiter avec IVM\")","v":"Traiter avec IVM"},0,0,null,0]
[{"$f":"IF(INTRO!$E$39<>\"Non endémique\", \" \", IF(INTRO!$E$37=\"Non endémique\",\" \", IF(COUNTRY_INFO!A81=0,\" \",COUNTRY_INFO!A81)))","v":" "},{"$f":"IF(INTRO!$E$39<>\"Non endémique\", \" \", IF(INTRO!$E$37=\"Non endémique\",\" \", IF(COUNTRY_INFO!B81=0,\" \",COUNTRY_INFO!B81)))","v":" "},{"$f":"IF(INTRO!$E$39<>\"Non endémique\", \" \", IF(INTRO!$E$37=\"Non endémique\",\" \", IF(COUNTRY_INFO!C81=0,\" \",COUNTRY_INFO!C81)))","v":" "},{"$f":"IF(INTRO!$E$39<>\"Non endémique\", 0, IF(INTRO!$E$37=\"Non endémique\",0,IF(COUNTRY_INFO!$H81=1,COUNTRY_INFO!E81,0)))","v":0},{"$f":"IF(INTRO!$E$39<>\"Non endémique\", 0, IF(INTRO!$E$37=\"Non endémique\",0,IF(COUNTRY_INFO!$H81=1,COUNTRY_INFO!F81,0)))","v":0},{"$f":"IF(INTRO!$E$39<>\"Non endémique\", 0, IF(INTRO!$E$37=\"Non endémique\",0,IF(COUNTRY_INFO!$H81=1,COUNTRY_INFO!G81,0)))","v":0},0,{"$f":"IF(INTRO!$E$39=\"Non endémique\",IF(INTRO!$E$37=\"Non endémique\",\"Non requis\",COUNTRY_INFO!V81),\"Traiter avec IVM\")","v":"Traiter avec IVM"},0,0,null,0]

{"sheet":"ALB_MBD","index":3,"n_rows":81,"n_cols":21,"rows_kept":81,"cut":false,"hidden":false,"merged":[[6,9,6,10],[6,11,7,11],[0,6,0,10],[1,6,1,7],[1,9,1,10],[5,6,5,11],[6,6,6,7],[3,0,3,2],[3,3,3,4],[5,0,5,2],[5,3,5,4],[5,5,7,5],[6,0,7,0],[6,1,7,1],[6,2,7,2],[6,3,7,3],[6,4,7,4],[5,12,5,17],[6,20,7,20],[5,18,5,20],[6,18,7,18],[6,19,7,19],[6,16,7,16],[6,17,7,17],[6,15,7,15],[6,12,7,12],[6,13,7,13],[6,14,7,14]]}
["Albendazole (ALB) et Mebendazole (MBD)",null,null,null,null,null,"Choisir le médicament pour le traitement de STH \npour chaque groupe d'âge"]
["Structure administrative, population ciblée par groupe d'âge, plan de traitement et information sur les comprimés",null,null,null,null,null,null,null,"ALB"]
[]
["TOTAL",null,null,null,null,{"$f":"SUBTOTAL(9,F$10:F$1010)","v":0},null,{"$f":"SUBTOTAL(9,H$10:H$1010)","v":0},0,null,0,0,0,0,0,0,0,0,0,0,0]
[]
["Structure administrative du pays",null,null,"Plan de traitement",null,"Population couverte par le PEFL avec ALB","Population cible pour STH",null,null,null,null,null,"Albendazole (ALB)",null,null,null,null,null,"Mebendazole (MBD)"]
["Pays","Région/Département","District","FL","STH",null,"EAPréS",null,"EAS","FAP",null,"Total","Total requis (FL)","Reste en stock (FL)","Comprimés devant être fournis (FL)","Total requis (STH)","Reste en stock (STH)","Comprimés devant être fournis (STH)","Total requis","Reste en stock","Comprimés devant être fournis"]
[null,null,null,null,null,null,"Tournées","Personnes","Personnes","Tournées","Personnes"]
[]
[{"$f":"IF(AND(INTRO!$E$37=\"Non endémique\",INTRO!$E$41=\"Non endémique\"),\" \",IF(COUNTRY_INFO!A10=0,\" \",COUNTRY_INFO!A10))","v":"NIGER"},{"$f":"IF(AND(INTRO!$E$37=\"Non endémique\",INTRO!$E$41=\"Non endémique\"),\" \",IF(COUNTRY_INFO!B10=0,\" \",COUNTRY_INFO!B10))","v":"Agadez"},{"$f":"IF(AND(INTRO!$E$37=\"Non endémique\",INTRO!$E$41=\"Non endémique\"),\" \",IF(COUNTRY_INFO!C10=0,\" \",COUNTRY_INFO!C10))","v":"Agadez"},{"$f":"IF(AND(INTRO!$E$37=\"Non endémique\",INTRO!$E$41=\"Non endémique\"),0,COUNTRY_INFO!V10)","v":0},{"$f":"IF(AND(INTRO!$E$37=\"Non endémique\",INTRO!$E$41=\"Non endémique\"),0,COUNTRY_INFO!X10)","v":0},{"$f":"IF(INTRO!$E$39=\"Non endémique\",IF($D10=1,DEC!I10,0),IF($D10=1,IVM!G10,0))","v":0},null,{"$f":"IF(OR(COUNTRY_INFO!N10=\"Inconnu\",COUNTRY_INFO!N10=\"Surveillance\",COUNTRY_INFO!N10=\"Non requis\",COUNTRY_INFO!N10=0),0,IF(INTRO!$E$39=\"Non endémique\",IF(AND($E10<>0,$G10=\"\"),IF($F10=0,COUNTRY_INFO!N10*$E10,COUNTRY_INFO!N10*($E10-$D10)),IF(AND($E10<>0,$G10<>0),IF($F10=0,COUNTRY_INFO!N10*$G10,COUNTRY_INFO!N10*($G10-$D10)),0)),IF($G10=\"\",COUNTRY_INFO!N10*$E10,COUNTRY_INFO!N10*$G10)))","v":0},{"$f":"IF(OR(COUNTRY_INFO!O10=\"Inconnu\",COUNTRY_INFO!O10=\"Surveillance\",COUNTRY_INFO!O10=\"Non requis\",COUNTRY_INFO!O10=0),0,IF($E10<>0, IF($F10=0,COUNTRY_INFO!O10*$E10,COUNTRY_INFO!O10*($E10-$D10)),COUNTRY_INFO!O10*$E10))","v":0},null,{"$f":"IF(OR(COUNTRY_INFO!P10=\"Inconnu\",COUNTRY_INFO!P10=\"Surveillance\",COUNTRY_INFO!P10=\"Non requis\",COUNTRY_INFO!P10=0),0,IF(AND($E10<>0,$J10=\"\"),IF($F10=0,COUNTRY_INFO!P10*$E10,COUNTRY_INFO!P10*($E10-$D10)), IF(AND($E10<>0,$J10<>0),IF($F10=0,COUNTRY_INFO!P10*$J10,COUNTRY_INFO!P10*($J10-$D10)), COUNTRY_INFO!P10*$J10)))","v":0},{"$f":"ROUND($H10,0)+ROUND($I10,0)+ROUND($K10,0)","v":0},{"$f":"$F10","v":0},null,{"$f":"IF($M10>$N10, $M10-$N10,0)","v":0},{"$f":"ROUND((IF($G$2=\"ALB\",$H10,0)+IF($I$2=\"ALB\",$I10,0)+IF($J$2=\"ALB\",$K10,0)),0)","v":0},null,{"$f":"IF($P10>$Q10,$P10-$Q10,0)","v":0},{"$f":"ROUND((IF($G$2=\"MBD\",$H10,0)+IF($I$2=\"MBD\",$I10,0)+IF($J$2=\"MBD\",$K10,0)),0)","v":0},null,{"$f":"IF($S10>$T10,$S10-$T10,0)","v":0}]
[{"$f":"IF(AND(INTRO!$E$37=\"Non endémique\",INTRO!$E$41=\"Non endémique\"),\" \",IF(COUNTRY_INFO!A11=0,\" \",COUNTRY_INFO!A11))","v":"NIGER"},{"$f":"IF(AND(INTRO!$E$37=\"Non endémique\",INTRO!$E$41=\"Non endémique\"),\" \",IF(COUNTRY_INFO!B11=0,\" \",COUNTRY_INFO!B11))","v":"Agadez"},{"$f":"IF(AND(INTRO!$E$37=\"Non endémique\",INTRO!$E$41=\"Non endémique\"),\" \",IF(COUNTRY_INFO!C11=0,\" \",COUNTRY_INFO!C11))","v":"Arlit"},{"$f":"IF(AND(INTRO!$E$37=\"Non endémique\",INTRO!$E$41=\"Non endémique\"),0,COUNTRY_INFO!V11)","v":0},{"$f":"IF(AND(INTRO!$E$37=\"Non endémique\",INTRO!$E$41=\"Non endémique\"),0,COUNTRY_INFO!X11)","v":0},{"$f":"IF(INTRO!$E$39=\"Non endémique\",IF($D11=1,DEC!I11,0),IF($D11=1,IVM!G11,0))","v":0},null,{"$f":"IF(OR(COUNTRY_INFO!N11=\"Inconnu\",COUNTRY_INFO!N11=\"Surveillance\",COUNTRY_INFO!N11=\"Non requis\",COUNTRY_INFO!N11=0),0,IF(INTRO!$E$39=\"Non endémique\",IF(AND($E11<>0,$G11=\"\"),IF($F11=0,COUNTRY_INFO!N11*$E11,COUNTRY_INFO!N11*($E11-$D11)),IF(AND($E11<>0,$G11<>0),IF($F11=0,COUNTRY_INFO!N11*$G11,COUNTRY_INFO!N11*($G11-$D11)),0)),IF($G11=\"\",COUNTRY_INFO!N11*$E11,COUNTRY_INFO!N11*$G11)))","v":0},{"$f":"IF(OR(COUNTRY_INFO!O11=\"Inconnu\",COUNTRY_INFO!O11=\"Surveillance\",COUNTRY_INFO!O11=\"Non requis\",COUNTRY_INFO!O11=0),0,IF($E11<>0, IF($F11=0,COUNTRY_INFO!O11*$E11,COUNTRY_INFO!O11*($E11-$D11)),COUNTRY_INFO!O11*$E11))","v":0},null,{"$f":"IF(OR(COUNTRY_INFO!P11=\"Inconnu\",COUNTRY_INFO!P11=\"Surveillance\",COUNTRY_INFO!P11=\"Non requis\",COUNTRY_INFO!P11=0),0,IF(AND($E11<>0,$J11=\"\"),IF($F11=0,COUNTRY_INFO!P11*$E11,COUNTRY_INFO!P11*($E11-$D11)), IF(AND($E11<>0,$J11<>0),IF($F11=0,COUNTRY_INFO!P11*$J11,COUNTRY_INFO!P11*($J11-$D11)), COUNTRY_INFO!P11*$J11)))","v":0},0,0,null,0,0,null,0,0,null,0]
[{"$f":"IF(AND(INTRO!$E$37=\"Non endémique\",INTRO!$E$41=\"Non endémique\"),\" \",IF(COUNTRY_INFO!A12=0,\" \",COUNTRY_INFO!A12))","v":"NIGER"},{"$f":"IF(AND(INTRO!$E$37=\"Non endémique\",INTRO!$E$41=\"Non endémique\"),\" \",IF(COUNTRY_INFO!B12=0,\" \",COUNTRY_INFO!B12))","v":"Agadez"},{"$f":"IF(AND(INTRO!$E$37=\"Non endémique\",INTRO!$E$41=\"Non endémique\"),\" \",IF(COUNTRY_INFO!C12=0,\" \",COUNTRY_INFO!C12))","v":"Iférouane"},{"$f":"IF(AND(INTRO!$E$37=\"Non endémique\",INTRO!$E$41=\"Non endémique\"),0,COUNTRY_INFO!V12)","v":0},{"$f":"IF(AND(INTRO!$E$37=\"Non endémique\",INTRO!$E$41=\"Non endémique\"),0,COUNTRY_INFO!X12)","v":0},{"$f":"IF(INTRO!$E$39=\"Non endémique\",IF($D12=1,DEC!I12,0),IF($D12=1,IVM!G12,0))","v":0},null,{"$f":"IF(OR(COUNTRY_INFO!N12=\"Inconnu\",COUNTRY_INFO!N12=\"Surveillance\",COUNTRY_INFO!N12=\"Non requis\",COUNTRY_INFO!N12=0),0,IF(INTRO!$E$39=\"Non endémique\",IF(AND($E12<>0,$G12=\"\"),IF($F12=0,COUNTRY_INFO!N12*$E12,COUNTRY_INFO!N12*($E12-$D12)),IF(AND($E12<>0,$G12<>0),IF($F12=0,COUNTRY_INFO!N12*$G12,COUNTRY_INFO!N12*($G12-$D12)),0)),IF($G12=\"\",COUNTRY_INFO!N12*$E12,COUNTRY_INFO!N12*$G12)))","v":0},{"$f":"IF(OR(COUNTRY_INFO!O12=\"Inconnu\",COUNTRY_INFO!O12=\"Surveillance\",COUNTRY_INFO!O12=\"Non requis\",COUNTRY_INFO!O12=0),0,IF($E12<>0, IF($F12=0,COUNTRY_INFO!O12*$E12,COUNTRY_INFO!O12*($E12-$D12)),COUNTRY_INFO!O12*$E12))","v":0},null,{"$f":"IF(OR(COUNTRY_INFO!P12=\"Inconnu\",COUNTRY_INFO!P12=\"Surveillance\",COUNTRY_INFO!P12=\"Non requis\",COUNTRY_INFO!P12=0),0,IF(AND($E12<>0,$J12=\"\"),IF($F12=0,COUNTRY_INFO!P12*$E12,COUNTRY_INFO!P12*($E12-$D12)), IF(AND($E12<>0,$J12<>0),IF($F12=0,COUNTRY_INFO!P12*$J12,COUNTRY_INFO!P12*($J12-$D12)), COUNTRY_INFO!P12*$J12)))","v":0},0,0,null,0,0,null,0,0,null,0]
[{"$f":"IF(AND(INTRO!$E$37=\"Non endémique\",INTRO!$E$41=\"Non endémique\"),\" \",IF(COUNTRY_INFO!A13=0,\" \",COUNTRY_INFO!A13))","v":"NIGER"},{"$f":"IF(AND(INTRO!$E$37=\"Non endémique\",INTRO!$E$41=\"Non endémique\"),\" \",IF(COUNTRY_INFO!B13=0,\" \",COUNTRY_INFO!B13))","v":"Agadez"},{"$f":"IF(AND(INTRO!$E$37=\"Non endémique\",INTRO!$E$41=\"Non endémique\"),\" \",IF(COUNTRY_INFO!C13=0,\" \",COUNTRY_INFO!C13))","v":"Bilma"},{"$f":"IF(AND(INTRO!$E$37=\"Non endémique\",INTRO!$E$41=\"Non endémique\"),0,COUNTRY_INFO!V13)","v":0},{"$f":"IF(AND(INTRO!$E$37=\"Non endémique\",INTRO!$E$41=\"Non endémique\"),0,COUNTRY_INFO!X13)","v":0},{"$f":"IF(INTRO!$E$39=\"Non endémique\",IF($D13=1,DEC!I13,0),IF($D13=1,IVM!G13,0))","v":0},null,{"$f":"IF(OR(COUNTRY_INFO!N13=\"Inconnu\",COUNTRY_INFO!N13=\"Surveillance\",COUNTRY_INFO!N13=\"Non requis\",COUNTRY_INFO!N13=0),0,IF(INTRO!$E$39=\"Non endémique\",IF(AND($E13<>0,$G13=\"\"),IF($F13=0,COUNTRY_INFO!N13*$E13,COUNTRY_INFO!N13*($E13-$D13)),IF(AND($E13<>0,$G13<>0),IF($F13=0,COUNTRY_INFO!N13*$G13,COUNTRY_INFO!N13*($G13-$D13)),0)),IF($G13=\"\",COUNTRY_INFO!N13*$E13,COUNTRY_INFO!N13*$G13)))","v":0},{"$f":"IF(OR(COUNTRY_INFO!O13=\"Inconnu\",COUNTRY_INFO!O13=\"Surveillance\",COUNTRY_INFO!O13=\"Non requis\",COUNTRY_INFO!O13=0),0,IF($E13<>0, IF($F13=0,COUNTRY_INFO!O13*$E13,COUNTRY_INFO!O13*($E13-$D13)),COUNTRY_INFO!O13*$E13))","v":0},null,{"$f":"IF(OR(COUNTRY_INFO!P13=\"Inconnu\",COUNTRY_INFO!P13=\"Surveillance\",COUNTRY_INFO!P13=\"Non requis\",COUNTRY_INFO!P13=0),0,IF(AND($E13<>0,$J13=\"\"),IF($F13=0,COUNTRY_INFO!P13*$E13,COUNTRY_INFO!P13*($E13-$D13)), IF(AND($E13<>0,$J13<>0),IF($F13=0,COUNTRY_INFO!P13*$J13,COUNTRY_INFO!P13*($J13-$D13)), COUNTRY_INFO!P13*$J13)))","v":0},0,0,null,0,0,null,0,0,null,0]
[{"$f":"IF(AND(INTRO!$E$37=\"Non endémique\",INTRO!$E$41=\"Non endémique\"),\" \",IF(COUNTRY_INFO!A14=0,\" \",COUNTRY_INFO!A14))","v":"NIGER"},{"$f":"IF(AND(INTRO!$E$37=\"Non endémique\",INTRO!$E$41=\"Non endémique\"),\" \",IF(COUNTRY_INFO!B14=0,\" \",COUNTRY_INFO!B14))","v":"Agadez"},{"$f":"IF(AND(INTRO!$E$37=\"Non endémique\",INTRO!$E$41=\"Non endémique\"),\" \",IF(COUNTRY_INFO!C14=0,\" \",COUNTRY_INFO!C14))","v":"Tchirozérine"},{"$f":"IF(AND(INTRO!$E$37=\"Non endémique\",INTRO!$E$41=\"Non endémique\"),0,COUNTRY_INFO!V14)","v":0},{"$f":"IF(AND(INTRO!$E$37=\"Non endémique\",INTRO!$E$41=\"Non endémique\"),0,COUNTRY_INFO!X14)","v":0},{"$f":"IF(INTRO!$E$39=\"Non endémique\",IF($D14=1,DEC!I14,0),IF($D14=1,IVM!G14,0))","v":0},null,{"$f":"IF(OR(COUNTRY_INFO!N14=\"Inconnu\",COUNTRY_INFO!N14=\"Surveillance\",COUNTRY_INFO!N14=\"Non requis\",COUNTRY_INFO!N14=0),0,IF(INTRO!$E$39=\"Non endémique\",IF(AND($E14<>0,$G14=\"\"),IF($F14=0,COUNTRY_INFO!N14*$E14,COUNTRY_INFO!N14*($E14-$D14)),IF(AND($E14<>0,$G14<>0),IF($F14=0,COUNTRY_INFO!N14*$G14,COUNTRY_INFO!N14*($G14-$D14)),0)),IF($G14=\"\",COUNTRY_INFO!N14*$E14,COUNTRY_INFO!N14*$G14)))","v":0},{"$f":"IF(OR(COUNTRY_INFO!O14=\"Inconnu\",COUNTRY_INFO!O14=\"Surveillance\",COUNTRY_INFO!O14=\"Non requis\",COUNTRY_INFO!O14=0),0,IF($E14<>0, IF($F14=0,COUNTRY_INFO!O14*$E14,COUNTRY_INFO!O14*($E14-$D14)),COUNTRY_INFO!O14*$E14))","v":0},null,{"$f":"IF(OR(COUNTRY_INFO!P14=\"Inconnu\",COUNTRY_INFO!P14=\"Surveillance\",COUNTRY_INFO!P14=\"Non requis\",COUNTRY_INFO!P14=0),0,IF(AND($E14<>0,$J14=\"\"),IF($F14=0,COUNTRY_INFO!P14*$E14,COUNTRY_INFO!P14*($E14-$D14)), IF(AND($E14<>0,$J14<>0),IF($F14=0,COUNTRY_INFO!P14*$J14,COUNTRY_INFO!P14*($J14-$D14)), COUNTRY_INFO!P14*$J14)))","v":0},0,0,null,0,0,null,0,0,null,0]
[{"$f":"IF(AND(INTRO!$E$37=\"Non endémique\",INTRO!$E$41=\"Non endémique\"),\" \",IF(COUNTRY_INFO!A15=0,\" \",COUNTRY_INFO!A15))","v":"NIGER"},{"$f":"IF(AND(INTRO!$E$37=\"Non endémique\",INTRO!$E$41=\"Non endémique\"),\" \",IF(COUNTRY_INFO!B15=0,\" \",COUNTRY_INFO!B15))","v":"Agadez"},{"$f":"IF(AND(INTRO!$E$37=\"Non endémique\",INTRO!$E$41=\"Non endémique\"),\" \",IF(COUNTRY_INFO!C15=0,\" \",COUNTRY_INFO!C15))","v":"Aderbissinat"},{"$f":"IF(AND(INTRO!$E$37=\"Non endémique\",INTRO!$E$41=\"Non endémique\"),0,COUNTRY_INFO!V15)","v":0},{"$f":"IF(AND(INTRO!$E$37=\"Non endémique\",INTRO!$E$41=\"Non endémique\"),0,COUNTRY_INFO!X15)","v":0},{"$f":"IF(INTRO!$E$39=\"Non endémique\",IF($D15=1,DEC!I15,0),IF($D15=1,IVM!G15,0))","v":0},null,{"$f":"IF(OR(COUNTRY_INFO!N15=\"Inconnu\",COUNTRY_INFO!N15=\"Surveillance\",COUNTRY_INFO!N15=\"Non requis\",COUNTRY_INFO!N15=0),0,IF(INTRO!$E$39=\"Non endémique\",IF(AND($E15<>0,$G15=\"\"),IF($F15=0,COUNTRY_INFO!N15*$E15,COUNTRY_INFO!N15*($E15-$D15)),IF(AND($E15<>0,$G15<>0),IF($F15=0,COUNTRY_INFO!N15*$G15,COUNTRY_INFO!N15*($G15-$D15)),0)),IF($G15=\"\",COUNTRY_INFO!N15*$E15,COUNTRY_INFO!N15*$G15)))","v":0},{"$f":"IF(OR(COUNTRY_INFO!O15=\"Inconnu\",COUNTRY_INFO!O15=\"Surveillance\",COUNTRY_INFO!O15=\"Non requis\",COUNTRY_INFO!O15=0),0,IF($E15<>0, IF($F15=0,COUNTRY_INFO!O15*$E15,COUNTRY_INFO!O15*($E15-$D15)),COUNTRY_INFO!O15*$E15))","v":0},null,{"$f":"IF(OR(COUNTRY_INFO!P15=\"Inconnu\",COUNTRY_INFO!P15=\"Surveillance\",COUNTRY_INFO!P15=\"Non requis\",COUNTRY_INFO!P15=0),0,IF(AND($E15<>0,$J15=\"\"),IF($F15=0,COUNTRY_INFO!P15*$E15,COUNTRY_INFO!P15*($E15-$D15)), IF(AND($E15<>0,$J15<>0),IF($F15=0,COUNTRY_INFO!P15*$J15,COUNTRY_INFO!P15*($J15-$D15)), COUNTRY_INFO!P15*$J15)))","v":0},0,0,null,0,0,null,0,0,null,0]
[{"$f":"IF(AND(INTRO!$E$37=\"Non endémique\",INTRO!$E$41=\"Non endémique\"),\" \",IF(COUNTRY_INFO!A16=0,\" \",COUNTRY_INFO!A16))","v":"NIGER"},{"$f":"IF(AND(INTRO!$E$37=\"Non endémique\",INTRO!$E$41=\"Non endémique\"),\" \",IF(COUNTRY_INFO!B16=0,\" \",COUNTRY_INFO!B16))","v":"Agadez"},{"$f":"IF(AND(INTRO!$E$37=\"Non endémique\",INTRO!$E$41=\"Non endémique\"),\" \",IF(COUNTRY_INFO!C16=0,\" \",COUNTRY_INFO!C16))","v":"Ingall"},{"$f":"IF(AND(INTRO!$E$37=\"Non endémique\",INTRO!$E$41=\"Non endémique\"),0,COUNTRY_INFO!V16)","v":0},{"$f":"IF(AND(INTRO!$E$37=\"Non endémique\",INTRO!$E$41=\"Non endémique\"),0,COUNTRY_INFO!X16)","v":0},{"$f":"IF(INTRO!$E$39=\"Non endémique\",IF($D16=1,DEC!I16,0),IF($D16=1,IVM!G16,0))","v":0},null,{"$f":"IF(OR(COUNTRY_INFO!N16=\"Inconnu\",COUNTRY_INFO!N16=\"Surveillance\",COUNTRY_INFO!N16=\"Non requis\",COUNTRY_INFO!N16=0),0,IF(INTRO!$E$39=\"Non endémique\",IF(AND($E16<>0,$G16=\"\"),IF($F16=0,COUNTRY_INFO!N16*$E16,COUNTRY_INFO!N16*($E16-$D16)),IF(AND($E16<>0,$G16<>0),IF($F16=0,COUNTRY_INFO!N16*$G16,COUNTRY_INFO!N16*($G16-$D16)),0)),IF($G16=\"\",COUNTRY_INFO!N16*$E16,COUNTRY_INFO!N16*$G16)))","v":0},{"$f":"IF(OR(COUNTRY_INFO!O16=\"Inconnu\",COUNTRY_INFO!O16=\"Surveillance\",COUNTRY_INFO!O16=\"Non requis\",COUNTRY_INFO!O16=0),0,IF($E16<>0, IF($F16=0,COUNTRY_INFO!O16*$E16,COUNTRY_INFO!O16*($E16-$D16)),COUNTRY_INFO!O16*$E16))","v":0},null,{"$f":"IF(OR(COUNTRY_INFO!P16=\"Inconnu\",COUNTRY_INFO!P16=\"Surveillance\",COUNTRY_INFO!P16=\"Non requis\",COUNTRY_INFO!P16=0),0,IF(AND($E16<>0,$J16=\"\"),IF($F16=0,COUNTRY_INFO!P16*$E16,COUNTRY_INFO!P16*($E16-$D16)), IF(AND($E16<>0,$J16<>0),IF($F16=0,COUNTRY_INFO!P16*$J16,COUNTRY_INFO!P16*($J16-$D16)), COUNTRY_INFO!P16*$J16)))","v":0},0,0,null,0,0,null,0,0,null,0]
[{"$f":"IF(AND(INTRO!$E$37=\"Non endémique\",INTRO!$E$41=\"Non endémique\"),\" \",IF(COUNTRY_INFO!A17=0,\" \",COUNTRY_INFO!A17))","v":"NIGER"},{"$f":"IF(AND(INTRO!$E$37=\"Non endémique\",INTRO!$E$41=\"Non endémique\"),\" \",IF(COUNTRY_INFO!B17=0,\" \",COUNTRY_INFO!B17))","v":"Diffa"},{"$f":"IF(AND(INTRO!$E$37=\"Non endémique\",INTRO!$E$41=\"Non endémique\"),\" \",IF(COUNTRY_INFO!C17=0,\" \",COUNTRY_INFO!C17))","v":"Diffa"},{"$f":"IF(AND(INTRO!$E$37=\"Non endémique\",INTRO!$E$41=\"Non endémique\"),0,COUNTRY_INFO!V17)","v":0},{"$f":"IF(AND(INTRO!$E$37=\"Non endémique\",INTRO!$E$41=\"Non endémique\"),0,COUNTRY_INFO!X17)","v":0},{"$f":"IF(INTRO!$E$39=\"Non endémique\",IF($D17=1,DEC!I17,0),IF($D17=1,IVM!G17,0))","v":0},null,{"$f":"IF(OR(COUNTRY_INFO!N17=\"Inconnu\",COUNTRY_INFO!N17=\"Surveillance\",COUNTRY_INFO!N17=\"Non requis\",COUNTRY_INFO!N17=0),0,IF(INTRO!$E$39=\"Non endémique\",IF(AND($E17<>0,$G17=\"\"),IF($F17=0,COUNTRY_INFO!N17*$E17,COUNTRY_INFO!N17*($E17-$D17)),IF(AND($E17<>0,$G17<>0),IF($F17=0,COUNTRY_INFO!N17*$G17,COUNTRY_INFO!N17*($G17-$D17)),0)),IF($G17=\"\",COUNTRY_INFO!N17*$E17,COUNTRY_INFO!N17*$G17)))","v":0},{"$f":"IF(OR(COUNTRY_INFO!O17=\"Inconnu\",COUNTRY_INFO!O17=\"Surveillance\",COUNTRY_INFO!O17=\"Non requis\",COUNTRY_INFO!O17=0),0,IF($E17<>0, IF($F17=0,COUNTRY_INFO!O17*$E17,COUNTRY_INFO!O17*($E17-$D17)),COUNTRY_INFO!O17*$E17))","v":0},null,{"$f":"IF(OR(COUNTRY_INFO!P17=\"Inconnu\",COUNTRY_INFO!P17=\"Surveillance\",COUNTRY_INFO!P17=\"Non requis\",COUNTRY_INFO!P17=0),0,IF(AND($E17<>0,$J17=\"\"),IF($F17=0,COUNTRY_INFO!P17*$E17,COUNTRY_INFO!P17*($E17-$D17)), IF(AND($E17<>0,$J17<>0),IF($F17=0,COUNTRY_INFO!P17*$J17,COUNTRY_INFO!P17*($J17-$D17)), COUNTRY_INFO!P17*$J17)))","v":0},0,0,null,0,0,null,0,0,null,0]
[{"$f":"IF(AND(INTRO!$E$37=\"Non endémique\",INTRO!$E$41=\"Non endémique\"),\" \",IF(COUNTRY_INFO!A18=0,\" \",COUNTRY_INFO!A18))","v":"NIGER"},{"$f":"IF(AND(INTRO!$E$37=\"Non endémique\",INTRO!$E$41=\"Non endémique\"),\" \",IF(COUNTRY_INFO!B18=0,\" \",COUNTRY_INFO!B18))","v":"Diffa"},{"$f":"IF(AND(INTRO!$E$37=\"Non endémique\",INTRO!$E$41=\"Non endémique\"),\" \",IF(COUNTRY_INFO!C18=0,\" \",COUNTRY_INFO!C18))","v":"Bosso"},{"$f":"IF(AND(INTRO!$E$37=\"Non endémique\",INTRO!$E$41=\"Non endémique\"),0,COUNTRY_INFO!V18)","v":0},{"$f":"IF(AND(INTRO!$E$37=\"Non endémique\",INTRO!$E$41=\"Non endémique\"),0,COUNTRY_INFO!X18)","v":0},{"$f":"IF(INTRO!$E$39=\"Non endémique\",IF($D18=1,DEC!I18,0),IF($D18=1,IVM!G18,0))","v":0},null,{"$f":"IF(OR(COUNTRY_INFO!N18=\"Inconnu\",COUNTRY_INFO!N18=\"Surveillance\",COUNTRY_INFO!N18=\"Non requis\",COUNTRY_INFO!N18=0),0,IF(INTRO!$E$39=\"Non endémique\",IF(AND($E18<>0,$G18=\"\"),IF($F18=0,COUNTRY_INFO!N18*$E18,COUNTRY_INFO!N18*($E18-$D18)),IF(AND($E18<>0,$G18<>0),IF($F18=0,COUNTRY_INFO!N18*$G18,COUNTRY_INFO!N18*($G18-$D18)),0)),IF($G18=\"\",COUNTRY_INFO!N18*$E18,COUNTRY_INFO!N18*$G18)))","v":0},{"$f":"IF(OR(COUNTRY_INFO!O18=\"Inconnu\",COUNTRY_INFO!O18=\"Surveillance\",COUNTRY_INFO!O18=\"Non requis\",COUNTRY_INFO!O18=0),0,IF($E18<>0, IF($F18=0,COUNTRY_INFO!O18*$E18,COUNTRY_INFO!O18*($E18-$D18)),COUNTRY_INFO!O18*$E18))","v":0},null,{"$f":"IF(OR(COUNTRY_INFO!P18=\"Inconnu\",COUNTRY_INFO!P18=\"Surveillance\",COUNTRY_INFO!P18=\"Non requis\",COUNTRY_INFO!P18=0),0,IF(AND($E18<>0,$J18=\"\"),IF($F18=0,COUNTRY_INFO!P18*$E18,COUNTRY_INFO!P18*($E18-$D18)), IF(AND($E18<>0,$J18<>0),IF($F18=0,COUNTRY_INFO!P18*$J18,COUNTRY_INFO!P18*($J18-$D18)), COUNTRY_INFO!P18*$J18)))","v":0},0,0,null,0,0,null,0,0,null,0]
[{"$f":"IF(AND(INTRO!$E$37=\"Non endémique\",INTRO!$E$41=\"Non endémique\"),\" \",IF(COUNTRY_INFO!A19=0,\" \",COUNTRY_INFO!A19))","v":"NIGER"},{"$f":"IF(AND(INTRO!$E$37=\"Non endémique\",INTRO!$E$41=\"Non endémique\"),\" \",IF(COUNTRY_INFO!B19=0,\" \",COUNTRY_INFO!B19))","v":"Diffa"},{"$f":"IF(AND(INTRO!$E$37=\"Non endémique\",INTRO!$E$41=\"Non endémique\"),\" \",IF(COUNTRY_INFO!C19=0,\" \",COUNTRY_INFO!C19))","v":"Mainé Soroa"},{"$f":"IF(AND(INTRO!$E$37=\"Non endémique\",INTRO!$E$41=\"Non endémique\"),0,COUNTRY_INFO!V19)","v":0},{"$f":"IF(AND(INTRO!$E$37=\"Non endémique\",INTRO!$E$41=\"Non endémique\"),0,COUNTRY_INFO!X19)","v":0},{"$f":"IF(INTRO!$E$39=\"Non endémique\",IF($D19=1,DEC!I19,0),IF($D19=1,IVM!G19,0))","v":0},null,{"$f":"IF(OR(COUNTRY_INFO!N19=\"Inconnu\",COUNTRY_INFO!N19=\"Surveillance\",COUNTRY_INFO!N19=\"Non requis\",COUNTRY_INFO!N19=0),0,IF(INTRO!$E$39=\"Non endémique\",IF(AND($E19<>0,$G19=\"\"),IF($F19=0,COUNTRY_INFO!N19*$E19,COUNTRY_INFO!N19*($E19-$D19)),IF(AND($E19<>0,$G19<>0),IF($F19=0,COUNTRY_INFO!N19*$G19,COUNTRY_INFO!N19*($G19-$D19)),0)),IF($G19=\"\",COUNTRY_INFO!N19*$E19,COUNTRY_INFO!N19*$G19)))","v":0},{"$f":"IF(OR(COUNTRY_INFO!O19=\"Inconnu\",COUNTRY_INFO!O19=\"Surveillance\",COUNTRY_INFO!O19=\"Non requis\",COUNTRY_INFO!O19=0),0,IF($E19<>0, IF($F19=0,COUNTRY_INFO!O19*$E19,COUNTRY_INFO!O19*($E19-$D19)),COUNTRY_INFO!O19*$E19))","v":0},null,{"$f":"IF(OR(COUNTRY_INFO!P19=\"Inconnu\",COUNTRY_INFO!P19=\"Surveillance\",COUNTRY_INFO!P19=\"Non requis\",COUNTRY_INFO!P19=0),0,IF(AND($E19<>0,$J19=\"\"),IF($F19=0,COUNTRY_INFO!P19*$E19,COUNTRY_INFO!P19*($E19-$D19)), IF(AND($E19<>0,$J19<>0),IF($F19=0,COUNTRY_INFO!P19*$J19,COUNTRY_INFO!P19*($J19-$D19)), COUNTRY_INFO!P19*$J19)))","v":0},0,0,null,0,0,null,0,0,null,0]
[{"$f":"IF(AND(INTRO!$E$37=\"Non endémique\",INTRO!$E$41=\"Non endémique\"),\" \",IF(COUNTRY_INFO!A20=0,\" \",COUNTRY_INFO!A20))","v":"NIGER"},{"$f":"IF(AND(INTRO!$E$37=\"Non endémique\",INTRO!$E$41=\"Non endémique\"),\" \",IF(COUNTRY_INFO!B20=0,\" \",COUNTRY_INFO!B20))","v":"Diffa"},{"$f":"IF(AND(INTRO!$E$37=\"Non endémique\",INTRO!$E$41=\"Non endémique\"),\" \",IF(COUNTRY_INFO!C20=0,\" \",COUNTRY_INFO!C20))","v":"Goudoumaria"},{"$f":"IF(AND(INTRO!$E$37=\"Non endémique\",INTRO!$E$41=\"Non endémique\"),0,COUNTRY_INFO!V20)","v":0},{"$f":"IF(AND(INTRO!$E$37=\"Non endémique\",INTRO!$E$41=\"Non endémique\"),0,COUNTRY_INFO!X20)","v":0},{"$f":"IF(INTRO!$E$39=\"Non endémique\",IF($D20=1,DEC!I20,0),IF($D20=1,IVM!G20,0))","v":0},null,{"$f":"IF(OR(COUNTRY_INFO!N20=\"Inconnu\",COUNTRY_INFO!N20=\"Surveillance\",COUNTRY_INFO!N20=\"Non requis\",COUNTRY_INFO!N20=0),0,IF(INTRO!$E$39=\"Non endémique\",IF(AND($E20<>0,$G20=\"\"),IF($F20=0,COUNTRY_INFO!N20*$E20,COUNTRY_INFO!N20*($E20-$D20)),IF(AND($E20<>0,$G20<>0),IF($F20=0,COUNTRY_INFO!N20*$G20,COUNTRY_INFO!N20*($G20-$D20)),0)),IF($G20=\"\",COUNTRY_INFO!N20*$E20,COUNTRY_INFO!N20*$G20)))","v":0},{"$f":"IF(OR(COUNTRY_INFO!O20=\"Inconnu\",COUNTRY_INFO!O20=\"Surveillance\",COUNTRY_INFO!O20=\"Non requis\",COUNTRY_INFO!O20=0),0,IF($E20<>0, IF($F20=0,COUNTRY_INFO!O20*$E20,COUNTRY_INFO!O20*($E20-$D20)),COUNTRY_INFO!O20*$E20))","v":0},null,{"$f":"IF(OR(COUNTRY_INFO!P20=\"Inconnu\",COUNTRY_INFO!P20=\"Surveillance\",COUNTRY_INFO!P20=\"Non requis\",COUNTRY_INFO!P20=0),0,IF(AND($E20<>0,$J20=\"\"),IF($F20=0,COUNTRY_INFO!P20*$E20,COUNTRY_INFO!P20*($E20-$D20)), IF(AND($E20<>0,$J20<>0),IF($F20=0,COUNTRY_INFO!P20*$J20,COUNTRY_INFO!P20*($J20-$D20)), COUNTRY_INFO!P20*$J20)))","v":0},0,0,null,0,0,null,0,0,null,0]
[{"$f":"IF(AND(INTRO!$E$37=\"Non endémique\",INTRO!$E$41=\"Non endémique\"),\" \",IF(COUNTRY_INFO!A21=0,\" \",COUNTRY_INFO!A21))","v":"NIGER"},{"$f":"IF(AND(INTRO!$E$37=\"Non endémique\",INTRO!$E$41=\"Non endémique\"),\" \",IF(COUNTRY_INFO!B21=0,\" \",COUNTRY_INFO!B21))","v":"Diffa"},{"$f":"IF(AND(INTRO!$E$37=\"Non endémique\",INTRO!$E$41=\"Non endémique\"),\" \",IF(COUNTRY_INFO!C21=0,\" \",COUNTRY_INFO!C21))","v":"N'Guigmi"},{"$f":"IF(AND(INTRO!$E$37=\"Non endémique\",INTRO!$E$41=\"Non endémique\"),0,COUNTRY_INFO!V21)","v":0},{"$f":"IF(AND(INTRO!$E$37=\"Non endémique\",INTRO!$E$41=\"Non endémique\"),0,COUNTRY_INFO!X21)","v":0},{"$f":"IF(INTRO!$E$39=\"Non endémique\",IF($D21=1,DEC!I21,0),IF($D21=1,IVM!G21,0))","v":0},null,{"$f":"IF(OR(COUNTRY_INFO!N21=\"Inconnu\",COUNTRY_INFO!N21=\"Surveillance\",COUNTRY_INFO!N21=\"Non requis\",COUNTRY_INFO!N21=0),0,IF(INTRO!$E$39=\"Non endémique\",IF(AND($E21<>0,$G21=\"\"),IF($F21=0,COUNTRY_INFO!N21*$E21,COUNTRY_INFO!N21*($E21-$D21)),IF(AND($E21<>0,$G21<>0),IF($F21=0,COUNTRY_INFO!N21*$G21,COUNTRY_INFO!N21*($G21-$D21)),0)),IF($G21=\"\",COUNTRY_INFO!N21*$E21,COUNTRY_INFO!N21*$G21)))","v":0},{"$f":"IF(OR(COUNTRY_INFO!O21=\"Inconnu\",COUNTRY_INFO!O21=\"Surveillance\",COUNTRY_INFO!O21=\"Non requis\",COUNTRY_INFO!O21=0),0,IF($E21<>0, IF($F21=0,COUNTRY_INFO!O21*$E21,COUNTRY_INFO!O21*($E21-$D21)),COUNTRY_INFO!O21*$E21))","v":0},null,{"$f":"IF(OR(COUNTRY_INFO!P21=\"Inconnu\",COUNTRY_INFO!P21=\"Surveillance\",COUNTRY_INFO!P21=\"Non requis\",COUNTRY_INFO!P21=0),0,IF(AND($E21<>0,$J21=\"\"),IF($F21=0,COUNTRY_INFO!P21*$E21,COUNTRY_INFO!P21*($E21-$D21)), IF(AND($E21<>0,$J21<>0),IF($F21=0,COUNTRY_INFO!P21*$J21,COUNTRY_INFO!P21*($J21-$D21)), COUNTRY_INFO!P21*$J21)))","v":0},0,0,null,0,0,null,0,0,null,0]
[{"$f":"IF(AND(INTRO!$E$37=\"Non endémique\",INTRO!$E$41=\"Non endémique\"),\" \",IF(COUNTRY_INFO!A22=0,\" \",COUNTRY_INFO!A22))","v":"NIGER"},{"$f":"IF(AND(INTRO!$E$37=\"Non endémique\",INTRO!$E$41=\"Non endémique\"),\" \",IF(COUNTRY_INFO!B22=0,\" \",COUNTRY_INFO!B22))","v":"Diffa"},{"$f":"IF(AND(INTRO!$E$37=\"Non endémique\",INTRO!$E$41=\"Non endémique\"),\" \",IF(COUNTRY_INFO!C22=0,\" \",COUNTRY_INFO!C22))","v":"N'Gourti"},{"$f":"IF(AND(INTRO!$E$37=\"Non endémique\",INTRO!$E$41=\"Non endémique\"),0,COUNTRY_INFO!V22)","v":0},{"$f":"IF(AND(INTRO!$E$37=\"Non endémique\",INTRO!$E$41=\"Non endémique\"),0,COUNTRY_INFO!X22)","v":0},{"$f":"IF(INTRO!$E$39=\"Non endémique\",IF($D22=1,DEC!I22,0),IF($D22=1,IVM!G22,0))","v":0},null,{"$f":"IF(OR(COUNTRY_INFO!N22=\"Inconnu\",COUNTRY_INFO!N22=\"Surveillance\",COUNTRY_INFO!N22=\"Non requis\",COUNTRY_INFO!N22=0),0,IF(INTRO!$E$39=\"Non endémique\",IF(AND($E22<>0,$G22=\"\"),IF($F22=0,COUNTRY_INFO!N22*$E22,COUNTRY_INFO!N22*($E22-$D22)),IF(AND($E22<>0,$G22<>0),IF($F22=0,COUNTRY_INFO!N22*$G22,COUNTRY_INFO!N22*($G22-$D22)),0)),IF($G22=\"\",COUNTRY_INFO!N22*$E22,COUNTRY_INFO!N22*$G22)))","v":0},{"$f":"IF(OR(COUNTRY_INFO!O22=\"Inconnu\",COUNTRY_INFO!O22=\"Surveillance\",COUNTRY_INFO!O22=\"Non requis\",COUNTRY_INFO!O22=0),0,IF($E22<>0, IF($F22=0,COUNTRY_INFO!O22*$E22,COUNTRY_INFO!O22*($E22-$D22)),COUNTRY_INFO!O22*$E22))","v":0},null,{"$f":"IF(OR(COUNTRY_INFO!P22=\"Inconnu\",COUNTRY_INFO!P22=\"Surveillance\",COUNTRY_INFO!P22=\"Non requis\",COUNTRY_INFO!P22=0),0,IF(AND($E22<>0,$J22=\"\"),IF($F22=0,COUNTRY_INFO!P22*$E22,COUNTRY_INFO!P22*($E22-$D22)), IF(AND($E22<>0,$J22<>0),IF($F22=0,COUNTRY_INFO!P22*$J22,COUNTRY_INFO!P22*($J22-$D22)), COUNTRY_INFO!P22*$J22)))","v":0},0,0,null,0,0,null,0,0,null,0]
[{"$f":"IF(AND(INTRO!$E$37=\"Non endémique\",INTRO!$E$41=\"Non endémique\"),\" \",IF(COUNTRY_INFO!A23=0,\" \",COUNTRY_INFO!A23))","v":"NIGER"},{"$f":"IF(AND(INTRO!$E$37=\"Non endémique\",INTRO!$E$41=\"Non endémique\"),\" \",IF(COUNTRY_INFO!B23=0,\" \",COUNTRY_INFO!B23))","v":"Dosso"},{"$f":"IF(AND(INTRO!$E$37=\"Non endémique\",INTRO!$E$41=\"Non endémique\"),\" \",IF(COUNTRY_INFO!C23=0,\" \",COUNTRY_INFO!C23))","v":"Boboye"},{"$f":"IF(AND(INTRO!$E$37=\"Non endémique\",INTRO!$E$41=\"Non endémique\"),0,COUNTRY_INFO!V23)","v":0},{"$f":"IF(AND(INTRO!$E$37=\"Non endémique\",INTRO!$E$41=\"Non endémique\"),0,COUNTRY_INFO!X23)","v":0},{"$f":"IF(INTRO!$E$39=\"Non endémique\",IF($D23=1,DEC!I23,0),IF($D23=1,IVM!G23,0))","v":0},null,{"$f":"IF(OR(COUNTRY_INFO!N23=\"Inconnu\",COUNTRY_INFO!N23=\"Surveillance\",COUNTRY_INFO!N23=\"Non requis\",COUNTRY_INFO!N23=0),0,IF(INTRO!$E$39=\"Non endémique\",IF(AND($E23<>0,$G23=\"\"),IF($F23=0,COUNTRY_INFO!N23*$E23,COUNTRY_INFO!N23*($E23-$D23)),IF(AND($E23<>0,$G23<>0),IF($F23=0,COUNTRY_INFO!N23*$G23,COUNTRY_INFO!N23*($G23-$D23)),0)),IF($G23=\"\",COUNTRY_INFO!N23*$E23,COUNTRY_INFO!N23*$G23)))","v":0},{"$f":"IF(OR(COUNTRY_INFO!O23=\"Inconnu\",COUNTRY_INFO!O23=\"Surveillance\",COUNTRY_INFO!O23=\"Non requis\",COUNTRY_INFO!O23=0),0,IF($E23<>0, IF($F23=0,COUNTRY_INFO!O23*$E23,COUNTRY_INFO!O23*($E23-$D23)),COUNTRY_INFO!O23*$E23))","v":0},null,{"$f":"IF(OR(COUNTRY_INFO!P23=\"Inconnu\",COUNTRY_INFO!P23=\"Surveillance\",COUNTRY_INFO!P23=\"Non requis\",COUNTRY_INFO!P23=0),0,IF(AND($E23<>0,$J23=\"\"),IF($F23=0,COUNTRY_INFO!P23*$E23,COUNTRY_INFO!P23*($E23-$D23)), IF(AND($E23<>0,$J23<>0),IF($F23=0,COUNTRY_INFO!P23*$J23,COUNTRY_INFO!P23*($J23-$D23)), COUNTRY_INFO!P23*$J23)))","v":0},0,0,null,0,0,null,0,0,null,0]
[{"$f":"IF(AND(INTRO!$E$37=\"Non endémique\",INTRO!$E$41=\"Non endémique\"),\" \",IF(COUNTRY_INFO!A24=0,\" \",COUNTRY_INFO!A24))","v":"NIGER"},{"$f":"IF(AND(INTRO!$E$37=\"Non endémique\",INTRO!$E$41=\"Non endémique\"),\" \",IF(COUNTRY_INFO!B24=0,\" \",COUNTRY_INFO!B24))","v":"Dosso"},{"$f":"IF(AND(INTRO!$E$37=\"Non endémique\",INTRO!$E$41=\"Non endémique\"),\" \",IF(COUNTRY_INFO!C24=0,\" \",COUNTRY_INFO!C24))","v":"Falmey"},{"$f":"IF(AND(INTRO!$E$37=\"Non endémique\",INTRO!$E$41=\"Non endémique\"),0,COUNTRY_INFO!V24)","v":0},{"$f":"IF(AND(INTRO!$E$37=\"Non endémique\",INTRO!$E$41=\"Non endémique\"),0,COUNTRY_INFO!X24)","v":0},{"$f":"IF(INTRO!$E$39=\"Non endémique\",IF($D24=1,DEC!I24,0),IF($D24=1,IVM!G24,0))","v":0},null,{"$f":"IF(OR(COUNTRY_INFO!N24=\"Inconnu\",COUNTRY_INFO!N24=\"Surveillance\",COUNTRY_INFO!N24=\"Non requis\",COUNTRY_INFO!N24=0),0,IF(INTRO!$E$39=\"Non endémique\",IF(AND($E24<>0,$G24=\"\"),IF($F24=0,COUNTRY_INFO!N24*$E24,COUNTRY_INFO!N24*($E24-$D24)),IF(AND($E24<>0,$G24<>0),IF($F24=0,COUNTRY_INFO!N24*$G24,COUNTRY_INFO!N24*($G24-$D24)),0)),IF($G24=\"\",COUNTRY_INFO!N24*$E24,COUNTRY_INFO!N24*$G24)))","v":0},{"$f":"IF(OR(COUNTRY_INFO!O24=\"Inconnu\",COUNTRY_INFO!O24=\"Surveillance\",COUNTRY_INFO!O24=\"Non requis\",COUNTRY_INFO!O24=0),0,IF($E24<>0, IF($F24=0,COUNTRY_INFO!O24*$E24,COUNTRY_INFO!O24*($E24-$D24)),COUNTRY_INFO!O24*$E24))","v":0},null,{"$f":"IF(OR(COUNTRY_INFO!P24=\"Inconnu\",COUNTRY_INFO!P24=\"Surveillance\",COUNTRY_INFO!P24=\"Non requis\",COUNTRY_INFO!P24=0),0,IF(AND($E24<>0,$J24=\"\"),IF($F24=0,COUNTRY_INFO!P24*$E24,COUNTRY_INFO!P24*($E24-$D24)), IF(AND($E24<>0,$J24<>0),IF($F24=0,COUNTRY_INFO!P24*$J24,COUNTRY_INFO!P24*($J24-$D24)), COUNTRY_INFO!P24*$J24)))","v":0},0,0,null,0,0,null,0,0,null,0]
[{"$f":"IF(AND(INTRO!$E$37=\"Non endémique\",INTRO!$E$41=\"Non endémique\"),\" \",IF(COUNTRY_INFO!A25=0,\" \",COUNTRY_INFO!A25))","v":"NIGER"},{"$f":"IF(AND(INTRO!$E$37=\"Non endémique\",INTRO!$E$41=\"Non endémique\"),\" \",IF(COUNTRY_INFO!B25=0,\" \",COUNTRY_INFO!B25))","v":"Dosso"},{"$f":"IF(AND(INTRO!$E$37=\"Non endémique\",INTRO!$E$41=\"Non endémique\"),\" \",IF(COUNTRY_INFO!C25=0,\" \",COUNTRY_INFO!C25))","v":"Dosso"},{"$f":"IF(AND(INTRO!$E$37=\"Non endémique\",INTRO!$E$41=\"Non endémique\"),0,COUNTRY_INFO!V25)","v":0},{"$f":"IF(AND(INTRO!$E$37=\"Non endémique\",INTRO!$E$41=\"Non endémique\"),0,COUNTRY_INFO!X25)","v":0},{"$f":"IF(INTRO!$E$39=\"Non endémique\",IF($D25=1,DEC!I25,0),IF($D25=1,IVM!G25,0))","v":0},null,{"$f":"IF(OR(COUNTRY_INFO!N25=\"Inconnu\",COUNTRY_INFO!N25=\"Surveillance\",COUNTRY_INFO!N25=\"Non requis\",COUNTRY_INFO!N25=0),0,IF(INTRO!$E$39=\"Non endémique\",IF(AND($E25<>0,$G25=\"\"),IF($F25=0,COUNTRY_INFO!N25*$E25,COUNTRY_INFO!N25*($E25-$D25)),IF(AND($E25<>0,$G25<>0),IF($F25=0,COUNTRY_INFO!N25*$G25,COUNTRY_INFO!N25*($G25-$D25)),0)),IF($G25=\"\",COUNTRY_INFO!N25*$E25,COUNTRY_INFO!N25*$G25)))","v":0},{"$f":"IF(OR(COUNTRY_INFO!O25=\"Inconnu\",COUNTRY_INFO!O25=\"Surveillance\",COUNTRY_INFO!O25=\"Non requis\",COUNTRY_INFO!O25=0),0,IF($E25<>0, IF($F25=0,COUNTRY_INFO!O25*$E25,COUNTRY_INFO!O25*($E25-$D25)),COUNTRY_INFO!O25*$E25))","v":0},null,{"$f":"IF(OR(COUNTRY_INFO!P25=\"Inconnu\",COUNTRY_INFO!P25=\"Surveillance\",COUNTRY_INFO!P25=\"Non requis\",COUNTRY_INFO!P25=0),0,IF(AND($E25<>0,$J25=\"\"),IF($F25=0,COUNTRY_INFO!P25*$E25,COUNTRY_INFO!P25*($E25-$D25)), IF(AND($E25<>0,$J25<>0),IF($F25=0,COUNTRY_INFO!P25*$J25,COUNTRY_INFO!P25*($J25-$D25)), COUNTRY_INFO!P25*$J25)))","v":0},0,0,null,0,0,null,0,0,null,0]
[{"$f":"IF(AND(INTRO!$E$37=\"Non endémique\",INTRO!$E$41=\"Non endémique\"),\" \",IF(COUNTRY_INFO!A26=0,\" \",COUNTRY_INFO!A26))","v":"NIGER"},{"$f":"IF(AND(INTRO!$E$37=\"Non endémique\",INTRO!$E$41=\"Non endémique\"),\" \",IF(COUNTRY_INFO!B26=0,\" \",COUNTRY_INFO!B26))","v":"Dosso"},{"$f":"IF(AND(INTRO!$E$37=\"Non endémique\",INTRO!$E$41=\"Non endémique\"),\" \",IF(COUNTRY_INFO!C26=0,\" \",COUNTRY_INFO!C26))","v":"Doutchi"},{"$f":"IF(AND(INTRO!$E$37=\"Non endémique\",INTRO!$E$41=\"Non endémique\"),0,COUNTRY_INFO!V26)","v":0},{"$f":"IF(AND(INTRO!$E$37=\"Non endémique\",INTRO!$E$41=\"Non endémique\"),0,COUNTRY_INFO!X26)","v":0},{"$f":"IF(INTRO!$E$39=\"Non endémique\",IF($D26=1,DEC!I26,0),IF($D26=1,IVM!G26,0))","v":0},null,{"$f":"IF(OR(COUNTRY_INFO!N26=\"Inconnu\",COUNTRY_INFO!N26=\"Surveillance\",COUNTRY_INFO!N26=\"Non requis\",COUNTRY_INFO!N26=0),0,IF(INTRO!$E$39=\"Non endémique\",IF(AND($E26<>0,$G26=\"\"),IF($F26=0,COUNTRY_INFO!N26*$E26,COUNTRY_INFO!N26*($E26-$D26)),IF(AND($E26<>0,$G26<>0),IF($F26=0,COUNTRY_INFO!N26*$G26,COUNTRY_INFO!N26*($G26-$D26)),0)),IF($G26=\"\",COUNTRY_INFO!N26*$E26,COUNTRY_INFO!N26*$G26)))","v":0},{"$f":"IF(OR(COUNTRY_INFO!O26=\"Inconnu\",COUNTRY_INFO!O26=\"Surveillance\",COUNTRY_INFO!O26=\"Non requis\",COUNTRY_INFO!O26=0),0,IF($E26<>0, IF($F26=0,COUNTRY_INFO!O26*$E26,COUNTRY_INFO!O26*($E26-$D26)),COUNTRY_INFO!O26*$E26))","v":0},null,{"$f":"IF(OR(COUNTRY_INFO!P26=\"Inconnu\",COUNTRY_INFO!P26=\"Surveillance\",COUNTRY_INFO!P26=\"Non requis\",COUNTRY_INFO!P26=0),0,IF(AND($E26<>0,$J26=\"\"),IF($F26=0,COUNTRY_INFO!P26*$E26,COUNTRY_INFO!P26*($E26-$D26)), IF(AND($E26<>0,$J26<>0),IF($F26=0,COUNTRY_INFO!P26*$J26,COUNTRY_INFO!P26*($J26-$D26)), COUNTRY_INFO!P26*$J26)))","v":0},0,0,null,0,0,null,0,0,null,0]
[{"$f":"IF(AND(INTRO!$E$37=\"Non endémique\",INTRO!$E$41=\"Non endémique\"),\" \",IF(COUNTRY_INFO!A27=0,\" \",COUNTRY_INFO!A27))","v":"NIGER"},{"$f":"IF(AND(INTRO!$E$37=\"Non endémique\",INTRO!$E$41=\"Non endémique\"),\" \",IF(COUNTRY_INFO!B27=0,\" \",COUNTRY_INFO!B27))","v":"Dosso"},{"$f":"IF(AND(INTRO!$E$37=\"Non endémique\",INTRO!$E$41=\"Non endémique\"),\" \",IF(COUNTRY_INFO!C27=0,\" \",COUNTRY_INFO!C27))","v":"Tibiri(Doutchi)"},{"$f":"IF(AND(INTRO!$E$37=\"Non endémique\",INTRO!$E$41=\"Non endémique\"),0,COUNTRY_INFO!V27)","v":0},{"$f":"IF(AND(INTRO!$E$37=\"Non endémique\",INTRO!$E$41=\"Non endémique\"),0,COUNTRY_INFO!X27)","v":0},{"$f":"IF(INTRO!$E$39=\"Non endémique\",IF($D27=1,DEC!I27,0),IF($D27=1,IVM!G27,0))","v":0},null,{"$f":"IF(OR(COUNTRY_INFO!N27=\"Inconnu\",COUNTRY_INFO!N27=\"Surveillance\",COUNTRY_INFO!N27=\"Non requis\",COUNTRY_INFO!N27=0),0,IF(INTRO!$E$39=\"Non endémique\",IF(AND($E27<>0,$G27=\"\"),IF($F27=0,COUNTRY_INFO!N27*$E27,COUNTRY_INFO!N27*($E27-$D27)),IF(AND($E27<>0,$G27<>0),IF($F27=0,COUNTRY_INFO!N27*$G27,COUNTRY_INFO!N27*($G27-$D27)),0)),IF($G27=\"\",COUNTRY_INFO!N27*$E27,COUNTRY_INFO!N27*$G27)))","v":0},{"$f":"IF(OR(COUNTRY_INFO!O27=\"Inconnu\",COUNTRY_INFO!O27=\"Surveillance\",COUNTRY_INFO!O27=\"Non requis\",COUNTRY_INFO!O27=0),0,IF($E27<>0, IF($F27=0,COUNTRY_INFO!O27*$E27,COUNTRY_INFO!O27*($E27-$D27)),COUNTRY_INFO!O27*$E27))","v":0},null,{"$f":"IF(OR(COUNTRY_INFO!P27=\"Inconnu\",COUNTRY_INFO!P27=\"Surveillance\",COUNTRY_INFO!P27=\"Non requis\",COUNTRY_INFO!P27=0),0,IF(AND($E27<>0,$J27=\"\"),IF($F27=0,COUNTRY_INFO!P27*$E27,COUNTRY_INFO!P27*($E27-$D27)), IF(AND($E27<>0,$J27<>0),IF($F27=0,COUNTRY_INFO!P27*$J27,COUNTRY_INFO!P27*($J27-$D27)), COUNTRY_INFO!P27*$J27)))","v":0},0,0,null,0,0,null,0,0,null,0]
[{"$f":"IF(AND(INTRO!$E$37=\"Non endémique\",INTRO!$E$41=\"Non endémique\"),\" \",IF(COUNTRY_INFO!A28=0,\" \",COUNTRY_INFO!A28))","v":"NIGER"},{"$f":"IF(AND(INTRO!$E$37=\"Non endémique\",INTRO!$E$41=\"Non endémique\"),\" \",IF(COUNTRY_INFO!B28=0,\" \",COUNTRY_INFO!B28))","v":"Dosso"},{"$f":"IF(AND(INTRO!$E$37=\"Non endémique\",INTRO!$E$41=\"Non endémique\"),\" \",IF(COUNTRY_INFO!C28=0,\" \",COUNTRY_INFO!C28))","v":"Gaya"},{"$f":"IF(AND(INTRO!$E$37=\"Non endémique\",INTRO!$E$41=\"Non endémique\"),0,COUNTRY_INFO!V28)","v":0},{"$f":"IF(AND(INTRO!$E$37=\"Non endémique\",INTRO!$E$41=\"Non endémique\"),0,COUNTRY_INFO!X28)","v":0},{"$f":"IF(INTRO!$E$39=\"Non endémique\",IF($D28=1,DEC!I28,0),IF($D28=1,IVM!G28,0))","v":0},null,{"$f":"IF(OR(COUNTRY_INFO!N28=\"Inconnu\",COUNTRY_INFO!N28=\"Surveillance\",COUNTRY_INFO!N28=\"Non requis\",COUNTRY_INFO!N28=0),0,IF(INTRO!$E$39=\"Non endémique\",IF(AND($E28<>0,$G28=\"\"),IF($F28=0,COUNTRY_INFO!N28*$E28,COUNTRY_INFO!N28*($E28-$D28)),IF(AND($E28<>0,$G28<>0),IF($F28=0,COUNTRY_INFO!N28*$G28,COUNTRY_INFO!N28*($G28-$D28)),0)),IF($G28=\"\",COUNTRY_INFO!N28*$E28,COUNTRY_INFO!N28*$G28)))","v":0},{"$f":"IF(OR(COUNTRY_INFO!O28=\"Inconnu\",COUNTRY_INFO!O28=\"Surveillance\",COUNTRY_INFO!O28=\"Non requis\",COUNTRY_INFO!O28=0),0,IF($E28<>0, IF($F28=0,COUNTRY_INFO!O28*$E28,COUNTRY_INFO!O28*($E28-$D28)),COUNTRY_INFO!O28*$E28))","v":0},null,{"$f":"IF(OR(COUNTRY_INFO!P28=\"Inconnu\",COUNTRY_INFO!P28=\"Surveillance\",COUNTRY_INFO!P28=\"Non requis\",COUNTRY_INFO!P28=0),0,IF(AND($E28<>0,$J28=\"\"),IF($F28=0,COUNTRY_INFO!P28*$E28,COUNTRY_INFO!P28*($E28-$D28)), IF(AND($E28<>0,$J28<>0),IF($F28=0,COUNTRY_INFO!P28*$J28,COUNTRY_INFO!P28*($J28-$D28)), COUNTRY_INFO!P28*$J28)))","v":0},0,0,null,0,0,null,0,0,null,0]
[{"$f":"IF(AND(INTRO!$E$37=\"Non endémique\",INTRO!$E$41=\"Non endémique\"),\" \",IF(COUNTRY_INFO!A29=0,\" \",COUNTRY_INFO!A29))","v":"NIGER"},{"$f":"IF(AND(INTRO!$E$37=\"Non endémique\",INTRO!$E$41=\"Non endémique\"),\" \",IF(COUNTRY_INFO!B29=0,\" \",COUNTRY_INFO!B29))","v":"Dosso"},{"$f":"IF(AND(INTRO!$E$37=\"Non endémique\",INTRO!$E$41=\"Non endémique\"),\" \",IF(COUNTRY_INFO!C29=0,\" \",COUNTRY_INFO!C29))","v":"Dioundiou"},{"$f":"IF(AND(INTRO!$E$37=\"Non endémique\",INTRO!$E$41=\"Non endémique\"),0,COUNTRY_INFO!V29)","v":0},{"$f":"IF(AND(INTRO!$E$37=\"Non endémique\",INTRO!$E$41=\"Non endémique\"),0,COUNTRY_INFO!X29)","v":0},{"$f":"IF(INTRO!$E$39=\"Non endémique\",IF($D29=1,DEC!I29,0),IF($D29=1,IVM!G29,0))","v":0},null,{"$f":"IF(OR(COUNTRY_INFO!N29=\"Inconnu\",COUNTRY_INFO!N29=\"Surveillance\",COUNTRY_INFO!N29=\"Non requis\",COUNTRY_INFO!N29=0),0,IF(INTRO!$E$39=\"Non endémique\",IF(AND($E29<>0,$G29=\"\"),IF($F29=0,COUNTRY_INFO!N29*$E29,COUNTRY_INFO!N29*($E29-$D29)),IF(AND($E29<>0,$G29<>0),IF($F29=0,COUNTRY_INFO!N29*$G29,COUNTRY_INFO!N29*($G29-$D29)),0)),IF($G29=\"\",COUNTRY_INFO!N29*$E29,COUNTRY_INFO!N29*$G29)))","v":0},{"$f":"IF(OR(COUNTRY_INFO!O29=\"Inconnu\",COUNTRY_INFO!O29=\"Surveillance\",COUNTRY_INFO!O29=\"Non requis\",COUNTRY_INFO!O29=0),0,IF($E29<>0, IF($F29=0,COUNTRY_INFO!O29*$E29,COUNTRY_INFO!O29*($E29-$D29)),COUNTRY_INFO!O29*$E29))","v":0},null,{"$f":"IF(OR(COUNTRY_INFO!P29=\"Inconnu\",COUNTRY_INFO!P29=\"Surveillance\",COUNTRY_INFO!P29=\"Non requis\",COUNTRY_INFO!P29=0),0,IF(AND($E29<>0,$J29=\"\"),IF($F29=0,COUNTRY_INFO!P29*$E29,COUNTRY_INFO!P29*($E29-$D29)), IF(AND($E29<>0,$J29<>0),IF($F29=0,COUNTRY_INFO!P29*$J29,COUNTRY_INFO!P29*($J29-$D29)), COUNTRY_INFO!P29*$J29)))","v":0},0,0,null,0,0,null,0,0,null,0]
[{"$f":"IF(AND(INTRO!$E$37=\"Non endémique\",INTRO!$E$41=\"Non endémique\"),\" \",IF(COUNTRY_INFO!A30=0,\" \",COUNTRY_INFO!A30))","v":"NIGER"},{"$f":"IF(AND(INTRO!$E$37=\"Non endémique\",INTRO!$E$41=\"Non endémique\"),\" \",IF(COUNTRY_INFO!B30=0,\" \",COUNTRY_INFO!B30))","v":"Dosso"},{"$f":"IF(AND(INTRO!$E$37=\"Non endémique\",INTRO!$E$41=\"Non endémique\"),\" \",IF(COUNTRY_INFO!C30=0,\" \",COUNTRY_INFO!C30))","v":"Loga"},{"$f":"IF(AND(INTRO!$E$37=\"Non endémique\",INTRO!$E$41=\"Non endémique\"),0,COUNTRY_INFO!V30)","v":0},{"$f":"IF(AND(INTRO!$E$37=\"Non endémique\",INTRO!$E$41=\"Non endémique\"),0,COUNTRY_INFO!X30)","v":0},{"$f":"IF(INTRO!$E$39=\"Non endémique\",IF($D30=1,DEC!I30,0),IF($D30=1,IVM!G30,0))","v":0},null,{"$f":"IF(OR(COUNTRY_INFO!N30=\"Inconnu\",COUNTRY_INFO!N30=\"Surveillance\",COUNTRY_INFO!N30=\"Non requis\",COUNTRY_INFO!N30=0),0,IF(INTRO!$E$39=\"Non endémique\",IF(AND($E30<>0,$G30=\"\"),IF($F30=0,COUNTRY_INFO!N30*$E30,COUNTRY_INFO!N30*($E30-$D30)),IF(AND($E30<>0,$G30<>0),IF($F30=0,COUNTRY_INFO!N30*$G30,COUNTRY_INFO!N30*($G30-$D30)),0)),IF($G30=\"\",COUNTRY_INFO!N30*$E30,COUNTRY_INFO!N30*$G30)))","v":0},{"$f":"IF(OR(COUNTRY_INFO!O30=\"Inconnu\",COUNTRY_INFO!O30=\"Surveillance\",COUNTRY_INFO!O30=\"Non requis\",COUNTRY_INFO!O30=0),0,IF($E30<>0, IF($F30=0,COUNTRY_INFO!O30*$E30,COUNTRY_INFO!O30*($E30-$D30)),COUNTRY_INFO!O30*$E30))","v":0},null,{"$f":"IF(OR(COUNTRY_INFO!P30=\"Inconnu\",COUNTRY_INFO!P30=\"Surveillance\",COUNTRY_INFO!P30=\"Non requis\",COUNTRY_INFO!P30=0),0,IF(AND($E30<>0,$J30=\"\"),IF($F30=0,COUNTRY_INFO!P30*$E30,COUNTRY_INFO!P30*($E30-$D30)), IF(AND($E30<>0,$J30<>0),IF($F30=0,COUNTRY_INFO!P30*$J30,COUNTRY_INFO!P30*($J30-$D30)), COUNTRY_INFO!P30*$J30)))","v":0},0,0,null,0,0,null,0,0,null,0]
[{"$f":"IF(AND(INTRO!$E$37=\"Non endémique\",INTRO!$E$41=\"Non endémique\"),\" \",IF(COUNTRY_INFO!A31=0,\" \",COUNTRY_INFO!A31))","v":"NIGER"},{"$f":"IF(AND(INTRO!$E$37=\"Non endémique\",INTRO!$E$41=\"Non endémique\"),\" \",IF(COUNTRY_INFO!B31=0,\" \",COUNTRY_INFO!B31))","v":"Maradi"},{"$f":"IF(AND(INTRO!$E$37=\"Non endémique\",INTRO!$E$41=\"Non endémique\"),\" \",IF(COUNTRY_INFO!C31=0,\" \",COUNTRY_INFO!C31))","v":"Aguié"},{"$f":"IF(AND(INTRO!$E$37=\"Non endémique\",INTRO!$E$41=\"Non endémique\"),0,COUNTRY_INFO!V31)","v":0},{"$f":"IF(AND(INTRO!$E$37=\"Non endémique\",INTRO!$E$41=\"Non endémique\"),0,COUNTRY_INFO!X31)","v":0},{"$f":"IF(INTRO!$E$39=\"Non endémique\",IF($D31=1,DEC!I31,0),IF($D31=1,IVM!G31,0))","v":0},null,{"$f":"IF(OR(COUNTRY_INFO!N31=\"Inconnu\",COUNTRY_INFO!N31=\"Surveillance\",COUNTRY_INFO!N31=\"Non requis\",COUNTRY_INFO!N31=0),0,IF(INTRO!$E$39=\"Non endémique\",IF(AND($E31<>0,$G31=\"\"),IF($F31=0,COUNTRY_INFO!N31*$E31,COUNTRY_INFO!N31*($E31-$D31)),IF(AND($E31<>0,$G31<>0),IF($F31=0,COUNTRY_INFO!N31*$G31,COUNTRY_INFO!N31*($G31-$D31)),0)),IF($G31=\"\",COUNTRY_INFO!N31*$E31,COUNTRY_INFO!N31*$G31)))","v":0},{"$f":"IF(OR(COUNTRY_INFO!O31=\"Inconnu\",COUNTRY_INFO!O31=\"Surveillance\",COUNTRY_INFO!O31=\"Non requis\",COUNTRY_INFO!O31=0),0,IF($E31<>0, IF($F31=0,COUNTRY_INFO!O31*$E31,COUNTRY_INFO!O31*($E31-$D31)),COUNTRY_INFO!O31*$E31))","v":0},null,{"$f":"IF(OR(COUNTRY_INFO!P31=\"Inconnu\",COUNTRY_INFO!P31=\"Surveillance\",COUNTRY_INFO!P31=\"Non requis\",COUNTRY_INFO!P31=0),0,IF(AND($E31<>0,$J31=\"\"),IF($F31=0,COUNTRY_INFO!P31*$E31,COUNTRY_INFO!P31*($E31-$D31)), IF(AND($E31<>0,$J31<>0),IF($F31=0,COUNTRY_INFO!P31*$J31,COUNTRY_INFO!P31*($J31-$D31)), COUNTRY_INFO!P31*$J31)))","v":0},0,0,null,0,0,null,0,0,null,0]
[{"$f":"IF(AND(INTRO!$E$37=\"Non endémique\",INTRO!$E$41=\"Non endémique\"),\" \",IF(COUNTRY_INFO!A32=0,\" \",COUNTRY_INFO!A32))","v":"NIGER"},{"$f":"IF(AND(INTRO!$E$37=\"Non endémique\",INTRO!$E$41=\"Non endémique\"),\" \",IF(COUNTRY_INFO!B32=0,\" \",COUNTRY_INFO!B32))","v":"Maradi"},{"$f":"IF(AND(INTRO!$E$37=\"Non endémique\",INTRO!$E$41=\"Non endémique\"),\" \",IF(COUNTRY_INFO!C32=0,\" \",COUNTRY_INFO!C32))","v":"Gazaoua"},{"$f":"IF(AND(INTRO!$E$37=\"Non endémique\",INTRO!$E$41=\"Non endémique\"),0,COUNTRY_INFO!V32)","v":0},{"$f":"IF(AND(INTRO!$E$37=\"Non endémique\",INTRO!$E$41=\"Non endémique\"),0,COUNTRY_INFO!X32)","v":0},{"$f":"IF(INTRO!$E$39=\"Non endémique\",IF($D32=1,DEC!I32,0),IF($D32=1,IVM!G32,0))","v":0},null,{"$f":"IF(OR(COUNTRY_INFO!N32=\"Inconnu\",COUNTRY_INFO!N32=\"Surveillance\",COUNTRY_INFO!N32=\"Non requis\",COUNTRY_INFO!N32=0),0,IF(INTRO!$E$39=\"Non endémique\",IF(AND($E32<>0,$G32=\"\"),IF($F32=0,COUNTRY_INFO!N32*$E32,COUNTRY_INFO!N32*($E32-$D32)),IF(AND($E32<>0,$G32<>0),IF($F32=0,COUNTRY_INFO!N32*$G32,COUNTRY_INFO!N32*($G32-$D32)),0)),IF($G32=\"\",COUNTRY_INFO!N32*$E32,COUNTRY_INFO!N32*$G32)))","v":0},{"$f":"IF(OR(COUNTRY_INFO!O32=\"Inconnu\",COUNTRY_INFO!O32=\"Surveillance\",COUNTRY_INFO!O32=\"Non requis\",COUNTRY_INFO!O32=0),0,IF($E32<>0, IF($F32=0,COUNTRY_INFO!O32*$E32,COUNTRY_INFO!O32*($E32-$D32)),COUNTRY_INFO!O32*$E32))","v":0},null,{"$f":"IF(OR(COUNTRY_INFO!P32=\"Inconnu\",COUNTRY_INFO!P32=\"Surveillance\",COUNTRY_INFO!P32=\"Non requis\",COUNTRY_INFO!P32=0),0,IF(AND($E32<>0,$J32=\"\"),IF($F32=0,COUNTRY_INFO!P32*$E32,COUNTRY_INFO!P32*($E32-$D32)), IF(AND($E32<>0,$J32<>0),IF($F32=0,COUNTRY_INFO!P32*$J32,COUNTRY_INFO!P32*($J32-$D32)), COUNTRY_INFO!P32*$J32)))","v":0},0,0,null,0,0,null,0,0,null,0]
[{"$f":"IF(AND(INTRO!$E$37=\"Non endémique\",INTRO!$E$41=\"Non endémique\"),\" \",IF(COUNTRY_INFO!A33=0,\" \",COUNTRY_INFO!A33))","v":"NIGER"},{"$f":"IF(AND(INTRO!$E$37=\"Non endémique\",INTRO!$E$41=\"Non endémique\"),\" \",IF(COUNTRY_INFO!B33=0,\" \",COUNTRY_INFO!B33))","v":"Maradi"},{"$f":"IF(AND(INTRO!$E$37=\"Non endémique\",INTRO!$E$41=\"Non endémique\"),\" \",IF(COUNTRY_INFO!C33=0,\" \",COUNTRY_INFO!C33))","v":"Dakoro"},{"$f":"IF(AND(INTRO!$E$37=\"Non endémique\",INTRO!$E$41=\"Non endémique\"),0,COUNTRY_INFO!V33)","v":0},{"$f":"IF(AND(INTRO!$E$37=\"Non endémique\",INTRO!$E$41=\"Non endémique\"),0,COUNTRY_INFO!X33)","v":0},{"$f":"IF(INTRO!$E$39=\"Non endémique\",IF($D33=1,DEC!I33,0),IF($D33=1,IVM!G33,0))","v":0},null,{"$f":"IF(OR(COUNTRY_INFO!N33=\"Inconnu\",COUNTRY_INFO!N33=\"Surveillance\",COUNTRY_INFO!N33=\"Non requis\",COUNTRY_INFO!N33=0),0,IF(INTRO!$E$39=\"Non endémique\",IF(AND($E33<>0,$G33=\"\"),IF($F33=0,COUNTRY_INFO!N33*$E33,COUNTRY_INFO!N33*($E33-$D33)),IF(AND($E33<>0,$G33<>0),IF($F33=0,COUNTRY_INFO!N33*$G33,COUNTRY_INFO!N33*($G33-$D33)),0)),IF($G33=\"\",COUNTRY_INFO!N33*$E33,COUNTRY_INFO!N33*$G33)))","v":0},{"$f":"IF(OR(COUNTRY_INFO!O33=\"Inconnu\",COUNTRY_INFO!O33=\"Surveillance\",COUNTRY_INFO!O33=\"Non requis\",COUNTRY_INFO!O33=0),0,IF($E33<>0, IF($F33=0,COUNTRY_INFO!O33*$E33,COUNTRY_INFO!O33*($E33-$D33)),COUNTRY_INFO!O33*$E33))","v":0},null,{"$f":"IF(OR(COUNTRY_INFO!P33=\"Inconnu\",COUNTRY_INFO!P33=\"Surveillance\",COUNTRY_INFO!P33=\"Non requis\",COUNTRY_INFO!P33=0),0,IF(AND($E33<>0,$J33=\"\"),IF($F33=0,COUNTRY_INFO!P33*$E33,COUNTRY_INFO!P33*($E33-$D33)), IF(AND($E33<>0,$J33<>0),IF($F33=0,COUNTRY_INFO!P33*$J33,COUNTRY_INFO!P33*($J33-$D33)), COUNTRY_INFO!P33*$J33)))","v":0},0,0,null,0,0,null,0,0,null,0]
[{"$f":"IF(AND(INTRO!$E$37=\"Non endémique\",INTRO!$E$41=\"Non endémique\"),\" \",IF(COUNTRY_INFO!A34=0,\" \",COUNTRY_INFO!A34))","v":"NIGER"},{"$f":"IF(AND(INTRO!$E$37=\"Non endémique\",INTRO!$E$41=\"Non endémique\"),\" \",IF(COUNTRY_INFO!B34=0,\" \",COUNTRY_INFO!B34))","v":"Maradi"},{"$f":"IF(AND(INTRO!$E$37=\"Non endémique\",INTRO!$E$41=\"Non endémique\"),\" \",IF(COUNTRY_INFO!C34=0,\" \",COUNTRY_INFO!C34))","v":"Bermo"},{"$f":"IF(AND(INTRO!$E$37=\"Non endémique\",INTRO!$E$41=\"Non endémique\"),0,COUNTRY_INFO!V34)","v":0},{"$f":"IF(AND(INTRO!$E$37=\"Non endémique\",INTRO!$E$41=\"Non endémique\"),0,COUNTRY_INFO!X34)","v":0},{"$f":"IF(INTRO!$E$39=\"Non endémique\",IF($D34=1,DEC!I34,0),IF($D34=1,IVM!G34,0))","v":0},null,{"$f":"IF(OR(COUNTRY_INFO!N34=\"Inconnu\",COUNTRY_INFO!N34=\"Surveillance\",COUNTRY_INFO!N34=\"Non requis\",COUNTRY_INFO!N34=0),0,IF(INTRO!$E$39=\"Non endémique\",IF(AND($E34<>0,$G34=\"\"),IF($F34=0,COUNTRY_INFO!N34*$E34,COUNTRY_INFO!N34*($E34-$D34)),IF(AND($E34<>0,$G34<>0),IF($F34=0,COUNTRY_INFO!N34*$G34,COUNTRY_INFO!N34*($G34-$D34)),0)),IF($G34=\"\",COUNTRY_INFO!N34*$E34,COUNTRY_INFO!N34*$G34)))","v":0},{"$f":"IF(OR(COUNTRY_INFO!O34=\"Inconnu\",COUNTRY_INFO!O34=\"Surveillance\",COUNTRY_INFO!O34=\"Non requis\",COUNTRY_INFO!O34=0),0,IF($E34<>0, IF($F34=0,COUNTRY_INFO!O34*$E34,COUNTRY_INFO!O34*($E34-$D34)),COUNTRY_INFO!O34*$E34))","v":0},null,{"$f":"IF(OR(COUNTRY_INFO!P34=\"Inconnu\",COUNTRY_INFO!P34=\"Surveillance\",COUNTRY_INFO!P34=\"Non requis\",COUNTRY_INFO!P34=0),0,IF(AND($E34<>0,$J34=\"\"),IF($F34=0,COUNTRY_INFO!P34*$E34,COUNTRY_INFO!P34*($E34-$D34)), IF(AND($E34<>0,$J34<>0),IF($F34=0,COUNTRY_INFO!P34*$J34,COUNTRY_INFO!P34*($J34-$D34)), COUNTRY_INFO!P34*$J34)))","v":0},0,0,null,0,0,null,0,0,null,0]
[{"$f":"IF(AND(INTRO!$E$37=\"Non endémique\",INTRO!$E$41=\"Non endémique\"),\" \",IF(COUNTRY_INFO!A35=0,\" \",COUNTRY_INFO!A35))","v":"NIGER"},{"$f":"IF(AND(INTRO!$E$37=\"Non endémique\",INTRO!$E$41=\"Non endémique\"),\" \",IF(COUNTRY_INFO!B35=0,\" \",COUNTRY_INFO!B35))","v":"Maradi"},{"$f":"IF(AND(INTRO!$E$37=\"Non endémique\",INTRO!$E$41=\"Non endémique\"),\" \",IF(COUNTRY_INFO!C35=0,\" \",COUNTRY_INFO!C35))","v":"Guidan Roumdji"},{"$f":"IF(AND(INTRO!$E$37=\"Non endémique\",INTRO!$E$41=\"Non endémique\"),0,COUNTRY_INFO!V35)","v":0},{"$f":"IF(AND(INTRO!$E$37=\"Non endémique\",INTRO!$E$41=\"Non endémique\"),0,COUNTRY_INFO!X35)","v":0},{"$f":"IF(INTRO!$E$39=\"Non endémique\",IF($D35=1,DEC!I35,0),IF($D35=1,IVM!G35,0))","v":0},null,{"$f":"IF(OR(COUNTRY_INFO!N35=\"Inconnu\",COUNTRY_INFO!N35=\"Surveillance\",COUNTRY_INFO!N35=\"Non requis\",COUNTRY_INFO!N35=0),0,IF(INTRO!$E$39=\"Non endémique\",IF(AND($E35<>0,$G35=\"\"),IF($F35=0,COUNTRY_INFO!N35*$E35,COUNTRY_INFO!N35*($E35-$D35)),IF(AND($E35<>0,$G35<>0),IF($F35=0,COUNTRY_INFO!N35*$G35,COUNTRY_INFO!N35*($G35-$D35)),0)),IF($G35=\"\",COUNTRY_INFO!N35*$E35,COUNTRY_INFO!N35*$G35)))","v":0},{"$f":"IF(OR(COUNTRY_INFO!O35=\"Inconnu\",COUNTRY_INFO!O35=\"Surveillance\",COUNTRY_INFO!O35=\"Non requis\",COUNTRY_INFO!O35=0),0,IF($E35<>0, IF($F35=0,COUNTRY_INFO!O35*$E35,COUNTRY_INFO!O35*($E35-$D35)),COUNTRY_INFO!O35*$E35))","v":0},null,{"$f":"IF(OR(COUNTRY_INFO!P35=\"Inconnu\",COUNTRY_INFO!P35=\"Surveillance\",COUNTRY_INFO!P35=\"Non requis\",COUNTRY_INFO!P35=0),0,IF(AND($E35<>0,$J35=\"\"),IF($F35=0,COUNTRY_INFO!P35*$E35,COUNTRY_INFO!P35*($E35-$D35)), IF(AND($E35<>0,$J35<>0),IF($F35=0,COUNTRY_INFO!P35*$J35,COUNTRY_INFO!P35*($J35-$D35)), COUNTRY_INFO!P35*$J35)))","v":0},0,0,null,0,0,null,0,0,null,0]
[{"$f":"IF(AND(INTRO!$E$37=\"Non endémique\",INTRO!$E$41=\"Non endémique\"),\" \",IF(COUNTRY_INFO!A36=0,\" \",COUNTRY_INFO!A36))","v":"NIGER"},{"$f":"IF(AND(INTRO!$E$37=\"Non endémique\",INTRO!$E$41=\"Non endémique\"),\" \",IF(COUNTRY_INFO!B36=0,\" \",COUNTRY_INFO!B36))","v":"Maradi"},{"$f":"IF(AND(INTRO!$E$37=\"Non endémique\",INTRO!$E$41=\"Non endémique\"),\" \",IF(COUNTRY_INFO!C36=0,\" \",COUNTRY_INFO!C36))","v":"Madarounfa"},{"$f":"IF(AND(INTRO!$E$37=\"Non endémique\",INTRO!$E$41=\"Non endémique\"),0,COUNTRY_INFO!V36)","v":0},{"$f":"IF(AND(INTRO!$E$37=\"Non endémique\",INTRO!$E$41=\"Non endémique\"),0,COUNTRY_INFO!X36)","v":0},{"$f":"IF(INTRO!$E$39=\"Non endémique\",IF($D36=1,DEC!I36,0),IF($D36=1,IVM!G36,0))","v":0},null,{"$f":"IF(OR(COUNTRY_INFO!N36=\"Inconnu\",COUNTRY_INFO!N36=\"Surveillance\",COUNTRY_INFO!N36=\"Non requis\",COUNTRY_INFO!N36=0),0,IF(INTRO!$E$39=\"Non endémique\",IF(AND($E36<>0,$G36=\"\"),IF($F36=0,COUNTRY_INFO!N36*$E36,COUNTRY_INFO!N36*($E36-$D36)),IF(AND($E36<>0,$G36<>0),IF($F36=0,COUNTRY_INFO!N36*$G36,COUNTRY_INFO!N36*($G36-$D36)),0)),IF($G36=\"\",COUNTRY_INFO!N36*$E36,COUNTRY_INFO!N36*$G36)))","v":0},{"$f":"IF(OR(COUNTRY_INFO!O36=\"Inconnu\",COUNTRY_INFO!O36=\"Surveillance\",COUNTRY_INFO!O36=\"Non requis\",COUNTRY_INFO!O36=0),0,IF($E36<>0, IF($F36=0,COUNTRY_INFO!O36*$E36,COUNTRY_INFO!O36*($E36-$D36)),COUNTRY_INFO!O36*$E36))","v":0},null,{"$f":"IF(OR(COUNTRY_INFO!P36=\"Inconnu\",COUNTRY_INFO!P36=\"Surveillance\",COUNTRY_INFO!P36=\"Non requis\",COUNTRY_INFO!P36=0),0,IF(AND($E36<>0,$J36=\"\"),IF($F36=0,COUNTRY_INFO!P36*$E36,COUNTRY_INFO!P36*($E36-$D36)), IF(AND($E36<>0,$J36<>0),IF($F36=0,COUNTRY_INFO!P36*$J36,COUNTRY_INFO!P36*($J36-$D36)), COUNTRY_INFO!P36*$J36)))","v":0},0,0,null,0,0,null,0,0,null,0]
[{"$f":"IF(AND(INTRO!$E$37=\"Non endémique\",INTRO!$E$41=\"Non endémique\"),\" \",IF(COUNTRY_INFO!A37=0,\" \",COUNTRY_INFO!A37))","v":"NIGER"},{"$f":"IF(AND(INTRO!$E$37=\"Non endémique\",INTRO!$E$41=\"Non endémique\"),\" \",IF(COUNTRY_INFO!B37=0,\" \",COUNTRY_INFO!B37))","v":"Maradi"},{"$f":"IF(AND(INTRO!$E$37=\"Non endémique\",INTRO!$E$41=\"Non endémique\"),\" \",IF(COUNTRY_INFO!C37=0,\" \",COUNTRY_INFO!C37))","v":"Maradi"},{"$f":"IF(AND(INTRO!$E$37=\"Non endémique\",INTRO!$E$41=\"Non endémique\"),0,COUNTRY_INFO!V37)","v":0},{"$f":"IF(AND(INTRO!$E$37=\"Non endémique\",INTRO!$E$41=\"Non endémique\"),0,COUNTRY_INFO!X37)","v":0},{"$f":"IF(INTRO!$E$39=\"Non endémique\",IF($D37=1,DEC!I37,0),IF($D37=1,IVM!G37,0))","v":0},null,{"$f":"IF(OR(COUNTRY_INFO!N37=\"Inconnu\",COUNTRY_INFO!N37=\"Surveillance\",COUNTRY_INFO!N37=\"Non requis\",COUNTRY_INFO!N37=0),0,IF(INTRO!$E$39=\"Non endémique\",IF(AND($E37<>0,$G37=\"\"),IF($F37=0,COUNTRY_INFO!N37*$E37,COUNTRY_INFO!N37*($E37-$D37)),IF(AND($E37<>0,$G37<>0),IF($F37=0,COUNTRY_INFO!N37*$G37,COUNTRY_INFO!N37*($G37-$D37)),0)),IF($G37=\"\",COUNTRY_INFO!N37*$E37,COUNTRY_INFO!N37*$G37)))","v":0},{"$f":"IF(OR(COUNTRY_INFO!O37=\"Inconnu\",COUNTRY_INFO!O37=\"Surveillance\",COUNTRY_INFO!O37=\"Non requis\",COUNTRY_INFO!O37=0),0,IF($E37<>0, IF($F37=0,COUNTRY_INFO!O37*$E37,COUNTRY_INFO!O37*($E37-$D37)),COUNTRY_INFO!O37*$E37))","v":0},null,{"$f":"IF(OR(COUNTRY_INFO!P37=\"Inconnu\",COUNTRY_INFO!P37=\"Surveillance\",COUNTRY_INFO!P37=\"Non requis\",COUNTRY_INFO!P37=0),0,IF(AND($E37<>0,$J37=\"\"),IF($F37=0,COUNTRY_INFO!P37*$E37,COUNTRY_INFO!P37*($E37-$D37)), IF(AND($E37<>0,$J37<>0),IF($F37=0,COUNTRY_INFO!P37*$J37,COUNTRY_INFO!P37*($J37-$D37)), COUNTRY_INFO!P37*$J37)))","v":0},0,0,null,0,0,null,0,0,null,0]
[{"$f":"IF(AND(INTRO!$E$37=\"Non endémique\",INTRO!$E$41=\"Non endémique\"),\" \",IF(COUNTRY_INFO!A38=0,\" \",COUNTRY_INFO!A38))","v":"NIGER"},{"$f":"IF(AND(INTRO!$E$37=\"Non endémique\",INTRO!$E$41=\"Non endémique\"),\" \",IF(COUNTRY_INFO!B38=0,\" \",COUNTRY_INFO!B38))","v":"Maradi"},{"$f":"IF(AND(INTRO!$E$37=\"Non endémique\",INTRO!$E$41=\"Non endémique\"),\" \",IF(COUNTRY_INFO!C38=0,\" \",COUNTRY_INFO!C38))","v":"Mayahi"},{"$f":"IF(AND(INTRO!$E$37=\"Non endémique\",INTRO!$E$41=\"Non endémique\"),0,COUNTRY_INFO!V38)","v":0},{"$f":"IF(AND(INTRO!$E$37=\"Non endémique\",INTRO!$E$41=\"Non endémique\"),0,COUNTRY_INFO!X38)","v":0},{"$f":"IF(INTRO!$E$39=\"Non endémique\",IF($D38=1,DEC!I38,0),IF($D38=1,IVM!G38,0))","v":0},null,{"$f":"IF(OR(COUNTRY_INFO!N38=\"Inconnu\",COUNTRY_INFO!N38=\"Surveillance\",COUNTRY_INFO!N38=\"Non requis\",COUNTRY_INFO!N38=0),0,IF(INTRO!$E$39=\"Non endémique\",IF(AND($E38<>0,$G38=\"\"),IF($F38=0,COUNTRY_INFO!N38*$E38,COUNTRY_INFO!N38*($E38-$D38)),IF(AND($E38<>0,$G38<>0),IF($F38=0,COUNTRY_INFO!N38*$G38,COUNTRY_INFO!N38*($G38-$D38)),0)),IF($G38=\"\",COUNTRY_INFO!N38*$E38,COUNTRY_INFO!N38*$G38)))","v":0},{"$f":"IF(OR(COUNTRY_INFO!O38=\"Inconnu\",COUNTRY_INFO!O38=\"Surveillance\",COUNTRY_INFO!O38=\"Non requis\",COUNTRY_INFO!O38=0),0,IF($E38<>0, IF($F38=0,COUNTRY_INFO!O38*$E38,COUNTRY_INFO!O38*($E38-$D38)),COUNTRY_INFO!O38*$E38))","v":0},null,{"$f":"IF(OR(COUNTRY_INFO!P38=\"Inconnu\",COUNTRY_INFO!P38=\"Surveillance\",COUNTRY_INFO!P38=\"Non requis\",COUNTRY_INFO!P38=0),0,IF(AND($E38<>0,$J38=\"\"),IF($F38=0,COUNTRY_INFO!P38*$E38,COUNTRY_INFO!P38*($E38-$D38)), IF(AND($E38<>0,$J38<>0),IF($F38=0,COUNTRY_INFO!P38*$J38,COUNTRY_INFO!P38*($J38-$D38)), COUNTRY_INFO!P38*$J38)))","v":0},0,0,null,0,0,null,0,0,null,0]
[{"$f":"IF(AND(INTRO!$E$37=\"Non endémique\",INTRO!$E$41=\"Non endémique\"),\" \",IF(COUNTRY_INFO!A39=0,\" \",COUNTRY_INFO!A39))","v":"NIGER"},{"$f":"IF(AND(INTRO!$E$37=\"Non endémique\",INTRO!$E$41=\"Non endémique\"),\" \",IF(COUNTRY_INFO!B39=0,\" \",COUNTRY_INFO!B39))","v":"Maradi"},{"$f":"IF(AND(INTRO!$E$37=\"Non endémique\",INTRO!$E$41=\"Non endémique\"),\" \",IF(COUNTRY_INFO!C39=0,\" \",COUNTRY_INFO!C39))","v":"Tessaoua"},{"$f":"IF(AND(INTRO!$E$37=\"Non endémique\",INTRO!$E$41=\"Non endémique\"),0,COUNTRY_INFO!V39)","v":0},{"$f":"IF(AND(INTRO!$E$37=\"Non endémique\",INTRO!$E$41=\"Non endémique\"),0,COUNTRY_INFO!X39)","v":0},{"$f":"IF(INTRO!$E$39=\"Non endémique\",IF($D39=1,DEC!I39,0),IF($D39=1,IVM!G39,0))","v":0},null,{"$f":"IF(OR(COUNTRY_INFO!N39=\"Inconnu\",COUNTRY_INFO!N39=\"Surveillance\",COUNTRY_INFO!N39=\"Non requis\",COUNTRY_INFO!N39=0),0,IF(INTRO!$E$39=\"Non endémique\",IF(AND($E39<>0,$G39=\"\"),IF($F39=0,COUNTRY_INFO!N39*$E39,COUNTRY_INFO!N39*($E39-$D39)),IF(AND($E39<>0,$G39<>0),IF($F39=0,COUNTRY_INFO!N39*$G39,COUNTRY_INFO!N39*($G39-$D39)),0)),IF($G39=\"\",COUNTRY_INFO!N39*$E39,COUNTRY_INFO!N39*$G39)))","v":0},{"$f":"IF(OR(COUNTRY_INFO!O39=\"Inconnu\",COUNTRY_INFO!O39=\"Surveillance\",COUNTRY_INFO!O39=\"Non requis\",COUNTRY_INFO!O39=0),0,IF($E39<>0, IF($F39=0,COUNTRY_INFO!O39*$E39,COUNTRY_INFO!O39*($E39-$D39)),COUNTRY_INFO!O39*$E39))","v":0},null,{"$f":"IF(OR(COUNTRY_INFO!P39=\"Inconnu\",COUNTRY_INFO!P39=\"Surveillance\",COUNTRY_INFO!P39=\"Non requis\",COUNTRY_INFO!P39=0),0,IF(AND($E39<>0,$J39=\"\"),IF($F39=0,COUNTRY_INFO!P39*$E39,COUNTRY_INFO!P39*($E39-$D39)), IF(AND($E39<>0,$J39<>0),IF($F39=0,COUNTRY_INFO!P39*$J39,COUNTRY_INFO!P39*($J39-$D39)), COUNTRY_INFO!P39*$J39)))","v":0},0,0,null,0,0,null,0,0,null,0]
[{"$f":"IF(AND(INTRO!$E$37=\"Non endémique\",INTRO!$E$41=\"Non endémique\"),\" \",IF(COUNTRY_INFO!A40=0,\" \",COUNTRY_INFO!A40))","v":"NIGER"},{"$f":"IF(AND(INTRO!$E$37=\"Non endémique\",INTRO!$E$41=\"Non endémique\"),\" \",IF(COUNTRY_INFO!B40=0,\" \",COUNTRY_INFO!B40))","v":"Niamey"},{"$f":"IF(AND(INTRO!$E$37=\"Non endémique\",INTRO!$E$41=\"Non endémique\"),\" \",IF(COUNTRY_INFO!C40=0,\" \",COUNTRY_INFO!C40))","v":"Niamey 1"},{"$f":"IF(AND(INTRO!$E$37=\"Non endémique\",INTRO!$E$41=\"Non endémique\"),0,COUNTRY_INFO!V40)","v":0},{"$f":"IF(AND(INTRO!$E$37=\"Non endémique\",INTRO!$E$41=\"Non endémique\"),0,COUNTRY_INFO!X40)","v":0},{"$f":"IF(INTRO!$E$39=\"Non endémique\",IF($D40=1,DEC!I40,0),IF($D40=1,IVM!G40,0))","v":0},null,{"$f":"IF(OR(COUNTRY_INFO!N40=\"Inconnu\",COUNTRY_INFO!N40=\"Surveillance\",COUNTRY_INFO!N40=\"Non requis\",COUNTRY_INFO!N40=0),0,IF(INTRO!$E$39=\"Non endémique\",IF(AND($E40<>0,$G40=\"\"),IF($F40=0,COUNTRY_INFO!N40*$E40,COUNTRY_INFO!N40*($E40-$D40)),IF(AND($E40<>0,$G40<>0),IF($F40=0,COUNTRY_INFO!N40*$G40,COUNTRY_INFO!N40*($G40-$D40)),0)),IF($G40=\"\",COUNTRY_INFO!N40*$E40,COUNTRY_INFO!N40*$G40)))","v":0},{"$f":"IF(OR(COUNTRY_INFO!O40=\"Inconnu\",COUNTRY_INFO!O40=\"Surveillance\",COUNTRY_INFO!O40=\"Non requis\",COUNTRY_INFO!O40=0),0,IF($E40<>0, IF($F40=0,COUNTRY_INFO!O40*$E40,COUNTRY_INFO!O40*($E40-$D40)),COUNTRY_INFO!O40*$E40))","v":0},null,{"$f":"IF(OR(COUNTRY_INFO!P40=\"Inconnu\",COUNTRY_INFO!P40=\"Surveillance\",COUNTRY_INFO!P40=\"Non requis\",COUNTRY_INFO!P40=0),0,IF(AND($E40<>0,$J40=\"\"),IF($F40=0,COUNTRY_INFO!P40*$E40,COUNTRY_INFO!P40*($E40-$D40)), IF(AND($E40<>0,$J40<>0),IF($F40=0,COUNTRY_INFO!P40*$J40,COUNTRY_INFO!P40*($J40-$D40)), COUNTRY_INFO!P40*$J40)))","v":0},0,0,null,0,0,null,0,0,null,0]
[{"$f":"IF(AND(INTRO!$E$37=\"Non endémique\",INTRO!$E$41=\"Non endémique\"),\" \",IF(COUNTRY_INFO!A41=0,\" \",COUNTRY_INFO!A41))","v":"NIGER"},{"$f":"IF(AND(INTRO!$E$37=\"Non endémique\",INTRO!$E$41=\"Non endémique\"),\" \",IF(COUNTRY_INFO!B41=0,\" \",COUNTRY_INFO!B41))","v":"Niamey"},{"$f":"IF(AND(INTRO!$E$37=\"Non endémique\",INTRO!$E$41=\"Non endémique\"),\" \",IF(COUNTRY_INFO!C41=0,\" \",COUNTRY_INFO!C41))","v":"Niamey 2"},{"$f":"IF(AND(INTRO!$E$37=\"Non endémique\",INTRO!$E$41=\"Non endémique\"),0,COUNTRY_INFO!V41)","v":0},{"$f":"IF(AND(INTRO!$E$37=\"Non endémique\",INTRO!$E$41=\"Non endémique\"),0,COUNTRY_INFO!X41)","v":0},{"$f":"IF(INTRO!$E$39=\"Non endémique\",IF($D41=1,DEC!I41,0),IF($D41=1,IVM!G41,0))","v":0},null,{"$f":"IF(OR(COUNTRY_INFO!N41=\"Inconnu\",COUNTRY_INFO!N41=\"Surveillance\",COUNTRY_INFO!N41=\"Non requis\",COUNTRY_INFO!N41=0),0,IF(INTRO!$E$39=\"Non endémique\",IF(AND($E41<>0,$G41=\"\"),IF($F41=0,COUNTRY_INFO!N41*$E41,COUNTRY_INFO!N41*($E41-$D41)),IF(AND($E41<>0,$G41<>0),IF($F41=0,COUNTRY_INFO!N41*$G41,COUNTRY_INFO!N41*($G41-$D41)),0)),IF($G41=\"\",COUNTRY_INFO!N41*$E41,COUNTRY_INFO!N41*$G41)))","v":0},{"$f":"IF(OR(COUNTRY_INFO!O41=\"Inconnu\",COUNTRY_INFO!O41=\"Surveillance\",COUNTRY_INFO!O41=\"Non requis\",COUNTRY_INFO!O41=0),0,IF($E41<>0, IF($F41=0,COUNTRY_INFO!O41*$E41,COUNTRY_INFO!O41*($E41-$D41)),COUNTRY_INFO!O41*$E41))","v":0},null,{"$f":"IF(OR(COUNTRY_INFO!P41=\"Inconnu\",COUNTRY_INFO!P41=\"Surveillance\",COUNTRY_INFO!P41=\"Non requis\",COUNTRY_INFO!P41=0),0,IF(AND($E41<>0,$J41=\"\"),IF($F41=0,COUNTRY_INFO!P41*$E41,COUNTRY_INFO!P41*($E41-$D41)), IF(AND($E41<>0,$J41<>0),IF($F41=0,COUNTRY_INFO!P41*$J41,COUNTRY_INFO!P41*($J41-$D41)), COUNTRY_INFO!P41*$J41)))","v":0},0,0,null,0,0,null,0,0,null,0]
[{"$f":"IF(AND(INTRO!$E$37=\"Non endémique\",INTRO!$E$41=\"Non endémique\"),\" \",IF(COUNTRY_INFO!A42=0,\" \",COUNTRY_INFO!A42))","v":"NIGER"},{"$f":"IF(AND(INTRO!$E$37=\"Non endémique\",INTRO!$E$41=\"Non endémique\"),\" \",IF(COUNTRY_INFO!B42=0,\" \",COUNTRY_INFO!B42))","v":"Niamey"},{"$f":"IF(AND(INTRO!$E$37=\"Non endémique\",INTRO!$E$41=\"Non endémique\"),\" \",IF(COUNTRY_INFO!C42=0,\" \",COUNTRY_INFO!C42))","v":"Niamey 3"},{"$f":"IF(AND(INTRO!$E$37=\"Non endémique\",INTRO!$E$41=\"Non endémique\"),0,COUNTRY_INFO!V42)","v":0},{"$f":"IF(AND(INTRO!$E$37=\"Non endémique\",INTRO!$E$41=\"Non endémique\"),0,COUNTRY_INFO!X42)","v":0},{"$f":"IF(INTRO!$E$39=\"Non endémique\",IF($D42=1,DEC!I42,0),IF($D42=1,IVM!G42,0))","v":0},null,{"$f":"IF(OR(COUNTRY_INFO!N42=\"Inconnu\",COUNTRY_INFO!N42=\"Surveillance\",COUNTRY_INFO!N42=\"Non requis\",COUNTRY_INFO!N42=0),0,IF(INTRO!$E$39=\"Non endémique\",IF(AND($E42<>0,$G42=\"\"),IF($F42=0,COUNTRY_INFO!N42*$E42,COUNTRY_INFO!N42*($E42-$D42)),IF(AND($E42<>0,$G42<>0),IF($F42=0,COUNTRY_INFO!N42*$G42,COUNTRY_INFO!N42*($G42-$D42)),0)),IF($G42=\"\",COUNTRY_INFO!N42*$E42,COUNTRY_INFO!N42*$G42)))","v":0},{"$f":"IF(OR(COUNTRY_INFO!O42=\"Inconnu\",COUNTRY_INFO!O42=\"Surveillance\",COUNTRY_INFO!O42=\"Non requis\",COUNTRY_INFO!O42=0),0,IF($E42<>0, IF($F42=0,COUNTRY_INFO!O42*$E42,COUNTRY_INFO!O42*($E42-$D42)),COUNTRY_INFO!O42*$E42))","v":0},null,{"$f":"IF(OR(COUNTRY_INFO!P42=\"Inconnu\",COUNTRY_INFO!P42=\"Surveillance\",COUNTRY_INFO!P42=\"Non requis\",COUNTRY_INFO!P42=0),0,IF(AND($E42<>0,$J42=\"\"),IF($F42=0,COUNTRY_INFO!P42*$E42,COUNTRY_INFO!P42*($E42-$D42)), IF(AND($E42<>0,$J42<>0),IF($F42=0,COUNTRY_INFO!P42*$J42,COUNTRY_INFO!P42*($J42-$D42)), COUNTRY_INFO!P42*$J42)))","v":0},0,0,null,0,0,null,0,0,null,0]
[{"$f":"IF(AND(INTRO!$E$37=\"Non endémique\",INTRO!$E$41=\"Non endémique\"),\" \",IF(COUNTRY_INFO!A43=0,\" \",COUNTRY_INFO!A43))","v":"NIGER"},{"$f":"IF(AND(INTRO!$E$37=\"Non endémique\",INTRO!$E$41=\"Non endémique\"),\" \",IF(COUNTRY_INFO!B43=0,\" \",COUNTRY_INFO!B43))","v":"Niamey"},{"$f":"IF(AND(INTRO!$E$37=\"Non endémique\",INTRO!$E$41=\"Non endémique\"),\" \",IF(COUNTRY_INFO!C43=0,\" \",COUNTRY_INFO!C43))","v":"Niamey 4"},{"$f":"IF(AND(INTRO!$E$37=\"Non endémique\",INTRO!$E$41=\"Non endémique\"),0,COUNTRY_INFO!V43)","v":0},{"$f":"IF(AND(INTRO!$E$37=\"Non endémique\",INTRO!$E$41=\"Non endémique\"),0,COUNTRY_INFO!X43)","v":0},{"$f":"IF(INTRO!$E$39=\"Non endémique\",IF($D43=1,DEC!I43,0),IF($D43=1,IVM!G43,0))","v":0},null,{"$f":"IF(OR(COUNTRY_INFO!N43=\"Inconnu\",COUNTRY_INFO!N43=\"Surveillance\",COUNTRY_INFO!N43=\"Non requis\",COUNTRY_INFO!N43=0),0,IF(INTRO!$E$39=\"Non endémique\",IF(AND($E43<>0,$G43=\"\"),IF($F43=0,COUNTRY_INFO!N43*$E43,COUNTRY_INFO!N43*($E43-$D43)),IF(AND($E43<>0,$G43<>0),IF($F43=0,COUNTRY_INFO!N43*$G43,COUNTRY_INFO!N43*($G43-$D43)),0)),IF($G43=\"\",COUNTRY_INFO!N43*$E43,COUNTRY_INFO!N43*$G43)))","v":0},{"$f":"IF(OR(COUNTRY_INFO!O43=\"Inconnu\",COUNTRY_INFO!O43=\"Surveillance\",COUNTRY_INFO!O43=\"Non requis\",COUNTRY_INFO!O43=0),0,IF($E43<>0, IF($F43=0,COUNTRY_INFO!O43*$E43,COUNTRY_INFO!O43*($E43-$D43)),COUNTRY_INFO!O43*$E43))","v":0},null,{"$f":"IF(OR(COUNTRY_INFO!P43=\"Inconnu\",COUNTRY_INFO!P43=\"Surveillance\",COUNTRY_INFO!P43=\"Non requis\",COUNTRY_INFO!P43=0),0,IF(AND($E43<>0,$J43=\"\"),IF($F43=0,COUNTRY_INFO!P43*$E43,COUNTRY_INFO!P43*($E43-$D43)), IF(AND($E43<>0,$J43<>0),IF($F43=0,COUNTRY_INFO!P43*$J43,COUNTRY_INFO!P43*($J43-$D43)), COUNTRY_INFO!P43*$J43)))","v":0},0,0,null,0,0,null,0,0,null,0]
[{"$f":"IF(AND(INTRO!$E$37=\"Non endémique\",INTRO!$E$41=\"Non endémique\"),\" \",IF(COUNTRY_INFO!A44=0,\" \",COUNTRY_INFO!A44))","v":"NIGER"},{"$f":"IF(AND(INTRO!$E$37=\"Non endémique\",INTRO!$E$41=\"Non endémique\"),\" \",IF(COUNTRY_INFO!B44=0,\" \",COUNTRY_INFO!B44))","v":"Niamey"},{"$f":"IF(AND(INTRO!$E$37=\"Non endémique\",INTRO!$E$41=\"Non endémique\"),\" \",IF(COUNTRY_INFO!C44=0,\" \",COUNTRY_INFO!C44))","v":"Niamey 5"},{"$f":"IF(AND(INTRO!$E$37=\"Non endémique\",INTRO!$E$41=\"Non endémique\"),0,COUNTRY_INFO!V44)","v":0},{"$f":"IF(AND(INTRO!$E$37=\"Non endémique\",INTRO!$E$41=\"Non endémique\"),0,COUNTRY_INFO!X44)","v":0},{"$f":"IF(INTRO!$E$39=\"Non endémique\",IF($D44=1,DEC!I44,0),IF($D44=1,IVM!G44,0))","v":0},null,{"$f":"IF(OR(COUNTRY_INFO!N44=\"Inconnu\",COUNTRY_INFO!N44=\"Surveillance\",COUNTRY_INFO!N44=\"Non requis\",COUNTRY_INFO!N44=0),0,IF(INTRO!$E$39=\"Non endémique\",IF(AND($E44<>0,$G44=\"\"),IF($F44=0,COUNTRY_INFO!N44*$E44,COUNTRY_INFO!N44*($E44-$D44)),IF(AND($E44<>0,$G44<>0),IF($F44=0,COUNTRY_INFO!N44*$G44,COUNTRY_INFO!N44*($G44-$D44)),0)),IF($G44=\"\",COUNTRY_INFO!N44*$E44,COUNTRY_INFO!N44*$G44)))","v":0},{"$f":"IF(OR(COUNTRY_INFO!O44=\"Inconnu\",COUNTRY_INFO!O44=\"Surveillance\",COUNTRY_INFO!O44=\"Non requis\",COUNTRY_INFO!O44=0),0,IF($E44<>0, IF($F44=0,COUNTRY_INFO!O44*$E44,COUNTRY_INFO!O44*($E44-$D44)),COUNTRY_INFO!O44*$E44))","v":0},null,{"$f":"IF(OR(COUNTRY_INFO!P44=\"Inconnu\",COUNTRY_INFO!P44=\"Surveillance\",COUNTRY_INFO!P44=\"Non requis\",COUNTRY_INFO!P44=0),0,IF(AND($E44<>0,$J44=\"\"),IF($F44=0,COUNTRY_INFO!P44*$E44,COUNTRY_INFO!P44*($E44-$D44)), IF(AND($E44<>0,$J44<>0),IF($F44=0,COUNTRY_INFO!P44*$J44,COUNTRY_INFO!P44*($J44-$D44)), COUNTRY_INFO!P44*$J44)))","v":0},0,0,null,0,0,null,0,0,null,0]
[{"$f":"IF(AND(INTRO!$E$37=\"Non endémique\",INTRO!$E$41=\"Non endémique\"),\" \",IF(COUNTRY_INFO!A45=0,\" \",COUNTRY_INFO!A45))","v":"NIGER"},{"$f":"IF(AND(INTRO!$E$37=\"Non endémique\",INTRO!$E$41=\"Non endémique\"),\" \",IF(COUNTRY_INFO!B45=0,\" \",COUNTRY_INFO!B45))","v":"Tahoua"},{"$f":"IF(AND(INTRO!$E$37=\"Non endémique\",INTRO!$E$41=\"Non endémique\"),\" \",IF(COUNTRY_INFO!C45=0,\" \",COUNTRY_INFO!C45))","v":"Abalak"},{"$f":"IF(AND(INTRO!$E$37=\"Non endémique\",INTRO!$E$41=\"Non endémique\"),0,COUNTRY_INFO!V45)","v":0},{"$f":"IF(AND(INTRO!$E$37=\"Non endémique\",INTRO!$E$41=\"Non endémique\"),0,COUNTRY_INFO!X45)","v":0},{"$f":"IF(INTRO!$E$39=\"Non endémique\",IF($D45=1,DEC!I45,0),IF($D45=1,IVM!G45,0))","v":0},null,{"$f":"IF(OR(COUNTRY_INFO!N45=\"Inconnu\",COUNTRY_INFO!N45=\"Surveillance\",COUNTRY_INFO!N45=\"Non requis\",COUNTRY_INFO!N45=0),0,IF(INTRO!$E$39=\"Non endémique\",IF(AND($E45<>0,$G45=\"\"),IF($F45=0,COUNTRY_INFO!N45*$E45,COUNTRY_INFO!N45*($E45-$D45)),IF(AND($E45<>0,$G45<>0),IF($F45=0,COUNTRY_INFO!N45*$G45,COUNTRY_INFO!N45*($G45-$D45)),0)),IF($G45=\"\",COUNTRY_INFO!N45*$E45,COUNTRY_INFO!N45*$G45)))","v":0},{"$f":"IF(OR(COUNTRY_INFO!O45=\"Inconnu\",COUNTRY_INFO!O45=\"Surveillance\",COUNTRY_INFO!O45=\"Non requis\",COUNTRY_INFO!O45=0),0,IF($E45<>0, IF($F45=0,COUNTRY_INFO!O45*$E45,COUNTRY_INFO!O45*($E45-$D45)),COUNTRY_INFO!O45*$E45))","v":0},null,{"$f":"IF(OR(COUNTRY_INFO!P45=\"Inconnu\",COUNTRY_INFO!P45=\"Surveillance\",COUNTRY_INFO!P45=\"Non requis\",COUNTRY_INFO!P45=0),0,IF(AND($E45<>0,$J45=\"\"),IF($F45=0,COUNTRY_INFO!P45*$E45,COUNTRY_INFO!P45*($E45-$D45)), IF(AND($E45<>0,$J45<>0),IF($F45=0,COUNTRY_INFO!P45*$J45,COUNTRY_INFO!P45*($J45-$D45)), COUNTRY_INFO!P45*$J45)))","v":0},0,0,null,0,0,null,0,0,null,0]
[{"$f":"IF(AND(INTRO!$E$37=\"Non endémique\",INTRO!$E$41=\"Non endémique\"),\" \",IF(COUNTRY_INFO!A46=0,\" \",COUNTRY_INFO!A46))","v":"NIGER"},{"$f":"IF(AND(INTRO!$E$37=\"Non endémique\",INTRO!$E$41=\"Non endémique\"),\" \",IF(COUNTRY_INFO!B46=0,\" \",COUNTRY_INFO!B46))","v":"Tahoua"},{"$f":"IF(AND(INTRO!$E$37=\"Non endémique\",INTRO!$E$41=\"Non endémique\"),\" \",IF(COUNTRY_INFO!C46=0,\" \",COUNTRY_INFO!C46))","v":"Birnin' Konni"},{"$f":"IF(AND(INTRO!$E$37=\"Non endémique\",INTRO!$E$41=\"Non endémique\"),0,COUNTRY_INFO!V46)","v":0},{"$f":"IF(AND(INTRO!$E$37=\"Non endémique\",INTRO!$E$41=\"Non endémique\"),0,COUNTRY_INFO!X46)","v":0},{"$f":"IF(INTRO!$E$39=\"Non endémique\",IF($D46=1,DEC!I46,0),IF($D46=1,IVM!G46,0))","v":0},null,{"$f":"IF(OR(COUNTRY_INFO!N46=\"Inconnu\",COUNTRY_INFO!N46=\"Surveillance\",COUNTRY_INFO!N46=\"Non requis\",COUNTRY_INFO!N46=0),0,IF(INTRO!$E$39=\"Non endémique\",IF(AND($E46<>0,$G46=\"\"),IF($F46=0,COUNTRY_INFO!N46*$E46,COUNTRY_INFO!N46*($E46-$D46)),IF(AND($E46<>0,$G46<>0),IF($F46=0,COUNTRY_INFO!N46*$G46,COUNTRY_INFO!N46*($G46-$D46)),0)),IF($G46=\"\",COUNTRY_INFO!N46*$E46,COUNTRY_INFO!N46*$G46)))","v":0},{"$f":"IF(OR(COUNTRY_INFO!O46=\"Inconnu\",COUNTRY_INFO!O46=\"Surveillance\",COUNTRY_INFO!O46=\"Non requis\",COUNTRY_INFO!O46=0),0,IF($E46<>0, IF($F46=0,COUNTRY_INFO!O46*$E46,COUNTRY_INFO!O46*($E46-$D46)),COUNTRY_INFO!O46*$E46))","v":0},null,{"$f":"IF(OR(COUNTRY_INFO!P46=\"Inconnu\",COUNTRY_INFO!P46=\"Surveillance\",COUNTRY_INFO!P46=\"Non requis\",COUNTRY_INFO!P46=0),0,IF(AND($E46<>0,$J46=\"\"),IF($F46=0,COUNTRY_INFO!P46*$E46,COUNTRY_INFO!P46*($E46-$D46)), IF(AND($E46<>0,$J46<>0),IF($F46=0,COUNTRY_INFO!P46*$J46,COUNTRY_INFO!P46*($J46-$D46)), COUNTRY_INFO!P46*$J46)))","v":0},0,0,null,0,0,null,0,0,null,0]
[{"$f":"IF(AND(INTRO!$E$37=\"Non endémique\",INTRO!$E$41=\"Non endémique\"),\" \",IF(COUNTRY_INFO!A47=0,\" \",COUNTRY_INFO!A47))","v":"NIGER"},{"$f":"IF(AND(INTRO!$E$37=\"Non endémique\",INTRO!$E$41=\"Non endémique\"),\" \",IF(COUNTRY_INFO!B47=0,\" \",COUNTRY_INFO!B47))","v":"Tahoua"},{"$f":"IF(AND(INTRO!$E$37=\"Non endémique\",INTRO!$E$41=\"Non endémique\"),\" \",IF(COUNTRY_INFO!C47=0,\" \",COUNTRY_INFO!C47))","v":"Malbaza"},{"$f":"IF(AND(INTRO!$E$37=\"Non endémique\",INTRO!$E$41=\"Non endémique\"),0,COUNTRY_INFO!V47)","v":0},{"$f":"IF(AND(INTRO!$E$37=\"Non endémique\",INTRO!$E$41=\"Non endémique\"),0,COUNTRY_INFO!X47)","v":0},{"$f":"IF(INTRO!$E$39=\"Non endémique\",IF($D47=1,DEC!I47,0),IF($D47=1,IVM!G47,0))","v":0},null,{"$f":"IF(OR(COUNTRY_INFO!N47=\"Inconnu\",COUNTRY_INFO!N47=\"Surveillance\",COUNTRY_INFO!N47=\"Non requis\",COUNTRY_INFO!N47=0),0,IF(INTRO!$E$39=\"Non endémique\",IF(AND($E47<>0,$G47=\"\"),IF($F47=0,COUNTRY_INFO!N47*$E47,COUNTRY_INFO!N47*($E47-$D47)),IF(AND($E47<>0,$G47<>0),IF($F47=0,COUNTRY_INFO!N47*$G47,COUNTRY_INFO!N47*($G47-$D47)),0)),IF($G47=\"\",COUNTRY_INFO!N47*$E47,COUNTRY_INFO!N47*$G47)))","v":0},{"$f":"IF(OR(COUNTRY_INFO!O47=\"Inconnu\",COUNTRY_INFO!O47=\"Surveillance\",COUNTRY_INFO!O47=\"Non requis\",COUNTRY_INFO!O47=0),0,IF($E47<>0, IF($F47=0,COUNTRY_INFO!O47*$E47,COUNTRY_INFO!O47*($E47-$D47)),COUNTRY_INFO!O47*$E47))","v":0},null,{"$f":"IF(OR(COUNTRY_INFO!P47=\"Inconnu\",COUNTRY_INFO!P47=\"Surveillance\",COUNTRY_INFO!P47=\"Non requis\",COUNTRY_INFO!P47=0),0,IF(AND($E47<>0,$J47=\"\"),IF($F47=0,COUNTRY_INFO!P47*$E47,COUNTRY_INFO!P47*($E47-$D47)), IF(AND($E47<>0,$J47<>0),IF($F47=0,COUNTRY_INFO!P47*$J47,COUNTRY_INFO!P47*($J47-$D47)), COUNTRY_INFO!P47*$J47)))","v":0},0,0,null,0,0,null,0,0,null,0]
[{"$f":"IF(AND(INTRO!$E$37=\"Non endémique\",INTRO!$E$41=\"Non endémique\"),\" \",IF(COUNTRY_INFO!A48=0,\" \",COUNTRY_INFO!A48))","v":"NIGER"},{"$f":"IF(AND(INTRO!$E$37=\"Non endémique\",INTRO!$E$41=\"Non endémique\"),\" \",IF(COUNTRY_INFO!B48=0,\" \",COUNTRY_INFO!B48))","v":"Tahoua"},{"$f":"IF(AND(INTRO!$E$37=\"Non endémique\",INTRO!$E$41=\"Non endémique\"),\" \",IF(COUNTRY_INFO!C48=0,\" \",COUNTRY_INFO!C48))","v":"Bouza"},{"$f":"IF(AND(INTRO!$E$37=\"Non endémique\",INTRO!$E$41=\"Non endémique\"),0,COUNTRY_INFO!V48)","v":0},{"$f":"IF(AND(INTRO!$E$37=\"Non endémique\",INTRO!$E$41=\"Non endémique\"),0,COUNTRY_INFO!X48)","v":0},{"$f":"IF(INTRO!$E$39=\"Non endémique\",IF($D48=1,DEC!I48,0),IF($D48=1,IVM!G48,0))","v":0},null,{"$f":"IF(OR(COUNTRY_INFO!N48=\"Inconnu\",COUNTRY_INFO!N48=\"Surveillance\",COUNTRY_INFO!N48=\"Non requis\",COUNTRY_INFO!N48=0),0,IF(INTRO!$E$39=\"Non endémique\",IF(AND($E48<>0,$G48=\"\"),IF($F48=0,COUNTRY_INFO!N48*$E48,COUNTRY_INFO!N48*($E48-$D48)),IF(AND($E48<>0,$G48<>0),IF($F48=0,COUNTRY_INFO!N48*$G48,COUNTRY_INFO!N48*($G48-$D48)),0)),IF($G48=\"\",COUNTRY_INFO!N48*$E48,COUNTRY_INFO!N48*$G48)))","v":0},{"$f":"IF(OR(COUNTRY_INFO!O48=\"Inconnu\",COUNTRY_INFO!O48=\"Surveillance\",COUNTRY_INFO!O48=\"Non requis\",COUNTRY_INFO!O48=0),0,IF($E48<>0, IF($F48=0,COUNTRY_INFO!O48*$E48,COUNTRY_INFO!O48*($E48-$D48)),COUNTRY_INFO!O48*$E48))","v":0},null,{"$f":"IF(OR(COUNTRY_INFO!P48=\"Inconnu\",COUNTRY_INFO!P48=\"Surveillance\",COUNTRY_INFO!P48=\"Non requis\",COUNTRY_INFO!P48=0),0,IF(AND($E48<>0,$J48=\"\"),IF($F48=0,COUNTRY_INFO!P48*$E48,COUNTRY_INFO!P48*($E48-$D48)), IF(AND($E48<>0,$J48<>0),IF($F48=0,COUNTRY_INFO!P48*$J48,COUNTRY_INFO!P48*($J48-$D48)), COUNTRY_INFO!P48*$J48)))","v":0},0,0,null,0,0,null,0,0,null,0]
[{"$f":"IF(AND(INTRO!$E$37=\"Non endémique\",INTRO!$E$41=\"Non endémique\"),\" \",IF(COUNTRY_INFO!A49=0,\" \",COUNTRY_INFO!A49))","v":"NIGER"},{"$f":"IF(AND(INTRO!$E$37=\"Non endémique\",INTRO!$E$41=\"Non endémique\"),\" \",IF(COUNTRY_INFO!B49=0,\" \",COUNTRY_INFO!B49))","v":"Tahoua"},{"$f":"IF(AND(INTRO!$E$37=\"Non endémique\",INTRO!$E$41=\"Non endémique\"),\" \",IF(COUNTRY_INFO!C49=0,\" \",COUNTRY_INFO!C49))","v":"Illela"},{"$f":"IF(AND(INTRO!$E$37=\"Non endémique\",INTRO!$E$41=\"Non endémique\"),0,COUNTRY_INFO!V49)","v":0},{"$f":"IF(AND(INTRO!$E$37=\"Non endémique\",INTRO!$E$41=\"Non endémique\"),0,COUNTRY_INFO!X49)","v":0},{"$f":"IF(INTRO!$E$39=\"Non endémique\",IF($D49=1,DEC!I49,0),IF($D49=1,IVM!G49,0))","v":0},null,{"$f":"IF(OR(COUNTRY_INFO!N49=\"Inconnu\",COUNTRY_INFO!N49=\"Surveillance\",COUNTRY_INFO!N49=\"Non requis\",COUNTRY_INFO!N49=0),0,IF(INTRO!$E$39=\"Non endémique\",IF(AND($E49<>0,$G49=\"\"),IF($F49=0,COUNTRY_INFO!N49*$E49,COUNTRY_INFO!N49*($E49-$D49)),IF(AND($E49<>0,$G49<>0),IF($F49=0,COUNTRY_INFO!N49*$G49,COUNTRY_INFO!N49*($G49-$D49)),0)),IF($G49=\"\",COUNTRY_INFO!N49*$E49,COUNTRY_INFO!N49*$G49)))","v":0},{"$f":"IF(OR(COUNTRY_INFO!O49=\"Inconnu\",COUNTRY_INFO!O49=\"Surveillance\",COUNTRY_INFO!O49=\"Non requis\",COUNTRY_INFO!O49=0),0,IF($E49<>0, IF($F49=0,COUNTRY_INFO!O49*$E49,COUNTRY_INFO!O49*($E49-$D49)),COUNTRY_INFO!O49*$E49))","v":0},null,{"$f":"IF(OR(COUNTRY_INFO!P49=\"Inconnu\",COUNTRY_INFO!P49=\"Surveillance\",COUNTRY_INFO!P49=\"Non requis\",COUNTRY_INFO!P49=0),0,IF(AND($E49<>0,$J49=\"\"),IF($F49=0,COUNTRY_INFO!P49*$E49,COUNTRY_INFO!P49*($E49-$D49)), IF(AND($E49<>0,$J49<>0),IF($F49=0,COUNTRY_INFO!P49*$J49,COUNTRY_INFO!P49*($J49-$D49)), COUNTRY_INFO!P49*$J49)))","v":0},0,0,null,0,0,null,0,0,null,0]
[{"$f":"IF(AND(INTRO!$E$37=\"Non endémique\",INTRO!$E$41=\"Non endémique\"),\" \",IF(COUNTRY_INFO!A50=0,\" \",COUNTRY_INFO!A50))","v":"NIGER"},{"$f":"IF(AND(INTRO!$E$37=\"Non endémique\",INTRO!$E$41=\"Non endémique\"),\" \",IF(COUNTRY_INFO!B50=0,\" \",COUNTRY_INFO!B50))","v":"Tahoua"},{"$f":"IF(AND(INTRO!$E$37=\"Non endémique\",INTRO!$E$41=\"Non endémique\"),\" \",IF(COUNTRY_INFO!C50=0,\" \",COUNTRY_INFO!C50))","v":"Bagaroua"},{"$f":"IF(AND(INTRO!$E$37=\"Non endémique\",INTRO!$E$41=\"Non endémique\"),0,COUNTRY_INFO!V50)","v":0},{"$f":"IF(AND(INTRO!$E$37=\"Non endémique\",INTRO!$E$41=\"Non endémique\"),0,COUNTRY_INFO!X50)","v":0},{"$f":"IF(INTRO!$E$39=\"Non endémique\",IF($D50=1,DEC!I50,0),IF($D50=1,IVM!G50,0))","v":0},null,{"$f":"IF(OR(COUNTRY_INFO!N50=\"Inconnu\",COUNTRY_INFO!N50=\"Surveillance\",COUNTRY_INFO!N50=\"Non requis\",COUNTRY_INFO!N50=0),0,IF(INTRO!$E$39=\"Non endémique\",IF(AND($E50<>0,$G50=\"\"),IF($F50=0,COUNTRY_INFO!N50*$E50,COUNTRY_INFO!N50*($E50-$D50)),IF(AND($E50<>0,$G50<>0),IF($F50=0,COUNTRY_INFO!N50*$G50,COUNTRY_INFO!N50*($G50-$D50)),0)),IF($G50=\"\",COUNTRY_INFO!N50*$E50,COUNTRY_INFO!N50*$G50)))","v":0},{"$f":"IF(OR(COUNTRY_INFO!O50=\"Inconnu\",COUNTRY_INFO!O50=\"Surveillance\",COUNTRY_INFO!O50=\"Non requis\",COUNTRY_INFO!O50=0),0,IF($E50<>0, IF($F50=0,COUNTRY_INFO!O50*$E50,COUNTRY_INFO!O50*($E50-$D50)),COUNTRY_INFO!O50*$E50))","v":0},null,{"$f":"IF(OR(COUNTRY_INFO!P50=\"Inconnu\",COUNTRY_INFO!P50=\"Surveillance\",COUNTRY_INFO!P50=\"Non requis\",COUNTRY_INFO!P50=0),0,IF(AND($E50<>0,$J50=\"\"),IF($F50=0,COUNTRY_INFO!P50*$E50,COUNTRY_INFO!P50*($E50-$D50)), IF(AND($E50<>0,$J50<>0),IF($F50=0,COUNTRY_INFO!P50*$J50,COUNTRY_INFO!P50*($J50-$D50)), COUNTRY_INFO!P50*$J50)))","v":0},0,0,null,0,0,null,0,0,null,0]
[{"$f":"IF(AND(INTRO!$E$37=\"Non endémique\",INTRO!$E$41=\"Non endémique\"),\" \",IF(COUNTRY_INFO!A51=0,\" \",COUNTRY_INFO!A51))","v":"NIGER"},{"$f":"IF(AND(INTRO!$E$37=\"Non endémique\",INTRO!$E$41=\"Non endémique\"),\" \",IF(COUNTRY_INFO!B51=0,\" \",COUNTRY_INFO!B51))","v":"Tahoua"},{"$f":"IF(AND(INTRO!$E$37=\"Non endémique\",INTRO!$E$41=\"Non endémique\"),\" \",IF(COUNTRY_INFO!C51=0,\" \",COUNTRY_INFO!C51))","v":"Keita"},{"$f":"IF(AND(INTRO!$E$37=\"Non endémique\",INTRO!$E$41=\"Non endémique\"),0,COUNTRY_INFO!V51)","v":0},{"$f":"IF(AND(INTRO!$E$37=\"Non endémique\",INTRO!$E$41=\"Non endémique\"),0,COUNTRY_INFO!X51)","v":0},{"$f":"IF(INTRO!$E$39=\"Non endémique\",IF($D51=1,DEC!I51,0),IF($D51=1,IVM!G51,0))","v":0},null,{"$f":"IF(OR(COUNTRY_INFO!N51=\"Inconnu\",COUNTRY_INFO!N51=\"Surveillance\",COUNTRY_INFO!N51=\"Non requis\",COUNTRY_INFO!N51=0),0,IF(INTRO!$E$39=\"Non endémique\",IF(AND($E51<>0,$G51=\"\"),IF($F51=0,COUNTRY_INFO!N51*$E51,COUNTRY_INFO!N51*($E51-$D51)),IF(AND($E51<>0,$G51<>0),IF($F51=0,COUNTRY_INFO!N51*$G51,COUNTRY_INFO!N51*($G51-$D51)),0)),IF($G51=\"\",COUNTRY_INFO!N51*$E51,COUNTRY_INFO!N51*$G51)))","v":0},{"$f":"IF(OR(COUNTRY_INFO!O51=\"Inconnu\",COUNTRY_INFO!O51=\"Surveillance\",COUNTRY_INFO!O51=\"Non requis\",COUNTRY_INFO!O51=0),0,IF($E51<>0, IF($F51=0,COUNTRY_INFO!O51*$E51,COUNTRY_INFO!O51*($E51-$D51)),COUNTRY_INFO!O51*$E51))","v":0},null,{"$f":"IF(OR(COUNTRY_INFO!P51=\"Inconnu\",COUNTRY_INFO!P51=\"Surveillance\",COUNTRY_INFO!P51=\"Non requis\",COUNTRY_INFO!P51=0),0,IF(AND($E51<>0,$J51=\"\"),IF($F51=0,COUNTRY_INFO!P51*$E51,COUNTRY_INFO!P51*($E51-$D51)), IF(AND($E51<>0,$J51<>0),IF($F51=0,COUNTRY_INFO!P51*$J51,COUNTRY_INFO!P51*($J51-$D51)), COUNTRY_INFO!P51*$J51)))","v":0},0,0,null,0,0,null,0,0,null,0]
[{"$f":"IF(AND(INTRO!$E$37=\"Non endémique\",INTRO!$E$41=\"Non endémique\"),\" \",IF(COUNTRY_INFO!A52=0,\" \",COUNTRY_INFO!A52))","v":"NIGER"},{"$f":"IF(AND(INTRO!$E$37=\"Non endémique\",INTRO!$E$41=\"Non endémique\"),\" \",IF(COUNTRY_INFO!B52=0,\" \",COUNTRY_INFO!B52))","v":"Tahoua"},{"$f":"IF(AND(INTRO!$E$37=\"Non endémique\",INTRO!$E$41=\"Non endémique\"),\" \",IF(COUNTRY_INFO!C52=0,\" \",COUNTRY_INFO!C52))","v":"Madaoua"},{"$f":"IF(AND(INTRO!$E$37=\"Non endémique\",INTRO!$E$41=\"Non endémique\"),0,COUNTRY_INFO!V52)","v":0},{"$f":"IF(AND(INTRO!$E$37=\"Non endémique\",INTRO!$E$41=\"Non endémique\"),0,COUNTRY_INFO!X52)","v":0},{"$f":"IF(INTRO!$E$39=\"Non endémique\",IF($D52=1,DEC!I52,0),IF($D52=1,IVM!G52,0))","v":0},null,{"$f":"IF(OR(COUNTRY_INFO!N52=\"Inconnu\",COUNTRY_INFO!N52=\"Surveillance\",COUNTRY_INFO!N52=\"Non requis\",COUNTRY_INFO!N52=0),0,IF(INTRO!$E$39=\"Non endémique\",IF(AND($E52<>0,$G52=\"\"),IF($F52=0,COUNTRY_INFO!N52*$E52,COUNTRY_INFO!N52*($E52-$D52)),IF(AND($E52<>0,$G52<>0),IF($F52=0,COUNTRY_INFO!N52*$G52,COUNTRY_INFO!N52*($G52-$D52)),0)),IF($G52=\"\",COUNTRY_INFO!N52*$E52,COUNTRY_INFO!N52*$G52)))","v":0},{"$f":"IF(OR(COUNTRY_INFO!O52=\"Inconnu\",COUNTRY_INFO!O52=\"Surveillance\",COUNTRY_INFO!O52=\"Non requis\",COUNTRY_INFO!O52=0),0,IF($E52<>0, IF($F52=0,COUNTRY_INFO!O52*$E52,COUNTRY_INFO!O52*($E52-$D52)),COUNTRY_INFO!O52*$E52))","v":0},null,{"$f":"IF(OR(COUNTRY_INFO!P52=\"Inconnu\",COUNTRY_INFO!P52=\"Surveillance\",COUNTRY_INFO!P52=\"Non requis\",COUNTRY_INFO!P52=0),0,IF(AND($E52<>0,$J52=\"\"),IF($F52=0,COUNTRY_INFO!P52*$E52,COUNTRY_INFO!P52*($E52-$D52)), IF(AND($E52<>0,$J52<>0),IF($F52=0,COUNTRY_INFO!P52*$J52,COUNTRY_INFO!P52*($J52-$D52)), COUNTRY_INFO!P52*$J52)))","v":0},0,0,null,0,0,null,0,0,null,0]
[{"$f":"IF(AND(INTRO!$E$37=\"Non endémique\",INTRO!$E$41=\"Non endémique\"),\" \",IF(COUNTRY_INFO!A53=0,\" \",COUNTRY_INFO!A53))","v":"NIGER"},{"$f":"IF(AND(INTRO!$E$37=\"Non endémique\",INTRO!$E$41=\"Non endémique\"),\" \",IF(COUNTRY_INFO!B53=0,\" \",COUNTRY_INFO!B53))","v":"Tahoua"},{"$f":"IF(AND(INTRO!$E$37=\"Non endémique\",INTRO!$E$41=\"Non endémique\"),\" \",IF(COUNTRY_INFO!C53=0,\" \",COUNTRY_INFO!C53))","v":"Tahoua département"},{"$f":"IF(AND(INTRO!$E$37=\"Non endémique\",INTRO!$E$41=\"Non endémique\"),0,COUNTRY_INFO!V53)","v":0},{"$f":"IF(AND(INTRO!$E$37=\"Non endémique\",INTRO!$E$41=\"Non endémique\"),0,COUNTRY_INFO!X53)","v":0},{"$f":"IF(INTRO!$E$39=\"Non endémique\",IF($D53=1,DEC!I53,0),IF($D53=1,IVM!G53,0))","v":0},null,{"$f":"IF(OR(COUNTRY_INFO!N53=\"Inconnu\",COUNTRY_INFO!N53=\"Surveillance\",COUNTRY_INFO!N53=\"Non requis\",COUNTRY_INFO!N53=0),0,IF(INTRO!$E$39=\"Non endémique\",IF(AND($E53<>0,$G53=\"\"),IF($F53=0,COUNTRY_INFO!N53*$E53,COUNTRY_INFO!N53*($E53-$D53)),IF(AND($E53<>0,$G53<>0),IF($F53=0,COUNTRY_INFO!N53*$G53,COUNTRY_INFO!N53*($G53-$D53)),0)),IF($G53=\"\",COUNTRY_INFO!N53*$E53,COUNTRY_INFO!N53*$G53)))","v":0},{"$f":"IF(OR(COUNTRY_INFO!O53=\"Inconnu\",COUNTRY_INFO!O53=\"Surveillance\",COUNTRY_INFO!O53=\"Non requis\",COUNTRY_INFO!O53=0),0,IF($E53<>0, IF($F53=0,COUNTRY_INFO!O53*$E53,COUNTRY_INFO!O53*($E53-$D53)),COUNTRY_INFO!O53*$E53))","v":0},null,{"$f":"IF(OR(COUNTRY_INFO!P53=\"Inconnu\",COUNTRY_INFO!P53=\"Surveillance\",COUNTRY_INFO!P53=\"Non requis\",COUNTRY_INFO!P53=0),0,IF(AND($E53<>0,$J53=\"\"),IF($F53=0,COUNTRY_INFO!P53*$E53,COUNTRY_INFO!P53*($E53-$D53)), IF(AND($E53<>0,$J53<>0),IF($F53=0,COUNTRY_INFO!P53*$J53,COUNTRY_INFO!P53*($J53-$D53)), COUNTRY_INFO!P53*$J53)))","v":0},0,0,null,0,0,null,0,0,null,0]
[{"$f":"IF(AND(INTRO!$E$37=\"Non endémique\",INTRO!$E$41=\"Non endémique\"),\" \",IF(COUNTRY_INFO!A54=0,\" \",COUNTRY_INFO!A54))","v":"NIGER"},{"$f":"IF(AND(INTRO!$E$37=\"Non endémique\",INTRO!$E$41=\"Non endémique\"),\" \",IF(COUNTRY_INFO!B54=0,\" \",COUNTRY_INFO!B54))","v":"Tahoua"},{"$f":"IF(AND(INTRO!$E$37=\"Non endémique\",INTRO!$E$41=\"Non endémique\"),\" \",IF(COUNTRY_INFO!C54=0,\" \",COUNTRY_INFO!C54))","v":"Tahoua commune"},{"$f":"IF(AND(INTRO!$E$37=\"Non endémique\",INTRO!$E$41=\"Non endémique\"),0,COUNTRY_INFO!V54)","v":0},{"$f":"IF(AND(INTRO!$E$37=\"Non endémique\",INTRO!$E$41=\"Non endémique\"),0,COUNTRY_INFO!X54)","v":0},{"$f":"IF(INTRO!$E$39=\"Non endémique\",IF($D54=1,DEC!I54,0),IF($D54=1,IVM!G54,0))","v":0},null,{"$f":"IF(OR(COUNTRY_INFO!N54=\"Inconnu\",COUNTRY_INFO!N54=\"Surveillance\",COUNTRY_INFO!N54=\"Non requis\",COUNTRY_INFO!N54=0),0,IF(INTRO!$E$39=\"Non endémique\",IF(AND($E54<>0,$G54=\"\"),IF($F54=0,COUNTRY_INFO!N54*$E54,COUNTRY_INFO!N54*($E54-$D54)),IF(AND($E54<>0,$G54<>0),IF($F54=0,COUNTRY_INFO!N54*$G54,COUNTRY_INFO!N54*($G54-$D54)),0)),IF($G54=\"\",COUNTRY_INFO!N54*$E54,COUNTRY_INFO!N54*$G54)))","v":0},{"$f":"IF(OR(COUNTRY_INFO!O54=\"Inconnu\",COUNTRY_INFO!O54=\"Surveillance\",COUNTRY_INFO!O54=\"Non requis\",COUNTRY_INFO!O54=0),0,IF($E54<>0, IF($F54=0,COUNTRY_INFO!O54*$E54,COUNTRY_INFO!O54*($E54-$D54)),COUNTRY_INFO!O54*$E54))","v":0},null,{"$f":"IF(OR(COUNTRY_INFO!P54=\"Inconnu\",COUNTRY_INFO!P54=\"Surveillance\",COUNTRY_INFO!P54=\"Non requis\",COUNTRY_INFO!P54=0),0,IF(AND($E54<>0,$J54=\"\"),IF($F54=0,COUNTRY_INFO!P54*$E54,COUNTRY_INFO!P54*($E54-$D54)), IF(AND($E54<>0,$J54<>0),IF($F54=0,COUNTRY_INFO!P54*$J54,COUNTRY_INFO!P54*($J54-$D54)), COUNTRY_INFO!P54*$J54)))","v":0},0,0,null,0,0,null,0,0,null,0]
[{"$f":"IF(AND(INTRO!$E$37=\"Non endémique\",INTRO!$E$41=\"Non endémique\"),\" \",IF(COUNTRY_INFO!A55=0,\" \",COUNTRY_INFO!A55))","v":"NIGER"},{"$f":"IF(AND(INTRO!$E$37=\"Non endémique\",INTRO!$E$41=\"Non endémique\"),\" \",IF(COUNTRY_INFO!B55=0,\" \",COUNTRY_INFO!B55))","v":"Tahoua"},{"$f":"IF(AND(INTRO!$E$37=\"Non endémique\",INTRO!$E$41=\"Non endémique\"),\" \",IF(COUNTRY_INFO!C55=0,\" \",COUNTRY_INFO!C55))","v":"TCHINTABARADEN"},{"$f":"IF(AND(INTRO!$E$37=\"Non endémique\",INTRO!$E$41=\"Non endémique\"),0,COUNTRY_INFO!V55)","v":0},{"$f":"IF(AND(INTRO!$E$37=\"Non endémique\",INTRO!$E$41=\"Non endémique\"),0,COUNTRY_INFO!X55)","v":0},{"$f":"IF(INTRO!$E$39=\"Non endémique\",IF($D55=1,DEC!I55,0),IF($D55=1,IVM!G55,0))","v":0},null,{"$f":"IF(OR(COUNTRY_INFO!N55=\"Inconnu\",COUNTRY_INFO!N55=\"Surveillance\",COUNTRY_INFO!N55=\"Non requis\",COUNTRY_INFO!N55=0),0,IF(INTRO!$E$39=\"Non endémique\",IF(AND($E55<>0,$G55=\"\"),IF($F55=0,COUNTRY_INFO!N55*$E55,COUNTRY_INFO!N55*($E55-$D55)),IF(AND($E55<>0,$G55<>0),IF($F55=0,COUNTRY_INFO!N55*$G55,COUNTRY_INFO!N55*($G55-$D55)),0)),IF($G55=\"\",COUNTRY_INFO!N55*$E55,COUNTRY_INFO!N55*$G55)))","v":0},{"$f":"IF(OR(COUNTRY_INFO!O55=\"Inconnu\",COUNTRY_INFO!O55=\"Surveillance\",COUNTRY_INFO!O55=\"Non requis\",COUNTRY_INFO!O55=0),0,IF($E55<>0, IF($F55=0,COUNTRY_INFO!O55*$E55,COUNTRY_INFO!O55*($E55-$D55)),COUNTRY_INFO!O55*$E55))","v":0},null,{"$f":"IF(OR(COUNTRY_INFO!P55=\"Inconnu\",COUNTRY_INFO!P55=\"Surveillance\",COUNTRY_INFO!P55=\"Non requis\",COUNTRY_INFO!P55=0),0,IF(AND($E55<>0,$J55=\"\"),IF($F55=0,COUNTRY_INFO!P55*$E55,COUNTRY_INFO!P55*($E55-$D55)), IF(AND($E55<>0,$J55<>0),IF($F55=0,COUNTRY_INFO!P55*$J55,COUNTRY_INFO!P55*($J55-$D55)), COUNTRY_INFO!P55*$J55)))","v":0},0,0,null,0,0,null,0,0,null,0]
[{"$f":"IF(AND(INTRO!$E$37=\"Non endémique\",INTRO!$E$41=\"Non endémique\"),\" \",IF(COUNTRY_INFO!A56=0,\" \",COUNTRY_INFO!A56))","v":"NIGER"},{"$f":"IF(AND(INTRO!$E$37=\"Non endémique\",INTRO!$E$41=\"Non endémique\"),\" \",IF(COUNTRY_INFO!B56=0,\" \",COUNTRY_INFO!B56))","v":"Tahoua"},{"$f":"IF(AND(INTRO!$E$37=\"Non endémique\",INTRO!$E$41=\"Non endémique\"),\" \",IF(COUNTRY_INFO!C56=0,\" \",COUNTRY_INFO!C56))","v":"Tassara"},{"$f":"IF(AND(INTRO!$E$37=\"Non endémique\",INTRO!$E$41=\"Non endémique\"),0,COUNTRY_INFO!V56)","v":0},{"$f":"IF(AND(INTRO!$E$37=\"Non endémique\",INTRO!$E$41=\"Non endémique\"),0,COUNTRY_INFO!X56)","v":0},{"$f":"IF(INTRO!$E$39=\"Non endémique\",IF($D56=1,DEC!I56,0),IF($D56=1,IVM!G56,0))","v":0},null,{"$f":"IF(OR(COUNTRY_INFO!N56=\"Inconnu\",COUNTRY_INFO!N56=\"Surveillance\",COUNTRY_INFO!N56=\"Non requis\",COUNTRY_INFO!N56=0),0,IF(INTRO!$E$39=\"Non endémique\",IF(AND($E56<>0,$G56=\"\"),IF($F56=0,COUNTRY_INFO!N56*$E56,COUNTRY_INFO!N56*($E56-$D56)),IF(AND($E56<>0,$G56<>0),IF($F56=0,COUNTRY_INFO!N56*$G56,COUNTRY_INFO!N56*($G56-$D56)),0)),IF($G56=\"\",COUNTRY_INFO!N56*$E56,COUNTRY_INFO!N56*$G56)))","v":0},{"$f":"IF(OR(COUNTRY_INFO!O56=\"Inconnu\",COUNTRY_INFO!O56=\"Surveillance\",COUNTRY_INFO!O56=\"Non requis\",COUNTRY_INFO!O56=0),0,IF($E56<>0, IF($F56=0,COUNTRY_INFO!O56*$E56,COUNTRY_INFO!O56*($E56-$D56)),COUNTRY_INFO!O56*$E56))","v":0},null,{"$f":"IF(OR(COUNTRY_INFO!P56=\"Inconnu\",COUNTRY_INFO!P56=\"Surveillance\",COUNTRY_INFO!P56=\"Non requis\",COUNTRY_INFO!P56=0),0,IF(AND($E56<>0,$J56=\"\"),IF($F56=0,COUNTRY_INFO!P56*$E56,COUNTRY_INFO!P56*($E56-$D56)), IF(AND($E56<>0,$J56<>0),IF($F56=0,COUNTRY_INFO!P56*$J56,COUNTRY_INFO!P56*($J56-$D56)), COUNTRY_INFO!P56*$J56)))","v":0},0,0,null,0,0,null,0,0,null,0]
[{"$f":"IF(AND(INTRO!$E$37=\"Non endémique\",INTRO!$E$41=\"Non endémique\"),\" \",IF(COUNTRY_INFO!A57=0,\" \",COUNTRY_INFO!A57))","v":"NIGER"},{"$f":"IF(AND(INTRO!$E$37=\"Non endémique\",INTRO!$E$41=\"Non endémique\"),\" \",IF(COUNTRY_INFO!B57=0,\" \",COUNTRY_INFO!B57))","v":"Tahoua"},{"$f":"IF(AND(INTRO!$E$37=\"Non endémique\",INTRO!$E$41=\"Non endémique\"),\" \",IF(COUNTRY_INFO!C57=0,\" \",COUNTRY_INFO!C57))","v":"Tillia"},{"$f":"IF(AND(INTRO!$E$37=\"Non endémique\",INTRO!$E$41=\"Non endémique\"),0,COUNTRY_INFO!V57)","v":0},{"$f":"IF(AND(INTRO!$E$37=\"Non endémique\",INTRO!$E$41=\"Non endémique\"),0,COUNTRY_INFO!X57)","v":0},{"$f":"IF(INTRO!$E$39=\"Non endémique\",IF($D57=1,DEC!I57,0),IF($D57=1,IVM!G57,0))","v":0},null,{"$f":"IF(OR(COUNTRY_INFO!N57=\"Inconnu\",COUNTRY_INFO!N57=\"Surveillance\",COUNTRY_INFO!N57=\"Non requis\",COUNTRY_INFO!N57=0),0,IF(INTRO!$E$39=\"Non endémique\",IF(AND($E57<>0,$G57=\"\"),IF($F57=0,COUNTRY_INFO!N57*$E57,COUNTRY_INFO!N57*($E57-$D57)),IF(AND($E57<>0,$G57<>0),IF($F57=0,COUNTRY_INFO!N57*$G57,COUNTRY_INFO!N57*($G57-$D57)),0)),IF($G57=\"\",COUNTRY_INFO!N57*$E57,COUNTRY_INFO!N57*$G57)))","v":0},{"$f":"IF(OR(COUNTRY_INFO!O57=\"Inconnu\",COUNTRY_INFO!O57=\"Surveillance\",COUNTRY_INFO!O57=\"Non requis\",COUNTRY_INFO!O57=0),0,IF($E57<>0, IF($F57=0,COUNTRY_INFO!O57*$E57,COUNTRY_INFO!O57*($E57-$D57)),COUNTRY_INFO!O57*$E57))","v":0},null,{"$f":"IF(OR(COUNTRY_INFO!P57=\"Inconnu\",COUNTRY_INFO!P57=\"Surveillance\",COUNTRY_INFO!P57=\"Non requis\",COUNTRY_INFO!P57=0),0,IF(AND($E57<>0,$J57=\"\"),IF($F57=0,COUNTRY_INFO!P57*$E57,COUNTRY_INFO!P57*($E57-$D57)), IF(AND($E57<>0,$J57<>0),IF($F57=0,COUNTRY_INFO!P57*$J57,COUNTRY_INFO!P57*($J57-$D57)), COUNTRY_INFO!P57*$J57)))","v":0},0,0,null,0,0,null,0,0,null,0]
[{"$f":"IF(AND(INTRO!$E$37=\"Non endémique\",INTRO!$E$41=\"Non endémique\"),\" \",IF(COUNTRY_INFO!A58=0,\" \",COUNTRY_INFO!A58))","v":"NIGER"},{"$f":"IF(AND(INTRO!$E$37=\"Non endémique\",INTRO!$E$41=\"Non endémique\"),\" \",IF(COUNTRY_INFO!B58=0,\" \",COUNTRY_INFO!B58))","v":"Tillabery"},{"$f":"IF(AND(INTRO!$E$37=\"Non endémique\",INTRO!$E$41=\"Non endémique\"),\" \",IF(COUNTRY_INFO!C58=0,\" \",COUNTRY_INFO!C58))","v":"Fillingue"},{"$f":"IF(AND(INTRO!$E$37=\"Non endémique\",INTRO!$E$41=\"Non endémique\"),0,COUNTRY_INFO!V58)","v":0},{"$f":"IF(AND(INTRO!$E$37=\"Non endémique\",INTRO!$E$41=\"Non endémique\"),0,COUNTRY_INFO!X58)","v":0},{"$f":"IF(INTRO!$E$39=\"Non endémique\",IF($D58=1,DEC!I58,0),IF($D58=1,IVM!G58,0))","v":0},null,{"$f":"IF(OR(COUNTRY_INFO!N58=\"Inconnu\",COUNTRY_INFO!N58=\"Surveillance\",COUNTRY_INFO!N58=\"Non requis\",COUNTRY_INFO!N58=0),0,IF(INTRO!$E$39=\"Non endémique\",IF(AND($E58<>0,$G58=\"\"),IF($F58=0,COUNTRY_INFO!N58*$E58,COUNTRY_INFO!N58*($E58-$D58)),IF(AND($E58<>0,$G58<>0),IF($F58=0,COUNTRY_INFO!N58*$G58,COUNTRY_INFO!N58*($G58-$D58)),0)),IF($G58=\"\",COUNTRY_INFO!N58*$E58,COUNTRY_INFO!N58*$G58)))","v":0},{"$f":"IF(OR(COUNTRY_INFO!O58=\"Inconnu\",COUNTRY_INFO!O58=\"Surveillance\",COUNTRY_INFO!O58=\"Non requis\",COUNTRY_INFO!O58=0),0,IF($E58<>0, IF($F58=0,COUNTRY_INFO!O58*$E58,COUNTRY_INFO!O58*($E58-$D58)),COUNTRY_INFO!O58*$E58))","v":0},null,{"$f":"IF(OR(COUNTRY_INFO!P58=\"Inconnu\",COUNTRY_INFO!P58=\"Surveillance\",COUNTRY_INFO!P58=\"Non requis\",COUNTRY_INFO!P58=0),0,IF(AND($E58<>0,$J58=\"\"),IF($F58=0,COUNTRY_INFO!P58*$E58,COUNTRY_INFO!P58*($E58-$D58)), IF(AND($E58<>0,$J58<>0),IF($F58=0,COUNTRY_INFO!P58*$J58,COUNTRY_INFO!P58*($J58-$D58)), COUNTRY_INFO!P58*$J58)))","v":0},0,0,null,0,0,null,0,0,null,0]
[{"$f":"IF(AND(INTRO!$E$37=\"Non endémique\",INTRO!$E$41=\"Non endémique\"),\" \",IF(COUNTRY_INFO!A59=0,\" \",COUNTRY_INFO!A59))","v":"NIGER"},{"$f":"IF(AND(INTRO!$E$37=\"Non endémique\",INTRO!$E$41=\"Non endémique\"),\" \",IF(COUNTRY_INFO!B59=0,\" \",COUNTRY_INFO!B59))","v":"Tillabery"},{"$f":"IF(AND(INTRO!$E$37=\"Non endémique\",INTRO!$E$41=\"Non endémique\"),\" \",IF(COUNTRY_INFO!C59=0,\" \",COUNTRY_INFO!C59))","v":"Balleyara"},{"$f":"IF(AND(INTRO!$E$37=\"Non endémique\",INTRO!$E$41=\"Non endémique\"),0,COUNTRY_INFO!V59)","v":0},{"$f":"IF(AND(INTRO!$E$37=\"Non endémique\",INTRO!$E$41=\"Non endémique\"),0,COUNTRY_INFO!X59)","v":0},{"$f":"IF(INTRO!$E$39=\"Non endémique\",IF($D59=1,DEC!I59,0),IF($D59=1,IVM!G59,0))","v":0},null,{"$f":"IF(OR(COUNTRY_INFO!N59=\"Inconnu\",COUNTRY_INFO!N59=\"Surveillance\",COUNTRY_INFO!N59=\"Non requis\",COUNTRY_INFO!N59=0),0,IF(INTRO!$E$39=\"Non endémique\",IF(AND($E59<>0,$G59=\"\"),IF($F59=0,COUNTRY_INFO!N59*$E59,COUNTRY_INFO!N59*($E59-$D59)),IF(AND($E59<>0,$G59<>0),IF($F59=0,COUNTRY_INFO!N59*$G59,COUNTRY_INFO!N59*($G59-$D59)),0)),IF($G59=\"\",COUNTRY_INFO!N59*$E59,COUNTRY_INFO!N59*$G59)))","v":0},{"$f":"IF(OR(COUNTRY_INFO!O59=\"Inconnu\",COUNTRY_INFO!O59=\"Surveillance\",COUNTRY_INFO!O59=\"Non requis\",COUNTRY_INFO!O59=0),0,IF($E59<>0, IF($F59=0,COUNTRY_INFO!O59*$E59,COUNTRY_INFO!O59*($E59-$D59)),COUNTRY_INFO!O59*$E59))","v":0},null,{"$f":"IF(OR(COUNTRY_INFO!P59=\"Inconnu\",COUNTRY_INFO!P59=\"Surveillance\",COUNTRY_INFO!P59=\"Non requis\",COUNTRY_INFO!P59=0),0,IF(AND($E59<>0,$J59=\"\"),IF($F59=0,COUNTRY_INFO!P59*$E59,COUNTRY_INFO!P59*($E59-$D59)), IF(AND($E59<>0,$J59<>0),IF($F59=0,COUNTRY_INFO!P59*$J59,COUNTRY_INFO!P59*($J59-$D59)), COUNTRY_INFO!P59*$J59)))","v":0},0,0,null,0,0,null,0,0,null,0]
[{"$f":"IF(AND(INTRO!$E$37=\"Non endémique\",INTRO!$E$41=\"Non endémique\"),\" \",IF(COUNTRY_INFO!A60=0,\" \",COUNTRY_INFO!A60))","v":"NIGER"},{"$f":"IF(AND(INTRO!$E$37=\"Non endémique\",INTRO!$E$41=\"Non endémique\"),\" \",IF(COUNTRY_INFO!B60=0,\" \",COUNTRY_INFO!B60))","v":"Tillabery"},{"$f":"IF(AND(INTRO!$E$37=\"Non endémique\",INTRO!$E$41=\"Non endémique\"),\" \",IF(COUNTRY_INFO!C60=0,\" \",COUNTRY_INFO!C60))","v":"Abala"},{"$f":"IF(AND(INTRO!$E$37=\"Non endémique\",INTRO!$E$41=\"Non endémique\"),0,COUNTRY_INFO!V60)","v":0},{"$f":"IF(AND(INTRO!$E$37=\"Non endémique\",INTRO!$E$41=\"Non endémique\"),0,COUNTRY_INFO!X60)","v":0},{"$f":"IF(INTRO!$E$39=\"Non endémique\",IF($D60=1,DEC!I60,0),IF($D60=1,IVM!G60,0))","v":0},null,{"$f":"IF(OR(COUNTRY_INFO!N60=\"Inconnu\",COUNTRY_INFO!N60=\"Surveillance\",COUNTRY_INFO!N60=\"Non requis\",COUNTRY_INFO!N60=0),0,IF(INTRO!$E$39=\"Non endémique\",IF(AND($E60<>0,$G60=\"\"),IF($F60=0,COUNTRY_INFO!N60*$E60,COUNTRY_INFO!N60*($E60-$D60)),IF(AND($E60<>0,$G60<>0),IF($F60=0,COUNTRY_INFO!N60*$G60,COUNTRY_INFO!N60*($G60-$D60)),0)),IF($G60=\"\",COUNTRY_INFO!N60*$E60,COUNTRY_INFO!N60*$G60)))","v":0},{"$f":"IF(OR(COUNTRY_INFO!O60=\"Inconnu\",COUNTRY_INFO!O60=\"Surveillance\",COUNTRY_INFO!O60=\"Non requis\",COUNTRY_INFO!O60=0),0,IF($E60<>0, IF($F60=0,COUNTRY_INFO!O60*$E60,COUNTRY_INFO!O60*($E60-$D60)),COUNTRY_INFO!O60*$E60))","v":0},null,{"$f":"IF(OR(COUNTRY_INFO!P60=\"Inconnu\",COUNTRY_INFO!P60=\"Surveillance\",COUNTRY_INFO!P60=\"Non requis\",COUNTRY_INFO!P60=0),0,IF(AND($E60<>0,$J60=\"\"),IF($F60=0,COUNTRY_INFO!P60*$E60,COUNTRY_INFO!P60*($E60-$D60)), IF(AND($E60<>0,$J60<>0),IF($F60=0,COUNTRY_INFO!P60*$J60,COUNTRY_INFO!P60*($J60-$D60)), COUNTRY_INFO!P60*$J60)))","v":0},0,0,null,0,0,null,0,0,null,0]
[{"$f":"IF(AND(INTRO!$E$37=\"Non endémique\",INTRO!$E$41=\"Non endémique\"),\" \",IF(COUNTRY_INFO!A61=0,\" \",COUNTRY_INFO!A61))","v":"NIGER"},{"$f":"IF(AND(INTRO!$E$37=\"Non endémique\",INTRO!$E$41=\"Non endémique\"),\" \",IF(COUNTRY_INFO!B61=0,\" \",COUNTRY_INFO!B61))","v":"Tillabery"},{"$f":"IF(AND(INTRO!$E$37=\"Non endémique\",INTRO!$E$41=\"Non endémique\"),\" \",IF(COUNTRY_INFO!C61=0,\" \",COUNTRY_INFO!C61))","v":"Kollo"},{"$f":"IF(AND(INTRO!$E$37=\"Non endémique\",INTRO!$E$41=\"Non endémique\"),0,COUNTRY_INFO!V61)","v":0},{"$f":"IF(AND(INTRO!$E$37=\"Non endémique\",INTRO!$E$41=\"Non endémique\"),0,COUNTRY_INFO!X61)","v":0},{"$f":"IF(INTRO!$E$39=\"Non endémique\",IF($D61=1,DEC!I61,0),IF($D61=1,IVM!G61,0))","v":0},null,{"$f":"IF(OR(COUNTRY_INFO!N61=\"Inconnu\",COUNTRY_INFO!N61=\"Surveillance\",COUNTRY_INFO!N61=\"Non requis\",COUNTRY_INFO!N61=0),0,IF(INTRO!$E$39=\"Non endémique\",IF(AND($E61<>0,$G61=\"\"),IF($F61=0,COUNTRY_INFO!N61*$E61,COUNTRY_INFO!N61*($E61-$D61)),IF(AND($E61<>0,$G61<>0),IF($F61=0,COUNTRY_INFO!N61*$G61,COUNTRY_INFO!N61*($G61-$D61)),0)),IF($G61=\"\",COUNTRY_INFO!N61*$E61,COUNTRY_INFO!N61*$G61)))","v":0},{"$f":"IF(OR(COUNTRY_INFO!O61=\"Inconnu\",COUNTRY_INFO!O61=\"Surveillance\",COUNTRY_INFO!O61=\"Non requis\",COUNTRY_INFO!O61=0),0,IF($E61<>0, IF($F61=0,COUNTRY_INFO!O61*$E61,COUNTRY_INFO!O61*($E61-$D61)),COUNTRY_INFO!O61*$E61))","v":0},null,{"$f":"IF(OR(COUNTRY_INFO!P61=\"Inconnu\",COUNTRY_INFO!P61=\"Surveillance\",COUNTRY_INFO!P61=\"Non requis\",COUNTRY_INFO!P61=0),0,IF(AND($E61<>0,$J61=\"\"),IF($F61=0,COUNTRY_INFO!P61*$E61,COUNTRY_INFO!P61*($E61-$D61)), IF(AND($E61<>0,$J61<>0),IF($F61=0,COUNTRY_INFO!P61*$J61,COUNTRY_INFO!P61*($J61-$D61)), COUNTRY_INFO!P61*$J61)))","v":0},0,0,null,0,0,null,0,0,null,0]
[{"$f":"IF(AND(INTRO!$E$37=\"Non endémique\",INTRO!$E$41=\"Non endémique\"),\" \",IF(COUNTRY_INFO!A62=0,\" \",COUNTRY_INFO!A62))","v":"NIGER"},{"$f":"IF(AND(INTRO!$E$37=\"Non endémique\",INTRO!$E$41=\"Non endémique\"),\" \",IF(COUNTRY_INFO!B62=0,\" \",COUNTRY_INFO!B62))","v":"Tillabery"},{"$f":"IF(AND(INTRO!$E$37=\"Non endémique\",INTRO!$E$41=\"Non endémique\"),\" \",IF(COUNTRY_INFO!C62=0,\" \",COUNTRY_INFO!C62))","v":"Ouallam"},{"$f":"IF(AND(INTRO!$E$37=\"Non endémique\",INTRO!$E$41=\"Non endémique\"),0,COUNTRY_INFO!V62)","v":0},{"$f":"IF(AND(INTRO!$E$37=\"Non endémique\",INTRO!$E$41=\"Non endémique\"),0,COUNTRY_INFO!X62)","v":0},{"$f":"IF(INTRO!$E$39=\"Non endémique\",IF($D62=1,DEC!I62,0),IF($D62=1,IVM!G62,0))","v":0},null,{"$f":"IF(OR(COUNTRY_INFO!N62=\"Inconnu\",COUNTRY_INFO!N62=\"Surveillance\",COUNTRY_INFO!N62=\"Non requis\",COUNTRY_INFO!N62=0),0,IF(INTRO!$E$39=\"Non endémique\",IF(AND($E62<>0,$G62=\"\"),IF($F62=0,COUNTRY_INFO!N62*$E62,COUNTRY_INFO!N62*($E62-$D62)),IF(AND($E62<>0,$G62<>0),IF($F62=0,COUNTRY_INFO!N62*$G62,COUNTRY_INFO!N62*($G62-$D62)),0)),IF($G62=\"\",COUNTRY_INFO!N62*$E62,COUNTRY_INFO!N62*$G62)))","v":0},{"$f":"IF(OR(COUNTRY_INFO!O62=\"Inconnu\",COUNTRY_INFO!O62=\"Surveillance\",COUNTRY_INFO!O62=\"Non requis\",COUNTRY_INFO!O62=0),0,IF($E62<>0, IF($F62=0,COUNTRY_INFO!O62*$E62,COUNTRY_INFO!O62*($E62-$D62)),COUNTRY_INFO!O62*$E62))","v":0},null,{"$f":"IF(OR(COUNTRY_INFO!P62=\"Inconnu\",COUNTRY_INFO!P62=\"Surveillance\",COUNTRY_INFO!P62=\"Non requis\",COUNTRY_INFO!P62=0),0,IF(AND($E62<>0,$J62=\"\"),IF($F62=0,COUNTRY_INFO!P62*$E62,COUNTRY_INFO!P62*($E62-$D62)), IF(AND($E62<>0,$J62<>0),IF($F62=0,COUNTRY_INFO!P62*$J62,COUNTRY_INFO!P62*($J62-$D62)), COUNTRY_INFO!P62*$J62)))","v":0},0,0,null,0,0,null,0,0,null,0]
[{"$f":"IF(AND(INTRO!$E$37=\"Non endémique\",INTRO!$E$41=\"Non endémique\"),\" \",IF(COUNTRY_INFO!A63=0,\" \",COUNTRY_INFO!A63))","v":"NIGER"},{"$f":"IF(AND(INTRO!$E$37=\"Non endémique\",INTRO!$E$41=\"Non endémique\"),\" \",IF(COUNTRY_INFO!B63=0,\" \",COUNTRY_INFO!B63))","v":"Tillabery"},{"$f":"IF(AND(INTRO!$E$37=\"Non endémique\",INTRO!$E$41=\"Non endémique\"),\" \",IF(COUNTRY_INFO!C63=0,\" \",COUNTRY_INFO!C63))","v":"Banibangou"},{"$f":"IF(AND(INTRO!$E$37=\"Non endémique\",INTRO!$E$41=\"Non endémique\"),0,COUNTRY_INFO!V63)","v":0},{"$f":"IF(AND(INTRO!$E$37=\"Non endémique\",INTRO!$E$41=\"Non endémique\"),0,COUNTRY_INFO!X63)","v":0},{"$f":"IF(INTRO!$E$39=\"Non endémique\",IF($D63=1,DEC!I63,0),IF($D63=1,IVM!G63,0))","v":0},null,{"$f":"IF(OR(COUNTRY_INFO!N63=\"Inconnu\",COUNTRY_INFO!N63=\"Surveillance\",COUNTRY_INFO!N63=\"Non requis\",COUNTRY_INFO!N63=0),0,IF(INTRO!$E$39=\"Non endémique\",IF(AND($E63<>0,$G63=\"\"),IF($F63=0,COUNTRY_INFO!N63*$E63,COUNTRY_INFO!N63*($E63-$D63)),IF(AND($E63<>0,$G63<>0),IF($F63=0,COUNTRY_INFO!N63*$G63,COUNTRY_INFO!N63*($G63-$D63)),0)),IF($G63=\"\",COUNTRY_INFO!N63*$E63,COUNTRY_INFO!N63*$G63)))","v":0},{"$f":"IF(OR(COUNTRY_INFO!O63=\"Inconnu\",COUNTRY_INFO!O63=\"Surveillance\",COUNTRY_INFO!O63=\"Non requis\",COUNTRY_INFO!O63=0),0,IF($E63<>0, IF($F63=0,COUNTRY_INFO!O63*$E63,COUNTRY_INFO!O63*($E63-$D63)),COUNTRY_INFO!O63*$E63))","v":0},null,{"$f":"IF(OR(COUNTRY_INFO!P63=\"Inconnu\",COUNTRY_INFO!P63=\"Surveillance\",COUNTRY_INFO!P63=\"Non requis\",COUNTRY_INFO!P63=0),0,IF(AND($E63<>0,$J63=\"\"),IF($F63=0,COUNTRY_INFO!P63*$E63,COUNTRY_INFO!P63*($E63-$D63)), IF(AND($E63<>0,$J63<>0),IF($F63=0,COUNTRY_INFO!P63*$J63,COUNTRY_INFO!P63*($J63-$D63)), COUNTRY_INFO!P63*$J63)))","v":0},0,0,null,0,0,null,0,0,null,0]
[{"$f":"IF(AND(INTRO!$E$37=\"Non endémique\",INTRO!$E$41=\"Non endémique\"),\" \",IF(COUNTRY_INFO!A64=0,\" \",COUNTRY_INFO!A64))","v":"NIGER"},{"$f":"IF(AND(INTRO!$E$37=\"Non endémique\",INTRO!$E$41=\"Non endémique\"),\" \",IF(COUNTRY_INFO!B64=0,\" \",COUNTRY_INFO!B64))","v":"Tillabery"},{"$f":"IF(AND(INTRO!$E$37=\"Non endémique\",INTRO!$E$41=\"Non endémique\"),\" \",IF(COUNTRY_INFO!C64=0,\" \",COUNTRY_INFO!C64))","v":"Say"},{"$f":"IF(AND(INTRO!$E$37=\"Non endémique\",INTRO!$E$41=\"Non endémique\"),0,COUNTRY_INFO!V64)","v":0},{"$f":"IF(AND(INTRO!$E$37=\"Non endémique\",INTRO!$E$41=\"Non endémique\"),0,COUNTRY_INFO!X64)","v":0},{"$f":"IF(INTRO!$E$39=\"Non endémique\",IF($D64=1,DEC!I64,0),IF($D64=1,IVM!G64,0))","v":0},null,{"$f":"IF(OR(COUNTRY_INFO!N64=\"Inconnu\",COUNTRY_INFO!N64=\"Surveillance\",COUNTRY_INFO!N64=\"Non requis\",COUNTRY_INFO!N64=0),0,IF(INTRO!$E$39=\"Non endémique\",IF(AND($E64<>0,$G64=\"\"),IF($F64=0,COUNTRY_INFO!N64*$E64,COUNTRY_INFO!N64*($E64-$D64)),IF(AND($E64<>0,$G64<>0),IF($F64=0,COUNTRY_INFO!N64*$G64,COUNTRY_INFO!N64*($G64-$D64)),0)),IF($G64=\"\",COUNTRY_INFO!N64*$E64,COUNTRY_INFO!N64*$G64)))","v":0},{"$f":"IF(OR(COUNTRY_INFO!O64=\"Inconnu\",COUNTRY_INFO!O64=\"Surveillance\",COUNTRY_INFO!O64=\"Non requis\",COUNTRY_INFO!O64=0),0,IF($E64<>0, IF($F64=0,COUNTRY_INFO!O64*$E64,COUNTRY_INFO!O64*($E64-$D64)),COUNTRY_INFO!O64*$E64))","v":0},null,{"$f":"IF(OR(COUNTRY_INFO!P64=\"Inconnu\",COUNTRY_INFO!P64=\"Surveillance\",COUNTRY_INFO!P64=\"Non requis\",COUNTRY_INFO!P64=0),0,IF(AND($E64<>0,$J64=\"\"),IF($F64=0,COUNTRY_INFO!P64*$E64,COUNTRY_INFO!P64*($E64-$D64)), IF(AND($E64<>0,$J64<>0),IF($F64=0,COUNTRY_INFO!P64*$J64,COUNTRY_INFO!P64*($J64-$D64)), COUNTRY_INFO!P64*$J64)))","v":0},0,0,null,0,0,null,0,0,null,0]
[{"$f":"IF(AND(INTRO!$E$37=\"Non endémique\",INTRO!$E$41=\"Non endémique\"),\" \",IF(COUNTRY_INFO!A65=0,\" \",COUNTRY_INFO!A65))","v":"NIGER"},{"$f":"IF(AND(INTRO!$E$37=\"Non endémique\",INTRO!$E$41=\"Non endémique\"),\" \",IF(COUNTRY_INFO!B65=0,\" \",COUNTRY_INFO!B65))","v":"Tillabery"},{"$f":"IF(AND(INTRO!$E$37=\"Non endémique\",INTRO!$E$41=\"Non endémique\"),\" \",IF(COUNTRY_INFO!C65=0,\" \",COUNTRY_INFO!C65))","v":"Torodi"},{"$f":"IF(AND(INTRO!$E$37=\"Non endémique\",INTRO!$E$41=\"Non endémique\"),0,COUNTRY_INFO!V65)","v":0},{"$f":"IF(AND(INTRO!$E$37=\"Non endémique\",INTRO!$E$41=\"Non endémique\"),0,COUNTRY_INFO!X65)","v":0},{"$f":"IF(INTRO!$E$39=\"Non endémique\",IF($D65=1,DEC!I65,0),IF($D65=1,IVM!G65,0))","v":0},null,{"$f":"IF(OR(COUNTRY_INFO!N65=\"Inconnu\",COUNTRY_INFO!N65=\"Surveillance\",COUNTRY_INFO!N65=\"Non requis\",COUNTRY_INFO!N65=0),0,IF(INTRO!$E$39=\"Non endémique\",IF(AND($E65<>0,$G65=\"\"),IF($F65=0,COUNTRY_INFO!N65*$E65,COUNTRY_INFO!N65*($E65-$D65)),IF(AND($E65<>0,$G65<>0),IF($F65=0,COUNTRY_INFO!N65*$G65,COUNTRY_INFO!N65*($G65-$D65)),0)),IF($G65=\"\",COUNTRY_INFO!N65*$E65,COUNTRY_INFO!N65*$G65)))","v":0},{"$f":"IF(OR(COUNTRY_INFO!O65=\"Inconnu\",COUNTRY_INFO!O65=\"Surveillance\",COUNTRY_INFO!O65=\"Non requis\",COUNTRY_INFO!O65=0),0,IF($E65<>0, IF($F65=0,COUNTRY_INFO!O65*$E65,COUNTRY_INFO!O65*($E65-$D65)),COUNTRY_INFO!O65*$E65))","v":0},null,{"$f":"IF(OR(COUNTRY_INFO!P65=\"Inconnu\",COUNTRY_INFO!P65=\"Surveillance\",COUNTRY_INFO!P65=\"Non requis\",COUNTRY_INFO!P65=0),0,IF(AND($E65<>0,$J65=\"\"),IF($F65=0,COUNTRY_INFO!P65*$E65,COUNTRY_INFO!P65*($E65-$D65)), IF(AND($E65<>0,$J65<>0),IF($F65=0,COUNTRY_INFO!P65*$J65,COUNTRY_INFO!P65*($J65-$D65)), COUNTRY_INFO!P65*$J65)))","v":0},0,0,null,0,0,null,0,0,null,0]
[{"$f":"IF(AND(INTRO!$E$37=\"Non endémique\",INTRO!$E$41=\"Non endémique\"),\" \",IF(COUNTRY_INFO!A66=0,\" \",COUNTRY_INFO!A66))","v":"NIGER"},{"$f":"IF(AND(INTRO!$E$37=\"Non endémique\",INTRO!$E$41=\"Non endémique\"),\" \",IF(COUNTRY_INFO!B66=0,\" \",COUNTRY_INFO!B66))","v":"Tillabery"},{"$f":"IF(AND(INTRO!$E$37=\"Non endémique\",INTRO!$E$41=\"Non endémique\"),\" \",IF(COUNTRY_INFO!C66=0,\" \",COUNTRY_INFO!C66))","v":"Tera"},{"$f":"IF(AND(INTRO!$E$37=\"Non endémique\",INTRO!$E$41=\"Non endémique\"),0,COUNTRY_INFO!V66)","v":0},{"$f":"IF(AND(INTRO!$E$37=\"Non endémique\",INTRO!$E$41=\"Non endémique\"),0,COUNTRY_INFO!X66)","v":0},{"$f":"IF(INTRO!$E$39=\"Non endémique\",IF($D66=1,DEC!I66,0),IF($D66=1,IVM!G66,0))","v":0},null,{"$f":"IF(OR(COUNTRY_INFO!N66=\"Inconnu\",COUNTRY_INFO!N66=\"Surveillance\",COUNTRY_INFO!N66=\"Non requis\",COUNTRY_INFO!N66=0),0,IF(INTRO!$E$39=\"Non endémique\",IF(AND($E66<>0,$G66=\"\"),IF($F66=0,COUNTRY_INFO!N66*$E66,COUNTRY_INFO!N66*($E66-$D66)),IF(AND($E66<>0,$G66<>0),IF($F66=0,COUNTRY_INFO!N66*$G66,COUNTRY_INFO!N66*($G66-$D66)),0)),IF($G66=\"\",COUNTRY_INFO!N66*$E66,COUNTRY_INFO!N66*$G66)))","v":0},{"$f":"IF(OR(COUNTRY_INFO!O66=\"Inconnu\",COUNTRY_INFO!O66=\"Surveillance\",COUNTRY_INFO!O66=\"Non requis\",COUNTRY_INFO!O66=0),0,IF($E66<>0, IF($F66=0,COUNTRY_INFO!O66*$E66,COUNTRY_INFO!O66*($E66-$D66)),COUNTRY_INFO!O66*$E66))","v":0},null,{"$f":"IF(OR(COUNTRY_INFO!P66=\"Inconnu\",COUNTRY_INFO!P66=\"Surveillance\",COUNTRY_INFO!P66=\"Non requis\",COUNTRY_INFO!P66=0),0,IF(AND($E66<>0,$J66=\"\"),IF($F66=0,COUNTRY_INFO!P66*$E66,COUNTRY_INFO!P66*($E66-$D66)), IF(AND($E66<>0,$J66<>0),IF($F66=0,COUNTRY_INFO!P66*$J66,COUNTRY_INFO!P66*($J66-$D66)), COUNTRY_INFO!P66*$J66)))","v":0},0,0,null,0,0,null,0,0,null,0]
[{"$f":"IF(AND(INTRO!$E$37=\"Non endémique\",INTRO!$E$41=\"Non endémique\"),\" \",IF(COUNTRY_INFO!A67=0,\" \",COUNTRY_INFO!A67))","v":"NIGER"},{"$f":"IF(AND(INTRO!$E$37=\"Non endémique\",INTRO!$E$41=\"Non endémique\"),\" \",IF(COUNTRY_INFO!B67=0,\" \",COUNTRY_INFO!B67))","v":"Tillabery"},{"$f":"IF(AND(INTRO!$E$37=\"Non endémique\",INTRO!$E$41=\"Non endémique\"),\" \",IF(COUNTRY_INFO!C67=0,\" \",COUNTRY_INFO!C67))","v":"Bankilare"},{"$f":"IF(AND(INTRO!$E$37=\"Non endémique\",INTRO!$E$41=\"Non endémique\"),0,COUNTRY_INFO!V67)","v":0},{"$f":"IF(AND(INTRO!$E$37=\"Non endémique\",INTRO!$E$41=\"Non endémique\"),0,COUNTRY_INFO!X67)","v":0},{"$f":"IF(INTRO!$E$39=\"Non endémique\",IF($D67=1,DEC!I67,0),IF($D67=1,IVM!G67,0))","v":0},null,{"$f":"IF(OR(COUNTRY_INFO!N67=\"Inconnu\",COUNTRY_INFO!N67=\"Surveillance\",COUNTRY_INFO!N67=\"Non requis\",COUNTRY_INFO!N67=0),0,IF(INTRO!$E$39=\"Non endémique\",IF(AND($E67<>0,$G67=\"\"),IF($F67=0,COUNTRY_INFO!N67*$E67,COUNTRY_INFO!N67*($E67-$D67)),IF(AND($E67<>0,$G67<>0),IF($F67=0,COUNTRY_INFO!N67*$G67,COUNTRY_INFO!N67*($G67-$D67)),0)),IF($G67=\"\",COUNTRY_INFO!N67*$E67,COUNTRY_INFO!N67*$G67)))","v":0},{"$f":"IF(OR(COUNTRY_INFO!O67=\"Inconnu\",COUNTRY_INFO!O67=\"Surveillance\",COUNTRY_INFO!O67=\"Non requis\",COUNTRY_INFO!O67=0),0,IF($E67<>0, IF($F67=0,COUNTRY_INFO!O67*$E67,COUNTRY_INFO!O67*($E67-$D67)),COUNTRY_INFO!O67*$E67))","v":0},null,{"$f":"IF(OR(COUNTRY_INFO!P67=\"Inconnu\",COUNTRY_INFO!P67=\"Surveillance\",COUNTRY_INFO!P67=\"Non requis\",COUNTRY_INFO!P67=0),0,IF(AND($E67<>0,$J67=\"\"),IF($F67=0,COUNTRY_INFO!P67*$E67,COUNTRY_INFO!P67*($E67-$D67)), IF(AND($E67<>0,$J67<>0),IF($F67=0,COUNTRY_INFO!P67*$J67,COUNTRY_INFO!P67*($J67-$D67)), COUNTRY_INFO!P67*$J67)))","v":0},0,0,null,0,0,null,0,0,null,0]
[{"$f":"IF(AND(INTRO!$E$37=\"Non endémique\",INTRO!$E$41=\"Non endémique\"),\" \",IF(COUNTRY_INFO!A68=0,\" \",COUNTRY_INFO!A68))","v":"NIGER"},{"$f":"IF(AND(INTRO!$E$37=\"Non endémique\",INTRO!$E$41=\"Non endémique\"),\" \",IF(COUNTRY_INFO!B68=0,\" \",COUNTRY_INFO!B68))","v":"Tillabery"},{"$f":"IF(AND(INTRO!$E$37=\"Non endémique\",INTRO!$E$41=\"Non endémique\"),\" \",IF(COUNTRY_INFO!C68=0,\" \",COUNTRY_INFO!C68))","v":"Gothèye"},{"$f":"IF(AND(INTRO!$E$37=\"Non endémique\",INTRO!$E$41=\"Non endémique\"),0,COUNTRY_INFO!V68)","v":0},{"$f":"IF(AND(INTRO!$E$37=\"Non endémique\",INTRO!$E$41=\"Non endémique\"),0,COUNTRY_INFO!X68)","v":0},{"$f":"IF(INTRO!$E$39=\"Non endémique\",IF($D68=1,DEC!I68,0),IF($D68=1,IVM!G68,0))","v":0},null,{"$f":"IF(OR(COUNTRY_INFO!N68=\"Inconnu\",COUNTRY_INFO!N68=\"Surveillance\",COUNTRY_INFO!N68=\"Non requis\",COUNTRY_INFO!N68=0),0,IF(INTRO!$E$39=\"Non endémique\",IF(AND($E68<>0,$G68=\"\"),IF($F68=0,COUNTRY_INFO!N68*$E68,COUNTRY_INFO!N68*($E68-$D68)),IF(AND($E68<>0,$G68<>0),IF($F68=0,COUNTRY_INFO!N68*$G68,COUNTRY_INFO!N68*($G68-$D68)),0)),IF($G68=\"\",COUNTRY_INFO!N68*$E68,COUNTRY_INFO!N68*$G68)))","v":0},{"$f":"IF(OR(COUNTRY_INFO!O68=\"Inconnu\",COUNTRY_INFO!O68=\"Surveillance\",COUNTRY_INFO!O68=\"Non requis\",COUNTRY_INFO!O68=0),0,IF($E68<>0, IF($F68=0,COUNTRY_INFO!O68*$E68,COUNTRY_INFO!O68*($E68-$D68)),COUNTRY_INFO!O68*$E68))","v":0},null,{"$f":"IF(OR(COUNTRY_INFO!P68=\"Inconnu\",COUNTRY_INFO!P68=\"Surveillance\",COUNTRY_INFO!P68=\"Non requis\",COUNTRY_INFO!P68=0),0,IF(AND($E68<>0,$J68=\"\"),IF($F68=0,COUNTRY_INFO!P68*$E68,COUNTRY_INFO!P68*($E68-$D68)), IF(AND($E68<>0,$J68<>0),IF($F68=0,COUNTRY_INFO!P68*$J68,COUNTRY_INFO!P68*($J68-$D68)), COUNTRY_INFO!P68*$J68)))","v":0},0,0,null,0,0,null,0,0,null,0]
[{"$f":"IF(AND(INTRO!$E$37=\"Non endémique\",INTRO!$E$41=\"Non endémique\"),\" \",IF(COUNTRY_INFO!A69=0,\" \",COUNTRY_INFO!A69))","v":"NIGER"},{"$f":"IF(AND(INTRO!$E$37=\"Non endémique\",INTRO!$E$41=\"Non endémique\"),\" \",IF(COUNTRY_INFO!B69=0,\" \",COUNTRY_INFO!B69))","v":"Tillabery"},{"$f":"IF(AND(INTRO!$E$37=\"Non endémique\",INTRO!$E$41=\"Non endémique\"),\" \",IF(COUNTRY_INFO!C69=0,\" \",COUNTRY_INFO!C69))","v":"Tillaberi"},{"$f":"IF(AND(INTRO!$E$37=\"Non endémique\",INTRO!$E$41=\"Non endémique\"),0,COUNTRY_INFO!V69)","v":0},{"$f":"IF(AND(INTRO!$E$37=\"Non endémique\",INTRO!$E$41=\"Non endémique\"),0,COUNTRY_INFO!X69)","v":0},{"$f":"IF(INTRO!$E$39=\"Non endémique\",IF($D69=1,DEC!I69,0),IF($D69=1,IVM!G69,0))","v":0},null,{"$f":"IF(OR(COUNTRY_INFO!N69=\"Inconnu\",COUNTRY_INFO!N69=\"Surveillance\",COUNTRY_INFO!N69=\"Non requis\",COUNTRY_INFO!N69=0),0,IF(INTRO!$E$39=\"Non endémique\",IF(AND($E69<>0,$G69=\"\"),IF($F69=0,COUNTRY_INFO!N69*$E69,COUNTRY_INFO!N69*($E69-$D69)),IF(AND($E69<>0,$G69<>0),IF($F69=0,COUNTRY_INFO!N69*$G69,COUNTRY_INFO!N69*($G69-$D69)),0)),IF($G69=\"\",COUNTRY_INFO!N69*$E69,COUNTRY_INFO!N69*$G69)))","v":0},{"$f":"IF(OR(COUNTRY_INFO!O69=\"Inconnu\",COUNTRY_INFO!O69=\"Surveillance\",COUNTRY_INFO!O69=\"Non requis\",COUNTRY_INFO!O69=0),0,IF($E69<>0, IF($F69=0,COUNTRY_INFO!O69*$E69,COUNTRY_INFO!O69*($E69-$D69)),COUNTRY_INFO!O69*$E69))","v":0},null,{"$f":"IF(OR(COUNTRY_INFO!P69=\"Inconnu\",COUNTRY_INFO!P69=\"Surveillance\",COUNTRY_INFO!P69=\"Non requis\",COUNTRY_INFO!P69=0),0,IF(AND($E69<>0,$J69=\"\"),IF($F69=0,COUNTRY_INFO!P69*$E69,COUNTRY_INFO!P69*($E69-$D69)), IF(AND($E69<>0,$J69<>0),IF($F69=0,COUNTRY_INFO!P69*$J69,COUNTRY_INFO!P69*($J69-$D69)), COUNTRY_INFO!P69*$J69)))","v":0},0,0,null,0,0,null,0,0,null,0]
[{"$f":"IF(AND(INTRO!$E$37=\"Non endémique\",INTRO!$E$41=\"Non endémique\"),\" \",IF(COUNTRY_INFO!A70=0,\" \",COUNTRY_INFO!A70))","v":"NIGER"},{"$f":"IF(AND(INTRO!$E$37=\"Non endémique\",INTRO!$E$41=\"Non endémique\"),\" \",IF(COUNTRY_INFO!B70=0,\" \",COUNTRY_INFO!B70))","v":"Tillabery"},{"$f":"IF(AND(INTRO!$E$37=\"Non endémique\",INTRO!$E$41=\"Non endémique\"),\" \",IF(COUNTRY_INFO!C70=0,\" \",COUNTRY_INFO!C70))","v":"Ayorou"},{"$f":"IF(AND(INTRO!$E$37=\"Non endémique\",INTRO!$E$41=\"Non endémique\"),0,COUNTRY_INFO!V70)","v":0},{"$f":"IF(AND(INTRO!$E$37=\"Non endémique\",INTRO!$E$41=\"Non endémique\"),0,COUNTRY_INFO!X70)","v":0},{"$f":"IF(INTRO!$E$39=\"Non endémique\",IF($D70=1,DEC!I70,0),IF($D70=1,IVM!G70,0))","v":0},null,{"$f":"IF(OR(COUNTRY_INFO!N70=\"Inconnu\",COUNTRY_INFO!N70=\"Surveillance\",COUNTRY_INFO!N70=\"Non requis\",COUNTRY_INFO!N70=0),0,IF(INTRO!$E$39=\"Non endémique\",IF(AND($E70<>0,$G70=\"\"),IF($F70=0,COUNTRY_INFO!N70*$E70,COUNTRY_INFO!N70*($E70-$D70)),IF(AND($E70<>0,$G70<>0),IF($F70=0,COUNTRY_INFO!N70*$G70,COUNTRY_INFO!N70*($G70-$D70)),0)),IF($G70=\"\",COUNTRY_INFO!N70*$E70,COUNTRY_INFO!N70*$G70)))","v":0},{"$f":"IF(OR(COUNTRY_INFO!O70=\"Inconnu\",COUNTRY_INFO!O70=\"Surveillance\",COUNTRY_INFO!O70=\"Non requis\",COUNTRY_INFO!O70=0),0,IF($E70<>0, IF($F70=0,COUNTRY_INFO!O70*$E70,COUNTRY_INFO!O70*($E70-$D70)),COUNTRY_INFO!O70*$E70))","v":0},null,{"$f":"IF(OR(COUNTRY_INFO!P70=\"Inconnu\",COUNTRY_INFO!P70=\"Surveillance\",COUNTRY_INFO!P70=\"Non requis\",COUNTRY_INFO!P70=0),0,IF(AND($E70<>0,$J70=\"\"),IF($F70=0,COUNTRY_INFO!P70*$E70,COUNTRY_INFO!P70*($E70-$D70)), IF(AND($E70<>0,$J70<>0),IF($F70=0,COUNTRY_INFO!P70*$J70,COUNTRY_INFO!P70*($J70-$D70)), COUNTRY_INFO!P70*$J70)))","v":0},0,0,null,0,0,null,0,0,null,0]
[{"$f":"IF(AND(INTRO!$E$37=\"Non endémique\",INTRO!$E$41=\"Non endémique\"),\" \",IF(COUNTRY_INFO!A71=0,\" \",COUNTRY_INFO!A71))","v":"NIGER"},{"$f":"IF(AND(INTRO!$E$37=\"Non endémique\",INTRO!$E$41=\"Non endémique\"),\" \",IF(COUNTRY_INFO!B71=0,\" \",COUNTRY_INFO!B71))","v":"Zinder"},{"$f":"IF(AND(INTRO!$E$37=\"Non endémique\",INTRO!$E$41=\"Non endémique\"),\" \",IF(COUNTRY_INFO!C71=0,\" \",COUNTRY_INFO!C71))","v":"Goure"},{"$f":"IF(AND(INTRO!$E$37=\"Non endémique\",INTRO!$E$41=\"Non endémique\"),0,COUNTRY_INFO!V71)","v":0},{"$f":"IF(AND(INTRO!$E$37=\"Non endémique\",INTRO!$E$41=\"Non endémique\"),0,COUNTRY_INFO!X71)","v":0},{"$f":"IF(INTRO!$E$39=\"Non endémique\",IF($D71=1,DEC!I71,0),IF($D71=1,IVM!G71,0))","v":0},null,{"$f":"IF(OR(COUNTRY_INFO!N71=\"Inconnu\",COUNTRY_INFO!N71=\"Surveillance\",COUNTRY_INFO!N71=\"Non requis\",COUNTRY_INFO!N71=0),0,IF(INTRO!$E$39=\"Non endémique\",IF(AND($E71<>0,$G71=\"\"),IF($F71=0,COUNTRY_INFO!N71*$E71,COUNTRY_INFO!N71*($E71-$D71)),IF(AND($E71<>0,$G71<>0),IF($F71=0,COUNTRY_INFO!N71*$G71,COUNTRY_INFO!N71*($G71-$D71)),0)),IF($G71=\"\",COUNTRY_INFO!N71*$E71,COUNTRY_INFO!N71*$G71)))","v":0},{"$f":"IF(OR(COUNTRY_INFO!O71=\"Inconnu\",COUNTRY_INFO!O71=\"Surveillance\",COUNTRY_INFO!O71=\"Non requis\",COUNTRY_INFO!O71=0),0,IF($E71<>0, IF($F71=0,COUNTRY_INFO!O71*$E71,COUNTRY_INFO!O71*($E71-$D71)),COUNTRY_INFO!O71*$E71))","v":0},null,{"$f":"IF(OR(COUNTRY_INFO!P71=\"Inconnu\",COUNTRY_INFO!P71=\"Surveillance\",COUNTRY_INFO!P71=\"Non requis\",COUNTRY_INFO!P71=0),0,IF(AND($E71<>0,$J71=\"\"),IF($F71=0,COUNTRY_INFO!P71*$E71,COUNTRY_INFO!P71*($E71-$D71)), IF(AND($E71<>0,$J71<>0),IF($F71=0,COUNTRY_INFO!P71*$J71,COUNTRY_INFO!P71*($J71-$D71)), COUNTRY_INFO!P71*$J71)))","v":0},0,0,null,0,0,null,0,0,null,0]
[{"$f":"IF(AND(INTRO!$E$37=\"Non endémique\",INTRO!$E$41=\"Non endémique\"),\" \",IF(COUNTRY_INFO!A72=0,\" \",COUNTRY_INFO!A72))","v":"NIGER"},{"$f":"IF(AND(INTRO!$E$37=\"Non endémique\",INTRO!$E$41=\"Non endémique\"),\" \",IF(COUNTRY_INFO!B72=0,\" \",COUNTRY_INFO!B72))","v":"Zinder"},{"$f":"IF(AND(INTRO!$E$37=\"Non endémique\",INTRO!$E$41=\"Non endémique\"),\" \",IF(COUNTRY_INFO!C72=0,\" \",COUNTRY_INFO!C72))","v":"Tesker"},{"$f":"IF(AND(INTRO!$E$37=\"Non endémique\",INTRO!$E$41=\"Non endémique\"),0,COUNTRY_INFO!V72)","v":0},{"$f":"IF(AND(INTRO!$E$37=\"Non endémique\",INTRO!$E$41=\"Non endémique\"),0,COUNTRY_INFO!X72)","v":0},{"$f":"IF(INTRO!$E$39=\"Non endémique\",IF($D72=1,DEC!I72,0),IF($D72=1,IVM!G72,0))","v":0},null,{"$f":"IF(OR(COUNTRY_INFO!N72=\"Inconnu\",COUNTRY_INFO!N72=\"Surveillance\",COUNTRY_INFO!N72=\"Non requis\",COUNTRY_INFO!N72=0),0,IF(INTRO!$E$39=\"Non endémique\",IF(AND($E72<>0,$G72=\"\"),IF($F72=0,COUNTRY_INFO!N72*$E72,COUNTRY_INFO!N72*($E72-$D72)),IF(AND($E72<>0,$G72<>0),IF($F72=0,COUNTRY_INFO!N72*$G72,COUNTRY_INFO!N72*($G72-$D72)),0)),IF($G72=\"\",COUNTRY_INFO!N72*$E72,COUNTRY_INFO!N72*$G72)))","v":0},{"$f":"IF(OR(COUNTRY_INFO!O72=\"Inconnu\",COUNTRY_INFO!O72=\"Surveillance\",COUNTRY_INFO!O72=\"Non requis\",COUNTRY_INFO!O72=0),0,IF($E72<>0, IF($F72=0,COUNTRY_INFO!O72*$E72,COUNTRY_INFO!O72*($E72-$D72)),COUNTRY_INFO!O72*$E72))","v":0},null,{"$f":"IF(OR(COUNTRY_INFO!P72=\"Inconnu\",COUNTRY_INFO!P72=\"Surveillance\",COUNTRY_INFO!P72=\"Non requis\",COUNTRY_INFO!P72=0),0,IF(AND($E72<>0,$J72=\"\"),IF($F72=0,COUNTRY_INFO!P72*$E72,COUNTRY_INFO!P72*($E72-$D72)), IF(AND($E72<>0,$J72<>0),IF($F72=0,COUNTRY_INFO!P72*$J72,COUNTRY_INFO!P72*($J72-$D72)), COUNTRY_INFO!P72*$J72)))","v":0},0,0,null,0,0,null,0,0,null,0]
[{"$f":"IF(AND(INTRO!$E$37=\"Non endémique\",INTRO!$E$41=\"Non endémique\"),\" \",IF(COUNTRY_INFO!A73=0,\" \",COUNTRY_INFO!A73))","v":"NIGER"},{"$f":"IF(AND(INTRO!$E$37=\"Non endémique\",INTRO!$E$41=\"Non endémique\"),\" \",IF(COUNTRY_INFO!B73=0,\" \",COUNTRY_INFO!B73))","v":"Zinder"},{"$f":"IF(AND(INTRO!$E$37=\"Non endémique\",INTRO!$E$41=\"Non endémique\"),\" \",IF(COUNTRY_INFO!C73=0,\" \",COUNTRY_INFO!C73))","v":"Magaria"},{"$f":"IF(AND(INTRO!$E$37=\"Non endémique\",INTRO!$E$41=\"Non endémique\"),0,COUNTRY_INFO!V73)","v":0},{"$f":"IF(AND(INTRO!$E$37=\"Non endémique\",INTRO!$E$41=\"Non endémique\"),0,COUNTRY_INFO!X73)","v":0},{"$f":"IF(INTRO!$E$39=\"Non endémique\",IF($D73=1,DEC!I73,0),IF($D73=1,IVM!G73,0))","v":0},null,{"$f":"IF(OR(COUNTRY_INFO!N73=\"Inconnu\",COUNTRY_INFO!N73=\"Surveillance\",COUNTRY_INFO!N73=\"Non requis\",COUNTRY_INFO!N73=0),0,IF(INTRO!$E$39=\"Non endémique\",IF(AND($E73<>0,$G73=\"\"),IF($F73=0,COUNTRY_INFO!N73*$E73,COUNTRY_INFO!N73*($E73-$D73)),IF(AND($E73<>0,$G73<>0),IF($F73=0,COUNTRY_INFO!N73*$G73,COUNTRY_INFO!N73*($G73-$D73)),0)),IF($G73=\"\",COUNTRY_INFO!N73*$E73,COUNTRY_INFO!N73*$G73)))","v":0},{"$f":"IF(OR(COUNTRY_INFO!O73=\"Inconnu\",COUNTRY_INFO!O73=\"Surveillance\",COUNTRY_INFO!O73=\"Non requis\",COUNTRY_INFO!O73=0),0,IF($E73<>0, IF($F73=0,COUNTRY_INFO!O73*$E73,COUNTRY_INFO!O73*($E73-$D73)),COUNTRY_INFO!O73*$E73))","v":0},null,{"$f":"IF(OR(COUNTRY_INFO!P73=\"Inconnu\",COUNTRY_INFO!P73=\"Surveillance\",COUNTRY_INFO!P73=\"Non requis\",COUNTRY_INFO!P73=0),0,IF(AND($E73<>0,$J73=\"\"),IF($F73=0,COUNTRY_INFO!P73*$E73,COUNTRY_INFO!P73*($E73-$D73)), IF(AND($E73<>0,$J73<>0),IF($F73=0,COUNTRY_INFO!P73*$J73,COUNTRY_INFO!P73*($J73-$D73)), COUNTRY_INFO!P73*$J73)))","v":0},0,0,null,0,0,null,0,0,null,0]
[{"$f":"IF(AND(INTRO!$E$37=\"Non endémique\",INTRO!$E$41=\"Non endémique\"),\" \",IF(COUNTRY_INFO!A74=0,\" \",COUNTRY_INFO!A74))","v":"NIGER"},{"$f":"IF(AND(INTRO!$E$37=\"Non endémique\",INTRO!$E$41=\"Non endémique\"),\" \",IF(COUNTRY_INFO!B74=0,\" \",COUNTRY_INFO!B74))","v":"Zinder"},{"$f":"IF(AND(INTRO!$E$37=\"Non endémique\",INTRO!$E$41=\"Non endémique\"),\" \",IF(COUNTRY_INFO!C74=0,\" \",COUNTRY_INFO!C74))","v":"Dungass"},{"$f":"IF(AND(INTRO!$E$37=\"Non endémique\",INTRO!$E$41=\"Non endémique\"),0,COUNTRY_INFO!V74)","v":0},{"$f":"IF(AND(INTRO!$E$37=\"Non endémique\",INTRO!$E$41=\"Non endémique\"),0,COUNTRY_INFO!X74)","v":0},{"$f":"IF(INTRO!$E$39=\"Non endémique\",IF($D74=1,DEC!I74,0),IF($D74=1,IVM!G74,0))","v":0},null,{"$f":"IF(OR(COUNTRY_INFO!N74=\"Inconnu\",COUNTRY_INFO!N74=\"Surveillance\",COUNTRY_INFO!N74=\"Non requis\",COUNTRY_INFO!N74=0),0,IF(INTRO!$E$39=\"Non endémique\",IF(AND($E74<>0,$G74=\"\"),IF($F74=0,COUNTRY_INFO!N74*$E74,COUNTRY_INFO!N74*($E74-$D74)),IF(AND($E74<>0,$G74<>0),IF($F74=0,COUNTRY_INFO!N74*$G74,COUNTRY_INFO!N74*($G74-$D74)),0)),IF($G74=\"\",COUNTRY_INFO!N74*$E74,COUNTRY_INFO!N74*$G74)))","v":0},{"$f":"IF(OR(COUNTRY_INFO!O74=\"Inconnu\",COUNTRY_INFO!O74=\"Surveillance\",COUNTRY_INFO!O74=\"Non requis\",COUNTRY_INFO!O74=0),0,IF($E74<>0, IF($F74=0,COUNTRY_INFO!O74*$E74,COUNTRY_INFO!O74*($E74-$D74)),COUNTRY_INFO!O74*$E74))","v":0},null,{"$f":"IF(OR(COUNTRY_INFO!P74=\"Inconnu\",COUNTRY_INFO!P74=\"Surveillance\",COUNTRY_INFO!P74=\"Non requis\",COUNTRY_INFO!P74=0),0,IF(AND($E74<>0,$J74=\"\"),IF($F74=0,COUNTRY_INFO!P74*$E74,COUNTRY_INFO!P74*($E74-$D74)), IF(AND($E74<>0,$J74<>0),IF($F74=0,COUNTRY_INFO!P74*$J74,COUNTRY_INFO!P74*($J74-$D74)), COUNTRY_INFO!P74*$J74)))","v":0},0,0,null,0,0,null,0,0,null,0]
[{"$f":"IF(AND(INTRO!$E$37=\"Non endémique\",INTRO!$E$41=\"Non endémique\"),\" \",IF(COUNTRY_INFO!A75=0,\" \",COUNTRY_INFO!A75))","v":"NIGER"},{"$f":"IF(AND(INTRO!$E$37=\"Non endémique\",INTRO!$E$41=\"Non endémique\"),\" \",IF(COUNTRY_INFO!B75=0,\" \",COUNTRY_INFO!B75))","v":"Zinder"},{"$f":"IF(AND(INTRO!$E$37=\"Non endémique\",INTRO!$E$41=\"Non endémique\"),\" \",IF(COUNTRY_INFO!C75=0,\" \",COUNTRY_INFO!C75))","v":"Matamaye"},{"$f":"IF(AND(INTRO!$E$37=\"Non endémique\",INTRO!$E$41=\"Non endémique\"),0,COUNTRY_INFO!V75)","v":0},{"$f":"IF(AND(INTRO!$E$37=\"Non endémique\",INTRO!$E$41=\"Non endémique\"),0,COUNTRY_INFO!X75)","v":0},{"$f":"IF(INTRO!$E$39=\"Non endémique\",IF($D75=1,DEC!I75,0),IF($D75=1,IVM!G75,0))","v":0},null,{"$f":"IF(OR(COUNTRY_INFO!N75=\"Inconnu\",COUNTRY_INFO!N75=\"Surveillance\",COUNTRY_INFO!N75=\"Non requis\",COUNTRY_INFO!N75=0),0,IF(INTRO!$E$39=\"Non endémique\",IF(AND($E75<>0,$G75=\"\"),IF($F75=0,COUNTRY_INFO!N75*$E75,COUNTRY_INFO!N75*($E75-$D75)),IF(AND($E75<>0,$G75<>0),IF($F75=0,COUNTRY_INFO!N75*$G75,COUNTRY_INFO!N75*($G75-$D75)),0)),IF($G75=\"\",COUNTRY_INFO!N75*$E75,COUNTRY_INFO!N75*$G75)))","v":0},{"$f":"IF(OR(COUNTRY_INFO!O75=\"Inconnu\",COUNTRY_INFO!O75=\"Surveillance\",COUNTRY_INFO!O75=\"Non requis\",COUNTRY_INFO!O75=0),0,IF($E75<>0, IF($F75=0,COUNTRY_INFO!O75*$E75,COUNTRY_INFO!O75*($E75-$D75)),COUNTRY_INFO!O75*$E75))","v":0},null,{"$f":"IF(OR(COUNTRY_INFO!P75=\"Inconnu\",COUNTRY_INFO!P75=\"Surveillance\",COUNTRY_INFO!P75=\"Non requis\",COUNTRY_INFO!P75=0),0,IF(AND($E75<>0,$J75=\"\"),IF($F75=0,COUNTRY_INFO!P75*$E75,COUNTRY_INFO!P75*($E75-$D75)), IF(AND($E75<>0,$J75<>0),IF($F75=0,COUNTRY_INFO!P75*$J75,COUNTRY_INFO!P75*($J75-$D75)), COUNTRY_INFO!P75*$J75)))","v":0},0,0,null,0,0,null,0,0,null,0]
[{"$f":"IF(AND(INTRO!$E$37=\"Non endémique\",INTRO!$E$41=\"Non endémique\"),\" \",IF(COUNTRY_INFO!A76=0,\" \",COUNTRY_INFO!A76))","v":"NIGER"},{"$f":"IF(AND(INTRO!$E$37=\"Non endémique\",INTRO!$E$41=\"Non endémique\"),\" \",IF(COUNTRY_INFO!B76=0,\" \",COUNTRY_INFO!B76))","v":"Zinder"},{"$f":"IF(AND(INTRO!$E$37=\"Non endémique\",INTRO!$E$41=\"Non endémique\"),\" \",IF(COUNTRY_INFO!C76=0,\" \",COUNTRY_INFO!C76))","v":"Miriah"},{"$f":"IF(AND(INTRO!$E$37=\"Non endémique\",INTRO!$E$41=\"Non endémique\"),0,COUNTRY_INFO!V76)","v":0},{"$f":"IF(AND(INTRO!$E$37=\"Non endémique\",INTRO!$E$41=\"Non endémique\"),0,COUNTRY_INFO!X76)","v":0},{"$f":"IF(INTRO!$E$39=\"Non endémique\",IF($D76=1,DEC!I76,0),IF($D76=1,IVM!G76,0))","v":0},null,{"$f":"IF(OR(COUNTRY_INFO!N76=\"Inconnu\",COUNTRY_INFO!N76=\"Surveillance\",COUNTRY_INFO!N76=\"Non requis\",COUNTRY_INFO!N76=0),0,IF(INTRO!$E$39=\"Non endémique\",IF(AND($E76<>0,$G76=\"\"),IF($F76=0,COUNTRY_INFO!N76*$E76,COUNTRY_INFO!N76*($E76-$D76)),IF(AND($E76<>0,$G76<>0),IF($F76=0,COUNTRY_INFO!N76*$G76,COUNTRY_INFO!N76*($G76-$D76)),0)),IF($G76=\"\",COUNTRY_INFO!N76*$E76,COUNTRY_INFO!N76*$G76)))","v":0},{"$f":"IF(OR(COUNTRY_INFO!O76=\"Inconnu\",COUNTRY_INFO!O76=\"Surveillance\",COUNTRY_INFO!O76=\"Non requis\",COUNTRY_INFO!O76=0),0,IF($E76<>0, IF($F76=0,COUNTRY_INFO!O76*$E76,COUNTRY_INFO!O76*($E76-$D76)),COUNTRY_INFO!O76*$E76))","v":0},null,{"$f":"IF(OR(COUNTRY_INFO!P76=\"Inconnu\",COUNTRY_INFO!P76=\"Surveillance\",COUNTRY_INFO!P76=\"Non requis\",COUNTRY_INFO!P76=0),0,IF(AND($E76<>0,$J76=\"\"),IF($F76=0,COUNTRY_INFO!P76*$E76,COUNTRY_INFO!P76*($E76-$D76)), IF(AND($E76<>0,$J76<>0),IF($F76=0,COUNTRY_INFO!P76*$J76,COUNTRY_INFO!P76*($J76-$D76)), COUNTRY_INFO!P76*$J76)))","v":0},0,0,null,0,0,null,0,0,null,0]
[{"$f":"IF(AND(INTRO!$E$37=\"Non endémique\",INTRO!$E$41=\"Non endémique\"),\" \",IF(COUNTRY_INFO!A77=0,\" \",COUNTRY_INFO!A77))","v":"NIGER"},{"$f":"IF(AND(INTRO!$E$37=\"Non endémique\",INTRO!$E$41=\"Non endémique\"),\" \",IF(COUNTRY_INFO!B77=0,\" \",COUNTRY_INFO!B77))","v":"Zinder"},{"$f":"IF(AND(INTRO!$E$37=\"Non endémique\",INTRO!$E$41=\"Non endémique\"),\" \",IF(COUNTRY_INFO!C77=0,\" \",COUNTRY_INFO!C77))","v":"Damagaram Takaya"},{"$f":"IF(AND(INTRO!$E$37=\"Non endémique\",INTRO!$E$41=\"Non endémique\"),0,COUNTRY_INFO!V77)","v":0},{"$f":"IF(AND(INTRO!$E$37=\"Non endémique\",INTRO!$E$41=\"Non endémique\"),0,COUNTRY_INFO!X77)","v":0},{"$f":"IF(INTRO!$E$39=\"Non endémique\",IF($D77=1,DEC!I77,0),IF($D77=1,IVM!G77,0))","v":0},null,{"$f":"IF(OR(COUNTRY_INFO!N77=\"Inconnu\",COUNTRY_INFO!N77=\"Surveillance\",COUNTRY_INFO!N77=\"Non requis\",COUNTRY_INFO!N77=0),0,IF(INTRO!$E$39=\"Non endémique\",IF(AND($E77<>0,$G77=\"\"),IF($F77=0,COUNTRY_INFO!N77*$E77,COUNTRY_INFO!N77*($E77-$D77)),IF(AND($E77<>0,$G77<>0),IF($F77=0,COUNTRY_INFO!N77*$G77,COUNTRY_INFO!N77*($G77-$D77)),0)),IF($G77=\"\",COUNTRY_INFO!N77*$E77,COUNTRY_INFO!N77*$G77)))","v":0},{"$f":"IF(OR(COUNTRY_INFO!O77=\"Inconnu\",COUNTRY_INFO!O77=\"Surveillance\",COUNTRY_INFO!O77=\"Non requis\",COUNTRY_INFO!O77=0),0,IF($E77<>0, IF($F77=0,COUNTRY_INFO!O77*$E77,COUNTRY_INFO!O77*($E77-$D77)),COUNTRY_INFO!O77*$E77))","v":0},null,{"$f":"IF(OR(COUNTRY_INFO!P77=\"Inconnu\",COUNTRY_INFO!P77=\"Surveillance\",COUNTRY_INFO!P77=\"Non requis\",COUNTRY_INFO!P77=0),0,IF(AND($E77<>0,$J77=\"\"),IF($F77=0,COUNTRY_INFO!P77*$E77,COUNTRY_INFO!P77*($E77-$D77)), IF(AND($E77<>0,$J77<>0),IF($F77=0,COUNTRY_INFO!P77*$J77,COUNTRY_INFO!P77*($J77-$D77)), COUNTRY_INFO!P77*$J77)))","v":0},0,0,null,0,0,null,0,0,null,0]
[{"$f":"IF(AND(INTRO!$E$37=\"Non endémique\",INTRO!$E$41=\"Non endémique\"),\" \",IF(COUNTRY_INFO!A78=0,\" \",COUNTRY_INFO!A78))","v":"NIGER"},{"$f":"IF(AND(INTRO!$E$37=\"Non endémique\",INTRO!$E$41=\"Non endémique\"),\" \",IF(COUNTRY_INFO!B78=0,\" \",COUNTRY_INFO!B78))","v":"Zinder"},{"$f":"IF(AND(INTRO!$E$37=\"Non endémique\",INTRO!$E$41=\"Non endémique\"),\" \",IF(COUNTRY_INFO!C78=0,\" \",COUNTRY_INFO!C78))","v":"Takeita"},{"$f":"IF(AND(INTRO!$E$37=\"Non endémique\",INTRO!$E$41=\"Non endémique\"),0,COUNTRY_INFO!V78)","v":0},{"$f":"IF(AND(INTRO!$E$37=\"Non endémique\",INTRO!$E$41=\"Non endémique\"),0,COUNTRY_INFO!X78)","v":0},{"$f":"IF(INTRO!$E$39=\"Non endémique\",IF($D78=1,DEC!I78,0),IF($D78=1,IVM!G78,0))","v":0},null,{"$f":"IF(OR(COUNTRY_INFO!N78=\"Inconnu\",COUNTRY_INFO!N78=\"Surveillance\",COUNTRY_INFO!N78=\"Non requis\",COUNTRY_INFO!N78=0),0,IF(INTRO!$E$39=\"Non endémique\",IF(AND($E78<>0,$G78=\"\"),IF($F78=0,COUNTRY_INFO!N78*$E78,COUNTRY_INFO!N78*($E78-$D78)),IF(AND($E78<>0,$G78<>0),IF($F78=0,COUNTRY_INFO!N78*$G78,COUNTRY_INFO!N78*($G78-$D78)),0)),IF($G78=\"\",COUNTRY_INFO!N78*$E78,COUNTRY_INFO!N78*$G78)))","v":0},{"$f":"IF(OR(COUNTRY_INFO!O78=\"Inconnu\",COUNTRY_INFO!O78=\"Surveillance\",COUNTRY_INFO!O78=\"Non requis\",COUNTRY_INFO!O78=0),0,IF($E78<>0, IF($F78=0,COUNTRY_INFO!O78*$E78,COUNTRY_INFO!O78*($E78-$D78)),COUNTRY_INFO!O78*$E78))","v":0},null,{"$f":"IF(OR(COUNTRY_INFO!P78=\"Inconnu\",COUNTRY_INFO!P78=\"Surveillance\",COUNTRY_INFO!P78=\"Non requis\",COUNTRY_INFO!P78=0),0,IF(AND($E78<>0,$J78=\"\"),IF($F78=0,COUNTRY_INFO!P78*$E78,COUNTRY_INFO!P78*($E78-$D78)), IF(AND($E78<>0,$J78<>0),IF($F78=0,COUNTRY_INFO!P78*$J78,COUNTRY_INFO!P78*($J78-$D78)), COUNTRY_INFO!P78*$J78)))","v":0},0,0,null,0,0,null,0,0,null,0]
[{"$f":"IF(AND(INTRO!$E$37=\"Non endémique\",INTRO!$E$41=\"Non endémique\"),\" \",IF(COUNTRY_INFO!A79=0,\" \",COUNTRY_INFO!A79))","v":"NIGER"},{"$f":"IF(AND(INTRO!$E$37=\"Non endémique\",INTRO!$E$41=\"Non endémique\"),\" \",IF(COUNTRY_INFO!B79=0,\" \",COUNTRY_INFO!B79))","v":"Zinder"},{"$f":"IF(AND(INTRO!$E$37=\"Non endémique\",INTRO!$E$41=\"Non endémique\"),\" \",IF(COUNTRY_INFO!C79=0,\" \",COUNTRY_INFO!C79))","v":"Tanout"},{"$f":"IF(AND(INTRO!$E$37=\"Non endémique\",INTRO!$E$41=\"Non endémique\"),0,COUNTRY_INFO!V79)","v":0},{"$f":"IF(AND(INTRO!$E$37=\"Non endémique\",INTRO!$E$41=\"Non endémique\"),0,COUNTRY_INFO!X79)","v":0},{"$f":"IF(INTRO!$E$39=\"Non endémique\",IF($D79=1,DEC!I79,0),IF($D79=1,IVM!G79,0))","v":0},null,{"$f":"IF(OR(COUNTRY_INFO!N79=\"Inconnu\",COUNTRY_INFO!N79=\"Surveillance\",COUNTRY_INFO!N79=\"Non requis\",COUNTRY_INFO!N79=0),0,IF(INTRO!$E$39=\"Non endémique\",IF(AND($E79<>0,$G79=\"\"),IF($F79=0,COUNTRY_INFO!N79*$E79,COUNTRY_INFO!N79*($E79-$D79)),IF(AND($E79<>0,$G79<>0),IF($F79=0,COUNTRY_INFO!N79*$G79,COUNTRY_INFO!N79*($G79-$D79)),0)),IF($G79=\"\",COUNTRY_INFO!N79*$E79,COUNTRY_INFO!N79*$G79)))","v":0},{"$f":"IF(OR(COUNTRY_INFO!O79=\"Inconnu\",COUNTRY_INFO!O79=\"Surveillance\",COUNTRY_INFO!O79=\"Non requis\",COUNTRY_INFO!O79=0),0,IF($E79<>0, IF($F79=0,COUNTRY_INFO!O79*$E79,COUNTRY_INFO!O79*($E79-$D79)),COUNTRY_INFO!O79*$E79))","v":0},null,{"$f":"IF(OR(COUNTRY_INFO!P79=\"Inconnu\",COUNTRY_INFO!P79=\"Surveillance\",COUNTRY_INFO!P79=\"Non requis\",COUNTRY_INFO!P79=0),0,IF(AND($E79<>0,$J79=\"\"),IF($F79=0,COUNTRY_INFO!P79*$E79,COUNTRY_INFO!P79*($E79-$D79)), IF(AND($E79<>0,$J79<>0),IF($F79=0,COUNTRY_INFO!P79*$J79,COUNTRY_INFO!P79*($J79-$D79)), COUNTRY_INFO!P79*$J79)))","v":0},0,0,null,0,0,null,0,0,null,0]
[{"$f":"IF(AND(INTRO!$E$37=\"Non endémique\",INTRO!$E$41=\"Non endémique\"),\" \",IF(COUNTRY_INFO!A80=0,\" \",COUNTRY_INFO!A80))","v":"NIGER"},{"$f":"IF(AND(INTRO!$E$37=\"Non endémique\",INTRO!$E$41=\"Non endémique\"),\" \",IF(COUNTRY_INFO!B80=0,\" \",COUNTRY_INFO!B80))","v":"Zinder"},{"$f":"IF(AND(INTRO!$E$37=\"Non endémique\",INTRO!$E$41=\"Non endémique\"),\" \",IF(COUNTRY_INFO!C80=0,\" \",COUNTRY_INFO!C80))","v":"Belbéji"},{"$f":"IF(AND(INTRO!$E$37=\"Non endémique\",INTRO!$E$41=\"Non endémique\"),0,COUNTRY_INFO!V80)","v":0},{"$f":"IF(AND(INTRO!$E$37=\"Non endémique\",INTRO!$E$41=\"Non endémique\"),0,COUNTRY_INFO!X80)","v":0},{"$f":"IF(INTRO!$E$39=\"Non endémique\",IF($D80=1,DEC!I80,0),IF($D80=1,IVM!G80,0))","v":0},null,{"$f":"IF(OR(COUNTRY_INFO!N80=\"Inconnu\",COUNTRY_INFO!N80=\"Surveillance\",COUNTRY_INFO!N80=\"Non requis\",COUNTRY_INFO!N80=0),0,IF(INTRO!$E$39=\"Non endémique\",IF(AND($E80<>0,$G80=\"\"),IF($F80=0,COUNTRY_INFO!N80*$E80,COUNTRY_INFO!N80*($E80-$D80)),IF(AND($E80<>0,$G80<>0),IF($F80=0,COUNTRY_INFO!N80*$G80,COUNTRY_INFO!N80*($G80-$D80)),0)),IF($G80=\"\",COUNTRY_INFO!N80*$E80,COUNTRY_INFO!N80*$G80)))","v":0},{"$f":"IF(OR(COUNTRY_INFO!O80=\"Inconnu\",COUNTRY_INFO!O80=\"Surveillance\",COUNTRY_INFO!O80=\"Non requis\",COUNTRY_INFO!O80=0),0,IF($E80<>0, IF($F80=0,COUNTRY_INFO!O80*$E80,COUNTRY_INFO!O80*($E80-$D80)),COUNTRY_INFO!O80*$E80))","v":0},null,{"$f":"IF(OR(COUNTRY_INFO!P80=\"Inconnu\",COUNTRY_INFO!P80=\"Surveillance\",COUNTRY_INFO!P80=\"Non requis\",COUNTRY_INFO!P80=0),0,IF(AND($E80<>0,$J80=\"\"),IF($F80=0,COUNTRY_INFO!P80*$E80,COUNTRY_INFO!P80*($E80-$D80)), IF(AND($E80<>0,$J80<>0),IF($F80=0,COUNTRY_INFO!P80*$J80,COUNTRY_INFO!P80*($J80-$D80)), COUNTRY_INFO!P80*$J80)))","v":0},0,0,null,0,0,null,0,0,null,0]
[{"$f":"IF(AND(INTRO!$E$37=\"Non endémique\",INTRO!$E$41=\"Non endémique\"),\" \",IF(COUNTRY_INFO!A81=0,\" \",COUNTRY_INFO!A81))","v":"NIGER"},{"$f":"IF(AND(INTRO!$E$37=\"Non endémique\",INTRO!$E$41=\"Non endémique\"),\" \",IF(COUNTRY_INFO!B81=0,\" \",COUNTRY_INFO!B81))","v":"Zinder"},{"$f":"IF(AND(INTRO!$E$37=\"Non endémique\",INTRO!$E$41=\"Non endémique\"),\" \",IF(COUNTRY_INFO!C81=0,\" \",COUNTRY_INFO!C81))","v":"Zinder"},{"$f":"IF(AND(INTRO!$E$37=\"Non endémique\",INTRO!$E$41=\"Non endémique\"),0,COUNTRY_INFO!V81)","v":0},{"$f":"IF(AND(INTRO!$E$37=\"Non endémique\",INTRO!$E$41=\"Non endémique\"),0,COUNTRY_INFO!X81)","v":0},{"$f":"IF(INTRO!$E$39=\"Non endémique\",IF($D81=1,DEC!I81,0),IF($D81=1,IVM!G81,0))","v":0},0,{"$f":"IF(OR(COUNTRY_INFO!N81=\"Inconnu\",COUNTRY_INFO!N81=\"Surveillance\",COUNTRY_INFO!N81=\"Non requis\",COUNTRY_INFO!N81=0),0,IF(INTRO!$E$39=\"Non endémique\",IF(AND($E81<>0,$G81=\"\"),IF($F81=0,COUNTRY_INFO!N81*$E81,COUNTRY_INFO!N81*($E81-$D81)),IF(AND($E81<>0,$G81<>0),IF($F81=0,COUNTRY_INFO!N81*$G81,COUNTRY_INFO!N81*($G81-$D81)),0)),IF($G81=\"\",COUNTRY_INFO!N81*$E81,COUNTRY_INFO!N81*$G81)))","v":0},{"$f":"IF(OR(COUNTRY_INFO!O81=\"Inconnu\",COUNTRY_INFO!O81=\"Surveillance\",COUNTRY_INFO!O81=\"Non requis\",COUNTRY_INFO!O81=0),0,IF($E81<>0, IF($F81=0,COUNTRY_INFO!O81*$E81,COUNTRY_INFO!O81*($E81-$D81)),COUNTRY_INFO!O81*$E81))","v":0},0,{"$f":"IF(OR(COUNTRY_INFO!P81=\"Inconnu\",COUNTRY_INFO!P81=\"Surveillance\",COUNTRY_INFO!P81=\"Non requis\",COUNTRY_INFO!P81=0),0,IF(AND($E81<>0,$J81=\"\"),IF($F81=0,COUNTRY_INFO!P81*$E81,COUNTRY_INFO!P81*($E81-$D81)), IF(AND($E81<>0,$J81<>0),IF($F81=0,COUNTRY_INFO!P81*$J81,COUNTRY_INFO!P81*($J81-$D81)), COUNTRY_INFO!P81*$J81)))","v":0},0,0,null,0,0,null,0,0,null,0]

{"sheet":"PZQ","index":4,"n_rows":81,"n_cols":18,"rows_kept":81,"cut":false,"hidden":false,"merged":[[3,0,3,2],[5,0,5,2],[5,4,5,7],[5,8,5,9],[6,17,7,17],[6,6,7,6],[6,7,7,7],[6,9,7,9],[6,0,7,0],[6,1,7,1],[6,2,7,2],[6,4,7,4],[5,3,7,3],[6,5,7,5],[6,8,7,8],[6,12,7,12],[5,12,5,17],[5,10,5,11],[6,10,7,10],[6,14,7,14],[6,15,7,15],[6,16,7,16],[6,13,7,13],[6,11,7,11]]}
["Praziquantel (PZQ)"]
["Structure administrative, population ciblée par groupe d'âge, plan de traitement et information sur les comprimés"]
[]
["TOTAL",null,null,null,{"$f":"SUBTOTAL(9,E$10:E$1010)","v":0},1858135.1248547907,3096891.8747579847,4955026.9996127728,null,0,null,null,{"$f":"SUBTOTAL(9,M$10:M$1010)","v":0},3716270.2497095815,9290675.6242739484,13006945.873983538,0,13006945.873983538]
[]
["Structure administrative du pays",null,null,"Plan de traitement\nSCH","Population cible pour SCH",null,null,null,"Hotspots",null,"Année précédent l’AMM",null,"Praziquantel (PZQ)"]
["Pays","Région/Département","District",null,"EAPréS","EAS","Adultes","Total","Prévue","Population","Tournées","Groupes d'âge","EAPréS","EAS","Adultes","Total requis","Reste en stock","Comprimés devant être fournis"]
[]
[]
[{"$f":"IF(INTRO!$E$43=\"Non endémique\",\" \", IF(COUNTRY_INFO!A10=0,\" \",COUNTRY_INFO!A10))","v":"NIGER"},{"$f":"IF(INTRO!$E$43=\"Non endémique\",\" \", IF(COUNTRY_INFO!B10=0,\" \",COUNTRY_INFO!B10))","v":"Agadez"},{"$f":"IF(INTRO!$E$43=\"Non endémique\",\" \", IF(COUNTRY_INFO!C10=0,\" \",COUNTRY_INFO!C10))","v":"Agadez"},{"$f":"IF(INTRO!$E$43=\"Non endémique\", \"Non requis\", COUNTRY_INFO!Y10)","v":0},{"$f":"IF(OR(COUNTRY_INFO!R10=\"Inconnu\",COUNTRY_INFO!R10=\"Surveillance\",COUNTRY_INFO!R10=\"Non requis\",COUNTRY_INFO!R10=0),0,IF($D10<>0, COUNTRY_INFO!R10,0))","v":0},{"$f":"IF(OR(COUNTRY_INFO!S10=\"Inconnu\",COUNTRY_INFO!S10=\"Surveillance\",COUNTRY_INFO!S10=\"Non requis\",COUNTRY_INFO!S10=0),0,IF($D10<>0, COUNTRY_INFO!S10,0))","v":0},{"$f":"IF(OR(COUNTRY_INFO!T10=\"Inconnu\",COUNTRY_INFO!T10=\"Surveillance\",COUNTRY_INFO!T10=\"Non requis\",COUNTRY_INFO!T10=0),0,IF($D10<>0, COUNTRY_INFO!T10,0))","v":0},{"$f":"SUM(E10:G10)","v":0},null,null,0,null,null,{"$f":"IF($I10<>\"Oui\",$F10*2,($F10+ROUND(J10*$F10/SUM(COUNTRY_INFO!$E10:$G10),0))*2)","v":0},{"$f":"IF($I10<>\"Oui\",$G10*3,($G10+ROUND(J10*$G10/SUM(COUNTRY_INFO!$E10:$G10),0))*3)","v":0},{"$f":"SUM(M10:O10)","v":0},null,{"$f":"IF($P10>$Q10,P10-Q10,0)","v":0}]
[{"$f":"IF(INTRO!$E$43=\"Non endémique\",\" \", IF(COUNTRY_INFO!A11=0,\" \",COUNTRY_INFO!A11))","v":"NIGER"},{"$f":"IF(INTRO!$E$43=\"Non endémique\",\" \", IF(COUNTRY_INFO!B11=0,\" \",COUNTRY_INFO!B11))","v":"Agadez"},{"$f":"IF(INTRO!$E$43=\"Non endémique\",\" \", IF(COUNTRY_INFO!C11=0,\" \",COUNTRY_INFO!C11))","v":"Arlit"},{"$f":"IF(INTRO!$E$43=\"Non endémique\", \"Non requis\", COUNTRY_INFO!Y11)","v":0},{"$f":"IF(OR(COUNTRY_INFO!R11=\"Inconnu\",COUNTRY_INFO!R11=\"Surveillance\",COUNTRY_INFO!R11=\"Non requis\",COUNTRY_INFO!R11=0),0,IF($D11<>0, COUNTRY_INFO!R11,0))","v":0},{"$f":"IF(OR(COUNTRY_INFO!S11=\"Inconnu\",COUNTRY_INFO!S11=\"Surveillance\",COUNTRY_INFO!S11=\"Non requis\",COUNTRY_INFO!S11=0),0,IF($D11<>0, COUNTRY_INFO!S11,0))","v":0},{"$f":"IF(OR(COUNTRY_INFO!T11=\"Inconnu\",COUNTRY_INFO!T11=\"Surveillance\",COUNTRY_INFO!T11=\"Non requis\",COUNTRY_INFO!T11=0),0,IF($D11<>0, COUNTRY_INFO!T11,0))","v":0},{"$f":"SUM(E11:G11)","v":0},null,null,0,null,null,{"$f":"IF($I11<>\"Oui\",$F11*2,($F11+ROUND(J11*$F11/SUM(COUNTRY_INFO!$E11:$G11),0))*2)","v":0},{"$f":"IF($I11<>\"Oui\",$G11*3,($G11+ROUND(J11*$G11/SUM(COUNTRY_INFO!$E11:$G11),0))*3)","v":0},{"$f":"SUM(M11:O11)","v":0},null,{"$f":"IF($P11>$Q11,P11-Q11,0)","v":0}]
[{"$f":"IF(INTRO!$E$43=\"Non endémique\",\" \", IF(COUNTRY_INFO!A12=0,\" \",COUNTRY_INFO!A12))","v":"NIGER"},{"$f":"IF(INTRO!$E$43=\"Non endémique\",\" \", IF(COUNTRY_INFO!B12=0,\" \",COUNTRY_INFO!B12))","v":"Agadez"},{"$f":"IF(INTRO!$E$43=\"Non endémique\",\" \", IF(COUNTRY_INFO!C12=0,\" \",COUNTRY_INFO!C12))","v":"Iférouane"},{"$f":"IF(INTRO!$E$43=\"Non endémique\", \"Non requis\", COUNTRY_INFO!Y12)","v":0},{"$f":"IF(OR(COUNTRY_INFO!R12=\"Inconnu\",COUNTRY_INFO!R12=\"Surveillance\",COUNTRY_INFO!R12=\"Non requis\",COUNTRY_INFO!R12=0),0,IF($D12<>0, COUNTRY_INFO!R12,0))","v":0},{"$f":"IF(OR(COUNTRY_INFO!S12=\"Inconnu\",COUNTRY_INFO!S12=\"Surveillance\",COUNTRY_INFO!S12=\"Non requis\",COUNTRY_INFO!S12=0),0,IF($D12<>0, COUNTRY_INFO!S12,0))","v":0},{"$f":"IF(OR(COUNTRY_INFO!T12=\"Inconnu\",COUNTRY_INFO!T12=\"Surveillance\",COUNTRY_INFO!T12=\"Non requis\",COUNTRY_INFO!T12=0),0,IF($D12<>0, COUNTRY_INFO!T12,0))","v":0},0,null,null,0,null,null,{"$f":"IF($I12<>\"Oui\",$F12*2,($F12+ROUND(J12*$F12/SUM(COUNTRY_INFO!$E12:$G12),0))*2)","v":0},{"$f":"IF($I12<>\"Oui\",$G12*3,($G12+ROUND(J12*$G12/SUM(COUNTRY_INFO!$E12:$G12),0))*3)","v":0},0,null,0]
[{"$f":"IF(INTRO!$E$43=\"Non endémique\",\" \", IF(COUNTRY_INFO!A13=0,\" \",COUNTRY_INFO!A13))","v":"NIGER"},{"$f":"IF(INTRO!$E$43=\"Non endémique\",\" \", IF(COUNTRY_INFO!B13=0,\" \",COUNTRY_INFO!B13))","v":"Agadez"},{"$f":"IF(INTRO!$E$43=\"Non endémique\",\" \", IF(COUNTRY_INFO!C13=0,\" \",COUNTRY_INFO!C13))","v":"Bilma"},{"$f":"IF(INTRO!$E$43=\"Non endémique\", \"Non requis\", COUNTRY_INFO!Y13)","v":0},{"$f":"IF(OR(COUNTRY_INFO!R13=\"Inconnu\",COUNTRY_INFO!R13=\"Surveillance\",COUNTRY_INFO!R13=\"Non requis\",COUNTRY_INFO!R13=0),0,IF($D13<>0, COUNTRY_INFO!R13,0))","v":0},{"$f":"IF(OR(COUNTRY_INFO!S13=\"Inconnu\",COUNTRY_INFO!S13=\"Surveillance\",COUNTRY_INFO!S13=\"Non requis\",COUNTRY_INFO!S13=0),0,IF($D13<>0, COUNTRY_INFO!S13,0))","v":0},{"$f":"IF(OR(COUNTRY_INFO!T13=\"Inconnu\",COUNTRY_INFO!T13=\"Surveillance\",COUNTRY_INFO!T13=\"Non requis\",COUNTRY_INFO!T13=0),0,IF($D13<>0, COUNTRY_INFO!T13,0))","v":0},0,null,null,0,null,null,{"$f":"IF($I13<>\"Oui\",$F13*2,($F13+ROUND(J13*$F13/SUM(COUNTRY_INFO!$E13:$G13),0))*2)","v":0},{"$f":"IF($I13<>\"Oui\",$G13*3,($G13+ROUND(J13*$G13/SUM(COUNTRY_INFO!$E13:$G13),0))*3)","v":0},0,null,0]
[{"$f":"IF(INTRO!$E$43=\"Non endémique\",\" \", IF(COUNTRY_INFO!A14=0,\" \",COUNTRY_INFO!A14))","v":"NIGER"},{"$f":"IF(INTRO!$E$43=\"Non endémique\",\" \", IF(COUNTRY_INFO!B14=0,\" \",COUNTRY_INFO!B14))","v":"Agadez"},{"$f":"IF(INTRO!$E$43=\"Non endémique\",\" \", IF(COUNTRY_INFO!C14=0,\" \",COUNTRY_INFO!C14))","v":"Tchirozérine"},{"$f":"IF(INTRO!$E$43=\"Non endémique\", \"Non requis\", COUNTRY_INFO!Y14)","v":0},{"$f":"IF(OR(COUNTRY_INFO!R14=\"Inconnu\",COUNTRY_INFO!R14=\"Surveillance\",COUNTRY_INFO!R14=\"Non requis\",COUNTRY_INFO!R14=0),0,IF($D14<>0, COUNTRY_INFO!R14,0))","v":0},{"$f":"IF(OR(COUNTRY_INFO!S14=\"Inconnu\",COUNTRY_INFO!S14=\"Surveillance\",COUNTRY_INFO!S14=\"Non requis\",COUNTRY_INFO!S14=0),0,IF($D14<>0, COUNTRY_INFO!S14,0))","v":0},{"$f":"IF(OR(COUNTRY_INFO!T14=\"Inconnu\",COUNTRY_INFO!T14=\"Surveillance\",COUNTRY_INFO!T14=\"Non requis\",COUNTRY_INFO!T14=0),0,IF($D14<>0, COUNTRY_INFO!T14,0))","v":0},0,null,null,0,null,null,{"$f":"IF($I14<>\"Oui\",$F14*2,($F14+ROUND(J14*$F14/SUM(COUNTRY_INFO!$E14:$G14),0))*2)","v":0},{"$f":"IF($I14<>\"Oui\",$G14*3,($G14+ROUND(J14*$G14/SUM(COUNTRY_INFO!$E14:$G14),0))*3)","v":0},0,null,0]
[{"$f":"IF(INTRO!$E$43=\"Non endémique\",\" \", IF(COUNTRY_INFO!A15=0,\" \",COUNTRY_INFO!A15))","v":"NIGER"},{"$f":"IF(INTRO!$E$43=\"Non endémique\",\" \", IF(COUNTRY_INFO!B15=0,\" \",COUNTRY_INFO!B15))","v":"Agadez"},{"$f":"IF(INTRO!$E$43=\"Non endémique\",\" \", IF(COUNTRY_INFO!C15=0,\" \",COUNTRY_INFO!C15))","v":"Aderbissinat"},{"$f":"IF(INTRO!$E$43=\"Non endémique\", \"Non requis\", COUNTRY_INFO!Y15)","v":0},{"$f":"IF(OR(COUNTRY_INFO!R15=\"Inconnu\",COUNTRY_INFO!R15=\"Surveillance\",COUNTRY_INFO!R15=\"Non requis\",COUNTRY_INFO!R15=0),0,IF($D15<>0, COUNTRY_INFO!R15,0))","v":0},{"$f":"IF(OR(COUNTRY_INFO!S15=\"Inconnu\",COUNTRY_INFO!S15=\"Surveillance\",COUNTRY_INFO!S15=\"Non requis\",COUNTRY_INFO!S15=0),0,IF($D15<>0, COUNTRY_INFO!S15,0))","v":0},{"$f":"IF(OR(COUNTRY_INFO!T15=\"Inconnu\",COUNTRY_INFO!T15=\"Surveillance\",COUNTRY_INFO!T15=\"Non requis\",COUNTRY_INFO!T15=0),0,IF($D15<>0, COUNTRY_INFO!T15,0))","v":0},0,null,null,0,null,null,{"$f":"IF($I15<>\"Oui\",$F15*2,($F15+ROUND(J15*$F15/SUM(COUNTRY_INFO!$E15:$G15),0))*2)","v":0},{"$f":"IF($I15<>\"Oui\",$G15*3,($G15+ROUND(J15*$G15/SUM(COUNTRY_INFO!$E15:$G15),0))*3)","v":0},0,null,0]
[{"$f":"IF(INTRO!$E$43=\"Non endémique\",\" \", IF(COUNTRY_INFO!A16=0,\" \",COUNTRY_INFO!A16))","v":"NIGER"},{"$f":"IF(INTRO!$E$43=\"Non endémique\",\" \", IF(COUNTRY_INFO!B16=0,\" \",COUNTRY_INFO!B16))","v":"Agadez"},{"$f":"IF(INTRO!$E$43=\"Non endémique\",\" \", IF(COUNTRY_INFO!C16=0,\" \",COUNTRY_INFO!C16))","v":"Ingall"},{"$f":"IF(INTRO!$E$43=\"Non endémique\", \"Non requis\", COUNTRY_INFO!Y16)","v":0},{"$f":"IF(OR(COUNTRY_INFO!R16=\"Inconnu\",COUNTRY_INFO!R16=\"Surveillance\",COUNTRY_INFO!R16=\"Non requis\",COUNTRY_INFO!R16=0),0,IF($D16<>0, COUNTRY_INFO!R16,0))","v":0},{"$f":"IF(OR(COUNTRY_INFO!S16=\"Inconnu\",COUNTRY_INFO!S16=\"Surveillance\",COUNTRY_INFO!S16=\"Non requis\",COUNTRY_INFO!S16=0),0,IF($D16<>0, COUNTRY_INFO!S16,0))","v":0},{"$f":"IF(OR(COUNTRY_INFO!T16=\"Inconnu\",COUNTRY_INFO!T16=\"Surveillance\",COUNTRY_INFO!T16=\"Non requis\",COUNTRY_INFO!T16=0),0,IF($D16<>0, COUNTRY_INFO!T16,0))","v":0},0,null,null,0,null,null,{"$f":"IF($I16<>\"Oui\",$F16*2,($F16+ROUND(J16*$F16/SUM(COUNTRY_INFO!$E16:$G16),0))*2)","v":0},{"$f":"IF($I16<>\"Oui\",$G16*3,($G16+ROUND(J16*$G16/SUM(COUNTRY_INFO!$E16:$G16),0))*3)","v":0},0,null,0]
[{"$f":"IF(INTRO!$E$43=\"Non endémique\",\" \", IF(COUNTRY_INFO!A17=0,\" \",COUNTRY_INFO!A17))","v":"NIGER"},{"$f":"IF(INTRO!$E$43=\"Non endémique\",\" \", IF(COUNTRY_INFO!B17=0,\" \",COUNTRY_INFO!B17))","v":"Diffa"},{"$f":"IF(INTRO!$E$43=\"Non endémique\",\" \", IF(COUNTRY_INFO!C17=0,\" \",COUNTRY_INFO!C17))","v":"Diffa"},{"$f":"IF(INTRO!$E$43=\"Non endémique\", \"Non requis\", COUNTRY_INFO!Y17)","v":1},0,26042.500460161958,43404.167433603267,69446.667893765232,null,null,1,"EAS et Adultes",null,{"$f":"IF($I17<>\"Oui\",$F17*2,($F17+ROUND(J17*$F17/SUM(COUNTRY_INFO!$E17:$G17),0))*2)","v":52085.000920323917},{"$f":"IF($I17<>\"Oui\",$G17*3,($G17+ROUND(J17*$G17/SUM(COUNTRY_INFO!$E17:$G17),0))*3)","v":130212.50230080981},182297.50322113372,null,182297.50322113372]
[{"$f":"IF(INTRO!$E$43=\"Non endémique\",\" \", IF(COUNTRY_INFO!A18=0,\" \",COUNTRY_INFO!A18))","v":"NIGER"},{"$f":"IF(INTRO!$E$43=\"Non endémique\",\" \", IF(COUNTRY_INFO!B18=0,\" \",COUNTRY_INFO!B18))","v":"Diffa"},{"$f":"IF(INTRO!$E$43=\"Non endémique\",\" \", IF(COUNTRY_INFO!C18=0,\" \",COUNTRY_INFO!C18))","v":"Bosso"},{"$f":"IF(INTRO!$E$43=\"Non endémique\", \"Non requis\", COUNTRY_INFO!Y18)","v":1},0,23521.185698600322,39201.976164333872,62723.161862934197,null,null,1,"EAS et Adultes",null,{"$f":"IF($I18<>\"Oui\",$F18*2,($F18+ROUND(J18*$F18/SUM(COUNTRY_INFO!$E18:$G18),0))*2)","v":47042.371397200644},{"$f":"IF($I18<>\"Oui\",$G18*3,($G18+ROUND(J18*$G18/SUM(COUNTRY_INFO!$E18:$G18),0))*3)","v":117605.92849300161},164648.29989020227,null,164648.29989020227]
[{"$f":"IF(INTRO!$E$43=\"Non endémique\",\" \", IF(COUNTRY_INFO!A19=0,\" \",COUNTRY_INFO!A19))","v":"NIGER"},{"$f":"IF(INTRO!$E$43=\"Non endémique\",\" \", IF(COUNTRY_INFO!B19=0,\" \",COUNTRY_INFO!B19))","v":"Diffa"},{"$f":"IF(INTRO!$E$43=\"Non endémique\",\" \", IF(COUNTRY_INFO!C19=0,\" \",COUNTRY_INFO!C19))","v":"Mainé Soroa"},{"$f":"IF(INTRO!$E$43=\"Non endémique\", \"Non requis\", COUNTRY_INFO!Y19)","v":1},0,28219.44467440412,47032.407790673533,75251.852465077653,null,null,1,"EAS et Adultes",null,{"$f":"IF($I19<>\"Oui\",$F19*2,($F19+ROUND(J19*$F19/SUM(COUNTRY_INFO!$E19:$G19),0))*2)","v":56438.889348808239},{"$f":"IF($I19<>\"Oui\",$G19*3,($G19+ROUND(J19*$G19/SUM(COUNTRY_INFO!$E19:$G19),0))*3)","v":141097.22337202058},197536.11272082882,null,197536.11272082882]
[{"$f":"IF(INTRO!$E$43=\"Non endémique\",\" \", IF(COUNTRY_INFO!A20=0,\" \",COUNTRY_INFO!A20))","v":"NIGER"},{"$f":"IF(INTRO!$E$43=\"Non endémique\",\" \", IF(COUNTRY_INFO!B20=0,\" \",COUNTRY_INFO!B20))","v":"Diffa"},{"$f":"IF(INTRO!$E$43=\"Non endémique\",\" \", IF(COUNTRY_INFO!C20=0,\" \",COUNTRY_INFO!C20))","v":"Goudoumaria"},{"$f":"IF(INTRO!$E$43=\"Non endémique\", \"Non requis\", COUNTRY_INFO!Y20)","v":1},0,14613.36638050554,24355.6106341759,38968.977014681441,null,null,1,"EAS et Adultes",null,{"$f":"IF($I20<>\"Oui\",$F20*2,($F20+ROUND(J20*$F20/SUM(COUNTRY_INFO!$E20:$G20),0))*2)","v":29226.732761011081},{"$f":"IF($I20<>\"Oui\",$G20*3,($G20+ROUND(J20*$G20/SUM(COUNTRY_INFO!$E20:$G20),0))*3)","v":73066.831902527701},102293.56466353878,null,102293.56466353878]
[{"$f":"IF(INTRO!$E$43=\"Non endémique\",\" \", IF(COUNTRY_INFO!A21=0,\" \",COUNTRY_INFO!A21))","v":"NIGER"},{"$f":"IF(INTRO!$E$43=\"Non endémique\",\" \", IF(COUNTRY_INFO!B21=0,\" \",COUNTRY_INFO!B21))","v":"Diffa"},{"$f":"IF(INTRO!$E$43=\"Non endémique\",\" \", IF(COUNTRY_INFO!C21=0,\" \",COUNTRY_INFO!C21))","v":"N'Guigmi"},{"$f":"IF(INTRO!$E$43=\"Non endémique\", \"Non requis\", COUNTRY_INFO!Y21)","v":1},0,7985.2372251169672,13308.728708528279,21293.965933645246,null,null,1,"EAS et Adultes",null,{"$f":"IF($I21<>\"Oui\",$F21*2,($F21+ROUND(J21*$F21/SUM(COUNTRY_INFO!$E21:$G21),0))*2)","v":15970.474450233934},{"$f":"IF($I21<>\"Oui\",$G21*3,($G21+ROUND(J21*$G21/SUM(COUNTRY_INFO!$E21:$G21),0))*3)","v":39926.186125584834},55896.660575818765,null,55896.660575818765]
[{"$f":"IF(INTRO!$E$43=\"Non endémique\",\" \", IF(COUNTRY_INFO!A22=0,\" \",COUNTRY_INFO!A22))","v":"NIGER"},{"$f":"IF(INTRO!$E$43=\"Non endémique\",\" \", IF(COUNTRY_INFO!B22=0,\" \",COUNTRY_INFO!B22))","v":"Diffa"},{"$f":"IF(INTRO!$E$43=\"Non endémique\",\" \", IF(COUNTRY_INFO!C22=0,\" \",COUNTRY_INFO!C22))","v":"N'Gourti"},{"$f":"IF(INTRO!$E$43=\"Non endémique\", \"Non requis\", COUNTRY_INFO!Y22)","v":0},{"$f":"IF(OR(COUNTRY_INFO!R22=\"Inconnu\",COUNTRY_INFO!R22=\"Surveillance\",COUNTRY_INFO!R22=\"Non requis\",COUNTRY_INFO!R22=0),0,IF($D22<>0, COUNTRY_INFO!R22,0))","v":0},{"$f":"IF(OR(COUNTRY_INFO!S22=\"Inconnu\",COUNTRY_INFO!S22=\"Surveillance\",COUNTRY_INFO!S22=\"Non requis\",COUNTRY_INFO!S22=0),0,IF($D22<>0, COUNTRY_INFO!S22,0))","v":0},{"$f":"IF(OR(COUNTRY_INFO!T22=\"Inconnu\",COUNTRY_INFO!T22=\"Surveillance\",COUNTRY_INFO!T22=\"Non requis\",COUNTRY_INFO!T22=0),0,IF($D22<>0, COUNTRY_INFO!T22,0))","v":0},0,null,null,0,null,null,{"$f":"IF($I22<>\"Oui\",$F22*2,($F22+ROUND(J22*$F22/SUM(COUNTRY_INFO!$E22:$G22),0))*2)","v":0},{"$f":"IF($I22<>\"Oui\",$G22*3,($G22+ROUND(J22*$G22/SUM(COUNTRY_INFO!$E22:$G22),0))*3)","v":0},0,null,0]
[{"$f":"IF(INTRO!$E$43=\"Non endémique\",\" \", IF(COUNTRY_INFO!A23=0,\" \",COUNTRY_INFO!A23))","v":"NIGER"},{"$f":"IF(INTRO!$E$43=\"Non endémique\",\" \", IF(COUNTRY_INFO!B23=0,\" \",COUNTRY_INFO!B23))","v":"Dosso"},{"$f":"IF(INTRO!$E$43=\"Non endémique\",\" \", IF(COUNTRY_INFO!C23=0,\" \",COUNTRY_INFO!C23))","v":"Boboye"},{"$f":"IF(INTRO!$E$43=\"Non endémique\", \"Non requis\", COUNTRY_INFO!Y23)","v":1},0,85716.155262954446,142860.25877159074,228576.41403454519,null,null,1,"EAS et Adultes",null,{"$f":"IF($I23<>\"Oui\",$F23*2,($F23+ROUND(J23*$F23/SUM(COUNTRY_INFO!$E23:$G23),0))*2)","v":171432.31052590889},{"$f":"IF($I23<>\"Oui\",$G23*3,($G23+ROUND(J23*$G23/SUM(COUNTRY_INFO!$E23:$G23),0))*3)","v":428580.7763147722},600013.08684068103,null,600013.08684068103]
[{"$f":"IF(INTRO!$E$43=\"Non endémique\",\" \", IF(COUNTRY_INFO!A24=0,\" \",COUNTRY_INFO!A24))","v":"NIGER"},{"$f":"IF(INTRO!$E$43=\"Non endémique\",\" \", IF(COUNTRY_INFO!B24=0,\" \",COUNTRY_INFO!B24))","v":"Dosso"},{"$f":"IF(INTRO!$E$43=\"Non endémique\",\" \", IF(COUNTRY_INFO!C24=0,\" \",COUNTRY_INFO!C24))","v":"Falmey"},{"$f":"IF(INTRO!$E$43=\"Non endémique\", \"Non requis\", COUNTRY_INFO!Y24)","v":1},0,43913.021849407545,73188.369749012578,117101.39159842013,null,null,1,"EAS et Adultes",null,{"$f":"IF($I24<>\"Oui\",$F24*2,($F24+ROUND(J24*$F24/SUM(COUNTRY_INFO!$E24:$G24),0))*2)","v":87826.04369881509},{"$f":"IF($I24<>\"Oui\",$G24*3,($G24+ROUND(J24*$G24/SUM(COUNTRY_INFO!$E24:$G24),0))*3)","v":219565.10924703773},307391.15294585284,null,307391.15294585284]
[{"$f":"IF(INTRO!$E$43=\"Non endémique\",\" \", IF(COUNTRY_INFO!A25=0,\" \",COUNTRY_INFO!A25))","v":"NIGER"},{"$f":"IF(INTRO!$E$43=\"Non endémique\",\" \", IF(COUNTRY_INFO!B25=0,\" \",COUNTRY_INFO!B25))","v":"Dosso"},{"$f":"IF(INTRO!$E$43=\"Non endémique\",\" \", IF(COUNTRY_INFO!C25=0,\" \",COUNTRY_INFO!C25))","v":"Dosso"},{"$f":"IF(INTRO!$E$43=\"Non endémique\", \"Non requis\", COUNTRY_INFO!Y25)","v":0},{"$f":"IF(OR(COUNTRY_INFO!R25=\"Inconnu\",COUNTRY_INFO!R25=\"Surveillance\",COUNTRY_INFO!R25=\"Non requis\",COUNTRY_INFO!R25=0),0,IF($D25<>0, COUNTRY_INFO!R25,0))","v":0},{"$f":"IF(OR(COUNTRY_INFO!S25=\"Inconnu\",COUNTRY_INFO!S25=\"Surveillance\",COUNTRY_INFO!S25=\"Non requis\",COUNTRY_INFO!S25=0),0,IF($D25<>0, COUNTRY_INFO!S25,0))","v":0},{"$f":"IF(OR(COUNTRY_INFO!T25=\"Inconnu\",COUNTRY_INFO!T25=\"Surveillance\",COUNTRY_INFO!T25=\"Non requis\",COUNTRY_INFO!T25=0),0,IF($D25<>0, COUNTRY_INFO!T25,0))","v":0},0,null,null,0,null,null,{"$f":"IF($I25<>\"Oui\",$F25*2,($F25+ROUND(J25*$F25/SUM(COUNTRY_INFO!$E25:$G25),0))*2)","v":0},{"$f":"IF($I25<>\"Oui\",$G25*3,($G25+ROUND(J25*$G25/SUM(COUNTRY_INFO!$E25:$G25),0))*3)","v":0},0,null,0]
[{"$f":"IF(INTRO!$E$43=\"Non endémique\",\" \", IF(COUNTRY_INFO!A26=0,\" \",COUNTRY_INFO!A26))","v":"NIGER"},{"$f":"IF(INTRO!$E$43=\"Non endémique\",\" \", IF(COUNTRY_INFO!B26=0,\" \",COUNTRY_INFO!B26))","v":"Dosso"},{"$f":"IF(INTRO!$E$43=\"Non endémique\",\" \", IF(COUNTRY_INFO!C26=0,\" \",COUNTRY_INFO!C26))","v":"Doutchi"},{"$f":"IF(INTRO!$E$43=\"Non endémique\", \"Non requis\", COUNTRY_INFO!Y26)","v":1},0,106143.61293707049,176906.02156178415,283049.63449885463,null,null,1,"EAS et Adultes",null,{"$f":"IF($I26<>\"Oui\",$F26*2,($F26+ROUND(J26*$F26/SUM(COUNTRY_INFO!$E26:$G26),0))*2)","v":212287.22587414098},{"$f":"IF($I26<>\"Oui\",$G26*3,($G26+ROUND(J26*$G26/SUM(COUNTRY_INFO!$E26:$G26),0))*3)","v":530718.06468535238},743005.29055949335,null,743005.29055949335]
[{"$f":"IF(INTRO!$E$43=\"Non endémique\",\" \", IF(COUNTRY_INFO!A27=0,\" \",COUNTRY_INFO!A27))","v":"NIGER"},{"$f":"IF(INTRO!$E$43=\"Non endémique\",\" \", IF(COUNTRY_INFO!B27=0,\" \",COUNTRY_INFO!B27))","v":"Dosso"},{"$f":"IF(INTRO!$E$43=\"Non endémique\",\" \", IF(COUNTRY_INFO!C27=0,\" \",COUNTRY_INFO!C27))","v":"Tibiri(Doutchi)"},{"$f":"IF(INTRO!$E$43=\"Non endémique\", \"Non requis\", COUNTRY_INFO!Y27)","v":1},0,68806.860374492186,114678.10062415365,183484.96099864584,null,null,1,"EAS et Adultes",null,{"$f":"IF($I27<>\"Oui\",$F27*2,($F27+ROUND(J27*$F27/SUM(COUNTRY_INFO!$E27:$G27),0))*2)","v":137613.72074898437},{"$f":"IF($I27<>\"Oui\",$G27*3,($G27+ROUND(J27*$G27/SUM(COUNTRY_INFO!$E27:$G27),0))*3)","v":344034.30187246099},481648.02262144536,null,481648.02262144536]
[{"$f":"IF(INTRO!$E$43=\"Non endémique\",\" \", IF(COUNTRY_INFO!A28=0,\" \",COUNTRY_INFO!A28))","v":"NIGER"},{"$f":"IF(INTRO!$E$43=\"Non endémique\",\" \", IF(COUNTRY_INFO!B28=0,\" \",COUNTRY_INFO!B28))","v":"Dosso"},{"$f":"IF(INTRO!$E$43=\"Non endémique\",\" \", IF(COUNTRY_INFO!C28=0,\" \",COUNTRY_INFO!C28))","v":"Gaya"},{"$f":"IF(INTRO!$E$43=\"Non endémique\", \"Non requis\", COUNTRY_INFO!Y28)","v":1},0,111436.96588369967,185728.27647283283,297165.24235653249,null,null,1,"EAS et Adultes",null,{"$f":"IF($I28<>\"Oui\",$F28*2,($F28+ROUND(J28*$F28/SUM(COUNTRY_INFO!$E28:$G28),0))*2)","v":222873.93176739934},{"$f":"IF($I28<>\"Oui\",$G28*3,($G28+ROUND(J28*$G28/SUM(COUNTRY_INFO!$E28:$G28),0))*3)","v":557184.82941849856},780058.76118589786,null,780058.76118589786]
[{"$f":"IF(INTRO!$E$43=\"Non endémique\",\" \", IF(COUNTRY_INFO!A29=0,\" \",COUNTRY_INFO!A29))","v":"NIGER"},{"$f":"IF(INTRO!$E$43=\"Non endémique\",\" \", IF(COUNTRY_INFO!B29=0,\" \",COUNTRY_INFO!B29))","v":"Dosso"},{"$f":"IF(INTRO!$E$43=\"Non endémique\",\" \", IF(COUNTRY_INFO!C29=0,\" \",COUNTRY_INFO!C29))","v":"Dioundiou"},{"$f":"IF(INTRO!$E$43=\"Non endémique\", \"Non requis\", COUNTRY_INFO!Y29)","v":1},0,40413.852430932973,67356.42071822162,107770.27314915459,null,null,1,"EAS et Adultes",null,{"$f":"IF($I29<>\"Oui\",$F29*2,($F29+ROUND(J29*$F29/SUM(COUNTRY_INFO!$E29:$G29),0))*2)","v":80827.704861865946},{"$f":"IF($I29<>\"Oui\",$G29*3,($G29+ROUND(J29*$G29/SUM(COUNTRY_INFO!$E29:$G29),0))*3)","v":202069.26215466484},282896.96701653081,null,282896.96701653081]
[{"$f":"IF(INTRO!$E$43=\"Non endémique\",\" \", IF(COUNTRY_INFO!A30=0,\" \",COUNTRY_INFO!A30))","v":"NIGER"},{"$f":"IF(INTRO!$E$43=\"Non endémique\",\" \", IF(COUNTRY_INFO!B30=0,\" \",COUNTRY_INFO!B30))","v":"Dosso"},{"$f":"IF(INTRO!$E$43=\"Non endémique\",\" \", IF(COUNTRY_INFO!C30=0,\" \",COUNTRY_INFO!C30))","v":"Loga"},{"$f":"IF(INTRO!$E$43=\"Non endémique\", \"Non requis\", COUNTRY_INFO!Y30)","v":1},0,37467.512571824445,62445.85428637408,99913.366858198526,null,null,1,"EAS et Adultes",null,{"$f":"IF($I30<>\"Oui\",$F30*2,($F30+ROUND(J30*$F30/SUM(COUNTRY_INFO!$E30:$G30),0))*2)","v":74935.025143648891},{"$f":"IF($I30<>\"Oui\",$G30*3,($G30+ROUND(J30*$G30/SUM(COUNTRY_INFO!$E30:$G30),0))*3)","v":187337.56285912223},262272.58800277114,null,262272.58800277114]
[{"$f":"IF(INTRO!$E$43=\"Non endémique\",\" \", IF(COUNTRY_INFO!A31=0,\" \",COUNTRY_INFO!A31))","v":"NIGER"},{"$f":"IF(INTRO!$E$43=\"Non endémique\",\" \", IF(COUNTRY_INFO!B31=0,\" \",COUNTRY_INFO!B31))","v":"Maradi"},{"$f":"IF(INTRO!$E$43=\"Non endémique\",\" \", IF(COUNTRY_INFO!C31=0,\" \",COUNTRY_INFO!C31))","v":"Aguié"},{"$f":"IF(INTRO!$E$43=\"Non endémique\", \"Non requis\", COUNTRY_INFO!Y31)","v":0},{"$f":"IF(OR(COUNTRY_INFO!R31=\"Inconnu\",COUNTRY_INFO!R31=\"Surveillance\",COUNTRY_INFO!R31=\"Non requis\",COUNTRY_INFO!R31=0),0,IF($D31<>0, COUNTRY_INFO!R31,0))","v":0},{"$f":"IF(OR(COUNTRY_INFO!S31=\"Inconnu\",COUNTRY_INFO!S31=\"Surveillance\",COUNTRY_INFO!S31=\"Non requis\",COUNTRY_INFO!S31=0),0,IF($D31<>0, COUNTRY_INFO!S31,0))","v":0},{"$f":"IF(OR(COUNTRY_INFO!T31=\"Inconnu\",COUNTRY_INFO!T31=\"Surveillance\",COUNTRY_INFO!T31=\"Non requis\",COUNTRY_INFO!T31=0),0,IF($D31<>0, COUNTRY_INFO!T31,0))","v":0},0,null,null,0,null,null,{"$f":"IF($I31<>\"Oui\",$F31*2,($F31+ROUND(J31*$F31/SUM(COUNTRY_INFO!$E31:$G31),0))*2)","v":0},{"$f":"IF($I31<>\"Oui\",$G31*3,($G31+ROUND(J31*$G31/SUM(COUNTRY_INFO!$E31:$G31),0))*3)","v":0},0,null,0]
[{"$f":"IF(INTRO!$E$43=\"Non endémique\",\" \", IF(COUNTRY_INFO!A32=0,\" \",COUNTRY_INFO!A32))","v":"NIGER"},{"$f":"IF(INTRO!$E$43=\"Non endémique\",\" \", IF(COUNTRY_INFO!B32=0,\" \",COUNTRY_INFO!B32))","v":"Maradi"},{"$f":"IF(INTRO!$E$43=\"Non endémique\",\" \", IF(COUNTRY_INFO!C32=0,\" \",COUNTRY_INFO!C32))","v":"Gazaoua"},{"$f":"IF(INTRO!$E$43=\"Non endémique\", \"Non requis\", COUNTRY_INFO!Y32)","v":0},{"$f":"IF(OR(COUNTRY_INFO!R32=\"Inconnu\",COUNTRY_INFO!R32=\"Surveillance\",COUNTRY_INFO!R32=\"Non requis\",COUNTRY_INFO!R32=0),0,IF($D32<>0, COUNTRY_INFO!R32,0))","v":0},{"$f":"IF(OR(COUNTRY_INFO!S32=\"Inconnu\",COUNTRY_INFO!S32=\"Surveillance\",COUNTRY_INFO!S32=\"Non requis\",COUNTRY_INFO!S32=0),0,IF($D32<>0, COUNTRY_INFO!S32,0))","v":0},{"$f":"IF(OR(COUNTRY_INFO!T32=\"Inconnu\",COUNTRY_INFO!T32=\"Surveillance\",COUNTRY_INFO!T32=\"Non requis\",COUNTRY_INFO!T32=0),0,IF($D32<>0, COUNTRY_INFO!T32,0))","v":0},0,null,null,0,null,null,{"$f":"IF($I32<>\"Oui\",$F32*2,($F32+ROUND(J32*$F32/SUM(COUNTRY_INFO!$E32:$G32),0))*2)","v":0},{"$f":"IF($I32<>\"Oui\",$G32*3,($G32+ROUND(J32*$G32/SUM(COUNTRY_INFO!$E32:$G32),0))*3)","v":0},0,null,0]
[{"$f":"IF(INTRO!$E$43=\"Non endémique\",\" \", IF(COUNTRY_INFO!A33=0,\" \",COUNTRY_INFO!A33))","v":"NIGER"},{"$f":"IF(INTRO!$E$43=\"Non endémique\",\" \", IF(COUNTRY_INFO!B33=0,\" \",COUNTRY_INFO!B33))","v":"Maradi"},{"$f":"IF(INTRO!$E$43=\"Non endémique\",\" \", IF(COUNTRY_INFO!C33=0,\" \",COUNTRY_INFO!C33))","v":"Dakoro"},{"$f":"IF(INTRO!$E$43=\"Non endémique\", \"Non requis\", COUNTRY_INFO!Y33)","v":0},{"$f":"IF(OR(COUNTRY_INFO!R33=\"Inconnu\",COUNTRY_INFO!R33=\"Surveillance\",COUNTRY_INFO!R33=\"Non requis\",COUNTRY_INFO!R33=0),0,IF($D33<>0, COUNTRY_INFO!R33,0))","v":0},{"$f":"IF(OR(COUNTRY_INFO!S33=\"Inconnu\",COUNTRY_INFO!S33=\"Surveillance\",COUNTRY_INFO!S33=\"Non requis\",COUNTRY_INFO!S33=0),0,IF($D33<>0, COUNTRY_INFO!S33,0))","v":0},{"$f":"IF(OR(COUNTRY_INFO!T33=\"Inconnu\",COUNTRY_INFO!T33=\"Surveillance\",COUNTRY_INFO!T33=\"Non requis\",COUNTRY_INFO!T33=0),0,IF($D33<>0, COUNTRY_INFO!T33,0))","v":0},0,null,null,0,null,null,{"$f":"IF($I33<>\"Oui\",$F33*2,($F33+ROUND(J33*$F33/SUM(COUNTRY_INFO!$E33:$G33),0))*2)","v":0},{"$f":"IF($I33<>\"Oui\",$G33*3,($G33+ROUND(J33*$G33/SUM(COUNTRY_INFO!$E33:$G33),0))*3)","v":0},0,null,0]
[{"$f":"IF(INTRO!$E$43=\"Non endémique\",\" \", IF(COUNTRY_INFO!A34=0,\" \",COUNTRY_INFO!A34))","v":"NIGER"},{"$f":"IF(INTRO!$E$43=\"Non endémique\",\" \", IF(COUNTRY_INFO!B34=0,\" \",COUNTRY_INFO!B34))","v":"Maradi"},{"$f":"IF(INTRO!$E$43=\"Non endémique\",\" \", IF(COUNTRY_INFO!C34=0,\" \",COUNTRY_INFO!C34))","v":"Bermo"},{"$f":"IF(INTRO!$E$43=\"Non endémique\", \"Non requis\", COUNTRY_INFO!Y34)","v":0},{"$f":"IF(OR(COUNTRY_INFO!R34=\"Inconnu\",COUNTRY_INFO!R34=\"Surveillance\",COUNTRY_INFO!R34=\"Non requis\",COUNTRY_INFO!R34=0),0,IF($D34<>0, COUNTRY_INFO!R34,0))","v":0},{"$f":"IF(OR(COUNTRY_INFO!S34=\"Inconnu\",COUNTRY_INFO!S34=\"Surveillance\",COUNTRY_INFO!S34=\"Non requis\",COUNTRY_INFO!S34=0),0,IF($D34<>0, COUNTRY_INFO!S34,0))","v":0},{"$f":"IF(OR(COUNTRY_INFO!T34=\"Inconnu\",COUNTRY_INFO!T34=\"Surveillance\",COUNTRY_INFO!T34=\"Non requis\",COUNTRY_INFO!T34=0),0,IF($D34<>0, COUNTRY_INFO!T34,0))","v":0},0,null,null,0,null,null,{"$f":"IF($I34<>\"Oui\",$F34*2,($F34+ROUND(J34*$F34/SUM(COUNTRY_INFO!$E34:$G34),0))*2)","v":0},{"$f":"IF($I34<>\"Oui\",$G34*3,($G34+ROUND(J34*$G34/SUM(COUNTRY_INFO!$E34:$G34),0))*3)","v":0},0,null,0]
[{"$f":"IF(INTRO!$E$43=\"Non endémique\",\" \", IF(COUNTRY_INFO!A35=0,\" \",COUNTRY_INFO!A35))","v":"NIGER"},{"$f":"IF(INTRO!$E$43=\"Non endémique\",\" \", IF(COUNTRY_INFO!B35=0,\" \",COUNTRY_INFO!B35))","v":"Maradi"},{"$f":"IF(INTRO!$E$43=\"Non endémique\",\" \", IF(COUNTRY_INFO!C35=0,\" \",COUNTRY_INFO!C35))","v":"Guidan Roumdji"},{"$f":"IF(INTRO!$E$43=\"Non endémique\", \"Non requis\", COUNTRY_INFO!Y35)","v":0},{"$f":"IF(OR(COUNTRY_INFO!R35=\"Inconnu\",COUNTRY_INFO!R35=\"Surveillance\",COUNTRY_INFO!R35=\"Non requis\",COUNTRY_INFO!R35=0),0,IF($D35<>0, COUNTRY_INFO!R35,0))","v":0},{"$f":"IF(OR(COUNTRY_INFO!S35=\"Inconnu\",COUNTRY_INFO!S35=\"Surveillance\",COUNTRY_INFO!S35=\"Non requis\",COUNTRY_INFO!S35=0),0,IF($D35<>0, COUNTRY_INFO!S35,0))","v":0},{"$f":"IF(OR(COUNTRY_INFO!T35=\"Inconnu\",COUNTRY_INFO!T35=\"Surveillance\",COUNTRY_INFO!T35=\"Non requis\",COUNTRY_INFO!T35=0),0,IF($D35<>0, COUNTRY_INFO!T35,0))","v":0},0,null,null,0,null,null,{"$f":"IF($I35<>\"Oui\",$F35*2,($F35+ROUND(J35*$F35/SUM(COUNTRY_INFO!$E35:$G35),0))*2)","v":0},{"$f":"IF($I35<>\"Oui\",$G35*3,($G35+ROUND(J35*$G35/SUM(COUNTRY_INFO!$E35:$G35),0))*3)","v":0},0,null,0]
[{"$f":"IF(INTRO!$E$43=\"Non endémique\",\" \", IF(COUNTRY_INFO!A36=0,\" \",COUNTRY_INFO!A36))","v":"NIGER"},{"$f":"IF(INTRO!$E$43=\"Non endémique\",\" \", IF(COUNTRY_INFO!B36=0,\" \",COUNTRY_INFO!B36))","v":"Maradi"},{"$f":"IF(INTRO!$E$43=\"Non endémique\",\" \", IF(COUNTRY_INFO!C36=0,\" \",COUNTRY_INFO!C36))","v":"Madarounfa"},{"$f":"IF(INTRO!$E$43=\"Non endémique\", \"Non requis\", COUNTRY_INFO!Y36)","v":0},{"$f":"IF(OR(COUNTRY_INFO!R36=\"Inconnu\",COUNTRY_INFO!R36=\"Surveillance\",COUNTRY_INFO!R36=\"Non requis\",COUNTRY_INFO!R36=0),0,IF($D36<>0, COUNTRY_INFO!R36,0))","v":0},{"$f":"IF(OR(COUNTRY_INFO!S36=\"Inconnu\",COUNTRY_INFO!S36=\"Surveillance\",COUNTRY_INFO!S36=\"Non requis\",COUNTRY_INFO!S36=0),0,IF($D36<>0, COUNTRY_INFO!S36,0))","v":0},{"$f":"IF(OR(COUNTRY_INFO!T36=\"Inconnu\",COUNTRY_INFO!T36=\"Surveillance\",COUNTRY_INFO!T36=\"Non requis\",COUNTRY_INFO!T36=0),0,IF($D36<>0, COUNTRY_INFO!T36,0))","v":0},0,null,null,0,null,null,{"$f":"IF($I36<>\"Oui\",$F36*2,($F36+ROUND(J36*$F36/SUM(COUNTRY_INFO!$E36:$G36),0))*2)","v":0},{"$f":"IF($I36<>\"Oui\",$G36*3,($G36+ROUND(J36*$G36/SUM(COUNTRY_INFO!$E36:$G36),0))*3)","v":0},0,null,0]
[{"$f":"IF(INTRO!$E$43=\"Non endémique\",\" \", IF(COUNTRY_INFO!A37=0,\" \",COUNTRY_INFO!A37))","v":"NIGER"},{"$f":"IF(INTRO!$E$43=\"Non endémique\",\" \", IF(COUNTRY_INFO!B37=0,\" \",COUNTRY_INFO!B37))","v":"Maradi"},{"$f":"IF(INTRO!$E$43=\"Non endémique\",\" \", IF(COUNTRY_INFO!C37=0,\" \",COUNTRY_INFO!C37))","v":"Maradi"},{"$f":"IF(INTRO!$E$43=\"Non endémique\", \"Non requis\", COUNTRY_INFO!Y37)","v":0},{"$f":"IF(OR(COUNTRY_INFO!R37=\"Inconnu\",COUNTRY_INFO!R37=\"Surveillance\",COUNTRY_INFO!R37=\"Non requis\",COUNTRY_INFO!R37=0),0,IF($D37<>0, COUNTRY_INFO!R37,0))","v":0},{"$f":"IF(OR(COUNTRY_INFO!S37=\"Inconnu\",COUNTRY_INFO!S37=\"Surveillance\",COUNTRY_INFO!S37=\"Non requis\",COUNTRY_INFO!S37=0),0,IF($D37<>0, COUNTRY_INFO!S37,0))","v":0},{"$f":"IF(OR(COUNTRY_INFO!T37=\"Inconnu\",COUNTRY_INFO!T37=\"Surveillance\",COUNTRY_INFO!T37=\"Non requis\",COUNTRY_INFO!T37=0),0,IF($D37<>0, COUNTRY_INFO!T37,0))","v":0},0,null,null,0,null,null,{"$f":"IF($I37<>\"Oui\",$F37*2,($F37+ROUND(J37*$F37/SUM(COUNTRY_INFO!$E37:$G37),0))*2)","v":0},{"$f":"IF($I37<>\"Oui\",$G37*3,($G37+ROUND(J37*$G37/SUM(COUNTRY_INFO!$E37:$G37),0))*3)","v":0},0,null,0]
[{"$f":"IF(INTRO!$E$43=\"Non endémique\",\" \", IF(COUNTRY_INFO!A38=0,\" \",COUNTRY_INFO!A38))","v":"NIGER"},{"$f":"IF(INTRO!$E$43=\"Non endémique\",\" \", IF(COUNTRY_INFO!B38=0,\" \",COUNTRY_INFO!B38))","v":"Maradi"},{"$f":"IF(INTRO!$E$43=\"Non endémique\",\" \", IF(COUNTRY_INFO!C38=0,\" \",COUNTRY_INFO!C38))","v":"Mayahi"},{"$f":"IF(INTRO!$E$43=\"Non endémique\", \"Non requis\", COUNTRY_INFO!Y38)","v":0},{"$f":"IF(OR(COUNTRY_INFO!R38=\"Inconnu\",COUNTRY_INFO!R38=\"Surveillance\",COUNTRY_INFO!R38=\"Non requis\",COUNTRY_INFO!R38=0),0,IF($D38<>0, COUNTRY_INFO!R38,0))","v":0},{"$f":"IF(OR(COUNTRY_INFO!S38=\"Inconnu\",COUNTRY_INFO!S38=\"Surveillance\",COUNTRY_INFO!S38=\"Non requis\",COUNTRY_INFO!S38=0),0,IF($D38<>0, COUNTRY_INFO!S38,0))","v":0},{"$f":"IF(OR(COUNTRY_INFO!T38=\"Inconnu\",COUNTRY_INFO!T38=\"Surveillance\",COUNTRY_INFO!T38=\"Non requis\",COUNTRY_INFO!T38=0),0,IF($D38<>0, COUNTRY_INFO!T38,0))","v":0},0,null,null,0,null,null,{"$f":"IF($I38<>\"Oui\",$F38*2,($F38+ROUND(J38*$F38/SUM(COUNTRY_INFO!$E38:$G38),0))*2)","v":0},{"$f":"IF($I38<>\"Oui\",$G38*3,($G38+ROUND(J38*$G38/SUM(COUNTRY_INFO!$E38:$G38),0))*3)","v":0},0,null,0]
[{"$f":"IF(INTRO!$E$43=\"Non endémique\",\" \", IF(COUNTRY_INFO!A39=0,\" \",COUNTRY_INFO!A39))","v":"NIGER"},{"$f":"IF(INTRO!$E$43=\"Non endémique\",\" \", IF(COUNTRY_INFO!B39=0,\" \",COUNTRY_INFO!B39))","v":"Maradi"},{"$f":"IF(INTRO!$E$43=\"Non endémique\",\" \", IF(COUNTRY_INFO!C39=0,\" \",COUNTRY_INFO!C39))","v":"Tessaoua"},{"$f":"IF(INTRO!$E$43=\"Non endémique\", \"Non requis\", COUNTRY_INFO!Y39)","v":1},0,95675.747324338387,159459.57887389732,255135.32619823571,null,null,1,"EAS et Adultes",null,{"$f":"IF($I39<>\"Oui\",$F39*2,($F39+ROUND(J39*$F39/SUM(COUNTRY_INFO!$E39:$G39),0))*2)","v":191351.49464867677},{"$f":"IF($I39<>\"Oui\",$G39*3,($G39+ROUND(J39*$G39/SUM(COUNTRY_INFO!$E39:$G39),0))*3)","v":478378.73662169196},669730.23127036868,null,669730.23127036868]
[{"$f":"IF(INTRO!$E$43=\"Non endémique\",\" \", IF(COUNTRY_INFO!A40=0,\" \",COUNTRY_INFO!A40))","v":"NIGER"},{"$f":"IF(INTRO!$E$43=\"Non endémique\",\" \", IF(COUNTRY_INFO!B40=0,\" \",COUNTRY_INFO!B40))","v":"Niamey"},{"$f":"IF(INTRO!$E$43=\"Non endémique\",\" \", IF(COUNTRY_INFO!C40=0,\" \",COUNTRY_INFO!C40))","v":"Niamey 1"},{"$f":"IF(INTRO!$E$43=\"Non endémique\", \"Non requis\", COUNTRY_INFO!Y40)","v":1},0,57316.312900700585,95527.188167834305,152843.50106853488,null,null,1,"EAS et Adultes",null,{"$f":"IF($I40<>\"Oui\",$F40*2,($F40+ROUND(J40*$F40/SUM(COUNTRY_INFO!$E40:$G40),0))*2)","v":114632.62580140117},{"$f":"IF($I40<>\"Oui\",$G40*3,($G40+ROUND(J40*$G40/SUM(COUNTRY_INFO!$E40:$G40),0))*3)","v":286581.56450350292},401214.19030490407,null,401214.19030490407]
[{"$f":"IF(INTRO!$E$43=\"Non endémique\",\" \", IF(COUNTRY_INFO!A41=0,\" \",COUNTRY_INFO!A41))","v":"NIGER"},{"$f":"IF(INTRO!$E$43=\"Non endémique\",\" \", IF(COUNTRY_INFO!B41=0,\" \",COUNTRY_INFO!B41))","v":"Niamey"},{"$f":"IF(INTRO!$E$43=\"Non endémique\",\" \", IF(COUNTRY_INFO!C41=0,\" \",COUNTRY_INFO!C41))","v":"Niamey 2"},{"$f":"IF(INTRO!$E$43=\"Non endémique\", \"Non requis\", COUNTRY_INFO!Y41)","v":1},0,29171.652620027286,48619.4210333788,77791.073653406085,null,null,1,"EAS et Adultes",null,{"$f":"IF($I41<>\"Oui\",$F41*2,($F41+ROUND(J41*$F41/SUM(COUNTRY_INFO!$E41:$G41),0))*2)","v":58343.305240054571},{"$f":"IF($I41<>\"Oui\",$G41*3,($G41+ROUND(J41*$G41/SUM(COUNTRY_INFO!$E41:$G41),0))*3)","v":145858.26310013639},204201.56834019098,null,204201.56834019098]
[{"$f":"IF(INTRO!$E$43=\"Non endémique\",\" \", IF(COUNTRY_INFO!A42=0,\" \",COUNTRY_INFO!A42))","v":"NIGER"},{"$f":"IF(INTRO!$E$43=\"Non endémique\",\" \", IF(COUNTRY_INFO!B42=0,\" \",COUNTRY_INFO!B42))","v":"Niamey"},{"$f":"IF(INTRO!$E$43=\"Non endémique\",\" \", IF(COUNTRY_INFO!C42=0,\" \",COUNTRY_INFO!C42))","v":"Niamey 3"},{"$f":"IF(INTRO!$E$43=\"Non endémique\", \"Non requis\", COUNTRY_INFO!Y42)","v":1},0,6005.1324162381588,10008.554027063597,16013.686443301756,null,null,1,"EAS et Adultes",null,{"$f":"IF($I42<>\"Oui\",$F42*2,($F42+ROUND(J42*$F42/SUM(COUNTRY_INFO!$E42:$G42),0))*2)","v":12010.264832476318},{"$f":"IF($I42<>\"Oui\",$G42*3,($G42+ROUND(J42*$G42/SUM(COUNTRY_INFO!$E42:$G42),0))*3)","v":30025.662081190792},42035.926913667106,null,42035.926913667106]
[{"$f":"IF(INTRO!$E$43=\"Non endémique\",\" \", IF(COUNTRY_INFO!A43=0,\" \",COUNTRY_INFO!A43))","v":"NIGER"},{"$f":"IF(INTRO!$E$43=\"Non endémique\",\" \", IF(COUNTRY_INFO!B43=0,\" \",COUNTRY_INFO!B43))","v":"Niamey"},{"$f":"IF(INTRO!$E$43=\"Non endémique\",\" \", IF(COUNTRY_INFO!C43=0,\" \",COUNTRY_INFO!C43))","v":"Niamey 4"},{"$f":"IF(INTRO!$E$43=\"Non endémique\", \"Non requis\", COUNTRY_INFO!Y43)","v":1},0,61938.001897100032,103230.0031618334,165168.00505893343,null,null,1,"EAS et Adultes",null,{"$f":"IF($I43<>\"Oui\",$F43*2,($F43+ROUND(J43*$F43/SUM(COUNTRY_INFO!$E43:$G43),0))*2)","v":123876.00379420006},{"$f":"IF($I43<>\"Oui\",$G43*3,($G43+ROUND(J43*$G43/SUM(COUNTRY_INFO!$E43:$G43),0))*3)","v":309690.00948550022},433566.0132797003,null,433566.0132797003]
[{"$f":"IF(INTRO!$E$43=\"Non endémique\",\" \", IF(COUNTRY_INFO!A44=0,\" \",COUNTRY_INFO!A44))","v":"NIGER"},{"$f":"IF(INTRO!$E$43=\"Non endémique\",\" \", IF(COUNTRY_INFO!B44=0,\" \",COUNTRY_INFO!B44))","v":"Niamey"},{"$f":"IF(INTRO!$E$43=\"Non endémique\",\" \", IF(COUNTRY_INFO!C44=0,\" \",COUNTRY_INFO!C44))","v":"Niamey 5"},{"$f":"IF(INTRO!$E$43=\"Non endémique\", \"Non requis\", COUNTRY_INFO!Y44)","v":1},0,45018.397239449245,75030.662065748751,120049.059305198,null,null,1,"EAS et Adultes",null,{"$f":"IF($I44<>\"Oui\",$F44*2,($F44+ROUND(J44*$F44/SUM(COUNTRY_INFO!$E44:$G44),0))*2)","v":90036.79447889849},{"$f":"IF($I44<>\"Oui\",$G44*3,($G44+ROUND(J44*$G44/SUM(COUNTRY_INFO!$E44:$G44),0))*3)","v":225091.98619724624},315128.78067614476,null,315128.78067614476]
[{"$f":"IF(INTRO!$E$43=\"Non endémique\",\" \", IF(COUNTRY_INFO!A45=0,\" \",COUNTRY_INFO!A45))","v":"NIGER"},{"$f":"IF(INTRO!$E$43=\"Non endémique\",\" \", IF(COUNTRY_INFO!B45=0,\" \",COUNTRY_INFO!B45))","v":"Tahoua"},{"$f":"IF(INTRO!$E$43=\"Non endémique\",\" \", IF(COUNTRY_INFO!C45=0,\" \",COUNTRY_INFO!C45))","v":"Abalak"},{"$f":"IF(INTRO!$E$43=\"Non endémique\", \"Non requis\", COUNTRY_INFO!Y45)","v":1},0,105783.38056443061,176305.63427405103,282089.01483848167,null,null,1,"EAS et Adultes",null,{"$f":"IF($I45<>\"Oui\",$F45*2,($F45+ROUND(J45*$F45/SUM(COUNTRY_INFO!$E45:$G45),0))*2)","v":211566.76112886122},{"$f":"IF($I45<>\"Oui\",$G45*3,($G45+ROUND(J45*$G45/SUM(COUNTRY_INFO!$E45:$G45),0))*3)","v":528916.90282215306},740483.66395101428,null,740483.66395101428]
[{"$f":"IF(INTRO!$E$43=\"Non endémique\",\" \", IF(COUNTRY_INFO!A46=0,\" \",COUNTRY_INFO!A46))","v":"NIGER"},{"$f":"IF(INTRO!$E$43=\"Non endémique\",\" \", IF(COUNTRY_INFO!B46=0,\" \",COUNTRY_INFO!B46))","v":"Tahoua"},{"$f":"IF(INTRO!$E$43=\"Non endémique\",\" \", IF(COUNTRY_INFO!C46=0,\" \",COUNTRY_INFO!C46))","v":"Birnin' Konni"},{"$f":"IF(INTRO!$E$43=\"Non endémique\", \"Non requis\", COUNTRY_INFO!Y46)","v":0},{"$f":"IF(OR(COUNTRY_INFO!R46=\"Inconnu\",COUNTRY_INFO!R46=\"Surveillance\",COUNTRY_INFO!R46=\"Non requis\",COUNTRY_INFO!R46=0),0,IF($D46<>0, COUNTRY_INFO!R46,0))","v":0},{"$f":"IF(OR(COUNTRY_INFO!S46=\"Inconnu\",COUNTRY_INFO!S46=\"Surveillance\",COUNTRY_INFO!S46=\"Non requis\",COUNTRY_INFO!S46=0),0,IF($D46<>0, COUNTRY_INFO!S46,0))","v":0},{"$f":"IF(OR(COUNTRY_INFO!T46=\"Inconnu\",COUNTRY_INFO!T46=\"Surveillance\",COUNTRY_INFO!T46=\"Non requis\",COUNTRY_INFO!T46=0),0,IF($D46<>0, COUNTRY_INFO!T46,0))","v":0},0,null,null,0,null,null,{"$f":"IF($I46<>\"Oui\",$F46*2,($F46+ROUND(J46*$F46/SUM(COUNTRY_INFO!$E46:$G46),0))*2)","v":0},{"$f":"IF($I46<>\"Oui\",$G46*3,($G46+ROUND(J46*$G46/SUM(COUNTRY_INFO!$E46:$G46),0))*3)","v":0},0,null,0]
[{"$f":"IF(INTRO!$E$43=\"Non endémique\",\" \", IF(COUNTRY_INFO!A47=0,\" \",COUNTRY_INFO!A47))","v":"NIGER"},{"$f":"IF(INTRO!$E$43=\"Non endémique\",\" \", IF(COUNTRY_INFO!B47=0,\" \",COUNTRY_INFO!B47))","v":"Tahoua"},{"$f":"IF(INTRO!$E$43=\"Non endémique\",\" \", IF(COUNTRY_INFO!C47=0,\" \",COUNTRY_INFO!C47))","v":"Malbaza"},{"$f":"IF(INTRO!$E$43=\"Non endémique\", \"Non requis\", COUNTRY_INFO!Y47)","v":0},{"$f":"IF(OR(COUNTRY_INFO!R47=\"Inconnu\",COUNTRY_INFO!R47=\"Surveillance\",COUNTRY_INFO!R47=\"Non requis\",COUNTRY_INFO!R47=0),0,IF($D47<>0, COUNTRY_INFO!R47,0))","v":0},{"$f":"IF(OR(COUNTRY_INFO!S47=\"Inconnu\",COUNTRY_INFO!S47=\"Surveillance\",COUNTRY_INFO!S47=\"Non requis\",COUNTRY_INFO!S47=0),0,IF($D47<>0, COUNTRY_INFO!S47,0))","v":0},{"$f":"IF(OR(COUNTRY_INFO!T47=\"Inconnu\",COUNTRY_INFO!T47=\"Surveillance\",COUNTRY_INFO!T47=\"Non requis\",COUNTRY_INFO!T47=0),0,IF($D47<>0, COUNTRY_INFO!T47,0))","v":0},0,null,null,0,null,null,{"$f":"IF($I47<>\"Oui\",$F47*2,($F47+ROUND(J47*$F47/SUM(COUNTRY_INFO!$E47:$G47),0))*2)","v":0},{"$f":"IF($I47<>\"Oui\",$G47*3,($G47+ROUND(J47*$G47/SUM(COUNTRY_INFO!$E47:$G47),0))*3)","v":0},0,null,0]
[{"$f":"IF(INTRO!$E$43=\"Non endémique\",\" \", IF(COUNTRY_INFO!A48=0,\" \",COUNTRY_INFO!A48))","v":"NIGER"},{"$f":"IF(INTRO!$E$43=\"Non endémique\",\" \", IF(COUNTRY_INFO!B48=0,\" \",COUNTRY_INFO!B48))","v":"Tahoua"},{"$f":"IF(INTRO!$E$43=\"Non endémique\",\" \", IF(COUNTRY_INFO!C48=0,\" \",COUNTRY_INFO!C48))","v":"Bouza"},{"$f":"IF(INTRO!$E$43=\"Non endémique\", \"Non requis\", COUNTRY_INFO!Y48)","v":0},{"$f":"IF(OR(COUNTRY_INFO!R48=\"Inconnu\",COUNTRY_INFO!R48=\"Surveillance\",COUNTRY_INFO!R48=\"Non requis\",COUNTRY_INFO!R48=0),0,IF($D48<>0, COUNTRY_INFO!R48,0))","v":0},{"$f":"IF(OR(COUNTRY_INFO!S48=\"Inconnu\",COUNTRY_INFO!S48=\"Surveillance\",COUNTRY_INFO!S48=\"Non requis\",COUNTRY_INFO!S48=0),0,IF($D48<>0, COUNTRY_INFO!S48,0))","v":0},{"$f":"IF(OR(COUNTRY_INFO!T48=\"Inconnu\",COUNTRY_INFO!T48=\"Surveillance\",COUNTRY_INFO!T48=\"Non requis\",COUNTRY_INFO!T48=0),0,IF($D48<>0, COUNTRY_INFO!T48,0))","v":0},0,null,null,0,null,null,{"$f":"IF($I48<>\"Oui\",$F48*2,($F48+ROUND(J48*$F48/SUM(COUNTRY_INFO!$E48:$G48),0))*2)","v":0},{"$f":"IF($I48<>\"Oui\",$G48*3,($G48+ROUND(J48*$G48/SUM(COUNTRY_INFO!$E48:$G48),0))*3)","v":0},0,null,0]
[{"$f":"IF(INTRO!$E$43=\"Non endémique\",\" \", IF(COUNTRY_INFO!A49=0,\" \",COUNTRY_INFO!A49))","v":"NIGER"},{"$f":"IF(INTRO!$E$43=\"Non endémique\",\" \", IF(COUNTRY_INFO!B49=0,\" \",COUNTRY_INFO!B49))","v":"Tahoua"},{"$f":"IF(INTRO!$E$43=\"Non endémique\",\" \", IF(COUNTRY_INFO!C49=0,\" \",COUNTRY_INFO!C49))","v":"Illela"},{"$f":"IF(INTRO!$E$43=\"Non endémique\", \"Non requis\", COUNTRY_INFO!Y49)","v":0},{"$f":"IF(OR(COUNTRY_INFO!R49=\"Inconnu\",COUNTRY_INFO!R49=\"Surveillance\",COUNTRY_INFO!R49=\"Non requis\",COUNTRY_INFO!R49=0),0,IF($D49<>0, COUNTRY_INFO!R49,0))","v":0},{"$f":"IF(OR(COUNTRY_INFO!S49=\"Inconnu\",COUNTRY_INFO!S49=\"Surveillance\",COUNTRY_INFO!S49=\"Non requis\",COUNTRY_INFO!S49=0),0,IF($D49<>0, COUNTRY_INFO!S49,0))","v":0},{"$f":"IF(OR(COUNTRY_INFO!T49=\"Inconnu\",COUNTRY_INFO!T49=\"Surveillance\",COUNTRY_INFO!T49=\"Non requis\",COUNTRY_INFO!T49=0),0,IF($D49<>0, COUNTRY_INFO!T49,0))","v":0},0,null,null,0,null,null,{"$f":"IF($I49<>\"Oui\",$F49*2,($F49+ROUND(J49*$F49/SUM(COUNTRY_INFO!$E49:$G49),0))*2)","v":0},{"$f":"IF($I49<>\"Oui\",$G49*3,($G49+ROUND(J49*$G49/SUM(COUNTRY_INFO!$E49:$G49),0))*3)","v":0},0,null,0]
[{"$f":"IF(INTRO!$E$43=\"Non endémique\",\" \", IF(COUNTRY_INFO!A50=0,\" \",COUNTRY_INFO!A50))","v":"NIGER"},{"$f":"IF(INTRO!$E$43=\"Non endémique\",\" \", IF(COUNTRY_INFO!B50=0,\" \",COUNTRY_INFO!B50))","v":"Tahoua"},{"$f":"IF(INTRO!$E$43=\"Non endémique\",\" \", IF(COUNTRY_INFO!C50=0,\" \",COUNTRY_INFO!C50))","v":"Bagaroua"},{"$f":"IF(INTRO!$E$43=\"Non endémique\", \"Non requis\", COUNTRY_INFO!Y50)","v":0},{"$f":"IF(OR(COUNTRY_INFO!R50=\"Inconnu\",COUNTRY_INFO!R50=\"Surveillance\",COUNTRY_INFO!R50=\"Non requis\",COUNTRY_INFO!R50=0),0,IF($D50<>0, COUNTRY_INFO!R50,0))","v":0},{"$f":"IF(OR(COUNTRY_INFO!S50=\"Inconnu\",COUNTRY_INFO!S50=\"Surveillance\",COUNTRY_INFO!S50=\"Non requis\",COUNTRY_INFO!S50=0),0,IF($D50<>0, COUNTRY_INFO!S50,0))","v":0},{"$f":"IF(OR(COUNTRY_INFO!T50=\"Inconnu\",COUNTRY_INFO!T50=\"Surveillance\",COUNTRY_INFO!T50=\"Non requis\",COUNTRY_INFO!T50=0),0,IF($D50<>0, COUNTRY_INFO!T50,0))","v":0},0,null,null,0,null,null,{"$f":"IF($I50<>\"Oui\",$F50*2,($F50+ROUND(J50*$F50/SUM(COUNTRY_INFO!$E50:$G50),0))*2)","v":0},{"$f":"IF($I50<>\"Oui\",$G50*3,($G50+ROUND(J50*$G50/SUM(COUNTRY_INFO!$E50:$G50),0))*3)","v":0},0,null,0]
[{"$f":"IF(INTRO!$E$43=\"Non endémique\",\" \", IF(COUNTRY_INFO!A51=0,\" \",COUNTRY_INFO!A51))","v":"NIGER"},{"$f":"IF(INTRO!$E$43=\"Non endémique\",\" \", IF(COUNTRY_INFO!B51=0,\" \",COUNTRY_INFO!B51))","v":"Tahoua"},{"$f":"IF(INTRO!$E$43=\"Non endémique\",\" \", IF(COUNTRY_INFO!C51=0,\" \",COUNTRY_INFO!C51))","v":"Keita"},{"$f":"IF(INTRO!$E$43=\"Non endémique\", \"Non requis\", COUNTRY_INFO!Y51)","v":0},{"$f":"IF(OR(COUNTRY_INFO!R51=\"Inconnu\",COUNTRY_INFO!R51=\"Surveillance\",COUNTRY_INFO!R51=\"Non requis\",COUNTRY_INFO!R51=0),0,IF($D51<>0, COUNTRY_INFO!R51,0))","v":0},{"$f":"IF(OR(COUNTRY_INFO!S51=\"Inconnu\",COUNTRY_INFO!S51=\"Surveillance\",COUNTRY_INFO!S51=\"Non requis\",COUNTRY_INFO!S51=0),0,IF($D51<>0, COUNTRY_INFO!S51,0))","v":0},{"$f":"IF(OR(COUNTRY_INFO!T51=\"Inconnu\",COUNTRY_INFO!T51=\"Surveillance\",COUNTRY_INFO!T51=\"Non requis\",COUNTRY_INFO!T51=0),0,IF($D51<>0, COUNTRY_INFO!T51,0))","v":0},0,null,null,0,null,null,{"$f":"IF($I51<>\"Oui\",$F51*2,($F51+ROUND(J51*$F51/SUM(COUNTRY_INFO!$E51:$G51),0))*2)","v":0},{"$f":"IF($I51<>\"Oui\",$G51*3,($G51+ROUND(J51*$G51/SUM(COUNTRY_INFO!$E51:$G51),0))*3)","v":0},0,null,0]
[{"$f":"IF(INTRO!$E$43=\"Non endémique\",\" \", IF(COUNTRY_INFO!A52=0,\" \",COUNTRY_INFO!A52))","v":"NIGER"},{"$f":"IF(INTRO!$E$43=\"Non endémique\",\" \", IF(COUNTRY_INFO!B52=0,\" \",COUNTRY_INFO!B52))","v":"Tahoua"},{"$f":"IF(INTRO!$E$43=\"Non endémique\",\" \", IF(COUNTRY_INFO!C52=0,\" \",COUNTRY_INFO!C52))","v":"Madaoua"},{"$f":"IF(INTRO!$E$43=\"Non endémique\", \"Non requis\", COUNTRY_INFO!Y52)","v":0},{"$f":"IF(OR(COUNTRY_INFO!R52=\"Inconnu\",COUNTRY_INFO!R52=\"Surveillance\",COUNTRY_INFO!R52=\"Non requis\",COUNTRY_INFO!R52=0),0,IF($D52<>0, COUNTRY_INFO!R52,0))","v":0},{"$f":"IF(OR(COUNTRY_INFO!S52=\"Inconnu\",COUNTRY_INFO!S52=\"Surveillance\",COUNTRY_INFO!S52=\"Non requis\",COUNTRY_INFO!S52=0),0,IF($D52<>0, COUNTRY_INFO!S52,0))","v":0},{"$f":"IF(OR(COUNTRY_INFO!T52=\"Inconnu\",COUNTRY_INFO!T52=\"Surveillance\",COUNTRY_INFO!T52=\"Non requis\",COUNTRY_INFO!T52=0),0,IF($D52<>0, COUNTRY_INFO!T52,0))","v":0},0,null,null,0,null,null,{"$f":"IF($I52<>\"Oui\",$F52*2,($F52+ROUND(J52*$F52/SUM(COUNTRY_INFO!$E52:$G52),0))*2)","v":0},{"$f":"IF($I52<>\"Oui\",$G52*3,($G52+ROUND(J52*$G52/SUM(COUNTRY_INFO!$E52:$G52),0))*3)","v":0},0,null,0]
[{"$f":"IF(INTRO!$E$43=\"Non endémique\",\" \", IF(COUNTRY_INFO!A53=0,\" \",COUNTRY_INFO!A53))","v":"NIGER"},{"$f":"IF(INTRO!$E$43=\"Non endémique\",\" \", IF(COUNTRY_INFO!B53=0,\" \",COUNTRY_INFO!B53))","v":"Tahoua"},{"$f":"IF(INTRO!$E$43=\"Non endémique\",\" \", IF(COUNTRY_INFO!C53=0,\" \",COUNTRY_INFO!C53))","v":"Tahoua département"},{"$f":"IF(INTRO!$E$43=\"Non endémique\", \"Non requis\", COUNTRY_INFO!Y53)","v":0},{"$f":"IF(OR(COUNTRY_INFO!R53=\"Inconnu\",COUNTRY_INFO!R53=\"Surveillance\",COUNTRY_INFO!R53=\"Non requis\",COUNTRY_INFO!R53=0),0,IF($D53<>0, COUNTRY_INFO!R53,0))","v":0},{"$f":"IF(OR(COUNTRY_INFO!S53=\"Inconnu\",COUNTRY_INFO!S53=\"Surveillance\",COUNTRY_INFO!S53=\"Non requis\",COUNTRY_INFO!S53=0),0,IF($D53<>0, COUNTRY_INFO!S53,0))","v":0},{"$f":"IF(OR(COUNTRY_INFO!T53=\"Inconnu\",COUNTRY_INFO!T53=\"Surveillance\",COUNTRY_INFO!T53=\"Non requis\",COUNTRY_INFO!T53=0),0,IF($D53<>0, COUNTRY_INFO!T53,0))","v":0},0,null,null,0,null,null,{"$f":"IF($I53<>\"Oui\",$F53*2,($F53+ROUND(J53*$F53/SUM(COUNTRY_INFO!$E53:$G53),0))*2)","v":0},{"$f":"IF($I53<>\"Oui\",$G53*3,($G53+ROUND(J53*$G53/SUM(COUNTRY_INFO!$E53:$G53),0))*3)","v":0},0,null,0]
[{"$f":"IF(INTRO!$E$43=\"Non endémique\",\" \", IF(COUNTRY_INFO!A54=0,\" \",COUNTRY_INFO!A54))","v":"NIGER"},{"$f":"IF(INTRO!$E$43=\"Non endémique\",\" \", IF(COUNTRY_INFO!B54=0,\" \",COUNTRY_INFO!B54))","v":"Tahoua"},{"$f":"IF(INTRO!$E$43=\"Non endémique\",\" \", IF(COUNTRY_INFO!C54=0,\" \",COUNTRY_INFO!C54))","v":"Tahoua commune"},{"$f":"IF(INTRO!$E$43=\"Non endémique\", \"Non requis\", COUNTRY_INFO!Y54)","v":0},{"$f":"IF(OR(COUNTRY_INFO!R54=\"Inconnu\",COUNTRY_INFO!R54=\"Surveillance\",COUNTRY_INFO!R54=\"Non requis\",COUNTRY_INFO!R54=0),0,IF($D54<>0, COUNTRY_INFO!R54,0))","v":0},{"$f":"IF(OR(COUNTRY_INFO!S54=\"Inconnu\",COUNTRY_INFO!S54=\"Surveillance\",COUNTRY_INFO!S54=\"Non requis\",COUNTRY_INFO!S54=0),0,IF($D54<>0, COUNTRY_INFO!S54,0))","v":0},{"$f":"IF(OR(COUNTRY_INFO!T54=\"Inconnu\",COUNTRY_INFO!T54=\"Surveillance\",COUNTRY_INFO!T54=\"Non requis\",COUNTRY_INFO!T54=0),0,IF($D54<>0, COUNTRY_INFO!T54,0))","v":0},0,null,null,0,null,null,{"$f":"IF($I54<>\"Oui\",$F54*2,($F54+ROUND(J54*$F54/SUM(COUNTRY_INFO!$E54:$G54),0))*2)","v":0},{"$f":"IF($I54<>\"Oui\",$G54*3,($G54+ROUND(J54*$G54/SUM(COUNTRY_INFO!$E54:$G54),0))*3)","v":0},0,null,0]
[{"$f":"IF(INTRO!$E$43=\"Non endémique\",\" \", IF(COUNTRY_INFO!A55=0,\" \",COUNTRY_INFO!A55))","v":"NIGER"},{"$f":"IF(INTRO!$E$43=\"Non endémique\",\" \", IF(COUNTRY_INFO!B55=0,\" \",COUNTRY_INFO!B55))","v":"Tahoua"},{"$f":"IF(INTRO!$E$43=\"Non endémique\",\" \", IF(COUNTRY_INFO!C55=0,\" \",COUNTRY_INFO!C55))","v":"TCHINTABARADEN"},{"$f":"IF(INTRO!$E$43=\"Non endémique\", \"Non requis\", COUNTRY_INFO!Y55)","v":1},0,38727.737286260155,64546.228810433589,103273.96609669374,null,null,1,"EAS et Adultes",null,{"$f":"IF($I55<>\"Oui\",$F55*2,($F55+ROUND(J55*$F55/SUM(COUNTRY_INFO!$E55:$G55),0))*2)","v":77455.47457252031},{"$f":"IF($I55<>\"Oui\",$G55*3,($G55+ROUND(J55*$G55/SUM(COUNTRY_INFO!$E55:$G55),0))*3)","v":193638.68643130077},271094.16100382106,null,271094.16100382106]
[{"$f":"IF(INTRO!$E$43=\"Non endémique\",\" \", IF(COUNTRY_INFO!A56=0,\" \",COUNTRY_INFO!A56))","v":"NIGER"},{"$f":"IF(INTRO!$E$43=\"Non endémique\",\" \", IF(COUNTRY_INFO!B56=0,\" \",COUNTRY_INFO!B56))","v":"Tahoua"},{"$f":"IF(INTRO!$E$43=\"Non endémique\",\" \", IF(COUNTRY_INFO!C56=0,\" \",COUNTRY_INFO!C56))","v":"Tassara"},{"$f":"IF(INTRO!$E$43=\"Non endémique\", \"Non requis\", COUNTRY_INFO!Y56)","v":1},0,10168.421466238404,16947.36911039734,27115.790576635743,null,null,1,"EAS et Adultes",null,{"$f":"IF($I56<>\"Oui\",$F56*2,($F56+ROUND(J56*$F56/SUM(COUNTRY_INFO!$E56:$G56),0))*2)","v":20336.842932476808},{"$f":"IF($I56<>\"Oui\",$G56*3,($G56+ROUND(J56*$G56/SUM(COUNTRY_INFO!$E56:$G56),0))*3)","v":50842.107331192019},71178.950263668827,null,71178.950263668827]
[{"$f":"IF(INTRO!$E$43=\"Non endémique\",\" \", IF(COUNTRY_INFO!A57=0,\" \",COUNTRY_INFO!A57))","v":"NIGER"},{"$f":"IF(INTRO!$E$43=\"Non endémique\",\" \", IF(COUNTRY_INFO!B57=0,\" \",COUNTRY_INFO!B57))","v":"Tahoua"},{"$f":"IF(INTRO!$E$43=\"Non endémique\",\" \", IF(COUNTRY_INFO!C57=0,\" \",COUNTRY_INFO!C57))","v":"Tillia"},{"$f":"IF(INTRO!$E$43=\"Non endémique\", \"Non requis\", COUNTRY_INFO!Y57)","v":1},0,9588.3957037981163,15980.659506330192,25569.05521012831,null,null,1,"EAS et Adultes",null,{"$f":"IF($I57<>\"Oui\",$F57*2,($F57+ROUND(J57*$F57/SUM(COUNTRY_INFO!$E57:$G57),0))*2)","v":19176.791407596233},{"$f":"IF($I57<>\"Oui\",$G57*3,($G57+ROUND(J57*$G57/SUM(COUNTRY_INFO!$E57:$G57),0))*3)","v":47941.978518990574},67118.7699265868,null,67118.7699265868]
[{"$f":"IF(INTRO!$E$43=\"Non endémique\",\" \", IF(COUNTRY_INFO!A58=0,\" \",COUNTRY_INFO!A58))","v":"NIGER"},{"$f":"IF(INTRO!$E$43=\"Non endémique\",\" \", IF(COUNTRY_INFO!B58=0,\" \",COUNTRY_INFO!B58))","v":"Tillabery"},{"$f":"IF(INTRO!$E$43=\"Non endémique\",\" \", IF(COUNTRY_INFO!C58=0,\" \",COUNTRY_INFO!C58))","v":"Fillingue"},{"$f":"IF(INTRO!$E$43=\"Non endémique\", \"Non requis\", COUNTRY_INFO!Y58)","v":1},0,68777.99589746019,114629.99316243366,183407.98905989385,null,null,1,"EAS et Adultes",null,{"$f":"IF($I58<>\"Oui\",$F58*2,($F58+ROUND(J58*$F58/SUM(COUNTRY_INFO!$E58:$G58),0))*2)","v":137555.99179492038},{"$f":"IF($I58<>\"Oui\",$G58*3,($G58+ROUND(J58*$G58/SUM(COUNTRY_INFO!$E58:$G58),0))*3)","v":343889.97948730097},481445.97128222138,null,481445.97128222138]
[{"$f":"IF(INTRO!$E$43=\"Non endémique\",\" \", IF(COUNTRY_INFO!A59=0,\" \",COUNTRY_INFO!A59))","v":"NIGER"},{"$f":"IF(INTRO!$E$43=\"Non endémique\",\" \", IF(COUNTRY_INFO!B59=0,\" \",COUNTRY_INFO!B59))","v":"Tillabery"},{"$f":"IF(INTRO!$E$43=\"Non endémique\",\" \", IF(COUNTRY_INFO!C59=0,\" \",COUNTRY_INFO!C59))","v":"Balleyara"},{"$f":"IF(INTRO!$E$43=\"Non endémique\", \"Non requis\", COUNTRY_INFO!Y59)","v":1},0,31123.051939412086,51871.753232353476,82994.805171765562,null,null,1,"EAS et Adultes",null,{"$f":"IF($I59<>\"Oui\",$F59*2,($F59+ROUND(J59*$F59/SUM(COUNTRY_INFO!$E59:$G59),0))*2)","v":62246.103878824171},{"$f":"IF($I59<>\"Oui\",$G59*3,($G59+ROUND(J59*$G59/SUM(COUNTRY_INFO!$E59:$G59),0))*3)","v":155615.25969706042},217861.36357588461,null,217861.36357588461]
[{"$f":"IF(INTRO!$E$43=\"Non endémique\",\" \", IF(COUNTRY_INFO!A60=0,\" \",COUNTRY_INFO!A60))","v":"NIGER"},{"$f":"IF(INTRO!$E$43=\"Non endémique\",\" \", IF(COUNTRY_INFO!B60=0,\" \",COUNTRY_INFO!B60))","v":"Tillabery"},{"$f":"IF(INTRO!$E$43=\"Non endémique\",\" \", IF(COUNTRY_INFO!C60=0,\" \",COUNTRY_INFO!C60))","v":"Abala"},{"$f":"IF(INTRO!$E$43=\"Non endémique\", \"Non requis\", COUNTRY_INFO!Y60)","v":1},0,32822.750716668452,54704.584527780746,87527.335244449205,null,null,1,"EAS et Adultes",null,{"$f":"IF($I60<>\"Oui\",$F60*2,($F60+ROUND(J60*$F60/SUM(COUNTRY_INFO!$E60:$G60),0))*2)","v":65645.501433336904},{"$f":"IF($I60<>\"Oui\",$G60*3,($G60+ROUND(J60*$G60/SUM(COUNTRY_INFO!$E60:$G60),0))*3)","v":164113.75358334224},229759.25501667915,null,229759.25501667915]
[{"$f":"IF(INTRO!$E$43=\"Non endémique\",\" \", IF(COUNTRY_INFO!A61=0,\" \",COUNTRY_INFO!A61))","v":"NIGER"},{"$f":"IF(INTRO!$E$43=\"Non endémique\",\" \", IF(COUNTRY_INFO!B61=0,\" \",COUNTRY_INFO!B61))","v":"Tillabery"},{"$f":"IF(INTRO!$E$43=\"Non endémique\",\" \", IF(COUNTRY_INFO!C61=0,\" \",COUNTRY_INFO!C61))","v":"Kollo"},{"$f":"IF(INTRO!$E$43=\"Non endémique\", \"Non requis\", COUNTRY_INFO!Y61)","v":1},0,107304.5211,178840.86849999998,286145.38959999999,null,null,1,"EAS et Adultes",null,{"$f":"IF($I61<>\"Oui\",$F61*2,($F61+ROUND(J61*$F61/SUM(COUNTRY_INFO!$E61:$G61),0))*2)","v":214609.0422},{"$f":"IF($I61<>\"Oui\",$G61*3,($G61+ROUND(J61*$G61/SUM(COUNTRY_INFO!$E61:$G61),0))*3)","v":536522.60549999995},751131.64769999997,null,751131.64769999997]
[{"$f":"IF(INTRO!$E$43=\"Non endémique\",\" \", IF(COUNTRY_INFO!A62=0,\" \",COUNTRY_INFO!A62))","v":"NIGER"},{"$f":"IF(INTRO!$E$43=\"Non endémique\",\" \", IF(COUNTRY_INFO!B62=0,\" \",COUNTRY_INFO!B62))","v":"Tillabery"},{"$f":"IF(INTRO!$E$43=\"Non endémique\",\" \", IF(COUNTRY_INFO!C62=0,\" \",COUNTRY_INFO!C62))","v":"Ouallam"},{"$f":"IF(INTRO!$E$43=\"Non endémique\", \"Non requis\", COUNTRY_INFO!Y62)","v":1},0,68314.622985165071,113857.70497527512,182172.32796044019,null,null,1,"EAS et Adultes",null,{"$f":"IF($I62<>\"Oui\",$F62*2,($F62+ROUND(J62*$F62/SUM(COUNTRY_INFO!$E62:$G62),0))*2)","v":136629.24597033014},{"$f":"IF($I62<>\"Oui\",$G62*3,($G62+ROUND(J62*$G62/SUM(COUNTRY_INFO!$E62:$G62),0))*3)","v":341573.11492582539},478202.36089615553,null,478202.36089615553]
[{"$f":"IF(INTRO!$E$43=\"Non endémique\",\" \", IF(COUNTRY_INFO!A63=0,\" \",COUNTRY_INFO!A63))","v":"NIGER"},{"$f":"IF(INTRO!$E$43=\"Non endémique\",\" \", IF(COUNTRY_INFO!B63=0,\" \",COUNTRY_INFO!B63))","v":"Tillabery"},{"$f":"IF(INTRO!$E$43=\"Non endémique\",\" \", IF(COUNTRY_INFO!C63=0,\" \",COUNTRY_INFO!C63))","v":"Banibangou"},{"$f":"IF(INTRO!$E$43=\"Non endémique\", \"Non requis\", COUNTRY_INFO!Y63)","v":1},0,21554.443161595325,35924.071935992208,57478.515097587529,null,null,1,"EAS et Adultes",null,{"$f":"IF($I63<>\"Oui\",$F63*2,($F63+ROUND(J63*$F63/SUM(COUNTRY_INFO!$E63:$G63),0))*2)","v":43108.886323190651},{"$f":"IF($I63<>\"Oui\",$G63*3,($G63+ROUND(J63*$G63/SUM(COUNTRY_INFO!$E63:$G63),0))*3)","v":107772.21580797662},150881.10213116728,null,150881.10213116728]
[{"$f":"IF(INTRO!$E$43=\"Non endémique\",\" \", IF(COUNTRY_INFO!A64=0,\" \",COUNTRY_INFO!A64))","v":"NIGER"},{"$f":"IF(INTRO!$E$43=\"Non endémique\",\" \", IF(COUNTRY_INFO!B64=0,\" \",COUNTRY_INFO!B64))","v":"Tillabery"},{"$f":"IF(INTRO!$E$43=\"Non endémique\",\" \", IF(COUNTRY_INFO!C64=0,\" \",COUNTRY_INFO!C64))","v":"Say"},{"$f":"IF(INTRO!$E$43=\"Non endémique\", \"Non requis\", COUNTRY_INFO!Y64)","v":1},0,55853.347092917626,93088.911821529357,148942.25891444698,null,null,1,"EAS et Adultes",null,{"$f":"IF($I64<>\"Oui\",$F64*2,($F64+ROUND(J64*$F64/SUM(COUNTRY_INFO!$E64:$G64),0))*2)","v":111706.69418583525},{"$f":"IF($I64<>\"Oui\",$G64*3,($G64+ROUND(J64*$G64/SUM(COUNTRY_INFO!$E64:$G64),0))*3)","v":279266.73546458804},390973.42965042329,null,390973.42965042329]
[{"$f":"IF(INTRO!$E$43=\"Non endémique\",\" \", IF(COUNTRY_INFO!A65=0,\" \",COUNTRY_INFO!A65))","v":"NIGER"},{"$f":"IF(INTRO!$E$43=\"Non endémique\",\" \", IF(COUNTRY_INFO!B65=0,\" \",COUNTRY_INFO!B65))","v":"Tillabery"},{"$f":"IF(INTRO!$E$43=\"Non endémique\",\" \", IF(COUNTRY_INFO!C65=0,\" \",COUNTRY_INFO!C65))","v":"Torodi"},{"$f":"IF(INTRO!$E$43=\"Non endémique\", \"Non requis\", COUNTRY_INFO!Y65)","v":1},0,42881.379553491046,71468.965922485077,114350.34547597612,null,null,1,"EAS et Adultes",null,{"$f":"IF($I65<>\"Oui\",$F65*2,($F65+ROUND(J65*$F65/SUM(COUNTRY_INFO!$E65:$G65),0))*2)","v":85762.759106982092},{"$f":"IF($I65<>\"Oui\",$G65*3,($G65+ROUND(J65*$G65/SUM(COUNTRY_INFO!$E65:$G65),0))*3)","v":214406.89776745523},300169.65687443735,null,300169.65687443735]
[{"$f":"IF(INTRO!$E$43=\"Non endémique\",\" \", IF(COUNTRY_INFO!A66=0,\" \",COUNTRY_INFO!A66))","v":"NIGER"},{"$f":"IF(INTRO!$E$43=\"Non endémique\",\" \", IF(COUNTRY_INFO!B66=0,\" \",COUNTRY_INFO!B66))","v":"Tillabery"},{"$f":"IF(INTRO!$E$43=\"Non endémique\",\" \", IF(COUNTRY_INFO!C66=0,\" \",COUNTRY_INFO!C66))","v":"Tera"},{"$f":"IF(INTRO!$E$43=\"Non endémique\", \"Non requis\", COUNTRY_INFO!Y66)","v":1},0,63464.329486733906,105773.88247788984,169238.21196462374,null,null,1,"EAS et Adultes",null,{"$f":"IF($I66<>\"Oui\",$F66*2,($F66+ROUND(J66*$F66/SUM(COUNTRY_INFO!$E66:$G66),0))*2)","v":126928.65897346781},{"$f":"IF($I66<>\"Oui\",$G66*3,($G66+ROUND(J66*$G66/SUM(COUNTRY_INFO!$E66:$G66),0))*3)","v":317321.64743366954},444250.30640713737,null,444250.30640713737]
[{"$f":"IF(INTRO!$E$43=\"Non endémique\",\" \", IF(COUNTRY_INFO!A67=0,\" \",COUNTRY_INFO!A67))","v":"NIGER"},{"$f":"IF(INTRO!$E$43=\"Non endémique\",\" \", IF(COUNTRY_INFO!B67=0,\" \",COUNTRY_INFO!B67))","v":"Tillabery"},{"$f":"IF(INTRO!$E$43=\"Non endémique\",\" \", IF(COUNTRY_INFO!C67=0,\" \",COUNTRY_INFO!C67))","v":"Bankilare"},{"$f":"IF(INTRO!$E$43=\"Non endémique\", \"Non requis\", COUNTRY_INFO!Y67)","v":1},0,10434.39601378372,17390.660022972868,27825.056036756589,null,null,1,"EAS et Adultes",null,{"$f":"IF($I67<>\"Oui\",$F67*2,($F67+ROUND(J67*$F67/SUM(COUNTRY_INFO!$E67:$G67),0))*2)","v":20868.792027567441},{"$f":"IF($I67<>\"Oui\",$G67*3,($G67+ROUND(J67*$G67/SUM(COUNTRY_INFO!$E67:$G67),0))*3)","v":52171.980068918609},73040.772096486049,null,73040.772096486049]
[{"$f":"IF(INTRO!$E$43=\"Non endémique\",\" \", IF(COUNTRY_INFO!A68=0,\" \",COUNTRY_INFO!A68))","v":"NIGER"},{"$f":"IF(INTRO!$E$43=\"Non endémique\",\" \", IF(COUNTRY_INFO!B68=0,\" \",COUNTRY_INFO!B68))","v":"Tillabery"},{"$f":"IF(INTRO!$E$43=\"Non endémique\",\" \", IF(COUNTRY_INFO!C68=0,\" \",COUNTRY_INFO!C68))","v":"Gothèye"},{"$f":"IF(INTRO!$E$43=\"Non endémique\", \"Non requis\", COUNTRY_INFO!Y68)","v":1},0,40907.146019058324,68178.576698430537,109085.72271748885,null,null,1,"EAS et Adultes",null,{"$f":"IF($I68<>\"Oui\",$F68*2,($F68+ROUND(J68*$F68/SUM(COUNTRY_INFO!$E68:$G68),0))*2)","v":81814.292038116648},{"$f":"IF($I68<>\"Oui\",$G68*3,($G68+ROUND(J68*$G68/SUM(COUNTRY_INFO!$E68:$G68),0))*3)","v":204535.73009529163},286350.02213340829,null,286350.02213340829]
[{"$f":"IF(INTRO!$E$43=\"Non endémique\",\" \", IF(COUNTRY_INFO!A69=0,\" \",COUNTRY_INFO!A69))","v":"NIGER"},{"$f":"IF(INTRO!$E$43=\"Non endémique\",\" \", IF(COUNTRY_INFO!B69=0,\" \",COUNTRY_INFO!B69))","v":"Tillabery"},{"$f":"IF(INTRO!$E$43=\"Non endémique\",\" \", IF(COUNTRY_INFO!C69=0,\" \",COUNTRY_INFO!C69))","v":"Tillaberi"},{"$f":"IF(INTRO!$E$43=\"Non endémique\", \"Non requis\", COUNTRY_INFO!Y69)","v":1},0,65439.947891234689,109066.57981872448,174506.52770995916,null,null,1,"EAS et Adultes",null,{"$f":"IF($I69<>\"Oui\",$F69*2,($F69+ROUND(J69*$F69/SUM(COUNTRY_INFO!$E69:$G69),0))*2)","v":130879.89578246938},{"$f":"IF($I69<>\"Oui\",$G69*3,($G69+ROUND(J69*$G69/SUM(COUNTRY_INFO!$E69:$G69),0))*3)","v":327199.73945617344},458079.6352386428,null,458079.6352386428]
[{"$f":"IF(INTRO!$E$43=\"Non endémique\",\" \", IF(COUNTRY_INFO!A70=0,\" \",COUNTRY_INFO!A70))","v":"NIGER"},{"$f":"IF(INTRO!$E$43=\"Non endémique\",\" \", IF(COUNTRY_INFO!B70=0,\" \",COUNTRY_INFO!B70))","v":"Tillabery"},{"$f":"IF(INTRO!$E$43=\"Non endémique\",\" \", IF(COUNTRY_INFO!C70=0,\" \",COUNTRY_INFO!C70))","v":"Ayorou"},{"$f":"IF(INTRO!$E$43=\"Non endémique\", \"Non requis\", COUNTRY_INFO!Y70)","v":1},0,8136.5060252531712,13560.843375421951,21697.349400675121,null,null,1,"EAS et Adultes",null,{"$f":"IF($I70<>\"Oui\",$F70*2,($F70+ROUND(J70*$F70/SUM(COUNTRY_INFO!$E70:$G70),0))*2)","v":16273.012050506342},{"$f":"IF($I70<>\"Oui\",$G70*3,($G70+ROUND(J70*$G70/SUM(COUNTRY_INFO!$E70:$G70),0))*3)","v":40682.530126265854},56955.5421767722,null,56955.5421767722]
[{"$f":"IF(INTRO!$E$43=\"Non endémique\",\" \", IF(COUNTRY_INFO!A71=0,\" \",COUNTRY_INFO!A71))","v":"NIGER"},{"$f":"IF(INTRO!$E$43=\"Non endémique\",\" \", IF(COUNTRY_INFO!B71=0,\" \",COUNTRY_INFO!B71))","v":"Zinder"},{"$f":"IF(INTRO!$E$43=\"Non endémique\",\" \", IF(COUNTRY_INFO!C71=0,\" \",COUNTRY_INFO!C71))","v":"Goure"},{"$f":"IF(INTRO!$E$43=\"Non endémique\", \"Non requis\", COUNTRY_INFO!Y71)","v":0},{"$f":"IF(OR(COUNTRY_INFO!R71=\"Inconnu\",COUNTRY_INFO!R71=\"Surveillance\",COUNTRY_INFO!R71=\"Non requis\",COUNTRY_INFO!R71=0),0,IF($D71<>0, COUNTRY_INFO!R71,0))","v":0},{"$f":"IF(OR(COUNTRY_INFO!S71=\"Inconnu\",COUNTRY_INFO!S71=\"Surveillance\",COUNTRY_INFO!S71=\"Non requis\",COUNTRY_INFO!S71=0),0,IF($D71<>0, COUNTRY_INFO!S71,0))","v":0},{"$f":"IF(OR(COUNTRY_INFO!T71=\"Inconnu\",COUNTRY_INFO!T71=\"Surveillance\",COUNTRY_INFO!T71=\"Non requis\",COUNTRY_INFO!T71=0),0,IF($D71<>0, COUNTRY_INFO!T71,0))","v":0},0,null,null,0,null,null,{"$f":"IF($I71<>\"Oui\",$F71*2,($F71+ROUND(J71*$F71/SUM(COUNTRY_INFO!$E71:$G71),0))*2)","v":0},{"$f":"IF($I71<>\"Oui\",$G71*3,($G71+ROUND(J71*$G71/SUM(COUNTRY_INFO!$E71:$G71),0))*3)","v":0},0,null,0]
[{"$f":"IF(INTRO!$E$43=\"Non endémique\",\" \", IF(COUNTRY_INFO!A72=0,\" \",COUNTRY_INFO!A72))","v":"NIGER"},{"$f":"IF(INTRO!$E$43=\"Non endémique\",\" \", IF(COUNTRY_INFO!B72=0,\" \",COUNTRY_INFO!B72))","v":"Zinder"},{"$f":"IF(INTRO!$E$43=\"Non endémique\",\" \", IF(COUNTRY_INFO!C72=0,\" \",COUNTRY_INFO!C72))","v":"Tesker"},{"$f":"IF(INTRO!$E$43=\"Non endémique\", \"Non requis\", COUNTRY_INFO!Y72)","v":0},{"$f":"IF(OR(COUNTRY_INFO!R72=\"Inconnu\",COUNTRY_INFO!R72=\"Surveillance\",COUNTRY_INFO!R72=\"Non requis\",COUNTRY_INFO!R72=0),0,IF($D72<>0, COUNTRY_INFO!R72,0))","v":0},{"$f":"IF(OR(COUNTRY_INFO!S72=\"Inconnu\",COUNTRY_INFO!S72=\"Surveillance\",COUNTRY_INFO!S72=\"Non requis\",COUNTRY_INFO!S72=0),0,IF($D72<>0, COUNTRY_INFO!S72,0))","v":0},{"$f":"IF(OR(COUNTRY_INFO!T72=\"Inconnu\",COUNTRY_INFO!T72=\"Surveillance\",COUNTRY_INFO!T72=\"Non requis\",COUNTRY_INFO!T72=0),0,IF($D72<>0, COUNTRY_INFO!T72,0))","v":0},0,null,null,0,null,null,{"$f":"IF($I72<>\"Oui\",$F72*2,($F72+ROUND(J72*$F72/SUM(COUNTRY_INFO!$E72:$G72),0))*2)","v":0},{"$f":"IF($I72<>\"Oui\",$G72*3,($G72+ROUND(J72*$G72/SUM(COUNTRY_INFO!$E72:$G72),0))*3)","v":0},0,null,0]
[{"$f":"IF(INTRO!$E$43=\"Non endémique\",\" \", IF(COUNTRY_INFO!A73=0,\" \",COUNTRY_INFO!A73))","v":"NIGER"},{"$f":"IF(INTRO!$E$43=\"Non endémique\",\" \", IF(COUNTRY_INFO!B73=0,\" \",COUNTRY_INFO!B73))","v":"Zinder"},{"$f":"IF(INTRO!$E$43=\"Non endémique\",\" \", IF(COUNTRY_INFO!C73=0,\" \",COUNTRY_INFO!C73))","v":"Magaria"},{"$f":"IF(INTRO!$E$43=\"Non endémique\", \"Non requis\", COUNTRY_INFO!Y73)","v":0},{"$f":"IF(OR(COUNTRY_INFO!R73=\"Inconnu\",COUNTRY_INFO!R73=\"Surveillance\",COUNTRY_INFO!R73=\"Non requis\",COUNTRY_INFO!R73=0),0,IF($D73<>0, COUNTRY_INFO!R73,0))","v":0},{"$f":"IF(OR(COUNTRY_INFO!S73=\"Inconnu\",COUNTRY_INFO!S73=\"Surveillance\",COUNTRY_INFO!S73=\"Non requis\",COUNTRY_INFO!S73=0),0,IF($D73<>0, COUNTRY_INFO!S73,0))","v":0},{"$f":"IF(OR(COUNTRY_INFO!T73=\"Inconnu\",COUNTRY_INFO!T73=\"Surveillance\",COUNTRY_INFO!T73=\"Non requis\",COUNTRY_INFO!T73=0),0,IF($D73<>0, COUNTRY_INFO!T73,0))","v":0},0,null,null,0,null,null,{"$f":"IF($I73<>\"Oui\",$F73*2,($F73+ROUND(J73*$F73/SUM(COUNTRY_INFO!$E73:$G73),0))*2)","v":0},{"$f":"IF($I73<>\"Oui\",$G73*3,($G73+ROUND(J73*$G73/SUM(COUNTRY_INFO!$E73:$G73),0))*3)","v":0},0,null,0]
[{"$f":"IF(INTRO!$E$43=\"Non endémique\",\" \", IF(COUNTRY_INFO!A74=0,\" \",COUNTRY_INFO!A74))","v":"NIGER"},{"$f":"IF(INTRO!$E$43=\"Non endémique\",\" \", IF(COUNTRY_INFO!B74=0,\" \",COUNTRY_INFO!B74))","v":"Zinder"},{"$f":"IF(INTRO!$E$43=\"Non endémique\",\" \", IF(COUNTRY_INFO!C74=0,\" \",COUNTRY_INFO!C74))","v":"Dungass"},{"$f":"IF(INTRO!$E$43=\"Non endémique\", \"Non requis\", COUNTRY_INFO!Y74)","v":0},{"$f":"IF(OR(COUNTRY_INFO!R74=\"Inconnu\",COUNTRY_INFO!R74=\"Surveillance\",COUNTRY_INFO!R74=\"Non requis\",COUNTRY_INFO!R74=0),0,IF($D74<>0, COUNTRY_INFO!R74,0))","v":0},{"$f":"IF(OR(COUNTRY_INFO!S74=\"Inconnu\",COUNTRY_INFO!S74=\"Surveillance\",COUNTRY_INFO!S74=\"Non requis\",COUNTRY_INFO!S74=0),0,IF($D74<>0, COUNTRY_INFO!S74,0))","v":0},{"$f":"IF(OR(COUNTRY_INFO!T74=\"Inconnu\",COUNTRY_INFO!T74=\"Surveillance\",COUNTRY_INFO!T74=\"Non requis\",COUNTRY_INFO!T74=0),0,IF($D74<>0, COUNTRY_INFO!T74,0))","v":0},0,null,null,0,null,null,{"$f":"IF($I74<>\"Oui\",$F74*2,($F74+ROUND(J74*$F74/SUM(COUNTRY_INFO!$E74:$G74),0))*2)","v":0},{"$f":"IF($I74<>\"Oui\",$G74*3,($G74+ROUND(J74*$G74/SUM(COUNTRY_INFO!$E74:$G74),0))*3)","v":0},0,null,0]
[{"$f":"IF(INTRO!$E$43=\"Non endémique\",\" \", IF(COUNTRY_INFO!A75=0,\" \",COUNTRY_INFO!A75))","v":"NIGER"},{"$f":"IF(INTRO!$E$43=\"Non endémique\",\" \", IF(COUNTRY_INFO!B75=0,\" \",COUNTRY_INFO!B75))","v":"Zinder"},{"$f":"IF(INTRO!$E$43=\"Non endémique\",\" \", IF(COUNTRY_INFO!C75=0,\" \",COUNTRY_INFO!C75))","v":"Matamaye"},{"$f":"IF(INTRO!$E$43=\"Non endémique\", \"Non requis\", COUNTRY_INFO!Y75)","v":0},{"$f":"IF(OR(COUNTRY_INFO!R75=\"Inconnu\",COUNTRY_INFO!R75=\"Surveillance\",COUNTRY_INFO!R75=\"Non requis\",COUNTRY_INFO!R75=0),0,IF($D75<>0, COUNTRY_INFO!R75,0))","v":0},{"$f":"IF(OR(COUNTRY_INFO!S75=\"Inconnu\",COUNTRY_INFO!S75=\"Surveillance\",COUNTRY_INFO!S75=\"Non requis\",COUNTRY_INFO!S75=0),0,IF($D75<>0, COUNTRY_INFO!S75,0))","v":0},{"$f":"IF(OR(COUNTRY_INFO!T75=\"Inconnu\",COUNTRY_INFO!T75=\"Surveillance\",COUNTRY_INFO!T75=\"Non requis\",COUNTRY_INFO!T75=0),0,IF($D75<>0, COUNTRY_INFO!T75,0))","v":0},{"$f":"SUM(E75:G75)","v":0},null,null,0,null,null,{"$f":"IF($I75<>\"Oui\",$F75*2,($F75+ROUND(J75*$F75/SUM(COUNTRY_INFO!$E75:$G75),0))*2)","v":0},{"$f":"IF($I75<>\"Oui\",$G75*3,($G75+ROUND(J75*$G75/SUM(COUNTRY_INFO!$E75:$G75),0))*3)","v":0},{"$f":"SUM(M75:O75)","v":0},null,{"$f":"IF($P75>$Q75,P75-Q75,0)","v":0}]
[{"$f":"IF(INTRO!$E$43=\"Non endémique\",\" \", IF(COUNTRY_INFO!A76=0,\" \",COUNTRY_INFO!A76))","v":"NIGER"},{"$f":"IF(INTRO!$E$43=\"Non endémique\",\" \", IF(COUNTRY_INFO!B76=0,\" \",COUNTRY_INFO!B76))","v":"Zinder"},{"$f":"IF(INTRO!$E$43=\"Non endémique\",\" \", IF(COUNTRY_INFO!C76=0,\" \",COUNTRY_INFO!C76))","v":"Miriah"},{"$f":"IF(INTRO!$E$43=\"Non endémique\", \"Non requis\", COUNTRY_INFO!Y76)","v":1},0,102247.07064374052,170411.78440623416,272658.85504997469,null,null,1,"EAS et Adultes",null,{"$f":"IF($I76<>\"Oui\",$F76*2,($F76+ROUND(J76*$F76/SUM(COUNTRY_INFO!$E76:$G76),0))*2)","v":204494.14128748103},{"$f":"IF($I76<>\"Oui\",$G76*3,($G76+ROUND(J76*$G76/SUM(COUNTRY_INFO!$E76:$G76),0))*3)","v":511235.35321870248},715729.49450618355,null,715729.49450618355]
[{"$f":"IF(INTRO!$E$43=\"Non endémique\",\" \", IF(COUNTRY_INFO!A77=0,\" \",COUNTRY_INFO!A77))","v":"NIGER"},{"$f":"IF(INTRO!$E$43=\"Non endémique\",\" \", IF(COUNTRY_INFO!B77=0,\" \",COUNTRY_INFO!B77))","v":"Zinder"},{"$f":"IF(INTRO!$E$43=\"Non endémique\",\" \", IF(COUNTRY_INFO!C77=0,\" \",COUNTRY_INFO!C77))","v":"Damagaram Takaya"},{"$f":"IF(INTRO!$E$43=\"Non endémique\", \"Non requis\", COUNTRY_INFO!Y77)","v":1},0,49822.5,83037.5,132860,null,null,1,"EAS et Adultes",null,{"$f":"IF($I77<>\"Oui\",$F77*2,($F77+ROUND(J77*$F77/SUM(COUNTRY_INFO!$E77:$G77),0))*2)","v":99645},{"$f":"IF($I77<>\"Oui\",$G77*3,($G77+ROUND(J77*$G77/SUM(COUNTRY_INFO!$E77:$G77),0))*3)","v":249112.5},348757.5,null,348757.5]
[{"$f":"IF(INTRO!$E$43=\"Non endémique\",\" \", IF(COUNTRY_INFO!A78=0,\" \",COUNTRY_INFO!A78))","v":"NIGER"},{"$f":"IF(INTRO!$E$43=\"Non endémique\",\" \", IF(COUNTRY_INFO!B78=0,\" \",COUNTRY_INFO!B78))","v":"Zinder"},{"$f":"IF(INTRO!$E$43=\"Non endémique\",\" \", IF(COUNTRY_INFO!C78=0,\" \",COUNTRY_INFO!C78))","v":"Takeita"},{"$f":"IF(INTRO!$E$43=\"Non endémique\", \"Non requis\", COUNTRY_INFO!Y78)","v":1},0,35378.221160524823,58963.701934208038,94341.923094732862,null,null,1,"EAS et Adultes",null,{"$f":"IF($I78<>\"Oui\",$F78*2,($F78+ROUND(J78*$F78/SUM(COUNTRY_INFO!$E78:$G78),0))*2)","v":70756.442321049646},{"$f":"IF($I78<>\"Oui\",$G78*3,($G78+ROUND(J78*$G78/SUM(COUNTRY_INFO!$E78:$G78),0))*3)","v":176891.10580262411},247647.54812367377,null,247647.54812367377]
[{"$f":"IF(INTRO!$E$43=\"Non endémique\",\" \", IF(COUNTRY_INFO!A79=0,\" \",COUNTRY_INFO!A79))","v":"NIGER"},{"$f":"IF(INTRO!$E$43=\"Non endémique\",\" \", IF(COUNTRY_INFO!B79=0,\" \",COUNTRY_INFO!B79))","v":"Zinder"},{"$f":"IF(INTRO!$E$43=\"Non endémique\",\" \", IF(COUNTRY_INFO!C79=0,\" \",COUNTRY_INFO!C79))","v":"Tanout"},{"$f":"IF(INTRO!$E$43=\"Non endémique\", \"Non requis\", COUNTRY_INFO!Y79)","v":0},{"$f":"IF(OR(COUNTRY_INFO!R79=\"Inconnu\",COUNTRY_INFO!R79=\"Surveillance\",COUNTRY_INFO!R79=\"Non requis\",COUNTRY_INFO!R79=0),0,IF($D79<>0, COUNTRY_INFO!R79,0))","v":0},{"$f":"IF(OR(COUNTRY_INFO!S79=\"Inconnu\",COUNTRY_INFO!S79=\"Surveillance\",COUNTRY_INFO!S79=\"Non requis\",COUNTRY_INFO!S79=0),0,IF($D79<>0, COUNTRY_INFO!S79,0))","v":0},{"$f":"IF(OR(COUNTRY_INFO!T79=\"Inconnu\",COUNTRY_INFO!T79=\"Surveillance\",COUNTRY_INFO!T79=\"Non requis\",COUNTRY_INFO!T79=0),0,IF($D79<>0, COUNTRY_INFO!T79,0))","v":0},0,null,null,0,null,null,{"$f":"IF($I79<>\"Oui\",$F79*2,($F79+ROUND(J79*$F79/SUM(COUNTRY_INFO!$E79:$G79),0))*2)","v":0},{"$f":"IF($I79<>\"Oui\",$G79*3,($G79+ROUND(J79*$G79/SUM(COUNTRY_INFO!$E79:$G79),0))*3)","v":0},0,null,0]
[{"$f":"IF(INTRO!$E$43=\"Non endémique\",\" \", IF(COUNTRY_INFO!A80=0,\" \",COUNTRY_INFO!A80))","v":"NIGER"},{"$f":"IF(INTRO!$E$43=\"Non endémique\",\" \", IF(COUNTRY_INFO!B80=0,\" \",COUNTRY_INFO!B80))","v":"Zinder"},{"$f":"IF(INTRO!$E$43=\"Non endémique\",\" \", IF(COUNTRY_INFO!C80=0,\" \",COUNTRY_INFO!C80))","v":"Belbéji"},{"$f":"IF(INTRO!$E$43=\"Non endémique\", \"Non requis\", COUNTRY_INFO!Y80)","v":0},{"$f":"IF(OR(COUNTRY_INFO!R80=\"Inconnu\",COUNTRY_INFO!R80=\"Surveillance\",COUNTRY_INFO!R80=\"Non requis\",COUNTRY_INFO!R80=0),0,IF($D80<>0, COUNTRY_INFO!R80,0))","v":0},{"$f":"IF(OR(COUNTRY_INFO!S80=\"Inconnu\",COUNTRY_INFO!S80=\"Surveillance\",COUNTRY_INFO!S80=\"Non requis\",COUNTRY_INFO!S80=0),0,IF($D80<>0, COUNTRY_INFO!S80,0))","v":0},{"$f":"IF(OR(COUNTRY_INFO!T80=\"Inconnu\",COUNTRY_INFO!T80=\"Surveillance\",COUNTRY_INFO!T80=\"Non requis\",COUNTRY_INFO!T80=0),0,IF($D80<>0, COUNTRY_INFO!T80,0))","v":0},0,null,null,0,null,null,{"$f":"IF($I80<>\"Oui\",$F80*2,($F80+ROUND(J80*$F80/SUM(COUNTRY_INFO!$E80:$G80),0))*2)","v":0},{"$f":"IF($I80<>\"Oui\",$G80*3,($G80+ROUND(J80*$G80/SUM(COUNTRY_INFO!$E80:$G80),0))*3)","v":0},0,null,0]
[{"$f":"IF(INTRO!$E$43=\"Non endémique\",\" \", IF(COUNTRY_INFO!A81=0,\" \",COUNTRY_INFO!A81))","v":"NIGER"},{"$f":"IF(INTRO!$E$43=\"Non endémique\",\" \", IF(COUNTRY_INFO!B81=0,\" \",COUNTRY_INFO!B81))","v":"Zinder"},{"$f":"IF(INTRO!$E$43=\"Non endémique\",\" \", IF(COUNTRY_INFO!C81=0,\" \",COUNTRY_INFO!C81))","v":"Zinder"},{"$f":"IF(INTRO!$E$43=\"Non endémique\", \"Non requis\", COUNTRY_INFO!Y81)","v":0},{"$f":"IF(OR(COUNTRY_INFO!R81=\"Inconnu\",COUNTRY_INFO!R81=\"Surveillance\",COUNTRY_INFO!R81=\"Non requis\",COUNTRY_INFO!R81=0),0,IF($D81<>0, COUNTRY_INFO!R81,0))","v":0},{"$f":"IF(OR(COUNTRY_INFO!S81=\"Inconnu\",COUNTRY_INFO!S81=\"Surveillance\",COUNTRY_INFO!S81=\"Non requis\",COUNTRY_INFO!S81=0),0,IF($D81<>0, COUNTRY_INFO!S81,0))","v":0},{"$f":"IF(OR(COUNTRY_INFO!T81=\"Inconnu\",COUNTRY_INFO!T81=\"Surveillance\",COUNTRY_INFO!T81=\"Non requis\",COUNTRY_INFO!T81=0),0,IF($D81<>0, COUNTRY_INFO!T81,0))","v":0},0,null,null,0,null,null,{"$f":"IF($I81<>\"Oui\",$F81*2,($F81+ROUND(J81*$F81/SUM(COUNTRY_INFO!$E81:$G81),0))*2)","v":0},{"$f":"IF($I81<>\"Oui\",$G81*3,($G81+ROUND(J81*$G81/SUM(COUNTRY_INFO!$E81:$G81),0))*3)","v":0},0,null,0]

{"sheet":"IVM","index":5,"n_rows":81,"n_cols":14,"rows_kept":81,"cut":false,"hidden":false,"merged":[[6,7,7,7],[6,9,7,9],[6,10,7,10],[6,11,7,11],[3,0,3,2],[3,4,3,5],[6,4,7,4],[6,5,7,5],[5,8,5,13],[6,0,7,0],[6,1,7,1],[6,2,7,2],[5,0,5,2],[5,4,5,5],[5,6,5,7],[6,12,7,12],[5,3,7,3],[6,13,7,13],[6,8,7,8],[6,6,7,6]]}
["Ivermectine (IVM)"]
["Structure administrative, population ciblée par groupe d'âge, plan de traitement et information sur les comprimés"]
[]
["TOTAL",null,null,{"$f":"SUBTOTAL(9,D$10:D$1010)","v":0},null,null,{"$f":"SUBTOTAL(9,G$10:G$1010)","v":0},0,0,0,0,0,0,0]
[]
["Structure administrative du pays",null,null,"Population nécessitant un traitement avec IVM","Plan de traitement",null,"Population cible",null,"Ivermectine (IVM)"]
["Pays","Région/Département","District",null,"FL","Oncho","FL","Oncho","FL uniquement","Oncho uniquement","FL+Oncho","Total requis","Reste en stock","Comprimés devant être fournis"]
[]
[]
[{"$f":"IF(INTRO!$E$39=\"Non endémique\",\" \",IF(COUNTRY_INFO!A10=0,\" \",COUNTRY_INFO!A10))","v":"NIGER"},{"$f":"IF(INTRO!$E$39=\"Non endémique\",\" \",IF(COUNTRY_INFO!B10=0,\" \",COUNTRY_INFO!B10))","v":"Agadez"},{"$f":"IF(INTRO!$E$39=\"Non endémique\",\" \",IF(COUNTRY_INFO!C10=0,\" \",COUNTRY_INFO!C10))","v":"Agadez"},{"$f":"IF(INTRO!$E$39=\"Non endémique\",0,IF(INTRO!$E$39=\"Endémique mais pas de CP\",IF(COUNTRY_INFO!$H10=1,COUNTRY_INFO!F10+COUNTRY_INFO!G10,0),IF(COUNTRY_INFO!$H10=1,COUNTRY_INFO!F10+COUNTRY_INFO!G10,IF(COUNTRY_INFO!$I10=1,IF(COUNTRY_INFO!M10>=(COUNTRY_INFO!F10+COUNTRY_INFO!G10),COUNTRY_INFO!F10+COUNTRY_INFO!G10,COUNTRY_INFO!$M10),0))))","v":0},{"$f":"IF(AND(INTRO!$E$39=\"Non endémique\",INTRO!$E$37=\"Non endémique\"),\"Non requis\",IF(INTRO!$E$39=\"Non endémique\",\"Traiter avec DEC\",COUNTRY_INFO!V10))","v":0},{"$f":"IF(INTRO!$E$39<>\"Non endémique\",COUNTRY_INFO!W10,\"Non requis\")","v":0},{"$f":"IF(COUNTRY_INFO!H10=1, IF($E10=1,$D10, 0),0)","v":0},{"$f":"IF(COUNTRY_INFO!I10=1, IF(AND(COUNTRY_INFO!$I10=1,$F10<>0),IF(COUNTRY_INFO!M10>=(COUNTRY_INFO!F10+COUNTRY_INFO!G10),COUNTRY_INFO!F10+COUNTRY_INFO!G10,COUNTRY_INFO!$M10), 0),0)","v":0},{"$f":"IF(G10<H10,0,IF($E10=1, (G10-H10)*2.8, 0))","v":0},{"$f":"IF($E10<$F10, H10*(F10-E10)*2.8, 0)","v":0},{"$f":"IF(AND($E10=1, $F10<>0), H10*2.8, 0)","v":0},{"$f":"SUM(I10:K10)","v":0},null,{"$f":"IF($L10>$M10,$L10-$M10,0)","v":0}]
[{"$f":"IF(INTRO!$E$39=\"Non endémique\",\" \",IF(COUNTRY_INFO!A11=0,\" \",COUNTRY_INFO!A11))","v":"NIGER"},{"$f":"IF(INTRO!$E$39=\"Non endémique\",\" \",IF(COUNTRY_INFO!B11=0,\" \",COUNTRY_INFO!B11))","v":"Agadez"},{"$f":"IF(INTRO!$E$39=\"Non endémique\",\" \",IF(COUNTRY_INFO!C11=0,\" \",COUNTRY_INFO!C11))","v":"Arlit"},{"$f":"IF(INTRO!$E$39=\"Non endémique\",0,IF(INTRO!$E$39=\"Endémique mais pas de CP\",IF(COUNTRY_INFO!$H11=1,COUNTRY_INFO!F11+COUNTRY_INFO!G11,0),IF(COUNTRY_INFO!$H11=1,COUNTRY_INFO!F11+COUNTRY_INFO!G11,IF(COUNTRY_INFO!$I11=1,IF(COUNTRY_INFO!M11>=(COUNTRY_INFO!F11+COUNTRY_INFO!G11),COUNTRY_INFO!F11+COUNTRY_INFO!G11,COUNTRY_INFO!$M11),0))))","v":0},{"$f":"IF(AND(INTRO!$E$39=\"Non endémique\",INTRO!$E$37=\"Non endémique\"),\"Non requis\",IF(INTRO!$E$39=\"Non endémique\",\"Traiter avec DEC\",COUNTRY_INFO!V11))","v":0},{"$f":"IF(INTRO!$E$39<>\"Non endémique\",COUNTRY_INFO!W11,\"Non requis\")","v":0},{"$f":"IF(COUNTRY_INFO!H11=1, IF($E11=1,$D11, 0),0)","v":0},{"$f":"IF(COUNTRY_INFO!I11=1, IF(AND(COUNTRY_INFO!$I11=1,$F11<>0),IF(COUNTRY_INFO!M11>=(COUNTRY_INFO!F11+COUNTRY_INFO!G11),COUNTRY_INFO!F11+COUNTRY_INFO!G11,COUNTRY_INFO!$M11), 0),0)","v":0},{"$f":"IF(G11<H11,0,IF($E11=1, (G11-H11)*2.8, 0))","v":0},{"$f":"IF($E11<$F11, H11*(F11-E11)*2.8, 0)","v":0},{"$f":"IF(AND($E11=1, $F11<>0), H11*2.8, 0)","v":0},{"$f":"SUM(I11:K11)","v":0},null,0]
[{"$f":"IF(INTRO!$E$39=\"Non endémique\",\" \",IF(COUNTRY_INFO!A12=0,\" \",COUNTRY_INFO!A12))","v":"NIGER"},{"$f":"IF(INTRO!$E$39=\"Non endémique\",\" \",IF(COUNTRY_INFO!B12=0,\" \",COUNTRY_INFO!B12))","v":"Agadez"},{"$f":"IF(INTRO!$E$39=\"Non endémique\",\" \",IF(COUNTRY_INFO!C12=0,\" \",COUNTRY_INFO!C12))","v":"Iférouane"},{"$f":"IF(INTRO!$E$39=\"Non endémique\",0,IF(INTRO!$E$39=\"Endémique mais pas de CP\",IF(COUNTRY_INFO!$H12=1,COUNTRY_INFO!F12+COUNTRY_INFO!G12,0),IF(COUNTRY_INFO!$H12=1,COUNTRY_INFO!F12+COUNTRY_INFO!G12,IF(COUNTRY_INFO!$I12=1,IF(COUNTRY_INFO!M12>=(COUNTRY_INFO!F12+COUNTRY_INFO!G12),COUNTRY_INFO!F12+COUNTRY_INFO!G12,COUNTRY_INFO!$M12),0))))","v":0},{"$f":"IF(AND(INTRO!$E$39=\"Non endémique\",INTRO!$E$37=\"Non endémique\"),\"Non requis\",IF(INTRO!$E$39=\"Non endémique\",\"Traiter avec DEC\",COUNTRY_INFO!V12))","v":0},{"$f":"IF(INTRO!$E$39<>\"Non endémique\",COUNTRY_INFO!W12,\"Non requis\")","v":0},{"$f":"IF(COUNTRY_INFO!H12=1, IF($E12=1,$D12, 0),0)","v":0},{"$f":"IF(COUNTRY_INFO!I12=1, IF(AND(COUNTRY_INFO!$I12=1,$F12<>0),IF(COUNTRY_INFO!M12>=(COUNTRY_INFO!F12+COUNTRY_INFO!G12),COUNTRY_INFO!F12+COUNTRY_INFO!G12,COUNTRY_INFO!$M12), 0),0)","v":0},0,0,0,0,null,0]
[{"$f":"IF(INTRO!$E$39=\"Non endémique\",\" \",IF(COUNTRY_INFO!A13=0,\" \",COUNTRY_INFO!A13))","v":"NIGER"},{"$f":"IF(INTRO!$E$39=\"Non endémique\",\" \",IF(COUNTRY_INFO!B13=0,\" \",COUNTRY_INFO!B13))","v":"Agadez"},{"$f":"IF(INTRO!$E$39=\"Non endémique\",\" \",IF(COUNTRY_INFO!C13=0,\" \",COUNTRY_INFO!C13))","v":"Bilma"},{"$f":"IF(INTRO!$E$39=\"Non endémique\",0,IF(INTRO!$E$39=\"Endémique mais pas de CP\",IF(COUNTRY_INFO!$H13=1,COUNTRY_INFO!F13+COUNTRY_INFO!G13,0),IF(COUNTRY_INFO!$H13=1,COUNTRY_INFO!F13+COUNTRY_INFO!G13,IF(COUNTRY_INFO!$I13=1,IF(COUNTRY_INFO!M13>=(COUNTRY_INFO!F13+COUNTRY_INFO!G13),COUNTRY_INFO!F13+COUNTRY_INFO!G13,COUNTRY_INFO!$M13),0))))","v":0},{"$f":"IF(AND(INTRO!$E$39=\"Non endémique\",INTRO!$E$37=\"Non endémique\"),\"Non requis\",IF(INTRO!$E$39=\"Non endémique\",\"Traiter avec DEC\",COUNTRY_INFO!V13))","v":0},{"$f":"IF(INTRO!$E$39<>\"Non endémique\",COUNTRY_INFO!W13,\"Non requis\")","v":0},{"$f":"IF(COUNTRY_INFO!H13=1, IF($E13=1,$D13, 0),0)","v":0},{"$f":"IF(COUNTRY_INFO!I13=1, IF(AND(COUNTRY_INFO!$I13=1,$F13<>0),IF(COUNTRY_INFO!M13>=(COUNTRY_INFO!F13+COUNTRY_INFO!G13),COUNTRY_INFO!F13+COUNTRY_INFO!G13,COUNTRY_INFO!$M13), 0),0)","v":0},0,0,0,0,null,0]
[{"$f":"IF(INTRO!$E$39=\"Non endémique\",\" \",IF(COUNTRY_INFO!A14=0,\" \",COUNTRY_INFO!A14))","v":"NIGER"},{"$f":"IF(INTRO!$E$39=\"Non endémique\",\" \",IF(COUNTRY_INFO!B14=0,\" \",COUNTRY_INFO!B14))","v":"Agadez"},{"$f":"IF(INTRO!$E$39=\"Non endémique\",\" \",IF(COUNTRY_INFO!C14=0,\" \",COUNTRY_INFO!C14))","v":"Tchirozérine"},{"$f":"IF(INTRO!$E$39=\"Non endémique\",0,IF(INTRO!$E$39=\"Endémique mais pas de CP\",IF(COUNTRY_INFO!$H14=1,COUNTRY_INFO!F14+COUNTRY_INFO!G14,0),IF(COUNTRY_INFO!$H14=1,COUNTRY_INFO!F14+COUNTRY_INFO!G14,IF(COUNTRY_INFO!$I14=1,IF(COUNTRY_INFO!M14>=(COUNTRY_INFO!F14+COUNTRY_INFO!G14),COUNTRY_INFO!F14+COUNTRY_INFO!G14,COUNTRY_INFO!$M14),0))))","v":0},{"$f":"IF(AND(INTRO!$E$39=\"Non endémique\",INTRO!$E$37=\"Non endémique\"),\"Non requis\",IF(INTRO!$E$39=\"Non endémique\",\"Traiter avec DEC\",COUNTRY_INFO!V14))","v":0},{"$f":"IF(INTRO!$E$39<>\"Non endémique\",COUNTRY_INFO!W14,\"Non requis\")","v":0},{"$f":"IF(COUNTRY_INFO!H14=1, IF($E14=1,$D14, 0),0)","v":0},{"$f":"IF(COUNTRY_INFO!I14=1, IF(AND(COUNTRY_INFO!$I14=1,$F14<>0),IF(COUNTRY_INFO!M14>=(COUNTRY_INFO!F14+COUNTRY_INFO!G14),COUNTRY_INFO!F14+COUNTRY_INFO!G14,COUNTRY_INFO!$M14), 0),0)","v":0},0,0,0,0,null,0]
[{"$f":"IF(INTRO!$E$39=\"Non endémique\",\" \",IF(COUNTRY_INFO!A15=0,\" \",COUNTRY_INFO!A15))","v":"NIGER"},{"$f":"IF(INTRO!$E$39=\"Non endémique\",\" \",IF(COUNTRY_INFO!B15=0,\" \",COUNTRY_INFO!B15))","v":"Agadez"},{"$f":"IF(INTRO!$E$39=\"Non endémique\",\" \",IF(COUNTRY_INFO!C15=0,\" \",COUNTRY_INFO!C15))","v":"Aderbissinat"},{"$f":"IF(INTRO!$E$39=\"Non endémique\",0,IF(INTRO!$E$39=\"Endémique mais pas de CP\",IF(COUNTRY_INFO!$H15=1,COUNTRY_INFO!F15+COUNTRY_INFO!G15,0),IF(COUNTRY_INFO!$H15=1,COUNTRY_INFO!F15+COUNTRY_INFO!G15,IF(COUNTRY_INFO!$I15=1,IF(COUNTRY_INFO!M15>=(COUNTRY_INFO!F15+COUNTRY_INFO!G15),COUNTRY_INFO!F15+COUNTRY_INFO!G15,COUNTRY_INFO!$M15),0))))","v":0},{"$f":"IF(AND(INTRO!$E$39=\"Non endémique\",INTRO!$E$37=\"Non endémique\"),\"Non requis\",IF(INTRO!$E$39=\"Non endémique\",\"Traiter avec DEC\",COUNTRY_INFO!V15))","v":0},{"$f":"IF(INTRO!$E$39<>\"Non endémique\",COUNTRY_INFO!W15,\"Non requis\")","v":0},{"$f":"IF(COUNTRY_INFO!H15=1, IF($E15=1,$D15, 0),0)","v":0},{"$f":"IF(COUNTRY_INFO!I15=1, IF(AND(COUNTRY_INFO!$I15=1,$F15<>0),IF(COUNTRY_INFO!M15>=(COUNTRY_INFO!F15+COUNTRY_INFO!G15),COUNTRY_INFO!F15+COUNTRY_INFO!G15,COUNTRY_INFO!$M15), 0),0)","v":0},0,0,0,0,null,0]
[{"$f":"IF(INTRO!$E$39=\"Non endémique\",\" \",IF(COUNTRY_INFO!A16=0,\" \",COUNTRY_INFO!A16))","v":"NIGER"},{"$f":"IF(INTRO!$E$39=\"Non endémique\",\" \",IF(COUNTRY_INFO!B16=0,\" \",COUNTRY_INFO!B16))","v":"Agadez"},{"$f":"IF(INTRO!$E$39=\"Non endémique\",\" \",IF(COUNTRY_INFO!C16=0,\" \",COUNTRY_INFO!C16))","v":"Ingall"},{"$f":"IF(INTRO!$E$39=\"Non endémique\",0,IF(INTRO!$E$39=\"Endémique mais pas de CP\",IF(COUNTRY_INFO!$H16=1,COUNTRY_INFO!F16+COUNTRY_INFO!G16,0),IF(COUNTRY_INFO!$H16=1,COUNTRY_INFO!F16+COUNTRY_INFO!G16,IF(COUNTRY_INFO!$I16=1,IF(COUNTRY_INFO!M16>=(COUNTRY_INFO!F16+COUNTRY_INFO!G16),COUNTRY_INFO!F16+COUNTRY_INFO!G16,COUNTRY_INFO!$M16),0))))","v":0},{"$f":"IF(AND(INTRO!$E$39=\"Non endémique\",INTRO!$E$37=\"Non endémique\"),\"Non requis\",IF(INTRO!$E$39=\"Non endémique\",\"Traiter avec DEC\",COUNTRY_INFO!V16))","v":0},{"$f":"IF(INTRO!$E$39<>\"Non endémique\",COUNTRY_INFO!W16,\"Non requis\")","v":0},{"$f":"IF(COUNTRY_INFO!H16=1, IF($E16=1,$D16, 0),0)","v":0},{"$f":"IF(COUNTRY_INFO!I16=1, IF(AND(COUNTRY_INFO!$I16=1,$F16<>0),IF(COUNTRY_INFO!M16>=(COUNTRY_INFO!F16+COUNTRY_INFO!G16),COUNTRY_INFO!F16+COUNTRY_INFO!G16,COUNTRY_INFO!$M16), 0),0)","v":0},0,0,0,0,null,0]
[{"$f":"IF(INTRO!$E$39=\"Non endémique\",\" \",IF(COUNTRY_INFO!A17=0,\" \",COUNTRY_INFO!A17))","v":"NIGER"},{"$f":"IF(INTRO!$E$39=\"Non endémique\",\" \",IF(COUNTRY_INFO!B17=0,\" \",COUNTRY_INFO!B17))","v":"Diffa"},{"$f":"IF(INTRO!$E$39=\"Non endémique\",\" \",IF(COUNTRY_INFO!C17=0,\" \",COUNTRY_INFO!C17))","v":"Diffa"},{"$f":"IF(INTRO!$E$39=\"Non endémique\",0,IF(INTRO!$E$39=\"Endémique mais pas de CP\",IF(COUNTRY_INFO!$H17=1,COUNTRY_INFO!F17+COUNTRY_INFO!G17,0),IF(COUNTRY_INFO!$H17=1,COUNTRY_INFO!F17+COUNTRY_INFO!G17,IF(COUNTRY_INFO!$I17=1,IF(COUNTRY_INFO!M17>=(COUNTRY_INFO!F17+COUNTRY_INFO!G17),COUNTRY_INFO!F17+COUNTRY_INFO!G17,COUNTRY_INFO!$M17),0))))","v":0},{"$f":"IF(AND(INTRO!$E$39=\"Non endémique\",INTRO!$E$37=\"Non endémique\"),\"Non requis\",IF(INTRO!$E$39=\"Non endémique\",\"Traiter avec DEC\",COUNTRY_INFO!V17))","v":0},{"$f":"IF(INTRO!$E$39<>\"Non endémique\",COUNTRY_INFO!W17,\"Non requis\")","v":0},{"$f":"IF(COUNTRY_INFO!H17=1, IF($E17=1,$D17, 0),0)","v":0},{"$f":"IF(COUNTRY_INFO!I17=1, IF(AND(COUNTRY_INFO!$I17=1,$F17<>0),IF(COUNTRY_INFO!M17>=(COUNTRY_INFO!F17+COUNTRY_INFO!G17),COUNTRY_INFO!F17+COUNTRY_INFO!G17,COUNTRY_INFO!$M17), 0),0)","v":0},0,0,0,0,null,0]
[{"$f":"IF(INTRO!$E$39=\"Non endémique\",\" \",IF(COUNTRY_INFO!A18=0,\" \",COUNTRY_INFO!A18))","v":"NIGER"},{"$f":"IF(INTRO!$E$39=\"Non endémique\",\" \",IF(COUNTRY_INFO!B18=0,\" \",COUNTRY_INFO!B18))","v":"Diffa"},{"$f":"IF(INTRO!$E$39=\"Non endémique\",\" \",IF(COUNTRY_INFO!C18=0,\" \",COUNTRY_INFO!C18))","v":"Bosso"},{"$f":"IF(INTRO!$E$39=\"Non endémique\",0,IF(INTRO!$E$39=\"Endémique mais pas de CP\",IF(COUNTRY_INFO!$H18=1,COUNTRY_INFO!F18+COUNTRY_INFO!G18,0),IF(COUNTRY_INFO!$H18=1,COUNTRY_INFO!F18+COUNTRY_INFO!G18,IF(COUNTRY_INFO!$I18=1,IF(COUNTRY_INFO!M18>=(COUNTRY_INFO!F18+COUNTRY_INFO!G18),COUNTRY_INFO!F18+COUNTRY_INFO!G18,COUNTRY_INFO!$M18),0))))","v":0},{"$f":"IF(AND(INTRO!$E$39=\"Non endémique\",INTRO!$E$37=\"Non endémique\"),\"Non requis\",IF(INTRO!$E$39=\"Non endémique\",\"Traiter avec DEC\",COUNTRY_INFO!V18))","v":0},{"$f":"IF(INTRO!$E$39<>\"Non endémique\",COUNTRY_INFO!W18,\"Non requis\")","v":0},{"$f":"IF(COUNTRY_INFO!H18=1, IF($E18=1,$D18, 0),0)","v":0},{"$f":"IF(COUNTRY_INFO!I18=1, IF(AND(COUNTRY_INFO!$I18=1,$F18<>0),IF(COUNTRY_INFO!M18>=(COUNTRY_INFO!F18+COUNTRY_INFO!G18),COUNTRY_INFO!F18+COUNTRY_INFO!G18,COUNTRY_INFO!$M18), 0),0)","v":0},0,0,0,0,null,0]
[{"$f":"IF(INTRO!$E$39=\"Non endémique\",\" \",IF(COUNTRY_INFO!A19=0,\" \",COUNTRY_INFO!A19))","v":"NIGER"},{"$f":"IF(INTRO!$E$39=\"Non endémique\",\" \",IF(COUNTRY_INFO!B19=0,\" \",COUNTRY_INFO!B19))","v":"Diffa"},{"$f":"IF(INTRO!$E$39=\"Non endémique\",\" \",IF(COUNTRY_INFO!C19=0,\" \",COUNTRY_INFO!C19))","v":"Mainé Soroa"},{"$f":"IF(INTRO!$E$39=\"Non endémique\",0,IF(INTRO!$E$39=\"Endémique mais pas de CP\",IF(COUNTRY_INFO!$H19=1,COUNTRY_INFO!F19+COUNTRY_INFO!G19,0),IF(COUNTRY_INFO!$H19=1,COUNTRY_INFO!F19+COUNTRY_INFO!G19,IF(COUNTRY_INFO!$I19=1,IF(COUNTRY_INFO!M19>=(COUNTRY_INFO!F19+COUNTRY_INFO!G19),COUNTRY_INFO!F19+COUNTRY_INFO!G19,COUNTRY_INFO!$M19),0))))","v":0},{"$f":"IF(AND(INTRO!$E$39=\"Non endémique\",INTRO!$E$37=\"Non endémique\"),\"Non requis\",IF(INTRO!$E$39=\"Non endémique\",\"Traiter avec DEC\",COUNTRY_INFO!V19))","v":0},{"$f":"IF(INTRO!$E$39<>\"Non endémique\",COUNTRY_INFO!W19,\"Non requis\")","v":0},{"$f":"IF(COUNTRY_INFO!H19=1, IF($E19=1,$D19, 0),0)","v":0},{"$f":"IF(COUNTRY_INFO!I19=1, IF(AND(COUNTRY_INFO!$I19=1,$F19<>0),IF(COUNTRY_INFO!M19>=(COUNTRY_INFO!F19+COUNTRY_INFO!G19),COUNTRY_INFO!F19+COUNTRY_INFO!G19,COUNTRY_INFO!$M19), 0),0)","v":0},0,0,0,0,null,0]
[{"$f":"IF(INTRO!$E$39=\"Non endémique\",\" \",IF(COUNTRY_INFO!A20=0,\" \",COUNTRY_INFO!A20))","v":"NIGER"},{"$f":"IF(INTRO!$E$39=\"Non endémique\",\" \",IF(COUNTRY_INFO!B20=0,\" \",COUNTRY_INFO!B20))","v":"Diffa"},{"$f":"IF(INTRO!$E$39=\"Non endémique\",\" \",IF(COUNTRY_INFO!C20=0,\" \",COUNTRY_INFO!C20))","v":"Goudoumaria"},{"$f":"IF(INTRO!$E$39=\"Non endémique\",0,IF(INTRO!$E$39=\"Endémique mais pas de CP\",IF(COUNTRY_INFO!$H20=1,COUNTRY_INFO!F20+COUNTRY_INFO!G20,0),IF(COUNTRY_INFO!$H20=1,COUNTRY_INFO!F20+COUNTRY_INFO!G20,IF(COUNTRY_INFO!$I20=1,IF(COUNTRY_INFO!M20>=(COUNTRY_INFO!F20+COUNTRY_INFO!G20),COUNTRY_INFO!F20+COUNTRY_INFO!G20,COUNTRY_INFO!$M20),0))))","v":0},{"$f":"IF(AND(INTRO!$E$39=\"Non endémique\",INTRO!$E$37=\"Non endémique\"),\"Non requis\",IF(INTRO!$E$39=\"Non endémique\",\"Traiter avec DEC\",COUNTRY_INFO!V20))","v":0},{"$f":"IF(INTRO!$E$39<>\"Non endémique\",COUNTRY_INFO!W20,\"Non requis\")","v":0},{"$f":"IF(COUNTRY_INFO!H20=1, IF($E20=1,$D20, 0),0)","v":0},{"$f":"IF(COUNTRY_INFO!I20=1, IF(AND(COUNTRY_INFO!$I20=1,$F20<>0),IF(COUNTRY_INFO!M20>=(COUNTRY_INFO!F20+COUNTRY_INFO!G20),COUNTRY_INFO!F20+COUNTRY_INFO!G20,COUNTRY_INFO!$M20), 0),0)","v":0},0,0,0,0,null,0]
[{"$f":"IF(INTRO!$E$39=\"Non endémique\",\" \",IF(COUNTRY_INFO!A21=0,\" \",COUNTRY_INFO!A21))","v":"NIGER"},{"$f":"IF(INTRO!$E$39=\"Non endémique\",\" \",IF(COUNTRY_INFO!B21=0,\" \",COUNTRY_INFO!B21))","v":"Diffa"},{"$f":"IF(INTRO!$E$39=\"Non endémique\",\" \",IF(COUNTRY_INFO!C21=0,\" \",COUNTRY_INFO!C21))","v":"N'Guigmi"},{"$f":"IF(INTRO!$E$39=\"Non endémique\",0,IF(INTRO!$E$39=\"Endémique mais pas de CP\",IF(COUNTRY_INFO!$H21=1,COUNTRY_INFO!F21+COUNTRY_INFO!G21,0),IF(COUNTRY_INFO!$H21=1,COUNTRY_INFO!F21+COUNTRY_INFO!G21,IF(COUNTRY_INFO!$I21=1,IF(COUNTRY_INFO!M21>=(COUNTRY_INFO!F21+COUNTRY_INFO!G21),COUNTRY_INFO!F21+COUNTRY_INFO!G21,COUNTRY_INFO!$M21),0))))","v":0},{"$f":"IF(AND(INTRO!$E$39=\"Non endémique\",INTRO!$E$37=\"Non endémique\"),\"Non requis\",IF(INTRO!$E$39=\"Non endémique\",\"Traiter avec DEC\",COUNTRY_INFO!V21))","v":0},{"$f":"IF(INTRO!$E$39<>\"Non endémique\",COUNTRY_INFO!W21,\"Non requis\")","v":0},{"$f":"IF(COUNTRY_INFO!H21=1, IF($E21=1,$D21, 0),0)","v":0},{"$f":"IF(COUNTRY_INFO!I21=1, IF(AND(COUNTRY_INFO!$I21=1,$F21<>0),IF(COUNTRY_INFO!M21>=(COUNTRY_INFO!F21+COUNTRY_INFO!G21),COUNTRY_INFO!F21+COUNTRY_INFO!G21,COUNTRY_INFO!$M21), 0),0)","v":0},0,0,0,0,null,0]
[{"$f":"IF(INTRO!$E$39=\"Non endémique\",\" \",IF(COUNTRY_INFO!A22=0,\" \",COUNTRY_INFO!A22))","v":"NIGER"},{"$f":"IF(INTRO!$E$39=\"Non endémique\",\" \",IF(COUNTRY_INFO!B22=0,\" \",COUNTRY_INFO!B22))","v":"Diffa"},{"$f":"IF(INTRO!$E$39=\"Non endémique\",\" \",IF(COUNTRY_INFO!C22=0,\" \",COUNTRY_INFO!C22))","v":"N'Gourti"},{"$f":"IF(INTRO!$E$39=\"Non endémique\",0,IF(INTRO!$E$39=\"Endémique mais pas de CP\",IF(COUNTRY_INFO!$H22=1,COUNTRY_INFO!F22+COUNTRY_INFO!G22,0),IF(COUNTRY_INFO!$H22=1,COUNTRY_INFO!F22+COUNTRY_INFO!G22,IF(COUNTRY_INFO!$I22=1,IF(COUNTRY_INFO!M22>=(COUNTRY_INFO!F22+COUNTRY_INFO!G22),COUNTRY_INFO!F22+COUNTRY_INFO!G22,COUNTRY_INFO!$M22),0))))","v":0},{"$f":"IF(AND(INTRO!$E$39=\"Non endémique\",INTRO!$E$37=\"Non endémique\"),\"Non requis\",IF(INTRO!$E$39=\"Non endémique\",\"Traiter avec DEC\",COUNTRY_INFO!V22))","v":0},{"$f":"IF(INTRO!$E$39<>\"Non endémique\",COUNTRY_INFO!W22,\"Non requis\")","v":0},{"$f":"IF(COUNTRY_INFO!H22=1, IF($E22=1,$D22, 0),0)","v":0},{"$f":"IF(COUNTRY_INFO!I22=1, IF(AND(COUNTRY_INFO!$I22=1,$F22<>0),IF(COUNTRY_INFO!M22>=(COUNTRY_INFO!F22+COUNTRY_INFO!G22),COUNTRY_INFO!F22+COUNTRY_INFO!G22,COUNTRY_INFO!$M22), 0),0)","v":0},0,0,0,0,null,0]
[{"$f":"IF(INTRO!$E$39=\"Non endémique\",\" \",IF(COUNTRY_INFO!A23=0,\" \",COUNTRY_INFO!A23))","v":"NIGER"},{"$f":"IF(INTRO!$E$39=\"Non endémique\",\" \",IF(COUNTRY_INFO!B23=0,\" \",COUNTRY_INFO!B23))","v":"Dosso"},{"$f":"IF(INTRO!$E$39=\"Non endémique\",\" \",IF(COUNTRY_INFO!C23=0,\" \",COUNTRY_INFO!C23))","v":"Boboye"},{"$f":"IF(INTRO!$E$39=\"Non endémique\",0,IF(INTRO!$E$39=\"Endémique mais pas de CP\",IF(COUNTRY_INFO!$H23=1,COUNTRY_INFO!F23+COUNTRY_INFO!G23,0),IF(COUNTRY_INFO!$H23=1,COUNTRY_INFO!F23+COUNTRY_INFO!G23,IF(COUNTRY_INFO!$I23=1,IF(COUNTRY_INFO!M23>=(COUNTRY_INFO!F23+COUNTRY_INFO!G23),COUNTRY_INFO!F23+COUNTRY_INFO!G23,COUNTRY_INFO!$M23),0))))","v":0},{"$f":"IF(AND(INTRO!$E$39=\"Non endémique\",INTRO!$E$37=\"Non endémique\"),\"Non requis\",IF(INTRO!$E$39=\"Non endémique\",\"Traiter avec DEC\",COUNTRY_INFO!V23))","v":0},{"$f":"IF(INTRO!$E$39<>\"Non endémique\",COUNTRY_INFO!W23,\"Non requis\")","v":0},{"$f":"IF(COUNTRY_INFO!H23=1, IF($E23=1,$D23, 0),0)","v":0},{"$f":"IF(COUNTRY_INFO!I23=1, IF(AND(COUNTRY_INFO!$I23=1,$F23<>0),IF(COUNTRY_INFO!M23>=(COUNTRY_INFO!F23+COUNTRY_INFO!G23),COUNTRY_INFO!F23+COUNTRY_INFO!G23,COUNTRY_INFO!$M23), 0),0)","v":0},0,0,0,0,null,0]
[{"$f":"IF(INTRO!$E$39=\"Non endémique\",\" \",IF(COUNTRY_INFO!A24=0,\" \",COUNTRY_INFO!A24))","v":"NIGER"},{"$f":"IF(INTRO!$E$39=\"Non endémique\",\" \",IF(COUNTRY_INFO!B24=0,\" \",COUNTRY_INFO!B24))","v":"Dosso"},{"$f":"IF(INTRO!$E$39=\"Non endémique\",\" \",IF(COUNTRY_INFO!C24=0,\" \",COUNTRY_INFO!C24))","v":"Falmey"},{"$f":"IF(INTRO!$E$39=\"Non endémique\",0,IF(INTRO!$E$39=\"Endémique mais pas de CP\",IF(COUNTRY_INFO!$H24=1,COUNTRY_INFO!F24+COUNTRY_INFO!G24,0),IF(COUNTRY_INFO!$H24=1,COUNTRY_INFO!F24+COUNTRY_INFO!G24,IF(COUNTRY_INFO!$I24=1,IF(COUNTRY_INFO!M24>=(COUNTRY_INFO!F24+COUNTRY_INFO!G24),COUNTRY_INFO!F24+COUNTRY_INFO!G24,COUNTRY_INFO!$M24),0))))","v":0},{"$f":"IF(AND(INTRO!$E$39=\"Non endémique\",INTRO!$E$37=\"Non endémique\"),\"Non requis\",IF(INTRO!$E$39=\"Non endémique\",\"Traiter avec DEC\",COUNTRY_INFO!V24))","v":0},{"$f":"IF(INTRO!$E$39<>\"Non endémique\",COUNTRY_INFO!W24,\"Non requis\")","v":0},{"$f":"IF(COUNTRY_INFO!H24=1, IF($E24=1,$D24, 0),0)","v":0},{"$f":"IF(COUNTRY_INFO!I24=1, IF(AND(COUNTRY_INFO!$I24=1,$F24<>0),IF(COUNTRY_INFO!M24>=(COUNTRY_INFO!F24+COUNTRY_INFO!G24),COUNTRY_INFO!F24+COUNTRY_INFO!G24,COUNTRY_INFO!$M24), 0),0)","v":0},0,0,0,0,null,0]
[{"$f":"IF(INTRO!$E$39=\"Non endémique\",\" \",IF(COUNTRY_INFO!A25=0,\" \",COUNTRY_INFO!A25))","v":"NIGER"},{"$f":"IF(INTRO!$E$39=\"Non endémique\",\" \",IF(COUNTRY_INFO!B25=0,\" \",COUNTRY_INFO!B25))","v":"Dosso"},{"$f":"IF(INTRO!$E$39=\"Non endémique\",\" \",IF(COUNTRY_INFO!C25=0,\" \",COUNTRY_INFO!C25))","v":"Dosso"},{"$f":"IF(INTRO!$E$39=\"Non endémique\",0,IF(INTRO!$E$39=\"Endémique mais pas de CP\",IF(COUNTRY_INFO!$H25=1,COUNTRY_INFO!F25+COUNTRY_INFO!G25,0),IF(COUNTRY_INFO!$H25=1,COUNTRY_INFO!F25+COUNTRY_INFO!G25,IF(COUNTRY_INFO!$I25=1,IF(COUNTRY_INFO!M25>=(COUNTRY_INFO!F25+COUNTRY_INFO!G25),COUNTRY_INFO!F25+COUNTRY_INFO!G25,COUNTRY_INFO!$M25),0))))","v":0},{"$f":"IF(AND(INTRO!$E$39=\"Non endémique\",INTRO!$E$37=\"Non endémique\"),\"Non requis\",IF(INTRO!$E$39=\"Non endémique\",\"Traiter avec DEC\",COUNTRY_INFO!V25))","v":0},{"$f":"IF(INTRO!$E$39<>\"Non endémique\",COUNTRY_INFO!W25,\"Non requis\")","v":0},{"$f":"IF(COUNTRY_INFO!H25=1, IF($E25=1,$D25, 0),0)","v":0},{"$f":"IF(COUNTRY_INFO!I25=1, IF(AND(COUNTRY_INFO!$I25=1,$F25<>0),IF(COUNTRY_INFO!M25>=(COUNTRY_INFO!F25+COUNTRY_INFO!G25),COUNTRY_INFO!F25+COUNTRY_INFO!G25,COUNTRY_INFO!$M25), 0),0)","v":0},0,0,0,0,null,0]
[{"$f":"IF(INTRO!$E$39=\"Non endémique\",\" \",IF(COUNTRY_INFO!A26=0,\" \",COUNTRY_INFO!A26))","v":"NIGER"},{"$f":"IF(INTRO!$E$39=\"Non endémique\",\" \",IF(COUNTRY_INFO!B26=0,\" \",COUNTRY_INFO!B26))","v":"Dosso"},{"$f":"IF(INTRO!$E$39=\"Non endémique\",\" \",IF(COUNTRY_INFO!C26=0,\" \",COUNTRY_INFO!C26))","v":"Doutchi"},{"$f":"IF(INTRO!$E$39=\"Non endémique\",0,IF(INTRO!$E$39=\"Endémique mais pas de CP\",IF(COUNTRY_INFO!$H26=1,COUNTRY_INFO!F26+COUNTRY_INFO!G26,0),IF(COUNTRY_INFO!$H26=1,COUNTRY_INFO!F26+COUNTRY_INFO!G26,IF(COUNTRY_INFO!$I26=1,IF(COUNTRY_INFO!M26>=(COUNTRY_INFO!F26+COUNTRY_INFO!G26),COUNTRY_INFO!F26+COUNTRY_INFO!G26,COUNTRY_INFO!$M26),0))))","v":0},{"$f":"IF(AND(INTRO!$E$39=\"Non endémique\",INTRO!$E$37=\"Non endémique\"),\"Non requis\",IF(INTRO!$E$39=\"Non endémique\",\"Traiter avec DEC\",COUNTRY_INFO!V26))","v":0},{"$f":"IF(INTRO!$E$39<>\"Non endémique\",COUNTRY_INFO!W26,\"Non requis\")","v":0},{"$f":"IF(COUNTRY_INFO!H26=1, IF($E26=1,$D26, 0),0)","v":0},{"$f":"IF(COUNTRY_INFO!I26=1, IF(AND(COUNTRY_INFO!$I26=1,$F26<>0),IF(COUNTRY_INFO!M26>=(COUNTRY_INFO!F26+COUNTRY_INFO!G26),COUNTRY_INFO!F26+COUNTRY_INFO!G26,COUNTRY_INFO!$M26), 0),0)","v":0},0,0,0,0,null,0]
[{"$f":"IF(INTRO!$E$39=\"Non endémique\",\" \",IF(COUNTRY_INFO!A27=0,\" \",COUNTRY_INFO!A27))","v":"NIGER"},{"$f":"IF(INTRO!$E$39=\"Non endémique\",\" \",IF(COUNTRY_INFO!B27=0,\" \",COUNTRY_INFO!B27))","v":"Dosso"},{"$f":"IF(INTRO!$E$39=\"Non endémique\",\" \",IF(COUNTRY_INFO!C27=0,\" \",COUNTRY_INFO!C27))","v":"Tibiri(Doutchi)"},{"$f":"IF(INTRO!$E$39=\"Non endémique\",0,IF(INTRO!$E$39=\"Endémique mais pas de CP\",IF(COUNTRY_INFO!$H27=1,COUNTRY_INFO!F27+COUNTRY_INFO!G27,0),IF(COUNTRY_INFO!$H27=1,COUNTRY_INFO!F27+COUNTRY_INFO!G27,IF(COUNTRY_INFO!$I27=1,IF(COUNTRY_INFO!M27>=(COUNTRY_INFO!F27+COUNTRY_INFO!G27),COUNTRY_INFO!F27+COUNTRY_INFO!G27,COUNTRY_INFO!$M27),0))))","v":0},{"$f":"IF(AND(INTRO!$E$39=\"Non endémique\",INTRO!$E$37=\"Non endémique\"),\"Non requis\",IF(INTRO!$E$39=\"Non endémique\",\"Traiter avec DEC\",COUNTRY_INFO!V27))","v":0},{"$f":"IF(INTRO!$E$39<>\"Non endémique\",COUNTRY_INFO!W27,\"Non requis\")","v":0},{"$f":"IF(COUNTRY_INFO!H27=1, IF($E27=1,$D27, 0),0)","v":0},{"$f":"IF(COUNTRY_INFO!I27=1, IF(AND(COUNTRY_INFO!$I27=1,$F27<>0),IF(COUNTRY_INFO!M27>=(COUNTRY_INFO!F27+COUNTRY_INFO!G27),COUNTRY_INFO!F27+COUNTRY_INFO!G27,COUNTRY_INFO!$M27), 0),0)","v":0},0,0,0,0,null,0]
[{"$f":"IF(INTRO!$E$39=\"Non endémique\",\" \",IF(COUNTRY_INFO!A28=0,\" \",COUNTRY_INFO!A28))","v":"NIGER"},{"$f":"IF(INTRO!$E$39=\"Non endémique\",\" \",IF(COUNTRY_INFO!B28=0,\" \",COUNTRY_INFO!B28))","v":"Dosso"},{"$f":"IF(INTRO!$E$39=\"Non endémique\",\" \",IF(COUNTRY_INFO!C28=0,\" \",COUNTRY_INFO!C28))","v":"Gaya"},{"$f":"IF(INTRO!$E$39=\"Non endémique\",0,IF(INTRO!$E$39=\"Endémique mais pas de CP\",IF(COUNTRY_INFO!$H28=1,COUNTRY_INFO!F28+COUNTRY_INFO!G28,0),IF(COUNTRY_INFO!$H28=1,COUNTRY_INFO!F28+COUNTRY_INFO!G28,IF(COUNTRY_INFO!$I28=1,IF(COUNTRY_INFO!M28>=(COUNTRY_INFO!F28+COUNTRY_INFO!G28),COUNTRY_INFO!F28+COUNTRY_INFO!G28,COUNTRY_INFO!$M28),0))))","v":0},{"$f":"IF(AND(INTRO!$E$39=\"Non endémique\",INTRO!$E$37=\"Non endémique\"),\"Non requis\",IF(INTRO!$E$39=\"Non endémique\",\"Traiter avec DEC\",COUNTRY_INFO!V28))","v":0},{"$f":"IF(INTRO!$E$39<>\"Non endémique\",COUNTRY_INFO!W28,\"Non requis\")","v":0},{"$f":"IF(COUNTRY_INFO!H28=1, IF($E28=1,$D28, 0),0)","v":0},{"$f":"IF(COUNTRY_INFO!I28=1, IF(AND(COUNTRY_INFO!$I28=1,$F28<>0),IF(COUNTRY_INFO!M28>=(COUNTRY_INFO!F28+COUNTRY_INFO!G28),COUNTRY_INFO!F28+COUNTRY_INFO!G28,COUNTRY_INFO!$M28), 0),0)","v":0},0,0,0,0,null,0]
[{"$f":"IF(INTRO!$E$39=\"Non endémique\",\" \",IF(COUNTRY_INFO!A29=0,\" \",COUNTRY_INFO!A29))","v":"NIGER"},{"$f":"IF(INTRO!$E$39=\"Non endémique\",\" \",IF(COUNTRY_INFO!B29=0,\" \",COUNTRY_INFO!B29))","v":"Dosso"},{"$f":"IF(INTRO!$E$39=\"Non endémique\",\" \",IF(COUNTRY_INFO!C29=0,\" \",COUNTRY_INFO!C29))","v":"Dioundiou"},{"$f":"IF(INTRO!$E$39=\"Non endémique\",0,IF(INTRO!$E$39=\"Endémique mais pas de CP\",IF(COUNTRY_INFO!$H29=1,COUNTRY_INFO!F29+COUNTRY_INFO!G29,0),IF(COUNTRY_INFO!$H29=1,COUNTRY_INFO!F29+COUNTRY_INFO!G29,IF(COUNTRY_INFO!$I29=1,IF(COUNTRY_INFO!M29>=(COUNTRY_INFO!F29+COUNTRY_INFO!G29),COUNTRY_INFO!F29+COUNTRY_INFO!G29,COUNTRY_INFO!$M29),0))))","v":0},{"$f":"IF(AND(INTRO!$E$39=\"Non endémique\",INTRO!$E$37=\"Non endémique\"),\"Non requis\",IF(INTRO!$E$39=\"Non endémique\",\"Traiter avec DEC\",COUNTRY_INFO!V29))","v":0},{"$f":"IF(INTRO!$E$39<>\"Non endémique\",COUNTRY_INFO!W29,\"Non requis\")","v":0},{"$f":"IF(COUNTRY_INFO!H29=1, IF($E29=1,$D29, 0),0)","v":0},{"$f":"IF(COUNTRY_INFO!I29=1, IF(AND(COUNTRY_INFO!$I29=1,$F29<>0),IF(COUNTRY_INFO!M29>=(COUNTRY_INFO!F29+COUNTRY_INFO!G29),COUNTRY_INFO!F29+COUNTRY_INFO!G29,COUNTRY_INFO!$M29), 0),0)","v":0},0,0,0,0,null,0]
[{"$f":"IF(INTRO!$E$39=\"Non endémique\",\" \",IF(COUNTRY_INFO!A30=0,\" \",COUNTRY_INFO!A30))","v":"NIGER"},{"$f":"IF(INTRO!$E$39=\"Non endémique\",\" \",IF(COUNTRY_INFO!B30=0,\" \",COUNTRY_INFO!B30))","v":"Dosso"},{"$f":"IF(INTRO!$E$39=\"Non endémique\",\" \",IF(COUNTRY_INFO!C30=0,\" \",COUNTRY_INFO!C30))","v":"Loga"},{"$f":"IF(INTRO!$E$39=\"Non endémique\",0,IF(INTRO!$E$39=\"Endémique mais pas de CP\",IF(COUNTRY_INFO!$H30=1,COUNTRY_INFO!F30+COUNTRY_INFO!G30,0),IF(COUNTRY_INFO!$H30=1,COUNTRY_INFO!F30+COUNTRY_INFO!G30,IF(COUNTRY_INFO!$I30=1,IF(COUNTRY_INFO!M30>=(COUNTRY_INFO!F30+COUNTRY_INFO!G30),COUNTRY_INFO!F30+COUNTRY_INFO!G30,COUNTRY_INFO!$M30),0))))","v":0},{"$f":"IF(AND(INTRO!$E$39=\"Non endémique\",INTRO!$E$37=\"Non endémique\"),\"Non requis\",IF(INTRO!$E$39=\"Non endémique\",\"Traiter avec DEC\",COUNTRY_INFO!V30))","v":0},{"$f":"IF(INTRO!$E$39<>\"Non endémique\",COUNTRY_INFO!W30,\"Non requis\")","v":0},{"$f":"IF(COUNTRY_INFO!H30=1, IF($E30=1,$D30, 0),0)","v":0},{"$f":"IF(COUNTRY_INFO!I30=1, IF(AND(COUNTRY_INFO!$I30=1,$F30<>0),IF(COUNTRY_INFO!M30>=(COUNTRY_INFO!F30+COUNTRY_INFO!G30),COUNTRY_INFO!F30+COUNTRY_INFO!G30,COUNTRY_INFO!$M30), 0),0)","v":0},0,0,0,0,null,0]
[{"$f":"IF(INTRO!$E$39=\"Non endémique\",\" \",IF(COUNTRY_INFO!A31=0,\" \",COUNTRY_INFO!A31))","v":"NIGER"},{"$f":"IF(INTRO!$E$39=\"Non endémique\",\" \",IF(COUNTRY_INFO!B31=0,\" \",COUNTRY_INFO!B31))","v":"Maradi"},{"$f":"IF(INTRO!$E$39=\"Non endémique\",\" \",IF(COUNTRY_INFO!C31=0,\" \",COUNTRY_INFO!C31))","v":"Aguié"},{"$f":"IF(INTRO!$E$39=\"Non endémique\",0,IF(INTRO!$E$39=\"Endémique mais pas de CP\",IF(COUNTRY_INFO!$H31=1,COUNTRY_INFO!F31+COUNTRY_INFO!G31,0),IF(COUNTRY_INFO!$H31=1,COUNTRY_INFO!F31+COUNTRY_INFO!G31,IF(COUNTRY_INFO!$I31=1,IF(COUNTRY_INFO!M31>=(COUNTRY_INFO!F31+COUNTRY_INFO!G31),COUNTRY_INFO!F31+COUNTRY_INFO!G31,COUNTRY_INFO!$M31),0))))","v":0},{"$f":"IF(AND(INTRO!$E$39=\"Non endémique\",INTRO!$E$37=\"Non endémique\"),\"Non requis\",IF(INTRO!$E$39=\"Non endémique\",\"Traiter avec DEC\",COUNTRY_INFO!V31))","v":0},{"$f":"IF(INTRO!$E$39<>\"Non endémique\",COUNTRY_INFO!W31,\"Non requis\")","v":0},{"$f":"IF(COUNTRY_INFO!H31=1, IF($E31=1,$D31, 0),0)","v":0},{"$f":"IF(COUNTRY_INFO!I31=1, IF(AND(COUNTRY_INFO!$I31=1,$F31<>0),IF(COUNTRY_INFO!M31>=(COUNTRY_INFO!F31+COUNTRY_INFO!G31),COUNTRY_INFO!F31+COUNTRY_INFO!G31,COUNTRY_INFO!$M31), 0),0)","v":0},0,0,0,0,null,0]
[{"$f":"IF(INTRO!$E$39=\"Non endémique\",\" \",IF(COUNTRY_INFO!A32=0,\" \",COUNTRY_INFO!A32))","v":"NIGER"},{"$f":"IF(INTRO!$E$39=\"Non endémique\",\" \",IF(COUNTRY_INFO!B32=0,\" \",COUNTRY_INFO!B32))","v":"Maradi"},{"$f":"IF(INTRO!$E$39=\"Non endémique\",\" \",IF(COUNTRY_INFO!C32=0,\" \",COUNTRY_INFO!C32))","v":"Gazaoua"},{"$f":"IF(INTRO!$E$39=\"Non endémique\",0,IF(INTRO!$E$39=\"Endémique mais pas de CP\",IF(COUNTRY_INFO!$H32=1,COUNTRY_INFO!F32+COUNTRY_INFO!G32,0),IF(COUNTRY_INFO!$H32=1,COUNTRY_INFO!F32+COUNTRY_INFO!G32,IF(COUNTRY_INFO!$I32=1,IF(COUNTRY_INFO!M32>=(COUNTRY_INFO!F32+COUNTRY_INFO!G32),COUNTRY_INFO!F32+COUNTRY_INFO!G32,COUNTRY_INFO!$M32),0))))","v":0},{"$f":"IF(AND(INTRO!$E$39=\"Non endémique\",INTRO!$E$37=\"Non endémique\"),\"Non requis\",IF(INTRO!$E$39=\"Non endémique\",\"Traiter avec DEC\",COUNTRY_INFO!V32))","v":0},{"$f":"IF(INTRO!$E$39<>\"Non endémique\",COUNTRY_INFO!W32,\"Non requis\")","v":0},{"$f":"IF(COUNTRY_INFO!H32=1, IF($E32=1,$D32, 0),0)","v":0},{"$f":"IF(COUNTRY_INFO!I32=1, IF(AND(COUNTRY_INFO!$I32=1,$F32<>0),IF(COUNTRY_INFO!M32>=(COUNTRY_INFO!F32+COUNTRY_INFO!G32),COUNTRY_INFO!F32+COUNTRY_INFO!G32,COUNTRY_INFO!$M32), 0),0)","v":0},0,0,0,0,null,0]
[{"$f":"IF(INTRO!$E$39=\"Non endémique\",\" \",IF(COUNTRY_INFO!A33=0,\" \",COUNTRY_INFO!A33))","v":"NIGER"},{"$f":"IF(INTRO!$E$39=\"Non endémique\",\" \",IF(COUNTRY_INFO!B33=0,\" \",COUNTRY_INFO!B33))","v":"Maradi"},{"$f":"IF(INTRO!$E$39=\"Non endémique\",\" \",IF(COUNTRY_INFO!C33=0,\" \",COUNTRY_INFO!C33))","v":"Dakoro"},{"$f":"IF(INTRO!$E$39=\"Non endémique\",0,IF(INTRO!$E$39=\"Endémique mais pas de CP\",IF(COUNTRY_INFO!$H33=1,COUNTRY_INFO!F33+COUNTRY_INFO!G33,0),IF(COUNTRY_INFO!$H33=1,COUNTRY_INFO!F33+COUNTRY_INFO!G33,IF(COUNTRY_INFO!$I33=1,IF(COUNTRY_INFO!M33>=(COUNTRY_INFO!F33+COUNTRY_INFO!G33),COUNTRY_INFO!F33+COUNTRY_INFO!G33,COUNTRY_INFO!$M33),0))))","v":0},{"$f":"IF(AND(INTRO!$E$39=\"Non endémique\",INTRO!$E$37=\"Non endémique\"),\"Non requis\",IF(INTRO!$E$39=\"Non endémique\",\"Traiter avec DEC\",COUNTRY_INFO!V33))","v":0},{"$f":"IF(INTRO!$E$39<>\"Non endémique\",COUNTRY_INFO!W33,\"Non requis\")","v":0},{"$f":"IF(COUNTRY_INFO!H33=1, IF($E33=1,$D33, 0),0)","v":0},{"$f":"IF(COUNTRY_INFO!I33=1, IF(AND(COUNTRY_INFO!$I33=1,$F33<>0),IF(COUNTRY_INFO!M33>=(COUNTRY_INFO!F33+COUNTRY_INFO!G33),COUNTRY_INFO!F33+COUNTRY_INFO!G33,COUNTRY_INFO!$M33), 0),0)","v":0},0,0,0,0,null,0]
[{"$f":"IF(INTRO!$E$39=\"Non endémique\",\" \",IF(COUNTRY_INFO!A34=0,\" \",COUNTRY_INFO!A34))","v":"NIGER"},{"$f":"IF(INTRO!$E$39=\"Non endémique\",\" \",IF(COUNTRY_INFO!B34=0,\" \",COUNTRY_INFO!B34))","v":"Maradi"},{"$f":"IF(INTRO!$E$39=\"Non endémique\",\" \",IF(COUNTRY_INFO!C34=0,\" \",COUNTRY_INFO!C34))","v":"Bermo"},{"$f":"IF(INTRO!$E$39=\"Non endémique\",0,IF(INTRO!$E$39=\"Endémique mais pas de CP\",IF(COUNTRY_INFO!$H34=1,COUNTRY_INFO!F34+COUNTRY_INFO!G34,0),IF(COUNTRY_INFO!$H34=1,COUNTRY_INFO!F34+COUNTRY_INFO!G34,IF(COUNTRY_INFO!$I34=1,IF(COUNTRY_INFO!M34>=(COUNTRY_INFO!F34+COUNTRY_INFO!G34),COUNTRY_INFO!F34+COUNTRY_INFO!G34,COUNTRY_INFO!$M34),0))))","v":0},{"$f":"IF(AND(INTRO!$E$39=\"Non endémique\",INTRO!$E$37=\"Non endémique\"),\"Non requis\",IF(INTRO!$E$39=\"Non endémique\",\"Traiter avec DEC\",COUNTRY_INFO!V34))","v":0},{"$f":"IF(INTRO!$E$39<>\"Non endémique\",COUNTRY_INFO!W34,\"Non requis\")","v":0},{"$f":"IF(COUNTRY_INFO!H34=1, IF($E34=1,$D34, 0),0)","v":0},{"$f":"IF(COUNTRY_INFO!I34=1, IF(AND(COUNTRY_INFO!$I34=1,$F34<>0),IF(COUNTRY_INFO!M34>=(COUNTRY_INFO!F34+COUNTRY_INFO!G34),COUNTRY_INFO!F34+COUNTRY_INFO!G34,COUNTRY_INFO!$M34), 0),0)","v":0},0,0,0,0,null,0]
[{"$f":"IF(INTRO!$E$39=\"Non endémique\",\" \",IF(COUNTRY_INFO!A35=0,\" \",COUNTRY_INFO!A35))","v":"NIGER"},{"$f":"IF(INTRO!$E$39=\"Non endémique\",\" \",IF(COUNTRY_INFO!B35=0,\" \",COUNTRY_INFO!B35))","v":"Maradi"},{"$f":"IF(INTRO!$E$39=\"Non endémique\",\" \",IF(COUNTRY_INFO!C35=0,\" \",COUNTRY_INFO!C35))","v":"Guidan Roumdji"},{"$f":"IF(INTRO!$E$39=\"Non endémique\",0,IF(INTRO!$E$39=\"Endémique mais pas de CP\",IF(COUNTRY_INFO!$H35=1,COUNTRY_INFO!F35+COUNTRY_INFO!G35,0),IF(COUNTRY_INFO!$H35=1,COUNTRY_INFO!F35+COUNTRY_INFO!G35,IF(COUNTRY_INFO!$I35=1,IF(COUNTRY_INFO!M35>=(COUNTRY_INFO!F35+COUNTRY_INFO!G35),COUNTRY_INFO!F35+COUNTRY_INFO!G35,COUNTRY_INFO!$M35),0))))","v":0},{"$f":"IF(AND(INTRO!$E$39=\"Non endémique\",INTRO!$E$37=\"Non endémique\"),\"Non requis\",IF(INTRO!$E$39=\"Non endémique\",\"Traiter avec DEC\",COUNTRY_INFO!V35))","v":0},{"$f":"IF(INTRO!$E$39<>\"Non endémique\",COUNTRY_INFO!W35,\"Non requis\")","v":0},{"$f":"IF(COUNTRY_INFO!H35=1, IF($E35=1,$D35, 0),0)","v":0},{"$f":"IF(COUNTRY_INFO!I35=1, IF(AND(COUNTRY_INFO!$I35=1,$F35<>0),IF(COUNTRY_INFO!M35>=(COUNTRY_INFO!F35+COUNTRY_INFO!G35),COUNTRY_INFO!F35+COUNTRY_INFO!G35,COUNTRY_INFO!$M35), 0),0)","v":0},0,0,0,0,null,0]
[{"$f":"IF(INTRO!$E$39=\"Non endémique\",\" \",IF(COUNTRY_INFO!A36=0,\" \",COUNTRY_INFO!A36))","v":"NIGER"},{"$f":"IF(INTRO!$E$39=\"Non endémique\",\" \",IF(COUNTRY_INFO!B36=0,\" \",COUNTRY_INFO!B36))","v":"Maradi"},{"$f":"IF(INTRO!$E$39=\"Non endémique\",\" \",IF(COUNTRY_INFO!C36=0,\" \",COUNTRY_INFO!C36))","v":"Madarounfa"},{"$f":"IF(INTRO!$E$39=\"Non endémique\",0,IF(INTRO!$E$39=\"Endémique mais pas de CP\",IF(COUNTRY_INFO!$H36=1,COUNTRY_INFO!F36+COUNTRY_INFO!G36,0),IF(COUNTRY_INFO!$H36=1,COUNTRY_INFO!F36+COUNTRY_INFO!G36,IF(COUNTRY_INFO!$I36=1,IF(COUNTRY_INFO!M36>=(COUNTRY_INFO!F36+COUNTRY_INFO!G36),COUNTRY_INFO!F36+COUNTRY_INFO!G36,COUNTRY_INFO!$M36),0))))","v":0},{"$f":"IF(AND(INTRO!$E$39=\"Non endémique\",INTRO!$E$37=\"Non endémique\"),\"Non requis\",IF(INTRO!$E$39=\"Non endémique\",\"Traiter avec DEC\",COUNTRY_INFO!V36))","v":0},{"$f":"IF(INTRO!$E$39<>\"Non endémique\",COUNTRY_INFO!W36,\"Non requis\")","v":0},{"$f":"IF(COUNTRY_INFO!H36=1, IF($E36=1,$D36, 0),0)","v":0},{"$f":"IF(COUNTRY_INFO!I36=1, IF(AND(COUNTRY_INFO!$I36=1,$F36<>0),IF(COUNTRY_INFO!M36>=(COUNTRY_INFO!F36+COUNTRY_INFO!G36),COUNTRY_INFO!F36+COUNTRY_INFO!G36,COUNTRY_INFO!$M36), 0),0)","v":0},0,0,0,0,null,0]
[{"$f":"IF(INTRO!$E$39=\"Non endémique\",\" \",IF(COUNTRY_INFO!A37=0,\" \",COUNTRY_INFO!A37))","v":"NIGER"},{"$f":"IF(INTRO!$E$39=\"Non endémique\",\" \",IF(COUNTRY_INFO!B37=0,\" \",COUNTRY_INFO!B37))","v":"Maradi"},{"$f":"IF(INTRO!$E$39=\"Non endémique\",\" \",IF(COUNTRY_INFO!C37=0,\" \",COUNTRY_INFO!C37))","v":"Maradi"},{"$f":"IF(INTRO!$E$39=\"Non endémique\",0,IF(INTRO!$E$39=\"Endémique mais pas de CP\",IF(COUNTRY_INFO!$H37=1,COUNTRY_INFO!F37+COUNTRY_INFO!G37,0),IF(COUNTRY_INFO!$H37=1,COUNTRY_INFO!F37+COUNTRY_INFO!G37,IF(COUNTRY_INFO!$I37=1,IF(COUNTRY_INFO!M37>=(COUNTRY_INFO!F37+COUNTRY_INFO!G37),COUNTRY_INFO!F37+COUNTRY_INFO!G37,COUNTRY_INFO!$M37),0))))","v":0},{"$f":"IF(AND(INTRO!$E$39=\"Non endémique\",INTRO!$E$37=\"Non endémique\"),\"Non requis\",IF(INTRO!$E$39=\"Non endémique\",\"Traiter avec DEC\",COUNTRY_INFO!V37))","v":0},{"$f":"IF(INTRO!$E$39<>\"Non endémique\",COUNTRY_INFO!W37,\"Non requis\")","v":0},{"$f":"IF(COUNTRY_INFO!H37=1, IF($E37=1,$D37, 0),0)","v":0},{"$f":"IF(COUNTRY_INFO!I37=1, IF(AND(COUNTRY_INFO!$I37=1,$F37<>0),IF(COUNTRY_INFO!M37>=(COUNTRY_INFO!F37+COUNTRY_INFO!G37),COUNTRY_INFO!F37+COUNTRY_INFO!G37,COUNTRY_INFO!$M37), 0),0)","v":0},0,0,0,0,null,0]
[{"$f":"IF(INTRO!$E$39=\"Non endémique\",\" \",IF(COUNTRY_INFO!A38=0,\" \",COUNTRY_INFO!A38))","v":"NIGER"},{"$f":"IF(INTRO!$E$39=\"Non endémique\",\" \",IF(COUNTRY_INFO!B38=0,\" \",COUNTRY_INFO!B38))","v":"Maradi"},{"$f":"IF(INTRO!$E$39=\"Non endémique\",\" \",IF(COUNTRY_INFO!C38=0,\" \",COUNTRY_INFO!C38))","v":"Mayahi"},{"$f":"IF(INTRO!$E$39=\"Non endémique\",0,IF(INTRO!$E$39=\"Endémique mais pas de CP\",IF(COUNTRY_INFO!$H38=1,COUNTRY_INFO!F38+COUNTRY_INFO!G38,0),IF(COUNTRY_INFO!$H38=1,COUNTRY_INFO!F38+COUNTRY_INFO!G38,IF(COUNTRY_INFO!$I38=1,IF(COUNTRY_INFO!M38>=(COUNTRY_INFO!F38+COUNTRY_INFO!G38),COUNTRY_INFO!F38+COUNTRY_INFO!G38,COUNTRY_INFO!$M38),0))))","v":0},{"$f":"IF(AND(INTRO!$E$39=\"Non endémique\",INTRO!$E$37=\"Non endémique\"),\"Non requis\",IF(INTRO!$E$39=\"Non endémique\",\"Traiter avec DEC\",COUNTRY_INFO!V38))","v":0},{"$f":"IF(INTRO!$E$39<>\"Non endémique\",COUNTRY_INFO!W38,\"Non requis\")","v":0},{"$f":"IF(COUNTRY_INFO!H38=1, IF($E38=1,$D38, 0),0)","v":0},{"$f":"IF(COUNTRY_INFO!I38=1, IF(AND(COUNTRY_INFO!$I38=1,$F38<>0),IF(COUNTRY_INFO!M38>=(COUNTRY_INFO!F38+COUNTRY_INFO!G38),COUNTRY_INFO!F38+COUNTRY_INFO!G38,COUNTRY_INFO!$M38), 0),0)","v":0},0,0,0,0,null,0]
[{"$f":"IF(INTRO!$E$39=\"Non endémique\",\" \",IF(COUNTRY_INFO!A39=0,\" \",COUNTRY_INFO!A39))","v":"NIGER"},{"$f":"IF(INTRO!$E$39=\"Non endémique\",\" \",IF(COUNTRY_INFO!B39=0,\" \",COUNTRY_INFO!B39))","v":"Maradi"},{"$f":"IF(INTRO!$E$39=\"Non endémique\",\" \",IF(COUNTRY_INFO!C39=0,\" \",COUNTRY_INFO!C39))","v":"Tessaoua"},{"$f":"IF(INTRO!$E$39=\"Non endémique\",0,IF(INTRO!$E$39=\"Endémique mais pas de CP\",IF(COUNTRY_INFO!$H39=1,COUNTRY_INFO!F39+COUNTRY_INFO!G39,0),IF(COUNTRY_INFO!$H39=1,COUNTRY_INFO!F39+COUNTRY_INFO!G39,IF(COUNTRY_INFO!$I39=1,IF(COUNTRY_INFO!M39>=(COUNTRY_INFO!F39+COUNTRY_INFO!G39),COUNTRY_INFO!F39+COUNTRY_INFO!G39,COUNTRY_INFO!$M39),0))))","v":0},{"$f":"IF(AND(INTRO!$E$39=\"Non endémique\",INTRO!$E$37=\"Non endémique\"),\"Non requis\",IF(INTRO!$E$39=\"Non endémique\",\"Traiter avec DEC\",COUNTRY_INFO!V39))","v":0},{"$f":"IF(INTRO!$E$39<>\"Non endémique\",COUNTRY_INFO!W39,\"Non requis\")","v":0},{"$f":"IF(COUNTRY_INFO!H39=1, IF($E39=1,$D39, 0),0)","v":0},{"$f":"IF(COUNTRY_INFO!I39=1, IF(AND(COUNTRY_INFO!$I39=1,$F39<>0),IF(COUNTRY_INFO!M39>=(COUNTRY_INFO!F39+COUNTRY_INFO!G39),COUNTRY_INFO!F39+COUNTRY_INFO!G39,COUNTRY_INFO!$M39), 0),0)","v":0},0,0,0,0,null,0]
[{"$f":"IF(INTRO!$E$39=\"Non endémique\",\" \",IF(COUNTRY_INFO!A40=0,\" \",COUNTRY_INFO!A40))","v":"NIGER"},{"$f":"IF(INTRO!$E$39=\"Non endémique\",\" \",IF(COUNTRY_INFO!B40=0,\" \",COUNTRY_INFO!B40))","v":"Niamey"},{"$f":"IF(INTRO!$E$39=\"Non endémique\",\" \",IF(COUNTRY_INFO!C40=0,\" \",COUNTRY_INFO!C40))","v":"Niamey 1"},{"$f":"IF(INTRO!$E$39=\"Non endémique\",0,IF(INTRO!$E$39=\"Endémique mais pas de CP\",IF(COUNTRY_INFO!$H40=1,COUNTRY_INFO!F40+COUNTRY_INFO!G40,0),IF(COUNTRY_INFO!$H40=1,COUNTRY_INFO!F40+COUNTRY_INFO!G40,IF(COUNTRY_INFO!$I40=1,IF(COUNTRY_INFO!M40>=(COUNTRY_INFO!F40+COUNTRY_INFO!G40),COUNTRY_INFO!F40+COUNTRY_INFO!G40,COUNTRY_INFO!$M40),0))))","v":0},{"$f":"IF(AND(INTRO!$E$39=\"Non endémique\",INTRO!$E$37=\"Non endémique\"),\"Non requis\",IF(INTRO!$E$39=\"Non endémique\",\"Traiter avec DEC\",COUNTRY_INFO!V40))","v":0},{"$f":"IF(INTRO!$E$39<>\"Non endémique\",COUNTRY_INFO!W40,\"Non requis\")","v":0},{"$f":"IF(COUNTRY_INFO!H40=1, IF($E40=1,$D40, 0),0)","v":0},{"$f":"IF(COUNTRY_INFO!I40=1, IF(AND(COUNTRY_INFO!$I40=1,$F40<>0),IF(COUNTRY_INFO!M40>=(COUNTRY_INFO!F40+COUNTRY_INFO!G40),COUNTRY_INFO!F40+COUNTRY_INFO!G40,COUNTRY_INFO!$M40), 0),0)","v":0},0,0,0,0,null,0]
[{"$f":"IF(INTRO!$E$39=\"Non endémique\",\" \",IF(COUNTRY_INFO!A41=0,\" \",COUNTRY_INFO!A41))","v":"NIGER"},{"$f":"IF(INTRO!$E$39=\"Non endémique\",\" \",IF(COUNTRY_INFO!B41=0,\" \",COUNTRY_INFO!B41))","v":"Niamey"},{"$f":"IF(INTRO!$E$39=\"Non endémique\",\" \",IF(COUNTRY_INFO!C41=0,\" \",COUNTRY_INFO!C41))","v":"Niamey 2"},{"$f":"IF(INTRO!$E$39=\"Non endémique\",0,IF(INTRO!$E$39=\"Endémique mais pas de CP\",IF(COUNTRY_INFO!$H41=1,COUNTRY_INFO!F41+COUNTRY_INFO!G41,0),IF(COUNTRY_INFO!$H41=1,COUNTRY_INFO!F41+COUNTRY_INFO!G41,IF(COUNTRY_INFO!$I41=1,IF(COUNTRY_INFO!M41>=(COUNTRY_INFO!F41+COUNTRY_INFO!G41),COUNTRY_INFO!F41+COUNTRY_INFO!G41,COUNTRY_INFO!$M41),0))))","v":0},{"$f":"IF(AND(INTRO!$E$39=\"Non endémique\",INTRO!$E$37=\"Non endémique\"),\"Non requis\",IF(INTRO!$E$39=\"Non endémique\",\"Traiter avec DEC\",COUNTRY_INFO!V41))","v":0},{"$f":"IF(INTRO!$E$39<>\"Non endémique\",COUNTRY_INFO!W41,\"Non requis\")","v":0},{"$f":"IF(COUNTRY_INFO!H41=1, IF($E41=1,$D41, 0),0)","v":0},{"$f":"IF(COUNTRY_INFO!I41=1, IF(AND(COUNTRY_INFO!$I41=1,$F41<>0),IF(COUNTRY_INFO!M41>=(COUNTRY_INFO!F41+COUNTRY_INFO!G41),COUNTRY_INFO!F41+COUNTRY_INFO!G41,COUNTRY_INFO!$M41), 0),0)","v":0},0,0,0,0,null,0]
[{"$f":"IF(INTRO!$E$39=\"Non endémique\",\" \",IF(COUNTRY_INFO!A42=0,\" \",COUNTRY_INFO!A42))","v":"NIGER"},{"$f":"IF(INTRO!$E$39=\"Non endémique\",\" \",IF(COUNTRY_INFO!B42=0,\" \",COUNTRY_INFO!B42))","v":"Niamey"},{"$f":"IF(INTRO!$E$39=\"Non endémique\",\" \",IF(COUNTRY_INFO!C42=0,\" \",COUNTRY_INFO!C42))","v":"Niamey 3"},{"$f":"IF(INTRO!$E$39=\"Non endémique\",0,IF(INTRO!$E$39=\"Endémique mais pas de CP\",IF(COUNTRY_INFO!$H42=1,COUNTRY_INFO!F42+COUNTRY_INFO!G42,0),IF(COUNTRY_INFO!$H42=1,COUNTRY_INFO!F42+COUNTRY_INFO!G42,IF(COUNTRY_INFO!$I42=1,IF(COUNTRY_INFO!M42>=(COUNTRY_INFO!F42+COUNTRY_INFO!G42),COUNTRY_INFO!F42+COUNTRY_INFO!G42,COUNTRY_INFO!$M42),0))))","v":0},{"$f":"IF(AND(INTRO!$E$39=\"Non endémique\",INTRO!$E$37=\"Non endémique\"),\"Non requis\",IF(INTRO!$E$39=\"Non endémique\",\"Traiter avec DEC\",COUNTRY_INFO!V42))","v":0},{"$f":"IF(INTRO!$E$39<>\"Non endémique\",COUNTRY_INFO!W42,\"Non requis\")","v":0},{"$f":"IF(COUNTRY_INFO!H42=1, IF($E42=1,$D42, 0),0)","v":0},{"$f":"IF(COUNTRY_INFO!I42=1, IF(AND(COUNTRY_INFO!$I42=1,$F42<>0),IF(COUNTRY_INFO!M42>=(COUNTRY_INFO!F42+COUNTRY_INFO!G42),COUNTRY_INFO!F42+COUNTRY_INFO!G42,COUNTRY_INFO!$M42), 0),0)","v":0},0,0,0,0,null,0]
[{"$f":"IF(INTRO!$E$39=\"Non endémique\",\" \",IF(COUNTRY_INFO!A43=0,\" \",COUNTRY_INFO!A43))","v":"NIGER"},{"$f":"IF(INTRO!$E$39=\"Non endémique\",\" \",IF(COUNTRY_INFO!B43=0,\" \",COUNTRY_INFO!B43))","v":"Niamey"},{"$f":"IF(INTRO!$E$39=\"Non endémique\",\" \",IF(COUNTRY_INFO!C43=0,\" \",COUNTRY_INFO!C43))","v":"Niamey 4"},{"$f":"IF(INTRO!$E$39=\"Non endémique\",0,IF(INTRO!$E$39=\"Endémique mais pas de CP\",IF(COUNTRY_INFO!$H43=1,COUNTRY_INFO!F43+COUNTRY_INFO!G43,0),IF(COUNTRY_INFO!$H43=1,COUNTRY_INFO!F43+COUNTRY_INFO!G43,IF(COUNTRY_INFO!$I43=1,IF(COUNTRY_INFO!M43>=(COUNTRY_INFO!F43+COUNTRY_INFO!G43),COUNTRY_INFO!F43+COUNTRY_INFO!G43,COUNTRY_INFO!$M43),0))))","v":0},{"$f":"IF(AND(INTRO!$E$39=\"Non endémique\",INTRO!$E$37=\"Non endémique\"),\"Non requis\",IF(INTRO!$E$39=\"Non endémique\",\"Traiter avec DEC\",COUNTRY_INFO!V43))","v":0},{"$f":"IF(INTRO!$E$39<>\"Non endémique\",COUNTRY_INFO!W43,\"Non requis\")","v":0},{"$f":"IF(COUNTRY_INFO!H43=1, IF($E43=1,$D43, 0),0)","v":0},{"$f":"IF(COUNTRY_INFO!I43=1, IF(AND(COUNTRY_INFO!$I43=1,$F43<>0),IF(COUNTRY_INFO!M43>=(COUNTRY_INFO!F43+COUNTRY_INFO!G43),COUNTRY_INFO!F43+COUNTRY_INFO!G43,COUNTRY_INFO!$M43), 0),0)","v":0},0,0,0,0,null,0]
[{"$f":"IF(INTRO!$E$39=\"Non endémique\",\" \",IF(COUNTRY_INFO!A44=0,\" \",COUNTRY_INFO!A44))","v":"NIGER"},{"$f":"IF(INTRO!$E$39=\"Non endémique\",\" \",IF(COUNTRY_INFO!B44=0,\" \",COUNTRY_INFO!B44))","v":"Niamey"},{"$f":"IF(INTRO!$E$39=\"Non endémique\",\" \",IF(COUNTRY_INFO!C44=0,\" \",COUNTRY_INFO!C44))","v":"Niamey 5"},{"$f":"IF(INTRO!$E$39=\"Non endémique\",0,IF(INTRO!$E$39=\"Endémique mais pas de CP\",IF(COUNTRY_INFO!$H44=1,COUNTRY_INFO!F44+COUNTRY_INFO!G44,0),IF(COUNTRY_INFO!$H44=1,COUNTRY_INFO!F44+COUNTRY_INFO!G44,IF(COUNTRY_INFO!$I44=1,IF(COUNTRY_INFO!M44>=(COUNTRY_INFO!F44+COUNTRY_INFO!G44),COUNTRY_INFO!F44+COUNTRY_INFO!G44,COUNTRY_INFO!$M44),0))))","v":0},{"$f":"IF(AND(INTRO!$E$39=\"Non endémique\",INTRO!$E$37=\"Non endémique\"),\"Non requis\",IF(INTRO!$E$39=\"Non endémique\",\"Traiter avec DEC\",COUNTRY_INFO!V44))","v":0},{"$f":"IF(INTRO!$E$39<>\"Non endémique\",COUNTRY_INFO!W44,\"Non requis\")","v":0},{"$f":"IF(COUNTRY_INFO!H44=1, IF($E44=1,$D44, 0),0)","v":0},{"$f":"IF(COUNTRY_INFO!I44=1, IF(AND(COUNTRY_INFO!$I44=1,$F44<>0),IF(COUNTRY_INFO!M44>=(COUNTRY_INFO!F44+COUNTRY_INFO!G44),COUNTRY_INFO!F44+COUNTRY_INFO!G44,COUNTRY_INFO!$M44), 0),0)","v":0},0,0,0,0,null,0]
[{"$f":"IF(INTRO!$E$39=\"Non endémique\",\" \",IF(COUNTRY_INFO!A45=0,\" \",COUNTRY_INFO!A45))","v":"NIGER"},{"$f":"IF(INTRO!$E$39=\"Non endémique\",\" \",IF(COUNTRY_INFO!B45=0,\" \",COUNTRY_INFO!B45))","v":"Tahoua"},{"$f":"IF(INTRO!$E$39=\"Non endémique\",\" \",IF(COUNTRY_INFO!C45=0,\" \",COUNTRY_INFO!C45))","v":"Abalak"},{"$f":"IF(INTRO!$E$39=\"Non endémique\",0,IF(INTRO!$E$39=\"Endémique mais pas de CP\",IF(COUNTRY_INFO!$H45=1,COUNTRY_INFO!F45+COUNTRY_INFO!G45,0),IF(COUNTRY_INFO!$H45=1,COUNTRY_INFO!F45+COUNTRY_INFO!G45,IF(COUNTRY_INFO!$I45=1,IF(COUNTRY_INFO!M45>=(COUNTRY_INFO!F45+COUNTRY_INFO!G45),COUNTRY_INFO!F45+COUNTRY_INFO!G45,COUNTRY_INFO!$M45),0))))","v":0},{"$f":"IF(AND(INTRO!$E$39=\"Non endémique\",INTRO!$E$37=\"Non endémique\"),\"Non requis\",IF(INTRO!$E$39=\"Non endémique\",\"Traiter avec DEC\",COUNTRY_INFO!V45))","v":0},{"$f":"IF(INTRO!$E$39<>\"Non endémique\",COUNTRY_INFO!W45,\"Non requis\")","v":0},{"$f":"IF(COUNTRY_INFO!H45=1, IF($E45=1,$D45, 0),0)","v":0},{"$f":"IF(COUNTRY_INFO!I45=1, IF(AND(COUNTRY_INFO!$I45=1,$F45<>0),IF(COUNTRY_INFO!M45>=(COUNTRY_INFO!F45+COUNTRY_INFO!G45),COUNTRY_INFO!F45+COUNTRY_INFO!G45,COUNTRY_INFO!$M45), 0),0)","v":0},0,0,0,0,null,0]
[{"$f":"IF(INTRO!$E$39=\"Non endémique\",\" \",IF(COUNTRY_INFO!A46=0,\" \",COUNTRY_INFO!A46))","v":"NIGER"},{"$f":"IF(INTRO!$E$39=\"Non endémique\",\" \",IF(COUNTRY_INFO!B46=0,\" \",COUNTRY_INFO!B46))","v":"Tahoua"},{"$f":"IF(INTRO!$E$39=\"Non endémique\",\" \",IF(COUNTRY_INFO!C46=0,\" \",COUNTRY_INFO!C46))","v":"Birnin' Konni"},{"$f":"IF(INTRO!$E$39=\"Non endémique\",0,IF(INTRO!$E$39=\"Endémique mais pas de CP\",IF(COUNTRY_INFO!$H46=1,COUNTRY_INFO!F46+COUNTRY_INFO!G46,0),IF(COUNTRY_INFO!$H46=1,COUNTRY_INFO!F46+COUNTRY_INFO!G46,IF(COUNTRY_INFO!$I46=1,IF(COUNTRY_INFO!M46>=(COUNTRY_INFO!F46+COUNTRY_INFO!G46),COUNTRY_INFO!F46+COUNTRY_INFO!G46,COUNTRY_INFO!$M46),0))))","v":0},{"$f":"IF(AND(INTRO!$E$39=\"Non endémique\",INTRO!$E$37=\"Non endémique\"),\"Non requis\",IF(INTRO!$E$39=\"Non endémique\",\"Traiter avec DEC\",COUNTRY_INFO!V46))","v":0},{"$f":"IF(INTRO!$E$39<>\"Non endémique\",COUNTRY_INFO!W46,\"Non requis\")","v":0},{"$f":"IF(COUNTRY_INFO!H46=1, IF($E46=1,$D46, 0),0)","v":0},{"$f":"IF(COUNTRY_INFO!I46=1, IF(AND(COUNTRY_INFO!$I46=1,$F46<>0),IF(COUNTRY_INFO!M46>=(COUNTRY_INFO!F46+COUNTRY_INFO!G46),COUNTRY_INFO!F46+COUNTRY_INFO!G46,COUNTRY_INFO!$M46), 0),0)","v":0},0,0,0,0,null,0]
[{"$f":"IF(INTRO!$E$39=\"Non endémique\",\" \",IF(COUNTRY_INFO!A47=0,\" \",COUNTRY_INFO!A47))","v":"NIGER"},{"$f":"IF(INTRO!$E$39=\"Non endémique\",\" \",IF(COUNTRY_INFO!B47=0,\" \",COUNTRY_INFO!B47))","v":"Tahoua"},{"$f":"IF(INTRO!$E$39=\"Non endémique\",\" \",IF(COUNTRY_INFO!C47=0,\" \",COUNTRY_INFO!C47))","v":"Malbaza"},{"$f":"IF(INTRO!$E$39=\"Non endémique\",0,IF(INTRO!$E$39=\"Endémique mais pas de CP\",IF(COUNTRY_INFO!$H47=1,COUNTRY_INFO!F47+COUNTRY_INFO!G47,0),IF(COUNTRY_INFO!$H47=1,COUNTRY_INFO!F47+COUNTRY_INFO!G47,IF(COUNTRY_INFO!$I47=1,IF(COUNTRY_INFO!M47>=(COUNTRY_INFO!F47+COUNTRY_INFO!G47),COUNTRY_INFO!F47+COUNTRY_INFO!G47,COUNTRY_INFO!$M47),0))))","v":0},{"$f":"IF(AND(INTRO!$E$39=\"Non endémique\",INTRO!$E$37=\"Non endémique\"),\"Non requis\",IF(INTRO!$E$39=\"Non endémique\",\"Traiter avec DEC\",COUNTRY_INFO!V47))","v":0},{"$f":"IF(INTRO!$E$39<>\"Non endémique\",COUNTRY_INFO!W47,\"Non requis\")","v":0},{"$f":"IF(COUNTRY_INFO!H47=1, IF($E47=1,$D47, 0),0)","v":0},{"$f":"IF(COUNTRY_INFO!I47=1, IF(AND(COUNTRY_INFO!$I47=1,$F47<>0),IF(COUNTRY_INFO!M47>=(COUNTRY_INFO!F47+COUNTRY_INFO!G47),COUNTRY_INFO!F47+COUNTRY_INFO!G47,COUNTRY_INFO!$M47), 0),0)","v":0},0,0,0,0,null,0]
[{"$f":"IF(INTRO!$E$39=\"Non endémique\",\" \",IF(COUNTRY_INFO!A48=0,\" \",COUNTRY_INFO!A48))","v":"NIGER"},{"$f":"IF(INTRO!$E$39=\"Non endémique\",\" \",IF(COUNTRY_INFO!B48=0,\" \",COUNTRY_INFO!B48))","v":"Tahoua"},{"$f":"IF(INTRO!$E$39=\"Non endémique\",\" \",IF(COUNTRY_INFO!C48=0,\" \",COUNTRY_INFO!C48))","v":"Bouza"},{"$f":"IF(INTRO!$E$39=\"Non endémique\",0,IF(INTRO!$E$39=\"Endémique mais pas de CP\",IF(COUNTRY_INFO!$H48=1,COUNTRY_INFO!F48+COUNTRY_INFO!G48,0),IF(COUNTRY_INFO!$H48=1,COUNTRY_INFO!F48+COUNTRY_INFO!G48,IF(COUNTRY_INFO!$I48=1,IF(COUNTRY_INFO!M48>=(COUNTRY_INFO!F48+COUNTRY_INFO!G48),COUNTRY_INFO!F48+COUNTRY_INFO!G48,COUNTRY_INFO!$M48),0))))","v":0},{"$f":"IF(AND(INTRO!$E$39=\"Non endémique\",INTRO!$E$37=\"Non endémique\"),\"Non requis\",IF(INTRO!$E$39=\"Non endémique\",\"Traiter avec DEC\",COUNTRY_INFO!V48))","v":0},{"$f":"IF(INTRO!$E$39<>\"Non endémique\",COUNTRY_INFO!W48,\"Non requis\")","v":0},{"$f":"IF(COUNTRY_INFO!H48=1, IF($E48=1,$D48, 0),0)","v":0},{"$f":"IF(COUNTRY_INFO!I48=1, IF(AND(COUNTRY_INFO!$I48=1,$F48<>0),IF(COUNTRY_INFO!M48>=(COUNTRY_INFO!F48+COUNTRY_INFO!G48),COUNTRY_INFO!F48+COUNTRY_INFO!G48,COUNTRY_INFO!$M48), 0),0)","v":0},0,0,0,0,null,0]
[{"$f":"IF(INTRO!$E$39=\"Non endémique\",\" \",IF(COUNTRY_INFO!A49=0,\" \",COUNTRY_INFO!A49))","v":"NIGER"},{"$f":"IF(INTRO!$E$39=\"Non endémique\",\" \",IF(COUNTRY_INFO!B49=0,\" \",COUNTRY_INFO!B49))","v":"Tahoua"},{"$f":"IF(INTRO!$E$39=\"Non endémique\",\" \",IF(COUNTRY_INFO!C49=0,\" \",COUNTRY_INFO!C49))","v":"Illela"},{"$f":"IF(INTRO!$E$39=\"Non endémique\",0,IF(INTRO!$E$39=\"Endémique mais pas de CP\",IF(COUNTRY_INFO!$H49=1,COUNTRY_INFO!F49+COUNTRY_INFO!G49,0),IF(COUNTRY_INFO!$H49=1,COUNTRY_INFO!F49+COUNTRY_INFO!G49,IF(COUNTRY_INFO!$I49=1,IF(COUNTRY_INFO!M49>=(COUNTRY_INFO!F49+COUNTRY_INFO!G49),COUNTRY_INFO!F49+COUNTRY_INFO!G49,COUNTRY_INFO!$M49),0))))","v":0},{"$f":"IF(AND(INTRO!$E$39=\"Non endémique\",INTRO!$E$37=\"Non endémique\"),\"Non requis\",IF(INTRO!$E$39=\"Non endémique\",\"Traiter avec DEC\",COUNTRY_INFO!V49))","v":0},{"$f":"IF(INTRO!$E$39<>\"Non endémique\",COUNTRY_INFO!W49,\"Non requis\")","v":0},{"$f":"IF(COUNTRY_INFO!H49=1, IF($E49=1,$D49, 0),0)","v":0},{"$f":"IF(COUNTRY_INFO!I49=1, IF(AND(COUNTRY_INFO!$I49=1,$F49<>0),IF(COUNTRY_INFO!M49>=(COUNTRY_INFO!F49+COUNTRY_INFO!G49),COUNTRY_INFO!F49+COUNTRY_INFO!G49,COUNTRY_INFO!$M49), 0),0)","v":0},0,0,0,0,null,0]
[{"$f":"IF(INTRO!$E$39=\"Non endémique\",\" \",IF(COUNTRY_INFO!A50=0,\" \",COUNTRY_INFO!A50))","v":"NIGER"},{"$f":"IF(INTRO!$E$39=\"Non endémique\",\" \",IF(COUNTRY_INFO!B50=0,\" \",COUNTRY_INFO!B50))","v":"Tahoua"},{"$f":"IF(INTRO!$E$39=\"Non endémique\",\" \",IF(COUNTRY_INFO!C50=0,\" \",COUNTRY_INFO!C50))","v":"Bagaroua"},{"$f":"IF(INTRO!$E$39=\"Non endémique\",0,IF(INTRO!$E$39=\"Endémique mais pas de CP\",IF(COUNTRY_INFO!$H50=1,COUNTRY_INFO!F50+COUNTRY_INFO!G50,0),IF(COUNTRY_INFO!$H50=1,COUNTRY_INFO!F50+COUNTRY_INFO!G50,IF(COUNTRY_INFO!$I50=1,IF(COUNTRY_INFO!M50>=(COUNTRY_INFO!F50+COUNTRY_INFO!G50),COUNTRY_INFO!F50+COUNTRY_INFO!G50,COUNTRY_INFO!$M50),0))))","v":0},{"$f":"IF(AND(INTRO!$E$39=\"Non endémique\",INTRO!$E$37=\"Non endémique\"),\"Non requis\",IF(INTRO!$E$39=\"Non endémique\",\"Traiter avec DEC\",COUNTRY_INFO!V50))","v":0},{"$f":"IF(INTRO!$E$39<>\"Non endémique\",COUNTRY_INFO!W50,\"Non requis\")","v":0},{"$f":"IF(COUNTRY_INFO!H50=1, IF($E50=1,$D50, 0),0)","v":0},{"$f":"IF(COUNTRY_INFO!I50=1, IF(AND(COUNTRY_INFO!$I50=1,$F50<>0),IF(COUNTRY_INFO!M50>=(COUNTRY_INFO!F50+COUNTRY_INFO!G50),COUNTRY_INFO!F50+COUNTRY_INFO!G50,COUNTRY_INFO!$M50), 0),0)","v":0},0,0,0,0,null,0]
[{"$f":"IF(INTRO!$E$39=\"Non endémique\",\" \",IF(COUNTRY_INFO!A51=0,\" \",COUNTRY_INFO!A51))","v":"NIGER"},{"$f":"IF(INTRO!$E$39=\"Non endémique\",\" \",IF(COUNTRY_INFO!B51=0,\" \",COUNTRY_INFO!B51))","v":"Tahoua"},{"$f":"IF(INTRO!$E$39=\"Non endémique\",\" \",IF(COUNTRY_INFO!C51=0,\" \",COUNTRY_INFO!C51))","v":"Keita"},{"$f":"IF(INTRO!$E$39=\"Non endémique\",0,IF(INTRO!$E$39=\"Endémique mais pas de CP\",IF(COUNTRY_INFO!$H51=1,COUNTRY_INFO!F51+COUNTRY_INFO!G51,0),IF(COUNTRY_INFO!$H51=1,COUNTRY_INFO!F51+COUNTRY_INFO!G51,IF(COUNTRY_INFO!$I51=1,IF(COUNTRY_INFO!M51>=(COUNTRY_INFO!F51+COUNTRY_INFO!G51),COUNTRY_INFO!F51+COUNTRY_INFO!G51,COUNTRY_INFO!$M51),0))))","v":0},{"$f":"IF(AND(INTRO!$E$39=\"Non endémique\",INTRO!$E$37=\"Non endémique\"),\"Non requis\",IF(INTRO!$E$39=\"Non endémique\",\"Traiter avec DEC\",COUNTRY_INFO!V51))","v":0},{"$f":"IF(INTRO!$E$39<>\"Non endémique\",COUNTRY_INFO!W51,\"Non requis\")","v":0},{"$f":"IF(COUNTRY_INFO!H51=1, IF($E51=1,$D51, 0),0)","v":0},{"$f":"IF(COUNTRY_INFO!I51=1, IF(AND(COUNTRY_INFO!$I51=1,$F51<>0),IF(COUNTRY_INFO!M51>=(COUNTRY_INFO!F51+COUNTRY_INFO!G51),COUNTRY_INFO!F51+COUNTRY_INFO!G51,COUNTRY_INFO!$M51), 0),0)","v":0},0,0,0,0,null,0]
[{"$f":"IF(INTRO!$E$39=\"Non endémique\",\" \",IF(COUNTRY_INFO!A52=0,\" \",COUNTRY_INFO!A52))","v":"NIGER"},{"$f":"IF(INTRO!$E$39=\"Non endémique\",\" \",IF(COUNTRY_INFO!B52=0,\" \",COUNTRY_INFO!B52))","v":"Tahoua"},{"$f":"IF(INTRO!$E$39=\"Non endémique\",\" \",IF(COUNTRY_INFO!C52=0,\" \",COUNTRY_INFO!C52))","v":"Madaoua"},{"$f":"IF(INTRO!$E$39=\"Non endémique\",0,IF(INTRO!$E$39=\"Endémique mais pas de CP\",IF(COUNTRY_INFO!$H52=1,COUNTRY_INFO!F52+COUNTRY_INFO!G52,0),IF(COUNTRY_INFO!$H52=1,COUNTRY_INFO!F52+COUNTRY_INFO!G52,IF(COUNTRY_INFO!$I52=1,IF(COUNTRY_INFO!M52>=(COUNTRY_INFO!F52+COUNTRY_INFO!G52),COUNTRY_INFO!F52+COUNTRY_INFO!G52,COUNTRY_INFO!$M52),0))))","v":0},{"$f":"IF(AND(INTRO!$E$39=\"Non endémique\",INTRO!$E$37=\"Non endémique\"),\"Non requis\",IF(INTRO!$E$39=\"Non endémique\",\"Traiter avec DEC\",COUNTRY_INFO!V52))","v":0},{"$f":"IF(INTRO!$E$39<>\"Non endémique\",COUNTRY_INFO!W52,\"Non requis\")","v":0},{"$f":"IF(COUNTRY_INFO!H52=1, IF($E52=1,$D52, 0),0)","v":0},{"$f":"IF(COUNTRY_INFO!I52=1, IF(AND(COUNTRY_INFO!$I52=1,$F52<>0),IF(COUNTRY_INFO!M52>=(COUNTRY_INFO!F52+COUNTRY_INFO!G52),COUNTRY_INFO!F52+COUNTRY_INFO!G52,COUNTRY_INFO!$M52), 0),0)","v":0},0,0,0,0,null,0]
[{"$f":"IF(INTRO!$E$39=\"Non endémique\",\" \",IF(COUNTRY_INFO!A53=0,\" \",COUNTRY_INFO!A53))","v":"NIGER"},{"$f":"IF(INTRO!$E$39=\"Non endémique\",\" \",IF(COUNTRY_INFO!B53=0,\" \",COUNTRY_INFO!B53))","v":"Tahoua"},{"$f":"IF(INTRO!$E$39=\"Non endémique\",\" \",IF(COUNTRY_INFO!C53=0,\" \",COUNTRY_INFO!C53))","v":"Tahoua département"},{"$f":"IF(INTRO!$E$39=\"Non endémique\",0,IF(INTRO!$E$39=\"Endémique mais pas de CP\",IF(COUNTRY_INFO!$H53=1,COUNTRY_INFO!F53+COUNTRY_INFO!G53,0),IF(COUNTRY_INFO!$H53=1,COUNTRY_INFO!F53+COUNTRY_INFO!G53,IF(COUNTRY_INFO!$I53=1,IF(COUNTRY_INFO!M53>=(COUNTRY_INFO!F53+COUNTRY_INFO!G53),COUNTRY_INFO!F53+COUNTRY_INFO!G53,COUNTRY_INFO!$M53),0))))","v":0},{"$f":"IF(AND(INTRO!$E$39=\"Non endémique\",INTRO!$E$37=\"Non endémique\"),\"Non requis\",IF(INTRO!$E$39=\"Non endémique\",\"Traiter avec DEC\",COUNTRY_INFO!V53))","v":0},{"$f":"IF(INTRO!$E$39<>\"Non endémique\",COUNTRY_INFO!W53,\"Non requis\")","v":0},{"$f":"IF(COUNTRY_INFO!H53=1, IF($E53=1,$D53, 0),0)","v":0},{"$f":"IF(COUNTRY_INFO!I53=1, IF(AND(COUNTRY_INFO!$I53=1,$F53<>0),IF(COUNTRY_INFO!M53>=(COUNTRY_INFO!F53+COUNTRY_INFO!G53),COUNTRY_INFO!F53+COUNTRY_INFO!G53,COUNTRY_INFO!$M53), 0),0)","v":0},0,0,0,0,null,0]
[{"$f":"IF(INTRO!$E$39=\"Non endémique\",\" \",IF(COUNTRY_INFO!A54=0,\" \",COUNTRY_INFO!A54))","v":"NIGER"},{"$f":"IF(INTRO!$E$39=\"Non endémique\",\" \",IF(COUNTRY_INFO!B54=0,\" \",COUNTRY_INFO!B54))","v":"Tahoua"},{"$f":"IF(INTRO!$E$39=\"Non endémique\",\" \",IF(COUNTRY_INFO!C54=0,\" \",COUNTRY_INFO!C54))","v":"Tahoua commune"},{"$f":"IF(INTRO!$E$39=\"Non endémique\",0,IF(INTRO!$E$39=\"Endémique mais pas de CP\",IF(COUNTRY_INFO!$H54=1,COUNTRY_INFO!F54+COUNTRY_INFO!G54,0),IF(COUNTRY_INFO!$H54=1,COUNTRY_INFO!F54+COUNTRY_INFO!G54,IF(COUNTRY_INFO!$I54=1,IF(COUNTRY_INFO!M54>=(COUNTRY_INFO!F54+COUNTRY_INFO!G54),COUNTRY_INFO!F54+COUNTRY_INFO!G54,COUNTRY_INFO!$M54),0))))","v":0},{"$f":"IF(AND(INTRO!$E$39=\"Non endémique\",INTRO!$E$37=\"Non endémique\"),\"Non requis\",IF(INTRO!$E$39=\"Non endémique\",\"Traiter avec DEC\",COUNTRY_INFO!V54))","v":0},{"$f":"IF(INTRO!$E$39<>\"Non endémique\",COUNTRY_INFO!W54,\"Non requis\")","v":0},{"$f":"IF(COUNTRY_INFO!H54=1, IF($E54=1,$D54, 0),0)","v":0},{"$f":"IF(COUNTRY_INFO!I54=1, IF(AND(COUNTRY_INFO!$I54=1,$F54<>0),IF(COUNTRY_INFO!M54>=(COUNTRY_INFO!F54+COUNTRY_INFO!G54),COUNTRY_INFO!F54+COUNTRY_INFO!G54,COUNTRY_INFO!$M54), 0),0)","v":0},0,0,0,0,null,0]
[{"$f":"IF(INTRO!$E$39=\"Non endémique\",\" \",IF(COUNTRY_INFO!A55=0,\" \",COUNTRY_INFO!A55))","v":"NIGER"},{"$f":"IF(INTRO!$E$39=\"Non endémique\",\" \",IF(COUNTRY_INFO!B55=0,\" \",COUNTRY_INFO!B55))","v":"Tahoua"},{"$f":"IF(INTRO!$E$39=\"Non endémique\",\" \",IF(COUNTRY_INFO!C55=0,\" \",COUNTRY_INFO!C55))","v":"TCHINTABARADEN"},{"$f":"IF(INTRO!$E$39=\"Non endémique\",0,IF(INTRO!$E$39=\"Endémique mais pas de CP\",IF(COUNTRY_INFO!$H55=1,COUNTRY_INFO!F55+COUNTRY_INFO!G55,0),IF(COUNTRY_INFO!$H55=1,COUNTRY_INFO!F55+COUNTRY_INFO!G55,IF(COUNTRY_INFO!$I55=1,IF(COUNTRY_INFO!M55>=(COUNTRY_INFO!F55+COUNTRY_INFO!G55),COUNTRY_INFO!F55+COUNTRY_INFO!G55,COUNTRY_INFO!$M55),0))))","v":0},{"$f":"IF(AND(INTRO!$E$39=\"Non endémique\",INTRO!$E$37=\"Non endémique\"),\"Non requis\",IF(INTRO!$E$39=\"Non endémique\",\"Traiter avec DEC\",COUNTRY_INFO!V55))","v":0},{"$f":"IF(INTRO!$E$39<>\"Non endémique\",COUNTRY_INFO!W55,\"Non requis\")","v":0},{"$f":"IF(COUNTRY_INFO!H55=1, IF($E55=1,$D55, 0),0)","v":0},{"$f":"IF(COUNTRY_INFO!I55=1, IF(AND(COUNTRY_INFO!$I55=1,$F55<>0),IF(COUNTRY_INFO!M55>=(COUNTRY_INFO!F55+COUNTRY_INFO!G55),COUNTRY_INFO!F55+COUNTRY_INFO!G55,COUNTRY_INFO!$M55), 0),0)","v":0},0,0,0,0,null,0]
[{"$f":"IF(INTRO!$E$39=\"Non endémique\",\" \",IF(COUNTRY_INFO!A56=0,\" \",COUNTRY_INFO!A56))","v":"NIGER"},{"$f":"IF(INTRO!$E$39=\"Non endémique\",\" \",IF(COUNTRY_INFO!B56=0,\" \",COUNTRY_INFO!B56))","v":"Tahoua"},{"$f":"IF(INTRO!$E$39=\"Non endémique\",\" \",IF(COUNTRY_INFO!C56=0,\" \",COUNTRY_INFO!C56))","v":"Tassara"},{"$f":"IF(INTRO!$E$39=\"Non endémique\",0,IF(INTRO!$E$39=\"Endémique mais pas de CP\",IF(COUNTRY_INFO!$H56=1,COUNTRY_INFO!F56+COUNTRY_INFO!G56,0),IF(COUNTRY_INFO!$H56=1,COUNTRY_INFO!F56+COUNTRY_INFO!G56,IF(COUNTRY_INFO!$I56=1,IF(COUNTRY_INFO!M56>=(COUNTRY_INFO!F56+COUNTRY_INFO!G56),COUNTRY_INFO!F56+COUNTRY_INFO!G56,COUNTRY_INFO!$M56),0))))","v":0},{"$f":"IF(AND(INTRO!$E$39=\"Non endémique\",INTRO!$E$37=\"Non endémique\"),\"Non requis\",IF(INTRO!$E$39=\"Non endémique\",\"Traiter avec DEC\",COUNTRY_INFO!V56))","v":0},{"$f":"IF(INTRO!$E$39<>\"Non endémique\",COUNTRY_INFO!W56,\"Non requis\")","v":0},{"$f":"IF(COUNTRY_INFO!H56=1, IF($E56=1,$D56, 0),0)","v":0},{"$f":"IF(COUNTRY_INFO!I56=1, IF(AND(COUNTRY_INFO!$I56=1,$F56<>0),IF(COUNTRY_INFO!M56>=(COUNTRY_INFO!F56+COUNTRY_INFO!G56),COUNTRY_INFO!F56+COUNTRY_INFO!G56,COUNTRY_INFO!$M56), 0),0)","v":0},0,0,0,0,null,0]
[{"$f":"IF(INTRO!$E$39=\"Non endémique\",\" \",IF(COUNTRY_INFO!A57=0,\" \",COUNTRY_INFO!A57))","v":"NIGER"},{"$f":"IF(INTRO!$E$39=\"Non endémique\",\" \",IF(COUNTRY_INFO!B57=0,\" \",COUNTRY_INFO!B57))","v":"Tahoua"},{"$f":"IF(INTRO!$E$39=\"Non endémique\",\" \",IF(COUNTRY_INFO!C57=0,\" \",COUNTRY_INFO!C57))","v":"Tillia"},{"$f":"IF(INTRO!$E$39=\"Non endémique\",0,IF(INTRO!$E$39=\"Endémique mais pas de CP\",IF(COUNTRY_INFO!$H57=1,COUNTRY_INFO!F57+COUNTRY_INFO!G57,0),IF(COUNTRY_INFO!$H57=1,COUNTRY_INFO!F57+COUNTRY_INFO!G57,IF(COUNTRY_INFO!$I57=1,IF(COUNTRY_INFO!M57>=(COUNTRY_INFO!F57+COUNTRY_INFO!G57),COUNTRY_INFO!F57+COUNTRY_INFO!G57,COUNTRY_INFO!$M57),0))))","v":0},{"$f":"IF(AND(INTRO!$E$39=\"Non endémique\",INTRO!$E$37=\"Non endémique\"),\"Non requis\",IF(INTRO!$E$39=\"Non endémique\",\"Traiter avec DEC\",COUNTRY_INFO!V57))","v":0},{"$f":"IF(INTRO!$E$39<>\"Non endémique\",COUNTRY_INFO!W57,\"Non requis\")","v":0},{"$f":"IF(COUNTRY_INFO!H57=1, IF($E57=1,$D57, 0),0)","v":0},{"$f":"IF(COUNTRY_INFO!I57=1, IF(AND(COUNTRY_INFO!$I57=1,$F57<>0),IF(COUNTRY_INFO!M57>=(COUNTRY_INFO!F57+COUNTRY_INFO!G57),COUNTRY_INFO!F57+COUNTRY_INFO!G57,COUNTRY_INFO!$M57), 0),0)","v":0},0,0,0,0,null,0]
[{"$f":"IF(INTRO!$E$39=\"Non endémique\",\" \",IF(COUNTRY_INFO!A58=0,\" \",COUNTRY_INFO!A58))","v":"NIGER"},{"$f":"IF(INTRO!$E$39=\"Non endémique\",\" \",IF(COUNTRY_INFO!B58=0,\" \",COUNTRY_INFO!B58))","v":"Tillabery"},{"$f":"IF(INTRO!$E$39=\"Non endémique\",\" \",IF(COUNTRY_INFO!C58=0,\" \",COUNTRY_INFO!C58))","v":"Fillingue"},{"$f":"IF(INTRO!$E$39=\"Non endémique\",0,IF(INTRO!$E$39=\"Endémique mais pas de CP\",IF(COUNTRY_INFO!$H58=1,COUNTRY_INFO!F58+COUNTRY_INFO!G58,0),IF(COUNTRY_INFO!$H58=1,COUNTRY_INFO!F58+COUNTRY_INFO!G58,IF(COUNTRY_INFO!$I58=1,IF(COUNTRY_INFO!M58>=(COUNTRY_INFO!F58+COUNTRY_INFO!G58),COUNTRY_INFO!F58+COUNTRY_INFO!G58,COUNTRY_INFO!$M58),0))))","v":0},{"$f":"IF(AND(INTRO!$E$39=\"Non endémique\",INTRO!$E$37=\"Non endémique\"),\"Non requis\",IF(INTRO!$E$39=\"Non endémique\",\"Traiter avec DEC\",COUNTRY_INFO!V58))","v":0},{"$f":"IF(INTRO!$E$39<>\"Non endémique\",COUNTRY_INFO!W58,\"Non requis\")","v":0},{"$f":"IF(COUNTRY_INFO!H58=1, IF($E58=1,$D58, 0),0)","v":0},{"$f":"IF(COUNTRY_INFO!I58=1, IF(AND(COUNTRY_INFO!$I58=1,$F58<>0),IF(COUNTRY_INFO!M58>=(COUNTRY_INFO!F58+COUNTRY_INFO!G58),COUNTRY_INFO!F58+COUNTRY_INFO!G58,COUNTRY_INFO!$M58), 0),0)","v":0},0,0,0,0,null,0]
[{"$f":"IF(INTRO!$E$39=\"Non endémique\",\" \",IF(COUNTRY_INFO!A59=0,\" \",COUNTRY_INFO!A59))","v":"NIGER"},{"$f":"IF(INTRO!$E$39=\"Non endémique\",\" \",IF(COUNTRY_INFO!B59=0,\" \",COUNTRY_INFO!B59))","v":"Tillabery"},{"$f":"IF(INTRO!$E$39=\"Non endémique\",\" \",IF(COUNTRY_INFO!C59=0,\" \",COUNTRY_INFO!C59))","v":"Balleyara"},{"$f":"IF(INTRO!$E$39=\"Non endémique\",0,IF(INTRO!$E$39=\"Endémique mais pas de CP\",IF(COUNTRY_INFO!$H59=1,COUNTRY_INFO!F59+COUNTRY_INFO!G59,0),IF(COUNTRY_INFO!$H59=1,COUNTRY_INFO!F59+COUNTRY_INFO!G59,IF(COUNTRY_INFO!$I59=1,IF(COUNTRY_INFO!M59>=(COUNTRY_INFO!F59+COUNTRY_INFO!G59),COUNTRY_INFO!F59+COUNTRY_INFO!G59,COUNTRY_INFO!$M59),0))))","v":0},{"$f":"IF(AND(INTRO!$E$39=\"Non endémique\",INTRO!$E$37=\"Non endémique\"),\"Non requis\",IF(INTRO!$E$39=\"Non endémique\",\"Traiter avec DEC\",COUNTRY_INFO!V59))","v":0},{"$f":"IF(INTRO!$E$39<>\"Non endémique\",COUNTRY_INFO!W59,\"Non requis\")","v":0},{"$f":"IF(COUNTRY_INFO!H59=1, IF($E59=1,$D59, 0),0)","v":0},{"$f":"IF(COUNTRY_INFO!I59=1, IF(AND(COUNTRY_INFO!$I59=1,$F59<>0),IF(COUNTRY_INFO!M59>=(COUNTRY_INFO!F59+COUNTRY_INFO!G59),COUNTRY_INFO!F59+COUNTRY_INFO!G59,COUNTRY_INFO!$M59), 0),0)","v":0},0,0,0,0,null,0]
[{"$f":"IF(INTRO!$E$39=\"Non endémique\",\" \",IF(COUNTRY_INFO!A60=0,\" \",COUNTRY_INFO!A60))","v":"NIGER"},{"$f":"IF(INTRO!$E$39=\"Non endémique\",\" \",IF(COUNTRY_INFO!B60=0,\" \",COUNTRY_INFO!B60))","v":"Tillabery"},{"$f":"IF(INTRO!$E$39=\"Non endémique\",\" \",IF(COUNTRY_INFO!C60=0,\" \",COUNTRY_INFO!C60))","v":"Abala"},{"$f":"IF(INTRO!$E$39=\"Non endémique\",0,IF(INTRO!$E$39=\"Endémique mais pas de CP\",IF(COUNTRY_INFO!$H60=1,COUNTRY_INFO!F60+COUNTRY_INFO!G60,0),IF(COUNTRY_INFO!$H60=1,COUNTRY_INFO!F60+COUNTRY_INFO!G60,IF(COUNTRY_INFO!$I60=1,IF(COUNTRY_INFO!M60>=(COUNTRY_INFO!F60+COUNTRY_INFO!G60),COUNTRY_INFO!F60+COUNTRY_INFO!G60,COUNTRY_INFO!$M60),0))))","v":0},{"$f":"IF(AND(INTRO!$E$39=\"Non endémique\",INTRO!$E$37=\"Non endémique\"),\"Non requis\",IF(INTRO!$E$39=\"Non endémique\",\"Traiter avec DEC\",COUNTRY_INFO!V60))","v":0},{"$f":"IF(INTRO!$E$39<>\"Non endémique\",COUNTRY_INFO!W60,\"Non requis\")","v":0},{"$f":"IF(COUNTRY_INFO!H60=1, IF($E60=1,$D60, 0),0)","v":0},{"$f":"IF(COUNTRY_INFO!I60=1, IF(AND(COUNTRY_INFO!$I60=1,$F60<>0),IF(COUNTRY_INFO!M60>=(COUNTRY_INFO!F60+COUNTRY_INFO!G60),COUNTRY_INFO!F60+COUNTRY_INFO!G60,COUNTRY_INFO!$M60), 0),0)","v":0},0,0,0,0,null,0]
[{"$f":"IF(INTRO!$E$39=\"Non endémique\",\" \",IF(COUNTRY_INFO!A61=0,\" \",COUNTRY_INFO!A61))","v":"NIGER"},{"$f":"IF(INTRO!$E$39=\"Non endémique\",\" \",IF(COUNTRY_INFO!B61=0,\" \",COUNTRY_INFO!B61))","v":"Tillabery"},{"$f":"IF(INTRO!$E$39=\"Non endémique\",\" \",IF(COUNTRY_INFO!C61=0,\" \",COUNTRY_INFO!C61))","v":"Kollo"},{"$f":"IF(INTRO!$E$39=\"Non endémique\",0,IF(INTRO!$E$39=\"Endémique mais pas de CP\",IF(COUNTRY_INFO!$H61=1,COUNTRY_INFO!F61+COUNTRY_INFO!G61,0),IF(COUNTRY_INFO!$H61=1,COUNTRY_INFO!F61+COUNTRY_INFO!G61,IF(COUNTRY_INFO!$I61=1,IF(COUNTRY_INFO!M61>=(COUNTRY_INFO!F61+COUNTRY_INFO!G61),COUNTRY_INFO!F61+COUNTRY_INFO!G61,COUNTRY_INFO!$M61),0))))","v":0},{"$f":"IF(AND(INTRO!$E$39=\"Non endémique\",INTRO!$E$37=\"Non endémique\"),\"Non requis\",IF(INTRO!$E$39=\"Non endémique\",\"Traiter avec DEC\",COUNTRY_INFO!V61))","v":0},{"$f":"IF(INTRO!$E$39<>\"Non endémique\",COUNTRY_INFO!W61,\"Non requis\")","v":0},{"$f":"IF(COUNTRY_INFO!H61=1, IF($E61=1,$D61, 0),0)","v":0},{"$f":"IF(COUNTRY_INFO!I61=1, IF(AND(COUNTRY_INFO!$I61=1,$F61<>0),IF(COUNTRY_INFO!M61>=(COUNTRY_INFO!F61+COUNTRY_INFO!G61),COUNTRY_INFO!F61+COUNTRY_INFO!G61,COUNTRY_INFO!$M61), 0),0)","v":0},0,0,0,0,null,0]
[{"$f":"IF(INTRO!$E$39=\"Non endémique\",\" \",IF(COUNTRY_INFO!A62=0,\" \",COUNTRY_INFO!A62))","v":"NIGER"},{"$f":"IF(INTRO!$E$39=\"Non endémique\",\" \",IF(COUNTRY_INFO!B62=0,\" \",COUNTRY_INFO!B62))","v":"Tillabery"},{"$f":"IF(INTRO!$E$39=\"Non endémique\",\" \",IF(COUNTRY_INFO!C62=0,\" \",COUNTRY_INFO!C62))","v":"Ouallam"},{"$f":"IF(INTRO!$E$39=\"Non endémique\",0,IF(INTRO!$E$39=\"Endémique mais pas de CP\",IF(COUNTRY_INFO!$H62=1,COUNTRY_INFO!F62+COUNTRY_INFO!G62,0),IF(COUNTRY_INFO!$H62=1,COUNTRY_INFO!F62+COUNTRY_INFO!G62,IF(COUNTRY_INFO!$I62=1,IF(COUNTRY_INFO!M62>=(COUNTRY_INFO!F62+COUNTRY_INFO!G62),COUNTRY_INFO!F62+COUNTRY_INFO!G62,COUNTRY_INFO!$M62),0))))","v":0},{"$f":"IF(AND(INTRO!$E$39=\"Non endémique\",INTRO!$E$37=\"Non endémique\"),\"Non requis\",IF(INTRO!$E$39=\"Non endémique\",\"Traiter avec DEC\",COUNTRY_INFO!V62))","v":0},{"$f":"IF(INTRO!$E$39<>\"Non endémique\",COUNTRY_INFO!W62,\"Non requis\")","v":0},{"$f":"IF(COUNTRY_INFO!H62=1, IF($E62=1,$D62, 0),0)","v":0},{"$f":"IF(COUNTRY_INFO!I62=1, IF(AND(COUNTRY_INFO!$I62=1,$F62<>0),IF(COUNTRY_INFO!M62>=(COUNTRY_INFO!F62+COUNTRY_INFO!G62),COUNTRY_INFO!F62+COUNTRY_INFO!G62,COUNTRY_INFO!$M62), 0),0)","v":0},0,0,0,0,null,0]
[{"$f":"IF(INTRO!$E$39=\"Non endémique\",\" \",IF(COUNTRY_INFO!A63=0,\" \",COUNTRY_INFO!A63))","v":"NIGER"},{"$f":"IF(INTRO!$E$39=\"Non endémique\",\" \",IF(COUNTRY_INFO!B63=0,\" \",COUNTRY_INFO!B63))","v":"Tillabery"},{"$f":"IF(INTRO!$E$39=\"Non endémique\",\" \",IF(COUNTRY_INFO!C63=0,\" \",COUNTRY_INFO!C63))","v":"Banibangou"},{"$f":"IF(INTRO!$E$39=\"Non endémique\",0,IF(INTRO!$E$39=\"Endémique mais pas de CP\",IF(COUNTRY_INFO!$H63=1,COUNTRY_INFO!F63+COUNTRY_INFO!G63,0),IF(COUNTRY_INFO!$H63=1,COUNTRY_INFO!F63+COUNTRY_INFO!G63,IF(COUNTRY_INFO!$I63=1,IF(COUNTRY_INFO!M63>=(COUNTRY_INFO!F63+COUNTRY_INFO!G63),COUNTRY_INFO!F63+COUNTRY_INFO!G63,COUNTRY_INFO!$M63),0))))","v":0},{"$f":"IF(AND(INTRO!$E$39=\"Non endémique\",INTRO!$E$37=\"Non endémique\"),\"Non requis\",IF(INTRO!$E$39=\"Non endémique\",\"Traiter avec DEC\",COUNTRY_INFO!V63))","v":0},{"$f":"IF(INTRO!$E$39<>\"Non endémique\",COUNTRY_INFO!W63,\"Non requis\")","v":0},{"$f":"IF(COUNTRY_INFO!H63=1, IF($E63=1,$D63, 0),0)","v":0},{"$f":"IF(COUNTRY_INFO!I63=1, IF(AND(COUNTRY_INFO!$I63=1,$F63<>0),IF(COUNTRY_INFO!M63>=(COUNTRY_INFO!F63+COUNTRY_INFO!G63),COUNTRY_INFO!F63+COUNTRY_INFO!G63,COUNTRY_INFO!$M63), 0),0)","v":0},0,0,0,0,null,0]
[{"$f":"IF(INTRO!$E$39=\"Non endémique\",\" \",IF(COUNTRY_INFO!A64=0,\" \",COUNTRY_INFO!A64))","v":"NIGER"},{"$f":"IF(INTRO!$E$39=\"Non endémique\",\" \",IF(COUNTRY_INFO!B64=0,\" \",COUNTRY_INFO!B64))","v":"Tillabery"},{"$f":"IF(INTRO!$E$39=\"Non endémique\",\" \",IF(COUNTRY_INFO!C64=0,\" \",COUNTRY_INFO!C64))","v":"Say"},{"$f":"IF(INTRO!$E$39=\"Non endémique\",0,IF(INTRO!$E$39=\"Endémique mais pas de CP\",IF(COUNTRY_INFO!$H64=1,COUNTRY_INFO!F64+COUNTRY_INFO!G64,0),IF(COUNTRY_INFO!$H64=1,COUNTRY_INFO!F64+COUNTRY_INFO!G64,IF(COUNTRY_INFO!$I64=1,IF(COUNTRY_INFO!M64>=(COUNTRY_INFO!F64+COUNTRY_INFO!G64),COUNTRY_INFO!F64+COUNTRY_INFO!G64,COUNTRY_INFO!$M64),0))))","v":0},{"$f":"IF(AND(INTRO!$E$39=\"Non endémique\",INTRO!$E$37=\"Non endémique\"),\"Non requis\",IF(INTRO!$E$39=\"Non endémique\",\"Traiter avec DEC\",COUNTRY_INFO!V64))","v":0},{"$f":"IF(INTRO!$E$39<>\"Non endémique\",COUNTRY_INFO!W64,\"Non requis\")","v":0},{"$f":"IF(COUNTRY_INFO!H64=1, IF($E64=1,$D64, 0),0)","v":0},{"$f":"IF(COUNTRY_INFO!I64=1, IF(AND(COUNTRY_INFO!$I64=1,$F64<>0),IF(COUNTRY_INFO!M64>=(COUNTRY_INFO!F64+COUNTRY_INFO!G64),COUNTRY_INFO!F64+COUNTRY_INFO!G64,COUNTRY_INFO!$M64), 0),0)","v":0},0,0,0,0,null,0]
[{"$f":"IF(INTRO!$E$39=\"Non endémique\",\" \",IF(COUNTRY_INFO!A65=0,\" \",COUNTRY_INFO!A65))","v":"NIGER"},{"$f":"IF(INTRO!$E$39=\"Non endémique\",\" \",IF(COUNTRY_INFO!B65=0,\" \",COUNTRY_INFO!B65))","v":"Tillabery"},{"$f":"IF(INTRO!$E$39=\"Non endémique\",\" \",IF(COUNTRY_INFO!C65=0,\" \",COUNTRY_INFO!C65))","v":"Torodi"},{"$f":"IF(INTRO!$E$39=\"Non endémique\",0,IF(INTRO!$E$39=\"Endémique mais pas de CP\",IF(COUNTRY_INFO!$H65=1,COUNTRY_INFO!F65+COUNTRY_INFO!G65,0),IF(COUNTRY_INFO!$H65=1,COUNTRY_INFO!F65+COUNTRY_INFO!G65,IF(COUNTRY_INFO!$I65=1,IF(COUNTRY_INFO!M65>=(COUNTRY_INFO!F65+COUNTRY_INFO!G65),COUNTRY_INFO!F65+COUNTRY_INFO!G65,COUNTRY_INFO!$M65),0))))","v":0},{"$f":"IF(AND(INTRO!$E$39=\"Non endémique\",INTRO!$E$37=\"Non endémique\"),\"Non requis\",IF(INTRO!$E$39=\"Non endémique\",\"Traiter avec DEC\",COUNTRY_INFO!V65))","v":0},{"$f":"IF(INTRO!$E$39<>\"Non endémique\",COUNTRY_INFO!W65,\"Non requis\")","v":0},{"$f":"IF(COUNTRY_INFO!H65=1, IF($E65=1,$D65, 0),0)","v":0},{"$f":"IF(COUNTRY_INFO!I65=1, IF(AND(COUNTRY_INFO!$I65=1,$F65<>0),IF(COUNTRY_INFO!M65>=(COUNTRY_INFO!F65+COUNTRY_INFO!G65),COUNTRY_INFO!F65+COUNTRY_INFO!G65,COUNTRY_INFO!$M65), 0),0)","v":0},0,0,0,0,null,0]
[{"$f":"IF(INTRO!$E$39=\"Non endémique\",\" \",IF(COUNTRY_INFO!A66=0,\" \",COUNTRY_INFO!A66))","v":"NIGER"},{"$f":"IF(INTRO!$E$39=\"Non endémique\",\" \",IF(COUNTRY_INFO!B66=0,\" \",COUNTRY_INFO!B66))","v":"Tillabery"},{"$f":"IF(INTRO!$E$39=\"Non endémique\",\" \",IF(COUNTRY_INFO!C66=0,\" \",COUNTRY_INFO!C66))","v":"Tera"},{"$f":"IF(INTRO!$E$39=\"Non endémique\",0,IF(INTRO!$E$39=\"Endémique mais pas de CP\",IF(COUNTRY_INFO!$H66=1,COUNTRY_INFO!F66+COUNTRY_INFO!G66,0),IF(COUNTRY_INFO!$H66=1,COUNTRY_INFO!F66+COUNTRY_INFO!G66,IF(COUNTRY_INFO!$I66=1,IF(COUNTRY_INFO!M66>=(COUNTRY_INFO!F66+COUNTRY_INFO!G66),COUNTRY_INFO!F66+COUNTRY_INFO!G66,COUNTRY_INFO!$M66),0))))","v":0},{"$f":"IF(AND(INTRO!$E$39=\"Non endémique\",INTRO!$E$37=\"Non endémique\"),\"Non requis\",IF(INTRO!$E$39=\"Non endémique\",\"Traiter avec DEC\",COUNTRY_INFO!V66))","v":0},{"$f":"IF(INTRO!$E$39<>\"Non endémique\",COUNTRY_INFO!W66,\"Non requis\")","v":0},{"$f":"IF(COUNTRY_INFO!H66=1, IF($E66=1,$D66, 0),0)","v":0},{"$f":"IF(COUNTRY_INFO!I66=1, IF(AND(COUNTRY_INFO!$I66=1,$F66<>0),IF(COUNTRY_INFO!M66>=(COUNTRY_INFO!F66+COUNTRY_INFO!G66),COUNTRY_INFO!F66+COUNTRY_INFO!G66,COUNTRY_INFO!$M66), 0),0)","v":0},0,0,0,0,null,0]
[{"$f":"IF(INTRO!$E$39=\"Non endémique\",\" \",IF(COUNTRY_INFO!A67=0,\" \",COUNTRY_INFO!A67))","v":"NIGER"},{"$f":"IF(INTRO!$E$39=\"Non endémique\",\" \",IF(COUNTRY_INFO!B67=0,\" \",COUNTRY_INFO!B67))","v":"Tillabery"},{"$f":"IF(INTRO!$E$39=\"Non endémique\",\" \",IF(COUNTRY_INFO!C67=0,\" \",COUNTRY_INFO!C67))","v":"Bankilare"},{"$f":"IF(INTRO!$E$39=\"Non endémique\",0,IF(INTRO!$E$39=\"Endémique mais pas de CP\",IF(COUNTRY_INFO!$H67=1,COUNTRY_INFO!F67+COUNTRY_INFO!G67,0),IF(COUNTRY_INFO!$H67=1,COUNTRY_INFO!F67+COUNTRY_INFO!G67,IF(COUNTRY_INFO!$I67=1,IF(COUNTRY_INFO!M67>=(COUNTRY_INFO!F67+COUNTRY_INFO!G67),COUNTRY_INFO!F67+COUNTRY_INFO!G67,COUNTRY_INFO!$M67),0))))","v":0},{"$f":"IF(AND(INTRO!$E$39=\"Non endémique\",INTRO!$E$37=\"Non endémique\"),\"Non requis\",IF(INTRO!$E$39=\"Non endémique\",\"Traiter avec DEC\",COUNTRY_INFO!V67))","v":0},{"$f":"IF(INTRO!$E$39<>\"Non endémique\",COUNTRY_INFO!W67,\"Non requis\")","v":0},{"$f":"IF(COUNTRY_INFO!H67=1, IF($E67=1,$D67, 0),0)","v":0},{"$f":"IF(COUNTRY_INFO!I67=1, IF(AND(COUNTRY_INFO!$I67=1,$F67<>0),IF(COUNTRY_INFO!M67>=(COUNTRY_INFO!F67+COUNTRY_INFO!G67),COUNTRY_INFO!F67+COUNTRY_INFO!G67,COUNTRY_INFO!$M67), 0),0)","v":0},0,0,0,0,null,0]
[{"$f":"IF(INTRO!$E$39=\"Non endémique\",\" \",IF(COUNTRY_INFO!A68=0,\" \",COUNTRY_INFO!A68))","v":"NIGER"},{"$f":"IF(INTRO!$E$39=\"Non endémique\",\" \",IF(COUNTRY_INFO!B68=0,\" \",COUNTRY_INFO!B68))","v":"Tillabery"},{"$f":"IF(INTRO!$E$39=\"Non endémique\",\" \",IF(COUNTRY_INFO!C68=0,\" \",COUNTRY_INFO!C68))","v":"Gothèye"},{"$f":"IF(INTRO!$E$39=\"Non endémique\",0,IF(INTRO!$E$39=\"Endémique mais pas de CP\",IF(COUNTRY_INFO!$H68=1,COUNTRY_INFO!F68+COUNTRY_INFO!G68,0),IF(COUNTRY_INFO!$H68=1,COUNTRY_INFO!F68+COUNTRY_INFO!G68,IF(COUNTRY_INFO!$I68=1,IF(COUNTRY_INFO!M68>=(COUNTRY_INFO!F68+COUNTRY_INFO!G68),COUNTRY_INFO!F68+COUNTRY_INFO!G68,COUNTRY_INFO!$M68),0))))","v":0},{"$f":"IF(AND(INTRO!$E$39=\"Non endémique\",INTRO!$E$37=\"Non endémique\"),\"Non requis\",IF(INTRO!$E$39=\"Non endémique\",\"Traiter avec DEC\",COUNTRY_INFO!V68))","v":0},{"$f":"IF(INTRO!$E$39<>\"Non endémique\",COUNTRY_INFO!W68,\"Non requis\")","v":0},{"$f":"IF(COUNTRY_INFO!H68=1, IF($E68=1,$D68, 0),0)","v":0},{"$f":"IF(COUNTRY_INFO!I68=1, IF(AND(COUNTRY_INFO!$I68=1,$F68<>0),IF(COUNTRY_INFO!M68>=(COUNTRY_INFO!F68+COUNTRY_INFO!G68),COUNTRY_INFO!F68+COUNTRY_INFO!G68,COUNTRY_INFO!$M68), 0),0)","v":0},0,0,0,0,null,0]
[{"$f":"IF(INTRO!$E$39=\"Non endémique\",\" \",IF(COUNTRY_INFO!A69=0,\" \",COUNTRY_INFO!A69))","v":"NIGER"},{"$f":"IF(INTRO!$E$39=\"Non endémique\",\" \",IF(COUNTRY_INFO!B69=0,\" \",COUNTRY_INFO!B69))","v":"Tillabery"},{"$f":"IF(INTRO!$E$39=\"Non endémique\",\" \",IF(COUNTRY_INFO!C69=0,\" \",COUNTRY_INFO!C69))","v":"Tillaberi"},{"$f":"IF(INTRO!$E$39=\"Non endémique\",0,IF(INTRO!$E$39=\"Endémique mais pas de CP\",IF(COUNTRY_INFO!$H69=1,COUNTRY_INFO!F69+COUNTRY_INFO!G69,0),IF(COUNTRY_INFO!$H69=1,COUNTRY_INFO!F69+COUNTRY_INFO!G69,IF(COUNTRY_INFO!$I69=1,IF(COUNTRY_INFO!M69>=(COUNTRY_INFO!F69+COUNTRY_INFO!G69),COUNTRY_INFO!F69+COUNTRY_INFO!G69,COUNTRY_INFO!$M69),0))))","v":0},{"$f":"IF(AND(INTRO!$E$39=\"Non endémique\",INTRO!$E$37=\"Non endémique\"),\"Non requis\",IF(INTRO!$E$39=\"Non endémique\",\"Traiter avec DEC\",COUNTRY_INFO!V69))","v":0},{"$f":"IF(INTRO!$E$39<>\"Non endémique\",COUNTRY_INFO!W69,\"Non requis\")","v":0},{"$f":"IF(COUNTRY_INFO!H69=1, IF($E69=1,$D69, 0),0)","v":0},{"$f":"IF(COUNTRY_INFO!I69=1, IF(AND(COUNTRY_INFO!$I69=1,$F69<>0),IF(COUNTRY_INFO!M69>=(COUNTRY_INFO!F69+COUNTRY_INFO!G69),COUNTRY_INFO!F69+COUNTRY_INFO!G69,COUNTRY_INFO!$M69), 0),0)","v":0},0,0,0,0,null,0]
[{"$f":"IF(INTRO!$E$39=\"Non endémique\",\" \",IF(COUNTRY_INFO!A70=0,\" \",COUNTRY_INFO!A70))","v":"NIGER"},{"$f":"IF(INTRO!$E$39=\"Non endémique\",\" \",IF(COUNTRY_INFO!B70=0,\" \",COUNTRY_INFO!B70))","v":"Tillabery"},{"$f":"IF(INTRO!$E$39=\"Non endémique\",\" \",IF(COUNTRY_INFO!C70=0,\" \",COUNTRY_INFO!C70))","v":"Ayorou"},{"$f":"IF(INTRO!$E$39=\"Non endémique\",0,IF(INTRO!$E$39=\"Endémique mais pas de CP\",IF(COUNTRY_INFO!$H70=1,COUNTRY_INFO!F70+COUNTRY_INFO!G70,0),IF(COUNTRY_INFO!$H70=1,COUNTRY_INFO!F70+COUNTRY_INFO!G70,IF(COUNTRY_INFO!$I70=1,IF(COUNTRY_INFO!M70>=(COUNTRY_INFO!F70+COUNTRY_INFO!G70),COUNTRY_INFO!F70+COUNTRY_INFO!G70,COUNTRY_INFO!$M70),0))))","v":0},{"$f":"IF(AND(INTRO!$E$39=\"Non endémique\",INTRO!$E$37=\"Non endémique\"),\"Non requis\",IF(INTRO!$E$39=\"Non endémique\",\"Traiter avec DEC\",COUNTRY_INFO!V70))","v":0},{"$f":"IF(INTRO!$E$39<>\"Non endémique\",COUNTRY_INFO!W70,\"Non requis\")","v":0},{"$f":"IF(COUNTRY_INFO!H70=1, IF($E70=1,$D70, 0),0)","v":0},{"$f":"IF(COUNTRY_INFO!I70=1, IF(AND(COUNTRY_INFO!$I70=1,$F70<>0),IF(COUNTRY_INFO!M70>=(COUNTRY_INFO!F70+COUNTRY_INFO!G70),COUNTRY_INFO!F70+COUNTRY_INFO!G70,COUNTRY_INFO!$M70), 0),0)","v":0},0,0,0,0,null,0]
[{"$f":"IF(INTRO!$E$39=\"Non endémique\",\" \",IF(COUNTRY_INFO!A71=0,\" \",COUNTRY_INFO!A71))","v":"NIGER"},{"$f":"IF(INTRO!$E$39=\"Non endémique\",\" \",IF(COUNTRY_INFO!B71=0,\" \",COUNTRY_INFO!B71))","v":"Zinder"},{"$f":"IF(INTRO!$E$39=\"Non endémique\",\" \",IF(COUNTRY_INFO!C71=0,\" \",COUNTRY_INFO!C71))","v":"Goure"},{"$f":"IF(INTRO!$E$39=\"Non endémique\",0,IF(INTRO!$E$39=\"Endémique mais pas de CP\",IF(COUNTRY_INFO!$H71=1,COUNTRY_INFO!F71+COUNTRY_INFO!G71,0),IF(COUNTRY_INFO!$H71=1,COUNTRY_INFO!F71+COUNTRY_INFO!G71,IF(COUNTRY_INFO!$I71=1,IF(COUNTRY_INFO!M71>=(COUNTRY_INFO!F71+COUNTRY_INFO!G71),COUNTRY_INFO!F71+COUNTRY_INFO!G71,COUNTRY_INFO!$M71),0))))","v":0},{"$f":"IF(AND(INTRO!$E$39=\"Non endémique\",INTRO!$E$37=\"Non endémique\"),\"Non requis\",IF(INTRO!$E$39=\"Non endémique\",\"Traiter avec DEC\",COUNTRY_INFO!V71))","v":0},{"$f":"IF(INTRO!$E$39<>\"Non endémique\",COUNTRY_INFO!W71,\"Non requis\")","v":0},{"$f":"IF(COUNTRY_INFO!H71=1, IF($E71=1,$D71, 0),0)","v":0},{"$f":"IF(COUNTRY_INFO!I71=1, IF(AND(COUNTRY_INFO!$I71=1,$F71<>0),IF(COUNTRY_INFO!M71>=(COUNTRY_INFO!F71+COUNTRY_INFO!G71),COUNTRY_INFO!F71+COUNTRY_INFO!G71,COUNTRY_INFO!$M71), 0),0)","v":0},0,0,0,0,null,0]
[{"$f":"IF(INTRO!$E$39=\"Non endémique\",\" \",IF(COUNTRY_INFO!A72=0,\" \",COUNTRY_INFO!A72))","v":"NIGER"},{"$f":"IF(INTRO!$E$39=\"Non endémique\",\" \",IF(COUNTRY_INFO!B72=0,\" \",COUNTRY_INFO!B72))","v":"Zinder"},{"$f":"IF(INTRO!$E$39=\"Non endémique\",\" \",IF(COUNTRY_INFO!C72=0,\" \",COUNTRY_INFO!C72))","v":"Tesker"},{"$f":"IF(INTRO!$E$39=\"Non endémique\",0,IF(INTRO!$E$39=\"Endémique mais pas de CP\",IF(COUNTRY_INFO!$H72=1,COUNTRY_INFO!F72+COUNTRY_INFO!G72,0),IF(COUNTRY_INFO!$H72=1,COUNTRY_INFO!F72+COUNTRY_INFO!G72,IF(COUNTRY_INFO!$I72=1,IF(COUNTRY_INFO!M72>=(COUNTRY_INFO!F72+COUNTRY_INFO!G72),COUNTRY_INFO!F72+COUNTRY_INFO!G72,COUNTRY_INFO!$M72),0))))","v":0},{"$f":"IF(AND(INTRO!$E$39=\"Non endémique\",INTRO!$E$37=\"Non endémique\"),\"Non requis\",IF(INTRO!$E$39=\"Non endémique\",\"Traiter avec DEC\",COUNTRY_INFO!V72))","v":0},{"$f":"IF(INTRO!$E$39<>\"Non endémique\",COUNTRY_INFO!W72,\"Non requis\")","v":0},{"$f":"IF(COUNTRY_INFO!H72=1, IF($E72=1,$D72, 0),0)","v":0},{"$f":"IF(COUNTRY_INFO!I72=1, IF(AND(COUNTRY_INFO!$I72=1,$F72<>0),IF(COUNTRY_INFO!M72>=(COUNTRY_INFO!F72+COUNTRY_INFO!G72),COUNTRY_INFO!F72+COUNTRY_INFO!G72,COUNTRY_INFO!$M72), 0),0)","v":0},0,0,0,0,null,0]
[{"$f":"IF(INTRO!$E$39=\"Non endémique\",\" \",IF(COUNTRY_INFO!A73=0,\" \",COUNTRY_INFO!A73))","v":"NIGER"},{"$f":"IF(INTRO!$E$39=\"Non endémique\",\" \",IF(COUNTRY_INFO!B73=0,\" \",COUNTRY_INFO!B73))","v":"Zinder"},{"$f":"IF(INTRO!$E$39=\"Non endémique\",\" \",IF(COUNTRY_INFO!C73=0,\" \",COUNTRY_INFO!C73))","v":"Magaria"},{"$f":"IF(INTRO!$E$39=\"Non endémique\",0,IF(INTRO!$E$39=\"Endémique mais pas de CP\",IF(COUNTRY_INFO!$H73=1,COUNTRY_INFO!F73+COUNTRY_INFO!G73,0),IF(COUNTRY_INFO!$H73=1,COUNTRY_INFO!F73+COUNTRY_INFO!G73,IF(COUNTRY_INFO!$I73=1,IF(COUNTRY_INFO!M73>=(COUNTRY_INFO!F73+COUNTRY_INFO!G73),COUNTRY_INFO!F73+COUNTRY_INFO!G73,COUNTRY_INFO!$M73),0))))","v":0},{"$f":"IF(AND(INTRO!$E$39=\"Non endémique\",INTRO!$E$37=\"Non endémique\"),\"Non requis\",IF(INTRO!$E$39=\"Non endémique\",\"Traiter avec DEC\",COUNTRY_INFO!V73))","v":0},{"$f":"IF(INTRO!$E$39<>\"Non endémique\",COUNTRY_INFO!W73,\"Non requis\")","v":0},{"$f":"IF(COUNTRY_INFO!H73=1, IF($E73=1,$D73, 0),0)","v":0},{"$f":"IF(COUNTRY_INFO!I73=1, IF(AND(COUNTRY_INFO!$I73=1,$F73<>0),IF(COUNTRY_INFO!M73>=(COUNTRY_INFO!F73+COUNTRY_INFO!G73),COUNTRY_INFO!F73+COUNTRY_INFO!G73,COUNTRY_INFO!$M73), 0),0)","v":0},0,0,0,0,null,0]
[{"$f":"IF(INTRO!$E$39=\"Non endémique\",\" \",IF(COUNTRY_INFO!A74=0,\" \",COUNTRY_INFO!A74))","v":"NIGER"},{"$f":"IF(INTRO!$E$39=\"Non endémique\",\" \",IF(COUNTRY_INFO!B74=0,\" \",COUNTRY_INFO!B74))","v":"Zinder"},{"$f":"IF(INTRO!$E$39=\"Non endémique\",\" \",IF(COUNTRY_INFO!C74=0,\" \",COUNTRY_INFO!C74))","v":"Dungass"},{"$f":"IF(INTRO!$E$39=\"Non endémique\",0,IF(INTRO!$E$39=\"Endémique mais pas de CP\",IF(COUNTRY_INFO!$H74=1,COUNTRY_INFO!F74+COUNTRY_INFO!G74,0),IF(COUNTRY_INFO!$H74=1,COUNTRY_INFO!F74+COUNTRY_INFO!G74,IF(COUNTRY_INFO!$I74=1,IF(COUNTRY_INFO!M74>=(COUNTRY_INFO!F74+COUNTRY_INFO!G74),COUNTRY_INFO!F74+COUNTRY_INFO!G74,COUNTRY_INFO!$M74),0))))","v":0},{"$f":"IF(AND(INTRO!$E$39=\"Non endémique\",INTRO!$E$37=\"Non endémique\"),\"Non requis\",IF(INTRO!$E$39=\"Non endémique\",\"Traiter avec DEC\",COUNTRY_INFO!V74))","v":0},{"$f":"IF(INTRO!$E$39<>\"Non endémique\",COUNTRY_INFO!W74,\"Non requis\")","v":0},{"$f":"IF(COUNTRY_INFO!H74=1, IF($E74=1,$D74, 0),0)","v":0},{"$f":"IF(COUNTRY_INFO!I74=1, IF(AND(COUNTRY_INFO!$I74=1,$F74<>0),IF(COUNTRY_INFO!M74>=(COUNTRY_INFO!F74+COUNTRY_INFO!G74),COUNTRY_INFO!F74+COUNTRY_INFO!G74,COUNTRY_INFO!$M74), 0),0)","v":0},0,0,0,0,null,0]
[{"$f":"IF(INTRO!$E$39=\"Non endémique\",\" \",IF(COUNTRY_INFO!A75=0,\" \",COUNTRY_INFO!A75))","v":"NIGER"},{"$f":"IF(INTRO!$E$39=\"Non endémique\",\" \",IF(COUNTRY_INFO!B75=0,\" \",COUNTRY_INFO!B75))","v":"Zinder"},{"$f":"IF(INTRO!$E$39=\"Non endémique\",\" \",IF(COUNTRY_INFO!C75=0,\" \",COUNTRY_INFO!C75))","v":"Matamaye"},{"$f":"IF(INTRO!$E$39=\"Non endémique\",0,IF(INTRO!$E$39=\"Endémique mais pas de CP\",IF(COUNTRY_INFO!$H75=1,COUNTRY_INFO!F75+COUNTRY_INFO!G75,0),IF(COUNTRY_INFO!$H75=1,COUNTRY_INFO!F75+COUNTRY_INFO!G75,IF(COUNTRY_INFO!$I75=1,IF(COUNTRY_INFO!M75>=(COUNTRY_INFO!F75+COUNTRY_INFO!G75),COUNTRY_INFO!F75+COUNTRY_INFO!G75,COUNTRY_INFO!$M75),0))))","v":0},{"$f":"IF(AND(INTRO!$E$39=\"Non endémique\",INTRO!$E$37=\"Non endémique\"),\"Non requis\",IF(INTRO!$E$39=\"Non endémique\",\"Traiter avec DEC\",COUNTRY_INFO!V75))","v":0},{"$f":"IF(INTRO!$E$39<>\"Non endémique\",COUNTRY_INFO!W75,\"Non requis\")","v":0},{"$f":"IF(COUNTRY_INFO!H75=1, IF($E75=1,$D75, 0),0)","v":0},{"$f":"IF(COUNTRY_INFO!I75=1, IF(AND(COUNTRY_INFO!$I75=1,$F75<>0),IF(COUNTRY_INFO!M75>=(COUNTRY_INFO!F75+COUNTRY_INFO!G75),COUNTRY_INFO!F75+COUNTRY_INFO!G75,COUNTRY_INFO!$M75), 0),0)","v":0},{"$f":"IF(G75<H75,0,IF($E75=1, (G75-H75)*2.8, 0))","v":0},{"$f":"IF($E75<$F75, H75*(F75-E75)*2.8, 0)","v":0},{"$f":"IF(AND($E75=1, $F75<>0), H75*2.8, 0)","v":0},{"$f":"SUM(I75:K75)","v":0},null,0]
[{"$f":"IF(INTRO!$E$39=\"Non endémique\",\" \",IF(COUNTRY_INFO!A76=0,\" \",COUNTRY_INFO!A76))","v":"NIGER"},{"$f":"IF(INTRO!$E$39=\"Non endémique\",\" \",IF(COUNTRY_INFO!B76=0,\" \",COUNTRY_INFO!B76))","v":"Zinder"},{"$f":"IF(INTRO!$E$39=\"Non endémique\",\" \",IF(COUNTRY_INFO!C76=0,\" \",COUNTRY_INFO!C76))","v":"Miriah"},{"$f":"IF(INTRO!$E$39=\"Non endémique\",0,IF(INTRO!$E$39=\"Endémique mais pas de CP\",IF(COUNTRY_INFO!$H76=1,COUNTRY_INFO!F76+COUNTRY_INFO!G76,0),IF(COUNTRY_INFO!$H76=1,COUNTRY_INFO!F76+COUNTRY_INFO!G76,IF(COUNTRY_INFO!$I76=1,IF(COUNTRY_INFO!M76>=(COUNTRY_INFO!F76+COUNTRY_INFO!G76),COUNTRY_INFO!F76+COUNTRY_INFO!G76,COUNTRY_INFO!$M76),0))))","v":0},{"$f":"IF(AND(INTRO!$E$39=\"Non endémique\",INTRO!$E$37=\"Non endémique\"),\"Non requis\",IF(INTRO!$E$39=\"Non endémique\",\"Traiter avec DEC\",COUNTRY_INFO!V76))","v":0},{"$f":"IF(INTRO!$E$39<>\"Non endémique\",COUNTRY_INFO!W76,\"Non requis\")","v":0},{"$f":"IF(COUNTRY_INFO!H76=1, IF($E76=1,$D76, 0),0)","v":0},{"$f":"IF(COUNTRY_INFO!I76=1, IF(AND(COUNTRY_INFO!$I76=1,$F76<>0),IF(COUNTRY_INFO!M76>=(COUNTRY_INFO!F76+COUNTRY_INFO!G76),COUNTRY_INFO!F76+COUNTRY_INFO!G76,COUNTRY_INFO!$M76), 0),0)","v":0},0,0,0,0,null,0]
[{"$f":"IF(INTRO!$E$39=\"Non endémique\",\" \",IF(COUNTRY_INFO!A77=0,\" \",COUNTRY_INFO!A77))","v":"NIGER"},{"$f":"IF(INTRO!$E$39=\"Non endémique\",\" \",IF(COUNTRY_INFO!B77=0,\" \",COUNTRY_INFO!B77))","v":"Zinder"},{"$f":"IF(INTRO!$E$39=\"Non endémique\",\" \",IF(COUNTRY_INFO!C77=0,\" \",COUNTRY_INFO!C77))","v":"Damagaram Takaya"},{"$f":"IF(INTRO!$E$39=\"Non endémique\",0,IF(INTRO!$E$39=\"Endémique mais pas de CP\",IF(COUNTRY_INFO!$H77=1,COUNTRY_INFO!F77+COUNTRY_INFO!G77,0),IF(COUNTRY_INFO!$H77=1,COUNTRY_INFO!F77+COUNTRY_INFO!G77,IF(COUNTRY_INFO!$I77=1,IF(COUNTRY_INFO!M77>=(COUNTRY_INFO!F77+COUNTRY_INFO!G77),COUNTRY_INFO!F77+COUNTRY_INFO!G77,COUNTRY_INFO!$M77),0))))","v":0},{"$f":"IF(AND(INTRO!$E$39=\"Non endémique\",INTRO!$E$37=\"Non endémique\"),\"Non requis\",IF(INTRO!$E$39=\"Non endémique\",\"Traiter avec DEC\",COUNTRY_INFO!V77))","v":0},{"$f":"IF(INTRO!$E$39<>\"Non endémique\",COUNTRY_INFO!W77,\"Non requis\")","v":0},{"$f":"IF(COUNTRY_INFO!H77=1, IF($E77=1,$D77, 0),0)","v":0},{"$f":"IF(COUNTRY_INFO!I77=1, IF(AND(COUNTRY_INFO!$I77=1,$F77<>0),IF(COUNTRY_INFO!M77>=(COUNTRY_INFO!F77+COUNTRY_INFO!G77),COUNTRY_INFO!F77+COUNTRY_INFO!G77,COUNTRY_INFO!$M77), 0),0)","v":0},0,0,0,0,null,0]
[{"$f":"IF(INTRO!$E$39=\"Non endémique\",\" \",IF(COUNTRY_INFO!A78=0,\" \",COUNTRY_INFO!A78))","v":"NIGER"},{"$f":"IF(INTRO!$E$39=\"Non endémique\",\" \",IF(COUNTRY_INFO!B78=0,\" \",COUNTRY_INFO!B78))","v":"Zinder"},{"$f":"IF(INTRO!$E$39=\"Non endémique\",\" \",IF(COUNTRY_INFO!C78=0,\" \",COUNTRY_INFO!C78))","v":"Takeita"},{"$f":"IF(INTRO!$E$39=\"Non endémique\",0,IF(INTRO!$E$39=\"Endémique mais pas de CP\",IF(COUNTRY_INFO!$H78=1,COUNTRY_INFO!F78+COUNTRY_INFO!G78,0),IF(COUNTRY_INFO!$H78=1,COUNTRY_INFO!F78+COUNTRY_INFO!G78,IF(COUNTRY_INFO!$I78=1,IF(COUNTRY_INFO!M78>=(COUNTRY_INFO!F78+COUNTRY_INFO!G78),COUNTRY_INFO!F78+COUNTRY_INFO!G78,COUNTRY_INFO!$M78),0))))","v":0},{"$f":"IF(AND(INTRO!$E$39=\"Non endémique\",INTRO!$E$37=\"Non endémique\"),\"Non requis\",IF(INTRO!$E$39=\"Non endémique\",\"Traiter avec DEC\",COUNTRY_INFO!V78))","v":0},{"$f":"IF(INTRO!$E$39<>\"Non endémique\",COUNTRY_INFO!W78,\"Non requis\")","v":0},{"$f":"IF(COUNTRY_INFO!H78=1, IF($E78=1,$D78, 0),0)","v":0},{"$f":"IF(COUNTRY_INFO!I78=1, IF(AND(COUNTRY_INFO!$I78=1,$F78<>0),IF(COUNTRY_INFO!M78>=(COUNTRY_INFO!F78+COUNTRY_INFO!G78),COUNTRY_INFO!F78+COUNTRY_INFO!G78,COUNTRY_INFO!$M78), 0),0)","v":0},0,0,0,0,null,0]
[{"$f":"IF(INTRO!$E$39=\"Non endémique\",\" \",IF(COUNTRY_INFO!A79=0,\" \",COUNTRY_INFO!A79))","v":"NIGER"},{"$f":"IF(INTRO!$E$39=\"Non endémique\",\" \",IF(COUNTRY_INFO!B79=0,\" \",COUNTRY_INFO!B79))","v":"Zinder"},{"$f":"IF(INTRO!$E$39=\"Non endémique\",\" \",IF(COUNTRY_INFO!C79=0,\" \",COUNTRY_INFO!C79))","v":"Tanout"},{"$f":"IF(INTRO!$E$39=\"Non endémique\",0,IF(INTRO!$E$39=\"Endémique mais pas de CP\",IF(COUNTRY_INFO!$H79=1,COUNTRY_INFO!F79+COUNTRY_INFO!G79,0),IF(COUNTRY_INFO!$H79=1,COUNTRY_INFO!F79+COUNTRY_INFO!G79,IF(COUNTRY_INFO!$I79=1,IF(COUNTRY_INFO!M79>=(COUNTRY_INFO!F79+COUNTRY_INFO!G79),COUNTRY_INFO!F79+COUNTRY_INFO!G79,COUNTRY_INFO!$M79),0))))","v":0},{"$f":"IF(AND(INTRO!$E$39=\"Non endémique\",INTRO!$E$37=\"Non endémique\"),\"Non requis\",IF(INTRO!$E$39=\"Non endémique\",\"Traiter avec DEC\",COUNTRY_INFO!V79))","v":0},{"$f":"IF(INTRO!$E$39<>\"Non endémique\",COUNTRY_INFO!W79,\"Non requis\")","v":0},{"$f":"IF(COUNTRY_INFO!H79=1, IF($E79=1,$D79, 0),0)","v":0},{"$f":"IF(COUNTRY_INFO!I79=1, IF(AND(COUNTRY_INFO!$I79=1,$F79<>0),IF(COUNTRY_INFO!M79>=(COUNTRY_INFO!F79+COUNTRY_INFO!G79),COUNTRY_INFO!F79+COUNTRY_INFO!G79,COUNTRY_INFO!$M79), 0),0)","v":0},0,0,0,0,null,0]
[{"$f":"IF(INTRO!$E$39=\"Non endémique\",\" \",IF(COUNTRY_INFO!A80=0,\" \",COUNTRY_INFO!A80))","v":"NIGER"},{"$f":"IF(INTRO!$E$39=\"Non endémique\",\" \",IF(COUNTRY_INFO!B80=0,\" \",COUNTRY_INFO!B80))","v":"Zinder"},{"$f":"IF(INTRO!$E$39=\"Non endémique\",\" \",IF(COUNTRY_INFO!C80=0,\" \",COUNTRY_INFO!C80))","v":"Belbéji"},{"$f":"IF(INTRO!$E$39=\"Non endémique\",0,IF(INTRO!$E$39=\"Endémique mais pas de CP\",IF(COUNTRY_INFO!$H80=1,COUNTRY_INFO!F80+COUNTRY_INFO!G80,0),IF(COUNTRY_INFO!$H80=1,COUNTRY_INFO!F80+COUNTRY_INFO!G80,IF(COUNTRY_INFO!$I80=1,IF(COUNTRY_INFO!M80>=(COUNTRY_INFO!F80+COUNTRY_INFO!G80),COUNTRY_INFO!F80+COUNTRY_INFO!G80,COUNTRY_INFO!$M80),0))))","v":0},{"$f":"IF(AND(INTRO!$E$39=\"Non endémique\",INTRO!$E$37=\"Non endémique\"),\"Non requis\",IF(INTRO!$E$39=\"Non endémique\",\"Traiter avec DEC\",COUNTRY_INFO!V80))","v":0},{"$f":"IF(INTRO!$E$39<>\"Non endémique\",COUNTRY_INFO!W80,\"Non requis\")","v":0},{"$f":"IF(COUNTRY_INFO!H80=1, IF($E80=1,$D80, 0),0)","v":0},{"$f":"IF(COUNTRY_INFO!I80=1, IF(AND(COUNTRY_INFO!$I80=1,$F80<>0),IF(COUNTRY_INFO!M80>=(COUNTRY_INFO!F80+COUNTRY_INFO!G80),COUNTRY_INFO!F80+COUNTRY_INFO!G80,COUNTRY_INFO!$M80), 0),0)","v":0},0,0,0,0,null,0]
[{"$f":"IF(INTRO!$E$39=\"Non endémique\",\" \",IF(COUNTRY_INFO!A81=0,\" \",COUNTRY_INFO!A81))","v":"NIGER"},{"$f":"IF(INTRO!$E$39=\"Non endémique\",\" \",IF(COUNTRY_INFO!B81=0,\" \",COUNTRY_INFO!B81))","v":"Zinder"},{"$f":"IF(INTRO!$E$39=\"Non endémique\",\" \",IF(COUNTRY_INFO!C81=0,\" \",COUNTRY_INFO!C81))","v":"Zinder"},{"$f":"IF(INTRO!$E$39=\"Non endémique\",0,IF(INTRO!$E$39=\"Endémique mais pas de CP\",IF(COUNTRY_INFO!$H81=1,COUNTRY_INFO!F81+COUNTRY_INFO!G81,0),IF(COUNTRY_INFO!$H81=1,COUNTRY_INFO!F81+COUNTRY_INFO!G81,IF(COUNTRY_INFO!$I81=1,IF(COUNTRY_INFO!M81>=(COUNTRY_INFO!F81+COUNTRY_INFO!G81),COUNTRY_INFO!F81+COUNTRY_INFO!G81,COUNTRY_INFO!$M81),0))))","v":0},{"$f":"IF(AND(INTRO!$E$39=\"Non endémique\",INTRO!$E$37=\"Non endémique\"),\"Non requis\",IF(INTRO!$E$39=\"Non endémique\",\"Traiter avec DEC\",COUNTRY_INFO!V81))","v":0},{"$f":"IF(INTRO!$E$39<>\"Non endémique\",COUNTRY_INFO!W81,\"Non requis\")","v":0},{"$f":"IF(COUNTRY_INFO!H81=1, IF($E81=1,$D81, 0),0)","v":0},{"$f":"IF(COUNTRY_INFO!I81=1, IF(AND(COUNTRY_INFO!$I81=1,$F81<>0),IF(COUNTRY_INFO!M81>=(COUNTRY_INFO!F81+COUNTRY_INFO!G81),COUNTRY_INFO!F81+COUNTRY_INFO!G81,COUNTRY_INFO!$M81), 0),0)","v":0},0,0,0,0,null,0]

{"sheet":"IVM+","index":6,"n_rows":81,"n_cols":8,"rows_kept":81,"cut":false,"hidden":true,"merged":[[6,0,7,0],[6,1,7,1],[6,2,7,2],[6,3,7,3],[3,0,3,2],[5,0,5,2],[6,5,7,5],[6,6,7,6],[6,7,7,7],[5,4,7,4],[5,5,5,7]]}
["Ivermectine (IVM) pour IDA thérapie"]
["Structure administrative, population ciblée par groupe d'âge, plan de traitement et information sur les comprimés"]
[]
["TOTAL",null,null,null,{"$f":"SUBTOTAL(9,E$10:E$1010)","v":0},0,0,0]
[]
["Structure administrative du pays",null,null,"Plan de traitement","Population nécessitant un traitement avec IVM\n(IDA thérapie)","Ivermectine (IVM)"]
["Pays","Région/Département","District","FL",null,"Total requis","Reste en stock","Comprimés devant être fournis"]
[]
[]
[{"$f":"IF(AND(INTRO!$E$37=\"Endémique\",INTRO!$E$39=\"Non endémique\"),IF(COUNTRY_INFO!A10=0,\" \",COUNTRY_INFO!A10),\" \")","v":" "},{"$f":"IF(AND(INTRO!$E$37=\"Endémique\",INTRO!$E$39=\"Non endémique\"),IF(COUNTRY_INFO!B10=0,\" \",COUNTRY_INFO!B10),\" \")","v":" "},{"$f":"IF(AND(INTRO!$E$37=\"Endémique\",INTRO!$E$39=\"Non endémique\"),IF(COUNTRY_INFO!C10=0,\" \",COUNTRY_INFO!C10),\" \")","v":" "},{"$f":"IF(COUNTRY_INFO!Z10<>\"\",COUNTRY_INFO!V10,0)","v":0},{"$f":"IF(AND(COUNTRY_INFO!Z10<>\"\",COUNTRY_INFO!$H10=1),COUNTRY_INFO!F10+COUNTRY_INFO!G10,0)","v":0},{"$f":"E10*2.8","v":0},null,{"$f":"IF($F10>$G10,$F10-$G10,0)","v":0}]
[{"$f":"IF(AND(INTRO!$E$37=\"Endémique\",INTRO!$E$39=\"Non endémique\"),IF(COUNTRY_INFO!A11=0,\" \",COUNTRY_INFO!A11),\" \")","v":" "},{"$f":"IF(AND(INTRO!$E$37=\"Endémique\",INTRO!$E$39=\"Non endémique\"),IF(COUNTRY_INFO!B11=0,\" \",COUNTRY_INFO!B11),\" \")","v":" "},{"$f":"IF(AND(INTRO!$E$37=\"Endémique\",INTRO!$E$39=\"Non endémique\"),IF(COUNTRY_INFO!C11=0,\" \",COUNTRY_INFO!C11),\" \")","v":" "},{"$f":"IF(COUNTRY_INFO!Z11<>\"\",COUNTRY_INFO!V11,0)","v":0},{"$f":"IF(AND(COUNTRY_INFO!Z11<>\"\",COUNTRY_INFO!$H11=1),COUNTRY_INFO!F11+COUNTRY_INFO!G11,0)","v":0},{"$f":"E11*2.8","v":0},null,0]
[{"$f":"IF(AND(INTRO!$E$37=\"Endémique\",INTRO!$E$39=\"Non endémique\"),IF(COUNTRY_INFO!A12=0,\" \",COUNTRY_INFO!A12),\" \")","v":" "},{"$f":"IF(AND(INTRO!$E$37=\"Endémique\",INTRO!$E$39=\"Non endémique\"),IF(COUNTRY_INFO!B12=0,\" \",COUNTRY_INFO!B12),\" \")","v":" "},{"$f":"IF(AND(INTRO!$E$37=\"Endémique\",INTRO!$E$39=\"Non endémique\"),IF(COUNTRY_INFO!C12=0,\" \",COUNTRY_INFO!C12),\" \")","v":" "},{"$f":"IF(COUNTRY_INFO!Z12<>\"\",COUNTRY_INFO!V12,0)","v":0},{"$f":"IF(AND(COUNTRY_INFO!Z12<>\"\",COUNTRY_INFO!$H12=1),COUNTRY_INFO!F12+COUNTRY_INFO!G12,0)","v":0},0,null,0]
[{"$f":"IF(AND(INTRO!$E$37=\"Endémique\",INTRO!$E$39=\"Non endémique\"),IF(COUNTRY_INFO!A13=0,\" \",COUNTRY_INFO!A13),\" \")","v":" "},{"$f":"IF(AND(INTRO!$E$37=\"Endémique\",INTRO!$E$39=\"Non endémique\"),IF(COUNTRY_INFO!B13=0,\" \",COUNTRY_INFO!B13),\" \")","v":" "},{"$f":"IF(AND(INTRO!$E$37=\"Endémique\",INTRO!$E$39=\"Non endémique\"),IF(COUNTRY_INFO!C13=0,\" \",COUNTRY_INFO!C13),\" \")","v":" "},{"$f":"IF(COUNTRY_INFO!Z13<>\"\",COUNTRY_INFO!V13,0)","v":0},{"$f":"IF(AND(COUNTRY_INFO!Z13<>\"\",COUNTRY_INFO!$H13=1),COUNTRY_INFO!F13+COUNTRY_INFO!G13,0)","v":0},0,null,0]
[{"$f":"IF(AND(INTRO!$E$37=\"Endémique\",INTRO!$E$39=\"Non endémique\"),IF(COUNTRY_INFO!A14=0,\" \",COUNTRY_INFO!A14),\" \")","v":" "},{"$f":"IF(AND(INTRO!$E$37=\"Endémique\",INTRO!$E$39=\"Non endémique\"),IF(COUNTRY_INFO!B14=0,\" \",COUNTRY_INFO!B14),\" \")","v":" "},{"$f":"IF(AND(INTRO!$E$37=\"Endémique\",INTRO!$E$39=\"Non endémique\"),IF(COUNTRY_INFO!C14=0,\" \",COUNTRY_INFO!C14),\" \")","v":" "},{"$f":"IF(COUNTRY_INFO!Z14<>\"\",COUNTRY_INFO!V14,0)","v":0},{"$f":"IF(AND(COUNTRY_INFO!Z14<>\"\",COUNTRY_INFO!$H14=1),COUNTRY_INFO!F14+COUNTRY_INFO!G14,0)","v":0},0,null,0]
[{"$f":"IF(AND(INTRO!$E$37=\"Endémique\",INTRO!$E$39=\"Non endémique\"),IF(COUNTRY_INFO!A15=0,\" \",COUNTRY_INFO!A15),\" \")","v":" "},{"$f":"IF(AND(INTRO!$E$37=\"Endémique\",INTRO!$E$39=\"Non endémique\"),IF(COUNTRY_INFO!B15=0,\" \",COUNTRY_INFO!B15),\" \")","v":" "},{"$f":"IF(AND(INTRO!$E$37=\"Endémique\",INTRO!$E$39=\"Non endémique\"),IF(COUNTRY_INFO!C15=0,\" \",COUNTRY_INFO!C15),\" \")","v":" "},{"$f":"IF(COUNTRY_INFO!Z15<>\"\",COUNTRY_INFO!V15,0)","v":0},{"$f":"IF(AND(COUNTRY_INFO!Z15<>\"\",COUNTRY_INFO!$H15=1),COUNTRY_INFO!F15+COUNTRY_INFO!G15,0)","v":0},0,null,0]
[{"$f":"IF(AND(INTRO!$E$37=\"Endémique\",INTRO!$E$39=\"Non endémique\"),IF(COUNTRY_INFO!A16=0,\" \",COUNTRY_INFO!A16),\" \")","v":" "},{"$f":"IF(AND(INTRO!$E$37=\"Endémique\",INTRO!$E$39=\"Non endémique\"),IF(COUNTRY_INFO!B16=0,\" \",COUNTRY_INFO!B16),\" \")","v":" "},{"$f":"IF(AND(INTRO!$E$37=\"Endémique\",INTRO!$E$39=\"Non endémique\"),IF(COUNTRY_INFO!C16=0,\" \",COUNTRY_INFO!C16),\" \")","v":" "},{"$f":"IF(COUNTRY_INFO!Z16<>\"\",COUNTRY_INFO!V16,0)","v":0},{"$f":"IF(AND(COUNTRY_INFO!Z16<>\"\",COUNTRY_INFO!$H16=1),COUNTRY_INFO!F16+COUNTRY_INFO!G16,0)","v":0},0,null,0]
[{"$f":"IF(AND(INTRO!$E$37=\"Endémique\",INTRO!$E$39=\"Non endémique\"),IF(COUNTRY_INFO!A17=0,\" \",COUNTRY_INFO!A17),\" \")","v":" "},{"$f":"IF(AND(INTRO!$E$37=\"Endémique\",INTRO!$E$39=\"Non endémique\"),IF(COUNTRY_INFO!B17=0,\" \",COUNTRY_INFO!B17),\" \")","v":" "},{"$f":"IF(AND(INTRO!$E$37=\"Endémique\",INTRO!$E$39=\"Non endémique\"),IF(COUNTRY_INFO!C17=0,\" \",COUNTRY_INFO!C17),\" \")","v":" "},{"$f":"IF(COUNTRY_INFO!Z17<>\"\",COUNTRY_INFO!V17,0)","v":0},{"$f":"IF(AND(COUNTRY_INFO!Z17<>\"\",COUNTRY_INFO!$H17=1),COUNTRY_INFO!F17+COUNTRY_INFO!G17,0)","v":0},0,null,0]
[{"$f":"IF(AND(INTRO!$E$37=\"Endémique\",INTRO!$E$39=\"Non endémique\"),IF(COUNTRY_INFO!A18=0,\" \",COUNTRY_INFO!A18),\" \")","v":" "},{"$f":"IF(AND(INTRO!$E$37=\"Endémique\",INTRO!$E$39=\"Non endémique\"),IF(COUNTRY_INFO!B18=0,\" \",COUNTRY_INFO!B18),\" \")","v":" "},{"$f":"IF(AND(INTRO!$E$37=\"Endémique\",INTRO!$E$39=\"Non endémique\"),IF(COUNTRY_INFO!C18=0,\" \",COUNTRY_INFO!C18),\" \")","v":" "},{"$f":"IF(COUNTRY_INFO!Z18<>\"\",COUNTRY_INFO!V18,0)","v":0},{"$f":"IF(AND(COUNTRY_INFO!Z18<>\"\",COUNTRY_INFO!$H18=1),COUNTRY_INFO!F18+COUNTRY_INFO!G18,0)","v":0},0,null,0]
[{"$f":"IF(AND(INTRO!$E$37=\"Endémique\",INTRO!$E$39=\"Non endémique\"),IF(COUNTRY_INFO!A19=0,\" \",COUNTRY_INFO!A19),\" \")","v":" "},{"$f":"IF(AND(INTRO!$E$37=\"Endémique\",INTRO!$E$39=\"Non endémique\"),IF(COUNTRY_INFO!B19=0,\" \",COUNTRY_INFO!B19),\" \")","v":" "},{"$f":"IF(AND(INTRO!$E$37=\"Endémique\",INTRO!$E$39=\"Non endémique\"),IF(COUNTRY_INFO!C19=0,\" \",COUNTRY_INFO!C19),\" \")","v":" "},{"$f":"IF(COUNTRY_INFO!Z19<>\"\",COUNTRY_INFO!V19,0)","v":0},{"$f":"IF(AND(COUNTRY_INFO!Z19<>\"\",COUNTRY_INFO!$H19=1),COUNTRY_INFO!F19+COUNTRY_INFO!G19,0)","v":0},0,null,0]
[{"$f":"IF(AND(INTRO!$E$37=\"Endémique\",INTRO!$E$39=\"Non endémique\"),IF(COUNTRY_INFO!A20=0,\" \",COUNTRY_INFO!A20),\" \")","v":" "},{"$f":"IF(AND(INTRO!$E$37=\"Endémique\",INTRO!$E$39=\"Non endémique\"),IF(COUNTRY_INFO!B20=0,\" \",COUNTRY_INFO!B20),\" \")","v":" "},{"$f":"IF(AND(INTRO!$E$37=\"Endémique\",INTRO!$E$39=\"Non endémique\"),IF(COUNTRY_INFO!C20=0,\" \",COUNTRY_INFO!C20),\" \")","v":" "},{"$f":"IF(COUNTRY_INFO!Z20<>\"\",COUNTRY_INFO!V20,0)","v":0},{"$f":"IF(AND(COUNTRY_INFO!Z20<>\"\",COUNTRY_INFO!$H20=1),COUNTRY_INFO!F20+COUNTRY_INFO!G20,0)","v":0},0,null,0]
[{"$f":"IF(AND(INTRO!$E$37=\"Endémique\",INTRO!$E$39=\"Non endémique\"),IF(COUNTRY_INFO!A21=0,\" \",COUNTRY_INFO!A21),\" \")","v":" "},{"$f":"IF(AND(INTRO!$E$37=\"Endémique\",INTRO!$E$39=\"Non endémique\"),IF(COUNTRY_INFO!B21=0,\" \",COUNTRY_INFO!B21),\" \")","v":" "},{"$f":"IF(AND(INTRO!$E$37=\"Endémique\",INTRO!$E$39=\"Non endémique\"),IF(COUNTRY_INFO!C21=0,\" \",COUNTRY_INFO!C21),\" \")","v":" "},{"$f":"IF(COUNTRY_INFO!Z21<>\"\",COUNTRY_INFO!V21,0)","v":0},{"$f":"IF(AND(COUNTRY_INFO!Z21<>\"\",COUNTRY_INFO!$H21=1),COUNTRY_INFO!F21+COUNTRY_INFO!G21,0)","v":0},0,null,0]
[{"$f":"IF(AND(INTRO!$E$37=\"Endémique\",INTRO!$E$39=\"Non endémique\"),IF(COUNTRY_INFO!A22=0,\" \",COUNTRY_INFO!A22),\" \")","v":" "},{"$f":"IF(AND(INTRO!$E$37=\"Endémique\",INTRO!$E$39=\"Non endémique\"),IF(COUNTRY_INFO!B22=0,\" \",COUNTRY_INFO!B22),\" \")","v":" "},{"$f":"IF(AND(INTRO!$E$37=\"Endémique\",INTRO!$E$39=\"Non endémique\"),IF(COUNTRY_INFO!C22=0,\" \",COUNTRY_INFO!C22),\" \")","v":" "},{"$f":"IF(COUNTRY_INFO!Z22<>\"\",COUNTRY_INFO!V22,0)","v":0},{"$f":"IF(AND(COUNTRY_INFO!Z22<>\"\",COUNTRY_INFO!$H22=1),COUNTRY_INFO!F22+COUNTRY_INFO!G22,0)","v":0},0,null,0]
[{"$f":"IF(AND(INTRO!$E$37=\"Endémique\",INTRO!$E$39=\"Non endémique\"),IF(COUNTRY_INFO!A23=0,\" \",COUNTRY_INFO!A23),\" \")","v":" "},{"$f":"IF(AND(INTRO!$E$37=\"Endémique\",INTRO!$E$39=\"Non endémique\"),IF(COUNTRY_INFO!B23=0,\" \",COUNTRY_INFO!B23),\" \")","v":" "},{"$f":"IF(AND(INTRO!$E$37=\"Endémique\",INTRO!$E$39=\"Non endémique\"),IF(COUNTRY_INFO!C23=0,\" \",COUNTRY_INFO!C23),\" \")","v":" "},{"$f":"IF(COUNTRY_INFO!Z23<>\"\",COUNTRY_INFO!V23,0)","v":0},{"$f":"IF(AND(COUNTRY_INFO!Z23<>\"\",COUNTRY_INFO!$H23=1),COUNTRY_INFO!F23+COUNTRY_INFO!G23,0)","v":0},0,null,0]
[{"$f":"IF(AND(INTRO!$E$37=\"Endémique\",INTRO!$E$39=\"Non endémique\"),IF(COUNTRY_INFO!A24=0,\" \",COUNTRY_INFO!A24),\" \")","v":" "},{"$f":"IF(AND(INTRO!$E$37=\"Endémique\",INTRO!$E$39=\"Non endémique\"),IF(COUNTRY_INFO!B24=0,\" \",COUNTRY_INFO!B24),\" \")","v":" "},{"$f":"IF(AND(INTRO!$E$37=\"Endémique\",INTRO!$E$39=\"Non endémique\"),IF(COUNTRY_INFO!C24=0,\" \",COUNTRY_INFO!C24),\" \")","v":" "},{"$f":"IF(COUNTRY_INFO!Z24<>\"\",COUNTRY_INFO!V24,0)","v":0},{"$f":"IF(AND(COUNTRY_INFO!Z24<>\"\",COUNTRY_INFO!$H24=1),COUNTRY_INFO!F24+COUNTRY_INFO!G24,0)","v":0},0,null,0]
[{"$f":"IF(AND(INTRO!$E$37=\"Endémique\",INTRO!$E$39=\"Non endémique\"),IF(COUNTRY_INFO!A25=0,\" \",COUNTRY_INFO!A25),\" \")","v":" "},{"$f":"IF(AND(INTRO!$E$37=\"Endémique\",INTRO!$E$39=\"Non endémique\"),IF(COUNTRY_INFO!B25=0,\" \",COUNTRY_INFO!B25),\" \")","v":" "},{"$f":"IF(AND(INTRO!$E$37=\"Endémique\",INTRO!$E$39=\"Non endémique\"),IF(COUNTRY_INFO!C25=0,\" \",COUNTRY_INFO!C25),\" \")","v":" "},{"$f":"IF(COUNTRY_INFO!Z25<>\"\",COUNTRY_INFO!V25,0)","v":0},{"$f":"IF(AND(COUNTRY_INFO!Z25<>\"\",COUNTRY_INFO!$H25=1),COUNTRY_INFO!F25+COUNTRY_INFO!G25,0)","v":0},0,null,0]
[{"$f":"IF(AND(INTRO!$E$37=\"Endémique\",INTRO!$E$39=\"Non endémique\"),IF(COUNTRY_INFO!A26=0,\" \",COUNTRY_INFO!A26),\" \")","v":" "},{"$f":"IF(AND(INTRO!$E$37=\"Endémique\",INTRO!$E$39=\"Non endémique\"),IF(COUNTRY_INFO!B26=0,\" \",COUNTRY_INFO!B26),\" \")","v":" "},{"$f":"IF(AND(INTRO!$E$37=\"Endémique\",INTRO!$E$39=\"Non endémique\"),IF(COUNTRY_INFO!C26=0,\" \",COUNTRY_INFO!C26),\" \")","v":" "},{"$f":"IF(COUNTRY_INFO!Z26<>\"\",COUNTRY_INFO!V26,0)","v":0},{"$f":"IF(AND(COUNTRY_INFO!Z26<>\"\",COUNTRY_INFO!$H26=1),COUNTRY_INFO!F26+COUNTRY_INFO!G26,0)","v":0},0,null,0]
[{"$f":"IF(AND(INTRO!$E$37=\"Endémique\",INTRO!$E$39=\"Non endémique\"),IF(COUNTRY_INFO!A27=0,\" \",COUNTRY_INFO!A27),\" \")","v":" "},{"$f":"IF(AND(INTRO!$E$37=\"Endémique\",INTRO!$E$39=\"Non endémique\"),IF(COUNTRY_INFO!B27=0,\" \",COUNTRY_INFO!B27),\" \")","v":" "},{"$f":"IF(AND(INTRO!$E$37=\"Endémique\",INTRO!$E$39=\"Non endémique\"),IF(COUNTRY_INFO!C27=0,\" \",COUNTRY_INFO!C27),\" \")","v":" "},{"$f":"IF(COUNTRY_INFO!Z27<>\"\",COUNTRY_INFO!V27,0)","v":0},{"$f":"IF(AND(COUNTRY_INFO!Z27<>\"\",COUNTRY_INFO!$H27=1),COUNTRY_INFO!F27+COUNTRY_INFO!G27,0)","v":0},0,null,0]
[{"$f":"IF(AND(INTRO!$E$37=\"Endémique\",INTRO!$E$39=\"Non endémique\"),IF(COUNTRY_INFO!A28=0,\" \",COUNTRY_INFO!A28),\" \")","v":" "},{"$f":"IF(AND(INTRO!$E$37=\"Endémique\",INTRO!$E$39=\"Non endémique\"),IF(COUNTRY_INFO!B28=0,\" \",COUNTRY_INFO!B28),\" \")","v":" "},{"$f":"IF(AND(INTRO!$E$37=\"Endémique\",INTRO!$E$39=\"Non endémique\"),IF(COUNTRY_INFO!C28=0,\" \",COUNTRY_INFO!C28),\" \")","v":" "},{"$f":"IF(COUNTRY_INFO!Z28<>\"\",COUNTRY_INFO!V28,0)","v":0},{"$f":"IF(AND(COUNTRY_INFO!Z28<>\"\",COUNTRY_INFO!$H28=1),COUNTRY_INFO!F28+COUNTRY_INFO!G28,0)","v":0},0,null,0]
[{"$f":"IF(AND(INTRO!$E$37=\"Endémique\",INTRO!$E$39=\"Non endémique\"),IF(COUNTRY_INFO!A29=0,\" \",COUNTRY_INFO!A29),\" \")","v":" "},{"$f":"IF(AND(INTRO!$E$37=\"Endémique\",INTRO!$E$39=\"Non endémique\"),IF(COUNTRY_INFO!B29=0,\" \",COUNTRY_INFO!B29),\" \")","v":" "},{"$f":"IF(AND(INTRO!$E$37=\"Endémique\",INTRO!$E$39=\"Non endémique\"),IF(COUNTRY_INFO!C29=0,\" \",COUNTRY_INFO!C29),\" \")","v":" "},{"$f":"IF(COUNTRY_INFO!Z29<>\"\",COUNTRY_INFO!V29,0)","v":0},{"$f":"IF(AND(COUNTRY_INFO!Z29<>\"\",COUNTRY_INFO!$H29=1),COUNTRY_INFO!F29+COUNTRY_INFO!G29,0)","v":0},0,null,0]
[{"$f":"IF(AND(INTRO!$E$37=\"Endémique\",INTRO!$E$39=\"Non endémique\"),IF(COUNTRY_INFO!A30=0,\" \",COUNTRY_INFO!A30),\" \")","v":" "},{"$f":"IF(AND(INTRO!$E$37=\"Endémique\",INTRO!$E$39=\"Non endémique\"),IF(COUNTRY_INFO!B30=0,\" \",COUNTRY_INFO!B30),\" \")","v":" "},{"$f":"IF(AND(INTRO!$E$37=\"Endémique\",INTRO!$E$39=\"Non endémique\"),IF(COUNTRY_INFO!C30=0,\" \",COUNTRY_INFO!C30),\" \")","v":" "},{"$f":"IF(COUNTRY_INFO!Z30<>\"\",COUNTRY_INFO!V30,0)","v":0},{"$f":"IF(AND(COUNTRY_INFO!Z30<>\"\",COUNTRY_INFO!$H30=1),COUNTRY_INFO!F30+COUNTRY_INFO!G30,0)","v":0},0,null,0]
[{"$f":"IF(AND(INTRO!$E$37=\"Endémique\",INTRO!$E$39=\"Non endémique\"),IF(COUNTRY_INFO!A31=0,\" \",COUNTRY_INFO!A31),\" \")","v":" "},{"$f":"IF(AND(INTRO!$E$37=\"Endémique\",INTRO!$E$39=\"Non endémique\"),IF(COUNTRY_INFO!B31=0,\" \",COUNTRY_INFO!B31),\" \")","v":" "},{"$f":"IF(AND(INTRO!$E$37=\"Endémique\",INTRO!$E$39=\"Non endémique\"),IF(COUNTRY_INFO!C31=0,\" \",COUNTRY_INFO!C31),\" \")","v":" "},{"$f":"IF(COUNTRY_INFO!Z31<>\"\",COUNTRY_INFO!V31,0)","v":0},{"$f":"IF(AND(COUNTRY_INFO!Z31<>\"\",COUNTRY_INFO!$H31=1),COUNTRY_INFO!F31+COUNTRY_INFO!G31,0)","v":0},0,null,0]
[{"$f":"IF(AND(INTRO!$E$37=\"Endémique\",INTRO!$E$39=\"Non endémique\"),IF(COUNTRY_INFO!A32=0,\" \",COUNTRY_INFO!A32),\" \")","v":" "},{"$f":"IF(AND(INTRO!$E$37=\"Endémique\",INTRO!$E$39=\"Non endémique\"),IF(COUNTRY_INFO!B32=0,\" \",COUNTRY_INFO!B32),\" \")","v":" "},{"$f":"IF(AND(INTRO!$E$37=\"Endémique\",INTRO!$E$39=\"Non endémique\"),IF(COUNTRY_INFO!C32=0,\" \",COUNTRY_INFO!C32),\" \")","v":" "},{"$f":"IF(COUNTRY_INFO!Z32<>\"\",COUNTRY_INFO!V32,0)","v":0},{"$f":"IF(AND(COUNTRY_INFO!Z32<>\"\",COUNTRY_INFO!$H32=1),COUNTRY_INFO!F32+COUNTRY_INFO!G32,0)","v":0},0,null,0]
[{"$f":"IF(AND(INTRO!$E$37=\"Endémique\",INTRO!$E$39=\"Non endémique\"),IF(COUNTRY_INFO!A33=0,\" \",COUNTRY_INFO!A33),\" \")","v":" "},{"$f":"IF(AND(INTRO!$E$37=\"Endémique\",INTRO!$E$39=\"Non endémique\"),IF(COUNTRY_INFO!B33=0,\" \",COUNTRY_INFO!B33),\" \")","v":" "},{"$f":"IF(AND(INTRO!$E$37=\"Endémique\",INTRO!$E$39=\"Non endémique\"),IF(COUNTRY_INFO!C33=0,\" \",COUNTRY_INFO!C33),\" \")","v":" "},{"$f":"IF(COUNTRY_INFO!Z33<>\"\",COUNTRY_INFO!V33,0)","v":0},{"$f":"IF(AND(COUNTRY_INFO!Z33<>\"\",COUNTRY_INFO!$H33=1),COUNTRY_INFO!F33+COUNTRY_INFO!G33,0)","v":0},0,null,0]
[{"$f":"IF(AND(INTRO!$E$37=\"Endémique\",INTRO!$E$39=\"Non endémique\"),IF(COUNTRY_INFO!A34=0,\" \",COUNTRY_INFO!A34),\" \")","v":" "},{"$f":"IF(AND(INTRO!$E$37=\"Endémique\",INTRO!$E$39=\"Non endémique\"),IF(COUNTRY_INFO!B34=0,\" \",COUNTRY_INFO!B34),\" \")","v":" "},{"$f":"IF(AND(INTRO!$E$37=\"Endémique\",INTRO!$E$39=\"Non endémique\"),IF(COUNTRY_INFO!C34=0,\" \",COUNTRY_INFO!C34),\" \")","v":" "},{"$f":"IF(COUNTRY_INFO!Z34<>\"\",COUNTRY_INFO!V34,0)","v":0},{"$f":"IF(AND(COUNTRY_INFO!Z34<>\"\",COUNTRY_INFO!$H34=1),COUNTRY_INFO!F34+COUNTRY_INFO!G34,0)","v":0},0,null,0]
[{"$f":"IF(AND(INTRO!$E$37=\"Endémique\",INTRO!$E$39=\"Non endémique\"),IF(COUNTRY_INFO!A35=0,\" \",COUNTRY_INFO!A35),\" \")","v":" "},{"$f":"IF(AND(INTRO!$E$37=\"Endémique\",INTRO!$E$39=\"Non endémique\"),IF(COUNTRY_INFO!B35=0,\" \",COUNTRY_INFO!B35),\" \")","v":" "},{"$f":"IF(AND(INTRO!$E$37=\"Endémique\",INTRO!$E$39=\"Non endémique\"),IF(COUNTRY_INFO!C35=0,\" \",COUNTRY_INFO!C35),\" \")","v":" "},{"$f":"IF(COUNTRY_INFO!Z35<>\"\",COUNTRY_INFO!V35,0)","v":0},{"$f":"IF(AND(COUNTRY_INFO!Z35<>\"\",COUNTRY_INFO!$H35=1),COUNTRY_INFO!F35+COUNTRY_INFO!G35,0)","v":0},0,null,0]
[{"$f":"IF(AND(INTRO!$E$37=\"Endémique\",INTRO!$E$39=\"Non endémique\"),IF(COUNTRY_INFO!A36=0,\" \",COUNTRY_INFO!A36),\" \")","v":" "},{"$f":"IF(AND(INTRO!$E$37=\"Endémique\",INTRO!$E$39=\"Non endémique\"),IF(COUNTRY_INFO!B36=0,\" \",COUNTRY_INFO!B36),\" \")","v":" "},{"$f":"IF(AND(INTRO!$E$37=\"Endémique\",INTRO!$E$39=\"Non endémique\"),IF(COUNTRY_INFO!C36=0,\" \",COUNTRY_INFO!C36),\" \")","v":" "},{"$f":"IF(COUNTRY_INFO!Z36<>\"\",COUNTRY_INFO!V36,0)","v":0},{"$f":"IF(AND(COUNTRY_INFO!Z36<>\"\",COUNTRY_INFO!$H36=1),COUNTRY_INFO!F36+COUNTRY_INFO!G36,0)","v":0},0,null,0]
[{"$f":"IF(AND(INTRO!$E$37=\"Endémique\",INTRO!$E$39=\"Non endémique\"),IF(COUNTRY_INFO!A37=0,\" \",COUNTRY_INFO!A37),\" \")","v":" "},{"$f":"IF(AND(INTRO!$E$37=\"Endémique\",INTRO!$E$39=\"Non endémique\"),IF(COUNTRY_INFO!B37=0,\" \",COUNTRY_INFO!B37),\" \")","v":" "},{"$f":"IF(AND(INTRO!$E$37=\"Endémique\",INTRO!$E$39=\"Non endémique\"),IF(COUNTRY_INFO!C37=0,\" \",COUNTRY_INFO!C37),\" \")","v":" "},{"$f":"IF(COUNTRY_INFO!Z37<>\"\",COUNTRY_INFO!V37,0)","v":0},{"$f":"IF(AND(COUNTRY_INFO!Z37<>\"\",COUNTRY_INFO!$H37=1),COUNTRY_INFO!F37+COUNTRY_INFO!G37,0)","v":0},0,null,0]
[{"$f":"IF(AND(INTRO!$E$37=\"Endémique\",INTRO!$E$39=\"Non endémique\"),IF(COUNTRY_INFO!A38=0,\" \",COUNTRY_INFO!A38),\" \")","v":" "},{"$f":"IF(AND(INTRO!$E$37=\"Endémique\",INTRO!$E$39=\"Non endémique\"),IF(COUNTRY_INFO!B38=0,\" \",COUNTRY_INFO!B38),\" \")","v":" "},{"$f":"IF(AND(INTRO!$E$37=\"Endémique\",INTRO!$E$39=\"Non endémique\"),IF(COUNTRY_INFO!C38=0,\" \",COUNTRY_INFO!C38),\" \")","v":" "},{"$f":"IF(COUNTRY_INFO!Z38<>\"\",COUNTRY_INFO!V38,0)","v":0},{"$f":"IF(AND(COUNTRY_INFO!Z38<>\"\",COUNTRY_INFO!$H38=1),COUNTRY_INFO!F38+COUNTRY_INFO!G38,0)","v":0},0,null,0]
[{"$f":"IF(AND(INTRO!$E$37=\"Endémique\",INTRO!$E$39=\"Non endémique\"),IF(COUNTRY_INFO!A39=0,\" \",COUNTRY_INFO!A39),\" \")","v":" "},{"$f":"IF(AND(INTRO!$E$37=\"Endémique\",INTRO!$E$39=\"Non endémique\"),IF(COUNTRY_INFO!B39=0,\" \",COUNTRY_INFO!B39),\" \")","v":" "},{"$f":"IF(AND(INTRO!$E$37=\"Endémique\",INTRO!$E$39=\"Non endémique\"),IF(COUNTRY_INFO!C39=0,\" \",COUNTRY_INFO!C39),\" \")","v":" "},{"$f":"IF(COUNTRY_INFO!Z39<>\"\",COUNTRY_INFO!V39,0)","v":0},{"$f":"IF(AND(COUNTRY_INFO!Z39<>\"\",COUNTRY_INFO!$H39=1),COUNTRY_INFO!F39+COUNTRY_INFO!G39,0)","v":0},0,null,0]
[{"$f":"IF(AND(INTRO!$E$37=\"Endémique\",INTRO!$E$39=\"Non endémique\"),IF(COUNTRY_INFO!A40=0,\" \",COUNTRY_INFO!A40),\" \")","v":" "},{"$f":"IF(AND(INTRO!$E$37=\"Endémique\",INTRO!$E$39=\"Non endémique\"),IF(COUNTRY_INFO!B40=0,\" \",COUNTRY_INFO!B40),\" \")","v":" "},{"$f":"IF(AND(INTRO!$E$37=\"Endémique\",INTRO!$E$39=\"Non endémique\"),IF(COUNTRY_INFO!C40=0,\" \",COUNTRY_INFO!C40),\" \")","v":" "},{"$f":"IF(COUNTRY_INFO!Z40<>\"\",COUNTRY_INFO!V40,0)","v":0},{"$f":"IF(AND(COUNTRY_INFO!Z40<>\"\",COUNTRY_INFO!$H40=1),COUNTRY_INFO!F40+COUNTRY_INFO!G40,0)","v":0},0,null,0]
[{"$f":"IF(AND(INTRO!$E$37=\"Endémique\",INTRO!$E$39=\"Non endémique\"),IF(COUNTRY_INFO!A41=0,\" \",COUNTRY_INFO!A41),\" \")","v":" "},{"$f":"IF(AND(INTRO!$E$37=\"Endémique\",INTRO!$E$39=\"Non endémique\"),IF(COUNTRY_INFO!B41=0,\" \",COUNTRY_INFO!B41),\" \")","v":" "},{"$f":"IF(AND(INTRO!$E$37=\"Endémique\",INTRO!$E$39=\"Non endémique\"),IF(COUNTRY_INFO!C41=0,\" \",COUNTRY_INFO!C41),\" \")","v":" "},{"$f":"IF(COUNTRY_INFO!Z41<>\"\",COUNTRY_INFO!V41,0)","v":0},{"$f":"IF(AND(COUNTRY_INFO!Z41<>\"\",COUNTRY_INFO!$H41=1),COUNTRY_INFO!F41+COUNTRY_INFO!G41,0)","v":0},0,null,0]
[{"$f":"IF(AND(INTRO!$E$37=\"Endémique\",INTRO!$E$39=\"Non endémique\"),IF(COUNTRY_INFO!A42=0,\" \",COUNTRY_INFO!A42),\" \")","v":" "},{"$f":"IF(AND(INTRO!$E$37=\"Endémique\",INTRO!$E$39=\"Non endémique\"),IF(COUNTRY_INFO!B42=0,\" \",COUNTRY_INFO!B42),\" \")","v":" "},{"$f":"IF(AND(INTRO!$E$37=\"Endémique\",INTRO!$E$39=\"Non endémique\"),IF(COUNTRY_INFO!C42=0,\" \",COUNTRY_INFO!C42),\" \")","v":" "},{"$f":"IF(COUNTRY_INFO!Z42<>\"\",COUNTRY_INFO!V42,0)","v":0},{"$f":"IF(AND(COUNTRY_INFO!Z42<>\"\",COUNTRY_INFO!$H42=1),COUNTRY_INFO!F42+COUNTRY_INFO!G42,0)","v":0},0,null,0]
[{"$f":"IF(AND(INTRO!$E$37=\"Endémique\",INTRO!$E$39=\"Non endémique\"),IF(COUNTRY_INFO!A43=0,\" \",COUNTRY_INFO!A43),\" \")","v":" "},{"$f":"IF(AND(INTRO!$E$37=\"Endémique\",INTRO!$E$39=\"Non endémique\"),IF(COUNTRY_INFO!B43=0,\" \",COUNTRY_INFO!B43),\" \")","v":" "},{"$f":"IF(AND(INTRO!$E$37=\"Endémique\",INTRO!$E$39=\"Non endémique\"),IF(COUNTRY_INFO!C43=0,\" \",COUNTRY_INFO!C43),\" \")","v":" "},{"$f":"IF(COUNTRY_INFO!Z43<>\"\",COUNTRY_INFO!V43,0)","v":0},{"$f":"IF(AND(COUNTRY_INFO!Z43<>\"\",COUNTRY_INFO!$H43=1),COUNTRY_INFO!F43+COUNTRY_INFO!G43,0)","v":0},0,null,0]
[{"$f":"IF(AND(INTRO!$E$37=\"Endémique\",INTRO!$E$39=\"Non endémique\"),IF(COUNTRY_INFO!A44=0,\" \",COUNTRY_INFO!A44),\" \")","v":" "},{"$f":"IF(AND(INTRO!$E$37=\"Endémique\",INTRO!$E$39=\"Non endémique\"),IF(COUNTRY_INFO!B44=0,\" \",COUNTRY_INFO!B44),\" \")","v":" "},{"$f":"IF(AND(INTRO!$E$37=\"Endémique\",INTRO!$E$39=\"Non endémique\"),IF(COUNTRY_INFO!C44=0,\" \",COUNTRY_INFO!C44),\" \")","v":" "},{"$f":"IF(COUNTRY_INFO!Z44<>\"\",COUNTRY_INFO!V44,0)","v":0},{"$f":"IF(AND(COUNTRY_INFO!Z44<>\"\",COUNTRY_INFO!$H44=1),COUNTRY_INFO!F44+COUNTRY_INFO!G44,0)","v":0},0,null,0]
[{"$f":"IF(AND(INTRO!$E$37=\"Endémique\",INTRO!$E$39=\"Non endémique\"),IF(COUNTRY_INFO!A45=0,\" \",COUNTRY_INFO!A45),\" \")","v":" "},{"$f":"IF(AND(INTRO!$E$37=\"Endémique\",INTRO!$E$39=\"Non endémique\"),IF(COUNTRY_INFO!B45=0,\" \",COUNTRY_INFO!B45),\" \")","v":" "},{"$f":"IF(AND(INTRO!$E$37=\"Endémique\",INTRO!$E$39=\"Non endémique\"),IF(COUNTRY_INFO!C45=0,\" \",COUNTRY_INFO!C45),\" \")","v":" "},{"$f":"IF(COUNTRY_INFO!Z45<>\"\",COUNTRY_INFO!V45,0)","v":0},{"$f":"IF(AND(COUNTRY_INFO!Z45<>\"\",COUNTRY_INFO!$H45=1),COUNTRY_INFO!F45+COUNTRY_INFO!G45,0)","v":0},0,null,0]
[{"$f":"IF(AND(INTRO!$E$37=\"Endémique\",INTRO!$E$39=\"Non endémique\"),IF(COUNTRY_INFO!A46=0,\" \",COUNTRY_INFO!A46),\" \")","v":" "},{"$f":"IF(AND(INTRO!$E$37=\"Endémique\",INTRO!$E$39=\"Non endémique\"),IF(COUNTRY_INFO!B46=0,\" \",COUNTRY_INFO!B46),\" \")","v":" "},{"$f":"IF(AND(INTRO!$E$37=\"Endémique\",INTRO!$E$39=\"Non endémique\"),IF(COUNTRY_INFO!C46=0,\" \",COUNTRY_INFO!C46),\" \")","v":" "},{"$f":"IF(COUNTRY_INFO!Z46<>\"\",COUNTRY_INFO!V46,0)","v":0},{"$f":"IF(AND(COUNTRY_INFO!Z46<>\"\",COUNTRY_INFO!$H46=1),COUNTRY_INFO!F46+COUNTRY_INFO!G46,0)","v":0},0,null,0]
[{"$f":"IF(AND(INTRO!$E$37=\"Endémique\",INTRO!$E$39=\"Non endémique\"),IF(COUNTRY_INFO!A47=0,\" \",COUNTRY_INFO!A47),\" \")","v":" "},{"$f":"IF(AND(INTRO!$E$37=\"Endémique\",INTRO!$E$39=\"Non endémique\"),IF(COUNTRY_INFO!B47=0,\" \",COUNTRY_INFO!B47),\" \")","v":" "},{"$f":"IF(AND(INTRO!$E$37=\"Endémique\",INTRO!$E$39=\"Non endémique\"),IF(COUNTRY_INFO!C47=0,\" \",COUNTRY_INFO!C47),\" \")","v":" "},{"$f":"IF(COUNTRY_INFO!Z47<>\"\",COUNTRY_INFO!V47,0)","v":0},{"$f":"IF(AND(COUNTRY_INFO!Z47<>\"\",COUNTRY_INFO!$H47=1),COUNTRY_INFO!F47+COUNTRY_INFO!G47,0)","v":0},0,null,0]
[{"$f":"IF(AND(INTRO!$E$37=\"Endémique\",INTRO!$E$39=\"Non endémique\"),IF(COUNTRY_INFO!A48=0,\" \",COUNTRY_INFO!A48),\" \")","v":" "},{"$f":"IF(AND(INTRO!$E$37=\"Endémique\",INTRO!$E$39=\"Non endémique\"),IF(COUNTRY_INFO!B48=0,\" \",COUNTRY_INFO!B48),\" \")","v":" "},{"$f":"IF(AND(INTRO!$E$37=\"Endémique\",INTRO!$E$39=\"Non endémique\"),IF(COUNTRY_INFO!C48=0,\" \",COUNTRY_INFO!C48),\" \")","v":" "},{"$f":"IF(COUNTRY_INFO!Z48<>\"\",COUNTRY_INFO!V48,0)","v":0},{"$f":"IF(AND(COUNTRY_INFO!Z48<>\"\",COUNTRY_INFO!$H48=1),COUNTRY_INFO!F48+COUNTRY_INFO!G48,0)","v":0},0,null,0]
[{"$f":"IF(AND(INTRO!$E$37=\"Endémique\",INTRO!$E$39=\"Non endémique\"),IF(COUNTRY_INFO!A49=0,\" \",COUNTRY_INFO!A49),\" \")","v":" "},{"$f":"IF(AND(INTRO!$E$37=\"Endémique\",INTRO!$E$39=\"Non endémique\"),IF(COUNTRY_INFO!B49=0,\" \",COUNTRY_INFO!B49),\" \")","v":" "},{"$f":"IF(AND(INTRO!$E$37=\"Endémique\",INTRO!$E$39=\"Non endémique\"),IF(COUNTRY_INFO!C49=0,\" \",COUNTRY_INFO!C49),\" \")","v":" "},{"$f":"IF(COUNTRY_INFO!Z49<>\"\",COUNTRY_INFO!V49,0)","v":0},{"$f":"IF(AND(COUNTRY_INFO!Z49<>\"\",COUNTRY_INFO!$H49=1),COUNTRY_INFO!F49+COUNTRY_INFO!G49,0)","v":0},0,null,0]
[{"$f":"IF(AND(INTRO!$E$37=\"Endémique\",INTRO!$E$39=\"Non endémique\"),IF(COUNTRY_INFO!A50=0,\" \",COUNTRY_INFO!A50),\" \")","v":" "},{"$f":"IF(AND(INTRO!$E$37=\"Endémique\",INTRO!$E$39=\"Non endémique\"),IF(COUNTRY_INFO!B50=0,\" \",COUNTRY_INFO!B50),\" \")","v":" "},{"$f":"IF(AND(INTRO!$E$37=\"Endémique\",INTRO!$E$39=\"Non endémique\"),IF(COUNTRY_INFO!C50=0,\" \",COUNTRY_INFO!C50),\" \")","v":" "},{"$f":"IF(COUNTRY_INFO!Z50<>\"\",COUNTRY_INFO!V50,0)","v":0},{"$f":"IF(AND(COUNTRY_INFO!Z50<>\"\",COUNTRY_INFO!$H50=1),COUNTRY_INFO!F50+COUNTRY_INFO!G50,0)","v":0},0,null,0]
[{"$f":"IF(AND(INTRO!$E$37=\"Endémique\",INTRO!$E$39=\"Non endémique\"),IF(COUNTRY_INFO!A51=0,\" \",COUNTRY_INFO!A51),\" \")","v":" "},{"$f":"IF(AND(INTRO!$E$37=\"Endémique\",INTRO!$E$39=\"Non endémique\"),IF(COUNTRY_INFO!B51=0,\" \",COUNTRY_INFO!B51),\" \")","v":" "},{"$f":"IF(AND(INTRO!$E$37=\"Endémique\",INTRO!$E$39=\"Non endémique\"),IF(COUNTRY_INFO!C51=0,\" \",COUNTRY_INFO!C51),\" \")","v":" "},{"$f":"IF(COUNTRY_INFO!Z51<>\"\",COUNTRY_INFO!V51,0)","v":0},{"$f":"IF(AND(COUNTRY_INFO!Z51<>\"\",COUNTRY_INFO!$H51=1),COUNTRY_INFO!F51+COUNTRY_INFO!G51,0)","v":0},0,null,0]
[{"$f":"IF(AND(INTRO!$E$37=\"Endémique\",INTRO!$E$39=\"Non endémique\"),IF(COUNTRY_INFO!A52=0,\" \",COUNTRY_INFO!A52),\" \")","v":" "},{"$f":"IF(AND(INTRO!$E$37=\"Endémique\",INTRO!$E$39=\"Non endémique\"),IF(COUNTRY_INFO!B52=0,\" \",COUNTRY_INFO!B52),\" \")","v":" "},{"$f":"IF(AND(INTRO!$E$37=\"Endémique\",INTRO!$E$39=\"Non endémique\"),IF(COUNTRY_INFO!C52=0,\" \",COUNTRY_INFO!C52),\" \")","v":" "},{"$f":"IF(COUNTRY_INFO!Z52<>\"\",COUNTRY_INFO!V52,0)","v":0},{"$f":"IF(AND(COUNTRY_INFO!Z52<>\"\",COUNTRY_INFO!$H52=1),COUNTRY_INFO!F52+COUNTRY_INFO!G52,0)","v":0},0,null,0]
[{"$f":"IF(AND(INTRO!$E$37=\"Endémique\",INTRO!$E$39=\"Non endémique\"),IF(COUNTRY_INFO!A53=0,\" \",COUNTRY_INFO!A53),\" \")","v":" "},{"$f":"IF(AND(INTRO!$E$37=\"Endémique\",INTRO!$E$39=\"Non endémique\"),IF(COUNTRY_INFO!B53=0,\" \",COUNTRY_INFO!B53),\" \")","v":" "},{"$f":"IF(AND(INTRO!$E$37=\"Endémique\",INTRO!$E$39=\"Non endémique\"),IF(COUNTRY_INFO!C53=0,\" \",COUNTRY_INFO!C53),\" \")","v":" "},{"$f":"IF(COUNTRY_INFO!Z53<>\"\",COUNTRY_INFO!V53,0)","v":0},{"$f":"IF(AND(COUNTRY_INFO!Z53<>\"\",COUNTRY_INFO!$H53=1),COUNTRY_INFO!F53+COUNTRY_INFO!G53,0)","v":0},0,null,0]
[{"$f":"IF(AND(INTRO!$E$37=\"Endémique\",INTRO!$E$39=\"Non endémique\"),IF(COUNTRY_INFO!A54=0,\" \",COUNTRY_INFO!A54),\" \")","v":" "},{"$f":"IF(AND(INTRO!$E$37=\"Endémique\",INTRO!$E$39=\"Non endémique\"),IF(COUNTRY_INFO!B54=0,\" \",COUNTRY_INFO!B54),\" \")","v":" "},{"$f":"IF(AND(INTRO!$E$37=\"Endémique\",INTRO!$E$39=\"Non endémique\"),IF(COUNTRY_INFO!C54=0,\" \",COUNTRY_INFO!C54),\" \")","v":" "},{"$f":"IF(COUNTRY_INFO!Z54<>\"\",COUNTRY_INFO!V54,0)","v":0},{"$f":"IF(AND(COUNTRY_INFO!Z54<>\"\",COUNTRY_INFO!$H54=1),COUNTRY_INFO!F54+COUNTRY_INFO!G54,0)","v":0},0,null,0]
[{"$f":"IF(AND(INTRO!$E$37=\"Endémique\",INTRO!$E$39=\"Non endémique\"),IF(COUNTRY_INFO!A55=0,\" \",COUNTRY_INFO!A55),\" \")","v":" "},{"$f":"IF(AND(INTRO!$E$37=\"Endémique\",INTRO!$E$39=\"Non endémique\"),IF(COUNTRY_INFO!B55=0,\" \",COUNTRY_INFO!B55),\" \")","v":" "},{"$f":"IF(AND(INTRO!$E$37=\"Endémique\",INTRO!$E$39=\"Non endémique\"),IF(COUNTRY_INFO!C55=0,\" \",COUNTRY_INFO!C55),\" \")","v":" "},{"$f":"IF(COUNTRY_INFO!Z55<>\"\",COUNTRY_INFO!V55,0)","v":0},{"$f":"IF(AND(COUNTRY_INFO!Z55<>\"\",COUNTRY_INFO!$H55=1),COUNTRY_INFO!F55+COUNTRY_INFO!G55,0)","v":0},0,null,0]
[{"$f":"IF(AND(INTRO!$E$37=\"Endémique\",INTRO!$E$39=\"Non endémique\"),IF(COUNTRY_INFO!A56=0,\" \",COUNTRY_INFO!A56),\" \")","v":" "},{"$f":"IF(AND(INTRO!$E$37=\"Endémique\",INTRO!$E$39=\"Non endémique\"),IF(COUNTRY_INFO!B56=0,\" \",COUNTRY_INFO!B56),\" \")","v":" "},{"$f":"IF(AND(INTRO!$E$37=\"Endémique\",INTRO!$E$39=\"Non endémique\"),IF(COUNTRY_INFO!C56=0,\" \",COUNTRY_INFO!C56),\" \")","v":" "},{"$f":"IF(COUNTRY_INFO!Z56<>\"\",COUNTRY_INFO!V56,0)","v":0},{"$f":"IF(AND(COUNTRY_INFO!Z56<>\"\",COUNTRY_INFO!$H56=1),COUNTRY_INFO!F56+COUNTRY_INFO!G56,0)","v":0},0,null,0]
[{"$f":"IF(AND(INTRO!$E$37=\"Endémique\",INTRO!$E$39=\"Non endémique\"),IF(COUNTRY_INFO!A57=0,\" \",COUNTRY_INFO!A57),\" \")","v":" "},{"$f":"IF(AND(INTRO!$E$37=\"Endémique\",INTRO!$E$39=\"Non endémique\"),IF(COUNTRY_INFO!B57=0,\" \",COUNTRY_INFO!B57),\" \")","v":" "},{"$f":"IF(AND(INTRO!$E$37=\"Endémique\",INTRO!$E$39=\"Non endémique\"),IF(COUNTRY_INFO!C57=0,\" \",COUNTRY_INFO!C57),\" \")","v":" "},{"$f":"IF(COUNTRY_INFO!Z57<>\"\",COUNTRY_INFO!V57,0)","v":0},{"$f":"IF(AND(COUNTRY_INFO!Z57<>\"\",COUNTRY_INFO!$H57=1),COUNTRY_INFO!F57+COUNTRY_INFO!G57,0)","v":0},0,null,0]
[{"$f":"IF(AND(INTRO!$E$37=\"Endémique\",INTRO!$E$39=\"Non endémique\"),IF(COUNTRY_INFO!A58=0,\" \",COUNTRY_INFO!A58),\" \")","v":" "},{"$f":"IF(AND(INTRO!$E$37=\"Endémique\",INTRO!$E$39=\"Non endémique\"),IF(COUNTRY_INFO!B58=0,\" \",COUNTRY_INFO!B58),\" \")","v":" "},{"$f":"IF(AND(INTRO!$E$37=\"Endémique\",INTRO!$E$39=\"Non endémique\"),IF(COUNTRY_INFO!C58=0,\" \",COUNTRY_INFO!C58),\" \")","v":" "},{"$f":"IF(COUNTRY_INFO!Z58<>\"\",COUNTRY_INFO!V58,0)","v":0},{"$f":"IF(AND(COUNTRY_INFO!Z58<>\"\",COUNTRY_INFO!$H58=1),COUNTRY_INFO!F58+COUNTRY_INFO!G58,0)","v":0},0,null,0]
[{"$f":"IF(AND(INTRO!$E$37=\"Endémique\",INTRO!$E$39=\"Non endémique\"),IF(COUNTRY_INFO!A59=0,\" \",COUNTRY_INFO!A59),\" \")","v":" "},{"$f":"IF(AND(INTRO!$E$37=\"Endémique\",INTRO!$E$39=\"Non endémique\"),IF(COUNTRY_INFO!B59=0,\" \",COUNTRY_INFO!B59),\" \")","v":" "},{"$f":"IF(AND(INTRO!$E$37=\"Endémique\",INTRO!$E$39=\"Non endémique\"),IF(COUNTRY_INFO!C59=0,\" \",COUNTRY_INFO!C59),\" \")","v":" "},{"$f":"IF(COUNTRY_INFO!Z59<>\"\",COUNTRY_INFO!V59,0)","v":0},{"$f":"IF(AND(COUNTRY_INFO!Z59<>\"\",COUNTRY_INFO!$H59=1),COUNTRY_INFO!F59+COUNTRY_INFO!G59,0)","v":0},0,null,0]
[{"$f":"IF(AND(INTRO!$E$37=\"Endémique\",INTRO!$E$39=\"Non endémique\"),IF(COUNTRY_INFO!A60=0,\" \",COUNTRY_INFO!A60),\" \")","v":" "},{"$f":"IF(AND(INTRO!$E$37=\"Endémique\",INTRO!$E$39=\"Non endémique\"),IF(COUNTRY_INFO!B60=0,\" \",COUNTRY_INFO!B60),\" \")","v":" "},{"$f":"IF(AND(INTRO!$E$37=\"Endémique\",INTRO!$E$39=\"Non endémique\"),IF(COUNTRY_INFO!C60=0,\" \",COUNTRY_INFO!C60),\" \")","v":" "},{"$f":"IF(COUNTRY_INFO!Z60<>\"\",COUNTRY_INFO!V60,0)","v":0},{"$f":"IF(AND(COUNTRY_INFO!Z60<>\"\",COUNTRY_INFO!$H60=1),COUNTRY_INFO!F60+COUNTRY_INFO!G60,0)","v":0},0,null,0]
[{"$f":"IF(AND(INTRO!$E$37=\"Endémique\",INTRO!$E$39=\"Non endémique\"),IF(COUNTRY_INFO!A61=0,\" \",COUNTRY_INFO!A61),\" \")","v":" "},{"$f":"IF(AND(INTRO!$E$37=\"Endémique\",INTRO!$E$39=\"Non endémique\"),IF(COUNTRY_INFO!B61=0,\" \",COUNTRY_INFO!B61),\" \")","v":" "},{"$f":"IF(AND(INTRO!$E$37=\"Endémique\",INTRO!$E$39=\"Non endémique\"),IF(COUNTRY_INFO!C61=0,\" \",COUNTRY_INFO!C61),\" \")","v":" "},{"$f":"IF(COUNTRY_INFO!Z61<>\"\",COUNTRY_INFO!V61,0)","v":0},{"$f":"IF(AND(COUNTRY_INFO!Z61<>\"\",COUNTRY_INFO!$H61=1),COUNTRY_INFO!F61+COUNTRY_INFO!G61,0)","v":0},0,null,0]
[{"$f":"IF(AND(INTRO!$E$37=\"Endémique\",INTRO!$E$39=\"Non endémique\"),IF(COUNTRY_INFO!A62=0,\" \",COUNTRY_INFO!A62),\" \")","v":" "},{"$f":"IF(AND(INTRO!$E$37=\"Endémique\",INTRO!$E$39=\"Non endémique\"),IF(COUNTRY_INFO!B62=0,\" \",COUNTRY_INFO!B62),\" \")","v":" "},{"$f":"IF(AND(INTRO!$E$37=\"Endémique\",INTRO!$E$39=\"Non endémique\"),IF(COUNTRY_INFO!C62=0,\" \",COUNTRY_INFO!C62),\" \")","v":" "},{"$f":"IF(COUNTRY_INFO!Z62<>\"\",COUNTRY_INFO!V62,0)","v":0},{"$f":"IF(AND(COUNTRY_INFO!Z62<>\"\",COUNTRY_INFO!$H62=1),COUNTRY_INFO!F62+COUNTRY_INFO!G62,0)","v":0},0,null,0]
[{"$f":"IF(AND(INTRO!$E$37=\"Endémique\",INTRO!$E$39=\"Non endémique\"),IF(COUNTRY_INFO!A63=0,\" \",COUNTRY_INFO!A63),\" \")","v":" "},{"$f":"IF(AND(INTRO!$E$37=\"Endémique\",INTRO!$E$39=\"Non endémique\"),IF(COUNTRY_INFO!B63=0,\" \",COUNTRY_INFO!B63),\" \")","v":" "},{"$f":"IF(AND(INTRO!$E$37=\"Endémique\",INTRO!$E$39=\"Non endémique\"),IF(COUNTRY_INFO!C63=0,\" \",COUNTRY_INFO!C63),\" \")","v":" "},{"$f":"IF(COUNTRY_INFO!Z63<>\"\",COUNTRY_INFO!V63,0)","v":0},{"$f":"IF(AND(COUNTRY_INFO!Z63<>\"\",COUNTRY_INFO!$H63=1),COUNTRY_INFO!F63+COUNTRY_INFO!G63,0)","v":0},0,null,0]
[{"$f":"IF(AND(INTRO!$E$37=\"Endémique\",INTRO!$E$39=\"Non endémique\"),IF(COUNTRY_INFO!A64=0,\" \",COUNTRY_INFO!A64),\" \")","v":" "},{"$f":"IF(AND(INTRO!$E$37=\"Endémique\",INTRO!$E$39=\"Non endémique\"),IF(COUNTRY_INFO!B64=0,\" \",COUNTRY_INFO!B64),\" \")","v":" "},{"$f":"IF(AND(INTRO!$E$37=\"Endémique\",INTRO!$E$39=\"Non endémique\"),IF(COUNTRY_INFO!C64=0,\" \",COUNTRY_INFO!C64),\" \")","v":" "},{"$f":"IF(COUNTRY_INFO!Z64<>\"\",COUNTRY_INFO!V64,0)","v":0},{"$f":"IF(AND(COUNTRY_INFO!Z64<>\"\",COUNTRY_INFO!$H64=1),COUNTRY_INFO!F64+COUNTRY_INFO!G64,0)","v":0},0,null,0]
[{"$f":"IF(AND(INTRO!$E$37=\"Endémique\",INTRO!$E$39=\"Non endémique\"),IF(COUNTRY_INFO!A65=0,\" \",COUNTRY_INFO!A65),\" \")","v":" "},{"$f":"IF(AND(INTRO!$E$37=\"Endémique\",INTRO!$E$39=\"Non endémique\"),IF(COUNTRY_INFO!B65=0,\" \",COUNTRY_INFO!B65),\" \")","v":" "},{"$f":"IF(AND(INTRO!$E$37=\"Endémique\",INTRO!$E$39=\"Non endémique\"),IF(COUNTRY_INFO!C65=0,\" \",COUNTRY_INFO!C65),\" \")","v":" "},{"$f":"IF(COUNTRY_INFO!Z65<>\"\",COUNTRY_INFO!V65,0)","v":0},{"$f":"IF(AND(COUNTRY_INFO!Z65<>\"\",COUNTRY_INFO!$H65=1),COUNTRY_INFO!F65+COUNTRY_INFO!G65,0)","v":0},0,null,0]
[{"$f":"IF(AND(INTRO!$E$37=\"Endémique\",INTRO!$E$39=\"Non endémique\"),IF(COUNTRY_INFO!A66=0,\" \",COUNTRY_INFO!A66),\" \")","v":" "},{"$f":"IF(AND(INTRO!$E$37=\"Endémique\",INTRO!$E$39=\"Non endémique\"),IF(COUNTRY_INFO!B66=0,\" \",COUNTRY_INFO!B66),\" \")","v":" "},{"$f":"IF(AND(INTRO!$E$37=\"Endémique\",INTRO!$E$39=\"Non endémique\"),IF(COUNTRY_INFO!C66=0,\" \",COUNTRY_INFO!C66),\" \")","v":" "},{"$f":"IF(COUNTRY_INFO!Z66<>\"\",COUNTRY_INFO!V66,0)","v":0},{"$f":"IF(AND(COUNTRY_INFO!Z66<>\"\",COUNTRY_INFO!$H66=1),COUNTRY_INFO!F66+COUNTRY_INFO!G66,0)","v":0},0,null,0]
[{"$f":"IF(AND(INTRO!$E$37=\"Endémique\",INTRO!$E$39=\"Non endémique\"),IF(COUNTRY_INFO!A67=0,\" \",COUNTRY_INFO!A67),\" \")","v":" "},{"$f":"IF(AND(INTRO!$E$37=\"Endémique\",INTRO!$E$39=\"Non endémique\"),IF(COUNTRY_INFO!B67=0,\" \",COUNTRY_INFO!B67),\" \")","v":" "},{"$f":"IF(AND(INTRO!$E$37=\"Endémique\",INTRO!$E$39=\"Non endémique\"),IF(COUNTRY_INFO!C67=0,\" \",COUNTRY_INFO!C67),\" \")","v":" "},{"$f":"IF(COUNTRY_INFO!Z67<>\"\",COUNTRY_INFO!V67,0)","v":0},{"$f":"IF(AND(COUNTRY_INFO!Z67<>\"\",COUNTRY_INFO!$H67=1),COUNTRY_INFO!F67+COUNTRY_INFO!G67,0)","v":0},0,null,0]
[{"$f":"IF(AND(INTRO!$E$37=\"Endémique\",INTRO!$E$39=\"Non endémique\"),IF(COUNTRY_INFO!A68=0,\" \",COUNTRY_INFO!A68),\" \")","v":" "},{"$f":"IF(AND(INTRO!$E$37=\"Endémique\",INTRO!$E$39=\"Non endémique\"),IF(COUNTRY_INFO!B68=0,\" \",COUNTRY_INFO!B68),\" \")","v":" "},{"$f":"IF(AND(INTRO!$E$37=\"Endémique\",INTRO!$E$39=\"Non endémique\"),IF(COUNTRY_INFO!C68=0,\" \",COUNTRY_INFO!C68),\" \")","v":" "},{"$f":"IF(COUNTRY_INFO!Z68<>\"\",COUNTRY_INFO!V68,0)","v":0},{"$f":"IF(AND(COUNTRY_INFO!Z68<>\"\",COUNTRY_INFO!$H68=1),COUNTRY_INFO!F68+COUNTRY_INFO!G68,0)","v":0},0,null,0]
[{"$f":"IF(AND(INTRO!$E$37=\"Endémique\",INTRO!$E$39=\"Non endémique\"),IF(COUNTRY_INFO!A69=0,\" \",COUNTRY_INFO!A69),\" \")","v":" "},{"$f":"IF(AND(INTRO!$E$37=\"Endémique\",INTRO!$E$39=\"Non endémique\"),IF(COUNTRY_INFO!B69=0,\" \",COUNTRY_INFO!B69),\" \")","v":" "},{"$f":"IF(AND(INTRO!$E$37=\"Endémique\",INTRO!$E$39=\"Non endémique\"),IF(COUNTRY_INFO!C69=0,\" \",COUNTRY_INFO!C69),\" \")","v":" "},{"$f":"IF(COUNTRY_INFO!Z69<>\"\",COUNTRY_INFO!V69,0)","v":0},{"$f":"IF(AND(COUNTRY_INFO!Z69<>\"\",COUNTRY_INFO!$H69=1),COUNTRY_INFO!F69+COUNTRY_INFO!G69,0)","v":0},0,null,0]
[{"$f":"IF(AND(INTRO!$E$37=\"Endémique\",INTRO!$E$39=\"Non endémique\"),IF(COUNTRY_INFO!A70=0,\" \",COUNTRY_INFO!A70),\" \")","v":" "},{"$f":"IF(AND(INTRO!$E$37=\"Endémique\",INTRO!$E$39=\"Non endémique\"),IF(COUNTRY_INFO!B70=0,\" \",COUNTRY_INFO!B70),\" \")","v":" "},{"$f":"IF(AND(INTRO!$E$37=\"Endémique\",INTRO!$E$39=\"Non endémique\"),IF(COUNTRY_INFO!C70=0,\" \",COUNTRY_INFO!C70),\" \")","v":" "},{"$f":"IF(COUNTRY_INFO!Z70<>\"\",COUNTRY_INFO!V70,0)","v":0},{"$f":"IF(AND(COUNTRY_INFO!Z70<>\"\",COUNTRY_INFO!$H70=1),COUNTRY_INFO!F70+COUNTRY_INFO!G70,0)","v":0},0,null,0]
[{"$f":"IF(AND(INTRO!$E$37=\"Endémique\",INTRO!$E$39=\"Non endémique\"),IF(COUNTRY_INFO!A71=0,\" \",COUNTRY_INFO!A71),\" \")","v":" "},{"$f":"IF(AND(INTRO!$E$37=\"Endémique\",INTRO!$E$39=\"Non endémique\"),IF(COUNTRY_INFO!B71=0,\" \",COUNTRY_INFO!B71),\" \")","v":" "},{"$f":"IF(AND(INTRO!$E$37=\"Endémique\",INTRO!$E$39=\"Non endémique\"),IF(COUNTRY_INFO!C71=0,\" \",COUNTRY_INFO!C71),\" \")","v":" "},{"$f":"IF(COUNTRY_INFO!Z71<>\"\",COUNTRY_INFO!V71,0)","v":0},{"$f":"IF(AND(COUNTRY_INFO!Z71<>\"\",COUNTRY_INFO!$H71=1),COUNTRY_INFO!F71+COUNTRY_INFO!G71,0)","v":0},0,null,0]
[{"$f":"IF(AND(INTRO!$E$37=\"Endémique\",INTRO!$E$39=\"Non endémique\"),IF(COUNTRY_INFO!A72=0,\" \",COUNTRY_INFO!A72),\" \")","v":" "},{"$f":"IF(AND(INTRO!$E$37=\"Endémique\",INTRO!$E$39=\"Non endémique\"),IF(COUNTRY_INFO!B72=0,\" \",COUNTRY_INFO!B72),\" \")","v":" "},{"$f":"IF(AND(INTRO!$E$37=\"Endémique\",INTRO!$E$39=\"Non endémique\"),IF(COUNTRY_INFO!C72=0,\" \",COUNTRY_INFO!C72),\" \")","v":" "},{"$f":"IF(COUNTRY_INFO!Z72<>\"\",COUNTRY_INFO!V72,0)","v":0},{"$f":"IF(AND(COUNTRY_INFO!Z72<>\"\",COUNTRY_INFO!$H72=1),COUNTRY_INFO!F72+COUNTRY_INFO!G72,0)","v":0},0,null,0]
[{"$f":"IF(AND(INTRO!$E$37=\"Endémique\",INTRO!$E$39=\"Non endémique\"),IF(COUNTRY_INFO!A73=0,\" \",COUNTRY_INFO!A73),\" \")","v":" "},{"$f":"IF(AND(INTRO!$E$37=\"Endémique\",INTRO!$E$39=\"Non endémique\"),IF(COUNTRY_INFO!B73=0,\" \",COUNTRY_INFO!B73),\" \")","v":" "},{"$f":"IF(AND(INTRO!$E$37=\"Endémique\",INTRO!$E$39=\"Non endémique\"),IF(COUNTRY_INFO!C73=0,\" \",COUNTRY_INFO!C73),\" \")","v":" "},{"$f":"IF(COUNTRY_INFO!Z73<>\"\",COUNTRY_INFO!V73,0)","v":0},{"$f":"IF(AND(COUNTRY_INFO!Z73<>\"\",COUNTRY_INFO!$H73=1),COUNTRY_INFO!F73+COUNTRY_INFO!G73,0)","v":0},0,null,0]
[{"$f":"IF(AND(INTRO!$E$37=\"Endémique\",INTRO!$E$39=\"Non endémique\"),IF(COUNTRY_INFO!A74=0,\" \",COUNTRY_INFO!A74),\" \")","v":" "},{"$f":"IF(AND(INTRO!$E$37=\"Endémique\",INTRO!$E$39=\"Non endémique\"),IF(COUNTRY_INFO!B74=0,\" \",COUNTRY_INFO!B74),\" \")","v":" "},{"$f":"IF(AND(INTRO!$E$37=\"Endémique\",INTRO!$E$39=\"Non endémique\"),IF(COUNTRY_INFO!C74=0,\" \",COUNTRY_INFO!C74),\" \")","v":" "},{"$f":"IF(COUNTRY_INFO!Z74<>\"\",COUNTRY_INFO!V74,0)","v":0},{"$f":"IF(AND(COUNTRY_INFO!Z74<>\"\",COUNTRY_INFO!$H74=1),COUNTRY_INFO!F74+COUNTRY_INFO!G74,0)","v":0},0,null,0]
[{"$f":"IF(AND(INTRO!$E$37=\"Endémique\",INTRO!$E$39=\"Non endémique\"),IF(COUNTRY_INFO!A75=0,\" \",COUNTRY_INFO!A75),\" \")","v":" "},{"$f":"IF(AND(INTRO!$E$37=\"Endémique\",INTRO!$E$39=\"Non endémique\"),IF(COUNTRY_INFO!B75=0,\" \",COUNTRY_INFO!B75),\" \")","v":" "},{"$f":"IF(AND(INTRO!$E$37=\"Endémique\",INTRO!$E$39=\"Non endémique\"),IF(COUNTRY_INFO!C75=0,\" \",COUNTRY_INFO!C75),\" \")","v":" "},{"$f":"IF(COUNTRY_INFO!Z75<>\"\",COUNTRY_INFO!V75,0)","v":0},{"$f":"IF(AND(COUNTRY_INFO!Z75<>\"\",COUNTRY_INFO!$H75=1),COUNTRY_INFO!F75+COUNTRY_INFO!G75,0)","v":0},{"$f":"E75*2.8","v":0},null,0]
[{"$f":"IF(AND(INTRO!$E$37=\"Endémique\",INTRO!$E$39=\"Non endémique\"),IF(COUNTRY_INFO!A76=0,\" \",COUNTRY_INFO!A76),\" \")","v":" "},{"$f":"IF(AND(INTRO!$E$37=\"Endémique\",INTRO!$E$39=\"Non endémique\"),IF(COUNTRY_INFO!B76=0,\" \",COUNTRY_INFO!B76),\" \")","v":" "},{"$f":"IF(AND(INTRO!$E$37=\"Endémique\",INTRO!$E$39=\"Non endémique\"),IF(COUNTRY_INFO!C76=0,\" \",COUNTRY_INFO!C76),\" \")","v":" "},{"$f":"IF(COUNTRY_INFO!Z76<>\"\",COUNTRY_INFO!V76,0)","v":0},{"$f":"IF(AND(COUNTRY_INFO!Z76<>\"\",COUNTRY_INFO!$H76=1),COUNTRY_INFO!F76+COUNTRY_INFO!G76,0)","v":0},0,null,0]
[{"$f":"IF(AND(INTRO!$E$37=\"Endémique\",INTRO!$E$39=\"Non endémique\"),IF(COUNTRY_INFO!A77=0,\" \",COUNTRY_INFO!A77),\" \")","v":" "},{"$f":"IF(AND(INTRO!$E$37=\"Endémique\",INTRO!$E$39=\"Non endémique\"),IF(COUNTRY_INFO!B77=0,\" \",COUNTRY_INFO!B77),\" \")","v":" "},{"$f":"IF(AND(INTRO!$E$37=\"Endémique\",INTRO!$E$39=\"Non endémique\"),IF(COUNTRY_INFO!C77=0,\" \",COUNTRY_INFO!C77),\" \")","v":" "},{"$f":"IF(COUNTRY_INFO!Z77<>\"\",COUNTRY_INFO!V77,0)","v":0},{"$f":"IF(AND(COUNTRY_INFO!Z77<>\"\",COUNTRY_INFO!$H77=1),COUNTRY_INFO!F77+COUNTRY_INFO!G77,0)","v":0},0,null,0]
[{"$f":"IF(AND(INTRO!$E$37=\"Endémique\",INTRO!$E$39=\"Non endémique\"),IF(COUNTRY_INFO!A78=0,\" \",COUNTRY_INFO!A78),\" \")","v":" "},{"$f":"IF(AND(INTRO!$E$37=\"Endémique\",INTRO!$E$39=\"Non endémique\"),IF(COUNTRY_INFO!B78=0,\" \",COUNTRY_INFO!B78),\" \")","v":" "},{"$f":"IF(AND(INTRO!$E$37=\"Endémique\",INTRO!$E$39=\"Non endémique\"),IF(COUNTRY_INFO!C78=0,\" \",COUNTRY_INFO!C78),\" \")","v":" "},{"$f":"IF(COUNTRY_INFO!Z78<>\"\",COUNTRY_INFO!V78,0)","v":0},{"$f":"IF(AND(COUNTRY_INFO!Z78<>\"\",COUNTRY_INFO!$H78=1),COUNTRY_INFO!F78+COUNTRY_INFO!G78,0)","v":0},0,null,0]
[{"$f":"IF(AND(INTRO!$E$37=\"Endémique\",INTRO!$E$39=\"Non endémique\"),IF(COUNTRY_INFO!A79=0,\" \",COUNTRY_INFO!A79),\" \")","v":" "},{"$f":"IF(AND(INTRO!$E$37=\"Endémique\",INTRO!$E$39=\"Non endémique\"),IF(COUNTRY_INFO!B79=0,\" \",COUNTRY_INFO!B79),\" \")","v":" "},{"$f":"IF(AND(INTRO!$E$37=\"Endémique\",INTRO!$E$39=\"Non endémique\"),IF(COUNTRY_INFO!C79=0,\" \",COUNTRY_INFO!C79),\" \")","v":" "},{"$f":"IF(COUNTRY_INFO!Z79<>\"\",COUNTRY_INFO!V79,0)","v":0},{"$f":"IF(AND(COUNTRY_INFO!Z79<>\"\",COUNTRY_INFO!$H79=1),COUNTRY_INFO!F79+COUNTRY_INFO!G79,0)","v":0},0,null,0]
[{"$f":"IF(AND(INTRO!$E$37=\"Endémique\",INTRO!$E$39=\"Non endémique\"),IF(COUNTRY_INFO!A80=0,\" \",COUNTRY_INFO!A80),\" \")","v":" "},{"$f":"IF(AND(INTRO!$E$37=\"Endémique\",INTRO!$E$39=\"Non endémique\"),IF(COUNTRY_INFO!B80=0,\" \",COUNTRY_INFO!B80),\" \")","v":" "},{"$f":"IF(AND(INTRO!$E$37=\"Endémique\",INTRO!$E$39=\"Non endémique\"),IF(COUNTRY_INFO!C80=0,\" \",COUNTRY_INFO!C80),\" \")","v":" "},{"$f":"IF(COUNTRY_INFO!Z80<>\"\",COUNTRY_INFO!V80,0)","v":0},{"$f":"IF(AND(COUNTRY_INFO!Z80<>\"\",COUNTRY_INFO!$H80=1),COUNTRY_INFO!F80+COUNTRY_INFO!G80,0)","v":0},0,null,0]
[{"$f":"IF(AND(INTRO!$E$37=\"Endémique\",INTRO!$E$39=\"Non endémique\"),IF(COUNTRY_INFO!A81=0,\" \",COUNTRY_INFO!A81),\" \")","v":" "},{"$f":"IF(AND(INTRO!$E$37=\"Endémique\",INTRO!$E$39=\"Non endémique\"),IF(COUNTRY_INFO!B81=0,\" \",COUNTRY_INFO!B81),\" \")","v":" "},{"$f":"IF(AND(INTRO!$E$37=\"Endémique\",INTRO!$E$39=\"Non endémique\"),IF(COUNTRY_INFO!C81=0,\" \",COUNTRY_INFO!C81),\" \")","v":" "},{"$f":"IF(COUNTRY_INFO!Z81<>\"\",COUNTRY_INFO!V81,0)","v":0},{"$f":"IF(AND(COUNTRY_INFO!Z81<>\"\",COUNTRY_INFO!$H81=1),COUNTRY_INFO!F81+COUNTRY_INFO!G81,0)","v":0},0,null,0]

{"sheet":"SUMMARY","index":7,"n_rows":93,"n_cols":8,"rows_kept":93,"cut":false,"hidden":false,"merged":[[73,4,73,5],[60,4,60,6],[61,4,61,6],[62,4,62,6],[72,2,72,3],[72,4,72,5],[81,2,81,7],[83,3,83,7],[59,4,59,6],[50,1,50,7],[56,1,56,7],[51,1,51,7],[52,1,52,7],[80,1,80,7],[58,1,58,7],[78,1,78,7],[79,1,79,7],[66,1,66,7],[76,2,76,3],[74,2,74,3],[74,4,74,5],[73,2,73,3],[55,1,55,7],[9,1,10,1],[9,3,9,6],[9,2,10,2],[17,1,19,1],[21,1,23,1],[25,1,27,1],[9,7,10,7],[32,2,35,4],[84,3,84,7],[83,1,83,2],[0,1,0,7],[1,1,1,7],[2,1,2,5],[3,1,3,7],[4,1,4,7],[6,1,6,7],[5,2,5,5],[65,1,65,7],[54,1,54,7],[53,1,53,7],[36,1,36,7],[41,2,41,3],[41,4,41,5],[41,6,41,7],[57,1,57,7],[82,2,82,6],[63,4,63,6],[75,2,75,3],[97,1,97,7],[75,4,75,5],[70,4,70,5],[71,4,71,5],[70,2,70,3],[71,2,71,3],[92,1,92,7],[76,4,76,5],[87,1,87,7],[91,1,91,7],[86,1,86,7],[84,1,84,2]]}
[]
[null,"Formulaire de demande commune de médicaments pour CP v.4.1"]
[]
[null,"Ce formulaire constitue une demande officielle du Gouvernement à l'OMS pour l'approvisionnement des médicaments mentionnés ci-dessus. Pour garantir la livraison des médicaments à temps, la demande de médicaments CP doit être soumise au moins 9 mois avant la première date d'administration massive de médicaments prévue dans l'année civile de la demande."]
[]
[null,"Pays",{"$f":"IF(INTRO!$E$33<>0,INTRO!$E$33,\" \")","v":"NIGER"},null,null,null,"Année",{"$f":"IF(INTRO!$E$35<>0,INTRO!$E$35,\" \")","v":2024}]
[]
[null,"Information on PC medicines requested to WHO"]
[]
[null,"Le médicament","Groupe ciblé","Nombre de comprimés",null,null,null,"Préciser l’origine"]
[null,null,null,"Requis","En stock","En cours de demande","Demandés"]
[null,"Diethylcarbamazine","TOUTE",0,0,null,{"$f":"IF(D12>(E12+F12),D12-E12-F12, 0)","v":0}]
[null,null,null,null,null,null,0]
[null,"Ivermectine","TOUTE",0,0,null,0]
[]
[null,"Albendazole pour FL","TOUTE",0,0,null,0]
[null,null,null,null,null,null,0]
[null,"Albendazole pour STH","EAPréS",null,null,null,0]
[null,null,"EAS",0,null,null,0]
[null,null,"Adultes",null,null,null,0]
[]
[null,"Mebendazole","EAPréS",null,null,null,0]
[null,null,"EAS",null,null,null,0]
[null,null,"Adultes",null,null,null,0]
[]
[null,"Praziquantel","EAPréS",0,null,null,0]
[null,null,"EAS",3716270.2497095815,null,null,3716270.2497095815,"OMS"]
[null,null,"Adultes",9290675.6242739484,null,null,{"$f":"IF(D28>(E28+F28),D28-E28-F28, 0)","v":9290675.6242739484},"OMS"]
[]
[null,"Nombre de personnes devant être traitées avec le médicament donné"]
[]
[null,"La maladie",null,null,null,"1er tour","2ème tour","3ème tour"]
[null,"Filariose lymphatique","Ces chiffres sont estimés uniquement pour les goupes d'âge ciblés pour le traitement avec les médicaments donnés, dans les régions où le traitement de maladies spécifiques est requis",null,null,0]
[null,"Onchocercose",null,null,null,0,0]
[null,"Schistosomiase",null,null,null,4955026.9996127756,0]
[null,"Géohelminthiases",null,null,null,0,0,0]
[]
[]
[]
[null,"Informations sur les interventions CP planifiées "]
[]
[null,"Le médicament","Veuillez sélectionner une date (mois et année) pour la 1ère tournée de CP",null,"Veuillez sélectionner une date (mois et année) pour la 2ème tournée de CP",null,"Date à laquelle les médicaments devraient atteindre l’entrepôt national"]
[null,"Diethylcarbamazine"]
[null,"Ivermectine"]
[null,"Albendazole pour FL"]
[null,"Albendazole pour STH","Mars",2024,null,null,"Janvier",2024]
[null,"Mebendazole"]
[null,"Praziquantel","Mars",2024,null,null,"Janvier",2024]
[]
[null,"Récapitulatif - Checklist"]
[null,"Submission"]
[null,"Que faut-il soumettre ?"]
[null,"L'approvisionnement des médicaments demandés doit être basé sur des données épidémiologiques à jour, des plans d'utilisation des médicaments spécifiques et sur la capacité de mise en oeuvre. La liste suivante permet d'assurer que tous les formulaires et toutes les informations sont fournis à l'OMS (en format électronique)."]
[null,"Formulaire de demande commune de médicaments pour chimioprévention"]
[null,"Formulaire de rapport commun"]
[null,"Déclaration des données épidémiologiques pour la CP"]
[]
[null,"Disponibilité de financement pour la mise en oeuvre de tournées pendant l’année pour laquelle les medicaments ont été demandés"]
[]
[null,"Maladies ciblées pour la mise en oeuvre","# de traitements ","Financement assuré pour","Origine",null,null,"Montant"]
[null,"Filariose lymphatique",{"$f":"SUM(F33:H33)","v":0}]
[null,"Onchocercose",{"$f":"SUM(F34:H34)","v":0}]
[null,"Schistosomiase",{"$f":"SUM(F35:H35)","v":4955026.9996127756},0.47]
[null,"Géohelminthiases",{"$f":"SUM(F36:H36)","v":0},0.47]
[]
[null,"Qui doit remplir le formulaire ?"]
[null,"Le Coordonnateur national MTN doit compiler toutes les informations nécessaires pour compléter le formulaire de demande.  En l'absence d'un coordonnateur, les gestionnaires de programmes spécifiques devraient coordonner leurs sections respectives. Une fois finalisée, chaque demande individuelle doit être approuvée par le Ministère de la Santé."]
[]
[null,"Informations concernant la (les) personne(s) ayant rempli le formulaire"]
[]
[null,"Titre/fonction ","Nom",null,"Téléphone",null,"Email","Date"]
[null,"Gestionnaire de Programme FL","Dr Salissou Adamou",null,"(+227)96960376",null,"sadamouba@yahoo.fr"]
[null,"Gestionnaire de programme ONCHO","Dr Salissou Adamou",null,"(+227)96960376",null,"sadamouba@yahoo.fr"]
[null,"Gestionnaire de programme SCH","Dr Gnandou Issa ",null,22796292252,null,"issahgnandou@yahoo.com"]
[null,"Gestionnaire de Programme STH","Dr Gnandou Issa ",null,22796292252,null,"issahgnandou@yahoo.com"]
[]
[]
[]
[null,"L’OMS recommende que tous les effets secondaires graves suspectés d’être associés à l’ingestion de médicaments de CP soient rapportés en suivant les lignes directrices nationales de pharmacovigilance.  En l’absence d’un système de pharmacovigilance national, contactez le département de Contrôle des Maladies Tropicales Négligées pour être conseillé."]
[null,"L’OMS s’est engagée à rendre possible la donation de médicaments en fournissant gratuitement: a) albendazole, mebendazole et praziquantel à l’entrepôt national du Ministère de la Santé et b) diethylcarbamazine au port d’entrée du pays receveur."]
[null,"L’institution soumettant la présente requête est responsable de: a) l’organisation du déchargement des médicaments du camion, du stockage dans l’entrepôt national et de l’expédition vers les centres où aura lieu la distribution finale; b) de l’enregistrement, si nécessaire, des médicaments donnés, auprès des autorités nationales en charge; et de c) de l’information de n’importe quels changements ayant trait à leurs campagnes de traitement (par exemple le report d’une date planifiée de distribution en masse de médicaments, le remplacement d’un coordonateur MTN, etc.)."]
[null,null,"J’ai pris connaissance et accepté la politique de la communication \nde données de l’OMS"]
[null,null,"Je confirme que toutes les informations fournies dans ce formulaire sont complètes et correctes"]
[null,"Nom et signature \ndu Coordonnateur MTN ou du \nReprésentant du Ministère de la Santé",null,"Dr Gnandou Issa Coordonnateur PNLBG"]
[null,"Date",null,"2023-05-14"]
[]
[null,"Si vous avez plus d'un destinataire final pour les médicaments de chimioprévention demandés, veuillez compléter les informations de la rubrique \"Informations concernant l'envoi et le destinataire\" dans la feuille de travail SHIPMENT."]
[null,"Veuillez envoyer le rapport national (signé et sous format électronique) au représentant de I'OMS du pays en mettant en copie:"]
[null,"Siège de l'OMS ","PC_JointForms@who.int"]
[null,"Bureau régional de l'OMS","Conseiller régional MTN"]
[null,"Mectizan donation programme","Dr Yao Sodahlon, email: ysodahlon@taskforce.org"]
[]
[null,"Veuillez noter que votre demande sera examinée par un panel d'experts indépendants (Comité ad hoc d’évaluation conjointe). Les informations contenues dans ce formulaire, le rapport commun d'activités (ou rapport national d'activités) et le plan d'action annuel sont essentiels à l'OMS pour assurer un usage optimal des médicaments. Dans le cadre de ses activités courantes de suivi et d'évaluation, et afin d'honorer ses obligations contractuelles envers les bailleurs de fonds  et autres partenaires, l'OMS et ses agents affiliés se réservent le droit d'inspecter, périodiquement, les stocks de médicaments au niveau national. "]

{"sheet":"SHIPMENT","index":8,"n_rows":48,"n_cols":8,"rows_kept":48,"cut":false,"hidden":false,"merged":[[34,1,34,7],[36,1,36,7],[0,1,0,7],[1,1,1,7],[2,1,2,5],[17,5,17,7],[18,5,18,7],[19,2,19,4],[19,5,19,7],[21,2,21,4],[3,2,3,5],[4,1,4,7],[22,2,22,4],[22,5,22,7],[15,2,15,4],[20,5,20,7],[15,5,15,7],[20,2,20,4],[18,2,18,4],[16,2,16,4],[47,1,54,7],[45,1,45,7],[37,1,37,6],[38,1,38,5],[40,1,40,7],[41,1,41,6],[39,1,39,6],[42,1,42,6],[43,1,43,7],[25,2,25,4],[25,5,25,7],[24,1,24,7],[6,1,6,7],[7,2,7,4],[7,5,7,7],[8,2,8,4],[8,5,8,7],[9,2,9,4],[9,5,9,7],[10,2,10,4],[10,5,10,7],[11,2,11,4],[11,5,11,7],[12,2,12,4],[12,5,12,7],[13,2,13,4],[13,5,13,7],[14,2,14,4],[14,5,14,7],[23,2,23,4],[23,5,23,7],[21,5,21,7],[16,5,16,7],[17,2,17,4],[26,2,26,4],[26,5,26,7],[27,2,27,4],[27,5,27,7],[28,2,28,4],[28,5,28,7],[32,2,32,4],[32,5,32,7],[29,2,29,4],[29,5,29,7],[30,2,30,4],[30,5,30,7],[31,2,31,4],[31,5,31,7]]}
[]
[null,"Formulaire de demande commune de médicaments pour CP v.4.1"]
[]
[null,"Pays",{"$f":"IF(INTRO!$E$33<>0,INTRO!$E$33,\" \")","v":"NIGER"},null,null,null,"Année",{"$f":"IF(INTRO!$E$35<>0,INTRO!$E$35,\" \")","v":2024}]
[]
[null,"Information on shipment and consignee "]
[]
[null,null,"Destinataire",null,null,"Destinataire final\nsi différent du destinaire précédent"]
[null,"Nom",null,null,null,"Dr Gnandou Issa "]
[null,"Département/Unité","WR OMS",null,null,"Coordonnateur"]
[null,"Organisation","OMS NIAMEY NIGER",null,null,"Programme Bilharziose et Géohelminthes"]
[null,"Téléphone","(+227)20 75 20 39    ",null,null,22796292252]
[null,"Fax","(+227) 20 75 20 41"]
[null,"E-mail","baruaningoyb@who.int",null,null,"issahgnadou@yahoo,com"]
[null,"Adresse postale"," ",null,null,"BP  82 NIAMEY"]
[]
[null,null,"Destinataire",null,null,"Destinataire final\nsi différent du destinaire précédent"]
[null,"Nom",null,null,null,"Dr Gnandou Issa "]
[null,"Département/Unité","WR OMS",null,null,"Coordonnateur"]
[null,"Organisation","OMS NIAMEY NIGER",null,null,"Programme Bilharziose et Géohelminthes"]
[null,"Téléphone","(+227)20 75 20 39    ",null,null,22796292252]
[null,"Fax","(+227) 20 75 20 41"]
[null,"E-mail","baruaningoyb@who.int",null,null,"issahgnadou@yahoo,com"]
[null,"Adresse postale"," ",null,null,"BP  82 NIAMEY"]
[]
[null,null,"Destinataire",null,null,"Destinataire final\nsi différent du destinaire précédent"]
[null,"Nom",null,null,null,"Dr Gnandou Issa "]
[null,"Département/Unité","WR OMS",null,null,"Coordonnateur"]
[null,"Organisation","OMS NIAMEY NIGER",null,null,"Programme Bilharziose et Géohelminthes"]
[null,"Téléphone","(+227)20 75 20 39    ",null,null,22796292252]
[null,"Fax","(+227) 20 75 20 41"]
[null,"E-mail","baruaningoyb@who.int",null,null,"issahgnadou@yahoo,com"]
[null,"Adresse postale",null,null,null,"BP  82 NIAMEY"]
[]
[]
[null,"Information concernant les obligations légales d’importation"]
[]
[null,"Est le permis d'importation nécessaire?",null,null,null,null,null,"Oui"]
[null,"Combien de temps cela prend-il pour obtenir le permis d’importation?",null,null,null,null,7,"Semaines"]
[null,"Avez vous besoin que certains documents soient remis en même temps que la demande de permis d’importation?",null,null,null,null,null,"Oui"]
[]
[null,"Est-ce que le destinataire doit procéder au dédouanement avant que l’expédition puisse avoir lieu?",null,null,null,null,null,"No"]
[null,"Y a-t-il des informations supplémentaires qui pourraient être utiles afin d’assurer un dédouanement et une livraison rapide des médicaments dans votre pays?",null,null,null,null,null,"Oui"]
[]
[]
[null,"Remarques supplémentaires éventuelles liées à cette requête"]
[]
[null,"Remerciements  au MDP et à l'OMS pour tous les appuis sans cesse croissant pour faciliter l'acquisition des médicaments MTN"]

{"sheet":"DATA_POLICY","index":9,"n_rows":39,"n_cols":8,"rows_kept":39,"cut":false,"hidden":true,"merged":[[55,1,55,2],[0,1,0,5],[1,1,1,7],[3,3,3,5],[6,1,6,7],[8,1,12,7],[13,1,16,7],[17,1,21,7],[22,1,25,7],[26,2,36,7],[38,1,45,7]]}
[]
[null,"Formulaire de demande commune de médicaments pour CP v.4.1"]
[]
[null,"Pays",null,{"$f":"IF(INTRO!$E$33<>0,INTRO!$E$33,\" \")","v":"NIGER"},null,null,"Année",{"$f":"IF(INTRO!$E$35<>0,INTRO!$E$35,\" \")","v":2024}]
[]
[]
[null,"Déclaration de principe sur la communication de données par l’OMS"]
[]
[null,"Les données sont le fondement de toutes les mesures rationnelles de santé publique et les avantages de la communication de données, y compris pour la science et la santé publique, sont largement reconnus. L’OMS souhaite promouvoir autant que possible la communication de données sanitaires, y compris, mais pas uniquement, de données épidémiologiques et de surveillance."]
[]
[]
[]
[]
[null,{"$f":"\"À cet égard, et sans préjudice des instruments juridiquement contraignants régissant la communication et la publication d’informations, le Ministère de la santé de \" & D4 & \", en fournissant des données à l’OMS :\"","v":"À cet égard, et sans préjudice des instruments juridiquement contraignants régissant la communication et la publication d’informations, le Ministère de la santé de NIGER, en fournissant des données à l’OMS :"}]
[]
[]
[]
[null,"confirme que toutes les données à fournir à l’OMS, ont été collectées conformément à la législation nationale applicable, y compris aux lois de protection des données visant à préserver l’anonymat des personnes identifiables ;"]
[]
[]
[]
[]
[null,{"$f":"\"convient que l’OMS aura le droit, toujours sous réserve des mesures visant à garantir l’utilisation éthique et sécurisée des données et toujours sous réserve d’une reconnaissance appropriée de la part de \"&D4&\":\"","v":"convient que l’OMS aura le droit, toujours sous réserve des mesures visant à garantir l’utilisation éthique et sécurisée des données et toujours sous réserve d’une reconnaissance appropriée de la part de NIGER:"}]
[]
[]
[]
[null,null,"de publier les données, dépourvues de tout élément d’identification personnelle (ci-après dénommées « les données ») et de les mettre à la disposition de toute partie intéressée, sur demande (dans la mesure où elles n’ont pas, ou pas encore, été publiées par l’OMS), selon des modalités autorisant leur utilisation non commerciale et sans but lucratif à des fins de santé publique (pour autant que l’OMS garde la maîtrise de la publication des données) ;\nd’utiliser, de compiler, d’agréger, d’évaluer et d’analyser les données et de publier et de diffuser les résultats obtenus grâce à ces données en rapport avec des travaux de l’OMS et conformément aux politiques et pratiques de l’Organisation."]
[]
[]
[]
[]
[]
[]
[]
[]
[]
[]
[]
[null,{"$f":"CONCATENATE(\"Sauf lorsque des instruments juridiquement contraignants (RSI, Règlement de Nomenclature de l’OMS, de 1967, etc.) disposent que les données doivent être communiquées et publiées, le Ministère de la santé de \", D4,\" peut, pour certaines données, décider de ne pas appliquer (tout ou partie des) (les) dispositions qui précèdent,\" & \" en informant l’OMS par écrit à l’adresse suivante, à condition que cette notification précise clairement les données, \" & \"dont il s’agit et indique clairement lesquelles des dispositions qui précèdent ne seront pas appliquées, et pour quels motifs.\")","v":"Sauf lorsque des instruments juridiquement contraignants (RSI, Règlement de Nomenclature de l’OMS, de 1967, etc.) disposent que les données doivent être communiquées et publiées, le Ministère de la santé de NIGER peut, pour certaines données, décider de ne pas appliquer (tout ou partie des) (les) dispositions qui précèdent, en informant l’OMS par écrit à l’adresse suivante, à condition que cette notification précise clairement les données, dont il s’agit et indique clairement lesquelles des dispositions qui précèdent ne seront pas appliquées, et pour quels motifs."}]