{"text_format":"1","workbook":"xlsx","n_sheets":12,"sheets":["INTRO","COUNTRY_INFO","MDA1","MDA2","MDA3","T1","T2","T3_R1","T3_R2","DISTRICT","SUMMARY","PROFILE"],"not_rendered":{"charts":8,"images":2,"macros":1,"external_links":0,"defined_names":4,"comments":11,"pivot_tables":0},"unopened":[],"bounds":{"document_bytes":16777216,"sheet_cells":100000,"rows_first":2000,"rows_last":500,"rows_between":2000,"halvings":0,"cell_chars":16384,"cell_head_chars":4096},"cells_cut":0,"cells_raw":0,"read":"whole","date_system":"1900"}

{"sheet":"INTRO","index":0,"n_rows":50,"n_cols":5,"rows_kept":50,"cut":false,"hidden":false,"merged":[[45,1,45,2],[10,2,10,4],[41,1,41,2],[43,1,43,2],[46,1,46,4],[33,1,33,2],[35,1,35,2],[26,2,27,4],[37,1,37,2],[39,1,39,2],[28,1,28,4],[29,2,29,4],[30,1,30,4],[31,1,31,4],[20,1,20,4],[21,2,21,4],[22,1,22,4],[23,2,24,4],[25,1,25,4],[15,1,15,4],[16,1,16,4],[17,1,17,4],[18,1,18,4],[19,2,19,4],[9,2,9,4],[11,2,11,4],[12,1,12,4],[13,1,13,4],[14,1,14,4],[7,2,7,4],[8,2,8,4],[0,1,0,4],[1,1,1,4],[2,1,2,4],[3,1,3,4],[4,1,4,4],[5,1,5,4]]}
[]
[null,"PC Joint Reporting Form v.3"]
[]
[null,"The purpose of this template Joint Reporting Form (JRF) - available as an Excel file - is to provide national health authorities and data managers with a standardized tool to address these reporting challenges, facilitate  integration and thereby further contribute to improving overall programme management. This template aims to standardize national reporting of programme implementation outcomes, improve availability and coordination of preventive chemotherapy data across the World Health Organization regions. \nNational authorities are requested to complete this form for submission to the World Health Organization any time before 15 August of the current year for reporting data on PC interventions implemented during the previous year."]
[]
[null,"Structure of the application (worksheets):"]
[]
[null,"INTRO","This worksheet includes guides on how to complete the joint reporting form and information about status of PC for endemic diseases in the country"]
[null,"COUNTRY_INFO","This worksheet includes information about administrative structure of the country, population by age group, status of endemicity for each disease, population requiring PC, planned interventions and interventions implemented"]
[null,"MDA1, MDA2, MDA3, T1, T2 and T3","These worksheets include information about endemic districts targeted for treatment with specified PC medicines, treatment plan, and number of people who received treatment by age group"]
[null,"DISTRICT","This worksheet includes summary of people treated by disease at the level of implementation. If data by gender is available, it requires to enter."]
[null,"SUMMARY","This worksheet includes summary of people treated by disease and by PC intervention. Before generating the report (run macros) please select the disease for which you need the report. Follow the same rule to generate various reports.\nThis worksheet should be printed and submitted as a Joint Report (see the instruction for submission in the SUMMARY worksheet)."]
[]
[null,"Instruction for data entry"]
[]
[null,"Most of the cells in the above-mentioned worksheets include formula that are calculated automatically according to the treatment policy recommended by WHO for each disease.\nSee the link http://www.who.int/neglected_diseases/preventive_chemotherapy/pct_manual/en/index.html"]
[]
[null,"Please enter your data into the cells according to their colour code:"]
[]
[null,null,"White - cell is not protected. Please enter the value of the requested indicator."]
[]
[null,null,"Yellow - cell is protected and includes name of indicator. No data entry required."]
[]
[null,null,"Orange - cell is not protected and includes a drop-down menu. Please select the value from the drop-down list."]
[]
[]
[null,null,"Green - cell is not protected and includes formula. Please change the value only if your data are different from those that are calculated automatically."]
[]
[]
[null,null,"Blue - cell is protected and includes formula. No data entry required."]
[]
[null,"Country data"]
[]
[null,"COUNTRY",null,null,"Guinea"]
[]
[null,"Year of reporting data",null,null,2016]
[]
[null,"Is country endemic for lymphatic filariasis (LF)?",null,null,"Endemic"]
[]
[null,"Is country endemic for onchocerciasis (ONCHO)?",null,null,"Endemic"]
[]
[null,"Is country endemic for soil-transmitted helminthiases (STH)?",null,null,"Endemic"]
[]
[null,"Is country endemic for schistosomiasis (SCH)?",null,null,"Endemic"]
[]
[null,"How many administrative units in the country?",null,null,38]
[null,"If demographical data at the second administrative level are not available by age group, please enter the proportion (%) of population by age group in the country. If data are available, please leave these cells blank."]
[null,"1-4 years age","Preschool-age children (PreSAC)",null,0.16]
[null,"5-14 years age","School-age children (SAC)",null,0.25]
[null,"15 years +","Adults",null,0.55000000000000004]

{"sheet":"COUNTRY_INFO","index":1,"n_rows":46,"n_cols":27,"rows_kept":46,"cut":false,"hidden":false,"merged":[[3,0,3,2],[3,7,3,10],[3,19,3,20],[5,0,5,2],[3,15,3,18],[5,15,5,18],[3,21,3,22],[5,21,5,22],[5,3,5,6],[5,7,5,10],[5,11,5,14],[5,19,5,20]]}
["COUNTRY INFORMATION"]
["Administrative structure, population by age group, endemicity status, planned interventions and interventions implemented"]
[]
["TOTAL",null,null,{"$f":"SUM(D$9:D$1000)","v":10991383},{"$f":"SUM(E$9:E$1000)","v":1758617},{"$f":"SUM(F$9:F$1000)","v":2747850},{"$f":"SUM(G$9:G$1000)","v":6045260},null,null,null,null,{"$f":"SUM(L$9:L$1000)","v":7161619},{"$f":"SUM(M$9:M$1000)","v":6781592},{"$f":"SUM(N$9:N$1000)","v":2079265},{"$f":"SUM(O$9:O$1000)","v":3678502.62}]
[]
["Country administrative structure",null,null,"Population",null,null,null,"Endemicity",null,null,null,"Population requiring PC",null,null,null,"Number of treatment\nrounds planned for the year",null,null,null,"PC implemented",null,"Click to see the recommended strategy"]
["Country","Province/State","District","Total","PreSAC","SAC","Adults","LF","Oncho","STH","SCH","LF","Oncho","STH","SCH","LF","Oncho","STH","SCH","ROUND 1","ROUND2",null,null,"IU_ID","IU_Name"]
[]
[{"$f":"IF(INTRO!$E$34<>0,INTRO!$E$34,\"\")","v":"Guinea"},"Boké","Boffa",222040,{"$f":"IF(INTRO!$E$48=\"\",\"\",ROUND($D9*INTRO!$E$48,0))","v":35526},{"$f":"IF(INTRO!$E$49=\"\",\"\",ROUND($D9*INTRO!$E$49,0))","v":55510},{"$f":"IF(INTRO!$E$50=\"\",\"\",ROUND($D9*INTRO!$E$50,0))","v":122122},0,0,1,0,{"$f":"IF(INTRO!$E$38=\"Endemic\", IF($H9>0, IF($H9=4,\"Unknown\", IF($H9=99,\"Stopped\", $D9)), 0),\"Not required\")","v":0},{"$f":"IF(INTRO!$E$40=\"Endemic\", IF($I9>0, IF($I9=4,\"Unknown\",IF($I9=99,\"Stopped\", $D9)), 0),\"Not required\")","v":0},{"$f":"IF(INTRO!$E$42=\"Endemic\", IF(AND($J9>1,$J9<5), IF($J9=4, \"Unknown\", E9+F9), 0),\"Not required\")","v":0},{"$f":"IF(INTRO!$E$44=\"Endemic\", IF(AND($K9>0,$K9<5), IF($K9=4,\"Unknown\", IF($K9=1, $F9*0.33, IF($K9=2, $F9*0.5+$G9*0.2, SUM(F9:G9)))), 0),\"Not required\")","v":0},0,0,0,0,null,null,null,null,22605,"Boffa",null,{"$f":"Y9=C9","v":true}]
[{"$f":"IF(INTRO!$E$34<>0,INTRO!$E$34,\"\")","v":"Guinea"},"Boké","Boke",470308,{"$f":"IF(INTRO!$E$48=\"\",\"\",ROUND($D10*INTRO!$E$48,0))","v":75249},{"$f":"IF(INTRO!$E$49=\"\",\"\",ROUND($D10*INTRO!$E$49,0))","v":117577},{"$f":"IF(INTRO!$E$50=\"\",\"\",ROUND($D10*INTRO!$E$50,0))","v":258669},1,0,1,1,{"$f":"IF(INTRO!$E$38=\"Endemic\", IF($H10>0, IF($H10=4,\"Unknown\", IF($H10=99,\"Stopped\", $D10)), 0),\"Not required\")","v":470308},{"$f":"IF(INTRO!$E$40=\"Endemic\", IF($I10>0, IF($I10=4,\"Unknown\",IF($I10=99,\"Stopped\", $D10)), 0),\"Not required\")","v":0},{"$f":"IF(INTRO!$E$42=\"Endemic\", IF(AND($J10>1,$J10<5), IF($J10=4, \"Unknown\", E10+F10), 0),\"Not required\")","v":0},{"$f":"IF(INTRO!$E$44=\"Endemic\", IF(AND($K10>0,$K10<5), IF($K10=4,\"Unknown\", IF($K10=1, $F10*0.33, IF($K10=2, $F10*0.5+$G10*0.2, SUM(F10:G10)))), 0),\"Not required\")","v":38800.410000000003},1,0,0,0,"MDA1 (IVM+ALB)",null,null,null,22606,"Boke",null,{"$f":"Y10=C10","v":true}]
[{"$f":"IF(INTRO!$E$34<>0,INTRO!$E$34,\"\")","v":"Guinea"},"Boké","Fria",101002,{"$f":"IF(INTRO!$E$48=\"\",\"\",ROUND($D11*INTRO!$E$48,0))","v":16160},{"$f":"IF(INTRO!$E$49=\"\",\"\",ROUND($D11*INTRO!$E$49,0))","v":25251},{"$f":"IF(INTRO!$E$50=\"\",\"\",ROUND($D11*INTRO!$E$50,0))","v":55551},0,0,1,1,{"$f":"IF(INTRO!$E$38=\"Endemic\", IF($H11>0, IF($H11=4,\"Unknown\", IF($H11=99,\"Stopped\", $D11)), 0),\"Not required\")","v":0},{"$f":"IF(INTRO!$E$40=\"Endemic\", IF($I11>0, IF($I11=4,\"Unknown\",IF($I11=99,\"Stopped\", $D11)), 0),\"Not required\")","v":0},{"$f":"IF(INTRO!$E$42=\"Endemic\", IF(AND($J11>1,$J11<5), IF($J11=4, \"Unknown\", E11+F11), 0),\"Not required\")","v":0},{"$f":"IF(INTRO!$E$44=\"Endemic\", IF(AND($K11>0,$K11<5), IF($K11=4,\"Unknown\", IF($K11=1, $F11*0.33, IF($K11=2, $F11*0.5+$G11*0.2, SUM(F11:G11)))), 0),\"Not required\")","v":8332.83},0,0,0,0,null,null,null,null,22617,"Fria",null,true]
[{"$f":"IF(INTRO!$E$34<>0,INTRO!$E$34,\"\")","v":"Guinea"},"Boké","Gaoual",202225,{"$f":"IF(INTRO!$E$48=\"\",\"\",ROUND($D12*INTRO!$E$48,0))","v":32356},{"$f":"IF(INTRO!$E$49=\"\",\"\",ROUND($D12*INTRO!$E$49,0))","v":50556},{"$f":"IF(INTRO!$E$50=\"\",\"\",ROUND($D12*INTRO!$E$50,0))","v":111224},1,1,1,3,{"$f":"IF(INTRO!$E$38=\"Endemic\", IF($H12>0, IF($H12=4,\"Unknown\", IF($H12=99,\"Stopped\", $D12)), 0),\"Not required\")","v":202225},{"$f":"IF(INTRO!$E$40=\"Endemic\", IF($I12>0, IF($I12=4,\"Unknown\",IF($I12=99,\"Stopped\", $D12)), 0),\"Not required\")","v":202225},{"$f":"IF(INTRO!$E$42=\"Endemic\", IF(AND($J12>1,$J12<5), IF($J12=4, \"Unknown\", E12+F12), 0),\"Not required\")","v":0},{"$f":"IF(INTRO!$E$44=\"Endemic\", IF(AND($K12>0,$K12<5), IF($K12=4,\"Unknown\", IF($K12=1, $F12*0.33, IF($K12=2, $F12*0.5+$G12*0.2, SUM(F12:G12)))), 0),\"Not required\")","v":161780},1,1,0,1,"MDA1 (IVM+ALB)","T2 (PZQ)",null,null,22607,"Gaoual",null,true]
[{"$f":"IF(INTRO!$E$34<>0,INTRO!$E$34,\"\")","v":"Guinea"},"Boké","Koundara",135756,{"$f":"IF(INTRO!$E$48=\"\",\"\",ROUND($D13*INTRO!$E$48,0))","v":21721},{"$f":"IF(INTRO!$E$49=\"\",\"\",ROUND($D13*INTRO!$E$49,0))","v":33939},{"$f":"IF(INTRO!$E$50=\"\",\"\",ROUND($D13*INTRO!$E$50,0))","v":74666},1,1,1,2,{"$f":"IF(INTRO!$E$38=\"Endemic\", IF($H13>0, IF($H13=4,\"Unknown\", IF($H13=99,\"Stopped\", $D13)), 0),\"Not required\")","v":135756},{"$f":"IF(INTRO!$E$40=\"Endemic\", IF($I13>0, IF($I13=4,\"Unknown\",IF($I13=99,\"Stopped\", $D13)), 0),\"Not required\")","v":135756},{"$f":"IF(INTRO!$E$42=\"Endemic\", IF(AND($J13>1,$J13<5), IF($J13=4, \"Unknown\", E13+F13), 0),\"Not required\")","v":0},{"$f":"IF(INTRO!$E$44=\"Endemic\", IF(AND($K13>0,$K13<5), IF($K13=4,\"Unknown\", IF($K13=1, $F13*0.33, IF($K13=2, $F13*0.5+$G13*0.2, SUM(F13:G13)))), 0),\"Not required\")","v":31902.7},1,1,0,1,"MDA1 (IVM+ALB)","T2 (PZQ)",null,null,22608,"Koundara",null,true]
[{"$f":"IF(INTRO!$E$34<>0,INTRO!$E$34,\"\")","v":"Guinea"},"Conakry","Dixinn",141828,{"$f":"IF(INTRO!$E$48=\"\",\"\",ROUND($D14*INTRO!$E$48,0))","v":22692},{"$f":"IF(INTRO!$E$49=\"\",\"\",ROUND($D14*INTRO!$E$49,0))","v":35457},{"$f":"IF(INTRO!$E$50=\"\",\"\",ROUND($D14*INTRO!$E$50,0))","v":78005},0,0,1,0,{"$f":"IF(INTRO!$E$38=\"Endemic\", IF($H14>0, IF($H14=4,\"Unknown\", IF($H14=99,\"Stopped\", $D14)), 0),\"Not required\")","v":0},{"$f":"IF(INTRO!$E$40=\"Endemic\", IF($I14>0, IF($I14=4,\"Unknown\",IF($I14=99,\"Stopped\", $D14)), 0),\"Not required\")","v":0},{"$f":"IF(INTRO!$E$42=\"Endemic\", IF(AND($J14>1,$J14<5), IF($J14=4, \"Unknown\", E14+F14), 0),\"Not required\")","v":0},{"$f":"IF(INTRO!$E$44=\"Endemic\", IF(AND($K14>0,$K14<5), IF($K14=4,\"Unknown\", IF($K14=1, $F14*0.33, IF($K14=2, $F14*0.5+$G14*0.2, SUM(F14:G14)))), 0),\"Not required\")","v":0},0,0,0,0,null,null,null,null,22613,"Dixinn",null,true]
[{"$f":"IF(INTRO!$E$34<>0,INTRO!$E$34,\"\")","v":"Guinea"},"Conakry","Kaloum",65288,{"$f":"IF(INTRO!$E$48=\"\",\"\",ROUND($D15*INTRO!$E$48,0))","v":10446},{"$f":"IF(INTRO!$E$49=\"\",\"\",ROUND($D15*INTRO!$E$49,0))","v":16322},{"$f":"IF(INTRO!$E$50=\"\",\"\",ROUND($D15*INTRO!$E$50,0))","v":35908},0,0,1,0,{"$f":"IF(INTRO!$E$38=\"Endemic\", IF($H15>0, IF($H15=4,\"Unknown\", IF($H15=99,\"Stopped\", $D15)), 0),\"Not required\")","v":0},{"$f":"IF(INTRO!$E$40=\"Endemic\", IF($I15>0, IF($I15=4,\"Unknown\",IF($I15=99,\"Stopped\", $D15)), 0),\"Not required\")","v":0},{"$f":"IF(INTRO!$E$42=\"Endemic\", IF(AND($J15>1,$J15<5), IF($J15=4, \"Unknown\", E15+F15), 0),\"Not required\")","v":0},{"$f":"IF(INTRO!$E$44=\"Endemic\", IF(AND($K15>0,$K15<5), IF($K15=4,\"Unknown\", IF($K15=1, $F15*0.33, IF($K15=2, $F15*0.5+$G15*0.2, SUM(F15:G15)))), 0),\"Not required\")","v":0},0,0,0,0,null,null,null,null,22619,"Kaloum",null,true]
[{"$f":"IF(INTRO!$E$34<>0,INTRO!$E$34,\"\")","v":"Guinea"},"Conakry","Matam",149628,{"$f":"IF(INTRO!$E$48=\"\",\"\",ROUND($D16*INTRO!$E$48,0))","v":23940},{"$f":"IF(INTRO!$E$49=\"\",\"\",ROUND($D16*INTRO!$E$49,0))","v":37407},{"$f":"IF(INTRO!$E$50=\"\",\"\",ROUND($D16*INTRO!$E$50,0))","v":82295},0,0,1,0,{"$f":"IF(INTRO!$E$38=\"Endemic\", IF($H16>0, IF($H16=4,\"Unknown\", IF($H16=99,\"Stopped\", $D16)), 0),\"Not required\")","v":0},{"$f":"IF(INTRO!$E$40=\"Endemic\", IF($I16>0, IF($I16=4,\"Unknown\",IF($I16=99,\"Stopped\", $D16)), 0),\"Not required\")","v":0},{"$f":"IF(INTRO!$E$42=\"Endemic\", IF(AND($J16>1,$J16<5), IF($J16=4, \"Unknown\", E16+F16), 0),\"Not required\")","v":0},{"$f":"IF(INTRO!$E$44=\"Endemic\", IF(AND($K16>0,$K16<5), IF($K16=4,\"Unknown\", IF($K16=1, $F16*0.33, IF($K16=2, $F16*0.5+$G16*0.2, SUM(F16:G16)))), 0),\"Not required\")","v":0},0,0,0,0,null,null,null,null,22633,"Matam",null,true]
[{"$f":"IF(INTRO!$E$34<>0,INTRO!$E$34,\"\")","v":"Guinea"},"Conakry","Matoto",696295,{"$f":"IF(INTRO!$E$48=\"\",\"\",ROUND($D17*INTRO!$E$48,0))","v":111407},{"$f":"IF(INTRO!$E$49=\"\",\"\",ROUND($D17*INTRO!$E$49,0))","v":174074},{"$f":"IF(INTRO!$E$50=\"\",\"\",ROUND($D17*INTRO!$E$50,0))","v":382962},0,0,1,2,{"$f":"IF(INTRO!$E$38=\"Endemic\", IF($H17>0, IF($H17=4,\"Unknown\", IF($H17=99,\"Stopped\", $D17)), 0),\"Not required\")","v":0},{"$f":"IF(INTRO!$E$40=\"Endemic\", IF($I17>0, IF($I17=4,\"Unknown\",IF($I17=99,\"Stopped\", $D17)), 0),\"Not required\")","v":0},{"$f":"IF(INTRO!$E$42=\"Endemic\", IF(AND($J17>1,$J17<5), IF($J17=4, \"Unknown\", E17+F17), 0),\"Not required\")","v":0},{"$f":"IF(INTRO!$E$44=\"Endemic\", IF(AND($K17>0,$K17<5), IF($K17=4,\"Unknown\", IF($K17=1, $F17*0.33, IF($K17=2, $F17*0.5+$G17*0.2, SUM(F17:G17)))), 0),\"Not required\")","v":163629.40000000002},0,0,0,1,null,null,null,null,22634,"Matoto",null,true]
[{"$f":"IF(INTRO!$E$34<>0,INTRO!$E$34,\"\")","v":"Guinea"},"Conakry","Ratoma",681821,{"$f":"IF(INTRO!$E$48=\"\",\"\",ROUND($D18*INTRO!$E$48,0))","v":109091},{"$f":"IF(INTRO!$E$49=\"\",\"\",ROUND($D18*INTRO!$E$49,0))","v":170455},{"$f":"IF(INTRO!$E$50=\"\",\"\",ROUND($D18*INTRO!$E$50,0))","v":375002},0,0,1,2,{"$f":"IF(INTRO!$E$38=\"Endemic\", IF($H18>0, IF($H18=4,\"Unknown\", IF($H18=99,\"Stopped\", $D18)), 0),\"Not required\")","v":0},{"$f":"IF(INTRO!$E$40=\"Endemic\", IF($I18>0, IF($I18=4,\"Unknown\",IF($I18=99,\"Stopped\", $D18)), 0),\"Not required\")","v":0},{"$f":"IF(INTRO!$E$42=\"Endemic\", IF(AND($J18>1,$J18<5), IF($J18=4, \"Unknown\", E18+F18), 0),\"Not required\")","v":0},{"$f":"IF(INTRO!$E$44=\"Endemic\", IF(AND($K18>0,$K18<5), IF($K18=4,\"Unknown\", IF($K18=1, $F18*0.33, IF($K18=2, $F18*0.5+$G18*0.2, SUM(F18:G18)))), 0),\"Not required\")","v":160227.90000000002},0,0,0,1,null,null,null,null,22637,"Ratoma",null,true]
[{"$f":"IF(INTRO!$E$34<>0,INTRO!$E$34,\"\")","v":"Guinea"},"Faranah","Dabola",189195,{"$f":"IF(INTRO!$E$48=\"\",\"\",ROUND($D19*INTRO!$E$48,0))","v":30271},{"$f":"IF(INTRO!$E$49=\"\",\"\",ROUND($D19*INTRO!$E$49,0))","v":47299},{"$f":"IF(INTRO!$E$50=\"\",\"\",ROUND($D19*INTRO!$E$50,0))","v":104057},1,1,1,1,{"$f":"IF(INTRO!$E$38=\"Endemic\", IF($H19>0, IF($H19=4,\"Unknown\", IF($H19=99,\"Stopped\", $D19)), 0),\"Not required\")","v":189195},{"$f":"IF(INTRO!$E$40=\"Endemic\", IF($I19>0, IF($I19=4,\"Unknown\",IF($I19=99,\"Stopped\", $D19)), 0),\"Not required\")","v":189195},{"$f":"IF(INTRO!$E$42=\"Endemic\", IF(AND($J19>1,$J19<5), IF($J19=4, \"Unknown\", E19+F19), 0),\"Not required\")","v":0},{"$f":"IF(INTRO!$E$44=\"Endemic\", IF(AND($K19>0,$K19<5), IF($K19=4,\"Unknown\", IF($K19=1, $F19*0.33, IF($K19=2, $F19*0.5+$G19*0.2, SUM(F19:G19)))), 0),\"Not required\")","v":15608.67},1,1,0,0,"MDA1 (IVM+ALB)",null,null,null,22610,"Dabola",null,true]
[{"$f":"IF(INTRO!$E$34<>0,INTRO!$E$34,\"\")","v":"Guinea"},"Faranah","Dinguiraye",205209,{"$f":"IF(INTRO!$E$48=\"\",\"\",ROUND($D20*INTRO!$E$48,0))","v":32833},{"$f":"IF(INTRO!$E$49=\"\",\"\",ROUND($D20*INTRO!$E$49,0))","v":51302},{"$f":"IF(INTRO!$E$50=\"\",\"\",ROUND($D20*INTRO!$E$50,0))","v":112865},1,1,1,3,{"$f":"IF(INTRO!$E$38=\"Endemic\", IF($H20>0, IF($H20=4,\"Unknown\", IF($H20=99,\"Stopped\", $D20)), 0),\"Not required\")","v":205209},{"$f":"IF(INTRO!$E$40=\"Endemic\", IF($I20>0, IF($I20=4,\"Unknown\",IF($I20=99,\"Stopped\", $D20)), 0),\"Not required\")","v":205209},{"$f":"IF(INTRO!$E$42=\"Endemic\", IF(AND($J20>1,$J20<5), IF($J20=4, \"Unknown\", E20+F20), 0),\"Not required\")","v":0},{"$f":"IF(INTRO!$E$44=\"Endemic\", IF(AND($K20>0,$K20<5), IF($K20=4,\"Unknown\", IF($K20=1, $F20*0.33, IF($K20=2, $F20*0.5+$G20*0.2, SUM(F20:G20)))), 0),\"Not required\")","v":164167},1,1,0,1,"MDA1 (IVM+ALB)","T2 (PZQ)",null,null,22612,"Dinguiraye",null,true]
[{"$f":"IF(INTRO!$E$34<>0,INTRO!$E$34,\"\")","v":"Guinea"},"Faranah","Faranah",292633,{"$f":"IF(INTRO!$E$48=\"\",\"\",ROUND($D21*INTRO!$E$48,0))","v":46821},{"$f":"IF(INTRO!$E$49=\"\",\"\",ROUND($D21*INTRO!$E$49,0))","v":73158},{"$f":"IF(INTRO!$E$50=\"\",\"\",ROUND($D21*INTRO!$E$50,0))","v":160948},1,1,3,3,{"$f":"IF(INTRO!$E$38=\"Endemic\", IF($H21>0, IF($H21=4,\"Unknown\", IF($H21=99,\"Stopped\", $D21)), 0),\"Not required\")","v":292633},{"$f":"IF(INTRO!$E$40=\"Endemic\", IF($I21>0, IF($I21=4,\"Unknown\",IF($I21=99,\"Stopped\", $D21)), 0),\"Not required\")","v":292633},{"$f":"IF(INTRO!$E$42=\"Endemic\", IF(AND($J21>1,$J21<5), IF($J21=4, \"Unknown\", E21+F21), 0),\"Not required\")","v":119979},{"$f":"IF(INTRO!$E$44=\"Endemic\", IF(AND($K21>0,$K21<5), IF($K21=4,\"Unknown\", IF($K21=1, $F21*0.33, IF($K21=2, $F21*0.5+$G21*0.2, SUM(F21:G21)))), 0),\"Not required\")","v":234106},1,1,2,1,"MDA1 (IVM+ALB)","T2 (PZQ)",null,null,22615,"Faranah",null,true]
[{"$f":"IF(INTRO!$E$34<>0,INTRO!$E$34,\"\")","v":"Guinea"},"Faranah","Kissidougou",296402,{"$f":"IF(INTRO!$E$48=\"\",\"\",ROUND($D22*INTRO!$E$48,0))","v":47424},{"$f":"IF(INTRO!$E$49=\"\",\"\",ROUND($D22*INTRO!$E$49,0))","v":74101},{"$f":"IF(INTRO!$E$50=\"\",\"\",ROUND($D22*INTRO!$E$50,0))","v":163021},1,1,3,3,{"$f":"IF(INTRO!$E$38=\"Endemic\", IF($H22>0, IF($H22=4,\"Unknown\", IF($H22=99,\"Stopped\", $D22)), 0),\"Not required\")","v":296402},{"$f":"IF(INTRO!$E$40=\"Endemic\", IF($I22>0, IF($I22=4,\"Unknown\",IF($I22=99,\"Stopped\", $D22)), 0),\"Not required\")","v":296402},{"$f":"IF(INTRO!$E$42=\"Endemic\", IF(AND($J22>1,$J22<5), IF($J22=4, \"Unknown\", E22+F22), 0),\"Not required\")","v":121525},{"$f":"IF(INTRO!$E$44=\"Endemic\", IF(AND($K22>0,$K22<5), IF($K22=4,\"Unknown\", IF($K22=1, $F22*0.33, IF($K22=2, $F22*0.5+$G22*0.2, SUM(F22:G22)))), 0),\"Not required\")","v":237122},1,1,2,1,"MDA1 (IVM+ALB)","T2 (PZQ)",null,null,22623,"Kissidougou",null,true]
[{"$f":"IF(INTRO!$E$34<>0,INTRO!$E$34,\"\")","v":"Guinea"},"Kankan","Kankan",494416,{"$f":"IF(INTRO!$E$48=\"\",\"\",ROUND($D23*INTRO!$E$48,0))","v":79107},{"$f":"IF(INTRO!$E$49=\"\",\"\",ROUND($D23*INTRO!$E$49,0))","v":123604},{"$f":"IF(INTRO!$E$50=\"\",\"\",ROUND($D23*INTRO!$E$50,0))","v":271929},1,1,2,2,{"$f":"IF(INTRO!$E$38=\"Endemic\", IF($H23>0, IF($H23=4,\"Unknown\", IF($H23=99,\"Stopped\", $D23)), 0),\"Not required\")","v":494416},{"$f":"IF(INTRO!$E$40=\"Endemic\", IF($I23>0, IF($I23=4,\"Unknown\",IF($I23=99,\"Stopped\", $D23)), 0),\"Not required\")","v":494416},{"$f":"IF(INTRO!$E$42=\"Endemic\", IF(AND($J23>1,$J23<5), IF($J23=4, \"Unknown\", E23+F23), 0),\"Not required\")","v":202711},{"$f":"IF(INTRO!$E$44=\"Endemic\", IF(AND($K23>0,$K23<5), IF($K23=4,\"Unknown\", IF($K23=1, $F23*0.33, IF($K23=2, $F23*0.5+$G23*0.2, SUM(F23:G23)))), 0),\"Not required\")","v":116187.8},1,1,1,1,"MDA1 (IVM+ALB)","T2 (PZQ)",null,null,22620,"Kankan",null,true]
[{"$f":"IF(INTRO!$E$34<>0,INTRO!$E$34,\"\")","v":"Guinea"},"Kankan","Kerouane",216780,{"$f":"IF(INTRO!$E$48=\"\",\"\",ROUND($D24*INTRO!$E$48,0))","v":34685},{"$f":"IF(INTRO!$E$49=\"\",\"\",ROUND($D24*INTRO!$E$49,0))","v":54195},{"$f":"IF(INTRO!$E$50=\"\",\"\",ROUND($D24*INTRO!$E$50,0))","v":119229},1,1,2,3,{"$f":"IF(INTRO!$E$38=\"Endemic\", IF($H24>0, IF($H24=4,\"Unknown\", IF($H24=99,\"Stopped\", $D24)), 0),\"Not required\")","v":216780},{"$f":"IF(INTRO!$E$40=\"Endemic\", IF($I24>0, IF($I24=4,\"Unknown\",IF($I24=99,\"Stopped\", $D24)), 0),\"Not required\")","v":216780},{"$f":"IF(INTRO!$E$42=\"Endemic\", IF(AND($J24>1,$J24<5), IF($J24=4, \"Unknown\", E24+F24), 0),\"Not required\")","v":88880},{"$f":"IF(INTRO!$E$44=\"Endemic\", IF(AND($K24>0,$K24<5), IF($K24=4,\"Unknown\", IF($K24=1, $F24*0.33, IF($K24=2, $F24*0.5+$G24*0.2, SUM(F24:G24)))), 0),\"Not required\")","v":173424},1,1,1,1,"MDA1 (IVM+ALB)","T2 (PZQ)",null,null,22621,"Kerouane",null,true]
[{"$f":"IF(INTRO!$E$34<>0,INTRO!$E$34,\"\")","v":"Guinea"},"Kankan","Kouroussa",280580,{"$f":"IF(INTRO!$E$48=\"\",\"\",ROUND($D25*INTRO!$E$48,0))","v":44893},{"$f":"IF(INTRO!$E$49=\"\",\"\",ROUND($D25*INTRO!$E$49,0))","v":70145},{"$f":"IF(INTRO!$E$50=\"\",\"\",ROUND($D25*INTRO!$E$50,0))","v":154319},1,1,2,2,{"$f":"IF(INTRO!$E$38=\"Endemic\", IF($H25>0, IF($H25=4,\"Unknown\", IF($H25=99,\"Stopped\", $D25)), 0),\"Not required\")","v":280580},{"$f":"IF(INTRO!$E$40=\"Endemic\", IF($I25>0, IF($I25=4,\"Unknown\",IF($I25=99,\"Stopped\", $D25)), 0),\"Not required\")","v":280580},{"$f":"IF(INTRO!$E$42=\"Endemic\", IF(AND($J25>1,$J25<5), IF($J25=4, \"Unknown\", E25+F25), 0),\"Not required\")","v":115038},{"$f":"IF(INTRO!$E$44=\"Endemic\", IF(AND($K25>0,$K25<5), IF($K25=4,\"Unknown\", IF($K25=1, $F25*0.33, IF($K25=2, $F25*0.5+$G25*0.2, SUM(F25:G25)))), 0),\"Not required\")","v":65936.3},1,1,1,1,"MDA1 (IVM+ALB)","T2 (PZQ)",null,null,22625,"Kouroussa",null,true]
[{"$f":"IF(INTRO!$E$34<>0,INTRO!$E$34,\"\")","v":"Guinea"},"Kankan","Mandiana",350946,{"$f":"IF(INTRO!$E$48=\"\",\"\",ROUND($D26*INTRO!$E$48,0))","v":56151},{"$f":"IF(INTRO!$E$49=\"\",\"\",ROUND($D26*INTRO!$E$49,0))","v":87737},{"$f":"IF(INTRO!$E$50=\"\",\"\",ROUND($D26*INTRO!$E$50,0))","v":193020},1,1,2,1,{"$f":"IF(INTRO!$E$38=\"Endemic\", IF($H26>0, IF($H26=4,\"Unknown\", IF($H26=99,\"Stopped\", $D26)), 0),\"Not required\")","v":350946},{"$f":"IF(INTRO!$E$40=\"Endemic\", IF($I26>0, IF($I26=4,\"Unknown\",IF($I26=99,\"Stopped\", $D26)), 0),\"Not required\")","v":350946},{"$f":"IF(INTRO!$E$42=\"Endemic\", IF(AND($J26>1,$J26<5), IF($J26=4, \"Unknown\", E26+F26), 0),\"Not required\")","v":143888},{"$f":"IF(INTRO!$E$44=\"Endemic\", IF(AND($K26>0,$K26<5), IF($K26=4,\"Unknown\", IF($K26=1, $F26*0.33, IF($K26=2, $F26*0.5+$G26*0.2, SUM(F26:G26)))), 0),\"Not required\")","v":28953.210000000003},1,1,1,0,"MDA1 (IVM+ALB)",null,null,null,22632,"Mandiana",null,true]
[{"$f":"IF(INTRO!$E$34<>0,INTRO!$E$34,\"\")","v":"Guinea"},"Kankan","Siguiri",717563,{"$f":"IF(INTRO!$E$48=\"\",\"\",ROUND($D27*INTRO!$E$48,0))","v":114810},{"$f":"IF(INTRO!$E$49=\"\",\"\",ROUND($D27*INTRO!$E$49,0))","v":179391},{"$f":"IF(INTRO!$E$50=\"\",\"\",ROUND($D27*INTRO!$E$50,0))","v":394660},1,1,1,2,{"$f":"IF(INTRO!$E$38=\"Endemic\", IF($H27>0, IF($H27=4,\"Unknown\", IF($H27=99,\"Stopped\", $D27)), 0),\"Not required\")","v":717563},{"$f":"IF(INTRO!$E$40=\"Endemic\", IF($I27>0, IF($I27=4,\"Unknown\",IF($I27=99,\"Stopped\", $D27)), 0),\"Not required\")","v":717563},{"$f":"IF(INTRO!$E$42=\"Endemic\", IF(AND($J27>1,$J27<5), IF($J27=4, \"Unknown\", E27+F27), 0),\"Not required\")","v":0},{"$f":"IF(INTRO!$E$44=\"Endemic\", IF(AND($K27>0,$K27<5), IF($K27=4,\"Unknown\", IF($K27=1, $F27*0.33, IF($K27=2, $F27*0.5+$G27*0.2, SUM(F27:G27)))), 0),\"Not required\")","v":168627.5},1,1,0,1,"MDA1 (IVM+ALB)","T2 (PZQ)",null,null,22638,"Siguiri",null,true]
[{"$f":"IF(INTRO!$E$34<>0,INTRO!$E$34,\"\")","v":"Guinea"},"Kindia","Coyah",275599,{"$f":"IF(INTRO!$E$48=\"\",\"\",ROUND($D28*INTRO!$E$48,0))","v":44096},{"$f":"IF(INTRO!$E$49=\"\",\"\",ROUND($D28*INTRO!$E$49,0))","v":68900},{"$f":"IF(INTRO!$E$50=\"\",\"\",ROUND($D28*INTRO!$E$50,0))","v":151579},0,0,1,1,{"$f":"IF(INTRO!$E$38=\"Endemic\", IF($H28>0, IF($H28=4,\"Unknown\", IF($H28=99,\"Stopped\", $D28)), 0),\"Not required\")","v":0},{"$f":"IF(INTRO!$E$40=\"Endemic\", IF($I28>0, IF($I28=4,\"Unknown\",IF($I28=99,\"Stopped\", $D28)), 0),\"Not required\")","v":0},{"$f":"IF(INTRO!$E$42=\"Endemic\", IF(AND($J28>1,$J28<5), IF($J28=4, \"Unknown\", E28+F28), 0),\"Not required\")","v":0},{"$f":"IF(INTRO!$E$44=\"Endemic\", IF(AND($K28>0,$K28<5), IF($K28=4,\"Unknown\", IF($K28=1, $F28*0.33, IF($K28=2, $F28*0.5+$G28*0.2, SUM(F28:G28)))), 0),\"Not required\")","v":22737},0,0,0,0,null,null,null,null,22609,"Coyah",null,true]
[{"$f":"IF(INTRO!$E$34<>0,INTRO!$E$34,\"\")","v":"Guinea"},"Kindia","Dubreka",345252,{"$f":"IF(INTRO!$E$48=\"\",\"\",ROUND($D29*INTRO!$E$48,0))","v":55240},{"$f":"IF(INTRO!$E$49=\"\",\"\",ROUND($D29*INTRO!$E$49,0))","v":86313},{"$f":"IF(INTRO!$E$50=\"\",\"\",ROUND($D29*INTRO!$E$50,0))","v":189889},0,0,1,1,{"$f":"IF(INTRO!$E$38=\"Endemic\", IF($H29>0, IF($H29=4,\"Unknown\", IF($H29=99,\"Stopped\", $D29)), 0),\"Not required\")","v":0},{"$f":"IF(INTRO!$E$40=\"Endemic\", IF($I29>0, IF($I29=4,\"Unknown\",IF($I29=99,\"Stopped\", $D29)), 0),\"Not required\")","v":0},{"$f":"IF(INTRO!$E$42=\"Endemic\", IF(AND($J29>1,$J29<5), IF($J29=4, \"Unknown\", E29+F29), 0),\"Not required\")","v":0},{"$f":"IF(INTRO!$E$44=\"Endemic\", IF(AND($K29>0,$K29<5), IF($K29=4,\"Unknown\", IF($K29=1, $F29*0.33, IF($K29=2, $F29*0.5+$G29*0.2, SUM(F29:G29)))), 0),\"Not required\")","v":28483.29},0,0,0,0,null,null,null,null,22614,"Dubreka",null,true]
[{"$f":"IF(INTRO!$E$34<>0,INTRO!$E$34,\"\")","v":"Guinea"},"Kindia","Forecariah",253749,{"$f":"IF(INTRO!$E$48=\"\",\"\",ROUND($D30*INTRO!$E$48,0))","v":40600},{"$f":"IF(INTRO!$E$49=\"\",\"\",ROUND($D30*INTRO!$E$49,0))","v":63437},{"$f":"IF(INTRO!$E$50=\"\",\"\",ROUND($D30*INTRO!$E$50,0))","v":139562},1,1,3,1,{"$f":"IF(INTRO!$E$38=\"Endemic\", IF($H30>0, IF($H30=4,\"Unknown\", IF($H30=99,\"Stopped\", $D30)), 0),\"Not required\")","v":253749},{"$f":"IF(INTRO!$E$40=\"Endemic\", IF($I30>0, IF($I30=4,\"Unknown\",IF($I30=99,\"Stopped\", $D30)), 0),\"Not required\")","v":253749},{"$f":"IF(INTRO!$E$42=\"Endemic\", IF(AND($J30>1,$J30<5), IF($J30=4, \"Unknown\", E30+F30), 0),\"Not required\")","v":104037},{"$f":"IF(INTRO!$E$44=\"Endemic\", IF(AND($K30>0,$K30<5), IF($K30=4,\"Unknown\", IF($K30=1, $F30*0.33, IF($K30=2, $F30*0.5+$G30*0.2, SUM(F30:G30)))), 0),\"Not required\")","v":20934.210000000003},1,1,2,0,"MDA1 (IVM+ALB)",null,null,null,22616,"Forecariah",null,true]
[{"$f":"IF(INTRO!$E$34<>0,INTRO!$E$34,\"\")","v":"Guinea"},"Kindia","Kindia",459170,{"$f":"IF(INTRO!$E$48=\"\",\"\",ROUND($D31*INTRO!$E$48,0))","v":73467},{"$f":"IF(INTRO!$E$49=\"\",\"\",ROUND($D31*INTRO!$E$49,0))","v":114793},{"$f":"IF(INTRO!$E$50=\"\",\"\",ROUND($D31*INTRO!$E$50,0))","v":252544},1,1,2,3,{"$f":"IF(INTRO!$E$38=\"Endemic\", IF($H31>0, IF($H31=4,\"Unknown\", IF($H31=99,\"Stopped\", $D31)), 0),\"Not required\")","v":459170},{"$f":"IF(INTRO!$E$40=\"Endemic\", IF($I31>0, IF($I31=4,\"Unknown\",IF($I31=99,\"Stopped\", $D31)), 0),\"Not required\")","v":459170},{"$f":"IF(INTRO!$E$42=\"Endemic\", IF(AND($J31>1,$J31<5), IF($J31=4, \"Unknown\", E31+F31), 0),\"Not required\")","v":188260},{"$f":"IF(INTRO!$E$44=\"Endemic\", IF(AND($K31>0,$K31<5), IF($K31=4,\"Unknown\", IF($K31=1, $F31*0.33, IF($K31=2, $F31*0.5+$G31*0.2, SUM(F31:G31)))), 0),\"Not required\")","v":367337},1,1,1,1,"MDA1 (IVM+ALB)",null,null,null,22622,"Kindia",null,true]
[{"$f":"IF(INTRO!$E$34<>0,INTRO!$E$34,\"\")","v":"Guinea"},"Kindia","Telimele",297061,{"$f":"IF(INTRO!$E$48=\"\",\"\",ROUND($D32*INTRO!$E$48,0))","v":47530},{"$f":"IF(INTRO!$E$49=\"\",\"\",ROUND($D32*INTRO!$E$49,0))","v":74265},{"$f":"IF(INTRO!$E$50=\"\",\"\",ROUND($D32*INTRO!$E$50,0))","v":163384},1,0,2,1,{"$f":"IF(INTRO!$E$38=\"Endemic\", IF($H32>0, IF($H32=4,\"Unknown\", IF($H32=99,\"Stopped\", $D32)), 0),\"Not required\")","v":297061},{"$f":"IF(INTRO!$E$40=\"Endemic\", IF($I32>0, IF($I32=4,\"Unknown\",IF($I32=99,\"Stopped\", $D32)), 0),\"Not required\")","v":0},{"$f":"IF(INTRO!$E$42=\"Endemic\", IF(AND($J32>1,$J32<5), IF($J32=4, \"Unknown\", E32+F32), 0),\"Not required\")","v":121795},{"$f":"IF(INTRO!$E$44=\"Endemic\", IF(AND($K32>0,$K32<5), IF($K32=4,\"Unknown\", IF($K32=1, $F32*0.33, IF($K32=2, $F32*0.5+$G32*0.2, SUM(F32:G32)))), 0),\"Not required\")","v":24507.45},1,0,1,0,"MDA1 (IVM+ALB)",null,null,null,22639,"Telimélé",null,false]
[{"$f":"IF(INTRO!$E$34<>0,INTRO!$E$34,\"\")","v":"Guinea"},"Labé","Koubia",104626,{"$f":"IF(INTRO!$E$48=\"\",\"\",ROUND($D33*INTRO!$E$48,0))","v":16740},{"$f":"IF(INTRO!$E$49=\"\",\"\",ROUND($D33*INTRO!$E$49,0))","v":26157},{"$f":"IF(INTRO!$E$50=\"\",\"\",ROUND($D33*INTRO!$E$50,0))","v":57544},0,1,1,2,{"$f":"IF(INTRO!$E$38=\"Endemic\", IF($H33>0, IF($H33=4,\"Unknown\", IF($H33=99,\"Stopped\", $D33)), 0),\"Not required\")","v":0},{"$f":"IF(INTRO!$E$40=\"Endemic\", IF($I33>0, IF($I33=4,\"Unknown\",IF($I33=99,\"Stopped\", $D33)), 0),\"Not required\")","v":104626},{"$f":"IF(INTRO!$E$42=\"Endemic\", IF(AND($J33>1,$J33<5), IF($J33=4, \"Unknown\", E33+F33), 0),\"Not required\")","v":0},{"$f":"IF(INTRO!$E$44=\"Endemic\", IF(AND($K33>0,$K33<5), IF($K33=4,\"Unknown\", IF($K33=1, $F33*0.33, IF($K33=2, $F33*0.5+$G33*0.2, SUM(F33:G33)))), 0),\"Not required\")","v":24587.300000000003},0,1,0,1,"MDA3 (IVM)","T2 (PZQ)",null,null,22624,"Koubia",null,true]
[{"$f":"IF(INTRO!$E$34<>0,INTRO!$E$34,\"\")","v":"Guinea"},"Labé","Labé",333126,{"$f":"IF(INTRO!$E$48=\"\",\"\",ROUND($D34*INTRO!$E$48,0))","v":53300},{"$f":"IF(INTRO!$E$49=\"\",\"\",ROUND($D34*INTRO!$E$49,0))","v":83282},{"$f":"IF(INTRO!$E$50=\"\",\"\",ROUND($D34*INTRO!$E$50,0))","v":183219},0,0,1,1,{"$f":"IF(INTRO!$E$38=\"Endemic\", IF($H34>0, IF($H34=4,\"Unknown\", IF($H34=99,\"Stopped\", $D34)), 0),\"Not required\")","v":0},{"$f":"IF(INTRO!$E$40=\"Endemic\", IF($I34>0, IF($I34=4,\"Unknown\",IF($I34=99,\"Stopped\", $D34)), 0),\"Not required\")","v":0},{"$f":"IF(INTRO!$E$42=\"Endemic\", IF(AND($J34>1,$J34<5), IF($J34=4, \"Unknown\", E34+F34), 0),\"Not required\")","v":0},{"$f":"IF(INTRO!$E$44=\"Endemic\", IF(AND($K34>0,$K34<5), IF($K34=4,\"Unknown\", IF($K34=1, $F34*0.33, IF($K34=2, $F34*0.5+$G34*0.2, SUM(F34:G34)))), 0),\"Not required\")","v":27483.06},0,0,0,0,null,null,null,null,22626,"Labé",null,true]
[{"$f":"IF(INTRO!$E$34<>0,INTRO!$E$34,\"\")","v":"Guinea"},"Labé","Lelouma",170323,{"$f":"IF(INTRO!$E$48=\"\",\"\",ROUND($D35*INTRO!$E$48,0))","v":27252},{"$f":"IF(INTRO!$E$49=\"\",\"\",ROUND($D35*INTRO!$E$49,0))","v":42581},{"$f":"IF(INTRO!$E$50=\"\",\"\",ROUND($D35*INTRO!$E$50,0))","v":93678},1,1,3,3,{"$f":"IF(INTRO!$E$38=\"Endemic\", IF($H35>0, IF($H35=4,\"Unknown\", IF($H35=99,\"Stopped\", $D35)), 0),\"Not required\")","v":170323},{"$f":"IF(INTRO!$E$40=\"Endemic\", IF($I35>0, IF($I35=4,\"Unknown\",IF($I35=99,\"Stopped\", $D35)), 0),\"Not required\")","v":170323},{"$f":"IF(INTRO!$E$42=\"Endemic\", IF(AND($J35>1,$J35<5), IF($J35=4, \"Unknown\", E35+F35), 0),\"Not required\")","v":69833},{"$f":"IF(INTRO!$E$44=\"Endemic\", IF(AND($K35>0,$K35<5), IF($K35=4,\"Unknown\", IF($K35=1, $F35*0.33, IF($K35=2, $F35*0.5+$G35*0.2, SUM(F35:G35)))), 0),\"Not required\")","v":136259},1,1,2,1,"MDA1 (IVM+ALB)","T2 (PZQ)",null,null,22627,"Lelouma",null,true]
[{"$f":"IF(INTRO!$E$34<>0,INTRO!$E$34,\"\")","v":"Guinea"},"Labé","Mali",300812,{"$f":"IF(INTRO!$E$48=\"\",\"\",ROUND($D36*INTRO!$E$48,0))","v":48130},{"$f":"IF(INTRO!$E$49=\"\",\"\",ROUND($D36*INTRO!$E$49,0))","v":75203},{"$f":"IF(INTRO!$E$50=\"\",\"\",ROUND($D36*INTRO!$E$50,0))","v":165447},1,1,1,1,{"$f":"IF(INTRO!$E$38=\"Endemic\", IF($H36>0, IF($H36=4,\"Unknown\", IF($H36=99,\"Stopped\", $D36)), 0),\"Not required\")","v":300812},{"$f":"IF(INTRO!$E$40=\"Endemic\", IF($I36>0, IF($I36=4,\"Unknown\",IF($I36=99,\"Stopped\", $D36)), 0),\"Not required\")","v":300812},{"$f":"IF(INTRO!$E$42=\"Endemic\", IF(AND($J36>1,$J36<5), IF($J36=4, \"Unknown\", E36+F36), 0),\"Not required\")","v":0},{"$f":"IF(INTRO!$E$44=\"Endemic\", IF(AND($K36>0,$K36<5), IF($K36=4,\"Unknown\", IF($K36=1, $F36*0.33, IF($K36=2, $F36*0.5+$G36*0.2, SUM(F36:G36)))), 0),\"Not required\")","v":24816.99},1,1,0,0,"MDA1 (IVM+ALB)",null,null,null,22630,"Mali",null,true]
[{"$f":"IF(INTRO!$E$34<>0,INTRO!$E$34,\"\")","v":"Guinea"},"Labé","Tougué",129808,{"$f":"IF(INTRO!$E$48=\"\",\"\",ROUND($D37*INTRO!$E$48,0))","v":20769},{"$f":"IF(INTRO!$E$49=\"\",\"\",ROUND($D37*INTRO!$E$49,0))","v":32452},{"$f":"IF(INTRO!$E$50=\"\",\"\",ROUND($D37*INTRO!$E$50,0))","v":71394},1,1,1,0,{"$f":"IF(INTRO!$E$38=\"Endemic\", IF($H37>0, IF($H37=4,\"Unknown\", IF($H37=99,\"Stopped\", $D37)), 0),\"Not required\")","v":129808},{"$f":"IF(INTRO!$E$40=\"Endemic\", IF($I37>0, IF($I37=4,\"Unknown\",IF($I37=99,\"Stopped\", $D37)), 0),\"Not required\")","v":129808},{"$f":"IF(INTRO!$E$42=\"Endemic\", IF(AND($J37>1,$J37<5), IF($J37=4, \"Unknown\", E37+F37), 0),\"Not required\")","v":0},{"$f":"IF(INTRO!$E$44=\"Endemic\", IF(AND($K37>0,$K37<5), IF($K37=4,\"Unknown\", IF($K37=1, $F37*0.33, IF($K37=2, $F37*0.5+$G37*0.2, SUM(F37:G37)))), 0),\"Not required\")","v":0},1,1,0,0,"MDA1 (IVM+ALB)",null,null,null,22640,"Tougué",null,true]
[{"$f":"IF(INTRO!$E$34<>0,INTRO!$E$34,\"\")","v":"Guinea"},"Mamou","Dalaba",139623,{"$f":"IF(INTRO!$E$48=\"\",\"\",ROUND($D38*INTRO!$E$48,0))","v":22340},{"$f":"IF(INTRO!$E$49=\"\",\"\",ROUND($D38*INTRO!$E$49,0))","v":34906},{"$f":"IF(INTRO!$E$50=\"\",\"\",ROUND($D38*INTRO!$E$50,0))","v":76793},1,0,2,0,{"$f":"IF(INTRO!$E$38=\"Endemic\", IF($H38>0, IF($H38=4,\"Unknown\", IF($H38=99,\"Stopped\", $D38)), 0),\"Not required\")","v":139623},{"$f":"IF(INTRO!$E$40=\"Endemic\", IF($I38>0, IF($I38=4,\"Unknown\",IF($I38=99,\"Stopped\", $D38)), 0),\"Not required\")","v":0},{"$f":"IF(INTRO!$E$42=\"Endemic\", IF(AND($J38>1,$J38<5), IF($J38=4, \"Unknown\", E38+F38), 0),\"Not required\")","v":57246},{"$f":"IF(INTRO!$E$44=\"Endemic\", IF(AND($K38>0,$K38<5), IF($K38=4,\"Unknown\", IF($K38=1, $F38*0.33, IF($K38=2, $F38*0.5+$G38*0.2, SUM(F38:G38)))), 0),\"Not required\")","v":0},1,0,1,0,"MDA1 (IVM+ALB)",null,null,null,22611,"Dalaba",null,true]
[{"$f":"IF(INTRO!$E$34<>0,INTRO!$E$34,\"\")","v":"Guinea"},"Mamou","Mamou",333171,{"$f":"IF(INTRO!$E$48=\"\",\"\",ROUND($D39*INTRO!$E$48,0))","v":53307},{"$f":"IF(INTRO!$E$49=\"\",\"\",ROUND($D39*INTRO!$E$49,0))","v":83293},{"$f":"IF(INTRO!$E$50=\"\",\"\",ROUND($D39*INTRO!$E$50,0))","v":183244},1,1,1,2,{"$f":"IF(INTRO!$E$38=\"Endemic\", IF($H39>0, IF($H39=4,\"Unknown\", IF($H39=99,\"Stopped\", $D39)), 0),\"Not required\")","v":333171},{"$f":"IF(INTRO!$E$40=\"Endemic\", IF($I39>0, IF($I39=4,\"Unknown\",IF($I39=99,\"Stopped\", $D39)), 0),\"Not required\")","v":333171},{"$f":"IF(INTRO!$E$42=\"Endemic\", IF(AND($J39>1,$J39<5), IF($J39=4, \"Unknown\", E39+F39), 0),\"Not required\")","v":0},{"$f":"IF(INTRO!$E$44=\"Endemic\", IF(AND($K39>0,$K39<5), IF($K39=4,\"Unknown\", IF($K39=1, $F39*0.33, IF($K39=2, $F39*0.5+$G39*0.2, SUM(F39:G39)))), 0),\"Not required\")","v":78295.3},1,1,0,1,"MDA1 (IVM+ALB)","T2 (PZQ)",null,null,22631,"Mamou",null,true]
[{"$f":"IF(INTRO!$E$34<>0,INTRO!$E$34,\"\")","v":"Guinea"},"Mamou","Pita",290920,{"$f":"IF(INTRO!$E$48=\"\",\"\",ROUND($D40*INTRO!$E$48,0))","v":46547},{"$f":"IF(INTRO!$E$49=\"\",\"\",ROUND($D40*INTRO!$E$49,0))","v":72730},{"$f":"IF(INTRO!$E$50=\"\",\"\",ROUND($D40*INTRO!$E$50,0))","v":160006},1,0,2,0,{"$f":"IF(INTRO!$E$38=\"Endemic\", IF($H40>0, IF($H40=4,\"Unknown\", IF($H40=99,\"Stopped\", $D40)), 0),\"Not required\")","v":290920},{"$f":"IF(INTRO!$E$40=\"Endemic\", IF($I40>0, IF($I40=4,\"Unknown\",IF($I40=99,\"Stopped\", $D40)), 0),\"Not required\")","v":0},{"$f":"IF(INTRO!$E$42=\"Endemic\", IF(AND($J40>1,$J40<5), IF($J40=4, \"Unknown\", E40+F40), 0),\"Not required\")","v":119277},{"$f":"IF(INTRO!$E$44=\"Endemic\", IF(AND($K40>0,$K40<5), IF($K40=4,\"Unknown\", IF($K40=1, $F40*0.33, IF($K40=2, $F40*0.5+$G40*0.2, SUM(F40:G40)))), 0),\"Not required\")","v":0},1,0,1,0,"MDA1 (IVM+ALB)",null,null,null,22636,"Pita",null,true]
[{"$f":"IF(INTRO!$E$34<>0,INTRO!$E$34,\"\")","v":"Guinea"},"N'Zérékoré","Beyla",340587,{"$f":"IF(INTRO!$E$48=\"\",\"\",ROUND($D41*INTRO!$E$48,0))","v":54494},{"$f":"IF(INTRO!$E$49=\"\",\"\",ROUND($D41*INTRO!$E$49,0))","v":85147},{"$f":"IF(INTRO!$E$50=\"\",\"\",ROUND($D41*INTRO!$E$50,0))","v":187323},1,1,3,3,{"$f":"IF(INTRO!$E$38=\"Endemic\", IF($H41>0, IF($H41=4,\"Unknown\", IF($H41=99,\"Stopped\", $D41)), 0),\"Not required\")","v":340587},{"$f":"IF(INTRO!$E$40=\"Endemic\", IF($I41>0, IF($I41=4,\"Unknown\",IF($I41=99,\"Stopped\", $D41)), 0),\"Not required\")","v":340587},{"$f":"IF(INTRO!$E$42=\"Endemic\", IF(AND($J41>1,$J41<5), IF($J41=4, \"Unknown\", E41+F41), 0),\"Not required\")","v":139641},{"$f":"IF(INTRO!$E$44=\"Endemic\", IF(AND($K41>0,$K41<5), IF($K41=4,\"Unknown\", IF($K41=1, $F41*0.33, IF($K41=2, $F41*0.5+$G41*0.2, SUM(F41:G41)))), 0),\"Not required\")","v":272470},1,1,2,1,"MDA1 (IVM+ALB)","T2 (PZQ)",null,null,22604,"Beyla",null,true]
[{"$f":"IF(INTRO!$E$34<>0,INTRO!$E$34,\"\")","v":"Guinea"},"N'Zérékoré","Gueckedou",303539,{"$f":"IF(INTRO!$E$48=\"\",\"\",ROUND($D42*INTRO!$E$48,0))","v":48566},{"$f":"IF(INTRO!$E$49=\"\",\"\",ROUND($D42*INTRO!$E$49,0))","v":75885},{"$f":"IF(INTRO!$E$50=\"\",\"\",ROUND($D42*INTRO!$E$50,0))","v":166946},1,1,3,3,{"$f":"IF(INTRO!$E$38=\"Endemic\", IF($H42>0, IF($H42=4,\"Unknown\", IF($H42=99,\"Stopped\", $D42)), 0),\"Not required\")","v":303539},{"$f":"IF(INTRO!$E$40=\"Endemic\", IF($I42>0, IF($I42=4,\"Unknown\",IF($I42=99,\"Stopped\", $D42)), 0),\"Not required\")","v":303539},{"$f":"IF(INTRO!$E$42=\"Endemic\", IF(AND($J42>1,$J42<5), IF($J42=4, \"Unknown\", E42+F42), 0),\"Not required\")","v":124451},{"$f":"IF(INTRO!$E$44=\"Endemic\", IF(AND($K42>0,$K42<5), IF($K42=4,\"Unknown\", IF($K42=1, $F42*0.33, IF($K42=2, $F42*0.5+$G42*0.2, SUM(F42:G42)))), 0),\"Not required\")","v":242831},1,1,2,1,"MDA1 (IVM+ALB)","T2 (PZQ)",null,null,22618,"Guéckédou",null,false]
[{"$f":"IF(INTRO!$E$34<>0,INTRO!$E$34,\"\")","v":"Guinea"},"N'Zérékoré","Lola",179193,{"$f":"IF(INTRO!$E$48=\"\",\"\",ROUND($D43*INTRO!$E$48,0))","v":28671},{"$f":"IF(INTRO!$E$49=\"\",\"\",ROUND($D43*INTRO!$E$49,0))","v":44798},{"$f":"IF(INTRO!$E$50=\"\",\"\",ROUND($D43*INTRO!$E$50,0))","v":98556},0,1,2,3,{"$f":"IF(INTRO!$E$38=\"Endemic\", IF($H43>0, IF($H43=4,\"Unknown\", IF($H43=99,\"Stopped\", $D43)), 0),\"Not required\")","v":0},{"$f":"IF(INTRO!$E$40=\"Endemic\", IF($I43>0, IF($I43=4,\"Unknown\",IF($I43=99,\"Stopped\", $D43)), 0),\"Not required\")","v":179193},{"$f":"IF(INTRO!$E$42=\"Endemic\", IF(AND($J43>1,$J43<5), IF($J43=4, \"Unknown\", E43+F43), 0),\"Not required\")","v":73469},{"$f":"IF(INTRO!$E$44=\"Endemic\", IF(AND($K43>0,$K43<5), IF($K43=4,\"Unknown\", IF($K43=1, $F43*0.33, IF($K43=2, $F43*0.5+$G43*0.2, SUM(F43:G43)))), 0),\"Not required\")","v":143354},0,1,1,1,"MDA3 (IVM)",null,null,null,22628,"Lola",null,true]
[{"$f":"IF(INTRO!$E$34<>0,INTRO!$E$34,\"\")","v":"Guinea"},"N'Zérékoré","Macenta",290843,{"$f":"IF(INTRO!$E$48=\"\",\"\",ROUND($D44*INTRO!$E$48,0))","v":46535},{"$f":"IF(INTRO!$E$49=\"\",\"\",ROUND($D44*INTRO!$E$49,0))","v":72711},{"$f":"IF(INTRO!$E$50=\"\",\"\",ROUND($D44*INTRO!$E$50,0))","v":159964},1,1,3,2,{"$f":"IF(INTRO!$E$38=\"Endemic\", IF($H44>0, IF($H44=4,\"Unknown\", IF($H44=99,\"Stopped\", $D44)), 0),\"Not required\")","v":290843},{"$f":"IF(INTRO!$E$40=\"Endemic\", IF($I44>0, IF($I44=4,\"Unknown\",IF($I44=99,\"Stopped\", $D44)), 0),\"Not required\")","v":290843},{"$f":"IF(INTRO!$E$42=\"Endemic\", IF(AND($J44>1,$J44<5), IF($J44=4, \"Unknown\", E44+F44), 0),\"Not required\")","v":119246},{"$f":"IF(INTRO!$E$44=\"Endemic\", IF(AND($K44>0,$K44<5), IF($K44=4,\"Unknown\", IF($K44=1, $F44*0.33, IF($K44=2, $F44*0.5+$G44*0.2, SUM(F44:G44)))), 0),\"Not required\")","v":68348.3},1,1,2,1,"MDA1 (IVM+ALB)","T2 (PZQ)",null,null,22629,"Macenta",null,true]
[{"$f":"IF(INTRO!$E$34<>0,INTRO!$E$34,\"\")","v":"Guinea"},"N'Zérékoré","N'Zérékoré",414607,{"$f":"IF(INTRO!$E$48=\"\",\"\",ROUND($D45*INTRO!$E$48,0))","v":66337},{"$f":"IF(INTRO!$E$49=\"\",\"\",ROUND($D45*INTRO!$E$49,0))","v":103652},{"$f":"IF(INTRO!$E$50=\"\",\"\",ROUND($D45*INTRO!$E$50,0))","v":228034},0,1,3,3,{"$f":"IF(INTRO!$E$38=\"Endemic\", IF($H45>0, IF($H45=4,\"Unknown\", IF($H45=99,\"Stopped\", $D45)), 0),\"Not required\")","v":0},{"$f":"IF(INTRO!$E$40=\"Endemic\", IF($I45>0, IF($I45=4,\"Unknown\",IF($I45=99,\"Stopped\", $D45)), 0),\"Not required\")","v":414607},{"$f":"IF(INTRO!$E$42=\"Endemic\", IF(AND($J45>1,$J45<5), IF($J45=4, \"Unknown\", E45+F45), 0),\"Not required\")","v":169989},{"$f":"IF(INTRO!$E$44=\"Endemic\", IF(AND($K45>0,$K45<5), IF($K45=4,\"Unknown\", IF($K45=1, $F45*0.33, IF($K45=2, $F45*0.5+$G45*0.2, SUM(F45:G45)))), 0),\"Not required\")","v":331686},0,1,2,1,"MDA3 (IVM)",null,null,null,22635,"N'Zérékoré",null,true]
[{"$f":"IF(INTRO!$E$34<>0,INTRO!$E$34,\"\")","v":"Guinea"},"N'Zérékoré","Yomou",119459,{"$f":"IF(INTRO!$E$48=\"\",\"\",ROUND($D46*INTRO!$E$48,0))","v":19113},{"$f":"IF(INTRO!$E$49=\"\",\"\",ROUND($D46*INTRO!$E$49,0))","v":29865},{"$f":"IF(INTRO!$E$50=\"\",\"\",ROUND($D46*INTRO!$E$50,0))","v":65702},0,1,1,3,{"$f":"IF(INTRO!$E$38=\"Endemic\", IF($H46>0, IF($H46=4,\"Unknown\", IF($H46=99,\"Stopped\", $D46)), 0),\"Not required\")","v":0},{"$f":"IF(INTRO!$E$40=\"Endemic\", IF($I46>0, IF($I46=4,\"Unknown\",IF($I46=99,\"Stopped\", $D46)), 0),\"Not required\")","v":119459},{"$f":"IF(INTRO!$E$42=\"Endemic\", IF(AND($J46>1,$J46<5), IF($J46=4, \"Unknown\", E46+F46), 0),\"Not required\")","v":0},{"$f":"IF(INTRO!$E$44=\"Endemic\", IF(AND($K46>0,$K46<5), IF($K46=4,\"Unknown\", IF($K46=1, $F46*0.33, IF($K46=2, $F46*0.5+$G46*0.2, SUM(F46:G46)))), 0),\"Not required\")","v":95567},0,1,0,1,"MDA3 (IVM)",null,null,null,22641,"Yomou",null,true]

{"sheet":"MDA1","index":2,"n_rows":46,"n_cols":17,"rows_kept":46,"cut":false,"hidden":false,"merged":[[5,13,5,16],[3,0,3,2],[5,0,5,2],[5,5,5,8],[5,9,5,12],[5,3,6,3],[5,4,6,4]]}
["MDA 1 - Ivermectin (IVM) and Albendazole (ALB)"]
["Administrative structure, population requiring PC by age group, population treated by age group and coverage"]
[]
["TOTAL",null,null,null,null,null,{"$f":"SUM(G$9:G$1000)","v":1790407},{"$f":"SUM(H$9:H$1000)","v":3938892},{"$f":"SUM(I$9:I$1000)","v":5729299},null,{"$f":"SUM(K$9:K$1000)","v":2497549},{"$f":"SUM(L$9:L$1000)","v":3138417},{"$f":"SUM(M$9:M$1000)","v":5635966},null,{"$f":"IF(G4<>0, IF(K4/G4*100=0, \"-\", K4/G4*100), \" \")","v":139.49615925317539},{"$f":"IF(H4<>0, IF(L4/H4*100=0, \"-\", L4/H4*100), \" \")","v":79.677660621311787},{"$f":"IF(I4<>0, IF(M4/I4*100=0, \"-\", M4/I4*100), \" \")","v":98.370952537125405}]
[]
[null,null,null,"PC implemented","Date","Population targeted for MDA 1",null,null,null,"Population treated",null,null,null,"Programme coverage (%)"]
["Country","Province/State","District",null,null,"PreSAC","SAC","Adults","Total","PreSAC","SAC","Adults","Total","PreSAC","SAC","Adults","Total"]
[]
[{"$f":"IF(COUNTRY_INFO!A9=0,\" \",COUNTRY_INFO!A9)","v":"Guinea"},{"$f":"IF(COUNTRY_INFO!B9=0,\" \",COUNTRY_INFO!B9)","v":"Boké"},{"$f":"IF(COUNTRY_INFO!C9=0,\" \",COUNTRY_INFO!C9)","v":"Boffa"},{"$f":"IF(COUNTRY_INFO!$T$9:$T$1000=\"MDA1 (IVM+ALB)\", COUNTRY_INFO!$T$9:$T$1000, \" \")","v":" "},null,null,null,null,{"$f":"SUM(F9:H9)","v":0},null,null,null,{"$f":"SUM(J9:L9)","v":0},null,{"$f":"IF(G9<>0, IF(K9/G9*100=0, \"-\", K9/G9*100), \" \")","v":" "},{"$f":"IF(H9<>0, IF(L9/H9*100=0, \"-\", L9/H9*100), \" \")","v":" "}," "]
[{"$f":"IF(COUNTRY_INFO!A10=0,\" \",COUNTRY_INFO!A10)","v":"Guinea"},{"$f":"IF(COUNTRY_INFO!B10=0,\" \",COUNTRY_INFO!B10)","v":"Boké"},{"$f":"IF(COUNTRY_INFO!C10=0,\" \",COUNTRY_INFO!C10)","v":"Boke"},{"$f":"IF(COUNTRY_INFO!$T$9:$T$1000=\"MDA1 (IVM+ALB)\", COUNTRY_INFO!$T$9:$T$1000, \" \")","v":"MDA1 (IVM+ALB)"},"Mai",null,117577,258669,{"$f":"SUM(F10:H10)","v":376246},null,163390,211761,{"$f":"SUM(J10:L10)","v":375151},null,{"$f":"IF(G10<>0, IF(K10/G10*100=0, \"-\", K10/G10*100), \" \")","v":138.96425321278824},{"$f":"IF(H10<>0, IF(L10/H10*100=0, \"-\", L10/H10*100), \" \")","v":81.86562750078285},{"$f":"IF(I10<>0, IF(M10/I10*100=0, \"-\", M10/I10*100), \" \")","v":99.708967005629304}]
[{"$f":"IF(COUNTRY_INFO!A11=0,\" \",COUNTRY_INFO!A11)","v":"Guinea"},{"$f":"IF(COUNTRY_INFO!B11=0,\" \",COUNTRY_INFO!B11)","v":"Boké"},{"$f":"IF(COUNTRY_INFO!C11=0,\" \",COUNTRY_INFO!C11)","v":"Fria"},{"$f":"IF(COUNTRY_INFO!$T$9:$T$1000=\"MDA1 (IVM+ALB)\", COUNTRY_INFO!$T$9:$T$1000, \" \")","v":" "},null,null,null,null,0,null,null,null,0,null," "," "," "]
[{"$f":"IF(COUNTRY_INFO!A12=0,\" \",COUNTRY_INFO!A12)","v":"Guinea"},{"$f":"IF(COUNTRY_INFO!B12=0,\" \",COUNTRY_INFO!B12)","v":"Boké"},{"$f":"IF(COUNTRY_INFO!C12=0,\" \",COUNTRY_INFO!C12)","v":"Gaoual"},{"$f":"IF(COUNTRY_INFO!$T$9:$T$1000=\"MDA1 (IVM+ALB)\", COUNTRY_INFO!$T$9:$T$1000, \" \")","v":"MDA1 (IVM+ALB)"},"Mai",null,50556,111224,161780,null,68222,96828,165050,null,134.94342906875545,87.056750341652872,102.02126344418345]
[{"$f":"IF(COUNTRY_INFO!A13=0,\" \",COUNTRY_INFO!A13)","v":"Guinea"},{"$f":"IF(COUNTRY_INFO!B13=0,\" \",COUNTRY_INFO!B13)","v":"Boké"},{"$f":"IF(COUNTRY_INFO!C13=0,\" \",COUNTRY_INFO!C13)","v":"Koundara"},{"$f":"IF(COUNTRY_INFO!$T$9:$T$1000=\"MDA1 (IVM+ALB)\", COUNTRY_INFO!$T$9:$T$1000, \" \")","v":"MDA1 (IVM+ALB)"},"Mai",null,33939,74666,108605,null,47584,49661,97245,null,140.20448451633814,66.510861704122362,89.540076423737403]
[{"$f":"IF(COUNTRY_INFO!A14=0,\" \",COUNTRY_INFO!A14)","v":"Guinea"},{"$f":"IF(COUNTRY_INFO!B14=0,\" \",COUNTRY_INFO!B14)","v":"Conakry"},{"$f":"IF(COUNTRY_INFO!C14=0,\" \",COUNTRY_INFO!C14)","v":"Dixinn"},{"$f":"IF(COUNTRY_INFO!$T$9:$T$1000=\"MDA1 (IVM+ALB)\", COUNTRY_INFO!$T$9:$T$1000, \" \")","v":" "},null,null,null,null,0,null,null,null,0,null," "," "," "]
[{"$f":"IF(COUNTRY_INFO!A15=0,\" \",COUNTRY_INFO!A15)","v":"Guinea"},{"$f":"IF(COUNTRY_INFO!B15=0,\" \",COUNTRY_INFO!B15)","v":"Conakry"},{"$f":"IF(COUNTRY_INFO!C15=0,\" \",COUNTRY_INFO!C15)","v":"Kaloum"},{"$f":"IF(COUNTRY_INFO!$T$9:$T$1000=\"MDA1 (IVM+ALB)\", COUNTRY_INFO!$T$9:$T$1000, \" \")","v":" "},null,null,null,null,0,null,null,null,0,null," "," "," "]
[{"$f":"IF(COUNTRY_INFO!A16=0,\" \",COUNTRY_INFO!A16)","v":"Guinea"},{"$f":"IF(COUNTRY_INFO!B16=0,\" \",COUNTRY_INFO!B16)","v":"Conakry"},{"$f":"IF(COUNTRY_INFO!C16=0,\" \",COUNTRY_INFO!C16)","v":"Matam"},{"$f":"IF(COUNTRY_INFO!$T$9:$T$1000=\"MDA1 (IVM+ALB)\", COUNTRY_INFO!$T$9:$T$1000, \" \")","v":" "},null,null,null,null,0,null,null,null,0,null," "," "," "]
[{"$f":"IF(COUNTRY_INFO!A17=0,\" \",COUNTRY_INFO!A17)","v":"Guinea"},{"$f":"IF(COUNTRY_INFO!B17=0,\" \",COUNTRY_INFO!B17)","v":"Conakry"},{"$f":"IF(COUNTRY_INFO!C17=0,\" \",COUNTRY_INFO!C17)","v":"Matoto"},{"$f":"IF(COUNTRY_INFO!$T$9:$T$1000=\"MDA1 (IVM+ALB)\", COUNTRY_INFO!$T$9:$T$1000, \" \")","v":" "},null,null,null,null,0,null,null,null,0,null," "," "," "]
[{"$f":"IF(COUNTRY_INFO!A18=0,\" \",COUNTRY_INFO!A18)","v":"Guinea"},{"$f":"IF(COUNTRY_INFO!B18=0,\" \",COUNTRY_INFO!B18)","v":"Conakry"},{"$f":"IF(COUNTRY_INFO!C18=0,\" \",COUNTRY_INFO!C18)","v":"Ratoma"},{"$f":"IF(COUNTRY_INFO!$T$9:$T$1000=\"MDA1 (IVM+ALB)\", COUNTRY_INFO!$T$9:$T$1000, \" \")","v":" "},null,null,null,null,0,null,null,null,0,null," "," "," "]
[{"$f":"IF(COUNTRY_INFO!A19=0,\" \",COUNTRY_INFO!A19)","v":"Guinea"},{"$f":"IF(COUNTRY_INFO!B19=0,\" \",COUNTRY_INFO!B19)","v":"Faranah"},{"$f":"IF(COUNTRY_INFO!C19=0,\" \",COUNTRY_INFO!C19)","v":"Dabola"},{"$f":"IF(COUNTRY_INFO!$T$9:$T$1000=\"MDA1 (IVM+ALB)\", COUNTRY_INFO!$T$9:$T$1000, \" \")","v":"MDA1 (IVM+ALB)"},"Mai",null,47299,104057,151356,null,79401,67936,147337,null,167.87035666716,65.287294463611289,97.344670842252697]
[{"$f":"IF(COUNTRY_INFO!A20=0,\" \",COUNTRY_INFO!A20)","v":"Guinea"},{"$f":"IF(COUNTRY_INFO!B20=0,\" \",COUNTRY_INFO!B20)","v":"Faranah"},{"$f":"IF(COUNTRY_INFO!C20=0,\" \",COUNTRY_INFO!C20)","v":"Dinguiraye"},{"$f":"IF(COUNTRY_INFO!$T$9:$T$1000=\"MDA1 (IVM+ALB)\", COUNTRY_INFO!$T$9:$T$1000, \" \")","v":"MDA1 (IVM+ALB)"},"Mai",null,51302,112865,164167,null,70227,89718,159945,null,136.88940002339089,79.491427811987762,97.428228572124738]
[{"$f":"IF(COUNTRY_INFO!A21=0,\" \",COUNTRY_INFO!A21)","v":"Guinea"},{"$f":"IF(COUNTRY_INFO!B21=0,\" \",COUNTRY_INFO!B21)","v":"Faranah"},{"$f":"IF(COUNTRY_INFO!C21=0,\" \",COUNTRY_INFO!C21)","v":"Faranah"},{"$f":"IF(COUNTRY_INFO!$T$9:$T$1000=\"MDA1 (IVM+ALB)\", COUNTRY_INFO!$T$9:$T$1000, \" \")","v":"MDA1 (IVM+ALB)"},"Mai",null,73158,160948,234106,null,96996,130127,227123,null,132.58426966292134,80.850336754728232,97.017163165403701]
[{"$f":"IF(COUNTRY_INFO!A22=0,\" \",COUNTRY_INFO!A22)","v":"Guinea"},{"$f":"IF(COUNTRY_INFO!B22=0,\" \",COUNTRY_INFO!B22)","v":"Faranah"},{"$f":"IF(COUNTRY_INFO!C22=0,\" \",COUNTRY_INFO!C22)","v":"Kissidougou"},{"$f":"IF(COUNTRY_INFO!$T$9:$T$1000=\"MDA1 (IVM+ALB)\", COUNTRY_INFO!$T$9:$T$1000, \" \")","v":"MDA1 (IVM+ALB)"},"Mai",null,74101,163021,237122,null,104754,111763,216517,null,141.36651327242546,68.557425117009458,91.310380310557434]
[{"$f":"IF(COUNTRY_INFO!A23=0,\" \",COUNTRY_INFO!A23)","v":"Guinea"},{"$f":"IF(COUNTRY_INFO!B23=0,\" \",COUNTRY_INFO!B23)","v":"Kankan"},{"$f":"IF(COUNTRY_INFO!C23=0,\" \",COUNTRY_INFO!C23)","v":"Kankan"},{"$f":"IF(COUNTRY_INFO!$T$9:$T$1000=\"MDA1 (IVM+ALB)\", COUNTRY_INFO!$T$9:$T$1000, \" \")","v":"MDA1 (IVM+ALB)"},"Mai",null,123604,271929,395533,null,167877,226917,394794,null,135.81842011585385,83.447149807486511,99.813163503424491]
[{"$f":"IF(COUNTRY_INFO!A24=0,\" \",COUNTRY_INFO!A24)","v":"Guinea"},{"$f":"IF(COUNTRY_INFO!B24=0,\" \",COUNTRY_INFO!B24)","v":"Kankan"},{"$f":"IF(COUNTRY_INFO!C24=0,\" \",COUNTRY_INFO!C24)","v":"Kerouane"},{"$f":"IF(COUNTRY_INFO!$T$9:$T$1000=\"MDA1 (IVM+ALB)\", COUNTRY_INFO!$T$9:$T$1000, \" \")","v":"MDA1 (IVM+ALB)"},"Mai",null,54195,119229,173424,null,71697,95420,167117,null,132.29449211181844,80.030864974125421,96.363248454654496]
[{"$f":"IF(COUNTRY_INFO!A25=0,\" \",COUNTRY_INFO!A25)","v":"Guinea"},{"$f":"IF(COUNTRY_INFO!B25=0,\" \",COUNTRY_INFO!B25)","v":"Kankan"},{"$f":"IF(COUNTRY_INFO!C25=0,\" \",COUNTRY_INFO!C25)","v":"Kouroussa"},{"$f":"IF(COUNTRY_INFO!$T$9:$T$1000=\"MDA1 (IVM+ALB)\", COUNTRY_INFO!$T$9:$T$1000, \" \")","v":"MDA1 (IVM+ALB)"},"Mai",null,70145,154319,224464,null,97063,92290,189353,null,138.37479506736045,59.804690284410867,84.357848029082618]
[{"$f":"IF(COUNTRY_INFO!A26=0,\" \",COUNTRY_INFO!A26)","v":"Guinea"},{"$f":"IF(COUNTRY_INFO!B26=0,\" \",COUNTRY_INFO!B26)","v":"Kankan"},{"$f":"IF(COUNTRY_INFO!C26=0,\" \",COUNTRY_INFO!C26)","v":"Mandiana"},{"$f":"IF(COUNTRY_INFO!$T$9:$T$1000=\"MDA1 (IVM+ALB)\", COUNTRY_INFO!$T$9:$T$1000, \" \")","v":"MDA1 (IVM+ALB)"},"Mai",null,87737,193020,280757,null,113746,184826,298572,null,129.64427778474302,95.754844057610612,106.34534490680554]
[{"$f":"IF(COUNTRY_INFO!A27=0,\" \",COUNTRY_INFO!A27)","v":"Guinea"},{"$f":"IF(COUNTRY_INFO!B27=0,\" \",COUNTRY_INFO!B27)","v":"Kankan"},{"$f":"IF(COUNTRY_INFO!C27=0,\" \",COUNTRY_INFO!C27)","v":"Siguiri"},{"$f":"IF(COUNTRY_INFO!$T$9:$T$1000=\"MDA1 (IVM+ALB)\", COUNTRY_INFO!$T$9:$T$1000, \" \")","v":"MDA1 (IVM+ALB)"},"Mai",null,179391,394660,574051,null,256551,364755,621306,null,143.01219124705253,92.422591597831044,108.23184699617281]
[{"$f":"IF(COUNTRY_INFO!A28=0,\" \",COUNTRY_INFO!A28)","v":"Guinea"},{"$f":"IF(COUNTRY_INFO!B28=0,\" \",COUNTRY_INFO!B28)","v":"Kindia"},{"$f":"IF(COUNTRY_INFO!C28=0,\" \",COUNTRY_INFO!C28)","v":"Coyah"},{"$f":"IF(COUNTRY_INFO!$T$9:$T$1000=\"MDA1 (IVM+ALB)\", COUNTRY_INFO!$T$9:$T$1000, \" \")","v":" "},null,null,null,null,0,null,null,null,0,null," "," "," "]
[{"$f":"IF(COUNTRY_INFO!A29=0,\" \",COUNTRY_INFO!A29)","v":"Guinea"},{"$f":"IF(COUNTRY_INFO!B29=0,\" \",COUNTRY_INFO!B29)","v":"Kindia"},{"$f":"IF(COUNTRY_INFO!C29=0,\" \",COUNTRY_INFO!C29)","v":"Dubreka"},{"$f":"IF(COUNTRY_INFO!$T$9:$T$1000=\"MDA1 (IVM+ALB)\", COUNTRY_INFO!$T$9:$T$1000, \" \")","v":" "},null,null,null,null,0,null,null,null,0,null," "," "," "]
[{"$f":"IF(COUNTRY_INFO!A30=0,\" \",COUNTRY_INFO!A30)","v":"Guinea"},{"$f":"IF(COUNTRY_INFO!B30=0,\" \",COUNTRY_INFO!B30)","v":"Kindia"},{"$f":"IF(COUNTRY_INFO!C30=0,\" \",COUNTRY_INFO!C30)","v":"Forecariah"},{"$f":"IF(COUNTRY_INFO!$T$9:$T$1000=\"MDA1 (IVM+ALB)\", COUNTRY_INFO!$T$9:$T$1000, \" \")","v":"MDA1 (IVM+ALB)"},"Oct",null,63437,139562,202999,null,97090,92860,189950,null,153.04948216340622,66.536736360900534,93.571889516697127]
[{"$f":"IF(COUNTRY_INFO!A31=0,\" \",COUNTRY_INFO!A31)","v":"Guinea"},{"$f":"IF(COUNTRY_INFO!B31=0,\" \",COUNTRY_INFO!B31)","v":"Kindia"},{"$f":"IF(COUNTRY_INFO!C31=0,\" \",COUNTRY_INFO!C31)","v":"Kindia"},{"$f":"IF(COUNTRY_INFO!$T$9:$T$1000=\"MDA1 (IVM+ALB)\", COUNTRY_INFO!$T$9:$T$1000, \" \")","v":"MDA1 (IVM+ALB)"},"Mai",null,114793,252544,367337,null,175356,177626,352982,null,152.75844345909593,70.334674353775966,96.092144270792218]
[{"$f":"IF(COUNTRY_INFO!A32=0,\" \",COUNTRY_INFO!A32)","v":"Guinea"},{"$f":"IF(COUNTRY_INFO!B32=0,\" \",COUNTRY_INFO!B32)","v":"Kindia"},{"$f":"IF(COUNTRY_INFO!C32=0,\" \",COUNTRY_INFO!C32)","v":"Telimele"},{"$f":"IF(COUNTRY_INFO!$T$9:$T$1000=\"MDA1 (IVM+ALB)\", COUNTRY_INFO!$T$9:$T$1000, \" \")","v":"MDA1 (IVM+ALB)"},"Oct",null,74265,163384,237649,null,93097,144682,237779,null,125.35784016696962,88.553346716936787,100.05470252346949]
[{"$f":"IF(COUNTRY_INFO!A33=0,\" \",COUNTRY_INFO!A33)","v":"Guinea"},{"$f":"IF(COUNTRY_INFO!B33=0,\" \",COUNTRY_INFO!B33)","v":"Labé"},{"$f":"IF(COUNTRY_INFO!C33=0,\" \",COUNTRY_INFO!C33)","v":"Koubia"},{"$f":"IF(COUNTRY_INFO!$T$9:$T$1000=\"MDA1 (IVM+ALB)\", COUNTRY_INFO!$T$9:$T$1000, \" \")","v":" "},null,null,null,null,0,null,null,null,0,null," "," "," "]
[{"$f":"IF(COUNTRY_INFO!A34=0,\" \",COUNTRY_INFO!A34)","v":"Guinea"},{"$f":"IF(COUNTRY_INFO!B34=0,\" \",COUNTRY_INFO!B34)","v":"Labé"},{"$f":"IF(COUNTRY_INFO!C34=0,\" \",COUNTRY_INFO!C34)","v":"Labé"},{"$f":"IF(COUNTRY_INFO!$T$9:$T$1000=\"MDA1 (IVM+ALB)\", COUNTRY_INFO!$T$9:$T$1000, \" \")","v":" "},null,null,null,null,0,null,null,null,0,null," "," "," "]
[{"$f":"IF(COUNTRY_INFO!A35=0,\" \",COUNTRY_INFO!A35)","v":"Guinea"},{"$f":"IF(COUNTRY_INFO!B35=0,\" \",COUNTRY_INFO!B35)","v":"Labé"},{"$f":"IF(COUNTRY_INFO!C35=0,\" \",COUNTRY_INFO!C35)","v":"Lelouma"},{"$f":"IF(COUNTRY_INFO!$T$9:$T$1000=\"MDA1 (IVM+ALB)\", COUNTRY_INFO!$T$9:$T$1000, \" \")","v":"MDA1 (IVM+ALB)"},"Mai",null,42581,93678,136259,null,55509,69990,125499,null,130.36095911321951,74.713379875744565,92.103273912181947]
[{"$f":"IF(COUNTRY_INFO!A36=0,\" \",COUNTRY_INFO!A36)","v":"Guinea"},{"$f":"IF(COUNTRY_INFO!B36=0,\" \",COUNTRY_INFO!B36)","v":"Labé"},{"$f":"IF(COUNTRY_INFO!C36=0,\" \",COUNTRY_INFO!C36)","v":"Mali"},{"$f":"IF(COUNTRY_INFO!$T$9:$T$1000=\"MDA1 (IVM+ALB)\", COUNTRY_INFO!$T$9:$T$1000, \" \")","v":"MDA1 (IVM+ALB)"},"Mai",null,75203,165447,240650,null,83411,153707,237118,null,110.91445819980585,92.904071998887858,98.532308331601911]
[{"$f":"IF(COUNTRY_INFO!A37=0,\" \",COUNTRY_INFO!A37)","v":"Guinea"},{"$f":"IF(COUNTRY_INFO!B37=0,\" \",COUNTRY_INFO!B37)","v":"Labé"},{"$f":"IF(COUNTRY_INFO!C37=0,\" \",COUNTRY_INFO!C37)","v":"Tougué"},{"$f":"IF(COUNTRY_INFO!$T$9:$T$1000=\"MDA1 (IVM+ALB)\", COUNTRY_INFO!$T$9:$T$1000, \" \")","v":"MDA1 (IVM+ALB)"},"Mai",null,32452,71394,103846,null,48758,49463,98221,null,150.24651793417971,69.281732358461497,94.58332530863008]
[{"$f":"IF(COUNTRY_INFO!A38=0,\" \",COUNTRY_INFO!A38)","v":"Guinea"},{"$f":"IF(COUNTRY_INFO!B38=0,\" \",COUNTRY_INFO!B38)","v":"Mamou"},{"$f":"IF(COUNTRY_INFO!C38=0,\" \",COUNTRY_INFO!C38)","v":"Dalaba"},{"$f":"IF(COUNTRY_INFO!$T$9:$T$1000=\"MDA1 (IVM+ALB)\", COUNTRY_INFO!$T$9:$T$1000, \" \")","v":"MDA1 (IVM+ALB)"},"Mai",null,34906,76793,111699,null,50887,65043,115930,null,145.78295994957887,84.699126222442146,103.78785844098873]
[{"$f":"IF(COUNTRY_INFO!A39=0,\" \",COUNTRY_INFO!A39)","v":"Guinea"},{"$f":"IF(COUNTRY_INFO!B39=0,\" \",COUNTRY_INFO!B39)","v":"Mamou"},{"$f":"IF(COUNTRY_INFO!C39=0,\" \",COUNTRY_INFO!C39)","v":"Mamou"},{"$f":"IF(COUNTRY_INFO!$T$9:$T$1000=\"MDA1 (IVM+ALB)\", COUNTRY_INFO!$T$9:$T$1000, \" \")","v":"MDA1 (IVM+ALB)"},"Mai",null,83293,183244,266537,null,123519,167576,291095,null,148.29457457409384,91.449651830346426,109.21373017629823]
[{"$f":"IF(COUNTRY_INFO!A40=0,\" \",COUNTRY_INFO!A40)","v":"Guinea"},{"$f":"IF(COUNTRY_INFO!B40=0,\" \",COUNTRY_INFO!B40)","v":"Mamou"},{"$f":"IF(COUNTRY_INFO!C40=0,\" \",COUNTRY_INFO!C40)","v":"Pita"},{"$f":"IF(COUNTRY_INFO!$T$9:$T$1000=\"MDA1 (IVM+ALB)\", COUNTRY_INFO!$T$9:$T$1000, \" \")","v":"MDA1 (IVM+ALB)"},"Mai",null,72730,160006,232736,null,110131,121643,231774,null,151.42444658325314,76.024024099096295,99.586656125395308]
[{"$f":"IF(COUNTRY_INFO!A41=0,\" \",COUNTRY_INFO!A41)","v":"Guinea"},{"$f":"IF(COUNTRY_INFO!B41=0,\" \",COUNTRY_INFO!B41)","v":"N'Zérékoré"},{"$f":"IF(COUNTRY_INFO!C41=0,\" \",COUNTRY_INFO!C41)","v":"Beyla"},{"$f":"IF(COUNTRY_INFO!$T$9:$T$1000=\"MDA1 (IVM+ALB)\", COUNTRY_INFO!$T$9:$T$1000, \" \")","v":"MDA1 (IVM+ALB)"},"Mai",null,85147,187323,272470,null,119576,119730,239306,null,140.43477750243696,63.916337022148909,87.82838477630564]
[{"$f":"IF(COUNTRY_INFO!A42=0,\" \",COUNTRY_INFO!A42)","v":"Guinea"},{"$f":"IF(COUNTRY_INFO!B42=0,\" \",COUNTRY_INFO!B42)","v":"N'Zérékoré"},{"$f":"IF(COUNTRY_INFO!C42=0,\" \",COUNTRY_INFO!C42)","v":"Gueckedou"},{"$f":"IF(COUNTRY_INFO!$T$9:$T$1000=\"MDA1 (IVM+ALB)\", COUNTRY_INFO!$T$9:$T$1000, \" \")","v":"MDA1 (IVM+ALB)"},"Mai",null,75885,166946,242831,null,97268,136084,233352,null,128.178164327601,81.513782899859834,96.096462148572456]
[{"$f":"IF(COUNTRY_INFO!A43=0,\" \",COUNTRY_INFO!A43)","v":"Guinea"},{"$f":"IF(COUNTRY_INFO!B43=0,\" \",COUNTRY_INFO!B43)","v":"N'Zérékoré"},{"$f":"IF(COUNTRY_INFO!C43=0,\" \",COUNTRY_INFO!C43)","v":"Lola"},{"$f":"IF(COUNTRY_INFO!$T$9:$T$1000=\"MDA1 (IVM+ALB)\", COUNTRY_INFO!$T$9:$T$1000, \" \")","v":" "},null,null,null,null,0,null,null,null,0,null," "," "," "]
[{"$f":"IF(COUNTRY_INFO!A44=0,\" \",COUNTRY_INFO!A44)","v":"Guinea"},{"$f":"IF(COUNTRY_INFO!B44=0,\" \",COUNTRY_INFO!B44)","v":"N'Zérékoré"},{"$f":"IF(COUNTRY_INFO!C44=0,\" \",COUNTRY_INFO!C44)","v":"Macenta"},{"$f":"IF(COUNTRY_INFO!$T$9:$T$1000=\"MDA1 (IVM+ALB)\", COUNTRY_INFO!$T$9:$T$1000, \" \")","v":"MDA1 (IVM+ALB)"},"Mai",null,72711,159964,232675,null,105439,118011,223450,null,145.01107122718707,73.77347403165713,96.035242290748897]
[{"$f":"IF(COUNTRY_INFO!A45=0,\" \",COUNTRY_INFO!A45)","v":"Guinea"},{"$f":"IF(COUNTRY_INFO!B45=0,\" \",COUNTRY_INFO!B45)","v":"N'Zérékoré"},{"$f":"IF(COUNTRY_INFO!C45=0,\" \",COUNTRY_INFO!C45)","v":"N'Zérékoré"},{"$f":"IF(COUNTRY_INFO!$T$9:$T$1000=\"MDA1 (IVM+ALB)\", COUNTRY_INFO!$T$9:$T$1000, \" \")","v":" "},null,null,null,null,0,null,null,null,0,null," "," "," "]
[{"$f":"IF(COUNTRY_INFO!A46=0,\" \",COUNTRY_INFO!A46)","v":"Guinea"},{"$f":"IF(COUNTRY_INFO!B46=0,\" \",COUNTRY_INFO!B46)","v":"N'Zérékoré"},{"$f":"IF(COUNTRY_INFO!C46=0,\" \",COUNTRY_INFO!C46)","v":"Yomou"},{"$f":"IF(COUNTRY_INFO!$T$9:$T$1000=\"MDA1 (IVM+ALB)\", COUNTRY_INFO!$T$9:$T$1000, \" \")","v":" "},null,null,null,null,0,null,null,null,0,null," "," "," "]

{"sheet":"MDA2","index":3,"n_rows":46,"n_cols":17,"rows_kept":46,"cut":false,"hidden":true,"merged":[[5,5,5,8],[5,9,5,12],[5,13,5,16],[3,0,3,2],[5,0,5,2],[5,3,6,3],[5,4,6,4]]}
["MDA 2 - Diethylcarbamazine citrate (DEC) + Albendazole (ALB)"]
["Administrative structure, population requiring PC by age group, population treated by age group and coverage"]
[]
["TOTAL",null,null,null,null,{"$f":"SUM(F$9:F$1000)","v":0},{"$f":"SUM(G$9:G$1000)","v":0},0,0,0,0,0,0,{"$f":"IF(F4<>0, IF(J4/F4*100=0, \"-\", J4/F4*100), \" \")","v":" "},{"$f":"IF(G4<>0, IF(K4/G4*100=0, \"-\", K4/G4*100), \" \")","v":" "},{"$f":"IF(H4<>0, IF(L4/H4*100=0, \"-\", L4/H4*100), \" \")","v":" "},{"$f":"IF(I4<>0, IF(M4/I4*100=0, \"-\", M4/I4*100), \" \")","v":" "}]
[]
[null,null,null,"PC implemented","Date","Population targeted for MDA 2",null,null,null,"Population treated",null,null,null,"Programme coverage (%)"]
["Country","Province/State","District",null,null,"PreSAC","SAC","Adults","Total","PreSAC","SAC","Adults","Total","PreSAC","SAC","Adults","Total"]
[]
[{"$f":"IF(COUNTRY_INFO!A9=0,\" \",COUNTRY_INFO!A9)","v":"Guinea"},{"$f":"IF(COUNTRY_INFO!B9=0,\" \",COUNTRY_INFO!B9)","v":"Boké"},{"$f":"IF(COUNTRY_INFO!C9=0,\" \",COUNTRY_INFO!C9)","v":"Boffa"},{"$f":"IF(COUNTRY_INFO!$T$9:$T$1000=\"MDA2 (DEC+ALB)\", COUNTRY_INFO!$T$9:$T$1000, \" \")","v":" "},null,null,null,null,{"$f":"SUM(F9:H9)","v":0},null,null,null,{"$f":"SUM(J9:L9)","v":0},{"$f":"IF(F9<>0, IF(J9/F9*100=0, \"-\", J9/F9*100), \" \")","v":" "}," "," "," "]
[{"$f":"IF(COUNTRY_INFO!A10=0,\" \",COUNTRY_INFO!A10)","v":"Guinea"},{"$f":"IF(COUNTRY_INFO!B10=0,\" \",COUNTRY_INFO!B10)","v":"Boké"},{"$f":"IF(COUNTRY_INFO!C10=0,\" \",COUNTRY_INFO!C10)","v":"Boke"},{"$f":"IF(COUNTRY_INFO!$T$9:$T$1000=\"MDA2 (DEC+ALB)\", COUNTRY_INFO!$T$9:$T$1000, \" \")","v":" "},null,null,null,null,{"$f":"SUM(F10:H10)","v":0},null,null,null,{"$f":"SUM(J10:L10)","v":0},{"$f":"IF(F10<>0, IF(J10/F10*100=0, \"-\", J10/F10*100), \" \")","v":" "},{"$f":"IF(G10<>0, IF(K10/G10*100=0, \"-\", K10/G10*100), \" \")","v":" "},{"$f":"IF(H10<>0, IF(L10/H10*100=0, \"-\", L10/H10*100), \" \")","v":" "},{"$f":"IF(I10<>0, IF(M10/I10*100=0, \"-\", M10/I10*100), \" \")","v":" "}]
[{"$f":"IF(COUNTRY_INFO!A11=0,\" \",COUNTRY_INFO!A11)","v":"Guinea"},{"$f":"IF(COUNTRY_INFO!B11=0,\" \",COUNTRY_INFO!B11)","v":"Boké"},{"$f":"IF(COUNTRY_INFO!C11=0,\" \",COUNTRY_INFO!C11)","v":"Fria"},{"$f":"IF(COUNTRY_INFO!$T$9:$T$1000=\"MDA2 (DEC+ALB)\", COUNTRY_INFO!$T$9:$T$1000, \" \")","v":" "},null,null,null,null,0,null,null,null,0," "," "," "," "]
[{"$f":"IF(COUNTRY_INFO!A12=0,\" \",COUNTRY_INFO!A12)","v":"Guinea"},{"$f":"IF(COUNTRY_INFO!B12=0,\" \",COUNTRY_INFO!B12)","v":"Boké"},{"$f":"IF(COUNTRY_INFO!C12=0,\" \",COUNTRY_INFO!C12)","v":"Gaoual"},{"$f":"IF(COUNTRY_INFO!$T$9:$T$1000=\"MDA2 (DEC+ALB)\", COUNTRY_INFO!$T$9:$T$1000, \" \")","v":" "},null,null,null,null,0,null,null,null,0," "," "," "," "]
[{"$f":"IF(COUNTRY_INFO!A13=0,\" \",COUNTRY_INFO!A13)","v":"Guinea"},{"$f":"IF(COUNTRY_INFO!B13=0,\" \",COUNTRY_INFO!B13)","v":"Boké"},{"$f":"IF(COUNTRY_INFO!C13=0,\" \",COUNTRY_INFO!C13)","v":"Koundara"},{"$f":"IF(COUNTRY_INFO!$T$9:$T$1000=\"MDA2 (DEC+ALB)\", COUNTRY_INFO!$T$9:$T$1000, \" \")","v":" "},null,null,null,null,0,null,null,null,0," "," "," "," "]
[{"$f":"IF(COUNTRY_INFO!A14=0,\" \",COUNTRY_INFO!A14)","v":"Guinea"},{"$f":"IF(COUNTRY_INFO!B14=0,\" \",COUNTRY_INFO!B14)","v":"Conakry"},{"$f":"IF(COUNTRY_INFO!C14=0,\" \",COUNTRY_INFO!C14)","v":"Dixinn"},{"$f":"IF(COUNTRY_INFO!$T$9:$T$1000=\"MDA2 (DEC+ALB)\", COUNTRY_INFO!$T$9:$T$1000, \" \")","v":" "},null,null,null,null,0,null,null,null,0," "," "," "," "]
[{"$f":"IF(COUNTRY_INFO!A15=0,\" \",COUNTRY_INFO!A15)","v":"Guinea"},{"$f":"IF(COUNTRY_INFO!B15=0,\" \",COUNTRY_INFO!B15)","v":"Conakry"},{"$f":"IF(COUNTRY_INFO!C15=0,\" \",COUNTRY_INFO!C15)","v":"Kaloum"},{"$f":"IF(COUNTRY_INFO!$T$9:$T$1000=\"MDA2 (DEC+ALB)\", COUNTRY_INFO!$T$9:$T$1000, \" \")","v":" "},null,null,null,null,0,null,null,null,0," "," "," "," "]
[{"$f":"IF(COUNTRY_INFO!A16=0,\" \",COUNTRY_INFO!A16)","v":"Guinea"},{"$f":"IF(COUNTRY_INFO!B16=0,\" \",COUNTRY_INFO!B16)","v":"Conakry"},{"$f":"IF(COUNTRY_INFO!C16=0,\" \",COUNTRY_INFO!C16)","v":"Matam"},{"$f":"IF(COUNTRY_INFO!$T$9:$T$1000=\"MDA2 (DEC+ALB)\", COUNTRY_INFO!$T$9:$T$1000, \" \")","v":" "},null,null,null,null,0,null,null,null,0," "," "," "," "]
[{"$f":"IF(COUNTRY_INFO!A17=0,\" \",COUNTRY_INFO!A17)","v":"Guinea"},{"$f":"IF(COUNTRY_INFO!B17=0,\" \",COUNTRY_INFO!B17)","v":"Conakry"},{"$f":"IF(COUNTRY_INFO!C17=0,\" \",COUNTRY_INFO!C17)","v":"Matoto"},{"$f":"IF(COUNTRY_INFO!$T$9:$T$1000=\"MDA2 (DEC+ALB)\", COUNTRY_INFO!$T$9:$T$1000, \" \")","v":" "},null,null,null,null,0,null,null,null,0," "," "," "," "]
[{"$f":"IF(COUNTRY_INFO!A18=0,\" \",COUNTRY_INFO!A18)","v":"Guinea"},{"$f":"IF(COUNTRY_INFO!B18=0,\" \",COUNTRY_INFO!B18)","v":"Conakry"},{"$f":"IF(COUNTRY_INFO!C18=0,\" \",COUNTRY_INFO!C18)","v":"Ratoma"},{"$f":"IF(COUNTRY_INFO!$T$9:$T$1000=\"MDA2 (DEC+ALB)\", COUNTRY_INFO!$T$9:$T$1000, \" \")","v":" "},null,null,null,null,0,null,null,null,0," "," "," "," "]
[{"$f":"IF(COUNTRY_INFO!A19=0,\" \",COUNTRY_INFO!A19)","v":"Guinea"},{"$f":"IF(COUNTRY_INFO!B19=0,\" \",COUNTRY_INFO!B19)","v":"Faranah"},{"$f":"IF(COUNTRY_INFO!C19=0,\" \",COUNTRY_INFO!C19)","v":"Dabola"},{"$f":"IF(COUNTRY_INFO!$T$9:$T$1000=\"MDA2 (DEC+ALB)\", COUNTRY_INFO!$T$9:$T$1000, \" \")","v":" "},null,null,null,null,0,null,null,null,0," "," "," "," "]
[{"$f":"IF(COUNTRY_INFO!A20=0,\" \",COUNTRY_INFO!A20)","v":"Guinea"},{"$f":"IF(COUNTRY_INFO!B20=0,\" \",COUNTRY_INFO!B20)","v":"Faranah"},{"$f":"IF(COUNTRY_INFO!C20=0,\" \",COUNTRY_INFO!C20)","v":"Dinguiraye"},{"$f":"IF(COUNTRY_INFO!$T$9:$T$1000=\"MDA2 (DEC+ALB)\", COUNTRY_INFO!$T$9:$T$1000, \" \")","v":" "},null,null,null,null,0,null,null,null,0," "," "," "," "]
[{"$f":"IF(COUNTRY_INFO!A21=0,\" \",COUNTRY_INFO!A21)","v":"Guinea"},{"$f":"IF(COUNTRY_INFO!B21=0,\" \",COUNTRY_INFO!B21)","v":"Faranah"},{"$f":"IF(COUNTRY_INFO!C21=0,\" \",COUNTRY_INFO!C21)","v":"Faranah"},{"$f":"IF(COUNTRY_INFO!$T$9:$T$1000=\"MDA2 (DEC+ALB)\", COUNTRY_INFO!$T$9:$T$1000, \" \")","v":" "},null,null,null,null,0,null,null,null,0," "," "," "," "]
[{"$f":"IF(COUNTRY_INFO!A22=0,\" \",COUNTRY_INFO!A22)","v":"Guinea"},{"$f":"IF(COUNTRY_INFO!B22=0,\" \",COUNTRY_INFO!B22)","v":"Faranah"},{"$f":"IF(COUNTRY_INFO!C22=0,\" \",COUNTRY_INFO!C22)","v":"Kissidougou"},{"$f":"IF(COUNTRY_INFO!$T$9:$T$1000=\"MDA2 (DEC+ALB)\", COUNTRY_INFO!$T$9:$T$1000, \" \")","v":" "},null,null,null,null,0,null,null,null,0," "," "," "," "]
[{"$f":"IF(COUNTRY_INFO!A23=0,\" \",COUNTRY_INFO!A23)","v":"Guinea"},{"$f":"IF(COUNTRY_INFO!B23=0,\" \",COUNTRY_INFO!B23)","v":"Kankan"},{"$f":"IF(COUNTRY_INFO!C23=0,\" \",COUNTRY_INFO!C23)","v":"Kankan"},{"$f":"IF(COUNTRY_INFO!$T$9:$T$1000=\"MDA2 (DEC+ALB)\", COUNTRY_INFO!$T$9:$T$1000, \" \")","v":" "},null,null,null,null,0,null,null,null,0," "," "," "," "]
[{"$f":"IF(COUNTRY_INFO!A24=0,\" \",COUNTRY_INFO!A24)","v":"Guinea"},{"$f":"IF(COUNTRY_INFO!B24=0,\" \",COUNTRY_INFO!B24)","v":"Kankan"},{"$f":"IF(COUNTRY_INFO!C24=0,\" \",COUNTRY_INFO!C24)","v":"Kerouane"},{"$f":"IF(COUNTRY_INFO!$T$9:$T$1000=\"MDA2 (DEC+ALB)\", COUNTRY_INFO!$T$9:$T$1000, \" \")","v":" "},null,null,null,null,0,null,null,null,0," "," "," "," "]
[{"$f":"IF(COUNTRY_INFO!A25=0,\" \",COUNTRY_INFO!A25)","v":"Guinea"},{"$f":"IF(COUNTRY_INFO!B25=0,\" \",COUNTRY_INFO!B25)","v":"Kankan"},{"$f":"IF(COUNTRY_INFO!C25=0,\" \",COUNTRY_INFO!C25)","v":"Kouroussa"},{"$f":"IF(COUNTRY_INFO!$T$9:$T$1000=\"MDA2 (DEC+ALB)\", COUNTRY_INFO!$T$9:$T$1000, \" \")","v":" "},null,null,null,null,0,null,null,null,0," "," "," "," "]
[{"$f":"IF(COUNTRY_INFO!A26=0,\" \",COUNTRY_INFO!A26)","v":"Guinea"},{"$f":"IF(COUNTRY_INFO!B26=0,\" \",COUNTRY_INFO!B26)","v":"Kankan"},{"$f":"IF(COUNTRY_INFO!C26=0,\" \",COUNTRY_INFO!C26)","v":"Mandiana"},{"$f":"IF(COUNTRY_INFO!$T$9:$T$1000=\"MDA2 (DEC+ALB)\", COUNTRY_INFO!$T$9:$T$1000, \" \")","v":" "},null,null,null,null,0,null,null,null,0," "," "," "," "]
[{"$f":"IF(COUNTRY_INFO!A27=0,\" \",COUNTRY_INFO!A27)","v":"Guinea"},{"$f":"IF(COUNTRY_INFO!B27=0,\" \",COUNTRY_INFO!B27)","v":"Kankan"},{"$f":"IF(COUNTRY_INFO!C27=0,\" \",COUNTRY_INFO!C27)","v":"Siguiri"},{"$f":"IF(COUNTRY_INFO!$T$9:$T$1000=\"MDA2 (DEC+ALB)\", COUNTRY_INFO!$T$9:$T$1000, \" \")","v":" "},null,null,null,null,0,null,null,null,0," "," "," "," "]
[{"$f":"IF(COUNTRY_INFO!A28=0,\" \",COUNTRY_INFO!A28)","v":"Guinea"},{"$f":"IF(COUNTRY_INFO!B28=0,\" \",COUNTRY_INFO!B28)","v":"Kindia"},{"$f":"IF(COUNTRY_INFO!C28=0,\" \",COUNTRY_INFO!C28)","v":"Coyah"},{"$f":"IF(COUNTRY_INFO!$T$9:$T$1000=\"MDA2 (DEC+ALB)\", COUNTRY_INFO!$T$9:$T$1000, \" \")","v":" "},null,null,null,null,0,null,null,null,0," "," "," "," "]
[{"$f":"IF(COUNTRY_INFO!A29=0,\" \",COUNTRY_INFO!A29)","v":"Guinea"},{"$f":"IF(COUNTRY_INFO!B29=0,\" \",COUNTRY_INFO!B29)","v":"Kindia"},{"$f":"IF(COUNTRY_INFO!C29=0,\" \",COUNTRY_INFO!C29)","v":"Dubreka"},{"$f":"IF(COUNTRY_INFO!$T$9:$T$1000=\"MDA2 (DEC+ALB)\", COUNTRY_INFO!$T$9:$T$1000, \" \")","v":" "},null,null,null,null,0,null,null,null,0," "," "," "," "]
[{"$f":"IF(COUNTRY_INFO!A30=0,\" \",COUNTRY_INFO!A30)","v":"Guinea"},{"$f":"IF(COUNTRY_INFO!B30=0,\" \",COUNTRY_INFO!B30)","v":"Kindia"},{"$f":"IF(COUNTRY_INFO!C30=0,\" \",COUNTRY_INFO!C30)","v":"Forecariah"},{"$f":"IF(COUNTRY_INFO!$T$9:$T$1000=\"MDA2 (DEC+ALB)\", COUNTRY_INFO!$T$9:$T$1000, \" \")","v":" "},null,null,null,null,0,null,null,null,0," "," "," "," "]
[{"$f":"IF(COUNTRY_INFO!A31=0,\" \",COUNTRY_INFO!A31)","v":"Guinea"},{"$f":"IF(COUNTRY_INFO!B31=0,\" \",COUNTRY_INFO!B31)","v":"Kindia"},{"$f":"IF(COUNTRY_INFO!C31=0,\" \",COUNTRY_INFO!C31)","v":"Kindia"},{"$f":"IF(COUNTRY_INFO!$T$9:$T$1000=\"MDA2 (DEC+ALB)\", COUNTRY_INFO!$T$9:$T$1000, \" \")","v":" "},null,null,null,null,0,null,null,null,0," "," "," "," "]
[{"$f":"IF(COUNTRY_INFO!A32=0,\" \",COUNTRY_INFO!A32)","v":"Guinea"},{"$f":"IF(COUNTRY_INFO!B32=0,\" \",COUNTRY_INFO!B32)","v":"Kindia"},{"$f":"IF(COUNTRY_INFO!C32=0,\" \",COUNTRY_INFO!C32)","v":"Telimele"},{"$f":"IF(COUNTRY_INFO!$T$9:$T$1000=\"MDA2 (DEC+ALB)\", COUNTRY_INFO!$T$9:$T$1000, \" \")","v":" "},null,null,null,null,0,null,null,null,0," "," "," "," "]
[{"$f":"IF(COUNTRY_INFO!A33=0,\" \",COUNTRY_INFO!A33)","v":"Guinea"},{"$f":"IF(COUNTRY_INFO!B33=0,\" \",COUNTRY_INFO!B33)","v":"Labé"},{"$f":"IF(COUNTRY_INFO!C33=0,\" \",COUNTRY_INFO!C33)","v":"Koubia"},{"$f":"IF(COUNTRY_INFO!$T$9:$T$1000=\"MDA2 (DEC+ALB)\", COUNTRY_INFO!$T$9:$T$1000, \" \")","v":" "},null,null,null,null,0,null,null,null,0," "," "," "," "]
[{"$f":"IF(COUNTRY_INFO!A34=0,\" \",COUNTRY_INFO!A34)","v":"Guinea"},{"$f":"IF(COUNTRY_INFO!B34=0,\" \",COUNTRY_INFO!B34)","v":"Labé"},{"$f":"IF(COUNTRY_INFO!C34=0,\" \",COUNTRY_INFO!C34)","v":"Labé"},{"$f":"IF(COUNTRY_INFO!$T$9:$T$1000=\"MDA2 (DEC+ALB)\", COUNTRY_INFO!$T$9:$T$1000, \" \")","v":" "},null,null,null,null,0,null,null,null,0," "," "," "," "]
[{"$f":"IF(COUNTRY_INFO!A35=0,\" \",COUNTRY_INFO!A35)","v":"Guinea"},{"$f":"IF(COUNTRY_INFO!B35=0,\" \",COUNTRY_INFO!B35)","v":"Labé"},{"$f":"IF(COUNTRY_INFO!C35=0,\" \",COUNTRY_INFO!C35)","v":"Lelouma"},{"$f":"IF(COUNTRY_INFO!$T$9:$T$1000=\"MDA2 (DEC+ALB)\", COUNTRY_INFO!$T$9:$T$1000, \" \")","v":" "},null,null,null,null,0,null,null,null,0," "," "," "," "]
[{"$f":"IF(COUNTRY_INFO!A36=0,\" \",COUNTRY_INFO!A36)","v":"Guinea"},{"$f":"IF(COUNTRY_INFO!B36=0,\" \",COUNTRY_INFO!B36)","v":"Labé"},{"$f":"IF(COUNTRY_INFO!C36=0,\" \",COUNTRY_INFO!C36)","v":"Mali"},{"$f":"IF(COUNTRY_INFO!$T$9:$T$1000=\"MDA2 (DEC+ALB)\", COUNTRY_INFO!$T$9:$T$1000, \" \")","v":" "},null,null,null,null,0,null,null,null,0," "," "," "," "]
[{"$f":"IF(COUNTRY_INFO!A37=0,\" \",COUNTRY_INFO!A37)","v":"Guinea"},{"$f":"IF(COUNTRY_INFO!B37=0,\" \",COUNTRY_INFO!B37)","v":"Labé"},{"$f":"IF(COUNTRY_INFO!C37=0,\" \",COUNTRY_INFO!C37)","v":"Tougué"},{"$f":"IF(COUNTRY_INFO!$T$9:$T$1000=\"MDA2 (DEC+ALB)\", COUNTRY_INFO!$T$9:$T$1000, \" \")","v":" "},null,null,null,null,0,null,null,null,0," "," "," "," "]
[{"$f":"IF(COUNTRY_INFO!A38=0,\" \",COUNTRY_INFO!A38)","v":"Guinea"},{"$f":"IF(COUNTRY_INFO!B38=0,\" \",COUNTRY_INFO!B38)","v":"Mamou"},{"$f":"IF(COUNTRY_INFO!C38=0,\" \",COUNTRY_INFO!C38)","v":"Dalaba"},{"$f":"IF(COUNTRY_INFO!$T$9:$T$1000=\"MDA2 (DEC+ALB)\", COUNTRY_INFO!$T$9:$T$1000, \" \")","v":" "},null,null,null,null,0,null,null,null,0," "," "," "," "]
[{"$f":"IF(COUNTRY_INFO!A39=0,\" \",COUNTRY_INFO!A39)","v":"Guinea"},{"$f":"IF(COUNTRY_INFO!B39=0,\" \",COUNTRY_INFO!B39)","v":"Mamou"},{"$f":"IF(COUNTRY_INFO!C39=0,\" \",COUNTRY_INFO!C39)","v":"Mamou"},{"$f":"IF(COUNTRY_INFO!$T$9:$T$1000=\"MDA2 (DEC+ALB)\", COUNTRY_INFO!$T$9:$T$1000, \" \")","v":" "},null,null,null,null,0,null,null,null,0," "," "," "," "]
[{"$f":"IF(COUNTRY_INFO!A40=0,\" \",COUNTRY_INFO!A40)","v":"Guinea"},{"$f":"IF(COUNTRY_INFO!B40=0,\" \",COUNTRY_INFO!B40)","v":"Mamou"},{"$f":"IF(COUNTRY_INFO!C40=0,\" \",COUNTRY_INFO!C40)","v":"Pita"},{"$f":"IF(COUNTRY_INFO!$T$9:$T$1000=\"MDA2 (DEC+ALB)\", COUNTRY_INFO!$T$9:$T$1000, \" \")","v":" "},null,null,null,null,0,null,null,null,0," "," "," "," "]
[{"$f":"IF(COUNTRY_INFO!A41=0,\" \",COUNTRY_INFO!A41)","v":"Guinea"},{"$f":"IF(COUNTRY_INFO!B41=0,\" \",COUNTRY_INFO!B41)","v":"N'Zérékoré"},{"$f":"IF(COUNTRY_INFO!C41=0,\" \",COUNTRY_INFO!C41)","v":"Beyla"},{"$f":"IF(COUNTRY_INFO!$T$9:$T$1000=\"MDA2 (DEC+ALB)\", COUNTRY_INFO!$T$9:$T$1000, \" \")","v":" "},null,null,null,null,0,null,null,null,0," "," "," "," "]
[{"$f":"IF(COUNTRY_INFO!A42=0,\" \",COUNTRY_INFO!A42)","v":"Guinea"},{"$f":"IF(COUNTRY_INFO!B42=0,\" \",COUNTRY_INFO!B42)","v":"N'Zérékoré"},{"$f":"IF(COUNTRY_INFO!C42=0,\" \",COUNTRY_INFO!C42)","v":"Gueckedou"},{"$f":"IF(COUNTRY_INFO!$T$9:$T$1000=\"MDA2 (DEC+ALB)\", COUNTRY_INFO!$T$9:$T$1000, \" \")","v":" "},null,null,null,null,0,null,null,null,0," "," "," "," "]
[{"$f":"IF(COUNTRY_INFO!A43=0,\" \",COUNTRY_INFO!A43)","v":"Guinea"},{"$f":"IF(COUNTRY_INFO!B43=0,\" \",COUNTRY_INFO!B43)","v":"N'Zérékoré"},{"$f":"IF(COUNTRY_INFO!C43=0,\" \",COUNTRY_INFO!C43)","v":"Lola"},{"$f":"IF(COUNTRY_INFO!$T$9:$T$1000=\"MDA2 (DEC+ALB)\", COUNTRY_INFO!$T$9:$T$1000, \" \")","v":" "},null,null,null,null,0,null,null,null,0," "," "," "," "]
[{"$f":"IF(COUNTRY_INFO!A44=0,\" \",COUNTRY_INFO!A44)","v":"Guinea"},{"$f":"IF(COUNTRY_INFO!B44=0,\" \",COUNTRY_INFO!B44)","v":"N'Zérékoré"},{"$f":"IF(COUNTRY_INFO!C44=0,\" \",COUNTRY_INFO!C44)","v":"Macenta"},{"$f":"IF(COUNTRY_INFO!$T$9:$T$1000=\"MDA2 (DEC+ALB)\", COUNTRY_INFO!$T$9:$T$1000, \" \")","v":" "},null,null,null,null,0,null,null,null,0," "," "," "," "]
[{"$f":"IF(COUNTRY_INFO!A45=0,\" \",COUNTRY_INFO!A45)","v":"Guinea"},{"$f":"IF(COUNTRY_INFO!B45=0,\" \",COUNTRY_INFO!B45)","v":"N'Zérékoré"},{"$f":"IF(COUNTRY_INFO!C45=0,\" \",COUNTRY_INFO!C45)","v":"N'Zérékoré"},{"$f":"IF(COUNTRY_INFO!$T$9:$T$1000=\"MDA2 (DEC+ALB)\", COUNTRY_INFO!$T$9:$T$1000, \" \")","v":" "},null,null,null,null,0,null,null,null,0," "," "," "," "]
[{"$f":"IF(COUNTRY_INFO!A46=0,\" \",COUNTRY_INFO!A46)","v":"Guinea"},{"$f":"IF(COUNTRY_INFO!B46=0,\" \",COUNTRY_INFO!B46)","v":"N'Zérékoré"},{"$f":"IF(COUNTRY_INFO!C46=0,\" \",COUNTRY_INFO!C46)","v":"Yomou"},{"$f":"IF(COUNTRY_INFO!$T$9:$T$1000=\"MDA2 (DEC+ALB)\", COUNTRY_INFO!$T$9:$T$1000, \" \")","v":" "},null,null,null,null,0,null,null,null,0," "," "," "," "]

{"sheet":"MDA3","index":4,"n_rows":46,"n_cols":20,"rows_kept":46,"cut":false,"hidden":false,"merged":[[5,5,5,7],[5,17,5,19],[3,0,3,2],[5,0,5,2],[5,3,6,3],[5,4,6,4],[5,8,5,10],[5,11,5,13],[5,14,5,16]]}
["MDA 3 - Ivermectin (IVM) "]
["Administrative structure, population requiring PC by age group, population treated by age group and coverage"]
[]
["TOTAL",null,null,null,null,{"$f":"SUM(F$9:F$1000)","v":204472},449836,654308,17425,52274,69699,0,0,0,17425,52274,69699,{"$f":"IF(F4<>0, IF(O4/F4*100=0, \"-\", O4/F4*100), \" \")","v":8.5219492155405145},{"$f":"IF(G4<>0, IF(P4/G4*100=0, \"-\", P4/G4*100), \" \")","v":11.620679536542207},{"$f":"IF(H4<>0, IF(Q4/H4*100=0, \"-\", Q4/H4*100), \" \")","v":10.652322759312129}]
[]
[null,null,null,"PC implemented","Date","Population targeted for MDA 3",null,null,"Population treated - 1st round",null,null,"Population treated - 2nd round",null,null,"Population treated",null,null,"Programme coverage (%)"]
["Country","Province/State","District",null,null,"SAC","Adults","Total","SAC","Adults","Total","SAC","Adults","Total","SAC","Adults","Total","SAC","Adults","Total"]
[]
[{"$f":"IF(COUNTRY_INFO!A9=0,\" \",COUNTRY_INFO!A9)","v":"Guinea"},{"$f":"IF(COUNTRY_INFO!B9=0,\" \",COUNTRY_INFO!B9)","v":"Boké"},{"$f":"IF(COUNTRY_INFO!C9=0,\" \",COUNTRY_INFO!C9)","v":"Boffa"},{"$f":"IF(COUNTRY_INFO!$T$9:$T$1000=\"MDA3 (IVM)\", COUNTRY_INFO!$T$9:$T$1000, \" \")","v":" "},null,null,null,{"$f":"SUM(F9:G9)","v":0},null,null,{"$f":"SUM(I9:J9)","v":0},null,null,{"$f":"SUM(L9:M9)","v":0},{"$f":"MAX(I9,L9)","v":0},0,{"$f":"SUM(O9:P9)","v":0},{"$f":"IF(F9<>0, IF(MAX(I9,L9)/F9*100=0, \"-\", MAX(I9,L9)/F9*100), \" \")","v":" "}," ",{"$f":"IF(H9<>0, IF((MAX(I9,L9)+MAX(J9,M9))/H9*100=0, \"-\",(MAX(I9,L9)+MAX(J9,M9))/H9*100), \" \")","v":" "}]
[{"$f":"IF(COUNTRY_INFO!A10=0,\" \",COUNTRY_INFO!A10)","v":"Guinea"},{"$f":"IF(COUNTRY_INFO!B10=0,\" \",COUNTRY_INFO!B10)","v":"Boké"},{"$f":"IF(COUNTRY_INFO!C10=0,\" \",COUNTRY_INFO!C10)","v":"Boke"},{"$f":"IF(COUNTRY_INFO!$T$9:$T$1000=\"MDA3 (IVM)\", COUNTRY_INFO!$T$9:$T$1000, \" \")","v":" "},null,null,null,{"$f":"SUM(F10:G10)","v":0},null,null,{"$f":"SUM(I10:J10)","v":0},null,null,{"$f":"SUM(L10:M10)","v":0},{"$f":"MAX(I10,L10)","v":0},{"$f":"MAX(J10,M10)","v":0},{"$f":"SUM(O10:P10)","v":0},{"$f":"IF(F10<>0, IF(MAX(I10,L10)/F10*100=0, \"-\", MAX(I10,L10)/F10*100), \" \")","v":" "},{"$f":"IF(G10<>0, IF(MAX(J10,M10)/G10*100=0, \"-\", MAX(J10,M10)/G10*100), \" \")","v":" "},{"$f":"IF(H10<>0, IF((MAX(I10,L10)+MAX(J10,M10))/H10*100=0, \"-\",(MAX(I10,L10)+MAX(J10,M10))/H10*100), \" \")","v":" "}]
[{"$f":"IF(COUNTRY_INFO!A11=0,\" \",COUNTRY_INFO!A11)","v":"Guinea"},{"$f":"IF(COUNTRY_INFO!B11=0,\" \",COUNTRY_INFO!B11)","v":"Boké"},{"$f":"IF(COUNTRY_INFO!C11=0,\" \",COUNTRY_INFO!C11)","v":"Fria"},{"$f":"IF(COUNTRY_INFO!$T$9:$T$1000=\"MDA3 (IVM)\", COUNTRY_INFO!$T$9:$T$1000, \" \")","v":" "},null,null,null,0,null,null,0,null,null,0,0,0,0," "," "," "]
[{"$f":"IF(COUNTRY_INFO!A12=0,\" \",COUNTRY_INFO!A12)","v":"Guinea"},{"$f":"IF(COUNTRY_INFO!B12=0,\" \",COUNTRY_INFO!B12)","v":"Boké"},{"$f":"IF(COUNTRY_INFO!C12=0,\" \",COUNTRY_INFO!C12)","v":"Gaoual"},{"$f":"IF(COUNTRY_INFO!$T$9:$T$1000=\"MDA3 (IVM)\", COUNTRY_INFO!$T$9:$T$1000, \" \")","v":" "},null,null,null,0,null,null,0,null,null,0,0,0,0," "," "," "]
[{"$f":"IF(COUNTRY_INFO!A13=0,\" \",COUNTRY_INFO!A13)","v":"Guinea"},{"$f":"IF(COUNTRY_INFO!B13=0,\" \",COUNTRY_INFO!B13)","v":"Boké"},{"$f":"IF(COUNTRY_INFO!C13=0,\" \",COUNTRY_INFO!C13)","v":"Koundara"},{"$f":"IF(COUNTRY_INFO!$T$9:$T$1000=\"MDA3 (IVM)\", COUNTRY_INFO!$T$9:$T$1000, \" \")","v":" "},null,null,null,0,null,null,0,null,null,0,0,0,0," "," "," "]
[{"$f":"IF(COUNTRY_INFO!A14=0,\" \",COUNTRY_INFO!A14)","v":"Guinea"},{"$f":"IF(COUNTRY_INFO!B14=0,\" \",COUNTRY_INFO!B14)","v":"Conakry"},{"$f":"IF(COUNTRY_INFO!C14=0,\" \",COUNTRY_INFO!C14)","v":"Dixinn"},{"$f":"IF(COUNTRY_INFO!$T$9:$T$1000=\"MDA3 (IVM)\", COUNTRY_INFO!$T$9:$T$1000, \" \")","v":" "},null,null,null,0,null,null,0,null,null,0,0,0,0," "," "," "]
[{"$f":"IF(COUNTRY_INFO!A15=0,\" \",COUNTRY_INFO!A15)","v":"Guinea"},{"$f":"IF(COUNTRY_INFO!B15=0,\" \",COUNTRY_INFO!B15)","v":"Conakry"},{"$f":"IF(COUNTRY_INFO!C15=0,\" \",COUNTRY_INFO!C15)","v":"Kaloum"},{"$f":"IF(COUNTRY_INFO!$T$9:$T$1000=\"MDA3 (IVM)\", COUNTRY_INFO!$T$9:$T$1000, \" \")","v":" "},null,null,null,0,null,null,0,null,null,0,0,0,0," "," "," "]
[{"$f":"IF(COUNTRY_INFO!A16=0,\" \",COUNTRY_INFO!A16)","v":"Guinea"},{"$f":"IF(COUNTRY_INFO!B16=0,\" \",COUNTRY_INFO!B16)","v":"Conakry"},{"$f":"IF(COUNTRY_INFO!C16=0,\" \",COUNTRY_INFO!C16)","v":"Matam"},{"$f":"IF(COUNTRY_INFO!$T$9:$T$1000=\"MDA3 (IVM)\", COUNTRY_INFO!$T$9:$T$1000, \" \")","v":" "},null,null,null,0,null,null,0,null,null,0,0,0,0," "," "," "]
[{"$f":"IF(COUNTRY_INFO!A17=0,\" \",COUNTRY_INFO!A17)","v":"Guinea"},{"$f":"IF(COUNTRY_INFO!B17=0,\" \",COUNTRY_INFO!B17)","v":"Conakry"},{"$f":"IF(COUNTRY_INFO!C17=0,\" \",COUNTRY_INFO!C17)","v":"Matoto"},{"$f":"IF(COUNTRY_INFO!$T$9:$T$1000=\"MDA3 (IVM)\", COUNTRY_INFO!$T$9:$T$1000, \" \")","v":" "},null,null,null,0,null,null,0,null,null,0,0,0,0," "," "," "]
[{"$f":"IF(COUNTRY_INFO!A18=0,\" \",COUNTRY_INFO!A18)","v":"Guinea"},{"$f":"IF(COUNTRY_INFO!B18=0,\" \",COUNTRY_INFO!B18)","v":"Conakry"},{"$f":"IF(COUNTRY_INFO!C18=0,\" \",COUNTRY_INFO!C18)","v":"Ratoma"},{"$f":"IF(COUNTRY_INFO!$T$9:$T$1000=\"MDA3 (IVM)\", COUNTRY_INFO!$T$9:$T$1000, \" \")","v":" "},null,null,null,0,null,null,0,null,null,0,0,0,0," "," "," "]
[{"$f":"IF(COUNTRY_INFO!A19=0,\" \",COUNTRY_INFO!A19)","v":"Guinea"},{"$f":"IF(COUNTRY_INFO!B19=0,\" \",COUNTRY_INFO!B19)","v":"Faranah"},{"$f":"IF(COUNTRY_INFO!C19=0,\" \",COUNTRY_INFO!C19)","v":"Dabola"},{"$f":"IF(COUNTRY_INFO!$T$9:$T$1000=\"MDA3 (IVM)\", COUNTRY_INFO!$T$9:$T$1000, \" \")","v":" "},null,null,null,0,null,null,0,null,null,0,0,0,0," "," "," "]
[{"$f":"IF(COUNTRY_INFO!A20=0,\" \",COUNTRY_INFO!A20)","v":"Guinea"},{"$f":"IF(COUNTRY_INFO!B20=0,\" \",COUNTRY_INFO!B20)","v":"Faranah"},{"$f":"IF(COUNTRY_INFO!C20=0,\" \",COUNTRY_INFO!C20)","v":"Dinguiraye"},{"$f":"IF(COUNTRY_INFO!$T$9:$T$1000=\"MDA3 (IVM)\", COUNTRY_INFO!$T$9:$T$1000, \" \")","v":" "},null,null,null,0,null,null,0,null,null,0,0,0,0," "," "," "]
[{"$f":"IF(COUNTRY_INFO!A21=0,\" \",COUNTRY_INFO!A21)","v":"Guinea"},{"$f":"IF(COUNTRY_INFO!B21=0,\" \",COUNTRY_INFO!B21)","v":"Faranah"},{"$f":"IF(COUNTRY_INFO!C21=0,\" \",COUNTRY_INFO!C21)","v":"Faranah"},{"$f":"IF(COUNTRY_INFO!$T$9:$T$1000=\"MDA3 (IVM)\", COUNTRY_INFO!$T$9:$T$1000, \" \")","v":" "},null,null,null,0,null,null,0,null,null,0,0,0,0," "," "," "]
[{"$f":"IF(COUNTRY_INFO!A22=0,\" \",COUNTRY_INFO!A22)","v":"Guinea"},{"$f":"IF(COUNTRY_INFO!B22=0,\" \",COUNTRY_INFO!B22)","v":"Faranah"},{"$f":"IF(COUNTRY_INFO!C22=0,\" \",COUNTRY_INFO!C22)","v":"Kissidougou"},{"$f":"IF(COUNTRY_INFO!$T$9:$T$1000=\"MDA3 (IVM)\", COUNTRY_INFO!$T$9:$T$1000, \" \")","v":" "},null,null,null,0,null,null,0,null,null,0,0,0,0," "," "," "]
[{"$f":"IF(COUNTRY_INFO!A23=0,\" \",COUNTRY_INFO!A23)","v":"Guinea"},{"$f":"IF(COUNTRY_INFO!B23=0,\" \",COUNTRY_INFO!B23)","v":"Kankan"},{"$f":"IF(COUNTRY_INFO!C23=0,\" \",COUNTRY_INFO!C23)","v":"Kankan"},{"$f":"IF(COUNTRY_INFO!$T$9:$T$1000=\"MDA3 (IVM)\", COUNTRY_INFO!$T$9:$T$1000, \" \")","v":" "},null,null,null,0,null,null,0,null,null,0,0,0,0," "," "," "]
[{"$f":"IF(COUNTRY_INFO!A24=0,\" \",COUNTRY_INFO!A24)","v":"Guinea"},{"$f":"IF(COUNTRY_INFO!B24=0,\" \",COUNTRY_INFO!B24)","v":"Kankan"},{"$f":"IF(COUNTRY_INFO!C24=0,\" \",COUNTRY_INFO!C24)","v":"Kerouane"},{"$f":"IF(COUNTRY_INFO!$T$9:$T$1000=\"MDA3 (IVM)\", COUNTRY_INFO!$T$9:$T$1000, \" \")","v":" "},null,null,null,0,null,null,0,null,null,0,0,0,0," "," "," "]
[{"$f":"IF(COUNTRY_INFO!A25=0,\" \",COUNTRY_INFO!A25)","v":"Guinea"},{"$f":"IF(COUNTRY_INFO!B25=0,\" \",COUNTRY_INFO!B25)","v":"Kankan"},{"$f":"IF(COUNTRY_INFO!C25=0,\" \",COUNTRY_INFO!C25)","v":"Kouroussa"},{"$f":"IF(COUNTRY_INFO!$T$9:$T$1000=\"MDA3 (IVM)\", COUNTRY_INFO!$T$9:$T$1000, \" \")","v":" "},null,null,null,0,null,null,0,null,null,0,0,0,0," "," "," "]
[{"$f":"IF(COUNTRY_INFO!A26=0,\" \",COUNTRY_INFO!A26)","v":"Guinea"},{"$f":"IF(COUNTRY_INFO!B26=0,\" \",COUNTRY_INFO!B26)","v":"Kankan"},{"$f":"IF(COUNTRY_INFO!C26=0,\" \",COUNTRY_INFO!C26)","v":"Mandiana"},{"$f":"IF(COUNTRY_INFO!$T$9:$T$1000=\"MDA3 (IVM)\", COUNTRY_INFO!$T$9:$T$1000, \" \")","v":" "},null,null,null,0,null,null,0,null,null,0,0,0,0," "," "," "]
[{"$f":"IF(COUNTRY_INFO!A27=0,\" \",COUNTRY_INFO!A27)","v":"Guinea"},{"$f":"IF(COUNTRY_INFO!B27=0,\" \",COUNTRY_INFO!B27)","v":"Kankan"},{"$f":"IF(COUNTRY_INFO!C27=0,\" \",COUNTRY_INFO!C27)","v":"Siguiri"},{"$f":"IF(COUNTRY_INFO!$T$9:$T$1000=\"MDA3 (IVM)\", COUNTRY_INFO!$T$9:$T$1000, \" \")","v":" "},null,null,null,0,null,null,0,null,null,0,0,0,0," "," "," "]
[{"$f":"IF(COUNTRY_INFO!A28=0,\" \",COUNTRY_INFO!A28)","v":"Guinea"},{"$f":"IF(COUNTRY_INFO!B28=0,\" \",COUNTRY_INFO!B28)","v":"Kindia"},{"$f":"IF(COUNTRY_INFO!C28=0,\" \",COUNTRY_INFO!C28)","v":"Coyah"},{"$f":"IF(COUNTRY_INFO!$T$9:$T$1000=\"MDA3 (IVM)\", COUNTRY_INFO!$T$9:$T$1000, \" \")","v":" "},null,null,null,0,null,null,0,null,null,0,0,0,0," "," "," "]
[{"$f":"IF(COUNTRY_INFO!A29=0,\" \",COUNTRY_INFO!A29)","v":"Guinea"},{"$f":"IF(COUNTRY_INFO!B29=0,\" \",COUNTRY_INFO!B29)","v":"Kindia"},{"$f":"IF(COUNTRY_INFO!C29=0,\" \",COUNTRY_INFO!C29)","v":"Dubreka"},{"$f":"IF(COUNTRY_INFO!$T$9:$T$1000=\"MDA3 (IVM)\", COUNTRY_INFO!$T$9:$T$1000, \" \")","v":" "},null,null,null,0,null,null,0,null,null,0,0,0,0," "," "," "]
[{"$f":"IF(COUNTRY_INFO!A30=0,\" \",COUNTRY_INFO!A30)","v":"Guinea"},{"$f":"IF(COUNTRY_INFO!B30=0,\" \",COUNTRY_INFO!B30)","v":"Kindia"},{"$f":"IF(COUNTRY_INFO!C30=0,\" \",COUNTRY_INFO!C30)","v":"Forecariah"},{"$f":"IF(COUNTRY_INFO!$T$9:$T$1000=\"MDA3 (IVM)\", COUNTRY_INFO!$T$9:$T$1000, \" \")","v":" "},null,null,null,0,null,null,0,null,null,0,0,0,0," "," "," "]
[{"$f":"IF(COUNTRY_INFO!A31=0,\" \",COUNTRY_INFO!A31)","v":"Guinea"},{"$f":"IF(COUNTRY_INFO!B31=0,\" \",COUNTRY_INFO!B31)","v":"Kindia"},{"$f":"IF(COUNTRY_INFO!C31=0,\" \",COUNTRY_INFO!C31)","v":"Kindia"},{"$f":"IF(COUNTRY_INFO!$T$9:$T$1000=\"MDA3 (IVM)\", COUNTRY_INFO!$T$9:$T$1000, \" \")","v":" "},null,null,null,0,null,null,0,null,null,0,0,0,0," "," "," "]
[{"$f":"IF(COUNTRY_INFO!A32=0,\" \",COUNTRY_INFO!A32)","v":"Guinea"},{"$f":"IF(COUNTRY_INFO!B32=0,\" \",COUNTRY_INFO!B32)","v":"Kindia"},{"$f":"IF(COUNTRY_INFO!C32=0,\" \",COUNTRY_INFO!C32)","v":"Telimele"},{"$f":"IF(COUNTRY_INFO!$T$9:$T$1000=\"MDA3 (IVM)\", COUNTRY_INFO!$T$9:$T$1000, \" \")","v":" "},null,null,null,0,null,null,0,null,null,0,0,0,0," "," "," "]
[{"$f":"IF(COUNTRY_INFO!A33=0,\" \",COUNTRY_INFO!A33)","v":"Guinea"},{"$f":"IF(COUNTRY_INFO!B33=0,\" \",COUNTRY_INFO!B33)","v":"Labé"},{"$f":"IF(COUNTRY_INFO!C33=0,\" \",COUNTRY_INFO!C33)","v":"Koubia"},{"$f":"IF(COUNTRY_INFO!$T$9:$T$1000=\"MDA3 (IVM)\", COUNTRY_INFO!$T$9:$T$1000, \" \")","v":"MDA3 (IVM)"},"Nov",26157,57544,83701,17425,52274,69699,null,null,0,17425,52274,69699,66.616966777535652,90.841790629778956,83.271406554282507]
[{"$f":"IF(COUNTRY_INFO!A34=0,\" \",COUNTRY_INFO!A34)","v":"Guinea"},{"$f":"IF(COUNTRY_INFO!B34=0,\" \",COUNTRY_INFO!B34)","v":"Labé"},{"$f":"IF(COUNTRY_INFO!C34=0,\" \",COUNTRY_INFO!C34)","v":"Labé"},{"$f":"IF(COUNTRY_INFO!$T$9:$T$1000=\"MDA3 (IVM)\", COUNTRY_INFO!$T$9:$T$1000, \" \")","v":" "},null,null,null,0,null,null,0,null,null,0,0,0,0," "," "," "]
[{"$f":"IF(COUNTRY_INFO!A35=0,\" \",COUNTRY_INFO!A35)","v":"Guinea"},{"$f":"IF(COUNTRY_INFO!B35=0,\" \",COUNTRY_INFO!B35)","v":"Labé"},{"$f":"IF(COUNTRY_INFO!C35=0,\" \",COUNTRY_INFO!C35)","v":"Lelouma"},{"$f":"IF(COUNTRY_INFO!$T$9:$T$1000=\"MDA3 (IVM)\", COUNTRY_INFO!$T$9:$T$1000, \" \")","v":" "},null,null,null,0,null,null,0,null,null,0,0,0,0," "," "," "]
[{"$f":"IF(COUNTRY_INFO!A36=0,\" \",COUNTRY_INFO!A36)","v":"Guinea"},{"$f":"IF(COUNTRY_INFO!B36=0,\" \",COUNTRY_INFO!B36)","v":"Labé"},{"$f":"IF(COUNTRY_INFO!C36=0,\" \",COUNTRY_INFO!C36)","v":"Mali"},{"$f":"IF(COUNTRY_INFO!$T$9:$T$1000=\"MDA3 (IVM)\", COUNTRY_INFO!$T$9:$T$1000, \" \")","v":" "},null,null,null,0,null,null,0,null,null,0,0,0,0," "," "," "]
[{"$f":"IF(COUNTRY_INFO!A37=0,\" \",COUNTRY_INFO!A37)","v":"Guinea"},{"$f":"IF(COUNTRY_INFO!B37=0,\" \",COUNTRY_INFO!B37)","v":"Labé"},{"$f":"IF(COUNTRY_INFO!C37=0,\" \",COUNTRY_INFO!C37)","v":"Tougué"},{"$f":"IF(COUNTRY_INFO!$T$9:$T$1000=\"MDA3 (IVM)\", COUNTRY_INFO!$T$9:$T$1000, \" \")","v":" "},null,null,null,0,null,null,0,null,null,0,0,0,0," "," "," "]
[{"$f":"IF(COUNTRY_INFO!A38=0,\" \",COUNTRY_INFO!A38)","v":"Guinea"},{"$f":"IF(COUNTRY_INFO!B38=0,\" \",COUNTRY_INFO!B38)","v":"Mamou"},{"$f":"IF(COUNTRY_INFO!C38=0,\" \",COUNTRY_INFO!C38)","v":"Dalaba"},{"$f":"IF(COUNTRY_INFO!$T$9:$T$1000=\"MDA3 (IVM)\", COUNTRY_INFO!$T$9:$T$1000, \" \")","v":" "},null,null,null,0,null,null,0,null,null,0,0,0,0," "," "," "]
[{"$f":"IF(COUNTRY_INFO!A39=0,\" \",COUNTRY_INFO!A39)","v":"Guinea"},{"$f":"IF(COUNTRY_INFO!B39=0,\" \",COUNTRY_INFO!B39)","v":"Mamou"},{"$f":"IF(COUNTRY_INFO!C39=0,\" \",COUNTRY_INFO!C39)","v":"Mamou"},{"$f":"IF(COUNTRY_INFO!$T$9:$T$1000=\"MDA3 (IVM)\", COUNTRY_INFO!$T$9:$T$1000, \" \")","v":" "},null,null,null,0,null,null,0,null,null,0,0,0,0," "," "," "]
[{"$f":"IF(COUNTRY_INFO!A40=0,\" \",COUNTRY_INFO!A40)","v":"Guinea"},{"$f":"IF(COUNTRY_INFO!B40=0,\" \",COUNTRY_INFO!B40)","v":"Mamou"},{"$f":"IF(COUNTRY_INFO!C40=0,\" \",COUNTRY_INFO!C40)","v":"Pita"},{"$f":"IF(COUNTRY_INFO!$T$9:$T$1000=\"MDA3 (IVM)\", COUNTRY_INFO!$T$9:$T$1000, \" \")","v":" "},null,null,null,0,null,null,0,null,null,0,0,0,0," "," "," "]
[{"$f":"IF(COUNTRY_INFO!A41=0,\" \",COUNTRY_INFO!A41)","v":"Guinea"},{"$f":"IF(COUNTRY_INFO!B41=0,\" \",COUNTRY_INFO!B41)","v":"N'Zérékoré"},{"$f":"IF(COUNTRY_INFO!C41=0,\" \",COUNTRY_INFO!C41)","v":"Beyla"},{"$f":"IF(COUNTRY_INFO!$T$9:$T$1000=\"MDA3 (IVM)\", COUNTRY_INFO!$T$9:$T$1000, \" \")","v":" "},null,null,null,0,null,null,0,null,null,0,0,0,0," "," "," "]
[{"$f":"IF(COUNTRY_INFO!A42=0,\" \",COUNTRY_INFO!A42)","v":"Guinea"},{"$f":"IF(COUNTRY_INFO!B42=0,\" \",COUNTRY_INFO!B42)","v":"N'Zérékoré"},{"$f":"IF(COUNTRY_INFO!C42=0,\" \",COUNTRY_INFO!C42)","v":"Gueckedou"},{"$f":"IF(COUNTRY_INFO!$T$9:$T$1000=\"MDA3 (IVM)\", COUNTRY_INFO!$T$9:$T$1000, \" \")","v":" "},null,null,null,0,null,null,0,null,null,0,0,0,0," "," "," "]
[{"$f":"IF(COUNTRY_INFO!A43=0,\" \",COUNTRY_INFO!A43)","v":"Guinea"},{"$f":"IF(COUNTRY_INFO!B43=0,\" \",COUNTRY_INFO!B43)","v":"N'Zérékoré"},{"$f":"IF(COUNTRY_INFO!C43=0,\" \",COUNTRY_INFO!C43)","v":"Lola"},{"$f":"IF(COUNTRY_INFO!$T$9:$T$1000=\"MDA3 (IVM)\", COUNTRY_INFO!$T$9:$T$1000, \" \")","v":"MDA3 (IVM)"},"Octobre",44798,98556,143354,null,null,0,null,null,0,0,0,0,"-","-","-"]
[{"$f":"IF(COUNTRY_INFO!A44=0,\" \",COUNTRY_INFO!A44)","v":"Guinea"},{"$f":"IF(COUNTRY_INFO!B44=0,\" \",COUNTRY_INFO!B44)","v":"N'Zérékoré"},{"$f":"IF(COUNTRY_INFO!C44=0,\" \",COUNTRY_INFO!C44)","v":"Macenta"},{"$f":"IF(COUNTRY_INFO!$T$9:$T$1000=\"MDA3 (IVM)\", COUNTRY_INFO!$T$9:$T$1000, \" \")","v":" "},null,null,null,0,null,null,0,null,null,0,0,0,0," "," "," "]
[{"$f":"IF(COUNTRY_INFO!A45=0,\" \",COUNTRY_INFO!A45)","v":"Guinea"},{"$f":"IF(COUNTRY_INFO!B45=0,\" \",COUNTRY_INFO!B45)","v":"N'Zérékoré"},{"$f":"IF(COUNTRY_INFO!C45=0,\" \",COUNTRY_INFO!C45)","v":"N'Zérékoré"},{"$f":"IF(COUNTRY_INFO!$T$9:$T$1000=\"MDA3 (IVM)\", COUNTRY_INFO!$T$9:$T$1000, \" \")","v":"MDA3 (IVM)"},"Octobre",103652,228034,331686,null,null,0,null,null,0,0,0,0,"-","-","-"]
[{"$f":"IF(COUNTRY_INFO!A46=0,\" \",COUNTRY_INFO!A46)","v":"Guinea"},{"$f":"IF(COUNTRY_INFO!B46=0,\" \",COUNTRY_INFO!B46)","v":"N'Zérékoré"},{"$f":"IF(COUNTRY_INFO!C46=0,\" \",COUNTRY_INFO!C46)","v":"Yomou"},{"$f":"IF(COUNTRY_INFO!$T$9:$T$1000=\"MDA3 (IVM)\", COUNTRY_INFO!$T$9:$T$1000, \" \")","v":"MDA3 (IVM)"},"Octobre",29865,65702,95567,null,null,0,null,null,0,0,0,0,"-","-","-"]

{"sheet":"T1","index":5,"n_rows":46,"n_cols":19,"rows_kept":46,"cut":false,"hidden":false,"merged":[[5,6,5,10],[5,11,5,14],[5,15,5,18],[3,0,3,2],[5,0,5,2],[5,3,6,3],[5,5,6,5],[5,4,6,4]]}
["T 1 - Praziquantel (PZQ) and Albendazole (ALB) or Mebendazole (MBD)"]
["Administrative structure, population requiring PC by age group, population treated by age group and coverage"]
[]
["TOTAL",null,null,null,null,null,{"$f":"SUM(G$9:G$1000)","v":0},0,0,0,{"$f":"SUM(K$9:K$1000)","v":0},0,0,0,0,{"$f":"IF(G4<>0, IF(L4/G4*100=0, \"-\", L4/G4*100), \" \")","v":" "},{"$f":"IF(OR(I4<>0,H4<>0), IF(M4/MAX(H4,I4)*100=0, \"-\", M4/MAX(H4,I4)*100), \" \")","v":" "},{"$f":"IF(J4<>0, IF(N4/J4*100=0, \"-\", N4/J4*100), \" \")","v":" "},{"$f":"IF(K4<>0, IF(O4/K4*100=0, \"-\", O4/K4*100), \" \")","v":" "}]
[]
[null,null,null,"PC implemented","Medicine","Date","Population targeted for T1",null,null,null,null,"Population treated",null,null,null,"Programme coverage (%)"]
["Country","Province/State","District",null,null,null,"PreSAC (ALB)","SAC (ALB)","SAC (PZQ)","Adults (PZQ)","Total","PreSAC","SAC","Adults","Total","PreSAC","SAC","Adults","Total"]
[]
[{"$f":"IF(COUNTRY_INFO!A9=0,\" \",COUNTRY_INFO!A9)","v":"Guinea"},{"$f":"IF(COUNTRY_INFO!B9=0,\" \",COUNTRY_INFO!B9)","v":"Boké"},{"$f":"IF(COUNTRY_INFO!C9=0,\" \",COUNTRY_INFO!C9)","v":"Boffa"},{"$f":"IF(OR(COUNTRY_INFO!$T$9:$T$1000=\"T1 (PZQ+ALB/MBD)\",COUNTRY_INFO!$U$9:$U$1000=\"T1 (PZQ+ALB/MBD)\"), \"T1 (PZQ+ALB/MBD)\", \" \")","v":" "},null,null,null,null,null,null,{"$f":"MAX(H9:I9)+G9+J9","v":0},null,null,null,{"$f":"SUM(L9:N9)","v":0},{"$f":"IF(G9<>0, IF(L9/G9*100=0, \"-\", L9/G9*100), \" \")","v":" "},{"$f":"IF(OR(I9<>0,H9<>0), IF(M9/MAX(H9,I9)*100=0, \"-\", M9/MAX(H9,I9)*100), \" \")","v":" "},{"$f":"IF(J9<>0, IF(N9/J9*100=0, \"-\", N9/J9*100), \" \")","v":" "}," "]
[{"$f":"IF(COUNTRY_INFO!A10=0,\" \",COUNTRY_INFO!A10)","v":"Guinea"},{"$f":"IF(COUNTRY_INFO!B10=0,\" \",COUNTRY_INFO!B10)","v":"Boké"},{"$f":"IF(COUNTRY_INFO!C10=0,\" \",COUNTRY_INFO!C10)","v":"Boke"},{"$f":"IF(OR(COUNTRY_INFO!$T$9:$T$1000=\"T1 (PZQ+ALB/MBD)\",COUNTRY_INFO!$U$9:$U$1000=\"T1 (PZQ+ALB/MBD)\"), \"T1 (PZQ+ALB/MBD)\", \" \")","v":" "},null,null,null,null,null,null,{"$f":"MAX(H10:I10)+G10+J10","v":0},null,null,null,{"$f":"SUM(L10:N10)","v":0},{"$f":"IF(G10<>0, IF(L10/G10*100=0, \"-\", L10/G10*100), \" \")","v":" "},{"$f":"IF(OR(I10<>0,H10<>0), IF(M10/MAX(H10,I10)*100=0, \"-\", M10/MAX(H10,I10)*100), \" \")","v":" "},{"$f":"IF(J10<>0, IF(N10/J10*100=0, \"-\", N10/J10*100), \" \")","v":" "},{"$f":"IF(K10<>0, IF(O10/K10*100=0, \"-\", O10/K10*100), \" \")","v":" "}]
[{"$f":"IF(COUNTRY_INFO!A11=0,\" \",COUNTRY_INFO!A11)","v":"Guinea"},{"$f":"IF(COUNTRY_INFO!B11=0,\" \",COUNTRY_INFO!B11)","v":"Boké"},{"$f":"IF(COUNTRY_INFO!C11=0,\" \",COUNTRY_INFO!C11)","v":"Fria"},{"$f":"IF(OR(COUNTRY_INFO!$T$9:$T$1000=\"T1 (PZQ+ALB/MBD)\",COUNTRY_INFO!$U$9:$U$1000=\"T1 (PZQ+ALB/MBD)\"), \"T1 (PZQ+ALB/MBD)\", \" \")","v":" "},null,null,null,null,null,null,0,null,null,null,0," "," "," "," "]
[{"$f":"IF(COUNTRY_INFO!A12=0,\" \",COUNTRY_INFO!A12)","v":"Guinea"},{"$f":"IF(COUNTRY_INFO!B12=0,\" \",COUNTRY_INFO!B12)","v":"Boké"},{"$f":"IF(COUNTRY_INFO!C12=0,\" \",COUNTRY_INFO!C12)","v":"Gaoual"},{"$f":"IF(OR(COUNTRY_INFO!$T$9:$T$1000=\"T1 (PZQ+ALB/MBD)\",COUNTRY_INFO!$U$9:$U$1000=\"T1 (PZQ+ALB/MBD)\"), \"T1 (PZQ+ALB/MBD)\", \" \")","v":" "},null,null,null,null,null,null,0,null,null,null,0," "," "," "," "]
[{"$f":"IF(COUNTRY_INFO!A13=0,\" \",COUNTRY_INFO!A13)","v":"Guinea"},{"$f":"IF(COUNTRY_INFO!B13=0,\" \",COUNTRY_INFO!B13)","v":"Boké"},{"$f":"IF(COUNTRY_INFO!C13=0,\" \",COUNTRY_INFO!C13)","v":"Koundara"},{"$f":"IF(OR(COUNTRY_INFO!$T$9:$T$1000=\"T1 (PZQ+ALB/MBD)\",COUNTRY_INFO!$U$9:$U$1000=\"T1 (PZQ+ALB/MBD)\"), \"T1 (PZQ+ALB/MBD)\", \" \")","v":" "},null,null,null,null,null,null,0,null,null,null,0," "," "," "," "]
[{"$f":"IF(COUNTRY_INFO!A14=0,\" \",COUNTRY_INFO!A14)","v":"Guinea"},{"$f":"IF(COUNTRY_INFO!B14=0,\" \",COUNTRY_INFO!B14)","v":"Conakry"},{"$f":"IF(COUNTRY_INFO!C14=0,\" \",COUNTRY_INFO!C14)","v":"Dixinn"},{"$f":"IF(OR(COUNTRY_INFO!$T$9:$T$1000=\"T1 (PZQ+ALB/MBD)\",COUNTRY_INFO!$U$9:$U$1000=\"T1 (PZQ+ALB/MBD)\"), \"T1 (PZQ+ALB/MBD)\", \" \")","v":" "},null,null,null,null,null,null,0,null,null,null,0," "," "," "," "]
[{"$f":"IF(COUNTRY_INFO!A15=0,\" \",COUNTRY_INFO!A15)","v":"Guinea"},{"$f":"IF(COUNTRY_INFO!B15=0,\" \",COUNTRY_INFO!B15)","v":"Conakry"},{"$f":"IF(COUNTRY_INFO!C15=0,\" \",COUNTRY_INFO!C15)","v":"Kaloum"},{"$f":"IF(OR(COUNTRY_INFO!$T$9:$T$1000=\"T1 (PZQ+ALB/MBD)\",COUNTRY_INFO!$U$9:$U$1000=\"T1 (PZQ+ALB/MBD)\"), \"T1 (PZQ+ALB/MBD)\", \" \")","v":" "},null,null,null,null,null,null,0,null,null,null,0," "," "," "," "]
[{"$f":"IF(COUNTRY_INFO!A16=0,\" \",COUNTRY_INFO!A16)","v":"Guinea"},{"$f":"IF(COUNTRY_INFO!B16=0,\" \",COUNTRY_INFO!B16)","v":"Conakry"},{"$f":"IF(COUNTRY_INFO!C16=0,\" \",COUNTRY_INFO!C16)","v":"Matam"},{"$f":"IF(OR(COUNTRY_INFO!$T$9:$T$1000=\"T1 (PZQ+ALB/MBD)\",COUNTRY_INFO!$U$9:$U$1000=\"T1 (PZQ+ALB/MBD)\"), \"T1 (PZQ+ALB/MBD)\", \" \")","v":" "},null,null,null,null,null,null,0,null,null,null,0," "," "," "," "]
[{"$f":"IF(COUNTRY_INFO!A17=0,\" \",COUNTRY_INFO!A17)","v":"Guinea"},{"$f":"IF(COUNTRY_INFO!B17=0,\" \",COUNTRY_INFO!B17)","v":"Conakry"},{"$f":"IF(COUNTRY_INFO!C17=0,\" \",COUNTRY_INFO!C17)","v":"Matoto"},{"$f":"IF(OR(COUNTRY_INFO!$T$9:$T$1000=\"T1 (PZQ+ALB/MBD)\",COUNTRY_INFO!$U$9:$U$1000=\"T1 (PZQ+ALB/MBD)\"), \"T1 (PZQ+ALB/MBD)\", \" \")","v":" "},null,null,null,null,null,null,0,null,null,null,0," "," "," "," "]
[{"$f":"IF(COUNTRY_INFO!A18=0,\" \",COUNTRY_INFO!A18)","v":"Guinea"},{"$f":"IF(COUNTRY_INFO!B18=0,\" \",COUNTRY_INFO!B18)","v":"Conakry"},{"$f":"IF(COUNTRY_INFO!C18=0,\" \",COUNTRY_INFO!C18)","v":"Ratoma"},{"$f":"IF(OR(COUNTRY_INFO!$T$9:$T$1000=\"T1 (PZQ+ALB/MBD)\",COUNTRY_INFO!$U$9:$U$1000=\"T1 (PZQ+ALB/MBD)\"), \"T1 (PZQ+ALB/MBD)\", \" \")","v":" "},null,null,null,null,null,null,0,null,null,null,0," "," "," "," "]
[{"$f":"IF(COUNTRY_INFO!A19=0,\" \",COUNTRY_INFO!A19)","v":"Guinea"},{"$f":"IF(COUNTRY_INFO!B19=0,\" \",COUNTRY_INFO!B19)","v":"Faranah"},{"$f":"IF(COUNTRY_INFO!C19=0,\" \",COUNTRY_INFO!C19)","v":"Dabola"},{"$f":"IF(OR(COUNTRY_INFO!$T$9:$T$1000=\"T1 (PZQ+ALB/MBD)\",COUNTRY_INFO!$U$9:$U$1000=\"T1 (PZQ+ALB/MBD)\"), \"T1 (PZQ+ALB/MBD)\", \" \")","v":" "},null,null,null,null,null,null,0,null,null,null,0," "," "," "," "]
[{"$f":"IF(COUNTRY_INFO!A20=0,\" \",COUNTRY_INFO!A20)","v":"Guinea"},{"$f":"IF(COUNTRY_INFO!B20=0,\" \",COUNTRY_INFO!B20)","v":"Faranah"},{"$f":"IF(COUNTRY_INFO!C20=0,\" \",COUNTRY_INFO!C20)","v":"Dinguiraye"},{"$f":"IF(OR(COUNTRY_INFO!$T$9:$T$1000=\"T1 (PZQ+ALB/MBD)\",COUNTRY_INFO!$U$9:$U$1000=\"T1 (PZQ+ALB/MBD)\"), \"T1 (PZQ+ALB/MBD)\", \" \")","v":" "},null,null,null,null,null,null,0,null,null,null,0," "," "," "," "]
[{"$f":"IF(COUNTRY_INFO!A21=0,\" \",COUNTRY_INFO!A21)","v":"Guinea"},{"$f":"IF(COUNTRY_INFO!B21=0,\" \",COUNTRY_INFO!B21)","v":"Faranah"},{"$f":"IF(COUNTRY_INFO!C21=0,\" \",COUNTRY_INFO!C21)","v":"Faranah"},{"$f":"IF(OR(COUNTRY_INFO!$T$9:$T$1000=\"T1 (PZQ+ALB/MBD)\",COUNTRY_INFO!$U$9:$U$1000=\"T1 (PZQ+ALB/MBD)\"), \"T1 (PZQ+ALB/MBD)\", \" \")","v":" "},null,null,null,null,null,null,0,null,null,null,0," "," "," "," "]
[{"$f":"IF(COUNTRY_INFO!A22=0,\" \",COUNTRY_INFO!A22)","v":"Guinea"},{"$f":"IF(COUNTRY_INFO!B22=0,\" \",COUNTRY_INFO!B22)","v":"Faranah"},{"$f":"IF(COUNTRY_INFO!C22=0,\" \",COUNTRY_INFO!C22)","v":"Kissidougou"},{"$f":"IF(OR(COUNTRY_INFO!$T$9:$T$1000=\"T1 (PZQ+ALB/MBD)\",COUNTRY_INFO!$U$9:$U$1000=\"T1 (PZQ+ALB/MBD)\"), \"T1 (PZQ+ALB/MBD)\", \" \")","v":" "},null,null,null,null,null,null,0,null,null,null,0," "," "," "," "]
[{"$f":"IF(COUNTRY_INFO!A23=0,\" \",COUNTRY_INFO!A23)","v":"Guinea"},{"$f":"IF(COUNTRY_INFO!B23=0,\" \",COUNTRY_INFO!B23)","v":"Kankan"},{"$f":"IF(COUNTRY_INFO!C23=0,\" \",COUNTRY_INFO!C23)","v":"Kankan"},{"$f":"IF(OR(COUNTRY_INFO!$T$9:$T$1000=\"T1 (PZQ+ALB/MBD)\",COUNTRY_INFO!$U$9:$U$1000=\"T1 (PZQ+ALB/MBD)\"), \"T1 (PZQ+ALB/MBD)\", \" \")","v":" "},null,null,null,null,null,null,0,null,null,null,0," "," "," "," "]
[{"$f":"IF(COUNTRY_INFO!A24=0,\" \",COUNTRY_INFO!A24)","v":"Guinea"},{"$f":"IF(COUNTRY_INFO!B24=0,\" \",COUNTRY_INFO!B24)","v":"Kankan"},{"$f":"IF(COUNTRY_INFO!C24=0,\" \",COUNTRY_INFO!C24)","v":"Kerouane"},{"$f":"IF(OR(COUNTRY_INFO!$T$9:$T$1000=\"T1 (PZQ+ALB/MBD)\",COUNTRY_INFO!$U$9:$U$1000=\"T1 (PZQ+ALB/MBD)\"), \"T1 (PZQ+ALB/MBD)\", \" \")","v":" "},null,null,null,null,null,null,0,null,null,null,0," "," "," "," "]
[{"$f":"IF(COUNTRY_INFO!A25=0,\" \",COUNTRY_INFO!A25)","v":"Guinea"},{"$f":"IF(COUNTRY_INFO!B25=0,\" \",COUNTRY_INFO!B25)","v":"Kankan"},{"$f":"IF(COUNTRY_INFO!C25=0,\" \",COUNTRY_INFO!C25)","v":"Kouroussa"},{"$f":"IF(OR(COUNTRY_INFO!$T$9:$T$1000=\"T1 (PZQ+ALB/MBD)\",COUNTRY_INFO!$U$9:$U$1000=\"T1 (PZQ+ALB/MBD)\"), \"T1 (PZQ+ALB/MBD)\", \" \")","v":" "},null,null,null,null,null,null,0,null,null,null,0," "," "," "," "]
[{"$f":"IF(COUNTRY_INFO!A26=0,\" \",COUNTRY_INFO!A26)","v":"Guinea"},{"$f":"IF(COUNTRY_INFO!B26=0,\" \",COUNTRY_INFO!B26)","v":"Kankan"},{"$f":"IF(COUNTRY_INFO!C26=0,\" \",COUNTRY_INFO!C26)","v":"Mandiana"},{"$f":"IF(OR(COUNTRY_INFO!$T$9:$T$1000=\"T1 (PZQ+ALB/MBD)\",COUNTRY_INFO!$U$9:$U$1000=\"T1 (PZQ+ALB/MBD)\"), \"T1 (PZQ+ALB/MBD)\", \" \")","v":" "},null,null,null,null,null,null,0,null,null,null,0," "," "," "," "]
[{"$f":"IF(COUNTRY_INFO!A27=0,\" \",COUNTRY_INFO!A27)","v":"Guinea"},{"$f":"IF(COUNTRY_INFO!B27=0,\" \",COUNTRY_INFO!B27)","v":"Kankan"},{"$f":"IF(COUNTRY_INFO!C27=0,\" \",COUNTRY_INFO!C27)","v":"Siguiri"},{"$f":"IF(OR(COUNTRY_INFO!$T$9:$T$1000=\"T1 (PZQ+ALB/MBD)\",COUNTRY_INFO!$U$9:$U$1000=\"T1 (PZQ+ALB/MBD)\"), \"T1 (PZQ+ALB/MBD)\", \" \")","v":" "},null,null,null,null,null,null,0,null,null,null,0," "," "," "," "]
[{"$f":"IF(COUNTRY_INFO!A28=0,\" \",COUNTRY_INFO!A28)","v":"Guinea"},{"$f":"IF(COUNTRY_INFO!B28=0,\" \",COUNTRY_INFO!B28)","v":"Kindia"},{"$f":"IF(COUNTRY_INFO!C28=0,\" \",COUNTRY_INFO!C28)","v":"Coyah"},{"$f":"IF(OR(COUNTRY_INFO!$T$9:$T$1000=\"T1 (PZQ+ALB/MBD)\",COUNTRY_INFO!$U$9:$U$1000=\"T1 (PZQ+ALB/MBD)\"), \"T1 (PZQ+ALB/MBD)\", \" \")","v":" "},null,null,null,null,null,null,0,null,null,null,0," "," "," "," "]
[{"$f":"IF(COUNTRY_INFO!A29=0,\" \",COUNTRY_INFO!A29)","v":"Guinea"},{"$f":"IF(COUNTRY_INFO!B29=0,\" \",COUNTRY_INFO!B29)","v":"Kindia"},{"$f":"IF(COUNTRY_INFO!C29=0,\" \",COUNTRY_INFO!C29)","v":"Dubreka"},{"$f":"IF(OR(COUNTRY_INFO!$T$9:$T$1000=\"T1 (PZQ+ALB/MBD)\",COUNTRY_INFO!$U$9:$U$1000=\"T1 (PZQ+ALB/MBD)\"), \"T1 (PZQ+ALB/MBD)\", \" \")","v":" "},null,null,null,null,null,null,0,null,null,null,0," "," "," "," "]
[{"$f":"IF(COUNTRY_INFO!A30=0,\" \",COUNTRY_INFO!A30)","v":"Guinea"},{"$f":"IF(COUNTRY_INFO!B30=0,\" \",COUNTRY_INFO!B30)","v":"Kindia"},{"$f":"IF(COUNTRY_INFO!C30=0,\" \",COUNTRY_INFO!C30)","v":"Forecariah"},{"$f":"IF(OR(COUNTRY_INFO!$T$9:$T$1000=\"T1 (PZQ+ALB/MBD)\",COUNTRY_INFO!$U$9:$U$1000=\"T1 (PZQ+ALB/MBD)\"), \"T1 (PZQ+ALB/MBD)\", \" \")","v":" "},null,null,null,null,null,null,0,null,null,null,0," "," "," "," "]
[{"$f":"IF(COUNTRY_INFO!A31=0,\" \",COUNTRY_INFO!A31)","v":"Guinea"},{"$f":"IF(COUNTRY_INFO!B31=0,\" \",COUNTRY_INFO!B31)","v":"Kindia"},{"$f":"IF(COUNTRY_INFO!C31=0,\" \",COUNTRY_INFO!C31)","v":"Kindia"},{"$f":"IF(OR(COUNTRY_INFO!$T$9:$T$1000=\"T1 (PZQ+ALB/MBD)\",COUNTRY_INFO!$U$9:$U$1000=\"T1 (PZQ+ALB/MBD)\"), \"T1 (PZQ+ALB/MBD)\", \" \")","v":" "},null,null,null,null,null,null,0,null,null,null,0," "," "," "," "]
[{"$f":"IF(COUNTRY_INFO!A32=0,\" \",COUNTRY_INFO!A32)","v":"Guinea"},{"$f":"IF(COUNTRY_INFO!B32=0,\" \",COUNTRY_INFO!B32)","v":"Kindia"},{"$f":"IF(COUNTRY_INFO!C32=0,\" \",COUNTRY_INFO!C32)","v":"Telimele"},{"$f":"IF(OR(COUNTRY_INFO!$T$9:$T$1000=\"T1 (PZQ+ALB/MBD)\",COUNTRY_INFO!$U$9:$U$1000=\"T1 (PZQ+ALB/MBD)\"), \"T1 (PZQ+ALB/MBD)\", \" \")","v":" "},null,null,null,null,null,null,0,null,null,null,0," "," "," "," "]
[{"$f":"IF(COUNTRY_INFO!A33=0,\" \",COUNTRY_INFO!A33)","v":"Guinea"},{"$f":"IF(COUNTRY_INFO!B33=0,\" \",COUNTRY_INFO!B33)","v":"Labé"},{"$f":"IF(COUNTRY_INFO!C33=0,\" \",COUNTRY_INFO!C33)","v":"Koubia"},{"$f":"IF(OR(COUNTRY_INFO!$T$9:$T$1000=\"T1 (PZQ+ALB/MBD)\",COUNTRY_INFO!$U$9:$U$1000=\"T1 (PZQ+ALB/MBD)\"), \"T1 (PZQ+ALB/MBD)\", \" \")","v":" "},null,null,null,null,null,null,0,null,null,null,0," "," "," "," "]
[{"$f":"IF(COUNTRY_INFO!A34=0,\" \",COUNTRY_INFO!A34)","v":"Guinea"},{"$f":"IF(COUNTRY_INFO!B34=0,\" \",COUNTRY_INFO!B34)","v":"Labé"},{"$f":"IF(COUNTRY_INFO!C34=0,\" \",COUNTRY_INFO!C34)","v":"Labé"},{"$f":"IF(OR(COUNTRY_INFO!$T$9:$T$1000=\"T1 (PZQ+ALB/MBD)\",COUNTRY_INFO!$U$9:$U$1000=\"T1 (PZQ+ALB/MBD)\"), \"T1 (PZQ+ALB/MBD)\", \" \")","v":" "},null,null,null,null,null,null,0,null,null,null,0," "," "," "," "]
[{"$f":"IF(COUNTRY_INFO!A35=0,\" \",COUNTRY_INFO!A35)","v":"Guinea"},{"$f":"IF(COUNTRY_INFO!B35=0,\" \",COUNTRY_INFO!B35)","v":"Labé"},{"$f":"IF(COUNTRY_INFO!C35=0,\" \",COUNTRY_INFO!C35)","v":"Lelouma"},{"$f":"IF(OR(COUNTRY_INFO!$T$9:$T$1000=\"T1 (PZQ+ALB/MBD)\",COUNTRY_INFO!$U$9:$U$1000=\"T1 (PZQ+ALB/MBD)\"), \"T1 (PZQ+ALB/MBD)\", \" \")","v":" "},null,null,null,null,null,null,0,null,null,null,0," "," "," "," "]
[{"$f":"IF(COUNTRY_INFO!A36=0,\" \",COUNTRY_INFO!A36)","v":"Guinea"},{"$f":"IF(COUNTRY_INFO!B36=0,\" \",COUNTRY_INFO!B36)","v":"Labé"},{"$f":"IF(COUNTRY_INFO!C36=0,\" \",COUNTRY_INFO!C36)","v":"Mali"},{"$f":"IF(OR(COUNTRY_INFO!$T$9:$T$1000=\"T1 (PZQ+ALB/MBD)\",COUNTRY_INFO!$U$9:$U$1000=\"T1 (PZQ+ALB/MBD)\"), \"T1 (PZQ+ALB/MBD)\", \" \")","v":" "},null,null,null,null,null,null,0,null,null,null,0," "," "," "," "]
[{"$f":"IF(COUNTRY_INFO!A37=0,\" \",COUNTRY_INFO!A37)","v":"Guinea"},{"$f":"IF(COUNTRY_INFO!B37=0,\" \",COUNTRY_INFO!B37)","v":"Labé"},{"$f":"IF(COUNTRY_INFO!C37=0,\" \",COUNTRY_INFO!C37)","v":"Tougué"},{"$f":"IF(OR(COUNTRY_INFO!$T$9:$T$1000=\"T1 (PZQ+ALB/MBD)\",COUNTRY_INFO!$U$9:$U$1000=\"T1 (PZQ+ALB/MBD)\"), \"T1 (PZQ+ALB/MBD)\", \" \")","v":" "},null,null,null,null,null,null,0,null,null,null,0," "," "," "," "]
[{"$f":"IF(COUNTRY_INFO!A38=0,\" \",COUNTRY_INFO!A38)","v":"Guinea"},{"$f":"IF(COUNTRY_INFO!B38=0,\" \",COUNTRY_INFO!B38)","v":"Mamou"},{"$f":"IF(COUNTRY_INFO!C38=0,\" \",COUNTRY_INFO!C38)","v":"Dalaba"},{"$f":"IF(OR(COUNTRY_INFO!$T$9:$T$1000=\"T1 (PZQ+ALB/MBD)\",COUNTRY_INFO!$U$9:$U$1000=\"T1 (PZQ+ALB/MBD)\"), \"T1 (PZQ+ALB/MBD)\", \" \")","v":" "},null,null,null,null,null,null,0,null,null,null,0," "," "," "," "]
[{"$f":"IF(COUNTRY_INFO!A39=0,\" \",COUNTRY_INFO!A39)","v":"Guinea"},{"$f":"IF(COUNTRY_INFO!B39=0,\" \",COUNTRY_INFO!B39)","v":"Mamou"},{"$f":"IF(COUNTRY_INFO!C39=0,\" \",COUNTRY_INFO!C39)","v":"Mamou"},{"$f":"IF(OR(COUNTRY_INFO!$T$9:$T$1000=\"T1 (PZQ+ALB/MBD)\",COUNTRY_INFO!$U$9:$U$1000=\"T1 (PZQ+ALB/MBD)\"), \"T1 (PZQ+ALB/MBD)\", \" \")","v":" "},null,null,null,null,null,null,0,null,null,null,0," "," "," "," "]
[{"$f":"IF(COUNTRY_INFO!A40=0,\" \",COUNTRY_INFO!A40)","v":"Guinea"},{"$f":"IF(COUNTRY_INFO!B40=0,\" \",COUNTRY_INFO!B40)","v":"Mamou"},{"$f":"IF(COUNTRY_INFO!C40=0,\" \",COUNTRY_INFO!C40)","v":"Pita"},{"$f":"IF(OR(COUNTRY_INFO!$T$9:$T$1000=\"T1 (PZQ+ALB/MBD)\",COUNTRY_INFO!$U$9:$U$1000=\"T1 (PZQ+ALB/MBD)\"), \"T1 (PZQ+ALB/MBD)\", \" \")","v":" "},null,null,null,null,null,null,0,null,null,null,0," "," "," "," "]
[{"$f":"IF(COUNTRY_INFO!A41=0,\" \",COUNTRY_INFO!A41)","v":"Guinea"},{"$f":"IF(COUNTRY_INFO!B41=0,\" \",COUNTRY_INFO!B41)","v":"N'Zérékoré"},{"$f":"IF(COUNTRY_INFO!C41=0,\" \",COUNTRY_INFO!C41)","v":"Beyla"},{"$f":"IF(OR(COUNTRY_INFO!$T$9:$T$1000=\"T1 (PZQ+ALB/MBD)\",COUNTRY_INFO!$U$9:$U$1000=\"T1 (PZQ+ALB/MBD)\"), \"T1 (PZQ+ALB/MBD)\", \" \")","v":" "},null,null,null,null,null,null,0,null,null,null,0," "," "," "," "]
[{"$f":"IF(COUNTRY_INFO!A42=0,\" \",COUNTRY_INFO!A42)","v":"Guinea"},{"$f":"IF(COUNTRY_INFO!B42=0,\" \",COUNTRY_INFO!B42)","v":"N'Zérékoré"},{"$f":"IF(COUNTRY_INFO!C42=0,\" \",COUNTRY_INFO!C42)","v":"Gueckedou"},{"$f":"IF(OR(COUNTRY_INFO!$T$9:$T$1000=\"T1 (PZQ+ALB/MBD)\",COUNTRY_INFO!$U$9:$U$1000=\"T1 (PZQ+ALB/MBD)\"), \"T1 (PZQ+ALB/MBD)\", \" \")","v":" "},null,null,null,null,null,null,0,null,null,null,0," "," "," "," "]
[{"$f":"IF(COUNTRY_INFO!A43=0,\" \",COUNTRY_INFO!A43)","v":"Guinea"},{"$f":"IF(COUNTRY_INFO!B43=0,\" \",COUNTRY_INFO!B43)","v":"N'Zérékoré"},{"$f":"IF(COUNTRY_INFO!C43=0,\" \",COUNTRY_INFO!C43)","v":"Lola"},{"$f":"IF(OR(COUNTRY_INFO!$T$9:$T$1000=\"T1 (PZQ+ALB/MBD)\",COUNTRY_INFO!$U$9:$U$1000=\"T1 (PZQ+ALB/MBD)\"), \"T1 (PZQ+ALB/MBD)\", \" \")","v":" "},null,null,null,null,null,null,0,null,null,null,0," "," "," "," "]
[{"$f":"IF(COUNTRY_INFO!A44=0,\" \",COUNTRY_INFO!A44)","v":"Guinea"},{"$f":"IF(COUNTRY_INFO!B44=0,\" \",COUNTRY_INFO!B44)","v":"N'Zérékoré"},{"$f":"IF(COUNTRY_INFO!C44=0,\" \",COUNTRY_INFO!C44)","v":"Macenta"},{"$f":"IF(OR(COUNTRY_INFO!$T$9:$T$1000=\"T1 (PZQ+ALB/MBD)\",COUNTRY_INFO!$U$9:$U$1000=\"T1 (PZQ+ALB/MBD)\"), \"T1 (PZQ+ALB/MBD)\", \" \")","v":" "},null,null,null,null,null,null,0,null,null,null,0," "," "," "," "]
[{"$f":"IF(COUNTRY_INFO!A45=0,\" \",COUNTRY_INFO!A45)","v":"Guinea"},{"$f":"IF(COUNTRY_INFO!B45=0,\" \",COUNTRY_INFO!B45)","v":"N'Zérékoré"},{"$f":"IF(COUNTRY_INFO!C45=0,\" \",COUNTRY_INFO!C45)","v":"N'Zérékoré"},{"$f":"IF(OR(COUNTRY_INFO!$T$9:$T$1000=\"T1 (PZQ+ALB/MBD)\",COUNTRY_INFO!$U$9:$U$1000=\"T1 (PZQ+ALB/MBD)\"), \"T1 (PZQ+ALB/MBD)\", \" \")","v":" "},null,null,null,null,null,null,0,null,null,null,0," "," "," "," "]
[{"$f":"IF(COUNTRY_INFO!A46=0,\" \",COUNTRY_INFO!A46)","v":"Guinea"},{"$f":"IF(COUNTRY_INFO!B46=0,\" \",COUNTRY_INFO!B46)","v":"N'Zérékoré"},{"$f":"IF(COUNTRY_INFO!C46=0,\" \",COUNTRY_INFO!C46)","v":"Yomou"},{"$f":"IF(OR(COUNTRY_INFO!$T$9:$T$1000=\"T1 (PZQ+ALB/MBD)\",COUNTRY_INFO!$U$9:$U$1000=\"T1 (PZQ+ALB/MBD)\"), \"T1 (PZQ+ALB/MBD)\", \" \")","v":" "},null,null,null,null,null,null,0,null,null,null,0," "," "," "," "]

{"sheet":"T2","index":6,"n_rows":46,"n_cols":17,"rows_kept":46,"cut":false,"hidden":false,"merged":[[5,5,5,8],[5,9,5,12],[5,13,5,16],[3,0,3,2],[5,0,5,2],[5,3,6,3],[5,4,6,4]]}
["T 2 - Praziquantel (PZQ) "]
["Administrative structure, population requiring PC by age group, population treated by age group and coverage"]
[]
["TOTAL",null,null,null,null,{"$f":"SUM(F$9:F$1000)","v":0},1240823,0,1240823,0,1147335,0,1147335,{"$f":"IF(F4<>0, IF(J4/F4*100=0, \"-\", J4/F4*100), \" \")","v":" "},{"$f":"IF(G4<>0, IF(K4/G4*100=0, \"-\", K4/G4*100), \" \")","v":92.465645785095859},{"$f":"IF(H4<>0, IF(L4/H4*100=0, \"-\", L4/H4*100), \" \")","v":" "},{"$f":"IF(I4<>0, IF(M4/I4*100=0, \"-\", M4/I4*100), \" \")","v":92.465645785095859}]
[]
[null,null,null,"PC implemented","Date","Population targeted for T2",null,null,null,"Population treated",null,null,null,"Programme coverage (%)"]
["Country","Province/State","District",null,null,"PreSAC","SAC","Adults","Total","PreSAC","SAC","Adults","Total","PreSAC","SAC","Adults","Total"]
[]
[{"$f":"IF(COUNTRY_INFO!A9=0,\" \",COUNTRY_INFO!A9)","v":"Guinea"},{"$f":"IF(COUNTRY_INFO!B9=0,\" \",COUNTRY_INFO!B9)","v":"Boké"},{"$f":"IF(COUNTRY_INFO!C9=0,\" \",COUNTRY_INFO!C9)","v":"Boffa"},{"$f":"IF(COUNTRY_INFO!$U$9:$U$1000=\"T2 (PZQ)\", COUNTRY_INFO!$U$9:$U$1000, \" \")","v":" "},null,null,null,null,{"$f":"SUM(F9:H9)","v":0},null,null,null,{"$f":"SUM(J9:L9)","v":0},{"$f":"IF(F9<>0, IF(J9/F9*100=0, \"-\", J9/F9*100), \" \")","v":" "}," "," "," "]
[{"$f":"IF(COUNTRY_INFO!A10=0,\" \",COUNTRY_INFO!A10)","v":"Guinea"},{"$f":"IF(COUNTRY_INFO!B10=0,\" \",COUNTRY_INFO!B10)","v":"Boké"},{"$f":"IF(COUNTRY_INFO!C10=0,\" \",COUNTRY_INFO!C10)","v":"Boke"},{"$f":"IF(COUNTRY_INFO!$U$9:$U$1000=\"T2 (PZQ)\", COUNTRY_INFO!$U$9:$U$1000, \" \")","v":" "},null,null,null,null,{"$f":"SUM(F10:H10)","v":0},null,null,null,{"$f":"SUM(J10:L10)","v":0},{"$f":"IF(F10<>0, IF(J10/F10*100=0, \"-\", J10/F10*100), \" \")","v":" "},{"$f":"IF(G10<>0, IF(K10/G10*100=0, \"-\", K10/G10*100), \" \")","v":" "},{"$f":"IF(H10<>0, IF(L10/H10*100=0, \"-\", L10/H10*100), \" \")","v":" "},{"$f":"IF(I10<>0, IF(M10/I10*100=0, \"-\", M10/I10*100), \" \")","v":" "}]
[{"$f":"IF(COUNTRY_INFO!A11=0,\" \",COUNTRY_INFO!A11)","v":"Guinea"},{"$f":"IF(COUNTRY_INFO!B11=0,\" \",COUNTRY_INFO!B11)","v":"Boké"},{"$f":"IF(COUNTRY_INFO!C11=0,\" \",COUNTRY_INFO!C11)","v":"Fria"},{"$f":"IF(COUNTRY_INFO!$U$9:$U$1000=\"T2 (PZQ)\", COUNTRY_INFO!$U$9:$U$1000, \" \")","v":" "},null,null,null,null,0,null,null,null,0," "," "," "," "]
[{"$f":"IF(COUNTRY_INFO!A12=0,\" \",COUNTRY_INFO!A12)","v":"Guinea"},{"$f":"IF(COUNTRY_INFO!B12=0,\" \",COUNTRY_INFO!B12)","v":"Boké"},{"$f":"IF(COUNTRY_INFO!C12=0,\" \",COUNTRY_INFO!C12)","v":"Gaoual"},{"$f":"IF(COUNTRY_INFO!$U$9:$U$1000=\"T2 (PZQ)\", COUNTRY_INFO!$U$9:$U$1000, \" \")","v":"T2 (PZQ)"},"Mai",null,50556,null,50556,null,48184,null,48184," ",95.308173114961619," ",95.308173114961619]
[{"$f":"IF(COUNTRY_INFO!A13=0,\" \",COUNTRY_INFO!A13)","v":"Guinea"},{"$f":"IF(COUNTRY_INFO!B13=0,\" \",COUNTRY_INFO!B13)","v":"Boké"},{"$f":"IF(COUNTRY_INFO!C13=0,\" \",COUNTRY_INFO!C13)","v":"Koundara"},{"$f":"IF(COUNTRY_INFO!$U$9:$U$1000=\"T2 (PZQ)\", COUNTRY_INFO!$U$9:$U$1000, \" \")","v":"T2 (PZQ)"},"Mai",null,33939,null,33939,null,32854,null,32854," ",96.803087892984479," ",96.803087892984479]
[{"$f":"IF(COUNTRY_INFO!A14=0,\" \",COUNTRY_INFO!A14)","v":"Guinea"},{"$f":"IF(COUNTRY_INFO!B14=0,\" \",COUNTRY_INFO!B14)","v":"Conakry"},{"$f":"IF(COUNTRY_INFO!C14=0,\" \",COUNTRY_INFO!C14)","v":"Dixinn"},{"$f":"IF(COUNTRY_INFO!$U$9:$U$1000=\"T2 (PZQ)\", COUNTRY_INFO!$U$9:$U$1000, \" \")","v":" "},null,null,null,null,0,null,null,null,0," "," "," "," "]
[{"$f":"IF(COUNTRY_INFO!A15=0,\" \",COUNTRY_INFO!A15)","v":"Guinea"},{"$f":"IF(COUNTRY_INFO!B15=0,\" \",COUNTRY_INFO!B15)","v":"Conakry"},{"$f":"IF(COUNTRY_INFO!C15=0,\" \",COUNTRY_INFO!C15)","v":"Kaloum"},{"$f":"IF(COUNTRY_INFO!$U$9:$U$1000=\"T2 (PZQ)\", COUNTRY_INFO!$U$9:$U$1000, \" \")","v":" "},null,null,null,null,0,null,null,null,0," "," "," "," "]
[{"$f":"IF(COUNTRY_INFO!A16=0,\" \",COUNTRY_INFO!A16)","v":"Guinea"},{"$f":"IF(COUNTRY_INFO!B16=0,\" \",COUNTRY_INFO!B16)","v":"Conakry"},{"$f":"IF(COUNTRY_INFO!C16=0,\" \",COUNTRY_INFO!C16)","v":"Matam"},{"$f":"IF(COUNTRY_INFO!$U$9:$U$1000=\"T2 (PZQ)\", COUNTRY_INFO!$U$9:$U$1000, \" \")","v":" "},null,null,null,null,0,null,null,null,0," "," "," "," "]
[{"$f":"IF(COUNTRY_INFO!A17=0,\" \",COUNTRY_INFO!A17)","v":"Guinea"},{"$f":"IF(COUNTRY_INFO!B17=0,\" \",COUNTRY_INFO!B17)","v":"Conakry"},{"$f":"IF(COUNTRY_INFO!C17=0,\" \",COUNTRY_INFO!C17)","v":"Matoto"},{"$f":"IF(COUNTRY_INFO!$U$9:$U$1000=\"T2 (PZQ)\", COUNTRY_INFO!$U$9:$U$1000, \" \")","v":" "},null,null,null,null,0,null,null,null,0," "," "," "," "]
[{"$f":"IF(COUNTRY_INFO!A18=0,\" \",COUNTRY_INFO!A18)","v":"Guinea"},{"$f":"IF(COUNTRY_INFO!B18=0,\" \",COUNTRY_INFO!B18)","v":"Conakry"},{"$f":"IF(COUNTRY_INFO!C18=0,\" \",COUNTRY_INFO!C18)","v":"Ratoma"},{"$f":"IF(COUNTRY_INFO!$U$9:$U$1000=\"T2 (PZQ)\", COUNTRY_INFO!$U$9:$U$1000, \" \")","v":" "},null,null,null,null,0,null,null,null,0," "," "," "," "]
[{"$f":"IF(COUNTRY_INFO!A19=0,\" \",COUNTRY_INFO!A19)","v":"Guinea"},{"$f":"IF(COUNTRY_INFO!B19=0,\" \",COUNTRY_INFO!B19)","v":"Faranah"},{"$f":"IF(COUNTRY_INFO!C19=0,\" \",COUNTRY_INFO!C19)","v":"Dabola"},{"$f":"IF(COUNTRY_INFO!$U$9:$U$1000=\"T2 (PZQ)\", COUNTRY_INFO!$U$9:$U$1000, \" \")","v":" "},null,null,null,null,0,null,null,null,0," "," "," "," "]
[{"$f":"IF(COUNTRY_INFO!A20=0,\" \",COUNTRY_INFO!A20)","v":"Guinea"},{"$f":"IF(COUNTRY_INFO!B20=0,\" \",COUNTRY_INFO!B20)","v":"Faranah"},{"$f":"IF(COUNTRY_INFO!C20=0,\" \",COUNTRY_INFO!C20)","v":"Dinguiraye"},{"$f":"IF(COUNTRY_INFO!$U$9:$U$1000=\"T2 (PZQ)\", COUNTRY_INFO!$U$9:$U$1000, \" \")","v":"T2 (PZQ)"},"Octobre",null,51302,null,51302,null,50864,null,50864," ",99.146232115706994," ",99.146232115706994]
[{"$f":"IF(COUNTRY_INFO!A21=0,\" \",COUNTRY_INFO!A21)","v":"Guinea"},{"$f":"IF(COUNTRY_INFO!B21=0,\" \",COUNTRY_INFO!B21)","v":"Faranah"},{"$f":"IF(COUNTRY_INFO!C21=0,\" \",COUNTRY_INFO!C21)","v":"Faranah"},{"$f":"IF(COUNTRY_INFO!$U$9:$U$1000=\"T2 (PZQ)\", COUNTRY_INFO!$U$9:$U$1000, \" \")","v":"T2 (PZQ)"},"Octobre",null,73158,null,73158,null,86182,null,86182," ",117.8025643128571," ",117.8025643128571]
[{"$f":"IF(COUNTRY_INFO!A22=0,\" \",COUNTRY_INFO!A22)","v":"Guinea"},{"$f":"IF(COUNTRY_INFO!B22=0,\" \",COUNTRY_INFO!B22)","v":"Faranah"},{"$f":"IF(COUNTRY_INFO!C22=0,\" \",COUNTRY_INFO!C22)","v":"Kissidougou"},{"$f":"IF(COUNTRY_INFO!$U$9:$U$1000=\"T2 (PZQ)\", COUNTRY_INFO!$U$9:$U$1000, \" \")","v":"T2 (PZQ)"},"Octobre",null,74101,null,74101,null,84950,null,84950," ",114.64082805900055," ",114.64082805900055]
[{"$f":"IF(COUNTRY_INFO!A23=0,\" \",COUNTRY_INFO!A23)","v":"Guinea"},{"$f":"IF(COUNTRY_INFO!B23=0,\" \",COUNTRY_INFO!B23)","v":"Kankan"},{"$f":"IF(COUNTRY_INFO!C23=0,\" \",COUNTRY_INFO!C23)","v":"Kankan"},{"$f":"IF(COUNTRY_INFO!$U$9:$U$1000=\"T2 (PZQ)\", COUNTRY_INFO!$U$9:$U$1000, \" \")","v":"T2 (PZQ)"},"Octobre",null,123604,null,123604,null,100582,null,100582," ",81.374389178343748," ",81.374389178343748]
[{"$f":"IF(COUNTRY_INFO!A24=0,\" \",COUNTRY_INFO!A24)","v":"Guinea"},{"$f":"IF(COUNTRY_INFO!B24=0,\" \",COUNTRY_INFO!B24)","v":"Kankan"},{"$f":"IF(COUNTRY_INFO!C24=0,\" \",COUNTRY_INFO!C24)","v":"Kerouane"},{"$f":"IF(COUNTRY_INFO!$U$9:$U$1000=\"T2 (PZQ)\", COUNTRY_INFO!$U$9:$U$1000, \" \")","v":"T2 (PZQ)"},"Octobre",null,54195,null,54195,null,53100,null,53100," ",97.979518405756991," ",97.979518405756991]
[{"$f":"IF(COUNTRY_INFO!A25=0,\" \",COUNTRY_INFO!A25)","v":"Guinea"},{"$f":"IF(COUNTRY_INFO!B25=0,\" \",COUNTRY_INFO!B25)","v":"Kankan"},{"$f":"IF(COUNTRY_INFO!C25=0,\" \",COUNTRY_INFO!C25)","v":"Kouroussa"},{"$f":"IF(COUNTRY_INFO!$U$9:$U$1000=\"T2 (PZQ)\", COUNTRY_INFO!$U$9:$U$1000, \" \")","v":"T2 (PZQ)"},"Octobre",null,70145,null,70145,null,68686,null,68686," ",97.920022809893794," ",97.920022809893794]
[{"$f":"IF(COUNTRY_INFO!A26=0,\" \",COUNTRY_INFO!A26)","v":"Guinea"},{"$f":"IF(COUNTRY_INFO!B26=0,\" \",COUNTRY_INFO!B26)","v":"Kankan"},{"$f":"IF(COUNTRY_INFO!C26=0,\" \",COUNTRY_INFO!C26)","v":"Mandiana"},{"$f":"IF(COUNTRY_INFO!$U$9:$U$1000=\"T2 (PZQ)\", COUNTRY_INFO!$U$9:$U$1000, \" \")","v":" "},null,null,null,null,0,null,null,null,0," "," "," "," "]
[{"$f":"IF(COUNTRY_INFO!A27=0,\" \",COUNTRY_INFO!A27)","v":"Guinea"},{"$f":"IF(COUNTRY_INFO!B27=0,\" \",COUNTRY_INFO!B27)","v":"Kankan"},{"$f":"IF(COUNTRY_INFO!C27=0,\" \",COUNTRY_INFO!C27)","v":"Siguiri"},{"$f":"IF(COUNTRY_INFO!$U$9:$U$1000=\"T2 (PZQ)\", COUNTRY_INFO!$U$9:$U$1000, \" \")","v":"T2 (PZQ)"},"Octobre",null,179391,null,179391,null,189917,null,189917," ",105.86762992569302," ",105.86762992569302]
[{"$f":"IF(COUNTRY_INFO!A28=0,\" \",COUNTRY_INFO!A28)","v":"Guinea"},{"$f":"IF(COUNTRY_INFO!B28=0,\" \",COUNTRY_INFO!B28)","v":"Kindia"},{"$f":"IF(COUNTRY_INFO!C28=0,\" \",COUNTRY_INFO!C28)","v":"Coyah"},{"$f":"IF(COUNTRY_INFO!$U$9:$U$1000=\"T2 (PZQ)\", COUNTRY_INFO!$U$9:$U$1000, \" \")","v":" "},null,null,null,null,0,null,null,null,0," "," "," "," "]
[{"$f":"IF(COUNTRY_INFO!A29=0,\" \",COUNTRY_INFO!A29)","v":"Guinea"},{"$f":"IF(COUNTRY_INFO!B29=0,\" \",COUNTRY_INFO!B29)","v":"Kindia"},{"$f":"IF(COUNTRY_INFO!C29=0,\" \",COUNTRY_INFO!C29)","v":"Dubreka"},{"$f":"IF(COUNTRY_INFO!$U$9:$U$1000=\"T2 (PZQ)\", COUNTRY_INFO!$U$9:$U$1000, \" \")","v":" "},null,null,null,null,0,null,null,null,0," "," "," "," "]
[{"$f":"IF(COUNTRY_INFO!A30=0,\" \",COUNTRY_INFO!A30)","v":"Guinea"},{"$f":"IF(COUNTRY_INFO!B30=0,\" \",COUNTRY_INFO!B30)","v":"Kindia"},{"$f":"IF(COUNTRY_INFO!C30=0,\" \",COUNTRY_INFO!C30)","v":"Forecariah"},{"$f":"IF(COUNTRY_INFO!$U$9:$U$1000=\"T2 (PZQ)\", COUNTRY_INFO!$U$9:$U$1000, \" \")","v":" "},null,null,null,null,0,null,null,null,0," "," "," "," "]
[{"$f":"IF(COUNTRY_INFO!A31=0,\" \",COUNTRY_INFO!A31)","v":"Guinea"},{"$f":"IF(COUNTRY_INFO!B31=0,\" \",COUNTRY_INFO!B31)","v":"Kindia"},{"$f":"IF(COUNTRY_INFO!C31=0,\" \",COUNTRY_INFO!C31)","v":"Kindia"},{"$f":"IF(COUNTRY_INFO!$U$9:$U$1000=\"T2 (PZQ)\", COUNTRY_INFO!$U$9:$U$1000, \" \")","v":" "},"Octobre",null,114793,null,114793,null,null,null,0," ","-"," ","-"]
[{"$f":"IF(COUNTRY_INFO!A32=0,\" \",COUNTRY_INFO!A32)","v":"Guinea"},{"$f":"IF(COUNTRY_INFO!B32=0,\" \",COUNTRY_INFO!B32)","v":"Kindia"},{"$f":"IF(COUNTRY_INFO!C32=0,\" \",COUNTRY_INFO!C32)","v":"Telimele"},{"$f":"IF(COUNTRY_INFO!$U$9:$U$1000=\"T2 (PZQ)\", COUNTRY_INFO!$U$9:$U$1000, \" \")","v":" "},null,null,null,null,0,null,null,null,0," "," "," "," "]
[{"$f":"IF(COUNTRY_INFO!A33=0,\" \",COUNTRY_INFO!A33)","v":"Guinea"},{"$f":"IF(COUNTRY_INFO!B33=0,\" \",COUNTRY_INFO!B33)","v":"Labé"},{"$f":"IF(COUNTRY_INFO!C33=0,\" \",COUNTRY_INFO!C33)","v":"Koubia"},{"$f":"IF(COUNTRY_INFO!$U$9:$U$1000=\"T2 (PZQ)\", COUNTRY_INFO!$U$9:$U$1000, \" \")","v":"T2 (PZQ)"},"Octobre",null,26157,null,26157,null,25870,null,25870," ",98.902779370722939," ",98.902779370722939]
[{"$f":"IF(COUNTRY_INFO!A34=0,\" \",COUNTRY_INFO!A34)","v":"Guinea"},{"$f":"IF(COUNTRY_INFO!B34=0,\" \",COUNTRY_INFO!B34)","v":"Labé"},{"$f":"IF(COUNTRY_INFO!C34=0,\" \",COUNTRY_INFO!C34)","v":"Labé"},{"$f":"IF(COUNTRY_INFO!$U$9:$U$1000=\"T2 (PZQ)\", COUNTRY_INFO!$U$9:$U$1000, \" \")","v":" "},null,null,null,null,0,null,null,null,0," "," "," "," "]
[{"$f":"IF(COUNTRY_INFO!A35=0,\" \",COUNTRY_INFO!A35)","v":"Guinea"},{"$f":"IF(COUNTRY_INFO!B35=0,\" \",COUNTRY_INFO!B35)","v":"Labé"},{"$f":"IF(COUNTRY_INFO!C35=0,\" \",COUNTRY_INFO!C35)","v":"Lelouma"},{"$f":"IF(COUNTRY_INFO!$U$9:$U$1000=\"T2 (PZQ)\", COUNTRY_INFO!$U$9:$U$1000, \" \")","v":"T2 (PZQ)"},"Mai",null,42581,null,42581,null,42850,null,42850," ",100.6317371597661," ",100.6317371597661]
[{"$f":"IF(COUNTRY_INFO!A36=0,\" \",COUNTRY_INFO!A36)","v":"Guinea"},{"$f":"IF(COUNTRY_INFO!B36=0,\" \",COUNTRY_INFO!B36)","v":"Labé"},{"$f":"IF(COUNTRY_INFO!C36=0,\" \",COUNTRY_INFO!C36)","v":"Mali"},{"$f":"IF(COUNTRY_INFO!$U$9:$U$1000=\"T2 (PZQ)\", COUNTRY_INFO!$U$9:$U$1000, \" \")","v":" "},null,null,null,null,0,null,null,null,0," "," "," "," "]
[{"$f":"IF(COUNTRY_INFO!A37=0,\" \",COUNTRY_INFO!A37)","v":"Guinea"},{"$f":"IF(COUNTRY_INFO!B37=0,\" \",COUNTRY_INFO!B37)","v":"Labé"},{"$f":"IF(COUNTRY_INFO!C37=0,\" \",COUNTRY_INFO!C37)","v":"Tougué"},{"$f":"IF(COUNTRY_INFO!$U$9:$U$1000=\"T2 (PZQ)\", COUNTRY_INFO!$U$9:$U$1000, \" \")","v":" "},null,null,null,null,0,null,null,null,0," "," "," "," "]
[{"$f":"IF(COUNTRY_INFO!A38=0,\" \",COUNTRY_INFO!A38)","v":"Guinea"},{"$f":"IF(COUNTRY_INFO!B38=0,\" \",COUNTRY_INFO!B38)","v":"Mamou"},{"$f":"IF(COUNTRY_INFO!C38=0,\" \",COUNTRY_INFO!C38)","v":"Dalaba"},{"$f":"IF(COUNTRY_INFO!$U$9:$U$1000=\"T2 (PZQ)\", COUNTRY_INFO!$U$9:$U$1000, \" \")","v":" "},null,null,null,null,0,null,null,null,0," "," "," "," "]
[{"$f":"IF(COUNTRY_INFO!A39=0,\" \",COUNTRY_INFO!A39)","v":"Guinea"},{"$f":"IF(COUNTRY_INFO!B39=0,\" \",COUNTRY_INFO!B39)","v":"Mamou"},{"$f":"IF(COUNTRY_INFO!C39=0,\" \",COUNTRY_INFO!C39)","v":"Mamou"},{"$f":"IF(COUNTRY_INFO!$U$9:$U$1000=\"T2 (PZQ)\", COUNTRY_INFO!$U$9:$U$1000, \" \")","v":"T2 (PZQ)"},"Octobre",null,83293,null,83293,null,109018,null,109018," ",130.88494831498446," ",130.88494831498446]
[{"$f":"IF(COUNTRY_INFO!A40=0,\" \",COUNTRY_INFO!A40)","v":"Guinea"},{"$f":"IF(COUNTRY_INFO!B40=0,\" \",COUNTRY_INFO!B40)","v":"Mamou"},{"$f":"IF(COUNTRY_INFO!C40=0,\" \",COUNTRY_INFO!C40)","v":"Pita"},{"$f":"IF(COUNTRY_INFO!$U$9:$U$1000=\"T2 (PZQ)\", COUNTRY_INFO!$U$9:$U$1000, \" \")","v":" "},null,null,null,null,0,null,null,null,0," "," "," "," "]
[{"$f":"IF(COUNTRY_INFO!A41=0,\" \",COUNTRY_INFO!A41)","v":"Guinea"},{"$f":"IF(COUNTRY_INFO!B41=0,\" \",COUNTRY_INFO!B41)","v":"N'Zérékoré"},{"$f":"IF(COUNTRY_INFO!C41=0,\" \",COUNTRY_INFO!C41)","v":"Beyla"},{"$f":"IF(COUNTRY_INFO!$U$9:$U$1000=\"T2 (PZQ)\", COUNTRY_INFO!$U$9:$U$1000, \" \")","v":"T2 (PZQ)"},"Mai",null,85147,null,85147,null,89742,null,89742," ",105.39654949675268," ",105.39654949675268]
[{"$f":"IF(COUNTRY_INFO!A42=0,\" \",COUNTRY_INFO!A42)","v":"Guinea"},{"$f":"IF(COUNTRY_INFO!B42=0,\" \",COUNTRY_INFO!B42)","v":"N'Zérékoré"},{"$f":"IF(COUNTRY_INFO!C42=0,\" \",COUNTRY_INFO!C42)","v":"Gueckedou"},{"$f":"IF(COUNTRY_INFO!$U$9:$U$1000=\"T2 (PZQ)\", COUNTRY_INFO!$U$9:$U$1000, \" \")","v":"T2 (PZQ)"},"Mai",null,75885,null,75885,null,76668,null,76668," ",101.03182447123937," ",101.03182447123937]
[{"$f":"IF(COUNTRY_INFO!A43=0,\" \",COUNTRY_INFO!A43)","v":"Guinea"},{"$f":"IF(COUNTRY_INFO!B43=0,\" \",COUNTRY_INFO!B43)","v":"N'Zérékoré"},{"$f":"IF(COUNTRY_INFO!C43=0,\" \",COUNTRY_INFO!C43)","v":"Lola"},{"$f":"IF(COUNTRY_INFO!$U$9:$U$1000=\"T2 (PZQ)\", COUNTRY_INFO!$U$9:$U$1000, \" \")","v":" "},null,null,null,null,0,null,null,null,0," "," "," "," "]
[{"$f":"IF(COUNTRY_INFO!A44=0,\" \",COUNTRY_INFO!A44)","v":"Guinea"},{"$f":"IF(COUNTRY_INFO!B44=0,\" \",COUNTRY_INFO!B44)","v":"N'Zérékoré"},{"$f":"IF(COUNTRY_INFO!C44=0,\" \",COUNTRY_INFO!C44)","v":"Macenta"},{"$f":"IF(COUNTRY_INFO!$U$9:$U$1000=\"T2 (PZQ)\", COUNTRY_INFO!$U$9:$U$1000, \" \")","v":"T2 (PZQ)"},"Mai",null,72711,null,72711,null,87868,null,87868," ",120.84553918939362," ",120.84553918939362]
[{"$f":"IF(COUNTRY_INFO!A45=0,\" \",COUNTRY_INFO!A45)","v":"Guinea"},{"$f":"IF(COUNTRY_INFO!B45=0,\" \",COUNTRY_INFO!B45)","v":"N'Zérékoré"},{"$f":"IF(COUNTRY_INFO!C45=0,\" \",COUNTRY_INFO!C45)","v":"N'Zérékoré"},{"$f":"IF(COUNTRY_INFO!$U$9:$U$1000=\"T2 (PZQ)\", COUNTRY_INFO!$U$9:$U$1000, \" \")","v":" "},null,null,null,null,0,null,null,null,0," "," "," "," "]
[{"$f":"IF(COUNTRY_INFO!A46=0,\" \",COUNTRY_INFO!A46)","v":"Guinea"},{"$f":"IF(COUNTRY_INFO!B46=0,\" \",COUNTRY_INFO!B46)","v":"N'Zérékoré"},{"$f":"IF(COUNTRY_INFO!C46=0,\" \",COUNTRY_INFO!C46)","v":"Yomou"},{"$f":"IF(COUNTRY_INFO!$U$9:$U$1000=\"T2 (PZQ)\", COUNTRY_INFO!$U$9:$U$1000, \" \")","v":" "},"Octobre",null,29865,null,29865,null,null,null,0," ","-"," ","-"]

{"sheet":"T3_R1","index":7,"n_rows":46,"n_cols":18,"rows_kept":46,"cut":false,"hidden":false,"merged":[[5,6,5,9],[5,10,5,13],[5,14,5,17],[3,0,3,2],[5,0,5,2],[5,3,6,3],[5,5,6,5],[5,4,6,4]]}
["T 3 - Albendazole (ALB) or Mebendazole (MBD) - Round 1"]
["Administrative structure, population requiring PC by age group, population treated by age group and coverage"]
[]
["TOTAL",null,null,null,null,null,{"$f":"SUM(G$9:G$1000)","v":0},423583,0,423583,0,0,0,0,{"$f":"IF(G4<>0, IF(K4/G4*100=0, \"-\", K4/G4*100), \" \")","v":" "},{"$f":"IF(H4<>0, IF(L4/H4*100=0, \"-\", L4/H4*100), \" \")","v":"-"},{"$f":"IF(I4<>0, IF(M4/I4*100=0, \"-\", M4/I4*100), \" \")","v":" "},{"$f":"IF(J4<>0, IF(N4/J4*100=0, \"-\", N4/J4*100), \" \")","v":"-"}]
[]
[null,null,null,"PC implemented","Medicine","Date","Population targeted for T3",null,null,null,"Population treated",null,null,null,"Programme coverage (%)"]
["Country","Province/State","District",null,null,null,"PreSAC","SAC","Adults","Total","PreSAC","SAC","Adults","Total","PreSAC","SAC","Adults","Total"]
[]
[{"$f":"IF(COUNTRY_INFO!A9=0,\" \",COUNTRY_INFO!A9)","v":"Guinea"},{"$f":"IF(COUNTRY_INFO!B9=0,\" \",COUNTRY_INFO!B9)","v":"Boké"},{"$f":"IF(COUNTRY_INFO!C9=0,\" \",COUNTRY_INFO!C9)","v":"Boffa"},{"$f":"IF(OR(COUNTRY_INFO!$T$9:$T$1000=\"T3 (ALB/MBD)\",COUNTRY_INFO!$U$9:$U$1000=\"T3 (ALB/MBD)\"), \"T3 (ALB/MBD)\", \" \")","v":" "},null,null,null,null,null,{"$f":"SUM(G9:I9)","v":0},null,null,null,{"$f":"SUM(K9:M9)","v":0},{"$f":"IF(G9<>0, IF(K9/G9*100=0, \"-\", K9/G9*100), \" \")","v":" "}," "," "," "]
[{"$f":"IF(COUNTRY_INFO!A10=0,\" \",COUNTRY_INFO!A10)","v":"Guinea"},{"$f":"IF(COUNTRY_INFO!B10=0,\" \",COUNTRY_INFO!B10)","v":"Boké"},{"$f":"IF(COUNTRY_INFO!C10=0,\" \",COUNTRY_INFO!C10)","v":"Boke"},{"$f":"IF(OR(COUNTRY_INFO!$T$9:$T$1000=\"T3 (ALB/MBD)\",COUNTRY_INFO!$U$9:$U$1000=\"T3 (ALB/MBD)\"), \"T3 (ALB/MBD)\", \" \")","v":" "},null,null,null,null,null,{"$f":"SUM(G10:I10)","v":0},null,null,null,{"$f":"SUM(K10:M10)","v":0},{"$f":"IF(G10<>0, IF(K10/G10*100=0, \"-\", K10/G10*100), \" \")","v":" "},{"$f":"IF(H10<>0, IF(L10/H10*100=0, \"-\", L10/H10*100), \" \")","v":" "},{"$f":"IF(I10<>0, IF(M10/I10*100=0, \"-\", M10/I10*100), \" \")","v":" "},{"$f":"IF(J10<>0, IF(N10/J10*100=0, \"-\", N10/J10*100), \" \")","v":" "}]
[{"$f":"IF(COUNTRY_INFO!A11=0,\" \",COUNTRY_INFO!A11)","v":"Guinea"},{"$f":"IF(COUNTRY_INFO!B11=0,\" \",COUNTRY_INFO!B11)","v":"Boké"},{"$f":"IF(COUNTRY_INFO!C11=0,\" \",COUNTRY_INFO!C11)","v":"Fria"},{"$f":"IF(OR(COUNTRY_INFO!$T$9:$T$1000=\"T3 (ALB/MBD)\",COUNTRY_INFO!$U$9:$U$1000=\"T3 (ALB/MBD)\"), \"T3 (ALB/MBD)\", \" \")","v":" "},null,null,null,null,null,0,null,null,null,0," "," "," "," "]
[{"$f":"IF(COUNTRY_INFO!A12=0,\" \",COUNTRY_INFO!A12)","v":"Guinea"},{"$f":"IF(COUNTRY_INFO!B12=0,\" \",COUNTRY_INFO!B12)","v":"Boké"},{"$f":"IF(COUNTRY_INFO!C12=0,\" \",COUNTRY_INFO!C12)","v":"Gaoual"},{"$f":"IF(OR(COUNTRY_INFO!$T$9:$T$1000=\"T3 (ALB/MBD)\",COUNTRY_INFO!$U$9:$U$1000=\"T3 (ALB/MBD)\"), \"T3 (ALB/MBD)\", \" \")","v":" "},null,null,null,null,null,0,null,null,null,0," "," "," "," "]
[{"$f":"IF(COUNTRY_INFO!A13=0,\" \",COUNTRY_INFO!A13)","v":"Guinea"},{"$f":"IF(COUNTRY_INFO!B13=0,\" \",COUNTRY_INFO!B13)","v":"Boké"},{"$f":"IF(COUNTRY_INFO!C13=0,\" \",COUNTRY_INFO!C13)","v":"Koundara"},{"$f":"IF(OR(COUNTRY_INFO!$T$9:$T$1000=\"T3 (ALB/MBD)\",COUNTRY_INFO!$U$9:$U$1000=\"T3 (ALB/MBD)\"), \"T3 (ALB/MBD)\", \" \")","v":" "},null,null,null,null,null,0,null,null,null,0," "," "," "," "]
[{"$f":"IF(COUNTRY_INFO!A14=0,\" \",COUNTRY_INFO!A14)","v":"Guinea"},{"$f":"IF(COUNTRY_INFO!B14=0,\" \",COUNTRY_INFO!B14)","v":"Conakry"},{"$f":"IF(COUNTRY_INFO!C14=0,\" \",COUNTRY_INFO!C14)","v":"Dixinn"},{"$f":"IF(OR(COUNTRY_INFO!$T$9:$T$1000=\"T3 (ALB/MBD)\",COUNTRY_INFO!$U$9:$U$1000=\"T3 (ALB/MBD)\"), \"T3 (ALB/MBD)\", \" \")","v":" "},null,null,null,null,null,0,null,null,null,0," "," "," "," "]
[{"$f":"IF(COUNTRY_INFO!A15=0,\" \",COUNTRY_INFO!A15)","v":"Guinea"},{"$f":"IF(COUNTRY_INFO!B15=0,\" \",COUNTRY_INFO!B15)","v":"Conakry"},{"$f":"IF(COUNTRY_INFO!C15=0,\" \",COUNTRY_INFO!C15)","v":"Kaloum"},{"$f":"IF(OR(COUNTRY_INFO!$T$9:$T$1000=\"T3 (ALB/MBD)\",COUNTRY_INFO!$U$9:$U$1000=\"T3 (ALB/MBD)\"), \"T3 (ALB/MBD)\", \" \")","v":" "},null,null,null,null,null,0,null,null,null,0," "," "," "," "]
[{"$f":"IF(COUNTRY_INFO!A16=0,\" \",COUNTRY_INFO!A16)","v":"Guinea"},{"$f":"IF(COUNTRY_INFO!B16=0,\" \",COUNTRY_INFO!B16)","v":"Conakry"},{"$f":"IF(COUNTRY_INFO!C16=0,\" \",COUNTRY_INFO!C16)","v":"Matam"},{"$f":"IF(OR(COUNTRY_INFO!$T$9:$T$1000=\"T3 (ALB/MBD)\",COUNTRY_INFO!$U$9:$U$1000=\"T3 (ALB/MBD)\"), \"T3 (ALB/MBD)\", \" \")","v":" "},null,null,null,null,null,0,null,null,null,0," "," "," "," "]
[{"$f":"IF(COUNTRY_INFO!A17=0,\" \",COUNTRY_INFO!A17)","v":"Guinea"},{"$f":"IF(COUNTRY_INFO!B17=0,\" \",COUNTRY_INFO!B17)","v":"Conakry"},{"$f":"IF(COUNTRY_INFO!C17=0,\" \",COUNTRY_INFO!C17)","v":"Matoto"},{"$f":"IF(OR(COUNTRY_INFO!$T$9:$T$1000=\"T3 (ALB/MBD)\",COUNTRY_INFO!$U$9:$U$1000=\"T3 (ALB/MBD)\"), \"T3 (ALB/MBD)\", \" \")","v":" "},null,null,null,null,null,0,null,null,null,0," "," "," "," "]
[{"$f":"IF(COUNTRY_INFO!A18=0,\" \",COUNTRY_INFO!A18)","v":"Guinea"},{"$f":"IF(COUNTRY_INFO!B18=0,\" \",COUNTRY_INFO!B18)","v":"Conakry"},{"$f":"IF(COUNTRY_INFO!C18=0,\" \",COUNTRY_INFO!C18)","v":"Ratoma"},{"$f":"IF(OR(COUNTRY_INFO!$T$9:$T$1000=\"T3 (ALB/MBD)\",COUNTRY_INFO!$U$9:$U$1000=\"T3 (ALB/MBD)\"), \"T3 (ALB/MBD)\", \" \")","v":" "},null,null,null,null,null,0,null,null,null,0," "," "," "," "]
[{"$f":"IF(COUNTRY_INFO!A19=0,\" \",COUNTRY_INFO!A19)","v":"Guinea"},{"$f":"IF(COUNTRY_INFO!B19=0,\" \",COUNTRY_INFO!B19)","v":"Faranah"},{"$f":"IF(COUNTRY_INFO!C19=0,\" \",COUNTRY_INFO!C19)","v":"Dabola"},{"$f":"IF(OR(COUNTRY_INFO!$T$9:$T$1000=\"T3 (ALB/MBD)\",COUNTRY_INFO!$U$9:$U$1000=\"T3 (ALB/MBD)\"), \"T3 (ALB/MBD)\", \" \")","v":" "},null,null,null,null,null,0,null,null,null,0," "," "," "," "]
[{"$f":"IF(COUNTRY_INFO!A20=0,\" \",COUNTRY_INFO!A20)","v":"Guinea"},{"$f":"IF(COUNTRY_INFO!B20=0,\" \",COUNTRY_INFO!B20)","v":"Faranah"},{"$f":"IF(COUNTRY_INFO!C20=0,\" \",COUNTRY_INFO!C20)","v":"Dinguiraye"},{"$f":"IF(OR(COUNTRY_INFO!$T$9:$T$1000=\"T3 (ALB/MBD)\",COUNTRY_INFO!$U$9:$U$1000=\"T3 (ALB/MBD)\"), \"T3 (ALB/MBD)\", \" \")","v":" "},null,null,null,null,null,0,null,null,null,0," "," "," "," "]
[{"$f":"IF(COUNTRY_INFO!A21=0,\" \",COUNTRY_INFO!A21)","v":"Guinea"},{"$f":"IF(COUNTRY_INFO!B21=0,\" \",COUNTRY_INFO!B21)","v":"Faranah"},{"$f":"IF(COUNTRY_INFO!C21=0,\" \",COUNTRY_INFO!C21)","v":"Faranah"},{"$f":"IF(OR(COUNTRY_INFO!$T$9:$T$1000=\"T3 (ALB/MBD)\",COUNTRY_INFO!$U$9:$U$1000=\"T3 (ALB/MBD)\"), \"T3 (ALB/MBD)\", \" \")","v":" "},"ALB","Octobre",null,73158,null,73158,null,null,null,0," ","-"," ","-"]
[{"$f":"IF(COUNTRY_INFO!A22=0,\" \",COUNTRY_INFO!A22)","v":"Guinea"},{"$f":"IF(COUNTRY_INFO!B22=0,\" \",COUNTRY_INFO!B22)","v":"Faranah"},{"$f":"IF(COUNTRY_INFO!C22=0,\" \",COUNTRY_INFO!C22)","v":"Kissidougou"},{"$f":"IF(OR(COUNTRY_INFO!$T$9:$T$1000=\"T3 (ALB/MBD)\",COUNTRY_INFO!$U$9:$U$1000=\"T3 (ALB/MBD)\"), \"T3 (ALB/MBD)\", \" \")","v":" "},"ALB","Octobre",null,74101,null,74101,null,null,null,0," ","-"," ","-"]
[{"$f":"IF(COUNTRY_INFO!A23=0,\" \",COUNTRY_INFO!A23)","v":"Guinea"},{"$f":"IF(COUNTRY_INFO!B23=0,\" \",COUNTRY_INFO!B23)","v":"Kankan"},{"$f":"IF(COUNTRY_INFO!C23=0,\" \",COUNTRY_INFO!C23)","v":"Kankan"},{"$f":"IF(OR(COUNTRY_INFO!$T$9:$T$1000=\"T3 (ALB/MBD)\",COUNTRY_INFO!$U$9:$U$1000=\"T3 (ALB/MBD)\"), \"T3 (ALB/MBD)\", \" \")","v":" "},null,null,null,null,null,0,null,null,null,0," "," "," "," "]
[{"$f":"IF(COUNTRY_INFO!A24=0,\" \",COUNTRY_INFO!A24)","v":"Guinea"},{"$f":"IF(COUNTRY_INFO!B24=0,\" \",COUNTRY_INFO!B24)","v":"Kankan"},{"$f":"IF(COUNTRY_INFO!C24=0,\" \",COUNTRY_INFO!C24)","v":"Kerouane"},{"$f":"IF(OR(COUNTRY_INFO!$T$9:$T$1000=\"T3 (ALB/MBD)\",COUNTRY_INFO!$U$9:$U$1000=\"T3 (ALB/MBD)\"), \"T3 (ALB/MBD)\", \" \")","v":" "},null,null,null,null,null,0,null,null,null,0," "," "," "," "]
[{"$f":"IF(COUNTRY_INFO!A25=0,\" \",COUNTRY_INFO!A25)","v":"Guinea"},{"$f":"IF(COUNTRY_INFO!B25=0,\" \",COUNTRY_INFO!B25)","v":"Kankan"},{"$f":"IF(COUNTRY_INFO!C25=0,\" \",COUNTRY_INFO!C25)","v":"Kouroussa"},{"$f":"IF(OR(COUNTRY_INFO!$T$9:$T$1000=\"T3 (ALB/MBD)\",COUNTRY_INFO!$U$9:$U$1000=\"T3 (ALB/MBD)\"), \"T3 (ALB/MBD)\", \" \")","v":" "},null,null,null,null,null,0,null,null,null,0," "," "," "," "]
[{"$f":"IF(COUNTRY_INFO!A26=0,\" \",COUNTRY_INFO!A26)","v":"Guinea"},{"$f":"IF(COUNTRY_INFO!B26=0,\" \",COUNTRY_INFO!B26)","v":"Kankan"},{"$f":"IF(COUNTRY_INFO!C26=0,\" \",COUNTRY_INFO!C26)","v":"Mandiana"},{"$f":"IF(OR(COUNTRY_INFO!$T$9:$T$1000=\"T3 (ALB/MBD)\",COUNTRY_INFO!$U$9:$U$1000=\"T3 (ALB/MBD)\"), \"T3 (ALB/MBD)\", \" \")","v":" "},null,null,null,null,null,0,null,null,null,0," "," "," "," "]
[{"$f":"IF(COUNTRY_INFO!A27=0,\" \",COUNTRY_INFO!A27)","v":"Guinea"},{"$f":"IF(COUNTRY_INFO!B27=0,\" \",COUNTRY_INFO!B27)","v":"Kankan"},{"$f":"IF(COUNTRY_INFO!C27=0,\" \",COUNTRY_INFO!C27)","v":"Siguiri"},{"$f":"IF(OR(COUNTRY_INFO!$T$9:$T$1000=\"T3 (ALB/MBD)\",COUNTRY_INFO!$U$9:$U$1000=\"T3 (ALB/MBD)\"), \"T3 (ALB/MBD)\", \" \")","v":" "},null,null,null,null,null,0,null,null,null,0," "," "," "," "]
[{"$f":"IF(COUNTRY_INFO!A28=0,\" \",COUNTRY_INFO!A28)","v":"Guinea"},{"$f":"IF(COUNTRY_INFO!B28=0,\" \",COUNTRY_INFO!B28)","v":"Kindia"},{"$f":"IF(COUNTRY_INFO!C28=0,\" \",COUNTRY_INFO!C28)","v":"Coyah"},{"$f":"IF(OR(COUNTRY_INFO!$T$9:$T$1000=\"T3 (ALB/MBD)\",COUNTRY_INFO!$U$9:$U$1000=\"T3 (ALB/MBD)\"), \"T3 (ALB/MBD)\", \" \")","v":" "},null,null,null,null,null,0,null,null,null,0," "," "," "," "]
[{"$f":"IF(COUNTRY_INFO!A29=0,\" \",COUNTRY_INFO!A29)","v":"Guinea"},{"$f":"IF(COUNTRY_INFO!B29=0,\" \",COUNTRY_INFO!B29)","v":"Kindia"},{"$f":"IF(COUNTRY_INFO!C29=0,\" \",COUNTRY_INFO!C29)","v":"Dubreka"},{"$f":"IF(OR(COUNTRY_INFO!$T$9:$T$1000=\"T3 (ALB/MBD)\",COUNTRY_INFO!$U$9:$U$1000=\"T3 (ALB/MBD)\"), \"T3 (ALB/MBD)\", \" \")","v":" "},null,null,null,null,null,0,null,null,null,0," "," "," "," "]
[{"$f":"IF(COUNTRY_INFO!A30=0,\" \",COUNTRY_INFO!A30)","v":"Guinea"},{"$f":"IF(COUNTRY_INFO!B30=0,\" \",COUNTRY_INFO!B30)","v":"Kindia"},{"$f":"IF(COUNTRY_INFO!C30=0,\" \",COUNTRY_INFO!C30)","v":"Forecariah"},{"$f":"IF(OR(COUNTRY_INFO!$T$9:$T$1000=\"T3 (ALB/MBD)\",COUNTRY_INFO!$U$9:$U$1000=\"T3 (ALB/MBD)\"), \"T3 (ALB/MBD)\", \" \")","v":" "},null,null,null,null,null,0,null,null,null,0," "," "," "," "]
[{"$f":"IF(COUNTRY_INFO!A31=0,\" \",COUNTRY_INFO!A31)","v":"Guinea"},{"$f":"IF(COUNTRY_INFO!B31=0,\" \",COUNTRY_INFO!B31)","v":"Kindia"},{"$f":"IF(COUNTRY_INFO!C31=0,\" \",COUNTRY_INFO!C31)","v":"Kindia"},{"$f":"IF(OR(COUNTRY_INFO!$T$9:$T$1000=\"T3 (ALB/MBD)\",COUNTRY_INFO!$U$9:$U$1000=\"T3 (ALB/MBD)\"), \"T3 (ALB/MBD)\", \" \")","v":" "},null,null,null,null,null,0,null,null,null,0," "," "," "," "]
[{"$f":"IF(COUNTRY_INFO!A32=0,\" \",COUNTRY_INFO!A32)","v":"Guinea"},{"$f":"IF(COUNTRY_INFO!B32=0,\" \",COUNTRY_INFO!B32)","v":"Kindia"},{"$f":"IF(COUNTRY_INFO!C32=0,\" \",COUNTRY_INFO!C32)","v":"Telimele"},{"$f":"IF(OR(COUNTRY_INFO!$T$9:$T$1000=\"T3 (ALB/MBD)\",COUNTRY_INFO!$U$9:$U$1000=\"T3 (ALB/MBD)\"), \"T3 (ALB/MBD)\", \" \")","v":" "},null,null,null,null,null,0,null,null,null,0," "," "," "," "]
[{"$f":"IF(COUNTRY_INFO!A33=0,\" \",COUNTRY_INFO!A33)","v":"Guinea"},{"$f":"IF(COUNTRY_INFO!B33=0,\" \",COUNTRY_INFO!B33)","v":"Labé"},{"$f":"IF(COUNTRY_INFO!C33=0,\" \",COUNTRY_INFO!C33)","v":"Koubia"},{"$f":"IF(OR(COUNTRY_INFO!$T$9:$T$1000=\"T3 (ALB/MBD)\",COUNTRY_INFO!$U$9:$U$1000=\"T3 (ALB/MBD)\"), \"T3 (ALB/MBD)\", \" \")","v":" "},null,null,null,null,null,0,null,null,null,0," "," "," "," "]
[{"$f":"IF(COUNTRY_INFO!A34=0,\" \",COUNTRY_INFO!A34)","v":"Guinea"},{"$f":"IF(COUNTRY_INFO!B34=0,\" \",COUNTRY_INFO!B34)","v":"Labé"},{"$f":"IF(COUNTRY_INFO!C34=0,\" \",COUNTRY_INFO!C34)","v":"Labé"},{"$f":"IF(OR(COUNTRY_INFO!$T$9:$T$1000=\"T3 (ALB/MBD)\",COUNTRY_INFO!$U$9:$U$1000=\"T3 (ALB/MBD)\"), \"T3 (ALB/MBD)\", \" \")","v":" "},null,null,null,null,null,0,null,null,null,0," "," "," "," "]
[{"$f":"IF(COUNTRY_INFO!A35=0,\" \",COUNTRY_INFO!A35)","v":"Guinea"},{"$f":"IF(COUNTRY_INFO!B35=0,\" \",COUNTRY_INFO!B35)","v":"Labé"},{"$f":"IF(COUNTRY_INFO!C35=0,\" \",COUNTRY_INFO!C35)","v":"Lelouma"},{"$f":"IF(OR(COUNTRY_INFO!$T$9:$T$1000=\"T3 (ALB/MBD)\",COUNTRY_INFO!$U$9:$U$1000=\"T3 (ALB/MBD)\"), \"T3 (ALB/MBD)\", \" \")","v":" "},"ALB","Octobre",null,42581,null,42581,null,null,null,0," ","-"," ","-"]
[{"$f":"IF(COUNTRY_INFO!A36=0,\" \",COUNTRY_INFO!A36)","v":"Guinea"},{"$f":"IF(COUNTRY_INFO!B36=0,\" \",COUNTRY_INFO!B36)","v":"Labé"},{"$f":"IF(COUNTRY_INFO!C36=0,\" \",COUNTRY_INFO!C36)","v":"Mali"},{"$f":"IF(OR(COUNTRY_INFO!$T$9:$T$1000=\"T3 (ALB/MBD)\",COUNTRY_INFO!$U$9:$U$1000=\"T3 (ALB/MBD)\"), \"T3 (ALB/MBD)\", \" \")","v":" "},null,null,null,null,null,0,null,null,null,0," "," "," "," "]
[{"$f":"IF(COUNTRY_INFO!A37=0,\" \",COUNTRY_INFO!A37)","v":"Guinea"},{"$f":"IF(COUNTRY_INFO!B37=0,\" \",COUNTRY_INFO!B37)","v":"Labé"},{"$f":"IF(COUNTRY_INFO!C37=0,\" \",COUNTRY_INFO!C37)","v":"Tougué"},{"$f":"IF(OR(COUNTRY_INFO!$T$9:$T$1000=\"T3 (ALB/MBD)\",COUNTRY_INFO!$U$9:$U$1000=\"T3 (ALB/MBD)\"), \"T3 (ALB/MBD)\", \" \")","v":" "},null,null,null,null,null,0,null,null,null,0," "," "," "," "]
[{"$f":"IF(COUNTRY_INFO!A38=0,\" \",COUNTRY_INFO!A38)","v":"Guinea"},{"$f":"IF(COUNTRY_INFO!B38=0,\" \",COUNTRY_INFO!B38)","v":"Mamou"},{"$f":"IF(COUNTRY_INFO!C38=0,\" \",COUNTRY_INFO!C38)","v":"Dalaba"},{"$f":"IF(OR(COUNTRY_INFO!$T$9:$T$1000=\"T3 (ALB/MBD)\",COUNTRY_INFO!$U$9:$U$1000=\"T3 (ALB/MBD)\"), \"T3 (ALB/MBD)\", \" \")","v":" "},null,null,null,null,null,0,null,null,null,0," "," "," "," "]
[{"$f":"IF(COUNTRY_INFO!A39=0,\" \",COUNTRY_INFO!A39)","v":"Guinea"},{"$f":"IF(COUNTRY_INFO!B39=0,\" \",COUNTRY_INFO!B39)","v":"Mamou"},{"$f":"IF(COUNTRY_INFO!C39=0,\" \",COUNTRY_INFO!C39)","v":"Mamou"},{"$f":"IF(OR(COUNTRY_INFO!$T$9:$T$1000=\"T3 (ALB/MBD)\",COUNTRY_INFO!$U$9:$U$1000=\"T3 (ALB/MBD)\"), \"T3 (ALB/MBD)\", \" \")","v":" "},null,null,null,null,null,0,null,null,null,0," "," "," "," "]
[{"$f":"IF(COUNTRY_INFO!A40=0,\" \",COUNTRY_INFO!A40)","v":"Guinea"},{"$f":"IF(COUNTRY_INFO!B40=0,\" \",COUNTRY_INFO!B40)","v":"Mamou"},{"$f":"IF(COUNTRY_INFO!C40=0,\" \",COUNTRY_INFO!C40)","v":"Pita"},{"$f":"IF(OR(COUNTRY_INFO!$T$9:$T$1000=\"T3 (ALB/MBD)\",COUNTRY_INFO!$U$9:$U$1000=\"T3 (ALB/MBD)\"), \"T3 (ALB/MBD)\", \" \")","v":" "},null,null,null,null,null,0,null,null,null,0," "," "," "," "]
[{"$f":"IF(COUNTRY_INFO!A41=0,\" \",COUNTRY_INFO!A41)","v":"Guinea"},{"$f":"IF(COUNTRY_INFO!B41=0,\" \",COUNTRY_INFO!B41)","v":"N'Zérékoré"},{"$f":"IF(COUNTRY_INFO!C41=0,\" \",COUNTRY_INFO!C41)","v":"Beyla"},{"$f":"IF(OR(COUNTRY_INFO!$T$9:$T$1000=\"T3 (ALB/MBD)\",COUNTRY_INFO!$U$9:$U$1000=\"T3 (ALB/MBD)\"), \"T3 (ALB/MBD)\", \" \")","v":" "},"ALB","Octobre",null,85147,null,85147,null,null,null,0," ","-"," ","-"]
[{"$f":"IF(COUNTRY_INFO!A42=0,\" \",COUNTRY_INFO!A42)","v":"Guinea"},{"$f":"IF(COUNTRY_INFO!B42=0,\" \",COUNTRY_INFO!B42)","v":"N'Zérékoré"},{"$f":"IF(COUNTRY_INFO!C42=0,\" \",COUNTRY_INFO!C42)","v":"Gueckedou"},{"$f":"IF(OR(COUNTRY_INFO!$T$9:$T$1000=\"T3 (ALB/MBD)\",COUNTRY_INFO!$U$9:$U$1000=\"T3 (ALB/MBD)\"), \"T3 (ALB/MBD)\", \" \")","v":" "},"ALB","Octobre",null,75885,null,75885,null,null,null,0," ","-"," ","-"]
[{"$f":"IF(COUNTRY_INFO!A43=0,\" \",COUNTRY_INFO!A43)","v":"Guinea"},{"$f":"IF(COUNTRY_INFO!B43=0,\" \",COUNTRY_INFO!B43)","v":"N'Zérékoré"},{"$f":"IF(COUNTRY_INFO!C43=0,\" \",COUNTRY_INFO!C43)","v":"Lola"},{"$f":"IF(OR(COUNTRY_INFO!$T$9:$T$1000=\"T3 (ALB/MBD)\",COUNTRY_INFO!$U$9:$U$1000=\"T3 (ALB/MBD)\"), \"T3 (ALB/MBD)\", \" \")","v":" "},null,null,null,null,null,0,null,null,null,0," "," "," "," "]
[{"$f":"IF(COUNTRY_INFO!A44=0,\" \",COUNTRY_INFO!A44)","v":"Guinea"},{"$f":"IF(COUNTRY_INFO!B44=0,\" \",COUNTRY_INFO!B44)","v":"N'Zérékoré"},{"$f":"IF(COUNTRY_INFO!C44=0,\" \",COUNTRY_INFO!C44)","v":"Macenta"},{"$f":"IF(OR(COUNTRY_INFO!$T$9:$T$1000=\"T3 (ALB/MBD)\",COUNTRY_INFO!$U$9:$U$1000=\"T3 (ALB/MBD)\"), \"T3 (ALB/MBD)\", \" \")","v":" "},"ALB","Octobre",null,72711,null,72711,null,null,null,0," ","-"," ","-"]
[{"$f":"IF(COUNTRY_INFO!A45=0,\" \",COUNTRY_INFO!A45)","v":"Guinea"},{"$f":"IF(COUNTRY_INFO!B45=0,\" \",COUNTRY_INFO!B45)","v":"N'Zérékoré"},{"$f":"IF(COUNTRY_INFO!C45=0,\" \",COUNTRY_INFO!C45)","v":"N'Zérékoré"},{"$f":"IF(OR(COUNTRY_INFO!$T$9:$T$1000=\"T3 (ALB/MBD)\",COUNTRY_INFO!$U$9:$U$1000=\"T3 (ALB/MBD)\"), \"T3 (ALB/MBD)\", \" \")","v":" "},null,null,null,null,null,0,null,null,null,0," "," "," "," "]
[{"$f":"IF(COUNTRY_INFO!A46=0,\" \",COUNTRY_INFO!A46)","v":"Guinea"},{"$f":"IF(COUNTRY_INFO!B46=0,\" \",COUNTRY_INFO!B46)","v":"N'Zérékoré"},{"$f":"IF(COUNTRY_INFO!C46=0,\" \",COUNTRY_INFO!C46)","v":"Yomou"},{"$f":"IF(OR(COUNTRY_INFO!$T$9:$T$1000=\"T3 (ALB/MBD)\",COUNTRY_INFO!$U$9:$U$1000=\"T3 (ALB/MBD)\"), \"T3 (ALB/MBD)\", \" \")","v":" "},null,null,null,null,null,0,null,null,null,0," "," "," "," "]

{"sheet":"T3_R2","index":8,"n_rows":46,"n_cols":18,"rows_kept":46,"cut":false,"hidden":false,"merged":[[5,6,5,9],[5,10,5,13],[5,14,5,17],[3,0,3,2],[5,0,5,2],[5,3,6,3],[5,5,6,5],[5,4,6,4]]}
["T 3 - Albendazole (ALB) or Mebendazole (MBD) - Round 2"]
["Administrative structure, population requiring PC by age group, population treated by age group and coverage"]
[]
["TOTAL",null,null,null,null,null,{"$f":"SUM(G$9:G$1000)","v":0},0,0,0,0,0,0,0,{"$f":"IF(G4<>0, IF(K4/G4*100=0, \"-\", K4/G4*100), \" \")","v":" "},{"$f":"IF(H4<>0, IF(L4/H4*100=0, \"-\", L4/H4*100), \" \")","v":" "},{"$f":"IF(I4<>0, IF(M4/I4*100=0, \"-\", M4/I4*100), \" \")","v":" "},{"$f":"IF(J4<>0, IF(N4/J4*100=0, \"-\", N4/J4*100), \" \")","v":" "}]
[]
[null,null,null,"PC implemented","Medicine","Date","Population targeted for T3",null,null,null,"Population treated",null,null,null,"Programme coverage (%)"]
["Country","Province/State","District",null,null,null,"PreSAC","SAC","Adults","Total","PreSAC","SAC","Adults","Total","PreSAC","SAC","Adults","Total"]
[]
[{"$f":"IF(COUNTRY_INFO!A9=0,\" \",COUNTRY_INFO!A9)","v":"Guinea"},{"$f":"IF(COUNTRY_INFO!B9=0,\" \",COUNTRY_INFO!B9)","v":"Boké"},{"$f":"IF(COUNTRY_INFO!C9=0,\" \",COUNTRY_INFO!C9)","v":"Boffa"},{"$f":"IF(AND(COUNTRY_INFO!$T$9:$T$1000=\"T3 (ALB/MBD)\",COUNTRY_INFO!$U$9:$U$1000=\"T3 (ALB/MBD)\"), \"T3 (ALB/MBD)\", \" \")","v":" "},null,null,null,null,null,{"$f":"SUM(G9:I9)","v":0},null,null,null,{"$f":"SUM(K9:M9)","v":0},{"$f":"IF(G9<>0, IF(K9/G9*100=0, \"-\", K9/G9*100), \" \")","v":" "}," "," "," "]
[{"$f":"IF(COUNTRY_INFO!A10=0,\" \",COUNTRY_INFO!A10)","v":"Guinea"},{"$f":"IF(COUNTRY_INFO!B10=0,\" \",COUNTRY_INFO!B10)","v":"Boké"},{"$f":"IF(COUNTRY_INFO!C10=0,\" \",COUNTRY_INFO!C10)","v":"Boke"},{"$f":"IF(AND(COUNTRY_INFO!$T$9:$T$1000=\"T3 (ALB/MBD)\",COUNTRY_INFO!$U$9:$U$1000=\"T3 (ALB/MBD)\"), \"T3 (ALB/MBD)\", \" \")","v":" "},null,null,null,null,null,{"$f":"SUM(G10:I10)","v":0},null,null,null,{"$f":"SUM(K10:M10)","v":0},{"$f":"IF(G10<>0, IF(K10/G10*100=0, \"-\", K10/G10*100), \" \")","v":" "},{"$f":"IF(H10<>0, IF(L10/H10*100=0, \"-\", L10/H10*100), \" \")","v":" "},{"$f":"IF(I10<>0, IF(M10/I10*100=0, \"-\", M10/I10*100), \" \")","v":" "},{"$f":"IF(J10<>0, IF(N10/J10*100=0, \"-\", N10/J10*100), \" \")","v":" "}]
[{"$f":"IF(COUNTRY_INFO!A11=0,\" \",COUNTRY_INFO!A11)","v":"Guinea"},{"$f":"IF(COUNTRY_INFO!B11=0,\" \",COUNTRY_INFO!B11)","v":"Boké"},{"$f":"IF(COUNTRY_INFO!C11=0,\" \",COUNTRY_INFO!C11)","v":"Fria"},{"$f":"IF(AND(COUNTRY_INFO!$T$9:$T$1000=\"T3 (ALB/MBD)\",COUNTRY_INFO!$U$9:$U$1000=\"T3 (ALB/MBD)\"), \"T3 (ALB/MBD)\", \" \")","v":" "},null,null,null,null,null,0,null,null,null,0," "," "," "," "]
[{"$f":"IF(COUNTRY_INFO!A12=0,\" \",COUNTRY_INFO!A12)","v":"Guinea"},{"$f":"IF(COUNTRY_INFO!B12=0,\" \",COUNTRY_INFO!B12)","v":"Boké"},{"$f":"IF(COUNTRY_INFO!C12=0,\" \",COUNTRY_INFO!C12)","v":"Gaoual"},{"$f":"IF(AND(COUNTRY_INFO!$T$9:$T$1000=\"T3 (ALB/MBD)\",COUNTRY_INFO!$U$9:$U$1000=\"T3 (ALB/MBD)\"), \"T3 (ALB/MBD)\", \" \")","v":" "},null,null,null,null,null,0,null,null,null,0," "," "," "," "]
[{"$f":"IF(COUNTRY_INFO!A13=0,\" \",COUNTRY_INFO!A13)","v":"Guinea"},{"$f":"IF(COUNTRY_INFO!B13=0,\" \",COUNTRY_INFO!B13)","v":"Boké"},{"$f":"IF(COUNTRY_INFO!C13=0,\" \",COUNTRY_INFO!C13)","v":"Koundara"},{"$f":"IF(AND(COUNTRY_INFO!$T$9:$T$1000=\"T3 (ALB/MBD)\",COUNTRY_INFO!$U$9:$U$1000=\"T3 (ALB/MBD)\"), \"T3 (ALB/MBD)\", \" \")","v":" "},null,null,null,null,null,0,null,null,null,0," "," "," "," "]
[{"$f":"IF(COUNTRY_INFO!A14=0,\" \",COUNTRY_INFO!A14)","v":"Guinea"},{"$f":"IF(COUNTRY_INFO!B14=0,\" \",COUNTRY_INFO!B14)","v":"Conakry"},{"$f":"IF(COUNTRY_INFO!C14=0,\" \",COUNTRY_INFO!C14)","v":"Dixinn"},{"$f":"IF(AND(COUNTRY_INFO!$T$9:$T$1000=\"T3 (ALB/MBD)\",COUNTRY_INFO!$U$9:$U$1000=\"T3 (ALB/MBD)\"), \"T3 (ALB/MBD)\", \" \")","v":" "},null,null,null,null,null,0,null,null,null,0," "," "," "," "]
[{"$f":"IF(COUNTRY_INFO!A15=0,\" \",COUNTRY_INFO!A15)","v":"Guinea"},{"$f":"IF(COUNTRY_INFO!B15=0,\" \",COUNTRY_INFO!B15)","v":"Conakry"},{"$f":"IF(COUNTRY_INFO!C15=0,\" \",COUNTRY_INFO!C15)","v":"Kaloum"},{"$f":"IF(AND(COUNTRY_INFO!$T$9:$T$1000=\"T3 (ALB/MBD)\",COUNTRY_INFO!$U$9:$U$1000=\"T3 (ALB/MBD)\"), \"T3 (ALB/MBD)\", \" \")","v":" "},null,null,null,null,null,0,null,null,null,0," "," "," "," "]
[{"$f":"IF(COUNTRY_INFO!A16=0,\" \",COUNTRY_INFO!A16)","v":"Guinea"},{"$f":"IF(COUNTRY_INFO!B16=0,\" \",COUNTRY_INFO!B16)","v":"Conakry"},{"$f":"IF(COUNTRY_INFO!C16=0,\" \",COUNTRY_INFO!C16)","v":"Matam"},{"$f":"IF(AND(COUNTRY_INFO!$T$9:$T$1000=\"T3 (ALB/MBD)\",COUNTRY_INFO!$U$9:$U$1000=\"T3 (ALB/MBD)\"), \"T3 (ALB/MBD)\", \" \")","v":" "},null,null,null,null,null,0,null,null,null,0," "," "," "," "]
[{"$f":"IF(COUNTRY_INFO!A17=0,\" \",COUNTRY_INFO!A17)","v":"Guinea"},{"$f":"IF(COUNTRY_INFO!B17=0,\" \",COUNTRY_INFO!B17)","v":"Conakry"},{"$f":"IF(COUNTRY_INFO!C17=0,\" \",COUNTRY_INFO!C17)","v":"Matoto"},{"$f":"IF(AND(COUNTRY_INFO!$T$9:$T$1000=\"T3 (ALB/MBD)\",COUNTRY_INFO!$U$9:$U$1000=\"T3 (ALB/MBD)\"), \"T3 (ALB/MBD)\", \" \")","v":" "},null,null,null,null,null,0,null,null,null,0," "," "," "," "]
[{"$f":"IF(COUNTRY_INFO!A18=0,\" \",COUNTRY_INFO!A18)","v":"Guinea"},{"$f":"IF(COUNTRY_INFO!B18=0,\" \",COUNTRY_INFO!B18)","v":"Conakry"},{"$f":"IF(COUNTRY_INFO!C18=0,\" \",COUNTRY_INFO!C18)","v":"Ratoma"},{"$f":"IF(AND(COUNTRY_INFO!$T$9:$T$1000=\"T3 (ALB/MBD)\",COUNTRY_INFO!$U$9:$U$1000=\"T3 (ALB/MBD)\"), \"T3 (ALB/MBD)\", \" \")","v":" "},null,null,null,null,null,0,null,null,null,0," "," "," "," "]
[{"$f":"IF(COUNTRY_INFO!A19=0,\" \",COUNTRY_INFO!A19)","v":"Guinea"},{"$f":"IF(COUNTRY_INFO!B19=0,\" \",COUNTRY_INFO!B19)","v":"Faranah"},{"$f":"IF(COUNTRY_INFO!C19=0,\" \",COUNTRY_INFO!C19)","v":"Dabola"},{"$f":"IF(AND(COUNTRY_INFO!$T$9:$T$1000=\"T3 (ALB/MBD)\",COUNTRY_INFO!$U$9:$U$1000=\"T3 (ALB/MBD)\"), \"T3 (ALB/MBD)\", \" \")","v":" "},null,null,null,null,null,0,null,null,null,0," "," "," "," "]
[{"$f":"IF(COUNTRY_INFO!A20=0,\" \",COUNTRY_INFO!A20)","v":"Guinea"},{"$f":"IF(COUNTRY_INFO!B20=0,\" \",COUNTRY_INFO!B20)","v":"Faranah"},{"$f":"IF(COUNTRY_INFO!C20=0,\" \",COUNTRY_INFO!C20)","v":"Dinguiraye"},{"$f":"IF(AND(COUNTRY_INFO!$T$9:$T$1000=\"T3 (ALB/MBD)\",COUNTRY_INFO!$U$9:$U$1000=\"T3 (ALB/MBD)\"), \"T3 (ALB/MBD)\", \" \")","v":" "},null,null,null,null,null,0,null,null,null,0," "," "," "," "]
[{"$f":"IF(COUNTRY_INFO!A21=0,\" \",COUNTRY_INFO!A21)","v":"Guinea"},{"$f":"IF(COUNTRY_INFO!B21=0,\" \",COUNTRY_INFO!B21)","v":"Faranah"},{"$f":"IF(COUNTRY_INFO!C21=0,\" \",COUNTRY_INFO!C21)","v":"Faranah"},{"$f":"IF(AND(COUNTRY_INFO!$T$9:$T$1000=\"T3 (ALB/MBD)\",COUNTRY_INFO!$U$9:$U$1000=\"T3 (ALB/MBD)\"), \"T3 (ALB/MBD)\", \" \")","v":" "},null,null,null,null,null,0,null,null,null,0," "," "," "," "]
[{"$f":"IF(COUNTRY_INFO!A22=0,\" \",COUNTRY_INFO!A22)","v":"Guinea"},{"$f":"IF(COUNTRY_INFO!B22=0,\" \",COUNTRY_INFO!B22)","v":"Faranah"},{"$f":"IF(COUNTRY_INFO!C22=0,\" \",COUNTRY_INFO!C22)","v":"Kissidougou"},{"$f":"IF(AND(COUNTRY_INFO!$T$9:$T$1000=\"T3 (ALB/MBD)\",COUNTRY_INFO!$U$9:$U$1000=\"T3 (ALB/MBD)\"), \"T3 (ALB/MBD)\", \" \")","v":" "},null,null,null,null,null,0,null,null,null,0," "," "," "," "]
[{"$f":"IF(COUNTRY_INFO!A23=0,\" \",COUNTRY_INFO!A23)","v":"Guinea"},{"$f":"IF(COUNTRY_INFO!B23=0,\" \",COUNTRY_INFO!B23)","v":"Kankan"},{"$f":"IF(COUNTRY_INFO!C23=0,\" \",COUNTRY_INFO!C23)","v":"Kankan"},{"$f":"IF(AND(COUNTRY_INFO!$T$9:$T$1000=\"T3 (ALB/MBD)\",COUNTRY_INFO!$U$9:$U$1000=\"T3 (ALB/MBD)\"), \"T3 (ALB/MBD)\", \" \")","v":" "},null,null,null,null,null,0,null,null,null,0," "," "," "," "]
[{"$f":"IF(COUNTRY_INFO!A24=0,\" \",COUNTRY_INFO!A24)","v":"Guinea"},{"$f":"IF(COUNTRY_INFO!B24=0,\" \",COUNTRY_INFO!B24)","v":"Kankan"},{"$f":"IF(COUNTRY_INFO!C24=0,\" \",COUNTRY_INFO!C24)","v":"Kerouane"},{"$f":"IF(AND(COUNTRY_INFO!$T$9:$T$1000=\"T3 (ALB/MBD)\",COUNTRY_INFO!$U$9:$U$1000=\"T3 (ALB/MBD)\"), \"T3 (ALB/MBD)\", \" \")","v":" "},null,null,null,null,null,0,null,null,null,0," "," "," "," "]
[{"$f":"IF(COUNTRY_INFO!A25=0,\" \",COUNTRY_INFO!A25)","v":"Guinea"},{"$f":"IF(COUNTRY_INFO!B25=0,\" \",COUNTRY_INFO!B25)","v":"Kankan"},{"$f":"IF(COUNTRY_INFO!C25=0,\" \",COUNTRY_INFO!C25)","v":"Kouroussa"},{"$f":"IF(AND(COUNTRY_INFO!$T$9:$T$1000=\"T3 (ALB/MBD)\",COUNTRY_INFO!$U$9:$U$1000=\"T3 (ALB/MBD)\"), \"T3 (ALB/MBD)\", \" \")","v":" "},null,null,null,null,null,0,null,null,null,0," "," "," "," "]
[{"$f":"IF(COUNTRY_INFO!A26=0,\" \",COUNTRY_INFO!A26)","v":"Guinea"},{"$f":"IF(COUNTRY_INFO!B26=0,\" \",COUNTRY_INFO!B26)","v":"Kankan"},{"$f":"IF(COUNTRY_INFO!C26=0,\" \",COUNTRY_INFO!C26)","v":"Mandiana"},{"$f":"IF(AND(COUNTRY_INFO!$T$9:$T$1000=\"T3 (ALB/MBD)\",COUNTRY_INFO!$U$9:$U$1000=\"T3 (ALB/MBD)\"), \"T3 (ALB/MBD)\", \" \")","v":" "},null,null,null,null,null,0,null,null,null,0," "," "," "," "]
[{"$f":"IF(COUNTRY_INFO!A27=0,\" \",COUNTRY_INFO!A27)","v":"Guinea"},{"$f":"IF(COUNTRY_INFO!B27=0,\" \",COUNTRY_INFO!B27)","v":"Kankan"},{"$f":"IF(COUNTRY_INFO!C27=0,\" \",COUNTRY_INFO!C27)","v":"Siguiri"},{"$f":"IF(AND(COUNTRY_INFO!$T$9:$T$1000=\"T3 (ALB/MBD)\",COUNTRY_INFO!$U$9:$U$1000=\"T3 (ALB/MBD)\"), \"T3 (ALB/MBD)\", \" \")","v":" "},null,null,null,null,null,0,null,null,null,0," "," "," "," "]
[{"$f":"IF(COUNTRY_INFO!A28=0,\" \",COUNTRY_INFO!A28)","v":"Guinea"},{"$f":"IF(COUNTRY_INFO!B28=0,\" \",COUNTRY_INFO!B28)","v":"Kindia"},{"$f":"IF(COUNTRY_INFO!C28=0,\" \",COUNTRY_INFO!C28)","v":"Coyah"},{"$f":"IF(AND(COUNTRY_INFO!$T$9:$T$1000=\"T3 (ALB/MBD)\",COUNTRY_INFO!$U$9:$U$1000=\"T3 (ALB/MBD)\"), \"T3 (ALB/MBD)\", \" \")","v":" "},null,null,null,null,null,0,null,null,null,0," "," "," "," "]
[{"$f":"IF(COUNTRY_INFO!A29=0,\" \",COUNTRY_INFO!A29)","v":"Guinea"},{"$f":"IF(COUNTRY_INFO!B29=0,\" \",COUNTRY_INFO!B29)","v":"Kindia"},{"$f":"IF(COUNTRY_INFO!C29=0,\" \",COUNTRY_INFO!C29)","v":"Dubreka"},{"$f":"IF(AND(COUNTRY_INFO!$T$9:$T$1000=\"T3 (ALB/MBD)\",COUNTRY_INFO!$U$9:$U$1000=\"T3 (ALB/MBD)\"), \"T3 (ALB/MBD)\", \" \")","v":" "},null,null,null,null,null,0,null,null,null,0," "," "," "," "]
[{"$f":"IF(COUNTRY_INFO!A30=0,\" \",COUNTRY_INFO!A30)","v":"Guinea"},{"$f":"IF(COUNTRY_INFO!B30=0,\" \",COUNTRY_INFO!B30)","v":"Kindia"},{"$f":"IF(COUNTRY_INFO!C30=0,\" \",COUNTRY_INFO!C30)","v":"Forecariah"},{"$f":"IF(AND(COUNTRY_INFO!$T$9:$T$1000=\"T3 (ALB/MBD)\",COUNTRY_INFO!$U$9:$U$1000=\"T3 (ALB/MBD)\"), \"T3 (ALB/MBD)\", \" \")","v":" "},null,null,null,null,null,0,null,null,null,0," "," "," "," "]
[{"$f":"IF(COUNTRY_INFO!A31=0,\" \",COUNTRY_INFO!A31)","v":"Guinea"},{"$f":"IF(COUNTRY_INFO!B31=0,\" \",COUNTRY_INFO!B31)","v":"Kindia"},{"$f":"IF(COUNTRY_INFO!C31=0,\" \",COUNTRY_INFO!C31)","v":"Kindia"},{"$f":"IF(AND(COUNTRY_INFO!$T$9:$T$1000=\"T3 (ALB/MBD)\",COUNTRY_INFO!$U$9:$U$1000=\"T3 (ALB/MBD)\"), \"T3 (ALB/MBD)\", \" \")","v":" "},null,null,null,null,null,0,null,null,null,0," "," "," "," "]
[{"$f":"IF(COUNTRY_INFO!A32=0,\" \",COUNTRY_INFO!A32)","v":"Guinea"},{"$f":"IF(COUNTRY_INFO!B32=0,\" \",COUNTRY_INFO!B32)","v":"Kindia"},{"$f":"IF(COUNTRY_INFO!C32=0,\" \",COUNTRY_INFO!C32)","v":"Telimele"},{"$f":"IF(AND(COUNTRY_INFO!$T$9:$T$1000=\"T3 (ALB/MBD)\",COUNTRY_INFO!$U$9:$U$1000=\"T3 (ALB/MBD)\"), \"T3 (ALB/MBD)\", \" \")","v":" "},null,null,null,null,null,0,null,null,null,0," "," "," "," "]
[{"$f":"IF(COUNTRY_INFO!A33=0,\" \",COUNTRY_INFO!A33)","v":"Guinea"},{"$f":"IF(COUNTRY_INFO!B33=0,\" \",COUNTRY_INFO!B33)","v":"Labé"},{"$f":"IF(COUNTRY_INFO!C33=0,\" \",COUNTRY_INFO!C33)","v":"Koubia"},{"$f":"IF(AND(COUNTRY_INFO!$T$9:$T$1000=\"T3 (ALB/MBD)\",COUNTRY_INFO!$U$9:$U$1000=\"T3 (ALB/MBD)\"), \"T3 (ALB/MBD)\", \" \")","v":" "},null,null,null,null,null,0,null,null,null,0," "," "," "," "]
[{"$f":"IF(COUNTRY_INFO!A34=0,\" \",COUNTRY_INFO!A34)","v":"Guinea"},{"$f":"IF(COUNTRY_INFO!B34=0,\" \",COUNTRY_INFO!B34)","v":"Labé"},{"$f":"IF(COUNTRY_INFO!C34=0,\" \",COUNTRY_INFO!C34)","v":"Labé"},{"$f":"IF(AND(COUNTRY_INFO!$T$9:$T$1000=\"T3 (ALB/MBD)\",COUNTRY_INFO!$U$9:$U$1000=\"T3 (ALB/MBD)\"), \"T3 (ALB/MBD)\", \" \")","v":" "},null,null,null,null,null,0,null,null,null,0," "," "," "," "]
[{"$f":"IF(COUNTRY_INFO!A35=0,\" \",COUNTRY_INFO!A35)","v":"Guinea"},{"$f":"IF(COUNTRY_INFO!B35=0,\" \",COUNTRY_INFO!B35)","v":"Labé"},{"$f":"IF(COUNTRY_INFO!C35=0,\" \",COUNTRY_INFO!C35)","v":"Lelouma"},{"$f":"IF(AND(COUNTRY_INFO!$T$9:$T$1000=\"T3 (ALB/MBD)\",COUNTRY_INFO!$U$9:$U$1000=\"T3 (ALB/MBD)\"), \"T3 (ALB/MBD)\", \" \")","v":" "},null,null,null,null,null,0,null,null,null,0," "," "," "," "]
[{"$f":"IF(COUNTRY_INFO!A36=0,\" \",COUNTRY_INFO!A36)","v":"Guinea"},{"$f":"IF(COUNTRY_INFO!B36=0,\" \",COUNTRY_INFO!B36)","v":"Labé"},{"$f":"IF(COUNTRY_INFO!C36=0,\" \",COUNTRY_INFO!C36)","v":"Mali"},{"$f":"IF(AND(COUNTRY_INFO!$T$9:$T$1000=\"T3 (ALB/MBD)\",COUNTRY_INFO!$U$9:$U$1000=\"T3 (ALB/MBD)\"), \"T3 (ALB/MBD)\", \" \")","v":" "},null,null,null,null,null,0,null,null,null,0," "," "," "," "]
[{"$f":"IF(COUNTRY_INFO!A37=0,\" \",COUNTRY_INFO!A37)","v":"Guinea"},{"$f":"IF(COUNTRY_INFO!B37=0,\" \",COUNTRY_INFO!B37)","v":"Labé"},{"$f":"IF(COUNTRY_INFO!C37=0,\" \",COUNTRY_INFO!C37)","v":"Tougué"},{"$f":"IF(AND(COUNTRY_INFO!$T$9:$T$1000=\"T3 (ALB/MBD)\",COUNTRY_INFO!$U$9:$U$1000=\"T3 (ALB/MBD)\"), \"T3 (ALB/MBD)\", \" \")","v":" "},null,null,null,null,null,0,null,null,null,0," "," "," "," "]
[{"$f":"IF(COUNTRY_INFO!A38=0,\" \",COUNTRY_INFO!A38)","v":"Guinea"},{"$f":"IF(COUNTRY_INFO!B38=0,\" \",COUNTRY_INFO!B38)","v":"Mamou"},{"$f":"IF(COUNTRY_INFO!C38=0,\" \",COUNTRY_INFO!C38)","v":"Dalaba"},{"$f":"IF(AND(COUNTRY_INFO!$T$9:$T$1000=\"T3 (ALB/MBD)\",COUNTRY_INFO!$U$9:$U$1000=\"T3 (ALB/MBD)\"), \"T3 (ALB/MBD)\", \" \")","v":" "},null,null,null,null,null,0,null,null,null,0," "," "," "," "]
[{"$f":"IF(COUNTRY_INFO!A39=0,\" \",COUNTRY_INFO!A39)","v":"Guinea"},{"$f":"IF(COUNTRY_INFO!B39=0,\" \",COUNTRY_INFO!B39)","v":"Mamou"},{"$f":"IF(COUNTRY_INFO!C39=0,\" \",COUNTRY_INFO!C39)","v":"Mamou"},{"$f":"IF(AND(COUNTRY_INFO!$T$9:$T$1000=\"T3 (ALB/MBD)\",COUNTRY_INFO!$U$9:$U$1000=\"T3 (ALB/MBD)\"), \"T3 (ALB/MBD)\", \" \")","v":" "},null,null,null,null,null,0,null,null,null,0," "," "," "," "]
[{"$f":"IF(COUNTRY_INFO!A40=0,\" \",COUNTRY_INFO!A40)","v":"Guinea"},{"$f":"IF(COUNTRY_INFO!B40=0,\" \",COUNTRY_INFO!B40)","v":"Mamou"},{"$f":"IF(COUNTRY_INFO!C40=0,\" \",COUNTRY_INFO!C40)","v":"Pita"},{"$f":"IF(AND(COUNTRY_INFO!$T$9:$T$1000=\"T3 (ALB/MBD)\",COUNTRY_INFO!$U$9:$U$1000=\"T3 (ALB/MBD)\"), \"T3 (ALB/MBD)\", \" \")","v":" "},null,null,null,null,null,0,null,null,null,0," "," "," "," "]
[{"$f":"IF(COUNTRY_INFO!A41=0,\" \",COUNTRY_INFO!A41)","v":"Guinea"},{"$f":"IF(COUNTRY_INFO!B41=0,\" \",COUNTRY_INFO!B41)","v":"N'Zérékoré"},{"$f":"IF(COUNTRY_INFO!C41=0,\" \",COUNTRY_INFO!C41)","v":"Beyla"},{"$f":"IF(AND(COUNTRY_INFO!$T$9:$T$1000=\"T3 (ALB/MBD)\",COUNTRY_INFO!$U$9:$U$1000=\"T3 (ALB/MBD)\"), \"T3 (ALB/MBD)\", \" \")","v":" "},null,null,null,null,null,0,null,null,null,0," "," "," "," "]
[{"$f":"IF(COUNTRY_INFO!A42=0,\" \",COUNTRY_INFO!A42)","v":"Guinea"},{"$f":"IF(COUNTRY_INFO!B42=0,\" \",COUNTRY_INFO!B42)","v":"N'Zérékoré"},{"$f":"IF(COUNTRY_INFO!C42=0,\" \",COUNTRY_INFO!C42)","v":"Gueckedou"},{"$f":"IF(AND(COUNTRY_INFO!$T$9:$T$1000=\"T3 (ALB/MBD)\",COUNTRY_INFO!$U$9:$U$1000=\"T3 (ALB/MBD)\"), \"T3 (ALB/MBD)\", \" \")","v":" "},null,null,null,null,null,0,null,null,null,0," "," "," "," "]
[{"$f":"IF(COUNTRY_INFO!A43=0,\" \",COUNTRY_INFO!A43)","v":"Guinea"},{"$f":"IF(COUNTRY_INFO!B43=0,\" \",COUNTRY_INFO!B43)","v":"N'Zérékoré"},{"$f":"IF(COUNTRY_INFO!C43=0,\" \",COUNTRY_INFO!C43)","v":"Lola"},{"$f":"IF(AND(COUNTRY_INFO!$T$9:$T$1000=\"T3 (ALB/MBD)\",COUNTRY_INFO!$U$9:$U$1000=\"T3 (ALB/MBD)\"), \"T3 (ALB/MBD)\", \" \")","v":" "},null,null,null,null,null,0,null,null,null,0," "," "," "," "]
[{"$f":"IF(COUNTRY_INFO!A44=0,\" \",COUNTRY_INFO!A44)","v":"Guinea"},{"$f":"IF(COUNTRY_INFO!B44=0,\" \",COUNTRY_INFO!B44)","v":"N'Zérékoré"},{"$f":"IF(COUNTRY_INFO!C44=0,\" \",COUNTRY_INFO!C44)","v":"Macenta"},{"$f":"IF(AND(COUNTRY_INFO!$T$9:$T$1000=\"T3 (ALB/MBD)\",COUNTRY_INFO!$U$9:$U$1000=\"T3 (ALB/MBD)\"), \"T3 (ALB/MBD)\", \" \")","v":" "},null,null,null,null,null,0,null,null,null,0," "," "," "," "]
[{"$f":"IF(COUNTRY_INFO!A45=0,\" \",COUNTRY_INFO!A45)","v":"Guinea"},{"$f":"IF(COUNTRY_INFO!B45=0,\" \",COUNTRY_INFO!B45)","v":"N'Zérékoré"},{"$f":"IF(COUNTRY_INFO!C45=0,\" \",COUNTRY_INFO!C45)","v":"N'Zérékoré"},{"$f":"IF(AND(COUNTRY_INFO!$T$9:$T$1000=\"T3 (ALB/MBD)\",COUNTRY_INFO!$U$9:$U$1000=\"T3 (ALB/MBD)\"), \"T3 (ALB/MBD)\", \" \")","v":" "},null,null,null,null,null,0,null,null,null,0," "," "," "," "]
[{"$f":"IF(COUNTRY_INFO!A46=0,\" \",COUNTRY_INFO!A46)","v":"Guinea"},{"$f":"IF(COUNTRY_INFO!B46=0,\" \",COUNTRY_INFO!B46)","v":"N'Zérékoré"},{"$f":"IF(COUNTRY_INFO!C46=0,\" \",COUNTRY_INFO!C46)","v":"Yomou"},{"$f":"IF(AND(COUNTRY_INFO!$T$9:$T$1000=\"T3 (ALB/MBD)\",COUNTRY_INFO!$U$9:$U$1000=\"T3 (ALB/MBD)\"), \"T3 (ALB/MBD)\", \" \")","v":" "},null,null,null,null,null,0,null,null,null,0," "," "," "," "]

{"sheet":"DISTRICT","index":9,"n_rows":46,"n_cols":56,"rows_kept":46,"cut":false,"hidden":false,"merged":[[5,26,5,34],[5,3,6,3],[5,9,6,9],[5,15,6,15],[5,25,6,25],[3,0,3,2],[5,0,5,2],[5,4,5,8],[5,10,5,14],[5,16,5,24]]}
["Number of individuals treated",null,null,null,null,null,null,null,null,null,null,"living","treating"]
["Administrative structure, population treated by age group and gender",null,null,null,null,null,null,null,null,null,null,{"$f":"SUMIF(L9:L1000,\"=1\",D9:D1000)","v":0},{"$f":"SUMIF(L9:L1000,\"=1\",N9:N1000)","v":0},{"$f":"SUMIF(N9:N1000,\">0\",G9:G1000)","v":4675332}]
[]
["TOTAL",null,null,{"$f":"SUM(D$9:D$1000)","v":7161619},{"$f":"SUM(E$9:E$1000)","v":0},{"$f":"SUM(F$9:F$1000)","v":0},{"$f":"SUM(G$9:G$1000)","v":5635966},{"$f":"SUM(H$9:H$1000)","v":5635966},{"$f":"IF(D4>0, IF(H4/D4*100<>0, H4/D4*100, \"-\"),0)","v":78.696814225945275},{"$f":"SUM(J$9:J$1000)","v":6781592},{"$f":"SUM(K$9:K$1000)","v":0},{"$f":"SUM(L$9:L$1000)","v":0},{"$f":"SUM(M$9:M$1000)","v":5705665},{"$f":"SUM(N$9:N$1000)","v":4745031},{"$f":"IF(J4>0, IF(N4/J4*100<>0, N4/J4*100, \"-\"),0)","v":69.969278600069131},{"$f":"SUM(P$9:P$1000)","v":2079265},{"$f":"SUM(Q$9:Q$1000)","v":0},{"$f":"SUM(R$9:R$1000)","v":0},{"$f":"SUM(S$9:S$1000)","v":5635966},{"$f":"SUM(T$9:T$1000)","v":0},null,1119395,null,{"$f":"SUM(X$9:X$1000)","v":1119395},{"$f":"IF(P4>0, IF(X4/P4*100<>0, X4/P4*100, \"-\"),0)","v":53.836091118736675},{"$f":"SUM(Z$9:Z$1000)","v":3678502.62},0,0,1147335,797640,null,0,null,797640,{"$f":"IF(Z4>0, IF(AH4/Z4*100<>0, AH4/Z4*100, \"-\"),0)","v":21.683823076901874}]
[]
[null,null,null,"Population requiring PC for LF","Population treated for lymphatic filariasis",null,null,null,null,"Population requiring PC for ONCHO","Population treated for onchocerciasis",null,null,null,null,"Population requiring PC for STH","Population treated for STH",null,null,null,null,null,null,null,null,"Population requiring PC for SCH","Population treated for schistosomiasis",null,null,null,null,null,null,null,null,null,null,null,null,null,null,{"$f":"SUM(AP9:AP1000)","v":319180.65366514842},1276717.5328134778,2254181.2018271438,4540321.0969150467,{"$f":"SUM(AT9:AT1000)","v":8390400.485220816},{"$f":"COUNTIF(AU9:AU1000,\"Y\")","v":18},{"$f":"SUM(AV9:AV1000)","v":0},2523419,3190691,{"$f":"SUM(AY9:AY1000)","v":5714110},0,2514974,3190691,5705665,{"$f":"IF(AT6<>0,BC6/AT6,0)","v":0.68002296315297284}]
["Country","Province/State","District",null,"Male","Female","Total treated","Total in need treated","(%)",null,"Male","Female","Total treated","Total in need treated","(%)",null,"Male","Female","Total treated","PreSAC in need treated ","PreSAC (%)","SAC in need treated","SAC (%)","Total in need treated ","(%)",null,"Male","Female","Total treated","SAC in need treated","SAC (%)","Adults in need treated","Adults (%)","Total in need treated ","(%)",null,"LF","ONCHO","STH","SCH-SAC","SCH_Adults","<1","PreSAC","SAC","Adults","Total","Dis","PreSAC","SAC","Adults","Total","PreSAC","SAC","Adults","Total","Coverage"]
[]
[{"$f":"IF(COUNTRY_INFO!A9=0,\" \",COUNTRY_INFO!A9)","v":"Guinea"},{"$f":"IF(COUNTRY_INFO!B9=0,\" \",COUNTRY_INFO!B9)","v":"Boké"},{"$f":"IF(COUNTRY_INFO!C9=0,\" \",COUNTRY_INFO!C9)","v":"Boffa"},{"$f":"COUNTRY_INFO!L9","v":0},null,null,{"$f":"MAX('MDA1'!M9,'MDA2'!M9)","v":0},{"$f":"IF(AND(COUNTRY_INFO!H9>0,COUNTRY_INFO!H9<4),IF(D9>MAX('MDA1'!M9,'MDA2'!M9),MAX('MDA1'!M9,'MDA2'!M9),D9),0)","v":0},{"$f":"IF(AND(COUNTRY_INFO!H9>0,COUNTRY_INFO!H9<4), IF(G9/D9*100<>0, IF(G9/D9*100>100,100,G9/D9*100), \"-\"),0)","v":0},{"$f":"COUNTRY_INFO!M9","v":0},null,{"$f":"IF(AND(N9>0,D9>0,H9=0),1,0)","v":0},{"$f":"MAX('MDA1'!M9,MAX('MDA3'!I9,'MDA3'!L9)+MAX('MDA3'!J9,'MDA3'!M9))","v":0},{"$f":"IF(AND(COUNTRY_INFO!I9>0,COUNTRY_INFO!I9<4),IF(J9>MAX('MDA1'!M9,MAX('MDA3'!I9,'MDA3'!L9)+MAX('MDA3'!J9,'MDA3'!M9)),MAX('MDA1'!M9,MAX('MDA3'!I9,'MDA3'!L9)+MAX('MDA3'!J9,'MDA3'!M9)),J9),0)","v":0},{"$f":"IF(AND(COUNTRY_INFO!I9>0,COUNTRY_INFO!I9<4), IF(M9/J9*100<>0, IF(M9/J9*100>100,100,M9/J9*100), \"-\"),0)","v":0},{"$f":"COUNTRY_INFO!N9","v":0},null,null,{"$f":"SUM(MAX('MDA2'!J9, 'T1'!L9, MAX(T3_R1!K9, T3_R2!K9)), MAX('MDA1'!K9, 'MDA2'!K9, 'T1'!M9, MAX(T3_R1!L9, T3_R2!L9)), MAX('MDA1'!L9, 'MDA2'!L9, 'T1'!N9, MAX(T3_R1!M9, T3_R2!M9)))","v":0},{"$f":"IF(AND(COUNTRY_INFO!J9>1,COUNTRY_INFO!J9<4),IF(COUNTRY_INFO!E9>MAX('MDA2'!J9,'T1'!L9,MAX(T3_R1!K9,T3_R2!K9)),MAX('MDA2'!J9,'T1'!L9,MAX(T3_R1!K9,T3_R2!K9)),COUNTRY_INFO!E9),0)","v":0},{"$f":"IF(AND(COUNTRY_INFO!J9>1,COUNTRY_INFO!J9<4), IF(T9/COUNTRY_INFO!E9*100<>0, IF(T9/COUNTRY_INFO!E9*100>100,100,T9/COUNTRY_INFO!E9*100), \"-\"),0)","v":0},{"$f":"IF(AND(COUNTRY_INFO!J9>1,COUNTRY_INFO!J9<4),IF(COUNTRY_INFO!F9>MAX('MDA1'!K9,'MDA2'!K9,'T1'!M9,MAX(T3_R1!L9,T3_R2!L9)),MAX('MDA1'!K9,'MDA2'!K9,'T1'!M9,MAX(T3_R1!L9,T3_R2!L9)),COUNTRY_INFO!F9),0)","v":0},{"$f":"IF(AND(COUNTRY_INFO!J9>1,COUNTRY_INFO!J9<4), IF(V9/COUNTRY_INFO!F9*100<>0, IF(V9/COUNTRY_INFO!F9*100>100,100,V9/COUNTRY_INFO!F9*100), \"-\"),0)","v":0},{"$f":"SUM(T9,V9)","v":0},{"$f":"IF(AND(COUNTRY_INFO!J9>1,COUNTRY_INFO!J9<4), IF(S9/P9*100<>0, IF(X9/P9*100>100,100,X9/P9*100), \"-\"),0)","v":0},{"$f":"COUNTRY_INFO!O9","v":0},null,null,{"$f":"MAX(SUM('T1'!L9:'T1'!N9),SUM('T2'!J9:'T2'!L9))","v":0},{"$f":"IF(COUNTRY_INFO!K9=1,IF(COUNTRY_INFO!F9*0.33>MAX('T1'!M9,'T2'!K9),MAX('T1'!M9,'T2'!K9),COUNTRY_INFO!F9*0.33),IF(COUNTRY_INFO!K9=2,IF(COUNTRY_INFO!F9*0.5>MAX('T1'!M9,'T2'!K9),MAX('T1'!M9,'T2'!K9),COUNTRY_INFO!F9*0.5),IF(COUNTRY_INFO!K9=3,IF(COUNTRY_INFO!F9>MAX('T1'!M9,'T2'!K9),MAX('T1'!M9,'T2'!K9),COUNTRY_INFO!F9),0)))","v":0},{"$f":"IF(AND(COUNTRY_INFO!K9>0,COUNTRY_INFO!K9<4),IF(Z9>0,IF(COUNTRY_INFO!K9=1, AD9/(COUNTRY_INFO!F9*0.33)*100, IF(COUNTRY_INFO!K9=2, AD9/(COUNTRY_INFO!F9*0.5)*100, IF(COUNTRY_INFO!K9=3, AD9/COUNTRY_INFO!F9*100))),\"-\"),0)","v":0},{"$f":"IF(COUNTRY_INFO!K9=2,IF(COUNTRY_INFO!G9*0.2>MAX('T1'!N9,'T2'!L9),MAX('T1'!N9,'T2'!L9),COUNTRY_INFO!G9*0.2),IF(COUNTRY_INFO!K9=3,IF(COUNTRY_INFO!G9>MAX('T1'!N9,'T2'!L9),MAX('T1'!N9,'T2'!L9),COUNTRY_INFO!G9),0))","v":0},{"$f":"IF(AND(COUNTRY_INFO!K9>0,COUNTRY_INFO!K9<4),IF(Z9>0,IF(COUNTRY_INFO!K9=1, 0, IF(COUNTRY_INFO!K9=2, AF9/(COUNTRY_INFO!G9*0.2)*100, IF(COUNTRY_INFO!K9=3, AF9/COUNTRY_INFO!G9*100))),\"-\"),0)","v":0},{"$f":"SUM(AD9,AF9)","v":0},{"$f":"IF(AND(COUNTRY_INFO!K9>0,COUNTRY_INFO!K9<4), IF(AC9/Z9*100<>0, IF(AH9/Z9*100>100,100,AH9/Z9*100), \"-\"),0)","v":0},null,{"$f":"IF(AND(D9<>0, D9<>\"Unknown\",D9<>\"Stopped\",D9<>\"Not required\"),D9/COUNTRY_INFO!D9, 0)","v":0},{"$f":"IF(AND(J9<>0,J9<>\"Unknown\",J9<>\"Stopped\",J9<>\"Not required\"),J9/COUNTRY_INFO!D9, 0)","v":0},{"$f":"IF(AND(P9<>0,P9<>\"Unknown\",P9<>\"Not required\"),P9/(COUNTRY_INFO!E9+COUNTRY_INFO!F9), 0)","v":0},{"$f":"IF(AND(Z9<>0,Z9<>\"Unknown\",Z9<>\"Not required\"),IF(COUNTRY_INFO!K9=1,1,IF(COUNTRY_INFO!K9=2,0.5*COUNTRY_INFO!F9/(0.5*COUNTRY_INFO!F9+0.2*COUNTRY_INFO!G9),IF(COUNTRY_INFO!K9=3,COUNTRY_INFO!F9/(COUNTRY_INFO!F9+COUNTRY_INFO!G9)))),0)","v":0},{"$f":"IF(AND(Z9<>0,Z9<>\"Unknown\",Z9<>\"Not required\"),IF(COUNTRY_INFO!K9=1,0,IF(COUNTRY_INFO!K9=2,0.2*COUNTRY_INFO!G9/(0.5*COUNTRY_INFO!F9+0.2*COUNTRY_INFO!G9),IF(COUNTRY_INFO!K9=3,COUNTRY_INFO!G9/(COUNTRY_INFO!F9+COUNTRY_INFO!G9)))),0)","v":0},{"$f":"MAX(COUNTRY_INFO!D9*AK9*PROFILE!$G$7,COUNTRY_INFO!D9*AL9*PROFILE!$G$7)","v":0},{"$f":"MAX(COUNTRY_INFO!D9*AK9*PROFILE!$G$8,COUNTRY_INFO!D9*AL9*PROFILE!$G$8,COUNTRY_INFO!D9*AM9*PROFILE!$G$8)","v":0},{"$f":"MAX(COUNTRY_INFO!D9*AK9*PROFILE!$G$9,COUNTRY_INFO!D9*AL9*PROFILE!$G$9,COUNTRY_INFO!D9*AM9*PROFILE!$G$9,IF(AND(DISTRICT!Z9<>\"Unknown\",Z9<>\"Not required\"),COUNTRY_INFO!O9*DISTRICT!AN9,0))","v":0},{"$f":"MAX(COUNTRY_INFO!D9*AK9*PROFILE!$G$10,COUNTRY_INFO!D9*AL9*PROFILE!$G$10,IF(AND(DISTRICT!Z9<>\"Unknown\",Z9<>\"Not required\"),COUNTRY_INFO!O9*DISTRICT!AO9,0))","v":0},{"$f":"SUM(AP9:AS9)","v":0},{"$f":"IF(COUNTIFS(AK9:AN9,\">0\")=0,0, IF(COUNTIFS(AK9:AN9,\">0\")<=IF(AND(OR(D9>=0,D9=\"Not required\",D9=\"Unknown\",D9=\"Stopped\"),D9>0,H9>0),1,0)+IF(AND(OR(J9>=0,J9=\"Not required\",J9=\"Unknown\",J9=\"Stopped\"),J9>0,N9>0),1,0)+IF(AND(OR(P9>=0,P9=\"Not required\",P9=\"Unknown\"),P9>0,X9>0),1,0)+IF(AND(OR(Z9>=0,Z9=\"Not required\",Z9=\"Unknown\"),Z9>0,AH9>0),1,0),\"Y\",0))","v":0},{"$f":"MAX('MDA2'!J9,'T1'!L9,'T2'!J9,T3_R1!K9,T3_R2!K9)","v":0},{"$f":"MAX('MDA1'!K9,'MDA2'!K9,'MDA3'!I9,'MDA3'!L9,'T1'!M9,'T2'!K9,T3_R1!L9,T3_R2!L9)","v":0},{"$f":"MAX('MDA1'!L9,'MDA2'!L9,'MDA3'!J9,'MDA3'!M9,'T1'!N9,'T2'!L9,T3_R1!M9,T3_R2!M9)","v":0},{"$f":"SUM(AV9:AX9)","v":0},{"$f":"MAX('MDA2'!J9,T9)","v":0},{"$f":"MAX('MDA1'!K9,'MDA2'!K9,'MDA3'!I9,'MDA3'!L9,V9,AD9)","v":0},{"$f":"MAX('MDA1'!L9,'MDA2'!L9,'MDA3'!J9,'MDA3'!M9,AF9)","v":0},{"$f":"IF(AT9<SUM(AZ9:BB9), AT9,SUM(AZ9:BB9))","v":0},{"$f":"IF(AT9<>0,BC9/AT9*100,0)","v":0}]
[{"$f":"IF(COUNTRY_INFO!A10=0,\" \",COUNTRY_INFO!A10)","v":"Guinea"},{"$f":"IF(COUNTRY_INFO!B10=0,\" \",COUNTRY_INFO!B10)","v":"Boké"},{"$f":"IF(COUNTRY_INFO!C10=0,\" \",COUNTRY_INFO!C10)","v":"Boke"},{"$f":"COUNTRY_INFO!L10","v":470308},null,null,{"$f":"MAX('MDA1'!M10,'MDA2'!M10)","v":375151},{"$f":"IF(AND(COUNTRY_INFO!H10>0,COUNTRY_INFO!H10<4),IF(D10>MAX('MDA1'!M10,'MDA2'!M10),MAX('MDA1'!M10,'MDA2'!M10),D10),0)","v":375151},{"$f":"IF(AND(COUNTRY_INFO!H10>0,COUNTRY_INFO!H10<4), IF(G10/D10*100<>0, IF(G10/D10*100>100,100,G10/D10*100), \"-\"),0)","v":79.76708880138122},{"$f":"COUNTRY_INFO!M10","v":0},null,{"$f":"IF(AND(N10>0,D10>0,H10=0),1,0)","v":0},{"$f":"MAX('MDA1'!M10,MAX('MDA3'!I10,'MDA3'!L10)+MAX('MDA3'!J10,'MDA3'!M10))","v":375151},{"$f":"IF(AND(COUNTRY_INFO!I10>0,COUNTRY_INFO!I10<4),IF(J10>MAX('MDA1'!M10,MAX('MDA3'!I10,'MDA3'!L10)+MAX('MDA3'!J10,'MDA3'!M10)),MAX('MDA1'!M10,MAX('MDA3'!I10,'MDA3'!L10)+MAX('MDA3'!J10,'MDA3'!M10)),J10),0)","v":0},{"$f":"IF(AND(COUNTRY_INFO!I10>0,COUNTRY_INFO!I10<4), IF(M10/J10*100<>0, IF(M10/J10*100>100,100,M10/J10*100), \"-\"),0)","v":0},{"$f":"COUNTRY_INFO!N10","v":0},null,null,{"$f":"SUM(MAX('MDA2'!J10, 'T1'!L10, MAX(T3_R1!K10, T3_R2!K10)), MAX('MDA1'!K10, 'MDA2'!K10, 'T1'!M10, MAX(T3_R1!L10, T3_R2!L10)), MAX('MDA1'!L10, 'MDA2'!L10, 'T1'!N10, MAX(T3_R1!M10, T3_R2!M10)))","v":375151},{"$f":"IF(AND(COUNTRY_INFO!J10>1,COUNTRY_INFO!J10<4),IF(COUNTRY_INFO!E10>MAX('MDA2'!J10,'T1'!L10,MAX(T3_R1!K10,T3_R2!K10)),MAX('MDA2'!J10,'T1'!L10,MAX(T3_R1!K10,T3_R2!K10)),COUNTRY_INFO!E10),0)","v":0},{"$f":"IF(AND(COUNTRY_INFO!J10>1,COUNTRY_INFO!J10<4), IF(T10/COUNTRY_INFO!E10*100<>0, IF(T10/COUNTRY_INFO!E10*100>100,100,T10/COUNTRY_INFO!E10*100), \"-\"),0)","v":0},{"$f":"IF(AND(COUNTRY_INFO!J10>1,COUNTRY_INFO!J10<4),IF(COUNTRY_INFO!F10>MAX('MDA1'!K10,'MDA2'!K10,'T1'!M10,MAX(T3_R1!L10,T3_R2!L10)),MAX('MDA1'!K10,'MDA2'!K10,'T1'!M10,MAX(T3_R1!L10,T3_R2!L10)),COUNTRY_INFO!F10),0)","v":0},{"$f":"IF(AND(COUNTRY_INFO!J10>1,COUNTRY_INFO!J10<4), IF(V10/COUNTRY_INFO!F10*100<>0, IF(V10/COUNTRY_INFO!F10*100>100,100,V10/COUNTRY_INFO!F10*100), \"-\"),0)","v":0},{"$f":"SUM(T10,V10)","v":0},{"$f":"IF(AND(COUNTRY_INFO!J10>1,COUNTRY_INFO!J10<4), IF(S10/P10*100<>0, IF(X10/P10*100>100,100,X10/P10*100), \"-\"),0)","v":0},{"$f":"COUNTRY_INFO!O10","v":38800.410000000003},null,null,{"$f":"MAX(SUM('T1'!L10:'T1'!N10),SUM('T2'!J10:'T2'!L10))","v":0},{"$f":"IF(COUNTRY_INFO!K10=1,IF(COUNTRY_INFO!F10*0.33>MAX('T1'!M10,'T2'!K10),MAX('T1'!M10,'T2'!K10),COUNTRY_INFO!F10*0.33),IF(COUNTRY_INFO!K10=2,IF(COUNTRY_INFO!F10*0.5>MAX('T1'!M10,'T2'!K10),MAX('T1'!M10,'T2'!K10),COUNTRY_INFO!F10*0.5),IF(COUNTRY_INFO!K10=3,IF(COUNTRY_INFO!F10>MAX('T1'!M10,'T2'!K10),MAX('T1'!M10,'T2'!K10),COUNTRY_INFO!F10),0)))","v":0},{"$f":"IF(AND(COUNTRY_INFO!K10>0,COUNTRY_INFO!K10<4),IF(Z10>0,IF(COUNTRY_INFO!K10=1, AD10/(COUNTRY_INFO!F10*0.33)*100, IF(COUNTRY_INFO!K10=2, AD10/(COUNTRY_INFO!F10*0.5)*100, IF(COUNTRY_INFO!K10=3, AD10/COUNTRY_INFO!F10*100))),\"-\"),0)","v":0},{"$f":"IF(COUNTRY_INFO!K10=2,IF(COUNTRY_INFO!G10*0.2>MAX('T1'!N10,'T2'!L10),MAX('T1'!N10,'T2'!L10),COUNTRY_INFO!G10*0.2),IF(COUNTRY_INFO!K10=3,IF(COUNTRY_INFO!G10>MAX('T1'!N10,'T2'!L10),MAX('T1'!N10,'T2'!L10),COUNTRY_INFO!G10),0))","v":0},{"$f":"IF(AND(COUNTRY_INFO!K10>0,COUNTRY_INFO!K10<4),IF(Z10>0,IF(COUNTRY_INFO!K10=1, 0, IF(COUNTRY_INFO!K10=2, AF10/(COUNTRY_INFO!G10*0.2)*100, IF(COUNTRY_INFO!K10=3, AF10/COUNTRY_INFO!G10*100))),\"-\"),0)","v":0},{"$f":"SUM(AD10,AF10)","v":0},{"$f":"IF(AND(COUNTRY_INFO!K10>0,COUNTRY_INFO!K10<4), IF(AC10/Z10*100<>0, IF(AH10/Z10*100>100,100,AH10/Z10*100), \"-\"),0)","v":"-"},null,{"$f":"IF(AND(D10<>0, D10<>\"Unknown\",D10<>\"Stopped\",D10<>\"Not required\"),D10/COUNTRY_INFO!D10, 0)","v":1},{"$f":"IF(AND(J10<>0,J10<>\"Unknown\",J10<>\"Stopped\",J10<>\"Not required\"),J10/COUNTRY_INFO!D10, 0)","v":0},{"$f":"IF(AND(P10<>0,P10<>\"Unknown\",P10<>\"Not required\"),P10/(COUNTRY_INFO!E10+COUNTRY_INFO!F10), 0)","v":0},{"$f":"IF(AND(Z10<>0,Z10<>\"Unknown\",Z10<>\"Not required\"),IF(COUNTRY_INFO!K10=1,1,IF(COUNTRY_INFO!K10=2,0.5*COUNTRY_INFO!F10/(0.5*COUNTRY_INFO!F10+0.2*COUNTRY_INFO!G10),IF(COUNTRY_INFO!K10=3,COUNTRY_INFO!F10/(COUNTRY_INFO!F10+COUNTRY_INFO!G10)))),0)","v":1},{"$f":"IF(AND(Z10<>0,Z10<>\"Unknown\",Z10<>\"Not required\"),IF(COUNTRY_INFO!K10=1,0,IF(COUNTRY_INFO!K10=2,0.2*COUNTRY_INFO!G10/(0.5*COUNTRY_INFO!F10+0.2*COUNTRY_INFO!G10),IF(COUNTRY_INFO!K10=3,COUNTRY_INFO!G10/(COUNTRY_INFO!F10+COUNTRY_INFO!G10)))),0)","v":0},{"$f":"MAX(COUNTRY_INFO!D10*AK10*PROFILE!$G$7,COUNTRY_INFO!D10*AL10*PROFILE!$G$7)","v":18812.349096378497},{"$f":"MAX(COUNTRY_INFO!D10*AK10*PROFILE!$G$8,COUNTRY_INFO!D10*AL10*PROFILE!$G$8,COUNTRY_INFO!D10*AM10*PROFILE!$G$8)","v":75249.096863970626},{"$f":"MAX(COUNTRY_INFO!D10*AK10*PROFILE!$G$9,COUNTRY_INFO!D10*AL10*PROFILE!$G$9,COUNTRY_INFO!D10*AM10*PROFILE!$G$9,IF(AND(DISTRICT!Z10<>\"Unknown\",Z10<>\"Not required\"),COUNTRY_INFO!O10*DISTRICT!AN10,0))","v":117577.18185236561},{"$f":"MAX(COUNTRY_INFO!D10*AK10*PROFILE!$G$10,COUNTRY_INFO!D10*AL10*PROFILE!$G$10,IF(AND(DISTRICT!Z10<>\"Unknown\",Z10<>\"Not required\"),COUNTRY_INFO!O10*DISTRICT!AO10,0))","v":258669.37218728525},{"$f":"SUM(AP10:AS10)","v":470308},0,{"$f":"MAX('MDA2'!J10,'T1'!L10,'T2'!J10,T3_R1!K10,T3_R2!K10)","v":0},{"$f":"MAX('MDA1'!K10,'MDA2'!K10,'MDA3'!I10,'MDA3'!L10,'T1'!M10,'T2'!K10,T3_R1!L10,T3_R2!L10)","v":163390},{"$f":"MAX('MDA1'!L10,'MDA2'!L10,'MDA3'!J10,'MDA3'!M10,'T1'!N10,'T2'!L10,T3_R1!M10,T3_R2!M10)","v":211761},{"$f":"SUM(AV10:AX10)","v":375151},{"$f":"MAX('MDA2'!J10,T10)","v":0},{"$f":"MAX('MDA1'!K10,'MDA2'!K10,'MDA3'!I10,'MDA3'!L10,V10,AD10)","v":163390},{"$f":"MAX('MDA1'!L10,'MDA2'!L10,'MDA3'!J10,'MDA3'!M10,AF10)","v":211761},375151,79.76708880138122]
[{"$f":"IF(COUNTRY_INFO!A11=0,\" \",COUNTRY_INFO!A11)","v":"Guinea"},{"$f":"IF(COUNTRY_INFO!B11=0,\" \",COUNTRY_INFO!B11)","v":"Boké"},{"$f":"IF(COUNTRY_INFO!C11=0,\" \",COUNTRY_INFO!C11)","v":"Fria"},{"$f":"COUNTRY_INFO!L11","v":0},null,null,{"$f":"MAX('MDA1'!M11,'MDA2'!M11)","v":0},{"$f":"IF(AND(COUNTRY_INFO!H11>0,COUNTRY_INFO!H11<4),IF(D11>MAX('MDA1'!M11,'MDA2'!M11),MAX('MDA1'!M11,'MDA2'!M11),D11),0)","v":0},{"$f":"IF(AND(COUNTRY_INFO!H11>0,COUNTRY_INFO!H11<4), IF(G11/D11*100<>0, IF(G11/D11*100>100,100,G11/D11*100), \"-\"),0)","v":0},{"$f":"COUNTRY_INFO!M11","v":0},null,0,{"$f":"MAX('MDA1'!M11,MAX('MDA3'!I11,'MDA3'!L11)+MAX('MDA3'!J11,'MDA3'!M11))","v":0},{"$f":"IF(AND(COUNTRY_INFO!I11>0,COUNTRY_INFO!I11<4),IF(J11>MAX('MDA1'!M11,MAX('MDA3'!I11,'MDA3'!L11)+MAX('MDA3'!J11,'MDA3'!M11)),MAX('MDA1'!M11,MAX('MDA3'!I11,'MDA3'!L11)+MAX('MDA3'!J11,'MDA3'!M11)),J11),0)","v":0},{"$f":"IF(AND(COUNTRY_INFO!I11>0,COUNTRY_INFO!I11<4), IF(M11/J11*100<>0, IF(M11/J11*100>100,100,M11/J11*100), \"-\"),0)","v":0},{"$f":"COUNTRY_INFO!N11","v":0},null,null,{"$f":"SUM(MAX('MDA2'!J11, 'T1'!L11, MAX(T3_R1!K11, T3_R2!K11)), MAX('MDA1'!K11, 'MDA2'!K11, 'T1'!M11, MAX(T3_R1!L11, T3_R2!L11)), MAX('MDA1'!L11, 'MDA2'!L11, 'T1'!N11, MAX(T3_R1!M11, T3_R2!M11)))","v":0},{"$f":"IF(AND(COUNTRY_INFO!J11>1,COUNTRY_INFO!J11<4),IF(COUNTRY_INFO!E11>MAX('MDA2'!J11,'T1'!L11,MAX(T3_R1!K11,T3_R2!K11)),MAX('MDA2'!J11,'T1'!L11,MAX(T3_R1!K11,T3_R2!K11)),COUNTRY_INFO!E11),0)","v":0},{"$f":"IF(AND(COUNTRY_INFO!J11>1,COUNTRY_INFO!J11<4), IF(T11/COUNTRY_INFO!E11*100<>0, IF(T11/COUNTRY_INFO!E11*100>100,100,T11/COUNTRY_INFO!E11*100), \"-\"),0)","v":0},{"$f":"IF(AND(COUNTRY_INFO!J11>1,COUNTRY_INFO!J11<4),IF(COUNTRY_INFO!F11>MAX('MDA1'!K11,'MDA2'!K11,'T1'!M11,MAX(T3_R1!L11,T3_R2!L11)),MAX('MDA1'!K11,'MDA2'!K11,'T1'!M11,MAX(T3_R1!L11,T3_R2!L11)),COUNTRY_INFO!F11),0)","v":0},{"$f":"IF(AND(COUNTRY_INFO!J11>1,COUNTRY_INFO!J11<4), IF(V11/COUNTRY_INFO!F11*100<>0, IF(V11/COUNTRY_INFO!F11*100>100,100,V11/COUNTRY_INFO!F11*100), \"-\"),0)","v":0},0,{"$f":"IF(AND(COUNTRY_INFO!J11>1,COUNTRY_INFO!J11<4), IF(S11/P11*100<>0, IF(X11/P11*100>100,100,X11/P11*100), \"-\"),0)","v":0},{"$f":"COUNTRY_INFO!O11","v":8332.83},null,null,{"$f":"MAX(SUM('T1'!L11:'T1'!N11),SUM('T2'!J11:'T2'!L11))","v":0},{"$f":"IF(COUNTRY_INFO!K11=1,IF(COUNTRY_INFO!F11*0.33>MAX('T1'!M11,'T2'!K11),MAX('T1'!M11,'T2'!K11),COUNTRY_INFO!F11*0.33),IF(COUNTRY_INFO!K11=2,IF(COUNTRY_INFO!F11*0.5>MAX('T1'!M11,'T2'!K11),MAX('T1'!M11,'T2'!K11),COUNTRY_INFO!F11*0.5),IF(COUNTRY_INFO!K11=3,IF(COUNTRY_INFO!F11>MAX('T1'!M11,'T2'!K11),MAX('T1'!M11,'T2'!K11),COUNTRY_INFO!F11),0)))","v":0},{"$f":"IF(AND(COUNTRY_INFO!K11>0,COUNTRY_INFO!K11<4),IF(Z11>0,IF(COUNTRY_INFO!K11=1, AD11/(COUNTRY_INFO!F11*0.33)*100, IF(COUNTRY_INFO!K11=2, AD11/(COUNTRY_INFO!F11*0.5)*100, IF(COUNTRY_INFO!K11=3, AD11/COUNTRY_INFO!F11*100))),\"-\"),0)","v":0},{"$f":"IF(COUNTRY_INFO!K11=2,IF(COUNTRY_INFO!G11*0.2>MAX('T1'!N11,'T2'!L11),MAX('T1'!N11,'T2'!L11),COUNTRY_INFO!G11*0.2),IF(COUNTRY_INFO!K11=3,IF(COUNTRY_INFO!G11>MAX('T1'!N11,'T2'!L11),MAX('T1'!N11,'T2'!L11),COUNTRY_INFO!G11),0))","v":0},{"$f":"IF(AND(COUNTRY_INFO!K11>0,COUNTRY_INFO!K11<4),IF(Z11>0,IF(COUNTRY_INFO!K11=1, 0, IF(COUNTRY_INFO!K11=2, AF11/(COUNTRY_INFO!G11*0.2)*100, IF(COUNTRY_INFO!K11=3, AF11/COUNTRY_INFO!G11*100))),\"-\"),0)","v":0},0,{"$f":"IF(AND(COUNTRY_INFO!K11>0,COUNTRY_INFO!K11<4), IF(AC11/Z11*100<>0, IF(AH11/Z11*100>100,100,AH11/Z11*100), \"-\"),0)","v":"-"},null,{"$f":"IF(AND(D11<>0, D11<>\"Unknown\",D11<>\"Stopped\",D11<>\"Not required\"),D11/COUNTRY_INFO!D11, 0)","v":0},{"$f":"IF(AND(J11<>0,J11<>\"Unknown\",J11<>\"Stopped\",J11<>\"Not required\"),J11/COUNTRY_INFO!D11, 0)","v":0},{"$f":"IF(AND(P11<>0,P11<>\"Unknown\",P11<>\"Not required\"),P11/(COUNTRY_INFO!E11+COUNTRY_INFO!F11), 0)","v":0},{"$f":"IF(AND(Z11<>0,Z11<>\"Unknown\",Z11<>\"Not required\"),IF(COUNTRY_INFO!K11=1,1,IF(COUNTRY_INFO!K11=2,0.5*COUNTRY_INFO!F11/(0.5*COUNTRY_INFO!F11+0.2*COUNTRY_INFO!G11),IF(COUNTRY_INFO!K11=3,COUNTRY_INFO!F11/(COUNTRY_INFO!F11+COUNTRY_INFO!G11)))),0)","v":1},{"$f":"IF(AND(Z11<>0,Z11<>\"Unknown\",Z11<>\"Not required\"),IF(COUNTRY_INFO!K11=1,0,IF(COUNTRY_INFO!K11=2,0.2*COUNTRY_INFO!G11/(0.5*COUNTRY_INFO!F11+0.2*COUNTRY_INFO!G11),IF(COUNTRY_INFO!K11=3,COUNTRY_INFO!G11/(COUNTRY_INFO!F11+COUNTRY_INFO!G11)))),0)","v":0},{"$f":"MAX(COUNTRY_INFO!D11*AK11*PROFILE!$G$7,COUNTRY_INFO!D11*AL11*PROFILE!$G$7)","v":0},{"$f":"MAX(COUNTRY_INFO!D11*AK11*PROFILE!$G$8,COUNTRY_INFO!D11*AL11*PROFILE!$G$8,COUNTRY_INFO!D11*AM11*PROFILE!$G$8)","v":0},{"$f":"MAX(COUNTRY_INFO!D11*AK11*PROFILE!$G$9,COUNTRY_INFO!D11*AL11*PROFILE!$G$9,COUNTRY_INFO!D11*AM11*PROFILE!$G$9,IF(AND(DISTRICT!Z11<>\"Unknown\",Z11<>\"Not required\"),COUNTRY_INFO!O11*DISTRICT!AN11,0))","v":8332.83},{"$f":"MAX(COUNTRY_INFO!D11*AK11*PROFILE!$G$10,COUNTRY_INFO!D11*AL11*PROFILE!$G$10,IF(AND(DISTRICT!Z11<>\"Unknown\",Z11<>\"Not required\"),COUNTRY_INFO!O11*DISTRICT!AO11,0))","v":0},8332.83,0,{"$f":"MAX('MDA2'!J11,'T1'!L11,'T2'!J11,T3_R1!K11,T3_R2!K11)","v":0},{"$f":"MAX('MDA1'!K11,'MDA2'!K11,'MDA3'!I11,'MDA3'!L11,'T1'!M11,'T2'!K11,T3_R1!L11,T3_R2!L11)","v":0},{"$f":"MAX('MDA1'!L11,'MDA2'!L11,'MDA3'!J11,'MDA3'!M11,'T1'!N11,'T2'!L11,T3_R1!M11,T3_R2!M11)","v":0},0,{"$f":"MAX('MDA2'!J11,T11)","v":0},{"$f":"MAX('MDA1'!K11,'MDA2'!K11,'MDA3'!I11,'MDA3'!L11,V11,AD11)","v":0},{"$f":"MAX('MDA1'!L11,'MDA2'!L11,'MDA3'!J11,'MDA3'!M11,AF11)","v":0},0,0]
[{"$f":"IF(COUNTRY_INFO!A12=0,\" \",COUNTRY_INFO!A12)","v":"Guinea"},{"$f":"IF(COUNTRY_INFO!B12=0,\" \",COUNTRY_INFO!B12)","v":"Boké"},{"$f":"IF(COUNTRY_INFO!C12=0,\" \",COUNTRY_INFO!C12)","v":"Gaoual"},{"$f":"COUNTRY_INFO!L12","v":202225},null,null,{"$f":"MAX('MDA1'!M12,'MDA2'!M12)","v":165050},{"$f":"IF(AND(COUNTRY_INFO!H12>0,COUNTRY_INFO!H12<4),IF(D12>MAX('MDA1'!M12,'MDA2'!M12),MAX('MDA1'!M12,'MDA2'!M12),D12),0)","v":165050},{"$f":"IF(AND(COUNTRY_INFO!H12>0,COUNTRY_INFO!H12<4), IF(G12/D12*100<>0, IF(G12/D12*100>100,100,G12/D12*100), \"-\"),0)","v":81.617010755346769},{"$f":"COUNTRY_INFO!M12","v":202225},null,0,{"$f":"MAX('MDA1'!M12,MAX('MDA3'!I12,'MDA3'!L12)+MAX('MDA3'!J12,'MDA3'!M12))","v":165050},{"$f":"IF(AND(COUNTRY_INFO!I12>0,COUNTRY_INFO!I12<4),IF(J12>MAX('MDA1'!M12,MAX('MDA3'!I12,'MDA3'!L12)+MAX('MDA3'!J12,'MDA3'!M12)),MAX('MDA1'!M12,MAX('MDA3'!I12,'MDA3'!L12)+MAX('MDA3'!J12,'MDA3'!M12)),J12),0)","v":165050},{"$f":"IF(AND(COUNTRY_INFO!I12>0,COUNTRY_INFO!I12<4), IF(M12/J12*100<>0, IF(M12/J12*100>100,100,M12/J12*100), \"-\"),0)","v":81.617010755346769},{"$f":"COUNTRY_INFO!N12","v":0},null,null,{"$f":"SUM(MAX('MDA2'!J12, 'T1'!L12, MAX(T3_R1!K12, T3_R2!K12)), MAX('MDA1'!K12, 'MDA2'!K12, 'T1'!M12, MAX(T3_R1!L12, T3_R2!L12)), MAX('MDA1'!L12, 'MDA2'!L12, 'T1'!N12, MAX(T3_R1!M12, T3_R2!M12)))","v":165050},{"$f":"IF(AND(COUNTRY_INFO!J12>1,COUNTRY_INFO!J12<4),IF(COUNTRY_INFO!E12>MAX('MDA2'!J12,'T1'!L12,MAX(T3_R1!K12,T3_R2!K12)),MAX('MDA2'!J12,'T1'!L12,MAX(T3_R1!K12,T3_R2!K12)),COUNTRY_INFO!E12),0)","v":0},{"$f":"IF(AND(COUNTRY_INFO!J12>1,COUNTRY_INFO!J12<4), IF(T12/COUNTRY_INFO!E12*100<>0, IF(T12/COUNTRY_INFO!E12*100>100,100,T12/COUNTRY_INFO!E12*100), \"-\"),0)","v":0},{"$f":"IF(AND(COUNTRY_INFO!J12>1,COUNTRY_INFO!J12<4),IF(COUNTRY_INFO!F12>MAX('MDA1'!K12,'MDA2'!K12,'T1'!M12,MAX(T3_R1!L12,T3_R2!L12)),MAX('MDA1'!K12,'MDA2'!K12,'T1'!M12,MAX(T3_R1!L12,T3_R2!L12)),COUNTRY_INFO!F12),0)","v":0},{"$f":"IF(AND(COUNTRY_INFO!J12>1,COUNTRY_INFO!J12<4), IF(V12/COUNTRY_INFO!F12*100<>0, IF(V12/COUNTRY_INFO!F12*100>100,100,V12/COUNTRY_INFO!F12*100), \"-\"),0)","v":0},0,{"$f":"IF(AND(COUNTRY_INFO!J12>1,COUNTRY_INFO!J12<4), IF(S12/P12*100<>0, IF(X12/P12*100>100,100,X12/P12*100), \"-\"),0)","v":0},{"$f":"COUNTRY_INFO!O12","v":161780},null,null,{"$f":"MAX(SUM('T1'!L12:'T1'!N12),SUM('T2'!J12:'T2'!L12))","v":48184},{"$f":"IF(COUNTRY_INFO!K12=1,IF(COUNTRY_INFO!F12*0.33>MAX('T1'!M12,'T2'!K12),MAX('T1'!M12,'T2'!K12),COUNTRY_INFO!F12*0.33),IF(COUNTRY_INFO!K12=2,IF(COUNTRY_INFO!F12*0.5>MAX('T1'!M12,'T2'!K12),MAX('T1'!M12,'T2'!K12),COUNTRY_INFO!F12*0.5),IF(COUNTRY_INFO!K12=3,IF(COUNTRY_INFO!F12>MAX('T1'!M12,'T2'!K12),MAX('T1'!M12,'T2'!K12),COUNTRY_INFO!F12),0)))","v":48184},{"$f":"IF(AND(COUNTRY_INFO!K12>0,COUNTRY_INFO!K12<4),IF(Z12>0,IF(COUNTRY_INFO!K12=1, AD12/(COUNTRY_INFO!F12*0.33)*100, IF(COUNTRY_INFO!K12=2, AD12/(COUNTRY_INFO!F12*0.5)*100, IF(COUNTRY_INFO!K12=3, AD12/COUNTRY_INFO!F12*100))),\"-\"),0)","v":95.308173114961619},{"$f":"IF(COUNTRY_INFO!K12=2,IF(COUNTRY_INFO!G12*0.2>MAX('T1'!N12,'T2'!L12),MAX('T1'!N12,'T2'!L12),COUNTRY_INFO!G12*0.2),IF(COUNTRY_INFO!K12=3,IF(COUNTRY_INFO!G12>MAX('T1'!N12,'T2'!L12),MAX('T1'!N12,'T2'!L12),COUNTRY_INFO!G12),0))","v":0},{"$f":"IF(AND(COUNTRY_INFO!K12>0,COUNTRY_INFO!K12<4),IF(Z12>0,IF(COUNTRY_INFO!K12=1, 0, IF(COUNTRY_INFO!K12=2, AF12/(COUNTRY_INFO!G12*0.2)*100, IF(COUNTRY_INFO!K12=3, AF12/COUNTRY_INFO!G12*100))),\"-\"),0)","v":0},48184,{"$f":"IF(AND(COUNTRY_INFO!K12>0,COUNTRY_INFO!K12<4), IF(AC12/Z12*100<>0, IF(AH12/Z12*100>100,100,AH12/Z12*100), \"-\"),0)","v":29.783656817900855},null,{"$f":"IF(AND(D12<>0, D12<>\"Unknown\",D12<>\"Stopped\",D12<>\"Not required\"),D12/COUNTRY_INFO!D12, 0)","v":1},{"$f":"IF(AND(J12<>0,J12<>\"Unknown\",J12<>\"Stopped\",J12<>\"Not required\"),J12/COUNTRY_INFO!D12, 0)","v":1},{"$f":"IF(AND(P12<>0,P12<>\"Unknown\",P12<>\"Not required\"),P12/(COUNTRY_INFO!E12+COUNTRY_INFO!F12), 0)","v":0},{"$f":"IF(AND(Z12<>0,Z12<>\"Unknown\",Z12<>\"Not required\"),IF(COUNTRY_INFO!K12=1,1,IF(COUNTRY_INFO!K12=2,0.5*COUNTRY_INFO!F12/(0.5*COUNTRY_INFO!F12+0.2*COUNTRY_INFO!G12),IF(COUNTRY_INFO!K12=3,COUNTRY_INFO!F12/(COUNTRY_INFO!F12+COUNTRY_INFO!G12)))),0)","v":0.31249845469155646},{"$f":"IF(AND(Z12<>0,Z12<>\"Unknown\",Z12<>\"Not required\"),IF(COUNTRY_INFO!K12=1,0,IF(COUNTRY_INFO!K12=2,0.2*COUNTRY_INFO!G12/(0.5*COUNTRY_INFO!F12+0.2*COUNTRY_INFO!G12),IF(COUNTRY_INFO!K12=3,COUNTRY_INFO!G12/(COUNTRY_INFO!F12+COUNTRY_INFO!G12)))),0)","v":0.68750154530844354},{"$f":"MAX(COUNTRY_INFO!D12*AK12*PROFILE!$G$7,COUNTRY_INFO!D12*AL12*PROFILE!$G$7)","v":8089.0125109824667},{"$f":"MAX(COUNTRY_INFO!D12*AK12*PROFILE!$G$8,COUNTRY_INFO!D12*AL12*PROFILE!$G$8,COUNTRY_INFO!D12*AM12*PROFILE!$G$8)","v":32355.921254404475},{"$f":"MAX(COUNTRY_INFO!D12*AK12*PROFILE!$G$9,COUNTRY_INFO!D12*AL12*PROFILE!$G$9,COUNTRY_INFO!D12*AM12*PROFILE!$G$9,IF(AND(DISTRICT!Z12<>\"Unknown\",Z12<>\"Not required\"),COUNTRY_INFO!O12*DISTRICT!AN12,0))","v":50556.328193640416},{"$f":"MAX(COUNTRY_INFO!D12*AK12*PROFILE!$G$10,COUNTRY_INFO!D12*AL12*PROFILE!$G$10,IF(AND(DISTRICT!Z12<>\"Unknown\",Z12<>\"Not required\"),COUNTRY_INFO!O12*DISTRICT!AO12,0))","v":111224},202225.26195902735,"Y",{"$f":"MAX('MDA2'!J12,'T1'!L12,'T2'!J12,T3_R1!K12,T3_R2!K12)","v":0},{"$f":"MAX('MDA1'!K12,'MDA2'!K12,'MDA3'!I12,'MDA3'!L12,'T1'!M12,'T2'!K12,T3_R1!L12,T3_R2!L12)","v":68222},{"$f":"MAX('MDA1'!L12,'MDA2'!L12,'MDA3'!J12,'MDA3'!M12,'T1'!N12,'T2'!L12,T3_R1!M12,T3_R2!M12)","v":96828},165050,{"$f":"MAX('MDA2'!J12,T12)","v":0},{"$f":"MAX('MDA1'!K12,'MDA2'!K12,'MDA3'!I12,'MDA3'!L12,V12,AD12)","v":68222},{"$f":"MAX('MDA1'!L12,'MDA2'!L12,'MDA3'!J12,'MDA3'!M12,AF12)","v":96828},165050,81.61690503011468]
[{"$f":"IF(COUNTRY_INFO!A13=0,\" \",COUNTRY_INFO!A13)","v":"Guinea"},{"$f":"IF(COUNTRY_INFO!B13=0,\" \",COUNTRY_INFO!B13)","v":"Boké"},{"$f":"IF(COUNTRY_INFO!C13=0,\" \",COUNTRY_INFO!C13)","v":"Koundara"},{"$f":"COUNTRY_INFO!L13","v":135756},null,null,{"$f":"MAX('MDA1'!M13,'MDA2'!M13)","v":97245},{"$f":"IF(AND(COUNTRY_INFO!H13>0,COUNTRY_INFO!H13<4),IF(D13>MAX('MDA1'!M13,'MDA2'!M13),MAX('MDA1'!M13,'MDA2'!M13),D13),0)","v":97245},{"$f":"IF(AND(COUNTRY_INFO!H13>0,COUNTRY_INFO!H13<4), IF(G13/D13*100<>0, IF(G13/D13*100>100,100,G13/D13*100), \"-\"),0)","v":71.632193052240794},{"$f":"COUNTRY_INFO!M13","v":135756},null,0,{"$f":"MAX('MDA1'!M13,MAX('MDA3'!I13,'MDA3'!L13)+MAX('MDA3'!J13,'MDA3'!M13))","v":97245},{"$f":"IF(AND(COUNTRY_INFO!I13>0,COUNTRY_INFO!I13<4),IF(J13>MAX('MDA1'!M13,MAX('MDA3'!I13,'MDA3'!L13)+MAX('MDA3'!J13,'MDA3'!M13)),MAX('MDA1'!M13,MAX('MDA3'!I13,'MDA3'!L13)+MAX('MDA3'!J13,'MDA3'!M13)),J13),0)","v":97245},{"$f":"IF(AND(COUNTRY_INFO!I13>0,COUNTRY_INFO!I13<4), IF(M13/J13*100<>0, IF(M13/J13*100>100,100,M13/J13*100), \"-\"),0)","v":71.632193052240794},{"$f":"COUNTRY_INFO!N13","v":0},null,null,{"$f":"SUM(MAX('MDA2'!J13, 'T1'!L13, MAX(T3_R1!K13, T3_R2!K13)), MAX('MDA1'!K13, 'MDA2'!K13, 'T1'!M13, MAX(T3_R1!L13, T3_R2!L13)), MAX('MDA1'!L13, 'MDA2'!L13, 'T1'!N13, MAX(T3_R1!M13, T3_R2!M13)))","v":97245},{"$f":"IF(AND(COUNTRY_INFO!J13>1,COUNTRY_INFO!J13<4),IF(COUNTRY_INFO!E13>MAX('MDA2'!J13,'T1'!L13,MAX(T3_R1!K13,T3_R2!K13)),MAX('MDA2'!J13,'T1'!L13,MAX(T3_R1!K13,T3_R2!K13)),COUNTRY_INFO!E13),0)","v":0},{"$f":"IF(AND(COUNTRY_INFO!J13>1,COUNTRY_INFO!J13<4), IF(T13/COUNTRY_INFO!E13*100<>0, IF(T13/COUNTRY_INFO!E13*100>100,100,T13/COUNTRY_INFO!E13*100), \"-\"),0)","v":0},{"$f":"IF(AND(COUNTRY_INFO!J13>1,COUNTRY_INFO!J13<4),IF(COUNTRY_INFO!F13>MAX('MDA1'!K13,'MDA2'!K13,'T1'!M13,MAX(T3_R1!L13,T3_R2!L13)),MAX('MDA1'!K13,'MDA2'!K13,'T1'!M13,MAX(T3_R1!L13,T3_R2!L13)),COUNTRY_INFO!F13),0)","v":0},{"$f":"IF(AND(COUNTRY_INFO!J13>1,COUNTRY_INFO!J13<4), IF(V13/COUNTRY_INFO!F13*100<>0, IF(V13/COUNTRY_INFO!F13*100>100,100,V13/COUNTRY_INFO!F13*100), \"-\"),0)","v":0},0,{"$f":"IF(AND(COUNTRY_INFO!J13>1,COUNTRY_INFO!J13<4), IF(S13/P13*100<>0, IF(X13/P13*100>100,100,X13/P13*100), \"-\"),0)","v":0},{"$f":"COUNTRY_INFO!O13","v":31902.7},null,null,{"$f":"MAX(SUM('T1'!L13:'T1'!N13),SUM('T2'!J13:'T2'!L13))","v":32854},{"$f":"IF(COUNTRY_INFO!K13=1,IF(COUNTRY_INFO!F13*0.33>MAX('T1'!M13,'T2'!K13),MAX('T1'!M13,'T2'!K13),COUNTRY_INFO!F13*0.33),IF(COUNTRY_INFO!K13=2,IF(COUNTRY_INFO!F13*0.5>MAX('T1'!M13,'T2'!K13),MAX('T1'!M13,'T2'!K13),COUNTRY_INFO!F13*0.5),IF(COUNTRY_INFO!K13=3,IF(COUNTRY_INFO!F13>MAX('T1'!M13,'T2'!K13),MAX('T1'!M13,'T2'!K13),COUNTRY_INFO!F13),0)))","v":16969.5},{"$f":"IF(AND(COUNTRY_INFO!K13>0,COUNTRY_INFO!K13<4),IF(Z13>0,IF(COUNTRY_INFO!K13=1, AD13/(COUNTRY_INFO!F13*0.33)*100, IF(COUNTRY_INFO!K13=2, AD13/(COUNTRY_INFO!F13*0.5)*100, IF(COUNTRY_INFO!K13=3, AD13/COUNTRY_INFO!F13*100))),\"-\"),0)","v":100},{"$f":"IF(COUNTRY_INFO!K13=2,IF(COUNTRY_INFO!G13*0.2>MAX('T1'!N13,'T2'!L13),MAX('T1'!N13,'T2'!L13),COUNTRY_INFO!G13*0.2),IF(COUNTRY_INFO!K13=3,IF(COUNTRY_INFO!G13>MAX('T1'!N13,'T2'!L13),MAX('T1'!N13,'T2'!L13),COUNTRY_INFO!G13),0))","v":0},{"$f":"IF(AND(COUNTRY_INFO!K13>0,COUNTRY_INFO!K13<4),IF(Z13>0,IF(COUNTRY_INFO!K13=1, 0, IF(COUNTRY_INFO!K13=2, AF13/(COUNTRY_INFO!G13*0.2)*100, IF(COUNTRY_INFO!K13=3, AF13/COUNTRY_INFO!G13*100))),\"-\"),0)","v":0},16969.5,{"$f":"IF(AND(COUNTRY_INFO!K13>0,COUNTRY_INFO!K13<4), IF(AC13/Z13*100<>0, IF(AH13/Z13*100>100,100,AH13/Z13*100), \"-\"),0)","v":53.191422669554612},null,{"$f":"IF(AND(D13<>0, D13<>\"Unknown\",D13<>\"Stopped\",D13<>\"Not required\"),D13/COUNTRY_INFO!D13, 0)","v":1},{"$f":"IF(AND(J13<>0,J13<>\"Unknown\",J13<>\"Stopped\",J13<>\"Not required\"),J13/COUNTRY_INFO!D13, 0)","v":1},{"$f":"IF(AND(P13<>0,P13<>\"Unknown\",P13<>\"Not required\"),P13/(COUNTRY_INFO!E13+COUNTRY_INFO!F13), 0)","v":0},{"$f":"IF(AND(Z13<>0,Z13<>\"Unknown\",Z13<>\"Not required\"),IF(COUNTRY_INFO!K13=1,1,IF(COUNTRY_INFO!K13=2,0.5*COUNTRY_INFO!F13/(0.5*COUNTRY_INFO!F13+0.2*COUNTRY_INFO!G13),IF(COUNTRY_INFO!K13=3,COUNTRY_INFO!F13/(COUNTRY_INFO!F13+COUNTRY_INFO!G13)))),0)","v":0.53191422669554611},{"$f":"IF(AND(Z13<>0,Z13<>\"Unknown\",Z13<>\"Not required\"),IF(COUNTRY_INFO!K13=1,0,IF(COUNTRY_INFO!K13=2,0.2*COUNTRY_INFO!G13/(0.5*COUNTRY_INFO!F13+0.2*COUNTRY_INFO!G13),IF(COUNTRY_INFO!K13=3,COUNTRY_INFO!G13/(COUNTRY_INFO!F13+COUNTRY_INFO!G13)))),0)","v":0.46808577330445389},{"$f":"MAX(COUNTRY_INFO!D13*AK13*PROFILE!$G$7,COUNTRY_INFO!D13*AL13*PROFILE!$G$7)","v":5430.2483987683809},{"$f":"MAX(COUNTRY_INFO!D13*AK13*PROFILE!$G$8,COUNTRY_INFO!D13*AL13*PROFILE!$G$8,COUNTRY_INFO!D13*AM13*PROFILE!$G$8)","v":21720.907137163722},{"$f":"MAX(COUNTRY_INFO!D13*AK13*PROFILE!$G$9,COUNTRY_INFO!D13*AL13*PROFILE!$G$9,COUNTRY_INFO!D13*AM13*PROFILE!$G$9,IF(AND(DISTRICT!Z13<>\"Unknown\",Z13<>\"Not required\"),COUNTRY_INFO!O13*DISTRICT!AN13,0))","v":33939.052492302377},{"$f":"MAX(COUNTRY_INFO!D13*AK13*PROFILE!$G$10,COUNTRY_INFO!D13*AL13*PROFILE!$G$10,IF(AND(DISTRICT!Z13<>\"Unknown\",Z13<>\"Not required\"),COUNTRY_INFO!O13*DISTRICT!AO13,0))","v":74665.791971765517},135756,"Y",{"$f":"MAX('MDA2'!J13,'T1'!L13,'T2'!J13,T3_R1!K13,T3_R2!K13)","v":0},{"$f":"MAX('MDA1'!K13,'MDA2'!K13,'MDA3'!I13,'MDA3'!L13,'T1'!M13,'T2'!K13,T3_R1!L13,T3_R2!L13)","v":47584},{"$f":"MAX('MDA1'!L13,'MDA2'!L13,'MDA3'!J13,'MDA3'!M13,'T1'!N13,'T2'!L13,T3_R1!M13,T3_R2!M13)","v":49661},97245,{"$f":"MAX('MDA2'!J13,T13)","v":0},{"$f":"MAX('MDA1'!K13,'MDA2'!K13,'MDA3'!I13,'MDA3'!L13,V13,AD13)","v":47584},{"$f":"MAX('MDA1'!L13,'MDA2'!L13,'MDA3'!J13,'MDA3'!M13,AF13)","v":49661},97245,71.632193052240794]
[{"$f":"IF(COUNTRY_INFO!A14=0,\" \",COUNTRY_INFO!A14)","v":"Guinea"},{"$f":"IF(COUNTRY_INFO!B14=0,\" \",COUNTRY_INFO!B14)","v":"Conakry"},{"$f":"IF(COUNTRY_INFO!C14=0,\" \",COUNTRY_INFO!C14)","v":"Dixinn"},{"$f":"COUNTRY_INFO!L14","v":0},null,null,{"$f":"MAX('MDA1'!M14,'MDA2'!M14)","v":0},{"$f":"IF(AND(COUNTRY_INFO!H14>0,COUNTRY_INFO!H14<4),IF(D14>MAX('MDA1'!M14,'MDA2'!M14),MAX('MDA1'!M14,'MDA2'!M14),D14),0)","v":0},{"$f":"IF(AND(COUNTRY_INFO!H14>0,COUNTRY_INFO!H14<4), IF(G14/D14*100<>0, IF(G14/D14*100>100,100,G14/D14*100), \"-\"),0)","v":0},{"$f":"COUNTRY_INFO!M14","v":0},null,0,{"$f":"MAX('MDA1'!M14,MAX('MDA3'!I14,'MDA3'!L14)+MAX('MDA3'!J14,'MDA3'!M14))","v":0},{"$f":"IF(AND(COUNTRY_INFO!I14>0,COUNTRY_INFO!I14<4),IF(J14>MAX('MDA1'!M14,MAX('MDA3'!I14,'MDA3'!L14)+MAX('MDA3'!J14,'MDA3'!M14)),MAX('MDA1'!M14,MAX('MDA3'!I14,'MDA3'!L14)+MAX('MDA3'!J14,'MDA3'!M14)),J14),0)","v":0},{"$f":"IF(AND(COUNTRY_INFO!I14>0,COUNTRY_INFO!I14<4), IF(M14/J14*100<>0, IF(M14/J14*100>100,100,M14/J14*100), \"-\"),0)","v":0},{"$f":"COUNTRY_INFO!N14","v":0},null,null,{"$f":"SUM(MAX('MDA2'!J14, 'T1'!L14, MAX(T3_R1!K14, T3_R2!K14)), MAX('MDA1'!K14, 'MDA2'!K14, 'T1'!M14, MAX(T3_R1!L14, T3_R2!L14)), MAX('MDA1'!L14, 'MDA2'!L14, 'T1'!N14, MAX(T3_R1!M14, T3_R2!M14)))","v":0},{"$f":"IF(AND(COUNTRY_INFO!J14>1,COUNTRY_INFO!J14<4),IF(COUNTRY_INFO!E14>MAX('MDA2'!J14,'T1'!L14,MAX(T3_R1!K14,T3_R2!K14)),MAX('MDA2'!J14,'T1'!L14,MAX(T3_R1!K14,T3_R2!K14)),COUNTRY_INFO!E14),0)","v":0},{"$f":"IF(AND(COUNTRY_INFO!J14>1,COUNTRY_INFO!J14<4), IF(T14/COUNTRY_INFO!E14*100<>0, IF(T14/COUNTRY_INFO!E14*100>100,100,T14/COUNTRY_INFO!E14*100), \"-\"),0)","v":0},{"$f":"IF(AND(COUNTRY_INFO!J14>1,COUNTRY_INFO!J14<4),IF(COUNTRY_INFO!F14>MAX('MDA1'!K14,'MDA2'!K14,'T1'!M14,MAX(T3_R1!L14,T3_R2!L14)),MAX('MDA1'!K14,'MDA2'!K14,'T1'!M14,MAX(T3_R1!L14,T3_R2!L14)),COUNTRY_INFO!F14),0)","v":0},{"$f":"IF(AND(COUNTRY_INFO!J14>1,COUNTRY_INFO!J14<4), IF(V14/COUNTRY_INFO!F14*100<>0, IF(V14/COUNTRY_INFO!F14*100>100,100,V14/COUNTRY_INFO!F14*100), \"-\"),0)","v":0},0,{"$f":"IF(AND(COUNTRY_INFO!J14>1,COUNTRY_INFO!J14<4), IF(S14/P14*100<>0, IF(X14/P14*100>100,100,X14/P14*100), \"-\"),0)","v":0},{"$f":"COUNTRY_INFO!O14","v":0},null,null,{"$f":"MAX(SUM('T1'!L14:'T1'!N14),SUM('T2'!J14:'T2'!L14))","v":0},{"$f":"IF(COUNTRY_INFO!K14=1,IF(COUNTRY_INFO!F14*0.33>MAX('T1'!M14,'T2'!K14),MAX('T1'!M14,'T2'!K14),COUNTRY_INFO!F14*0.33),IF(COUNTRY_INFO!K14=2,IF(COUNTRY_INFO!F14*0.5>MAX('T1'!M14,'T2'!K14),MAX('T1'!M14,'T2'!K14),COUNTRY_INFO!F14*0.5),IF(COUNTRY_INFO!K14=3,IF(COUNTRY_INFO!F14>MAX('T1'!M14,'T2'!K14),MAX('T1'!M14,'T2'!K14),COUNTRY_INFO!F14),0)))","v":0},{"$f":"IF(AND(COUNTRY_INFO!K14>0,COUNTRY_INFO!K14<4),IF(Z14>0,IF(COUNTRY_INFO!K14=1, AD14/(COUNTRY_INFO!F14*0.33)*100, IF(COUNTRY_INFO!K14=2, AD14/(COUNTRY_INFO!F14*0.5)*100, IF(COUNTRY_INFO!K14=3, AD14/COUNTRY_INFO!F14*100))),\"-\"),0)","v":0},{"$f":"IF(COUNTRY_INFO!K14=2,IF(COUNTRY_INFO!G14*0.2>MAX('T1'!N14,'T2'!L14),MAX('T1'!N14,'T2'!L14),COUNTRY_INFO!G14*0.2),IF(COUNTRY_INFO!K14=3,IF(COUNTRY_INFO!G14>MAX('T1'!N14,'T2'!L14),MAX('T1'!N14,'T2'!L14),COUNTRY_INFO!G14),0))","v":0},{"$f":"IF(AND(COUNTRY_INFO!K14>0,COUNTRY_INFO!K14<4),IF(Z14>0,IF(COUNTRY_INFO!K14=1, 0, IF(COUNTRY_INFO!K14=2, AF14/(COUNTRY_INFO!G14*0.2)*100, IF(COUNTRY_INFO!K14=3, AF14/COUNTRY_INFO!G14*100))),\"-\"),0)","v":0},0,{"$f":"IF(AND(COUNTRY_INFO!K14>0,COUNTRY_INFO!K14<4), IF(AC14/Z14*100<>0, IF(AH14/Z14*100>100,100,AH14/Z14*100), \"-\"),0)","v":0},null,{"$f":"IF(AND(D14<>0, D14<>\"Unknown\",D14<>\"Stopped\",D14<>\"Not required\"),D14/COUNTRY_INFO!D14, 0)","v":0},{"$f":"IF(AND(J14<>0,J14<>\"Unknown\",J14<>\"Stopped\",J14<>\"Not required\"),J14/COUNTRY_INFO!D14, 0)","v":0},{"$f":"IF(AND(P14<>0,P14<>\"Unknown\",P14<>\"Not required\"),P14/(COUNTRY_INFO!E14+COUNTRY_INFO!F14), 0)","v":0},{"$f":"IF(AND(Z14<>0,Z14<>\"Unknown\",Z14<>\"Not required\"),IF(COUNTRY_INFO!K14=1,1,IF(COUNTRY_INFO!K14=2,0.5*COUNTRY_INFO!F14/(0.5*COUNTRY_INFO!F14+0.2*COUNTRY_INFO!G14),IF(COUNTRY_INFO!K14=3,COUNTRY_INFO!F14/(COUNTRY_INFO!F14+COUNTRY_INFO!G14)))),0)","v":0},{"$f":"IF(AND(Z14<>0,Z14<>\"Unknown\",Z14<>\"Not required\"),IF(COUNTRY_INFO!K14=1,0,IF(COUNTRY_INFO!K14=2,0.2*COUNTRY_INFO!G14/(0.5*COUNTRY_INFO!F14+0.2*COUNTRY_INFO!G14),IF(COUNTRY_INFO!K14=3,COUNTRY_INFO!G14/(COUNTRY_INFO!F14+COUNTRY_INFO!G14)))),0)","v":0},{"$f":"MAX(COUNTRY_INFO!D14*AK14*PROFILE!$G$7,COUNTRY_INFO!D14*AL14*PROFILE!$G$7)","v":0},{"$f":"MAX(COUNTRY_INFO!D14*AK14*PROFILE!$G$8,COUNTRY_INFO!D14*AL14*PROFILE!$G$8,COUNTRY_INFO!D14*AM14*PROFILE!$G$8)","v":0},{"$f":"MAX(COUNTRY_INFO!D14*AK14*PROFILE!$G$9,COUNTRY_INFO!D14*AL14*PROFILE!$G$9,COUNTRY_INFO!D14*AM14*PROFILE!$G$9,IF(AND(DISTRICT!Z14<>\"Unknown\",Z14<>\"Not required\"),COUNTRY_INFO!O14*DISTRICT!AN14,0))","v":0},{"$f":"MAX(COUNTRY_INFO!D14*AK14*PROFILE!$G$10,COUNTRY_INFO!D14*AL14*PROFILE!$G$10,IF(AND(DISTRICT!Z14<>\"Unknown\",Z14<>\"Not required\"),COUNTRY_INFO!O14*DISTRICT!AO14,0))","v":0},0,0,{"$f":"MAX('MDA2'!J14,'T1'!L14,'T2'!J14,T3_R1!K14,T3_R2!K14)","v":0},{"$f":"MAX('MDA1'!K14,'MDA2'!K14,'MDA3'!I14,'MDA3'!L14,'T1'!M14,'T2'!K14,T3_R1!L14,T3_R2!L14)","v":0},{"$f":"MAX('MDA1'!L14,'MDA2'!L14,'MDA3'!J14,'MDA3'!M14,'T1'!N14,'T2'!L14,T3_R1!M14,T3_R2!M14)","v":0},0,{"$f":"MAX('MDA2'!J14,T14)","v":0},{"$f":"MAX('MDA1'!K14,'MDA2'!K14,'MDA3'!I14,'MDA3'!L14,V14,AD14)","v":0},{"$f":"MAX('MDA1'!L14,'MDA2'!L14,'MDA3'!J14,'MDA3'!M14,AF14)","v":0},0,0]
[{"$f":"IF(COUNTRY_INFO!A15=0,\" \",COUNTRY_INFO!A15)","v":"Guinea"},{"$f":"IF(COUNTRY_INFO!B15=0,\" \",COUNTRY_INFO!B15)","v":"Conakry"},{"$f":"IF(COUNTRY_INFO!C15=0,\" \",COUNTRY_INFO!C15)","v":"Kaloum"},{"$f":"COUNTRY_INFO!L15","v":0},null,null,{"$f":"MAX('MDA1'!M15,'MDA2'!M15)","v":0},{"$f":"IF(AND(COUNTRY_INFO!H15>0,COUNTRY_INFO!H15<4),IF(D15>MAX('MDA1'!M15,'MDA2'!M15),MAX('MDA1'!M15,'MDA2'!M15),D15),0)","v":0},{"$f":"IF(AND(COUNTRY_INFO!H15>0,COUNTRY_INFO!H15<4), IF(G15/D15*100<>0, IF(G15/D15*100>100,100,G15/D15*100), \"-\"),0)","v":0},{"$f":"COUNTRY_INFO!M15","v":0},null,0,{"$f":"MAX('MDA1'!M15,MAX('MDA3'!I15,'MDA3'!L15)+MAX('MDA3'!J15,'MDA3'!M15))","v":0},{"$f":"IF(AND(COUNTRY_INFO!I15>0,COUNTRY_INFO!I15<4),IF(J15>MAX('MDA1'!M15,MAX('MDA3'!I15,'MDA3'!L15)+MAX('MDA3'!J15,'MDA3'!M15)),MAX('MDA1'!M15,MAX('MDA3'!I15,'MDA3'!L15)+MAX('MDA3'!J15,'MDA3'!M15)),J15),0)","v":0},{"$f":"IF(AND(COUNTRY_INFO!I15>0,COUNTRY_INFO!I15<4), IF(M15/J15*100<>0, IF(M15/J15*100>100,100,M15/J15*100), \"-\"),0)","v":0},{"$f":"COUNTRY_INFO!N15","v":0},null,null,{"$f":"SUM(MAX('MDA2'!J15, 'T1'!L15, MAX(T3_R1!K15, T3_R2!K15)), MAX('MDA1'!K15, 'MDA2'!K15, 'T1'!M15, MAX(T3_R1!L15, T3_R2!L15)), MAX('MDA1'!L15, 'MDA2'!L15, 'T1'!N15, MAX(T3_R1!M15, T3_R2!M15)))","v":0},{"$f":"IF(AND(COUNTRY_INFO!J15>1,COUNTRY_INFO!J15<4),IF(COUNTRY_INFO!E15>MAX('MDA2'!J15,'T1'!L15,MAX(T3_R1!K15,T3_R2!K15)),MAX('MDA2'!J15,'T1'!L15,MAX(T3_R1!K15,T3_R2!K15)),COUNTRY_INFO!E15),0)","v":0},{"$f":"IF(AND(COUNTRY_INFO!J15>1,COUNTRY_INFO!J15<4), IF(T15/COUNTRY_INFO!E15*100<>0, IF(T15/COUNTRY_INFO!E15*100>100,100,T15/COUNTRY_INFO!E15*100), \"-\"),0)","v":0},{"$f":"IF(AND(COUNTRY_INFO!J15>1,COUNTRY_INFO!J15<4),IF(COUNTRY_INFO!F15>MAX('MDA1'!K15,'MDA2'!K15,'T1'!M15,MAX(T3_R1!L15,T3_R2!L15)),MAX('MDA1'!K15,'MDA2'!K15,'T1'!M15,MAX(T3_R1!L15,T3_R2!L15)),COUNTRY_INFO!F15),0)","v":0},{"$f":"IF(AND(COUNTRY_INFO!J15>1,COUNTRY_INFO!J15<4), IF(V15/COUNTRY_INFO!F15*100<>0, IF(V15/COUNTRY_INFO!F15*100>100,100,V15/COUNTRY_INFO!F15*100), \"-\"),0)","v":0},0,{"$f":"IF(AND(COUNTRY_INFO!J15>1,COUNTRY_INFO!J15<4), IF(S15/P15*100<>0, IF(X15/P15*100>100,100,X15/P15*100), \"-\"),0)","v":0},{"$f":"COUNTRY_INFO!O15","v":0},null,null,{"$f":"MAX(SUM('T1'!L15:'T1'!N15),SUM('T2'!J15:'T2'!L15))","v":0},{"$f":"IF(COUNTRY_INFO!K15=1,IF(COUNTRY_INFO!F15*0.33>MAX('T1'!M15,'T2'!K15),MAX('T1'!M15,'T2'!K15),COUNTRY_INFO!F15*0.33),IF(COUNTRY_INFO!K15=2,IF(COUNTRY_INFO!F15*0.5>MAX('T1'!M15,'T2'!K15),MAX('T1'!M15,'T2'!K15),COUNTRY_INFO!F15*0.5),IF(COUNTRY_INFO!K15=3,IF(COUNTRY_INFO!F15>MAX('T1'!M15,'T2'!K15),MAX('T1'!M15,'T2'!K15),COUNTRY_INFO!F15),0)))","v":0},{"$f":"IF(AND(COUNTRY_INFO!K15>0,COUNTRY_INFO!K15<4),IF(Z15>0,IF(COUNTRY_INFO!K15=1, AD15/(COUNTRY_INFO!F15*0.33)*100, IF(COUNTRY_INFO!K15=2, AD15/(COUNTRY_INFO!F15*0.5)*100, IF(COUNTRY_INFO!K15=3, AD15/COUNTRY_INFO!F15*100))),\"-\"),0)","v":0},{"$f":"IF(COUNTRY_INFO!K15=2,IF(COUNTRY_INFO!G15*0.2>MAX('T1'!N15,'T2'!L15),MAX('T1'!N15,'T2'!L15),COUNTRY_INFO!G15*0.2),IF(COUNTRY_INFO!K15=3,IF(COUNTRY_INFO!G15>MAX('T1'!N15,'T2'!L15),MAX('T1'!N15,'T2'!L15),COUNTRY_INFO!G15),0))","v":0},{"$f":"IF(AND(COUNTRY_INFO!K15>0,COUNTRY_INFO!K15<4),IF(Z15>0,IF(COUNTRY_INFO!K15=1, 0, IF(COUNTRY_INFO!K15=2, AF15/(COUNTRY_INFO!G15*0.2)*100, IF(COUNTRY_INFO!K15=3, AF15/COUNTRY_INFO!G15*100))),\"-\"),0)","v":0},0,{"$f":"IF(AND(COUNTRY_INFO!K15>0,COUNTRY_INFO!K15<4), IF(AC15/Z15*100<>0, IF(AH15/Z15*100>100,100,AH15/Z15*100), \"-\"),0)","v":0},null,{"$f":"IF(AND(D15<>0, D15<>\"Unknown\",D15<>\"Stopped\",D15<>\"Not required\"),D15/COUNTRY_INFO!D15, 0)","v":0},{"$f":"IF(AND(J15<>0,J15<>\"Unknown\",J15<>\"Stopped\",J15<>\"Not required\"),J15/COUNTRY_INFO!D15, 0)","v":0},{"$f":"IF(AND(P15<>0,P15<>\"Unknown\",P15<>\"Not required\"),P15/(COUNTRY_INFO!E15+COUNTRY_INFO!F15), 0)","v":0},{"$f":"IF(AND(Z15<>0,Z15<>\"Unknown\",Z15<>\"Not required\"),IF(COUNTRY_INFO!K15=1,1,IF(COUNTRY_INFO!K15=2,0.5*COUNTRY_INFO!F15/(0.5*COUNTRY_INFO!F15+0.2*COUNTRY_INFO!G15),IF(COUNTRY_INFO!K15=3,COUNTRY_INFO!F15/(COUNTRY_INFO!F15+COUNTRY_INFO!G15)))),0)","v":0},{"$f":"IF(AND(Z15<>0,Z15<>\"Unknown\",Z15<>\"Not required\"),IF(COUNTRY_INFO!K15=1,0,IF(COUNTRY_INFO!K15=2,0.2*COUNTRY_INFO!G15/(0.5*COUNTRY_INFO!F15+0.2*COUNTRY_INFO!G15),IF(COUNTRY_INFO!K15=3,COUNTRY_INFO!G15/(COUNTRY_INFO!F15+COUNTRY_INFO!G15)))),0)","v":0},{"$f":"MAX(COUNTRY_INFO!D15*AK15*PROFILE!$G$7,COUNTRY_INFO!D15*AL15*PROFILE!$G$7)","v":0},{"$f":"MAX(COUNTRY_INFO!D15*AK15*PROFILE!$G$8,COUNTRY_INFO!D15*AL15*PROFILE!$G$8,COUNTRY_INFO!D15*AM15*PROFILE!$G$8)","v":0},{"$f":"MAX(COUNTRY_INFO!D15*AK15*PROFILE!$G$9,COUNTRY_INFO!D15*AL15*PROFILE!$G$9,COUNTRY_INFO!D15*AM15*PROFILE!$G$9,IF(AND(DISTRICT!Z15<>\"Unknown\",Z15<>\"Not required\"),COUNTRY_INFO!O15*DISTRICT!AN15,0))","v":0},{"$f":"MAX(COUNTRY_INFO!D15*AK15*PROFILE!$G$10,COUNTRY_INFO!D15*AL15*PROFILE!$G$10,IF(AND(DISTRICT!Z15<>\"Unknown\",Z15<>\"Not required\"),COUNTRY_INFO!O15*DISTRICT!AO15,0))","v":0},0,0,{"$f":"MAX('MDA2'!J15,'T1'!L15,'T2'!J15,T3_R1!K15,T3_R2!K15)","v":0},{"$f":"MAX('MDA1'!K15,'MDA2'!K15,'MDA3'!I15,'MDA3'!L15,'T1'!M15,'T2'!K15,T3_R1!L15,T3_R2!L15)","v":0},{"$f":"MAX('MDA1'!L15,'MDA2'!L15,'MDA3'!J15,'MDA3'!M15,'T1'!N15,'T2'!L15,T3_R1!M15,T3_R2!M15)","v":0},0,{"$f":"MAX('MDA2'!J15,T15)","v":0},{"$f":"MAX('MDA1'!K15,'MDA2'!K15,'MDA3'!I15,'MDA3'!L15,V15,AD15)","v":0},{"$f":"MAX('MDA1'!L15,'MDA2'!L15,'MDA3'!J15,'MDA3'!M15,AF15)","v":0},0,0]
[{"$f":"IF(COUNTRY_INFO!A16=0,\" \",COUNTRY_INFO!A16)","v":"Guinea"},{"$f":"IF(COUNTRY_INFO!B16=0,\" \",COUNTRY_INFO!B16)","v":"Conakry"},{"$f":"IF(COUNTRY_INFO!C16=0,\" \",COUNTRY_INFO!C16)","v":"Matam"},{"$f":"COUNTRY_INFO!L16","v":0},null,null,{"$f":"MAX('MDA1'!M16,'MDA2'!M16)","v":0},{"$f":"IF(AND(COUNTRY_INFO!H16>0,COUNTRY_INFO!H16<4),IF(D16>MAX('MDA1'!M16,'MDA2'!M16),MAX('MDA1'!M16,'MDA2'!M16),D16),0)","v":0},{"$f":"IF(AND(COUNTRY_INFO!H16>0,COUNTRY_INFO!H16<4), IF(G16/D16*100<>0, IF(G16/D16*100>100,100,G16/D16*100), \"-\"),0)","v":0},{"$f":"COUNTRY_INFO!M16","v":0},null,0,{"$f":"MAX('MDA1'!M16,MAX('MDA3'!I16,'MDA3'!L16)+MAX('MDA3'!J16,'MDA3'!M16))","v":0},{"$f":"IF(AND(COUNTRY_INFO!I16>0,COUNTRY_INFO!I16<4),IF(J16>MAX('MDA1'!M16,MAX('MDA3'!I16,'MDA3'!L16)+MAX('MDA3'!J16,'MDA3'!M16)),MAX('MDA1'!M16,MAX('MDA3'!I16,'MDA3'!L16)+MAX('MDA3'!J16,'MDA3'!M16)),J16),0)","v":0},{"$f":"IF(AND(COUNTRY_INFO!I16>0,COUNTRY_INFO!I16<4), IF(M16/J16*100<>0, IF(M16/J16*100>100,100,M16/J16*100), \"-\"),0)","v":0},{"$f":"COUNTRY_INFO!N16","v":0},null,null,{"$f":"SUM(MAX('MDA2'!J16, 'T1'!L16, MAX(T3_R1!K16, T3_R2!K16)), MAX('MDA1'!K16, 'MDA2'!K16, 'T1'!M16, MAX(T3_R1!L16, T3_R2!L16)), MAX('MDA1'!L16, 'MDA2'!L16, 'T1'!N16, MAX(T3_R1!M16, T3_R2!M16)))","v":0},{"$f":"IF(AND(COUNTRY_INFO!J16>1,COUNTRY_INFO!J16<4),IF(COUNTRY_INFO!E16>MAX('MDA2'!J16,'T1'!L16,MAX(T3_R1!K16,T3_R2!K16)),MAX('MDA2'!J16,'T1'!L16,MAX(T3_R1!K16,T3_R2!K16)),COUNTRY_INFO!E16),0)","v":0},{"$f":"IF(AND(COUNTRY_INFO!J16>1,COUNTRY_INFO!J16<4), IF(T16/COUNTRY_INFO!E16*100<>0, IF(T16/COUNTRY_INFO!E16*100>100,100,T16/COUNTRY_INFO!E16*100), \"-\"),0)","v":0},{"$f":"IF(AND(COUNTRY_INFO!J16>1,COUNTRY_INFO!J16<4),IF(COUNTRY_INFO!F16>MAX('MDA1'!K16,'MDA2'!K16,'T1'!M16,MAX(T3_R1!L16,T3_R2!L16)),MAX('MDA1'!K16,'MDA2'!K16,'T1'!M16,MAX(T3_R1!L16,T3_R2!L16)),COUNTRY_INFO!F16),0)","v":0},{"$f":"IF(AND(COUNTRY_INFO!J16>1,COUNTRY_INFO!J16<4), IF(V16/COUNTRY_INFO!F16*100<>0, IF(V16/COUNTRY_INFO!F16*100>100,100,V16/COUNTRY_INFO!F16*100), \"-\"),0)","v":0},0,{"$f":"IF(AND(COUNTRY_INFO!J16>1,COUNTRY_INFO!J16<4), IF(S16/P16*100<>0, IF(X16/P16*100>100,100,X16/P16*100), \"-\"),0)","v":0},{"$f":"COUNTRY_INFO!O16","v":0},null,null,{"$f":"MAX(SUM('T1'!L16:'T1'!N16),SUM('T2'!J16:'T2'!L16))","v":0},{"$f":"IF(COUNTRY_INFO!K16=1,IF(COUNTRY_INFO!F16*0.33>MAX('T1'!M16,'T2'!K16),MAX('T1'!M16,'T2'!K16),COUNTRY_INFO!F16*0.33),IF(COUNTRY_INFO!K16=2,IF(COUNTRY_INFO!F16*0.5>MAX('T1'!M16,'T2'!K16),MAX('T1'!M16,'T2'!K16),COUNTRY_INFO!F16*0.5),IF(COUNTRY_INFO!K16=3,IF(COUNTRY_INFO!F16>MAX('T1'!M16,'T2'!K16),MAX('T1'!M16,'T2'!K16),COUNTRY_INFO!F16),0)))","v":0},{"$f":"IF(AND(COUNTRY_INFO!K16>0,COUNTRY_INFO!K16<4),IF(Z16>0,IF(COUNTRY_INFO!K16=1, AD16/(COUNTRY_INFO!F16*0.33)*100, IF(COUNTRY_INFO!K16=2, AD16/(COUNTRY_INFO!F16*0.5)*100, IF(COUNTRY_INFO!K16=3, AD16/COUNTRY_INFO!F16*100))),\"-\"),0)","v":0},{"$f":"IF(COUNTRY_INFO!K16=2,IF(COUNTRY_INFO!G16*0.2>MAX('T1'!N16,'T2'!L16),MAX('T1'!N16,'T2'!L16),COUNTRY_INFO!G16*0.2),IF(COUNTRY_INFO!K16=3,IF(COUNTRY_INFO!G16>MAX('T1'!N16,'T2'!L16),MAX('T1'!N16,'T2'!L16),COUNTRY_INFO!G16),0))","v":0},{"$f":"IF(AND(COUNTRY_INFO!K16>0,COUNTRY_INFO!K16<4),IF(Z16>0,IF(COUNTRY_INFO!K16=1, 0, IF(COUNTRY_INFO!K16=2, AF16/(COUNTRY_INFO!G16*0.2)*100, IF(COUNTRY_INFO!K16=3, AF16/COUNTRY_INFO!G16*100))),\"-\"),0)","v":0},0,{"$f":"IF(AND(COUNTRY_INFO!K16>0,COUNTRY_INFO!K16<4), IF(AC16/Z16*100<>0, IF(AH16/Z16*100>100,100,AH16/Z16*100), \"-\"),0)","v":0},null,{"$f":"IF(AND(D16<>0, D16<>\"Unknown\",D16<>\"Stopped\",D16<>\"Not required\"),D16/COUNTRY_INFO!D16, 0)","v":0},{"$f":"IF(AND(J16<>0,J16<>\"Unknown\",J16<>\"Stopped\",J16<>\"Not required\"),J16/COUNTRY_INFO!D16, 0)","v":0},{"$f":"IF(AND(P16<>0,P16<>\"Unknown\",P16<>\"Not required\"),P16/(COUNTRY_INFO!E16+COUNTRY_INFO!F16), 0)","v":0},{"$f":"IF(AND(Z16<>0,Z16<>\"Unknown\",Z16<>\"Not required\"),IF(COUNTRY_INFO!K16=1,1,IF(COUNTRY_INFO!K16=2,0.5*COUNTRY_INFO!F16/(0.5*COUNTRY_INFO!F16+0.2*COUNTRY_INFO!G16),IF(COUNTRY_INFO!K16=3,COUNTRY_INFO!F16/(COUNTRY_INFO!F16+COUNTRY_INFO!G16)))),0)","v":0},{"$f":"IF(AND(Z16<>0,Z16<>\"Unknown\",Z16<>\"Not required\"),IF(COUNTRY_INFO!K16=1,0,IF(COUNTRY_INFO!K16=2,0.2*COUNTRY_INFO!G16/(0.5*COUNTRY_INFO!F16+0.2*COUNTRY_INFO!G16),IF(COUNTRY_INFO!K16=3,COUNTRY_INFO!G16/(COUNTRY_INFO!F16+COUNTRY_INFO!G16)))),0)","v":0},{"$f":"MAX(COUNTRY_INFO!D16*AK16*PROFILE!$G$7,COUNTRY_INFO!D16*AL16*PROFILE!$G$7)","v":0},{"$f":"MAX(COUNTRY_INFO!D16*AK16*PROFILE!$G$8,COUNTRY_INFO!D16*AL16*PROFILE!$G$8,COUNTRY_INFO!D16*AM16*PROFILE!$G$8)","v":0},{"$f":"MAX(COUNTRY_INFO!D16*AK16*PROFILE!$G$9,COUNTRY_INFO!D16*AL16*PROFILE!$G$9,COUNTRY_INFO!D16*AM16*PROFILE!$G$9,IF(AND(DISTRICT!Z16<>\"Unknown\",Z16<>\"Not required\"),COUNTRY_INFO!O16*DISTRICT!AN16,0))","v":0},{"$f":"MAX(COUNTRY_INFO!D16*AK16*PROFILE!$G$10,COUNTRY_INFO!D16*AL16*PROFILE!$G$10,IF(AND(DISTRICT!Z16<>\"Unknown\",Z16<>\"Not required\"),COUNTRY_INFO!O16*DISTRICT!AO16,0))","v":0},0,0,{"$f":"MAX('MDA2'!J16,'T1'!L16,'T2'!J16,T3_R1!K16,T3_R2!K16)","v":0},{"$f":"MAX('MDA1'!K16,'MDA2'!K16,'MDA3'!I16,'MDA3'!L16,'T1'!M16,'T2'!K16,T3_R1!L16,T3_R2!L16)","v":0},{"$f":"MAX('MDA1'!L16,'MDA2'!L16,'MDA3'!J16,'MDA3'!M16,'T1'!N16,'T2'!L16,T3_R1!M16,T3_R2!M16)","v":0},0,{"$f":"MAX('MDA2'!J16,T16)","v":0},{"$f":"MAX('MDA1'!K16,'MDA2'!K16,'MDA3'!I16,'MDA3'!L16,V16,AD16)","v":0},{"$f":"MAX('MDA1'!L16,'MDA2'!L16,'MDA3'!J16,'MDA3'!M16,AF16)","v":0},0,0]
[{"$f":"IF(COUNTRY_INFO!A17=0,\" \",COUNTRY_INFO!A17)","v":"Guinea"},{"$f":"IF(COUNTRY_INFO!B17=0,\" \",COUNTRY_INFO!B17)","v":"Conakry"},{"$f":"IF(COUNTRY_INFO!C17=0,\" \",COUNTRY_INFO!C17)","v":"Matoto"},{"$f":"COUNTRY_INFO!L17","v":0},null,null,{"$f":"MAX('MDA1'!M17,'MDA2'!M17)","v":0},{"$f":"IF(AND(COUNTRY_INFO!H17>0,COUNTRY_INFO!H17<4),IF(D17>MAX('MDA1'!M17,'MDA2'!M17),MAX('MDA1'!M17,'MDA2'!M17),D17),0)","v":0},{"$f":"IF(AND(COUNTRY_INFO!H17>0,COUNTRY_INFO!H17<4), IF(G17/D17*100<>0, IF(G17/D17*100>100,100,G17/D17*100), \"-\"),0)","v":0},{"$f":"COUNTRY_INFO!M17","v":0},null,0,{"$f":"MAX('MDA1'!M17,MAX('MDA3'!I17,'MDA3'!L17)+MAX('MDA3'!J17,'MDA3'!M17))","v":0},{"$f":"IF(AND(COUNTRY_INFO!I17>0,COUNTRY_INFO!I17<4),IF(J17>MAX('MDA1'!M17,MAX('MDA3'!I17,'MDA3'!L17)+MAX('MDA3'!J17,'MDA3'!M17)),MAX('MDA1'!M17,MAX('MDA3'!I17,'MDA3'!L17)+MAX('MDA3'!J17,'MDA3'!M17)),J17),0)","v":0},{"$f":"IF(AND(COUNTRY_INFO!I17>0,COUNTRY_INFO!I17<4), IF(M17/J17*100<>0, IF(M17/J17*100>100,100,M17/J17*100), \"-\"),0)","v":0},{"$f":"COUNTRY_INFO!N17","v":0},null,null,{"$f":"SUM(MAX('MDA2'!J17, 'T1'!L17, MAX(T3_R1!K17, T3_R2!K17)), MAX('MDA1'!K17, 'MDA2'!K17, 'T1'!M17, MAX(T3_R1!L17, T3_R2!L17)), MAX('MDA1'!L17, 'MDA2'!L17, 'T1'!N17, MAX(T3_R1!M17, T3_R2!M17)))","v":0},{"$f":"IF(AND(COUNTRY_INFO!J17>1,COUNTRY_INFO!J17<4),IF(COUNTRY_INFO!E17>MAX('MDA2'!J17,'T1'!L17,MAX(T3_R1!K17,T3_R2!K17)),MAX('MDA2'!J17,'T1'!L17,MAX(T3_R1!K17,T3_R2!K17)),COUNTRY_INFO!E17),0)","v":0},{"$f":"IF(AND(COUNTRY_INFO!J17>1,COUNTRY_INFO!J17<4), IF(T17/COUNTRY_INFO!E17*100<>0, IF(T17/COUNTRY_INFO!E17*100>100,100,T17/COUNTRY_INFO!E17*100), \"-\"),0)","v":0},{"$f":"IF(AND(COUNTRY_INFO!J17>1,COUNTRY_INFO!J17<4),IF(COUNTRY_INFO!F17>MAX('MDA1'!K17,'MDA2'!K17,'T1'!M17,MAX(T3_R1!L17,T3_R2!L17)),MAX('MDA1'!K17,'MDA2'!K17,'T1'!M17,MAX(T3_R1!L17,T3_R2!L17)),COUNTRY_INFO!F17),0)","v":0},{"$f":"IF(AND(COUNTRY_INFO!J17>1,COUNTRY_INFO!J17<4), IF(V17/COUNTRY_INFO!F17*100<>0, IF(V17/COUNTRY_INFO!F17*100>100,100,V17/COUNTRY_INFO!F17*100), \"-\"),0)","v":0},0,{"$f":"IF(AND(COUNTRY_INFO!J17>1,COUNTRY_INFO!J17<4), IF(S17/P17*100<>0, IF(X17/P17*100>100,100,X17/P17*100), \"-\"),0)","v":0},{"$f":"COUNTRY_INFO!O17","v":163629.40000000002},null,null,{"$f":"MAX(SUM('T1'!L17:'T1'!N17),SUM('T2'!J17:'T2'!L17))","v":0},{"$f":"IF(COUNTRY_INFO!K17=1,IF(COUNTRY_INFO!F17*0.33>MAX('T1'!M17,'T2'!K17),MAX('T1'!M17,'T2'!K17),COUNTRY_INFO!F17*0.33),IF(COUNTRY_INFO!K17=2,IF(COUNTRY_INFO!F17*0.5>MAX('T1'!M17,'T2'!K17),MAX('T1'!M17,'T2'!K17),COUNTRY_INFO!F17*0.5),IF(COUNTRY_INFO!K17=3,IF(COUNTRY_INFO!F17>MAX('T1'!M17,'T2'!K17),MAX('T1'!M17,'T2'!K17),COUNTRY_INFO!F17),0)))","v":0},{"$f":"IF(AND(COUNTRY_INFO!K17>0,COUNTRY_INFO!K17<4),IF(Z17>0,IF(COUNTRY_INFO!K17=1, AD17/(COUNTRY_INFO!F17*0.33)*100, IF(COUNTRY_INFO!K17=2, AD17/(COUNTRY_INFO!F17*0.5)*100, IF(COUNTRY_INFO!K17=3, AD17/COUNTRY_INFO!F17*100))),\"-\"),0)","v":0},{"$f":"IF(COUNTRY_INFO!K17=2,IF(COUNTRY_INFO!G17*0.2>MAX('T1'!N17,'T2'!L17),MAX('T1'!N17,'T2'!L17),COUNTRY_INFO!G17*0.2),IF(COUNTRY_INFO!K17=3,IF(COUNTRY_INFO!G17>MAX('T1'!N17,'T2'!L17),MAX('T1'!N17,'T2'!L17),COUNTRY_INFO!G17),0))","v":0},{"$f":"IF(AND(COUNTRY_INFO!K17>0,COUNTRY_INFO!K17<4),IF(Z17>0,IF(COUNTRY_INFO!K17=1, 0, IF(COUNTRY_INFO!K17=2, AF17/(COUNTRY_INFO!G17*0.2)*100, IF(COUNTRY_INFO!K17=3, AF17/COUNTRY_INFO!G17*100))),\"-\"),0)","v":0},0,{"$f":"IF(AND(COUNTRY_INFO!K17>0,COUNTRY_INFO!K17<4), IF(AC17/Z17*100<>0, IF(AH17/Z17*100>100,100,AH17/Z17*100), \"-\"),0)","v":"-"},null,{"$f":"IF(AND(D17<>0, D17<>\"Unknown\",D17<>\"Stopped\",D17<>\"Not required\"),D17/COUNTRY_INFO!D17, 0)","v":0},{"$f":"IF(AND(J17<>0,J17<>\"Unknown\",J17<>\"Stopped\",J17<>\"Not required\"),J17/COUNTRY_INFO!D17, 0)","v":0},{"$f":"IF(AND(P17<>0,P17<>\"Unknown\",P17<>\"Not required\"),P17/(COUNTRY_INFO!E17+COUNTRY_INFO!F17), 0)","v":0},{"$f":"IF(AND(Z17<>0,Z17<>\"Unknown\",Z17<>\"Not required\"),IF(COUNTRY_INFO!K17=1,1,IF(COUNTRY_INFO!K17=2,0.5*COUNTRY_INFO!F17/(0.5*COUNTRY_INFO!F17+0.2*COUNTRY_INFO!G17),IF(COUNTRY_INFO!K17=3,COUNTRY_INFO!F17/(COUNTRY_INFO!F17+COUNTRY_INFO!G17)))),0)","v":0.53191541373371776},{"$f":"IF(AND(Z17<>0,Z17<>\"Unknown\",Z17<>\"Not required\"),IF(COUNTRY_INFO!K17=1,0,IF(COUNTRY_INFO!K17=2,0.2*COUNTRY_INFO!G17/(0.5*COUNTRY_INFO!F17+0.2*COUNTRY_INFO!G17),IF(COUNTRY_INFO!K17=3,COUNTRY_INFO!G17/(COUNTRY_INFO!F17+COUNTRY_INFO!G17)))),0)","v":0.46808458626628219},{"$f":"MAX(COUNTRY_INFO!D17*AK17*PROFILE!$G$7,COUNTRY_INFO!D17*AL17*PROFILE!$G$7)","v":0},{"$f":"MAX(COUNTRY_INFO!D17*AK17*PROFILE!$G$8,COUNTRY_INFO!D17*AL17*PROFILE!$G$8,COUNTRY_INFO!D17*AM17*PROFILE!$G$8)","v":0},{"$f":"MAX(COUNTRY_INFO!D17*AK17*PROFILE!$G$9,COUNTRY_INFO!D17*AL17*PROFILE!$G$9,COUNTRY_INFO!D17*AM17*PROFILE!$G$9,IF(AND(DISTRICT!Z17<>\"Unknown\",Z17<>\"Not required\"),COUNTRY_INFO!O17*DISTRICT!AN17,0))","v":87037.000000000015},{"$f":"MAX(COUNTRY_INFO!D17*AK17*PROFILE!$G$10,COUNTRY_INFO!D17*AL17*PROFILE!$G$10,IF(AND(DISTRICT!Z17<>\"Unknown\",Z17<>\"Not required\"),COUNTRY_INFO!O17*DISTRICT!AO17,0))","v":76592.400000000009},163629.40000000002,0,{"$f":"MAX('MDA2'!J17,'T1'!L17,'T2'!J17,T3_R1!K17,T3_R2!K17)","v":0},{"$f":"MAX('MDA1'!K17,'MDA2'!K17,'MDA3'!I17,'MDA3'!L17,'T1'!M17,'T2'!K17,T3_R1!L17,T3_R2!L17)","v":0},{"$f":"MAX('MDA1'!L17,'MDA2'!L17,'MDA3'!J17,'MDA3'!M17,'T1'!N17,'T2'!L17,T3_R1!M17,T3_R2!M17)","v":0},0,{"$f":"MAX('MDA2'!J17,T17)","v":0},{"$f":"MAX('MDA1'!K17,'MDA2'!K17,'MDA3'!I17,'MDA3'!L17,V17,AD17)","v":0},{"$f":"MAX('MDA1'!L17,'MDA2'!L17,'MDA3'!J17,'MDA3'!M17,AF17)","v":0},0,0]
[{"$f":"IF(COUNTRY_INFO!A18=0,\" \",COUNTRY_INFO!A18)","v":"Guinea"},{"$f":"IF(COUNTRY_INFO!B18=0,\" \",COUNTRY_INFO!B18)","v":"Conakry"},{"$f":"IF(COUNTRY_INFO!C18=0,\" \",COUNTRY_INFO!C18)","v":"Ratoma"},{"$f":"COUNTRY_INFO!L18","v":0},null,null,{"$f":"MAX('MDA1'!M18,'MDA2'!M18)","v":0},{"$f":"IF(AND(COUNTRY_INFO!H18>0,COUNTRY_INFO!H18<4),IF(D18>MAX('MDA1'!M18,'MDA2'!M18),MAX('MDA1'!M18,'MDA2'!M18),D18),0)","v":0},{"$f":"IF(AND(COUNTRY_INFO!H18>0,COUNTRY_INFO!H18<4), IF(G18/D18*100<>0, IF(G18/D18*100>100,100,G18/D18*100), \"-\"),0)","v":0},{"$f":"COUNTRY_INFO!M18","v":0},null,0,{"$f":"MAX('MDA1'!M18,MAX('MDA3'!I18,'MDA3'!L18)+MAX('MDA3'!J18,'MDA3'!M18))","v":0},{"$f":"IF(AND(COUNTRY_INFO!I18>0,COUNTRY_INFO!I18<4),IF(J18>MAX('MDA1'!M18,MAX('MDA3'!I18,'MDA3'!L18)+MAX('MDA3'!J18,'MDA3'!M18)),MAX('MDA1'!M18,MAX('MDA3'!I18,'MDA3'!L18)+MAX('MDA3'!J18,'MDA3'!M18)),J18),0)","v":0},{"$f":"IF(AND(COUNTRY_INFO!I18>0,COUNTRY_INFO!I18<4), IF(M18/J18*100<>0, IF(M18/J18*100>100,100,M18/J18*100), \"-\"),0)","v":0},{"$f":"COUNTRY_INFO!N18","v":0},null,null,{"$f":"SUM(MAX('MDA2'!J18, 'T1'!L18, MAX(T3_R1!K18, T3_R2!K18)), MAX('MDA1'!K18, 'MDA2'!K18, 'T1'!M18, MAX(T3_R1!L18, T3_R2!L18)), MAX('MDA1'!L18, 'MDA2'!L18, 'T1'!N18, MAX(T3_R1!M18, T3_R2!M18)))","v":0},{"$f":"IF(AND(COUNTRY_INFO!J18>1,COUNTRY_INFO!J18<4),IF(COUNTRY_INFO!E18>MAX('MDA2'!J18,'T1'!L18,MAX(T3_R1!K18,T3_R2!K18)),MAX('MDA2'!J18,'T1'!L18,MAX(T3_R1!K18,T3_R2!K18)),COUNTRY_INFO!E18),0)","v":0},{"$f":"IF(AND(COUNTRY_INFO!J18>1,COUNTRY_INFO!J18<4), IF(T18/COUNTRY_INFO!E18*100<>0, IF(T18/COUNTRY_INFO!E18*100>100,100,T18/COUNTRY_INFO!E18*100), \"-\"),0)","v":0},{"$f":"IF(AND(COUNTRY_INFO!J18>1,COUNTRY_INFO!J18<4),IF(COUNTRY_INFO!F18>MAX('MDA1'!K18,'MDA2'!K18,'T1'!M18,MAX(T3_R1!L18,T3_R2!L18)),MAX('MDA1'!K18,'MDA2'!K18,'T1'!M18,MAX(T3_R1!L18,T3_R2!L18)),COUNTRY_INFO!F18),0)","v":0},{"$f":"IF(AND(COUNTRY_INFO!J18>1,COUNTRY_INFO!J18<4), IF(V18/COUNTRY_INFO!F18*100<>0, IF(V18/COUNTRY_INFO!F18*100>100,100,V18/COUNTRY_INFO!F18*100), \"-\"),0)","v":0},0,{"$f":"IF(AND(COUNTRY_INFO!J18>1,COUNTRY_INFO!J18<4), IF(S18/P18*100<>0, IF(X18/P18*100>100,100,X18/P18*100), \"-\"),0)","v":0},{"$f":"COUNTRY_INFO!O18","v":160227.90000000002},null,null,{"$f":"MAX(SUM('T1'!L18:'T1'!N18),SUM('T2'!J18:'T2'!L18))","v":0},{"$f":"IF(COUNTRY_INFO!K18=1,IF(COUNTRY_INFO!F18*0.33>MAX('T1'!M18,'T2'!K18),MAX('T1'!M18,'T2'!K18),COUNTRY_INFO!F18*0.33),IF(COUNTRY_INFO!K18=2,IF(COUNTRY_INFO!F18*0.5>MAX('T1'!M18,'T2'!K18),MAX('T1'!M18,'T2'!K18),COUNTRY_INFO!F18*0.5),IF(COUNTRY_INFO!K18=3,IF(COUNTRY_INFO!F18>MAX('T1'!M18,'T2'!K18),MAX('T1'!M18,'T2'!K18),COUNTRY_INFO!F18),0)))","v":0},{"$f":"IF(AND(COUNTRY_INFO!K18>0,COUNTRY_INFO!K18<4),IF(Z18>0,IF(COUNTRY_INFO!K18=1, AD18/(COUNTRY_INFO!F18*0.33)*100, IF(COUNTRY_INFO!K18=2, AD18/(COUNTRY_INFO!F18*0.5)*100, IF(COUNTRY_INFO!K18=3, AD18/COUNTRY_INFO!F18*100))),\"-\"),0)","v":0},{"$f":"IF(COUNTRY_INFO!K18=2,IF(COUNTRY_INFO!G18*0.2>MAX('T1'!N18,'T2'!L18),MAX('T1'!N18,'T2'!L18),COUNTRY_INFO!G18*0.2),IF(COUNTRY_INFO!K18=3,IF(COUNTRY_INFO!G18>MAX('T1'!N18,'T2'!L18),MAX('T1'!N18,'T2'!L18),COUNTRY_INFO!G18),0))","v":0},{"$f":"IF(AND(COUNTRY_INFO!K18>0,COUNTRY_INFO!K18<4),IF(Z18>0,IF(COUNTRY_INFO!K18=1, 0, IF(COUNTRY_INFO!K18=2, AF18/(COUNTRY_INFO!G18*0.2)*100, IF(COUNTRY_INFO!K18=3, AF18/COUNTRY_INFO!G18*100))),\"-\"),0)","v":0},0,{"$f":"IF(AND(COUNTRY_INFO!K18>0,COUNTRY_INFO!K18<4), IF(AC18/Z18*100<>0, IF(AH18/Z18*100>100,100,AH18/Z18*100), \"-\"),0)","v":"-"},null,{"$f":"IF(AND(D18<>0, D18<>\"Unknown\",D18<>\"Stopped\",D18<>\"Not required\"),D18/COUNTRY_INFO!D18, 0)","v":0},{"$f":"IF(AND(J18<>0,J18<>\"Unknown\",J18<>\"Stopped\",J18<>\"Not required\"),J18/COUNTRY_INFO!D18, 0)","v":0},{"$f":"IF(AND(P18<>0,P18<>\"Unknown\",P18<>\"Not required\"),P18/(COUNTRY_INFO!E18+COUNTRY_INFO!F18), 0)","v":0},{"$f":"IF(AND(Z18<>0,Z18<>\"Unknown\",Z18<>\"Not required\"),IF(COUNTRY_INFO!K18=1,1,IF(COUNTRY_INFO!K18=2,0.5*COUNTRY_INFO!F18/(0.5*COUNTRY_INFO!F18+0.2*COUNTRY_INFO!G18),IF(COUNTRY_INFO!K18=3,COUNTRY_INFO!F18/(COUNTRY_INFO!F18+COUNTRY_INFO!G18)))),0)","v":0.53191422966911495},{"$f":"IF(AND(Z18<>0,Z18<>\"Unknown\",Z18<>\"Not required\"),IF(COUNTRY_INFO!K18=1,0,IF(COUNTRY_INFO!K18=2,0.2*COUNTRY_INFO!G18/(0.5*COUNTRY_INFO!F18+0.2*COUNTRY_INFO!G18),IF(COUNTRY_INFO!K18=3,COUNTRY_INFO!G18/(COUNTRY_INFO!F18+COUNTRY_INFO!G18)))),0)","v":0.46808577033088494},{"$f":"MAX(COUNTRY_INFO!D18*AK18*PROFILE!$G$7,COUNTRY_INFO!D18*AL18*PROFILE!$G$7)","v":0},{"$f":"MAX(COUNTRY_INFO!D18*AK18*PROFILE!$G$8,COUNTRY_INFO!D18*AL18*PROFILE!$G$8,COUNTRY_INFO!D18*AM18*PROFILE!$G$8)","v":0},{"$f":"MAX(COUNTRY_INFO!D18*AK18*PROFILE!$G$9,COUNTRY_INFO!D18*AL18*PROFILE!$G$9,COUNTRY_INFO!D18*AM18*PROFILE!$G$9,IF(AND(DISTRICT!Z18<>\"Unknown\",Z18<>\"Not required\"),COUNTRY_INFO!O18*DISTRICT!AN18,0))","v":85227.5},{"$f":"MAX(COUNTRY_INFO!D18*AK18*PROFILE!$G$10,COUNTRY_INFO!D18*AL18*PROFILE!$G$10,IF(AND(DISTRICT!Z18<>\"Unknown\",Z18<>\"Not required\"),COUNTRY_INFO!O18*DISTRICT!AO18,0))","v":75000.400000000009},160227.90000000002,0,{"$f":"MAX('MDA2'!J18,'T1'!L18,'T2'!J18,T3_R1!K18,T3_R2!K18)","v":0},{"$f":"MAX('MDA1'!K18,'MDA2'!K18,'MDA3'!I18,'MDA3'!L18,'T1'!M18,'T2'!K18,T3_R1!L18,T3_R2!L18)","v":0},{"$f":"MAX('MDA1'!L18,'MDA2'!L18,'MDA3'!J18,'MDA3'!M18,'T1'!N18,'T2'!L18,T3_R1!M18,T3_R2!M18)","v":0},0,{"$f":"MAX('MDA2'!J18,T18)","v":0},{"$f":"MAX('MDA1'!K18,'MDA2'!K18,'MDA3'!I18,'MDA3'!L18,V18,AD18)","v":0},{"$f":"MAX('MDA1'!L18,'MDA2'!L18,'MDA3'!J18,'MDA3'!M18,AF18)","v":0},0,0]
[{"$f":"IF(COUNTRY_INFO!A19=0,\" \",COUNTRY_INFO!A19)","v":"Guinea"},{"$f":"IF(COUNTRY_INFO!B19=0,\" \",COUNTRY_INFO!B19)","v":"Faranah"},{"$f":"IF(COUNTRY_INFO!C19=0,\" \",COUNTRY_INFO!C19)","v":"Dabola"},{"$f":"COUNTRY_INFO!L19","v":189195},null,null,{"$f":"MAX('MDA1'!M19,'MDA2'!M19)","v":147337},{"$f":"IF(AND(COUNTRY_INFO!H19>0,COUNTRY_INFO!H19<4),IF(D19>MAX('MDA1'!M19,'MDA2'!M19),MAX('MDA1'!M19,'MDA2'!M19),D19),0)","v":147337},{"$f":"IF(AND(COUNTRY_INFO!H19>0,COUNTRY_INFO!H19<4), IF(G19/D19*100<>0, IF(G19/D19*100>100,100,G19/D19*100), \"-\"),0)","v":77.875736673802166},{"$f":"COUNTRY_INFO!M19","v":189195},null,0,{"$f":"MAX('MDA1'!M19,MAX('MDA3'!I19,'MDA3'!L19)+MAX('MDA3'!J19,'MDA3'!M19))","v":147337},{"$f":"IF(AND(COUNTRY_INFO!I19>0,COUNTRY_INFO!I19<4),IF(J19>MAX('MDA1'!M19,MAX('MDA3'!I19,'MDA3'!L19)+MAX('MDA3'!J19,'MDA3'!M19)),MAX('MDA1'!M19,MAX('MDA3'!I19,'MDA3'!L19)+MAX('MDA3'!J19,'MDA3'!M19)),J19),0)","v":147337},{"$f":"IF(AND(COUNTRY_INFO!I19>0,COUNTRY_INFO!I19<4), IF(M19/J19*100<>0, IF(M19/J19*100>100,100,M19/J19*100), \"-\"),0)","v":77.875736673802166},{"$f":"COUNTRY_INFO!N19","v":0},null,null,{"$f":"SUM(MAX('MDA2'!J19, 'T1'!L19, MAX(T3_R1!K19, T3_R2!K19)), MAX('MDA1'!K19, 'MDA2'!K19, 'T1'!M19, MAX(T3_R1!L19, T3_R2!L19)), MAX('MDA1'!L19, 'MDA2'!L19, 'T1'!N19, MAX(T3_R1!M19, T3_R2!M19)))","v":147337},{"$f":"IF(AND(COUNTRY_INFO!J19>1,COUNTRY_INFO!J19<4),IF(COUNTRY_INFO!E19>MAX('MDA2'!J19,'T1'!L19,MAX(T3_R1!K19,T3_R2!K19)),MAX('MDA2'!J19,'T1'!L19,MAX(T3_R1!K19,T3_R2!K19)),COUNTRY_INFO!E19),0)","v":0},{"$f":"IF(AND(COUNTRY_INFO!J19>1,COUNTRY_INFO!J19<4), IF(T19/COUNTRY_INFO!E19*100<>0, IF(T19/COUNTRY_INFO!E19*100>100,100,T19/COUNTRY_INFO!E19*100), \"-\"),0)","v":0},{"$f":"IF(AND(COUNTRY_INFO!J19>1,COUNTRY_INFO!J19<4),IF(COUNTRY_INFO!F19>MAX('MDA1'!K19,'MDA2'!K19,'T1'!M19,MAX(T3_R1!L19,T3_R2!L19)),MAX('MDA1'!K19,'MDA2'!K19,'T1'!M19,MAX(T3_R1!L19,T3_R2!L19)),COUNTRY_INFO!F19),0)","v":0},{"$f":"IF(AND(COUNTRY_INFO!J19>1,COUNTRY_INFO!J19<4), IF(V19/COUNTRY_INFO!F19*100<>0, IF(V19/COUNTRY_INFO!F19*100>100,100,V19/COUNTRY_INFO!F19*100), \"-\"),0)","v":0},0,{"$f":"IF(AND(COUNTRY_INFO!J19>1,COUNTRY_INFO!J19<4), IF(S19/P19*100<>0, IF(X19/P19*100>100,100,X19/P19*100), \"-\"),0)","v":0},{"$f":"COUNTRY_INFO!O19","v":15608.67},null,null,{"$f":"MAX(SUM('T1'!L19:'T1'!N19),SUM('T2'!J19:'T2'!L19))","v":0},{"$f":"IF(COUNTRY_INFO!K19=1,IF(COUNTRY_INFO!F19*0.33>MAX('T1'!M19,'T2'!K19),MAX('T1'!M19,'T2'!K19),COUNTRY_INFO!F19*0.33),IF(COUNTRY_INFO!K19=2,IF(COUNTRY_INFO!F19*0.5>MAX('T1'!M19,'T2'!K19),MAX('T1'!M19,'T2'!K19),COUNTRY_INFO!F19*0.5),IF(COUNTRY_INFO!K19=3,IF(COUNTRY_INFO!F19>MAX('T1'!M19,'T2'!K19),MAX('T1'!M19,'T2'!K19),COUNTRY_INFO!F19),0)))","v":0},{"$f":"IF(AND(COUNTRY_INFO!K19>0,COUNTRY_INFO!K19<4),IF(Z19>0,IF(COUNTRY_INFO!K19=1, AD19/(COUNTRY_INFO!F19*0.33)*100, IF(COUNTRY_INFO!K19=2, AD19/(COUNTRY_INFO!F19*0.5)*100, IF(COUNTRY_INFO!K19=3, AD19/COUNTRY_INFO!F19*100))),\"-\"),0)","v":0},{"$f":"IF(COUNTRY_INFO!K19=2,IF(COUNTRY_INFO!G19*0.2>MAX('T1'!N19,'T2'!L19),MAX('T1'!N19,'T2'!L19),COUNTRY_INFO!G19*0.2),IF(COUNTRY_INFO!K19=3,IF(COUNTRY_INFO!G19>MAX('T1'!N19,'T2'!L19),MAX('T1'!N19,'T2'!L19),COUNTRY_INFO!G19),0))","v":0},{"$f":"IF(AND(COUNTRY_INFO!K19>0,COUNTRY_INFO!K19<4),IF(Z19>0,IF(COUNTRY_INFO!K19=1, 0, IF(COUNTRY_INFO!K19=2, AF19/(COUNTRY_INFO!G19*0.2)*100, IF(COUNTRY_INFO!K19=3, AF19/COUNTRY_INFO!G19*100))),\"-\"),0)","v":0},0,{"$f":"IF(AND(COUNTRY_INFO!K19>0,COUNTRY_INFO!K19<4), IF(AC19/Z19*100<>0, IF(AH19/Z19*100>100,100,AH19/Z19*100), \"-\"),0)","v":"-"},null,{"$f":"IF(AND(D19<>0, D19<>\"Unknown\",D19<>\"Stopped\",D19<>\"Not required\"),D19/COUNTRY_INFO!D19, 0)","v":1},{"$f":"IF(AND(J19<>0,J19<>\"Unknown\",J19<>\"Stopped\",J19<>\"Not required\"),J19/COUNTRY_INFO!D19, 0)","v":1},{"$f":"IF(AND(P19<>0,P19<>\"Unknown\",P19<>\"Not required\"),P19/(COUNTRY_INFO!E19+COUNTRY_INFO!F19), 0)","v":0},{"$f":"IF(AND(Z19<>0,Z19<>\"Unknown\",Z19<>\"Not required\"),IF(COUNTRY_INFO!K19=1,1,IF(COUNTRY_INFO!K19=2,0.5*COUNTRY_INFO!F19/(0.5*COUNTRY_INFO!F19+0.2*COUNTRY_INFO!G19),IF(COUNTRY_INFO!K19=3,COUNTRY_INFO!F19/(COUNTRY_INFO!F19+COUNTRY_INFO!G19)))),0)","v":1},{"$f":"IF(AND(Z19<>0,Z19<>\"Unknown\",Z19<>\"Not required\"),IF(COUNTRY_INFO!K19=1,0,IF(COUNTRY_INFO!K19=2,0.2*COUNTRY_INFO!G19/(0.5*COUNTRY_INFO!F19+0.2*COUNTRY_INFO!G19),IF(COUNTRY_INFO!K19=3,COUNTRY_INFO!G19/(COUNTRY_INFO!F19+COUNTRY_INFO!G19)))),0)","v":0},{"$f":"MAX(COUNTRY_INFO!D19*AK19*PROFILE!$G$7,COUNTRY_INFO!D19*AL19*PROFILE!$G$7)","v":7567.8117048600707},{"$f":"MAX(COUNTRY_INFO!D19*AK19*PROFILE!$G$8,COUNTRY_INFO!D19*AL19*PROFILE!$G$8,COUNTRY_INFO!D19*AM19*PROFILE!$G$8)","v":30271.126328233673},{"$f":"MAX(COUNTRY_INFO!D19*AK19*PROFILE!$G$9,COUNTRY_INFO!D19*AL19*PROFILE!$G$9,COUNTRY_INFO!D19*AM19*PROFILE!$G$9,IF(AND(DISTRICT!Z19<>\"Unknown\",Z19<>\"Not required\"),COUNTRY_INFO!O19*DISTRICT!AN19,0))","v":47298.823155375438},{"$f":"MAX(COUNTRY_INFO!D19*AK19*PROFILE!$G$10,COUNTRY_INFO!D19*AL19*PROFILE!$G$10,IF(AND(DISTRICT!Z19<>\"Unknown\",Z19<>\"Not required\"),COUNTRY_INFO!O19*DISTRICT!AO19,0))","v":104057.23881153081},189195,0,{"$f":"MAX('MDA2'!J19,'T1'!L19,'T2'!J19,T3_R1!K19,T3_R2!K19)","v":0},{"$f":"MAX('MDA1'!K19,'MDA2'!K19,'MDA3'!I19,'MDA3'!L19,'T1'!M19,'T2'!K19,T3_R1!L19,T3_R2!L19)","v":79401},{"$f":"MAX('MDA1'!L19,'MDA2'!L19,'MDA3'!J19,'MDA3'!M19,'T1'!N19,'T2'!L19,T3_R1!M19,T3_R2!M19)","v":67936},147337,{"$f":"MAX('MDA2'!J19,T19)","v":0},{"$f":"MAX('MDA1'!K19,'MDA2'!K19,'MDA3'!I19,'MDA3'!L19,V19,AD19)","v":79401},{"$f":"MAX('MDA1'!L19,'MDA2'!L19,'MDA3'!J19,'MDA3'!M19,AF19)","v":67936},147337,77.875736673802166]
[{"$f":"IF(COUNTRY_INFO!A20=0,\" \",COUNTRY_INFO!A20)","v":"Guinea"},{"$f":"IF(COUNTRY_INFO!B20=0,\" \",COUNTRY_INFO!B20)","v":"Faranah"},{"$f":"IF(COUNTRY_INFO!C20=0,\" \",COUNTRY_INFO!C20)","v":"Dinguiraye"},{"$f":"COUNTRY_INFO!L20","v":205209},null,null,{"$f":"MAX('MDA1'!M20,'MDA2'!M20)","v":159945},{"$f":"IF(AND(COUNTRY_INFO!H20>0,COUNTRY_INFO!H20<4),IF(D20>MAX('MDA1'!M20,'MDA2'!M20),MAX('MDA1'!M20,'MDA2'!M20),D20),0)","v":159945},{"$f":"IF(AND(COUNTRY_INFO!H20>0,COUNTRY_INFO!H20<4), IF(G20/D20*100<>0, IF(G20/D20*100>100,100,G20/D20*100), \"-\"),0)","v":77.942487902577369},{"$f":"COUNTRY_INFO!M20","v":205209},null,0,{"$f":"MAX('MDA1'!M20,MAX('MDA3'!I20,'MDA3'!L20)+MAX('MDA3'!J20,'MDA3'!M20))","v":159945},{"$f":"IF(AND(COUNTRY_INFO!I20>0,COUNTRY_INFO!I20<4),IF(J20>MAX('MDA1'!M20,MAX('MDA3'!I20,'MDA3'!L20)+MAX('MDA3'!J20,'MDA3'!M20)),MAX('MDA1'!M20,MAX('MDA3'!I20,'MDA3'!L20)+MAX('MDA3'!J20,'MDA3'!M20)),J20),0)","v":159945},{"$f":"IF(AND(COUNTRY_INFO!I20>0,COUNTRY_INFO!I20<4), IF(M20/J20*100<>0, IF(M20/J20*100>100,100,M20/J20*100), \"-\"),0)","v":77.942487902577369},{"$f":"COUNTRY_INFO!N20","v":0},null,null,{"$f":"SUM(MAX('MDA2'!J20, 'T1'!L20, MAX(T3_R1!K20, T3_R2!K20)), MAX('MDA1'!K20, 'MDA2'!K20, 'T1'!M20, MAX(T3_R1!L20, T3_R2!L20)), MAX('MDA1'!L20, 'MDA2'!L20, 'T1'!N20, MAX(T3_R1!M20, T3_R2!M20)))","v":159945},{"$f":"IF(AND(COUNTRY_INFO!J20>1,COUNTRY_INFO!J20<4),IF(COUNTRY_INFO!E20>MAX('MDA2'!J20,'T1'!L20,MAX(T3_R1!K20,T3_R2!K20)),MAX('MDA2'!J20,'T1'!L20,MAX(T3_R1!K20,T3_R2!K20)),COUNTRY_INFO!E20),0)","v":0},{"$f":"IF(AND(COUNTRY_INFO!J20>1,COUNTRY_INFO!J20<4), IF(T20/COUNTRY_INFO!E20*100<>0, IF(T20/COUNTRY_INFO!E20*100>100,100,T20/COUNTRY_INFO!E20*100), \"-\"),0)","v":0},{"$f":"IF(AND(COUNTRY_INFO!J20>1,COUNTRY_INFO!J20<4),IF(COUNTRY_INFO!F20>MAX('MDA1'!K20,'MDA2'!K20,'T1'!M20,MAX(T3_R1!L20,T3_R2!L20)),MAX('MDA1'!K20,'MDA2'!K20,'T1'!M20,MAX(T3_R1!L20,T3_R2!L20)),COUNTRY_INFO!F20),0)","v":0},{"$f":"IF(AND(COUNTRY_INFO!J20>1,COUNTRY_INFO!J20<4), IF(V20/COUNTRY_INFO!F20*100<>0, IF(V20/COUNTRY_INFO!F20*100>100,100,V20/COUNTRY_INFO!F20*100), \"-\"),0)","v":0},0,{"$f":"IF(AND(COUNTRY_INFO!J20>1,COUNTRY_INFO!J20<4), IF(S20/P20*100<>0, IF(X20/P20*100>100,100,X20/P20*100), \"-\"),0)","v":0},{"$f":"COUNTRY_INFO!O20","v":164167},null,null,{"$f":"MAX(SUM('T1'!L20:'T1'!N20),SUM('T2'!J20:'T2'!L20))","v":50864},{"$f":"IF(COUNTRY_INFO!K20=1,IF(COUNTRY_INFO!F20*0.33>MAX('T1'!M20,'T2'!K20),MAX('T1'!M20,'T2'!K20),COUNTRY_INFO!F20*0.33),IF(COUNTRY_INFO!K20=2,IF(COUNTRY_INFO!F20*0.5>MAX('T1'!M20,'T2'!K20),MAX('T1'!M20,'T2'!K20),COUNTRY_INFO!F20*0.5),IF(COUNTRY_INFO!K20=3,IF(COUNTRY_INFO!F20>MAX('T1'!M20,'T2'!K20),MAX('T1'!M20,'T2'!K20),COUNTRY_INFO!F20),0)))","v":50864},{"$f":"IF(AND(COUNTRY_INFO!K20>0,COUNTRY_INFO!K20<4),IF(Z20>0,IF(COUNTRY_INFO!K20=1, AD20/(COUNTRY_INFO!F20*0.33)*100, IF(COUNTRY_INFO!K20=2, AD20/(COUNTRY_INFO!F20*0.5)*100, IF(COUNTRY_INFO!K20=3, AD20/COUNTRY_INFO!F20*100))),\"-\"),0)","v":99.146232115706994},{"$f":"IF(COUNTRY_INFO!K20=2,IF(COUNTRY_INFO!G20*0.2>MAX('T1'!N20,'T2'!L20),MAX('T1'!N20,'T2'!L20),COUNTRY_INFO!G20*0.2),IF(COUNTRY_INFO!K20=3,IF(COUNTRY_INFO!G20>MAX('T1'!N20,'T2'!L20),MAX('T1'!N20,'T2'!L20),COUNTRY_INFO!G20),0))","v":0},{"$f":"IF(AND(COUNTRY_INFO!K20>0,COUNTRY_INFO!K20<4),IF(Z20>0,IF(COUNTRY_INFO!K20=1, 0, IF(COUNTRY_INFO!K20=2, AF20/(COUNTRY_INFO!G20*0.2)*100, IF(COUNTRY_INFO!K20=3, AF20/COUNTRY_INFO!G20*100))),\"-\"),0)","v":0},50864,{"$f":"IF(AND(COUNTRY_INFO!K20>0,COUNTRY_INFO!K20<4), IF(AC20/Z20*100<>0, IF(AH20/Z20*100>100,100,AH20/Z20*100), \"-\"),0)","v":30.98308429830599},null,{"$f":"IF(AND(D20<>0, D20<>\"Unknown\",D20<>\"Stopped\",D20<>\"Not required\"),D20/COUNTRY_INFO!D20, 0)","v":1},{"$f":"IF(AND(J20<>0,J20<>\"Unknown\",J20<>\"Stopped\",J20<>\"Not required\"),J20/COUNTRY_INFO!D20, 0)","v":1},{"$f":"IF(AND(P20<>0,P20<>\"Unknown\",P20<>\"Not required\"),P20/(COUNTRY_INFO!E20+COUNTRY_INFO!F20), 0)","v":0},{"$f":"IF(AND(Z20<>0,Z20<>\"Unknown\",Z20<>\"Not required\"),IF(COUNTRY_INFO!K20=1,1,IF(COUNTRY_INFO!K20=2,0.5*COUNTRY_INFO!F20/(0.5*COUNTRY_INFO!F20+0.2*COUNTRY_INFO!G20),IF(COUNTRY_INFO!K20=3,COUNTRY_INFO!F20/(COUNTRY_INFO!F20+COUNTRY_INFO!G20)))),0)","v":0.31249885787033937},{"$f":"IF(AND(Z20<>0,Z20<>\"Unknown\",Z20<>\"Not required\"),IF(COUNTRY_INFO!K20=1,0,IF(COUNTRY_INFO!K20=2,0.2*COUNTRY_INFO!G20/(0.5*COUNTRY_INFO!F20+0.2*COUNTRY_INFO!G20),IF(COUNTRY_INFO!K20=3,COUNTRY_INFO!G20/(COUNTRY_INFO!F20+COUNTRY_INFO!G20)))),0)","v":0.68750114212966063},{"$f":"MAX(COUNTRY_INFO!D20*AK20*PROFILE!$G$7,COUNTRY_INFO!D20*AL20*PROFILE!$G$7)","v":8208.3726955925376},{"$f":"MAX(COUNTRY_INFO!D20*AK20*PROFILE!$G$8,COUNTRY_INFO!D20*AL20*PROFILE!$G$8,COUNTRY_INFO!D20*AM20*PROFILE!$G$8)","v":32833.360092446965},{"$f":"MAX(COUNTRY_INFO!D20*AK20*PROFILE!$G$9,COUNTRY_INFO!D20*AL20*PROFILE!$G$9,COUNTRY_INFO!D20*AM20*PROFILE!$G$9,IF(AND(DISTRICT!Z20<>\"Unknown\",Z20<>\"Not required\"),COUNTRY_INFO!O20*DISTRICT!AN20,0))","v":51302.329347453357},{"$f":"MAX(COUNTRY_INFO!D20*AK20*PROFILE!$G$10,COUNTRY_INFO!D20*AL20*PROFILE!$G$10,IF(AND(DISTRICT!Z20<>\"Unknown\",Z20<>\"Not required\"),COUNTRY_INFO!O20*DISTRICT!AO20,0))","v":112865},205209.06213549286,"Y",{"$f":"MAX('MDA2'!J20,'T1'!L20,'T2'!J20,T3_R1!K20,T3_R2!K20)","v":0},{"$f":"MAX('MDA1'!K20,'MDA2'!K20,'MDA3'!I20,'MDA3'!L20,'T1'!M20,'T2'!K20,T3_R1!L20,T3_R2!L20)","v":70227},{"$f":"MAX('MDA1'!L20,'MDA2'!L20,'MDA3'!J20,'MDA3'!M20,'T1'!N20,'T2'!L20,T3_R1!M20,T3_R2!M20)","v":89718},159945,{"$f":"MAX('MDA2'!J20,T20)","v":0},{"$f":"MAX('MDA1'!K20,'MDA2'!K20,'MDA3'!I20,'MDA3'!L20,V20,AD20)","v":70227},{"$f":"MAX('MDA1'!L20,'MDA2'!L20,'MDA3'!J20,'MDA3'!M20,AF20)","v":89718},159945,77.942464302279944]
[{"$f":"IF(COUNTRY_INFO!A21=0,\" \",COUNTRY_INFO!A21)","v":"Guinea"},{"$f":"IF(COUNTRY_INFO!B21=0,\" \",COUNTRY_INFO!B21)","v":"Faranah"},{"$f":"IF(COUNTRY_INFO!C21=0,\" \",COUNTRY_INFO!C21)","v":"Faranah"},{"$f":"COUNTRY_INFO!L21","v":292633},null,null,{"$f":"MAX('MDA1'!M21,'MDA2'!M21)","v":227123},{"$f":"IF(AND(COUNTRY_INFO!H21>0,COUNTRY_INFO!H21<4),IF(D21>MAX('MDA1'!M21,'MDA2'!M21),MAX('MDA1'!M21,'MDA2'!M21),D21),0)","v":227123},{"$f":"IF(AND(COUNTRY_INFO!H21>0,COUNTRY_INFO!H21<4), IF(G21/D21*100<>0, IF(G21/D21*100>100,100,G21/D21*100), \"-\"),0)","v":77.613597919578453},{"$f":"COUNTRY_INFO!M21","v":292633},null,0,{"$f":"MAX('MDA1'!M21,MAX('MDA3'!I21,'MDA3'!L21)+MAX('MDA3'!J21,'MDA3'!M21))","v":227123},{"$f":"IF(AND(COUNTRY_INFO!I21>0,COUNTRY_INFO!I21<4),IF(J21>MAX('MDA1'!M21,MAX('MDA3'!I21,'MDA3'!L21)+MAX('MDA3'!J21,'MDA3'!M21)),MAX('MDA1'!M21,MAX('MDA3'!I21,'MDA3'!L21)+MAX('MDA3'!J21,'MDA3'!M21)),J21),0)","v":227123},{"$f":"IF(AND(COUNTRY_INFO!I21>0,COUNTRY_INFO!I21<4), IF(M21/J21*100<>0, IF(M21/J21*100>100,100,M21/J21*100), \"-\"),0)","v":77.613597919578453},{"$f":"COUNTRY_INFO!N21","v":119979},null,null,{"$f":"SUM(MAX('MDA2'!J21, 'T1'!L21, MAX(T3_R1!K21, T3_R2!K21)), MAX('MDA1'!K21, 'MDA2'!K21, 'T1'!M21, MAX(T3_R1!L21, T3_R2!L21)), MAX('MDA1'!L21, 'MDA2'!L21, 'T1'!N21, MAX(T3_R1!M21, T3_R2!M21)))","v":227123},{"$f":"IF(AND(COUNTRY_INFO!J21>1,COUNTRY_INFO!J21<4),IF(COUNTRY_INFO!E21>MAX('MDA2'!J21,'T1'!L21,MAX(T3_R1!K21,T3_R2!K21)),MAX('MDA2'!J21,'T1'!L21,MAX(T3_R1!K21,T3_R2!K21)),COUNTRY_INFO!E21),0)","v":0},{"$f":"IF(AND(COUNTRY_INFO!J21>1,COUNTRY_INFO!J21<4), IF(T21/COUNTRY_INFO!E21*100<>0, IF(T21/COUNTRY_INFO!E21*100>100,100,T21/COUNTRY_INFO!E21*100), \"-\"),0)","v":"-"},{"$f":"IF(AND(COUNTRY_INFO!J21>1,COUNTRY_INFO!J21<4),IF(COUNTRY_INFO!F21>MAX('MDA1'!K21,'MDA2'!K21,'T1'!M21,MAX(T3_R1!L21,T3_R2!L21)),MAX('MDA1'!K21,'MDA2'!K21,'T1'!M21,MAX(T3_R1!L21,T3_R2!L21)),COUNTRY_INFO!F21),0)","v":73158},{"$f":"IF(AND(COUNTRY_INFO!J21>1,COUNTRY_INFO!J21<4), IF(V21/COUNTRY_INFO!F21*100<>0, IF(V21/COUNTRY_INFO!F21*100>100,100,V21/COUNTRY_INFO!F21*100), \"-\"),0)","v":100},73158,{"$f":"IF(AND(COUNTRY_INFO!J21>1,COUNTRY_INFO!J21<4), IF(S21/P21*100<>0, IF(X21/P21*100>100,100,X21/P21*100), \"-\"),0)","v":60.975670742379918},{"$f":"COUNTRY_INFO!O21","v":234106},null,null,{"$f":"MAX(SUM('T1'!L21:'T1'!N21),SUM('T2'!J21:'T2'!L21))","v":86182},{"$f":"IF(COUNTRY_INFO!K21=1,IF(COUNTRY_INFO!F21*0.33>MAX('T1'!M21,'T2'!K21),MAX('T1'!M21,'T2'!K21),COUNTRY_INFO!F21*0.33),IF(COUNTRY_INFO!K21=2,IF(COUNTRY_INFO!F21*0.5>MAX('T1'!M21,'T2'!K21),MAX('T1'!M21,'T2'!K21),COUNTRY_INFO!F21*0.5),IF(COUNTRY_INFO!K21=3,IF(COUNTRY_INFO!F21>MAX('T1'!M21,'T2'!K21),MAX('T1'!M21,'T2'!K21),COUNTRY_INFO!F21),0)))","v":73158},{"$f":"IF(AND(COUNTRY_INFO!K21>0,COUNTRY_INFO!K21<4),IF(Z21>0,IF(COUNTRY_INFO!K21=1, AD21/(COUNTRY_INFO!F21*0.33)*100, IF(COUNTRY_INFO!K21=2, AD21/(COUNTRY_INFO!F21*0.5)*100, IF(COUNTRY_INFO!K21=3, AD21/COUNTRY_INFO!F21*100))),\"-\"),0)","v":100},{"$f":"IF(COUNTRY_INFO!K21=2,IF(COUNTRY_INFO!G21*0.2>MAX('T1'!N21,'T2'!L21),MAX('T1'!N21,'T2'!L21),COUNTRY_INFO!G21*0.2),IF(COUNTRY_INFO!K21=3,IF(COUNTRY_INFO!G21>MAX('T1'!N21,'T2'!L21),MAX('T1'!N21,'T2'!L21),COUNTRY_INFO!G21),0))","v":0},{"$f":"IF(AND(COUNTRY_INFO!K21>0,COUNTRY_INFO!K21<4),IF(Z21>0,IF(COUNTRY_INFO!K21=1, 0, IF(COUNTRY_INFO!K21=2, AF21/(COUNTRY_INFO!G21*0.2)*100, IF(COUNTRY_INFO!K21=3, AF21/COUNTRY_INFO!G21*100))),\"-\"),0)","v":0},73158,{"$f":"IF(AND(COUNTRY_INFO!K21>0,COUNTRY_INFO!K21<4), IF(AC21/Z21*100<>0, IF(AH21/Z21*100>100,100,AH21/Z21*100), \"-\"),0)","v":31.249946605383887},null,{"$f":"IF(AND(D21<>0, D21<>\"Unknown\",D21<>\"Stopped\",D21<>\"Not required\"),D21/COUNTRY_INFO!D21, 0)","v":1},{"$f":"IF(AND(J21<>0,J21<>\"Unknown\",J21<>\"Stopped\",J21<>\"Not required\"),J21/COUNTRY_INFO!D21, 0)","v":1},{"$f":"IF(AND(P21<>0,P21<>\"Unknown\",P21<>\"Not required\"),P21/(COUNTRY_INFO!E21+COUNTRY_INFO!F21), 0)","v":1},{"$f":"IF(AND(Z21<>0,Z21<>\"Unknown\",Z21<>\"Not required\"),IF(COUNTRY_INFO!K21=1,1,IF(COUNTRY_INFO!K21=2,0.5*COUNTRY_INFO!F21/(0.5*COUNTRY_INFO!F21+0.2*COUNTRY_INFO!G21),IF(COUNTRY_INFO!K21=3,COUNTRY_INFO!F21/(COUNTRY_INFO!F21+COUNTRY_INFO!G21)))),0)","v":0.31249946605383888},{"$f":"IF(AND(Z21<>0,Z21<>\"Unknown\",Z21<>\"Not required\"),IF(COUNTRY_INFO!K21=1,0,IF(COUNTRY_INFO!K21=2,0.2*COUNTRY_INFO!G21/(0.5*COUNTRY_INFO!F21+0.2*COUNTRY_INFO!G21),IF(COUNTRY_INFO!K21=3,COUNTRY_INFO!G21/(COUNTRY_INFO!F21+COUNTRY_INFO!G21)))),0)","v":0.68750053394616117},{"$f":"MAX(COUNTRY_INFO!D21*AK21*PROFILE!$G$7,COUNTRY_INFO!D21*AL21*PROFILE!$G$7)","v":11705.338104222188},{"$f":"MAX(COUNTRY_INFO!D21*AK21*PROFILE!$G$8,COUNTRY_INFO!D21*AL21*PROFILE!$G$8,COUNTRY_INFO!D21*AM21*PROFILE!$G$8)","v":46821.166049895633},{"$f":"MAX(COUNTRY_INFO!D21*AK21*PROFILE!$G$9,COUNTRY_INFO!D21*AL21*PROFILE!$G$9,COUNTRY_INFO!D21*AM21*PROFILE!$G$9,IF(AND(DISTRICT!Z21<>\"Unknown\",Z21<>\"Not required\"),COUNTRY_INFO!O21*DISTRICT!AN21,0))","v":73158.363151388679},{"$f":"MAX(COUNTRY_INFO!D21*AK21*PROFILE!$G$10,COUNTRY_INFO!D21*AL21*PROFILE!$G$10,IF(AND(DISTRICT!Z21<>\"Unknown\",Z21<>\"Not required\"),COUNTRY_INFO!O21*DISTRICT!AO21,0))","v":160948.13269449348},292633,"Y",{"$f":"MAX('MDA2'!J21,'T1'!L21,'T2'!J21,T3_R1!K21,T3_R2!K21)","v":0},{"$f":"MAX('MDA1'!K21,'MDA2'!K21,'MDA3'!I21,'MDA3'!L21,'T1'!M21,'T2'!K21,T3_R1!L21,T3_R2!L21)","v":96996},{"$f":"MAX('MDA1'!L21,'MDA2'!L21,'MDA3'!J21,'MDA3'!M21,'T1'!N21,'T2'!L21,T3_R1!M21,T3_R2!M21)","v":130127},227123,{"$f":"MAX('MDA2'!J21,T21)","v":0},{"$f":"MAX('MDA1'!K21,'MDA2'!K21,'MDA3'!I21,'MDA3'!L21,V21,AD21)","v":96996},{"$f":"MAX('MDA1'!L21,'MDA2'!L21,'MDA3'!J21,'MDA3'!M21,AF21)","v":130127},227123,77.613597919578453]
[{"$f":"IF(COUNTRY_INFO!A22=0,\" \",COUNTRY_INFO!A22)","v":"Guinea"},{"$f":"IF(COUNTRY_INFO!B22=0,\" \",COUNTRY_INFO!B22)","v":"Faranah"},{"$f":"IF(COUNTRY_INFO!C22=0,\" \",COUNTRY_INFO!C22)","v":"Kissidougou"},{"$f":"COUNTRY_INFO!L22","v":296402},null,null,{"$f":"MAX('MDA1'!M22,'MDA2'!M22)","v":216517},{"$f":"IF(AND(COUNTRY_INFO!H22>0,COUNTRY_INFO!H22<4),IF(D22>MAX('MDA1'!M22,'MDA2'!M22),MAX('MDA1'!M22,'MDA2'!M22),D22),0)","v":216517},{"$f":"IF(AND(COUNTRY_INFO!H22>0,COUNTRY_INFO!H22<4), IF(G22/D22*100<>0, IF(G22/D22*100>100,100,G22/D22*100), \"-\"),0)","v":73.048427473498833},{"$f":"COUNTRY_INFO!M22","v":296402},null,0,{"$f":"MAX('MDA1'!M22,MAX('MDA3'!I22,'MDA3'!L22)+MAX('MDA3'!J22,'MDA3'!M22))","v":216517},{"$f":"IF(AND(COUNTRY_INFO!I22>0,COUNTRY_INFO!I22<4),IF(J22>MAX('MDA1'!M22,MAX('MDA3'!I22,'MDA3'!L22)+MAX('MDA3'!J22,'MDA3'!M22)),MAX('MDA1'!M22,MAX('MDA3'!I22,'MDA3'!L22)+MAX('MDA3'!J22,'MDA3'!M22)),J22),0)","v":216517},{"$f":"IF(AND(COUNTRY_INFO!I22>0,COUNTRY_INFO!I22<4), IF(M22/J22*100<>0, IF(M22/J22*100>100,100,M22/J22*100), \"-\"),0)","v":73.048427473498833},{"$f":"COUNTRY_INFO!N22","v":121525},null,null,{"$f":"SUM(MAX('MDA2'!J22, 'T1'!L22, MAX(T3_R1!K22, T3_R2!K22)), MAX('MDA1'!K22, 'MDA2'!K22, 'T1'!M22, MAX(T3_R1!L22, T3_R2!L22)), MAX('MDA1'!L22, 'MDA2'!L22, 'T1'!N22, MAX(T3_R1!M22, T3_R2!M22)))","v":216517},{"$f":"IF(AND(COUNTRY_INFO!J22>1,COUNTRY_INFO!J22<4),IF(COUNTRY_INFO!E22>MAX('MDA2'!J22,'T1'!L22,MAX(T3_R1!K22,T3_R2!K22)),MAX('MDA2'!J22,'T1'!L22,MAX(T3_R1!K22,T3_R2!K22)),COUNTRY_INFO!E22),0)","v":0},{"$f":"IF(AND(COUNTRY_INFO!J22>1,COUNTRY_INFO!J22<4), IF(T22/COUNTRY_INFO!E22*100<>0, IF(T22/COUNTRY_INFO!E22*100>100,100,T22/COUNTRY_INFO!E22*100), \"-\"),0)","v":"-"},{"$f":"IF(AND(COUNTRY_INFO!J22>1,COUNTRY_INFO!J22<4),IF(COUNTRY_INFO!F22>MAX('MDA1'!K22,'MDA2'!K22,'T1'!M22,MAX(T3_R1!L22,T3_R2!L22)),MAX('MDA1'!K22,'MDA2'!K22,'T1'!M22,MAX(T3_R1!L22,T3_R2!L22)),COUNTRY_INFO!F22),0)","v":74101},{"$f":"IF(AND(COUNTRY_INFO!J22>1,COUNTRY_INFO!J22<4), IF(V22/COUNTRY_INFO!F22*100<>0, IF(V22/COUNTRY_INFO!F22*100>100,100,V22/COUNTRY_INFO!F22*100), \"-\"),0)","v":100},74101,{"$f":"IF(AND(COUNTRY_INFO!J22>1,COUNTRY_INFO!J22<4), IF(S22/P22*100<>0, IF(X22/P22*100>100,100,X22/P22*100), \"-\"),0)","v":60.97593087842008},{"$f":"COUNTRY_INFO!O22","v":237122},null,null,{"$f":"MAX(SUM('T1'!L22:'T1'!N22),SUM('T2'!J22:'T2'!L22))","v":84950},{"$f":"IF(COUNTRY_INFO!K22=1,IF(COUNTRY_INFO!F22*0.33>MAX('T1'!M22,'T2'!K22),MAX('T1'!M22,'T2'!K22),COUNTRY_INFO!F22*0.33),IF(COUNTRY_INFO!K22=2,IF(COUNTRY_INFO!F22*0.5>MAX('T1'!M22,'T2'!K22),MAX('T1'!M22,'T2'!K22),COUNTRY_INFO!F22*0.5),IF(COUNTRY_INFO!K22=3,IF(COUNTRY_INFO!F22>MAX('T1'!M22,'T2'!K22),MAX('T1'!M22,'T2'!K22),COUNTRY_INFO!F22),0)))","v":74101},{"$f":"IF(AND(COUNTRY_INFO!K22>0,COUNTRY_INFO!K22<4),IF(Z22>0,IF(COUNTRY_INFO!K22=1, AD22/(COUNTRY_INFO!F22*0.33)*100, IF(COUNTRY_INFO!K22=2, AD22/(COUNTRY_INFO!F22*0.5)*100, IF(COUNTRY_INFO!K22=3, AD22/COUNTRY_INFO!F22*100))),\"-\"),0)","v":100},{"$f":"IF(COUNTRY_INFO!K22=2,IF(COUNTRY_INFO!G22*0.2>MAX('T1'!N22,'T2'!L22),MAX('T1'!N22,'T2'!L22),COUNTRY_INFO!G22*0.2),IF(COUNTRY_INFO!K22=3,IF(COUNTRY_INFO!G22>MAX('T1'!N22,'T2'!L22),MAX('T1'!N22,'T2'!L22),COUNTRY_INFO!G22),0))","v":0},{"$f":"IF(AND(COUNTRY_INFO!K22>0,COUNTRY_INFO!K22<4),IF(Z22>0,IF(COUNTRY_INFO!K22=1, 0, IF(COUNTRY_INFO!K22=2, AF22/(COUNTRY_INFO!G22*0.2)*100, IF(COUNTRY_INFO!K22=3, AF22/COUNTRY_INFO!G22*100))),\"-\"),0)","v":0},74101,{"$f":"IF(AND(COUNTRY_INFO!K22>0,COUNTRY_INFO!K22<4), IF(AC22/Z22*100<>0, IF(AH22/Z22*100>100,100,AH22/Z22*100), \"-\"),0)","v":31.250158146439382},null,{"$f":"IF(AND(D22<>0, D22<>\"Unknown\",D22<>\"Stopped\",D22<>\"Not required\"),D22/COUNTRY_INFO!D22, 0)","v":1},{"$f":"IF(AND(J22<>0,J22<>\"Unknown\",J22<>\"Stopped\",J22<>\"Not required\"),J22/COUNTRY_INFO!D22, 0)","v":1},{"$f":"IF(AND(P22<>0,P22<>\"Unknown\",P22<>\"Not required\"),P22/(COUNTRY_INFO!E22+COUNTRY_INFO!F22), 0)","v":1},{"$f":"IF(AND(Z22<>0,Z22<>\"Unknown\",Z22<>\"Not required\"),IF(COUNTRY_INFO!K22=1,1,IF(COUNTRY_INFO!K22=2,0.5*COUNTRY_INFO!F22/(0.5*COUNTRY_INFO!F22+0.2*COUNTRY_INFO!G22),IF(COUNTRY_INFO!K22=3,COUNTRY_INFO!F22/(COUNTRY_INFO!F22+COUNTRY_INFO!G22)))),0)","v":0.31250158146439383},{"$f":"IF(AND(Z22<>0,Z22<>\"Unknown\",Z22<>\"Not required\"),IF(COUNTRY_INFO!K22=1,0,IF(COUNTRY_INFO!K22=2,0.2*COUNTRY_INFO!G22/(0.5*COUNTRY_INFO!F22+0.2*COUNTRY_INFO!G22),IF(COUNTRY_INFO!K22=3,COUNTRY_INFO!G22/(COUNTRY_INFO!F22+COUNTRY_INFO!G22)))),0)","v":0.68749841853560612},{"$f":"MAX(COUNTRY_INFO!D22*AK22*PROFILE!$G$7,COUNTRY_INFO!D22*AL22*PROFILE!$G$7)","v":11856.098337397578},{"$f":"MAX(COUNTRY_INFO!D22*AK22*PROFILE!$G$8,COUNTRY_INFO!D22*AL22*PROFILE!$G$8,COUNTRY_INFO!D22*AM22*PROFILE!$G$8)","v":47424.204582262311},{"$f":"MAX(COUNTRY_INFO!D22*AK22*PROFILE!$G$9,COUNTRY_INFO!D22*AL22*PROFILE!$G$9,COUNTRY_INFO!D22*AM22*PROFILE!$G$9,IF(AND(DISTRICT!Z22<>\"Unknown\",Z22<>\"Not required\"),COUNTRY_INFO!O22*DISTRICT!AN22,0))","v":74101},{"$f":"MAX(COUNTRY_INFO!D22*AK22*PROFILE!$G$10,COUNTRY_INFO!D22*AL22*PROFILE!$G$10,IF(AND(DISTRICT!Z22<>\"Unknown\",Z22<>\"Not required\"),COUNTRY_INFO!O22*DISTRICT!AO22,0))","v":163021.08247160524},296402.38539126515,"Y",{"$f":"MAX('MDA2'!J22,'T1'!L22,'T2'!J22,T3_R1!K22,T3_R2!K22)","v":0},{"$f":"MAX('MDA1'!K22,'MDA2'!K22,'MDA3'!I22,'MDA3'!L22,'T1'!M22,'T2'!K22,T3_R1!L22,T3_R2!L22)","v":104754},{"$f":"MAX('MDA1'!L22,'MDA2'!L22,'MDA3'!J22,'MDA3'!M22,'T1'!N22,'T2'!L22,T3_R1!M22,T3_R2!M22)","v":111763},216517,{"$f":"MAX('MDA2'!J22,T22)","v":0},{"$f":"MAX('MDA1'!K22,'MDA2'!K22,'MDA3'!I22,'MDA3'!L22,V22,AD22)","v":104754},{"$f":"MAX('MDA1'!L22,'MDA2'!L22,'MDA3'!J22,'MDA3'!M22,AF22)","v":111763},216517,73.048332493744056]
[{"$f":"IF(COUNTRY_INFO!A23=0,\" \",COUNTRY_INFO!A23)","v":"Guinea"},{"$f":"IF(COUNTRY_INFO!B23=0,\" \",COUNTRY_INFO!B23)","v":"Kankan"},{"$f":"IF(COUNTRY_INFO!C23=0,\" \",COUNTRY_INFO!C23)","v":"Kankan"},{"$f":"COUNTRY_INFO!L23","v":494416},null,null,{"$f":"MAX('MDA1'!M23,'MDA2'!M23)","v":394794},{"$f":"IF(AND(COUNTRY_INFO!H23>0,COUNTRY_INFO!H23<4),IF(D23>MAX('MDA1'!M23,'MDA2'!M23),MAX('MDA1'!M23,'MDA2'!M23),D23),0)","v":394794},{"$f":"IF(AND(COUNTRY_INFO!H23>0,COUNTRY_INFO!H23<4), IF(G23/D23*100<>0, IF(G23/D23*100>100,100,G23/D23*100), \"-\"),0)","v":79.850571178926245},{"$f":"COUNTRY_INFO!M23","v":494416},null,0,{"$f":"MAX('MDA1'!M23,MAX('MDA3'!I23,'MDA3'!L23)+MAX('MDA3'!J23,'MDA3'!M23))","v":394794},{"$f":"IF(AND(COUNTRY_INFO!I23>0,COUNTRY_INFO!I23<4),IF(J23>MAX('MDA1'!M23,MAX('MDA3'!I23,'MDA3'!L23)+MAX('MDA3'!J23,'MDA3'!M23)),MAX('MDA1'!M23,MAX('MDA3'!I23,'MDA3'!L23)+MAX('MDA3'!J23,'MDA3'!M23)),J23),0)","v":394794},{"$f":"IF(AND(COUNTRY_INFO!I23>0,COUNTRY_INFO!I23<4), IF(M23/J23*100<>0, IF(M23/J23*100>100,100,M23/J23*100), \"-\"),0)","v":79.850571178926245},{"$f":"COUNTRY_INFO!N23","v":202711},null,null,{"$f":"SUM(MAX('MDA2'!J23, 'T1'!L23, MAX(T3_R1!K23, T3_R2!K23)), MAX('MDA1'!K23, 'MDA2'!K23, 'T1'!M23, MAX(T3_R1!L23, T3_R2!L23)), MAX('MDA1'!L23, 'MDA2'!L23, 'T1'!N23, MAX(T3_R1!M23, T3_R2!M23)))","v":394794},{"$f":"IF(AND(COUNTRY_INFO!J23>1,COUNTRY_INFO!J23<4),IF(COUNTRY_INFO!E23>MAX('MDA2'!J23,'T1'!L23,MAX(T3_R1!K23,T3_R2!K23)),MAX('MDA2'!J23,'T1'!L23,MAX(T3_R1!K23,T3_R2!K23)),COUNTRY_INFO!E23),0)","v":0},{"$f":"IF(AND(COUNTRY_INFO!J23>1,COUNTRY_INFO!J23<4), IF(T23/COUNTRY_INFO!E23*100<>0, IF(T23/COUNTRY_INFO!E23*100>100,100,T23/COUNTRY_INFO!E23*100), \"-\"),0)","v":"-"},{"$f":"IF(AND(COUNTRY_INFO!J23>1,COUNTRY_INFO!J23<4),IF(COUNTRY_INFO!F23>MAX('MDA1'!K23,'MDA2'!K23,'T1'!M23,MAX(T3_R1!L23,T3_R2!L23)),MAX('MDA1'!K23,'MDA2'!K23,'T1'!M23,MAX(T3_R1!L23,T3_R2!L23)),COUNTRY_INFO!F23),0)","v":123604},{"$f":"IF(AND(COUNTRY_INFO!J23>1,COUNTRY_INFO!J23<4), IF(V23/COUNTRY_INFO!F23*100<>0, IF(V23/COUNTRY_INFO!F23*100>100,100,V23/COUNTRY_INFO!F23*100), \"-\"),0)","v":100},123604,{"$f":"IF(AND(COUNTRY_INFO!J23>1,COUNTRY_INFO!J23<4), IF(S23/P23*100<>0, IF(X23/P23*100>100,100,X23/P23*100), \"-\"),0)","v":60.975477403791601},{"$f":"COUNTRY_INFO!O23","v":116187.8},null,null,{"$f":"MAX(SUM('T1'!L23:'T1'!N23),SUM('T2'!J23:'T2'!L23))","v":100582},{"$f":"IF(COUNTRY_INFO!K23=1,IF(COUNTRY_INFO!F23*0.33>MAX('T1'!M23,'T2'!K23),MAX('T1'!M23,'T2'!K23),COUNTRY_INFO!F23*0.33),IF(COUNTRY_INFO!K23=2,IF(COUNTRY_INFO!F23*0.5>MAX('T1'!M23,'T2'!K23),MAX('T1'!M23,'T2'!K23),COUNTRY_INFO!F23*0.5),IF(COUNTRY_INFO!K23=3,IF(COUNTRY_INFO!F23>MAX('T1'!M23,'T2'!K23),MAX('T1'!M23,'T2'!K23),COUNTRY_INFO!F23),0)))","v":61802},{"$f":"IF(AND(COUNTRY_INFO!K23>0,COUNTRY_INFO!K23<4),IF(Z23>0,IF(COUNTRY_INFO!K23=1, AD23/(COUNTRY_INFO!F23*0.33)*100, IF(COUNTRY_INFO!K23=2, AD23/(COUNTRY_INFO!F23*0.5)*100, IF(COUNTRY_INFO!K23=3, AD23/COUNTRY_INFO!F23*100))),\"-\"),0)","v":100},{"$f":"IF(COUNTRY_INFO!K23=2,IF(COUNTRY_INFO!G23*0.2>MAX('T1'!N23,'T2'!L23),MAX('T1'!N23,'T2'!L23),COUNTRY_INFO!G23*0.2),IF(COUNTRY_INFO!K23=3,IF(COUNTRY_INFO!G23>MAX('T1'!N23,'T2'!L23),MAX('T1'!N23,'T2'!L23),COUNTRY_INFO!G23),0))","v":0},{"$f":"IF(AND(COUNTRY_INFO!K23>0,COUNTRY_INFO!K23<4),IF(Z23>0,IF(COUNTRY_INFO!K23=1, 0, IF(COUNTRY_INFO!K23=2, AF23/(COUNTRY_INFO!G23*0.2)*100, IF(COUNTRY_INFO!K23=3, AF23/COUNTRY_INFO!G23*100))),\"-\"),0)","v":0},61802,{"$f":"IF(AND(COUNTRY_INFO!K23>0,COUNTRY_INFO!K23<4), IF(AC23/Z23*100<>0, IF(AH23/Z23*100>100,100,AH23/Z23*100), \"-\"),0)","v":53.19147104945614},null,{"$f":"IF(AND(D23<>0, D23<>\"Unknown\",D23<>\"Stopped\",D23<>\"Not required\"),D23/COUNTRY_INFO!D23, 0)","v":1},{"$f":"IF(AND(J23<>0,J23<>\"Unknown\",J23<>\"Stopped\",J23<>\"Not required\"),J23/COUNTRY_INFO!D23, 0)","v":1},{"$f":"IF(AND(P23<>0,P23<>\"Unknown\",P23<>\"Not required\"),P23/(COUNTRY_INFO!E23+COUNTRY_INFO!F23), 0)","v":1},{"$f":"IF(AND(Z23<>0,Z23<>\"Unknown\",Z23<>\"Not required\"),IF(COUNTRY_INFO!K23=1,1,IF(COUNTRY_INFO!K23=2,0.5*COUNTRY_INFO!F23/(0.5*COUNTRY_INFO!F23+0.2*COUNTRY_INFO!G23),IF(COUNTRY_INFO!K23=3,COUNTRY_INFO!F23/(COUNTRY_INFO!F23+COUNTRY_INFO!G23)))),0)","v":0.5319147104945614},{"$f":"IF(AND(Z23<>0,Z23<>\"Unknown\",Z23<>\"Not required\"),IF(COUNTRY_INFO!K23=1,0,IF(COUNTRY_INFO!K23=2,0.2*COUNTRY_INFO!G23/(0.5*COUNTRY_INFO!F23+0.2*COUNTRY_INFO!G23),IF(COUNTRY_INFO!K23=3,COUNTRY_INFO!G23/(COUNTRY_INFO!F23+COUNTRY_INFO!G23)))),0)","v":0.4680852895054386},{"$f":"MAX(COUNTRY_INFO!D23*AK23*PROFILE!$G$7,COUNTRY_INFO!D23*AL23*PROFILE!$G$7)","v":19776.670587859597},{"$f":"MAX(COUNTRY_INFO!D23*AK23*PROFILE!$G$8,COUNTRY_INFO!D23*AL23*PROFILE!$G$8,COUNTRY_INFO!D23*AM23*PROFILE!$G$8)","v":79106.367476413114},{"$f":"MAX(COUNTRY_INFO!D23*AK23*PROFILE!$G$9,COUNTRY_INFO!D23*AL23*PROFILE!$G$9,COUNTRY_INFO!D23*AM23*PROFILE!$G$9,IF(AND(DISTRICT!Z23<>\"Unknown\",Z23<>\"Not required\"),COUNTRY_INFO!O23*DISTRICT!AN23,0))","v":123604.19117412248},{"$f":"MAX(COUNTRY_INFO!D23*AK23*PROFILE!$G$10,COUNTRY_INFO!D23*AL23*PROFILE!$G$10,IF(AND(DISTRICT!Z23<>\"Unknown\",Z23<>\"Not required\"),COUNTRY_INFO!O23*DISTRICT!AO23,0))","v":271928.77076160477},494415.99999999994,"Y",{"$f":"MAX('MDA2'!J23,'T1'!L23,'T2'!J23,T3_R1!K23,T3_R2!K23)","v":0},{"$f":"MAX('MDA1'!K23,'MDA2'!K23,'MDA3'!I23,'MDA3'!L23,'T1'!M23,'T2'!K23,T3_R1!L23,T3_R2!L23)","v":167877},{"$f":"MAX('MDA1'!L23,'MDA2'!L23,'MDA3'!J23,'MDA3'!M23,'T1'!N23,'T2'!L23,T3_R1!M23,T3_R2!M23)","v":226917},394794,{"$f":"MAX('MDA2'!J23,T23)","v":0},{"$f":"MAX('MDA1'!K23,'MDA2'!K23,'MDA3'!I23,'MDA3'!L23,V23,AD23)","v":167877},{"$f":"MAX('MDA1'!L23,'MDA2'!L23,'MDA3'!J23,'MDA3'!M23,AF23)","v":226917},394794,79.850571178926259]
[{"$f":"IF(COUNTRY_INFO!A24=0,\" \",COUNTRY_INFO!A24)","v":"Guinea"},{"$f":"IF(COUNTRY_INFO!B24=0,\" \",COUNTRY_INFO!B24)","v":"Kankan"},{"$f":"IF(COUNTRY_INFO!C24=0,\" \",COUNTRY_INFO!C24)","v":"Kerouane"},{"$f":"COUNTRY_INFO!L24","v":216780},null,null,{"$f":"MAX('MDA1'!M24,'MDA2'!M24)","v":167117},{"$f":"IF(AND(COUNTRY_INFO!H24>0,COUNTRY_INFO!H24<4),IF(D24>MAX('MDA1'!M24,'MDA2'!M24),MAX('MDA1'!M24,'MDA2'!M24),D24),0)","v":167117},{"$f":"IF(AND(COUNTRY_INFO!H24>0,COUNTRY_INFO!H24<4), IF(G24/D24*100<>0, IF(G24/D24*100>100,100,G24/D24*100), \"-\"),0)","v":77.090598763723591},{"$f":"COUNTRY_INFO!M24","v":216780},null,0,{"$f":"MAX('MDA1'!M24,MAX('MDA3'!I24,'MDA3'!L24)+MAX('MDA3'!J24,'MDA3'!M24))","v":167117},{"$f":"IF(AND(COUNTRY_INFO!I24>0,COUNTRY_INFO!I24<4),IF(J24>MAX('MDA1'!M24,MAX('MDA3'!I24,'MDA3'!L24)+MAX('MDA3'!J24,'MDA3'!M24)),MAX('MDA1'!M24,MAX('MDA3'!I24,'MDA3'!L24)+MAX('MDA3'!J24,'MDA3'!M24)),J24),0)","v":167117},{"$f":"IF(AND(COUNTRY_INFO!I24>0,COUNTRY_INFO!I24<4), IF(M24/J24*100<>0, IF(M24/J24*100>100,100,M24/J24*100), \"-\"),0)","v":77.090598763723591},{"$f":"COUNTRY_INFO!N24","v":88880},null,null,{"$f":"SUM(MAX('MDA2'!J24, 'T1'!L24, MAX(T3_R1!K24, T3_R2!K24)), MAX('MDA1'!K24, 'MDA2'!K24, 'T1'!M24, MAX(T3_R1!L24, T3_R2!L24)), MAX('MDA1'!L24, 'MDA2'!L24, 'T1'!N24, MAX(T3_R1!M24, T3_R2!M24)))","v":167117},{"$f":"IF(AND(COUNTRY_INFO!J24>1,COUNTRY_INFO!J24<4),IF(COUNTRY_INFO!E24>MAX('MDA2'!J24,'T1'!L24,MAX(T3_R1!K24,T3_R2!K24)),MAX('MDA2'!J24,'T1'!L24,MAX(T3_R1!K24,T3_R2!K24)),COUNTRY_INFO!E24),0)","v":0},{"$f":"IF(AND(COUNTRY_INFO!J24>1,COUNTRY_INFO!J24<4), IF(T24/COUNTRY_INFO!E24*100<>0, IF(T24/COUNTRY_INFO!E24*100>100,100,T24/COUNTRY_INFO!E24*100), \"-\"),0)","v":"-"},{"$f":"IF(AND(COUNTRY_INFO!J24>1,COUNTRY_INFO!J24<4),IF(COUNTRY_INFO!F24>MAX('MDA1'!K24,'MDA2'!K24,'T1'!M24,MAX(T3_R1!L24,T3_R2!L24)),MAX('MDA1'!K24,'MDA2'!K24,'T1'!M24,MAX(T3_R1!L24,T3_R2!L24)),COUNTRY_INFO!F24),0)","v":54195},{"$f":"IF(AND(COUNTRY_INFO!J24>1,COUNTRY_INFO!J24<4), IF(V24/COUNTRY_INFO!F24*100<>0, IF(V24/COUNTRY_INFO!F24*100>100,100,V24/COUNTRY_INFO!F24*100), \"-\"),0)","v":100},54195,{"$f":"IF(AND(COUNTRY_INFO!J24>1,COUNTRY_INFO!J24<4), IF(S24/P24*100<>0, IF(X24/P24*100>100,100,X24/P24*100), \"-\"),0)","v":60.975472547254725},{"$f":"COUNTRY_INFO!O24","v":173424},null,null,{"$f":"MAX(SUM('T1'!L24:'T1'!N24),SUM('T2'!J24:'T2'!L24))","v":53100},{"$f":"IF(COUNTRY_INFO!K24=1,IF(COUNTRY_INFO!F24*0.33>MAX('T1'!M24,'T2'!K24),MAX('T1'!M24,'T2'!K24),COUNTRY_INFO!F24*0.33),IF(COUNTRY_INFO!K24=2,IF(COUNTRY_INFO!F24*0.5>MAX('T1'!M24,'T2'!K24),MAX('T1'!M24,'T2'!K24),COUNTRY_INFO!F24*0.5),IF(COUNTRY_INFO!K24=3,IF(COUNTRY_INFO!F24>MAX('T1'!M24,'T2'!K24),MAX('T1'!M24,'T2'!K24),COUNTRY_INFO!F24),0)))","v":53100},{"$f":"IF(AND(COUNTRY_INFO!K24>0,COUNTRY_INFO!K24<4),IF(Z24>0,IF(COUNTRY_INFO!K24=1, AD24/(COUNTRY_INFO!F24*0.33)*100, IF(COUNTRY_INFO!K24=2, AD24/(COUNTRY_INFO!F24*0.5)*100, IF(COUNTRY_INFO!K24=3, AD24/COUNTRY_INFO!F24*100))),\"-\"),0)","v":97.979518405756991},{"$f":"IF(COUNTRY_INFO!K24=2,IF(COUNTRY_INFO!G24*0.2>MAX('T1'!N24,'T2'!L24),MAX('T1'!N24,'T2'!L24),COUNTRY_INFO!G24*0.2),IF(COUNTRY_INFO!K24=3,IF(COUNTRY_INFO!G24>MAX('T1'!N24,'T2'!L24),MAX('T1'!N24,'T2'!L24),COUNTRY_INFO!G24),0))","v":0},{"$f":"IF(AND(COUNTRY_INFO!K24>0,COUNTRY_INFO!K24<4),IF(Z24>0,IF(COUNTRY_INFO!K24=1, 0, IF(COUNTRY_INFO!K24=2, AF24/(COUNTRY_INFO!G24*0.2)*100, IF(COUNTRY_INFO!K24=3, AF24/COUNTRY_INFO!G24*100))),\"-\"),0)","v":0},53100,{"$f":"IF(AND(COUNTRY_INFO!K24>0,COUNTRY_INFO!K24<4), IF(AC24/Z24*100<>0, IF(AH24/Z24*100>100,100,AH24/Z24*100), \"-\"),0)","v":30.618599501799061},null,{"$f":"IF(AND(D24<>0, D24<>\"Unknown\",D24<>\"Stopped\",D24<>\"Not required\"),D24/COUNTRY_INFO!D24, 0)","v":1},{"$f":"IF(AND(J24<>0,J24<>\"Unknown\",J24<>\"Stopped\",J24<>\"Not required\"),J24/COUNTRY_INFO!D24, 0)","v":1},{"$f":"IF(AND(P24<>0,P24<>\"Unknown\",P24<>\"Not required\"),P24/(COUNTRY_INFO!E24+COUNTRY_INFO!F24), 0)","v":1},{"$f":"IF(AND(Z24<>0,Z24<>\"Unknown\",Z24<>\"Not required\"),IF(COUNTRY_INFO!K24=1,1,IF(COUNTRY_INFO!K24=2,0.5*COUNTRY_INFO!F24/(0.5*COUNTRY_INFO!F24+0.2*COUNTRY_INFO!G24),IF(COUNTRY_INFO!K24=3,COUNTRY_INFO!F24/(COUNTRY_INFO!F24+COUNTRY_INFO!G24)))),0)","v":0.3125},{"$f":"IF(AND(Z24<>0,Z24<>\"Unknown\",Z24<>\"Not required\"),IF(COUNTRY_INFO!K24=1,0,IF(COUNTRY_INFO!K24=2,0.2*COUNTRY_INFO!G24/(0.5*COUNTRY_INFO!F24+0.2*COUNTRY_INFO!G24),IF(COUNTRY_INFO!K24=3,COUNTRY_INFO!G24/(COUNTRY_INFO!F24+COUNTRY_INFO!G24)))),0)","v":0.6875},{"$f":"MAX(COUNTRY_INFO!D24*AK24*PROFILE!$G$7,COUNTRY_INFO!D24*AL24*PROFILE!$G$7)","v":8671.2134114514974},{"$f":"MAX(COUNTRY_INFO!D24*AK24*PROFILE!$G$8,COUNTRY_INFO!D24*AL24*PROFILE!$G$8,COUNTRY_INFO!D24*AM24*PROFILE!$G$8)","v":34684.715586746453},{"$f":"MAX(COUNTRY_INFO!D24*AK24*PROFILE!$G$9,COUNTRY_INFO!D24*AL24*PROFILE!$G$9,COUNTRY_INFO!D24*AM24*PROFILE!$G$9,IF(AND(DISTRICT!Z24<>\"Unknown\",Z24<>\"Not required\"),COUNTRY_INFO!O24*DISTRICT!AN24,0))","v":54195.083821571854},{"$f":"MAX(COUNTRY_INFO!D24*AK24*PROFILE!$G$10,COUNTRY_INFO!D24*AL24*PROFILE!$G$10,IF(AND(DISTRICT!Z24<>\"Unknown\",Z24<>\"Not required\"),COUNTRY_INFO!O24*DISTRICT!AO24,0))","v":119229},216780.01281976979,"Y",{"$f":"MAX('MDA2'!J24,'T1'!L24,'T2'!J24,T3_R1!K24,T3_R2!K24)","v":0},{"$f":"MAX('MDA1'!K24,'MDA2'!K24,'MDA3'!I24,'MDA3'!L24,'T1'!M24,'T2'!K24,T3_R1!L24,T3_R2!L24)","v":71697},{"$f":"MAX('MDA1'!L24,'MDA2'!L24,'MDA3'!J24,'MDA3'!M24,'T1'!N24,'T2'!L24,T3_R1!M24,T3_R2!M24)","v":95420},167117,{"$f":"MAX('MDA2'!J24,T24)","v":0},{"$f":"MAX('MDA1'!K24,'MDA2'!K24,'MDA3'!I24,'MDA3'!L24,V24,AD24)","v":71697},{"$f":"MAX('MDA1'!L24,'MDA2'!L24,'MDA3'!J24,'MDA3'!M24,AF24)","v":95420},167117,77.090594204799018]
[{"$f":"IF(COUNTRY_INFO!A25=0,\" \",COUNTRY_INFO!A25)","v":"Guinea"},{"$f":"IF(COUNTRY_INFO!B25=0,\" \",COUNTRY_INFO!B25)","v":"Kankan"},{"$f":"IF(COUNTRY_INFO!C25=0,\" \",COUNTRY_INFO!C25)","v":"Kouroussa"},{"$f":"COUNTRY_INFO!L25","v":280580},null,null,{"$f":"MAX('MDA1'!M25,'MDA2'!M25)","v":189353},{"$f":"IF(AND(COUNTRY_INFO!H25>0,COUNTRY_INFO!H25<4),IF(D25>MAX('MDA1'!M25,'MDA2'!M25),MAX('MDA1'!M25,'MDA2'!M25),D25),0)","v":189353},{"$f":"IF(AND(COUNTRY_INFO!H25>0,COUNTRY_INFO!H25<4), IF(G25/D25*100<>0, IF(G25/D25*100>100,100,G25/D25*100), \"-\"),0)","v":67.486278423266086},{"$f":"COUNTRY_INFO!M25","v":280580},null,0,{"$f":"MAX('MDA1'!M25,MAX('MDA3'!I25,'MDA3'!L25)+MAX('MDA3'!J25,'MDA3'!M25))","v":189353},{"$f":"IF(AND(COUNTRY_INFO!I25>0,COUNTRY_INFO!I25<4),IF(J25>MAX('MDA1'!M25,MAX('MDA3'!I25,'MDA3'!L25)+MAX('MDA3'!J25,'MDA3'!M25)),MAX('MDA1'!M25,MAX('MDA3'!I25,'MDA3'!L25)+MAX('MDA3'!J25,'MDA3'!M25)),J25),0)","v":189353},{"$f":"IF(AND(COUNTRY_INFO!I25>0,COUNTRY_INFO!I25<4), IF(M25/J25*100<>0, IF(M25/J25*100>100,100,M25/J25*100), \"-\"),0)","v":67.486278423266086},{"$f":"COUNTRY_INFO!N25","v":115038},null,null,{"$f":"SUM(MAX('MDA2'!J25, 'T1'!L25, MAX(T3_R1!K25, T3_R2!K25)), MAX('MDA1'!K25, 'MDA2'!K25, 'T1'!M25, MAX(T3_R1!L25, T3_R2!L25)), MAX('MDA1'!L25, 'MDA2'!L25, 'T1'!N25, MAX(T3_R1!M25, T3_R2!M25)))","v":189353},{"$f":"IF(AND(COUNTRY_INFO!J25>1,COUNTRY_INFO!J25<4),IF(COUNTRY_INFO!E25>MAX('MDA2'!J25,'T1'!L25,MAX(T3_R1!K25,T3_R2!K25)),MAX('MDA2'!J25,'T1'!L25,MAX(T3_R1!K25,T3_R2!K25)),COUNTRY_INFO!E25),0)","v":0},{"$f":"IF(AND(COUNTRY_INFO!J25>1,COUNTRY_INFO!J25<4), IF(T25/COUNTRY_INFO!E25*100<>0, IF(T25/COUNTRY_INFO!E25*100>100,100,T25/COUNTRY_INFO!E25*100), \"-\"),0)","v":"-"},{"$f":"IF(AND(COUNTRY_INFO!J25>1,COUNTRY_INFO!J25<4),IF(COUNTRY_INFO!F25>MAX('MDA1'!K25,'MDA2'!K25,'T1'!M25,MAX(T3_R1!L25,T3_R2!L25)),MAX('MDA1'!K25,'MDA2'!K25,'T1'!M25,MAX(T3_R1!L25,T3_R2!L25)),COUNTRY_INFO!F25),0)","v":70145},{"$f":"IF(AND(COUNTRY_INFO!J25>1,COUNTRY_INFO!J25<4), IF(V25/COUNTRY_INFO!F25*100<>0, IF(V25/COUNTRY_INFO!F25*100>100,100,V25/COUNTRY_INFO!F25*100), \"-\"),0)","v":100},70145,{"$f":"IF(AND(COUNTRY_INFO!J25>1,COUNTRY_INFO!J25<4), IF(S25/P25*100<>0, IF(X25/P25*100>100,100,X25/P25*100), \"-\"),0)","v":60.975503746588089},{"$f":"COUNTRY_INFO!O25","v":65936.3},null,null,{"$f":"MAX(SUM('T1'!L25:'T1'!N25),SUM('T2'!J25:'T2'!L25))","v":68686},{"$f":"IF(COUNTRY_INFO!K25=1,IF(COUNTRY_INFO!F25*0.33>MAX('T1'!M25,'T2'!K25),MAX('T1'!M25,'T2'!K25),COUNTRY_INFO!F25*0.33),IF(COUNTRY_INFO!K25=2,IF(COUNTRY_INFO!F25*0.5>MAX('T1'!M25,'T2'!K25),MAX('T1'!M25,'T2'!K25),COUNTRY_INFO!F25*0.5),IF(COUNTRY_INFO!K25=3,IF(COUNTRY_INFO!F25>MAX('T1'!M25,'T2'!K25),MAX('T1'!M25,'T2'!K25),COUNTRY_INFO!F25),0)))","v":35072.5},{"$f":"IF(AND(COUNTRY_INFO!K25>0,COUNTRY_INFO!K25<4),IF(Z25>0,IF(COUNTRY_INFO!K25=1, AD25/(COUNTRY_INFO!F25*0.33)*100, IF(COUNTRY_INFO!K25=2, AD25/(COUNTRY_INFO!F25*0.5)*100, IF(COUNTRY_INFO!K25=3, AD25/COUNTRY_INFO!F25*100))),\"-\"),0)","v":100},{"$f":"IF(COUNTRY_INFO!K25=2,IF(COUNTRY_INFO!G25*0.2>MAX('T1'!N25,'T2'!L25),MAX('T1'!N25,'T2'!L25),COUNTRY_INFO!G25*0.2),IF(COUNTRY_INFO!K25=3,IF(COUNTRY_INFO!G25>MAX('T1'!N25,'T2'!L25),MAX('T1'!N25,'T2'!L25),COUNTRY_INFO!G25),0))","v":0},{"$f":"IF(AND(COUNTRY_INFO!K25>0,COUNTRY_INFO!K25<4),IF(Z25>0,IF(COUNTRY_INFO!K25=1, 0, IF(COUNTRY_INFO!K25=2, AF25/(COUNTRY_INFO!G25*0.2)*100, IF(COUNTRY_INFO!K25=3, AF25/COUNTRY_INFO!G25*100))),\"-\"),0)","v":0},35072.5,{"$f":"IF(AND(COUNTRY_INFO!K25>0,COUNTRY_INFO!K25<4), IF(AC25/Z25*100<>0, IF(AH25/Z25*100>100,100,AH25/Z25*100), \"-\"),0)","v":53.191489361702125},null,{"$f":"IF(AND(D25<>0, D25<>\"Unknown\",D25<>\"Stopped\",D25<>\"Not required\"),D25/COUNTRY_INFO!D25, 0)","v":1},{"$f":"IF(AND(J25<>0,J25<>\"Unknown\",J25<>\"Stopped\",J25<>\"Not required\"),J25/COUNTRY_INFO!D25, 0)","v":1},{"$f":"IF(AND(P25<>0,P25<>\"Unknown\",P25<>\"Not required\"),P25/(COUNTRY_INFO!E25+COUNTRY_INFO!F25), 0)","v":1},{"$f":"IF(AND(Z25<>0,Z25<>\"Unknown\",Z25<>\"Not required\"),IF(COUNTRY_INFO!K25=1,1,IF(COUNTRY_INFO!K25=2,0.5*COUNTRY_INFO!F25/(0.5*COUNTRY_INFO!F25+0.2*COUNTRY_INFO!G25),IF(COUNTRY_INFO!K25=3,COUNTRY_INFO!F25/(COUNTRY_INFO!F25+COUNTRY_INFO!G25)))),0)","v":0.53191489361702127},{"$f":"IF(AND(Z25<>0,Z25<>\"Unknown\",Z25<>\"Not required\"),IF(COUNTRY_INFO!K25=1,0,IF(COUNTRY_INFO!K25=2,0.2*COUNTRY_INFO!G25/(0.5*COUNTRY_INFO!F25+0.2*COUNTRY_INFO!G25),IF(COUNTRY_INFO!K25=3,COUNTRY_INFO!G25/(COUNTRY_INFO!F25+COUNTRY_INFO!G25)))),0)","v":0.46808510638297873},{"$f":"MAX(COUNTRY_INFO!D25*AK25*PROFILE!$G$7,COUNTRY_INFO!D25*AL25*PROFILE!$G$7)","v":11223.217358543507},{"$f":"MAX(COUNTRY_INFO!D25*AK25*PROFILE!$G$8,COUNTRY_INFO!D25*AL25*PROFILE!$G$8,COUNTRY_INFO!D25*AM25*PROFILE!$G$8)","v":44892.690743284991},{"$f":"MAX(COUNTRY_INFO!D25*AK25*PROFILE!$G$9,COUNTRY_INFO!D25*AL25*PROFILE!$G$9,COUNTRY_INFO!D25*AM25*PROFILE!$G$9,IF(AND(DISTRICT!Z25<>\"Unknown\",Z25<>\"Not required\"),COUNTRY_INFO!O25*DISTRICT!AN25,0))","v":70145.108490896906},{"$f":"MAX(COUNTRY_INFO!D25*AK25*PROFILE!$G$10,COUNTRY_INFO!D25*AL25*PROFILE!$G$10,IF(AND(DISTRICT!Z25<>\"Unknown\",Z25<>\"Not required\"),COUNTRY_INFO!O25*DISTRICT!AO25,0))","v":154318.98340727459},280580,"Y",{"$f":"MAX('MDA2'!J25,'T1'!L25,'T2'!J25,T3_R1!K25,T3_R2!K25)","v":0},{"$f":"MAX('MDA1'!K25,'MDA2'!K25,'MDA3'!I25,'MDA3'!L25,'T1'!M25,'T2'!K25,T3_R1!L25,T3_R2!L25)","v":97063},{"$f":"MAX('MDA1'!L25,'MDA2'!L25,'MDA3'!J25,'MDA3'!M25,'T1'!N25,'T2'!L25,T3_R1!M25,T3_R2!M25)","v":92290},189353,{"$f":"MAX('MDA2'!J25,T25)","v":0},{"$f":"MAX('MDA1'!K25,'MDA2'!K25,'MDA3'!I25,'MDA3'!L25,V25,AD25)","v":97063},{"$f":"MAX('MDA1'!L25,'MDA2'!L25,'MDA3'!J25,'MDA3'!M25,AF25)","v":92290},189353,67.486278423266086]
[{"$f":"IF(COUNTRY_INFO!A26=0,\" \",COUNTRY_INFO!A26)","v":"Guinea"},{"$f":"IF(COUNTRY_INFO!B26=0,\" \",COUNTRY_INFO!B26)","v":"Kankan"},{"$f":"IF(COUNTRY_INFO!C26=0,\" \",COUNTRY_INFO!C26)","v":"Mandiana"},{"$f":"COUNTRY_INFO!L26","v":350946},null,null,{"$f":"MAX('MDA1'!M26,'MDA2'!M26)","v":298572},{"$f":"IF(AND(COUNTRY_INFO!H26>0,COUNTRY_INFO!H26<4),IF(D26>MAX('MDA1'!M26,'MDA2'!M26),MAX('MDA1'!M26,'MDA2'!M26),D26),0)","v":298572},{"$f":"IF(AND(COUNTRY_INFO!H26>0,COUNTRY_INFO!H26<4), IF(G26/D26*100<>0, IF(G26/D26*100>100,100,G26/D26*100), \"-\"),0)","v":85.07633653040638},{"$f":"COUNTRY_INFO!M26","v":350946},null,0,{"$f":"MAX('MDA1'!M26,MAX('MDA3'!I26,'MDA3'!L26)+MAX('MDA3'!J26,'MDA3'!M26))","v":298572},{"$f":"IF(AND(COUNTRY_INFO!I26>0,COUNTRY_INFO!I26<4),IF(J26>MAX('MDA1'!M26,MAX('MDA3'!I26,'MDA3'!L26)+MAX('MDA3'!J26,'MDA3'!M26)),MAX('MDA1'!M26,MAX('MDA3'!I26,'MDA3'!L26)+MAX('MDA3'!J26,'MDA3'!M26)),J26),0)","v":298572},{"$f":"IF(AND(COUNTRY_INFO!I26>0,COUNTRY_INFO!I26<4), IF(M26/J26*100<>0, IF(M26/J26*100>100,100,M26/J26*100), \"-\"),0)","v":85.07633653040638},{"$f":"COUNTRY_INFO!N26","v":143888},null,null,{"$f":"SUM(MAX('MDA2'!J26, 'T1'!L26, MAX(T3_R1!K26, T3_R2!K26)), MAX('MDA1'!K26, 'MDA2'!K26, 'T1'!M26, MAX(T3_R1!L26, T3_R2!L26)), MAX('MDA1'!L26, 'MDA2'!L26, 'T1'!N26, MAX(T3_R1!M26, T3_R2!M26)))","v":298572},{"$f":"IF(AND(COUNTRY_INFO!J26>1,COUNTRY_INFO!J26<4),IF(COUNTRY_INFO!E26>MAX('MDA2'!J26,'T1'!L26,MAX(T3_R1!K26,T3_R2!K26)),MAX('MDA2'!J26,'T1'!L26,MAX(T3_R1!K26,T3_R2!K26)),COUNTRY_INFO!E26),0)","v":0},{"$f":"IF(AND(COUNTRY_INFO!J26>1,COUNTRY_INFO!J26<4), IF(T26/COUNTRY_INFO!E26*100<>0, IF(T26/COUNTRY_INFO!E26*100>100,100,T26/COUNTRY_INFO!E26*100), \"-\"),0)","v":"-"},{"$f":"IF(AND(COUNTRY_INFO!J26>1,COUNTRY_INFO!J26<4),IF(COUNTRY_INFO!F26>MAX('MDA1'!K26,'MDA2'!K26,'T1'!M26,MAX(T3_R1!L26,T3_R2!L26)),MAX('MDA1'!K26,'MDA2'!K26,'T1'!M26,MAX(T3_R1!L26,T3_R2!L26)),COUNTRY_INFO!F26),0)","v":87737},{"$f":"IF(AND(COUNTRY_INFO!J26>1,COUNTRY_INFO!J26<4), IF(V26/COUNTRY_INFO!F26*100<>0, IF(V26/COUNTRY_INFO!F26*100>100,100,V26/COUNTRY_INFO!F26*100), \"-\"),0)","v":100},87737,{"$f":"IF(AND(COUNTRY_INFO!J26>1,COUNTRY_INFO!J26<4), IF(S26/P26*100<>0, IF(X26/P26*100>100,100,X26/P26*100), \"-\"),0)","v":60.975897920604915},{"$f":"COUNTRY_INFO!O26","v":28953.210000000003},null,null,{"$f":"MAX(SUM('T1'!L26:'T1'!N26),SUM('T2'!J26:'T2'!L26))","v":0},{"$f":"IF(COUNTRY_INFO!K26=1,IF(COUNTRY_INFO!F26*0.33>MAX('T1'!M26,'T2'!K26),MAX('T1'!M26,'T2'!K26),COUNTRY_INFO!F26*0.33),IF(COUNTRY_INFO!K26=2,IF(COUNTRY_INFO!F26*0.5>MAX('T1'!M26,'T2'!K26),MAX('T1'!M26,'T2'!K26),COUNTRY_INFO!F26*0.5),IF(COUNTRY_INFO!K26=3,IF(COUNTRY_INFO!F26>MAX('T1'!M26,'T2'!K26),MAX('T1'!M26,'T2'!K26),COUNTRY_INFO!F26),0)))","v":0},{"$f":"IF(AND(COUNTRY_INFO!K26>0,COUNTRY_INFO!K26<4),IF(Z26>0,IF(COUNTRY_INFO!K26=1, AD26/(COUNTRY_INFO!F26*0.33)*100, IF(COUNTRY_INFO!K26=2, AD26/(COUNTRY_INFO!F26*0.5)*100, IF(COUNTRY_INFO!K26=3, AD26/COUNTRY_INFO!F26*100))),\"-\"),0)","v":0},{"$f":"IF(COUNTRY_INFO!K26=2,IF(COUNTRY_INFO!G26*0.2>MAX('T1'!N26,'T2'!L26),MAX('T1'!N26,'T2'!L26),COUNTRY_INFO!G26*0.2),IF(COUNTRY_INFO!K26=3,IF(COUNTRY_INFO!G26>MAX('T1'!N26,'T2'!L26),MAX('T1'!N26,'T2'!L26),COUNTRY_INFO!G26),0))","v":0},{"$f":"IF(AND(COUNTRY_INFO!K26>0,COUNTRY_INFO!K26<4),IF(Z26>0,IF(COUNTRY_INFO!K26=1, 0, IF(COUNTRY_INFO!K26=2, AF26/(COUNTRY_INFO!G26*0.2)*100, IF(COUNTRY_INFO!K26=3, AF26/COUNTRY_INFO!G26*100))),\"-\"),0)","v":0},0,{"$f":"IF(AND(COUNTRY_INFO!K26>0,COUNTRY_INFO!K26<4), IF(AC26/Z26*100<>0, IF(AH26/Z26*100>100,100,AH26/Z26*100), \"-\"),0)","v":"-"},null,{"$f":"IF(AND(D26<>0, D26<>\"Unknown\",D26<>\"Stopped\",D26<>\"Not required\"),D26/COUNTRY_INFO!D26, 0)","v":1},{"$f":"IF(AND(J26<>0,J26<>\"Unknown\",J26<>\"Stopped\",J26<>\"Not required\"),J26/COUNTRY_INFO!D26, 0)","v":1},{"$f":"IF(AND(P26<>0,P26<>\"Unknown\",P26<>\"Not required\"),P26/(COUNTRY_INFO!E26+COUNTRY_INFO!F26), 0)","v":1},{"$f":"IF(AND(Z26<>0,Z26<>\"Unknown\",Z26<>\"Not required\"),IF(COUNTRY_INFO!K26=1,1,IF(COUNTRY_INFO!K26=2,0.5*COUNTRY_INFO!F26/(0.5*COUNTRY_INFO!F26+0.2*COUNTRY_INFO!G26),IF(COUNTRY_INFO!K26=3,COUNTRY_INFO!F26/(COUNTRY_INFO!F26+COUNTRY_INFO!G26)))),0)","v":1},{"$f":"IF(AND(Z26<>0,Z26<>\"Unknown\",Z26<>\"Not required\"),IF(COUNTRY_INFO!K26=1,0,IF(COUNTRY_INFO!K26=2,0.2*COUNTRY_INFO!G26/(0.5*COUNTRY_INFO!F26+0.2*COUNTRY_INFO!G26),IF(COUNTRY_INFO!K26=3,COUNTRY_INFO!G26/(COUNTRY_INFO!F26+COUNTRY_INFO!G26)))),0)","v":0},{"$f":"MAX(COUNTRY_INFO!D26*AK26*PROFILE!$G$7,COUNTRY_INFO!D26*AL26*PROFILE!$G$7)","v":14037.861711851911},{"$f":"MAX(COUNTRY_INFO!D26*AK26*PROFILE!$G$8,COUNTRY_INFO!D26*AL26*PROFILE!$G$8,COUNTRY_INFO!D26*AM26*PROFILE!$G$8)","v":56151.223343049736},{"$f":"MAX(COUNTRY_INFO!D26*AK26*PROFILE!$G$9,COUNTRY_INFO!D26*AL26*PROFILE!$G$9,COUNTRY_INFO!D26*AM26*PROFILE!$G$9,IF(AND(DISTRICT!Z26<>\"Unknown\",Z26<>\"Not required\"),COUNTRY_INFO!O26*DISTRICT!AN26,0))","v":87736.635699074439},{"$f":"MAX(COUNTRY_INFO!D26*AK26*PROFILE!$G$10,COUNTRY_INFO!D26*AL26*PROFILE!$G$10,IF(AND(DISTRICT!Z26<>\"Unknown\",Z26<>\"Not required\"),COUNTRY_INFO!O26*DISTRICT!AO26,0))","v":193020.27924602391},350946,0,{"$f":"MAX('MDA2'!J26,'T1'!L26,'T2'!J26,T3_R1!K26,T3_R2!K26)","v":0},{"$f":"MAX('MDA1'!K26,'MDA2'!K26,'MDA3'!I26,'MDA3'!L26,'T1'!M26,'T2'!K26,T3_R1!L26,T3_R2!L26)","v":113746},{"$f":"MAX('MDA1'!L26,'MDA2'!L26,'MDA3'!J26,'MDA3'!M26,'T1'!N26,'T2'!L26,T3_R1!M26,T3_R2!M26)","v":184826},298572,{"$f":"MAX('MDA2'!J26,T26)","v":0},{"$f":"MAX('MDA1'!K26,'MDA2'!K26,'MDA3'!I26,'MDA3'!L26,V26,AD26)","v":113746},{"$f":"MAX('MDA1'!L26,'MDA2'!L26,'MDA3'!J26,'MDA3'!M26,AF26)","v":184826},298572,85.07633653040638]
[{"$f":"IF(COUNTRY_INFO!A27=0,\" \",COUNTRY_INFO!A27)","v":"Guinea"},{"$f":"IF(COUNTRY_INFO!B27=0,\" \",COUNTRY_INFO!B27)","v":"Kankan"},{"$f":"IF(COUNTRY_INFO!C27=0,\" \",COUNTRY_INFO!C27)","v":"Siguiri"},{"$f":"COUNTRY_INFO!L27","v":717563},null,null,{"$f":"MAX('MDA1'!M27,'MDA2'!M27)","v":621306},{"$f":"IF(AND(COUNTRY_INFO!H27>0,COUNTRY_INFO!H27<4),IF(D27>MAX('MDA1'!M27,'MDA2'!M27),MAX('MDA1'!M27,'MDA2'!M27),D27),0)","v":621306},{"$f":"IF(AND(COUNTRY_INFO!H27>0,COUNTRY_INFO!H27<4), IF(G27/D27*100<>0, IF(G27/D27*100>100,100,G27/D27*100), \"-\"),0)","v":86.585568096459824},{"$f":"COUNTRY_INFO!M27","v":717563},null,0,{"$f":"MAX('MDA1'!M27,MAX('MDA3'!I27,'MDA3'!L27)+MAX('MDA3'!J27,'MDA3'!M27))","v":621306},{"$f":"IF(AND(COUNTRY_INFO!I27>0,COUNTRY_INFO!I27<4),IF(J27>MAX('MDA1'!M27,MAX('MDA3'!I27,'MDA3'!L27)+MAX('MDA3'!J27,'MDA3'!M27)),MAX('MDA1'!M27,MAX('MDA3'!I27,'MDA3'!L27)+MAX('MDA3'!J27,'MDA3'!M27)),J27),0)","v":621306},{"$f":"IF(AND(COUNTRY_INFO!I27>0,COUNTRY_INFO!I27<4), IF(M27/J27*100<>0, IF(M27/J27*100>100,100,M27/J27*100), \"-\"),0)","v":86.585568096459824},{"$f":"COUNTRY_INFO!N27","v":0},null,null,{"$f":"SUM(MAX('MDA2'!J27, 'T1'!L27, MAX(T3_R1!K27, T3_R2!K27)), MAX('MDA1'!K27, 'MDA2'!K27, 'T1'!M27, MAX(T3_R1!L27, T3_R2!L27)), MAX('MDA1'!L27, 'MDA2'!L27, 'T1'!N27, MAX(T3_R1!M27, T3_R2!M27)))","v":621306},{"$f":"IF(AND(COUNTRY_INFO!J27>1,COUNTRY_INFO!J27<4),IF(COUNTRY_INFO!E27>MAX('MDA2'!J27,'T1'!L27,MAX(T3_R1!K27,T3_R2!K27)),MAX('MDA2'!J27,'T1'!L27,MAX(T3_R1!K27,T3_R2!K27)),COUNTRY_INFO!E27),0)","v":0},{"$f":"IF(AND(COUNTRY_INFO!J27>1,COUNTRY_INFO!J27<4), IF(T27/COUNTRY_INFO!E27*100<>0, IF(T27/COUNTRY_INFO!E27*100>100,100,T27/COUNTRY_INFO!E27*100), \"-\"),0)","v":0},{"$f":"IF(AND(COUNTRY_INFO!J27>1,COUNTRY_INFO!J27<4),IF(COUNTRY_INFO!F27>MAX('MDA1'!K27,'MDA2'!K27,'T1'!M27,MAX(T3_R1!L27,T3_R2!L27)),MAX('MDA1'!K27,'MDA2'!K27,'T1'!M27,MAX(T3_R1!L27,T3_R2!L27)),COUNTRY_INFO!F27),0)","v":0},{"$f":"IF(AND(COUNTRY_INFO!J27>1,COUNTRY_INFO!J27<4), IF(V27/COUNTRY_INFO!F27*100<>0, IF(V27/COUNTRY_INFO!F27*100>100,100,V27/COUNTRY_INFO!F27*100), \"-\"),0)","v":0},0,{"$f":"IF(AND(COUNTRY_INFO!J27>1,COUNTRY_INFO!J27<4), IF(S27/P27*100<>0, IF(X27/P27*100>100,100,X27/P27*100), \"-\"),0)","v":0},{"$f":"COUNTRY_INFO!O27","v":168627.5},null,null,{"$f":"MAX(SUM('T1'!L27:'T1'!N27),SUM('T2'!J27:'T2'!L27))","v":189917},{"$f":"IF(COUNTRY_INFO!K27=1,IF(COUNTRY_INFO!F27*0.33>MAX('T1'!M27,'T2'!K27),MAX('T1'!M27,'T2'!K27),COUNTRY_INFO!F27*0.33),IF(COUNTRY_INFO!K27=2,IF(COUNTRY_INFO!F27*0.5>MAX('T1'!M27,'T2'!K27),MAX('T1'!M27,'T2'!K27),COUNTRY_INFO!F27*0.5),IF(COUNTRY_INFO!K27=3,IF(COUNTRY_INFO!F27>MAX('T1'!M27,'T2'!K27),MAX('T1'!M27,'T2'!K27),COUNTRY_INFO!F27),0)))","v":89695.5},{"$f":"IF(AND(COUNTRY_INFO!K27>0,COUNTRY_INFO!K27<4),IF(Z27>0,IF(COUNTRY_INFO!K27=1, AD27/(COUNTRY_INFO!F27*0.33)*100, IF(COUNTRY_INFO!K27=2, AD27/(COUNTRY_INFO!F27*0.5)*100, IF(COUNTRY_INFO!K27=3, AD27/COUNTRY_INFO!F27*100))),\"-\"),0)","v":100},{"$f":"IF(COUNTRY_INFO!K27=2,IF(COUNTRY_INFO!G27*0.2>MAX('T1'!N27,'T2'!L27),MAX('T1'!N27,'T2'!L27),COUNTRY_INFO!G27*0.2),IF(COUNTRY_INFO!K27=3,IF(COUNTRY_INFO!G27>MAX('T1'!N27,'T2'!L27),MAX('T1'!N27,'T2'!L27),COUNTRY_INFO!G27),0))","v":0},{"$f":"IF(AND(COUNTRY_INFO!K27>0,COUNTRY_INFO!K27<4),IF(Z27>0,IF(COUNTRY_INFO!K27=1, 0, IF(COUNTRY_INFO!K27=2, AF27/(COUNTRY_INFO!G27*0.2)*100, IF(COUNTRY_INFO!K27=3, AF27/COUNTRY_INFO!G27*100))),\"-\"),0)","v":0},89695.5,{"$f":"IF(AND(COUNTRY_INFO!K27>0,COUNTRY_INFO!K27<4), IF(AC27/Z27*100<>0, IF(AH27/Z27*100>100,100,AH27/Z27*100), \"-\"),0)","v":53.191501979214536},null,{"$f":"IF(AND(D27<>0, D27<>\"Unknown\",D27<>\"Stopped\",D27<>\"Not required\"),D27/COUNTRY_INFO!D27, 0)","v":1},{"$f":"IF(AND(J27<>0,J27<>\"Unknown\",J27<>\"Stopped\",J27<>\"Not required\"),J27/COUNTRY_INFO!D27, 0)","v":1},{"$f":"IF(AND(P27<>0,P27<>\"Unknown\",P27<>\"Not required\"),P27/(COUNTRY_INFO!E27+COUNTRY_INFO!F27), 0)","v":0},{"$f":"IF(AND(Z27<>0,Z27<>\"Unknown\",Z27<>\"Not required\"),IF(COUNTRY_INFO!K27=1,1,IF(COUNTRY_INFO!K27=2,0.5*COUNTRY_INFO!F27/(0.5*COUNTRY_INFO!F27+0.2*COUNTRY_INFO!G27),IF(COUNTRY_INFO!K27=3,COUNTRY_INFO!F27/(COUNTRY_INFO!F27+COUNTRY_INFO!G27)))),0)","v":0.53191501979214539},{"$f":"IF(AND(Z27<>0,Z27<>\"Unknown\",Z27<>\"Not required\"),IF(COUNTRY_INFO!K27=1,0,IF(COUNTRY_INFO!K27=2,0.2*COUNTRY_INFO!G27/(0.5*COUNTRY_INFO!F27+0.2*COUNTRY_INFO!G27),IF(COUNTRY_INFO!K27=3,COUNTRY_INFO!G27/(COUNTRY_INFO!F27+COUNTRY_INFO!G27)))),0)","v":0.46808498020785461},{"$f":"MAX(COUNTRY_INFO!D27*AK27*PROFILE!$G$7,COUNTRY_INFO!D27*AL27*PROFILE!$G$7)","v":28702.564393216031},{"$f":"MAX(COUNTRY_INFO!D27*AK27*PROFILE!$G$8,COUNTRY_INFO!D27*AL27*PROFILE!$G$8,COUNTRY_INFO!D27*AM27*PROFILE!$G$8)","v":114809.80058387558},{"$f":"MAX(COUNTRY_INFO!D27*AK27*PROFILE!$G$9,COUNTRY_INFO!D27*AL27*PROFILE!$G$9,COUNTRY_INFO!D27*AM27*PROFILE!$G$9,IF(AND(DISTRICT!Z27<>\"Unknown\",Z27<>\"Not required\"),COUNTRY_INFO!O27*DISTRICT!AN27,0))","v":179391.02745760017},{"$f":"MAX(COUNTRY_INFO!D27*AK27*PROFILE!$G$10,COUNTRY_INFO!D27*AL27*PROFILE!$G$10,IF(AND(DISTRICT!Z27<>\"Unknown\",Z27<>\"Not required\"),COUNTRY_INFO!O27*DISTRICT!AO27,0))","v":394659.60756530822},717563,"Y",{"$f":"MAX('MDA2'!J27,'T1'!L27,'T2'!J27,T3_R1!K27,T3_R2!K27)","v":0},{"$f":"MAX('MDA1'!K27,'MDA2'!K27,'MDA3'!I27,'MDA3'!L27,'T1'!M27,'T2'!K27,T3_R1!L27,T3_R2!L27)","v":256551},{"$f":"MAX('MDA1'!L27,'MDA2'!L27,'MDA3'!J27,'MDA3'!M27,'T1'!N27,'T2'!L27,T3_R1!M27,T3_R2!M27)","v":364755},621306,{"$f":"MAX('MDA2'!J27,T27)","v":0},{"$f":"MAX('MDA1'!K27,'MDA2'!K27,'MDA3'!I27,'MDA3'!L27,V27,AD27)","v":256551},{"$f":"MAX('MDA1'!L27,'MDA2'!L27,'MDA3'!J27,'MDA3'!M27,AF27)","v":364755},621306,86.585568096459824]
[{"$f":"IF(COUNTRY_INFO!A28=0,\" \",COUNTRY_INFO!A28)","v":"Guinea"},{"$f":"IF(COUNTRY_INFO!B28=0,\" \",COUNTRY_INFO!B28)","v":"Kindia"},{"$f":"IF(COUNTRY_INFO!C28=0,\" \",COUNTRY_INFO!C28)","v":"Coyah"},{"$f":"COUNTRY_INFO!L28","v":0},null,null,{"$f":"MAX('MDA1'!M28,'MDA2'!M28)","v":0},{"$f":"IF(AND(COUNTRY_INFO!H28>0,COUNTRY_INFO!H28<4),IF(D28>MAX('MDA1'!M28,'MDA2'!M28),MAX('MDA1'!M28,'MDA2'!M28),D28),0)","v":0},{"$f":"IF(AND(COUNTRY_INFO!H28>0,COUNTRY_INFO!H28<4), IF(G28/D28*100<>0, IF(G28/D28*100>100,100,G28/D28*100), \"-\"),0)","v":0},{"$f":"COUNTRY_INFO!M28","v":0},null,0,{"$f":"MAX('MDA1'!M28,MAX('MDA3'!I28,'MDA3'!L28)+MAX('MDA3'!J28,'MDA3'!M28))","v":0},{"$f":"IF(AND(COUNTRY_INFO!I28>0,COUNTRY_INFO!I28<4),IF(J28>MAX('MDA1'!M28,MAX('MDA3'!I28,'MDA3'!L28)+MAX('MDA3'!J28,'MDA3'!M28)),MAX('MDA1'!M28,MAX('MDA3'!I28,'MDA3'!L28)+MAX('MDA3'!J28,'MDA3'!M28)),J28),0)","v":0},{"$f":"IF(AND(COUNTRY_INFO!I28>0,COUNTRY_INFO!I28<4), IF(M28/J28*100<>0, IF(M28/J28*100>100,100,M28/J28*100), \"-\"),0)","v":0},{"$f":"COUNTRY_INFO!N28","v":0},null,null,{"$f":"SUM(MAX('MDA2'!J28, 'T1'!L28, MAX(T3_R1!K28, T3_R2!K28)), MAX('MDA1'!K28, 'MDA2'!K28, 'T1'!M28, MAX(T3_R1!L28, T3_R2!L28)), MAX('MDA1'!L28, 'MDA2'!L28, 'T1'!N28, MAX(T3_R1!M28, T3_R2!M28)))","v":0},{"$f":"IF(AND(COUNTRY_INFO!J28>1,COUNTRY_INFO!J28<4),IF(COUNTRY_INFO!E28>MAX('MDA2'!J28,'T1'!L28,MAX(T3_R1!K28,T3_R2!K28)),MAX('MDA2'!J28,'T1'!L28,MAX(T3_R1!K28,T3_R2!K28)),COUNTRY_INFO!E28),0)","v":0},{"$f":"IF(AND(COUNTRY_INFO!J28>1,COUNTRY_INFO!J28<4), IF(T28/COUNTRY_INFO!E28*100<>0, IF(T28/COUNTRY_INFO!E28*100>100,100,T28/COUNTRY_INFO!E28*100), \"-\"),0)","v":0},{"$f":"IF(AND(COUNTRY_INFO!J28>1,COUNTRY_INFO!J28<4),IF(COUNTRY_INFO!F28>MAX('MDA1'!K28,'MDA2'!K28,'T1'!M28,MAX(T3_R1!L28,T3_R2!L28)),MAX('MDA1'!K28,'MDA2'!K28,'T1'!M28,MAX(T3_R1!L28,T3_R2!L28)),COUNTRY_INFO!F28),0)","v":0},{"$f":"IF(AND(COUNTRY_INFO!J28>1,COUNTRY_INFO!J28<4), IF(V28/COUNTRY_INFO!F28*100<>0, IF(V28/COUNTRY_INFO!F28*100>100,100,V28/COUNTRY_INFO!F28*100), \"-\"),0)","v":0},0,{"$f":"IF(AND(COUNTRY_INFO!J28>1,COUNTRY_INFO!J28<4), IF(S28/P28*100<>0, IF(X28/P28*100>100,100,X28/P28*100), \"-\"),0)","v":0},{"$f":"COUNTRY_INFO!O28","v":22737},null,null,{"$f":"MAX(SUM('T1'!L28:'T1'!N28),SUM('T2'!J28:'T2'!L28))","v":0},{"$f":"IF(COUNTRY_INFO!K28=1,IF(COUNTRY_INFO!F28*0.33>MAX('T1'!M28,'T2'!K28),MAX('T1'!M28,'T2'!K28),COUNTRY_INFO!F28*0.33),IF(COUNTRY_INFO!K28=2,IF(COUNTRY_INFO!F28*0.5>MAX('T1'!M28,'T2'!K28),MAX('T1'!M28,'T2'!K28),COUNTRY_INFO!F28*0.5),IF(COUNTRY_INFO!K28=3,IF(COUNTRY_INFO!F28>MAX('T1'!M28,'T2'!K28),MAX('T1'!M28,'T2'!K28),COUNTRY_INFO!F28),0)))","v":0},{"$f":"IF(AND(COUNTRY_INFO!K28>0,COUNTRY_INFO!K28<4),IF(Z28>0,IF(COUNTRY_INFO!K28=1, AD28/(COUNTRY_INFO!F28*0.33)*100, IF(COUNTRY_INFO!K28=2, AD28/(COUNTRY_INFO!F28*0.5)*100, IF(COUNTRY_INFO!K28=3, AD28/COUNTRY_INFO!F28*100))),\"-\"),0)","v":0},{"$f":"IF(COUNTRY_INFO!K28=2,IF(COUNTRY_INFO!G28*0.2>MAX('T1'!N28,'T2'!L28),MAX('T1'!N28,'T2'!L28),COUNTRY_INFO!G28*0.2),IF(COUNTRY_INFO!K28=3,IF(COUNTRY_INFO!G28>MAX('T1'!N28,'T2'!L28),MAX('T1'!N28,'T2'!L28),COUNTRY_INFO!G28),0))","v":0},{"$f":"IF(AND(COUNTRY_INFO!K28>0,COUNTRY_INFO!K28<4),IF(Z28>0,IF(COUNTRY_INFO!K28=1, 0, IF(COUNTRY_INFO!K28=2, AF28/(COUNTRY_INFO!G28*0.2)*100, IF(COUNTRY_INFO!K28=3, AF28/COUNTRY_INFO!G28*100))),\"-\"),0)","v":0},0,{"$f":"IF(AND(COUNTRY_INFO!K28>0,COUNTRY_INFO!K28<4), IF(AC28/Z28*100<>0, IF(AH28/Z28*100>100,100,AH28/Z28*100), \"-\"),0)","v":"-"},null,{"$f":"IF(AND(D28<>0, D28<>\"Unknown\",D28<>\"Stopped\",D28<>\"Not required\"),D28/COUNTRY_INFO!D28, 0)","v":0},{"$f":"IF(AND(J28<>0,J28<>\"Unknown\",J28<>\"Stopped\",J28<>\"Not required\"),J28/COUNTRY_INFO!D28, 0)","v":0},{"$f":"IF(AND(P28<>0,P28<>\"Unknown\",P28<>\"Not required\"),P28/(COUNTRY_INFO!E28+COUNTRY_INFO!F28), 0)","v":0},{"$f":"IF(AND(Z28<>0,Z28<>\"Unknown\",Z28<>\"Not required\"),IF(COUNTRY_INFO!K28=1,1,IF(COUNTRY_INFO!K28=2,0.5*COUNTRY_INFO!F28/(0.5*COUNTRY_INFO!F28+0.2*COUNTRY_INFO!G28),IF(COUNTRY_INFO!K28=3,COUNTRY_INFO!F28/(COUNTRY_INFO!F28+COUNTRY_INFO!G28)))),0)","v":1},{"$f":"IF(AND(Z28<>0,Z28<>\"Unknown\",Z28<>\"Not required\"),IF(COUNTRY_INFO!K28=1,0,IF(COUNTRY_INFO!K28=2,0.2*COUNTRY_INFO!G28/(0.5*COUNTRY_INFO!F28+0.2*COUNTRY_INFO!G28),IF(COUNTRY_INFO!K28=3,COUNTRY_INFO!G28/(COUNTRY_INFO!F28+COUNTRY_INFO!G28)))),0)","v":0},{"$f":"MAX(COUNTRY_INFO!D28*AK28*PROFILE!$G$7,COUNTRY_INFO!D28*AL28*PROFILE!$G$7)","v":0},{"$f":"MAX(COUNTRY_INFO!D28*AK28*PROFILE!$G$8,COUNTRY_INFO!D28*AL28*PROFILE!$G$8,COUNTRY_INFO!D28*AM28*PROFILE!$G$8)","v":0},{"$f":"MAX(COUNTRY_INFO!D28*AK28*PROFILE!$G$9,COUNTRY_INFO!D28*AL28*PROFILE!$G$9,COUNTRY_INFO!D28*AM28*PROFILE!$G$9,IF(AND(DISTRICT!Z28<>\"Unknown\",Z28<>\"Not required\"),COUNTRY_INFO!O28*DISTRICT!AN28,0))","v":22737},{"$f":"MAX(COUNTRY_INFO!D28*AK28*PROFILE!$G$10,COUNTRY_INFO!D28*AL28*PROFILE!$G$10,IF(AND(DISTRICT!Z28<>\"Unknown\",Z28<>\"Not required\"),COUNTRY_INFO!O28*DISTRICT!AO28,0))","v":0},22737,0,{"$f":"MAX('MDA2'!J28,'T1'!L28,'T2'!J28,T3_R1!K28,T3_R2!K28)","v":0},{"$f":"MAX('MDA1'!K28,'MDA2'!K28,'MDA3'!I28,'MDA3'!L28,'T1'!M28,'T2'!K28,T3_R1!L28,T3_R2!L28)","v":0},{"$f":"MAX('MDA1'!L28,'MDA2'!L28,'MDA3'!J28,'MDA3'!M28,'T1'!N28,'T2'!L28,T3_R1!M28,T3_R2!M28)","v":0},0,{"$f":"MAX('MDA2'!J28,T28)","v":0},{"$f":"MAX('MDA1'!K28,'MDA2'!K28,'MDA3'!I28,'MDA3'!L28,V28,AD28)","v":0},{"$f":"MAX('MDA1'!L28,'MDA2'!L28,'MDA3'!J28,'MDA3'!M28,AF28)","v":0},0,0]
[{"$f":"IF(COUNTRY_INFO!A29=0,\" \",COUNTRY_INFO!A29)","v":"Guinea"},{"$f":"IF(COUNTRY_INFO!B29=0,\" \",COUNTRY_INFO!B29)","v":"Kindia"},{"$f":"IF(COUNTRY_INFO!C29=0,\" \",COUNTRY_INFO!C29)","v":"Dubreka"},{"$f":"COUNTRY_INFO!L29","v":0},null,null,{"$f":"MAX('MDA1'!M29,'MDA2'!M29)","v":0},{"$f":"IF(AND(COUNTRY_INFO!H29>0,COUNTRY_INFO!H29<4),IF(D29>MAX('MDA1'!M29,'MDA2'!M29),MAX('MDA1'!M29,'MDA2'!M29),D29),0)","v":0},{"$f":"IF(AND(COUNTRY_INFO!H29>0,COUNTRY_INFO!H29<4), IF(G29/D29*100<>0, IF(G29/D29*100>100,100,G29/D29*100), \"-\"),0)","v":0},{"$f":"COUNTRY_INFO!M29","v":0},null,0,{"$f":"MAX('MDA1'!M29,MAX('MDA3'!I29,'MDA3'!L29)+MAX('MDA3'!J29,'MDA3'!M29))","v":0},{"$f":"IF(AND(COUNTRY_INFO!I29>0,COUNTRY_INFO!I29<4),IF(J29>MAX('MDA1'!M29,MAX('MDA3'!I29,'MDA3'!L29)+MAX('MDA3'!J29,'MDA3'!M29)),MAX('MDA1'!M29,MAX('MDA3'!I29,'MDA3'!L29)+MAX('MDA3'!J29,'MDA3'!M29)),J29),0)","v":0},{"$f":"IF(AND(COUNTRY_INFO!I29>0,COUNTRY_INFO!I29<4), IF(M29/J29*100<>0, IF(M29/J29*100>100,100,M29/J29*100), \"-\"),0)","v":0},{"$f":"COUNTRY_INFO!N29","v":0},null,null,{"$f":"SUM(MAX('MDA2'!J29, 'T1'!L29, MAX(T3_R1!K29, T3_R2!K29)), MAX('MDA1'!K29, 'MDA2'!K29, 'T1'!M29, MAX(T3_R1!L29, T3_R2!L29)), MAX('MDA1'!L29, 'MDA2'!L29, 'T1'!N29, MAX(T3_R1!M29, T3_R2!M29)))","v":0},{"$f":"IF(AND(COUNTRY_INFO!J29>1,COUNTRY_INFO!J29<4),IF(COUNTRY_INFO!E29>MAX('MDA2'!J29,'T1'!L29,MAX(T3_R1!K29,T3_R2!K29)),MAX('MDA2'!J29,'T1'!L29,MAX(T3_R1!K29,T3_R2!K29)),COUNTRY_INFO!E29),0)","v":0},{"$f":"IF(AND(COUNTRY_INFO!J29>1,COUNTRY_INFO!J29<4), IF(T29/COUNTRY_INFO!E29*100<>0, IF(T29/COUNTRY_INFO!E29*100>100,100,T29/COUNTRY_INFO!E29*100), \"-\"),0)","v":0},{"$f":"IF(AND(COUNTRY_INFO!J29>1,COUNTRY_INFO!J29<4),IF(COUNTRY_INFO!F29>MAX('MDA1'!K29,'MDA2'!K29,'T1'!M29,MAX(T3_R1!L29,T3_R2!L29)),MAX('MDA1'!K29,'MDA2'!K29,'T1'!M29,MAX(T3_R1!L29,T3_R2!L29)),COUNTRY_INFO!F29),0)","v":0},{"$f":"IF(AND(COUNTRY_INFO!J29>1,COUNTRY_INFO!J29<4), IF(V29/COUNTRY_INFO!F29*100<>0, IF(V29/COUNTRY_INFO!F29*100>100,100,V29/COUNTRY_INFO!F29*100), \"-\"),0)","v":0},0,{"$f":"IF(AND(COUNTRY_INFO!J29>1,COUNTRY_INFO!J29<4), IF(S29/P29*100<>0, IF(X29/P29*100>100,100,X29/P29*100), \"-\"),0)","v":0},{"$f":"COUNTRY_INFO!O29","v":28483.29},null,null,{"$f":"MAX(SUM('T1'!L29:'T1'!N29),SUM('T2'!J29:'T2'!L29))","v":0},{"$f":"IF(COUNTRY_INFO!K29=1,IF(COUNTRY_INFO!F29*0.33>MAX('T1'!M29,'T2'!K29),MAX('T1'!M29,'T2'!K29),COUNTRY_INFO!F29*0.33),IF(COUNTRY_INFO!K29=2,IF(COUNTRY_INFO!F29*0.5>MAX('T1'!M29,'T2'!K29),MAX('T1'!M29,'T2'!K29),COUNTRY_INFO!F29*0.5),IF(COUNTRY_INFO!K29=3,IF(COUNTRY_INFO!F29>MAX('T1'!M29,'T2'!K29),MAX('T1'!M29,'T2'!K29),COUNTRY_INFO!F29),0)))","v":0},{"$f":"IF(AND(COUNTRY_INFO!K29>0,COUNTRY_INFO!K29<4),IF(Z29>0,IF(COUNTRY_INFO!K29=1, AD29/(COUNTRY_INFO!F29*0.33)*100, IF(COUNTRY_INFO!K29=2, AD29/(COUNTRY_INFO!F29*0.5)*100, IF(COUNTRY_INFO!K29=3, AD29/COUNTRY_INFO!F29*100))),\"-\"),0)","v":0},{"$f":"IF(COUNTRY_INFO!K29=2,IF(COUNTRY_INFO!G29*0.2>MAX('T1'!N29,'T2'!L29),MAX('T1'!N29,'T2'!L29),COUNTRY_INFO!G29*0.2),IF(COUNTRY_INFO!K29=3,IF(COUNTRY_INFO!G29>MAX('T1'!N29,'T2'!L29),MAX('T1'!N29,'T2'!L29),COUNTRY_INFO!G29),0))","v":0},{"$f":"IF(AND(COUNTRY_INFO!K29>0,COUNTRY_INFO!K29<4),IF(Z29>0,IF(COUNTRY_INFO!K29=1, 0, IF(COUNTRY_INFO!K29=2, AF29/(COUNTRY_INFO!G29*0.2)*100, IF(COUNTRY_INFO!K29=3, AF29/COUNTRY_INFO!G29*100))),\"-\"),0)","v":0},0,{"$f":"IF(AND(COUNTRY_INFO!K29>0,COUNTRY_INFO!K29<4), IF(AC29/Z29*100<>0, IF(AH29/Z29*100>100,100,AH29/Z29*100), \"-\"),0)","v":"-"},null,{"$f":"IF(AND(D29<>0, D29<>\"Unknown\",D29<>\"Stopped\",D29<>\"Not required\"),D29/COUNTRY_INFO!D29, 0)","v":0},{"$f":"IF(AND(J29<>0,J29<>\"Unknown\",J29<>\"Stopped\",J29<>\"Not required\"),J29/COUNTRY_INFO!D29, 0)","v":0},{"$f":"IF(AND(P29<>0,P29<>\"Unknown\",P29<>\"Not required\"),P29/(COUNTRY_INFO!E29+COUNTRY_INFO!F29), 0)","v":0},{"$f":"IF(AND(Z29<>0,Z29<>\"Unknown\",Z29<>\"Not required\"),IF(COUNTRY_INFO!K29=1,1,IF(COUNTRY_INFO!K29=2,0.5*COUNTRY_INFO!F29/(0.5*COUNTRY_INFO!F29+0.2*COUNTRY_INFO!G29),IF(COUNTRY_INFO!K29=3,COUNTRY_INFO!F29/(COUNTRY_INFO!F29+COUNTRY_INFO!G29)))),0)","v":1},{"$f":"IF(AND(Z29<>0,Z29<>\"Unknown\",Z29<>\"Not required\"),IF(COUNTRY_INFO!K29=1,0,IF(COUNTRY_INFO!K29=2,0.2*COUNTRY_INFO!G29/(0.5*COUNTRY_INFO!F29+0.2*COUNTRY_INFO!G29),IF(COUNTRY_INFO!K29=3,COUNTRY_INFO!G29/(COUNTRY_INFO!F29+COUNTRY_INFO!G29)))),0)","v":0},{"$f":"MAX(COUNTRY_INFO!D29*AK29*PROFILE!$G$7,COUNTRY_INFO!D29*AL29*PROFILE!$G$7)","v":0},{"$f":"MAX(COUNTRY_INFO!D29*AK29*PROFILE!$G$8,COUNTRY_INFO!D29*AL29*PROFILE!$G$8,COUNTRY_INFO!D29*AM29*PROFILE!$G$8)","v":0},{"$f":"MAX(COUNTRY_INFO!D29*AK29*PROFILE!$G$9,COUNTRY_INFO!D29*AL29*PROFILE!$G$9,COUNTRY_INFO!D29*AM29*PROFILE!$G$9,IF(AND(DISTRICT!Z29<>\"Unknown\",Z29<>\"Not required\"),COUNTRY_INFO!O29*DISTRICT!AN29,0))","v":28483.29},{"$f":"MAX(COUNTRY_INFO!D29*AK29*PROFILE!$G$10,COUNTRY_INFO!D29*AL29*PROFILE!$G$10,IF(AND(DISTRICT!Z29<>\"Unknown\",Z29<>\"Not required\"),COUNTRY_INFO!O29*DISTRICT!AO29,0))","v":0},28483.29,0,{"$f":"MAX('MDA2'!J29,'T1'!L29,'T2'!J29,T3_R1!K29,T3_R2!K29)","v":0},{"$f":"MAX('MDA1'!K29,'MDA2'!K29,'MDA3'!I29,'MDA3'!L29,'T1'!M29,'T2'!K29,T3_R1!L29,T3_R2!L29)","v":0},{"$f":"MAX('MDA1'!L29,'MDA2'!L29,'MDA3'!J29,'MDA3'!M29,'T1'!N29,'T2'!L29,T3_R1!M29,T3_R2!M29)","v":0},0,{"$f":"MAX('MDA2'!J29,T29)","v":0},{"$f":"MAX('MDA1'!K29,'MDA2'!K29,'MDA3'!I29,'MDA3'!L29,V29,AD29)","v":0},{"$f":"MAX('MDA1'!L29,'MDA2'!L29,'MDA3'!J29,'MDA3'!M29,AF29)","v":0},0,0]
[{"$f":"IF(COUNTRY_INFO!A30=0,\" \",COUNTRY_INFO!A30)","v":"Guinea"},{"$f":"IF(COUNTRY_INFO!B30=0,\" \",COUNTRY_INFO!B30)","v":"Kindia"},{"$f":"IF(COUNTRY_INFO!C30=0,\" \",COUNTRY_INFO!C30)","v":"Forecariah"},{"$f":"COUNTRY_INFO!L30","v":253749},null,null,{"$f":"MAX('MDA1'!M30,'MDA2'!M30)","v":189950},{"$f":"IF(AND(COUNTRY_INFO!H30>0,COUNTRY_INFO!H30<4),IF(D30>MAX('MDA1'!M30,'MDA2'!M30),MAX('MDA1'!M30,'MDA2'!M30),D30),0)","v":189950},{"$f":"IF(AND(COUNTRY_INFO!H30>0,COUNTRY_INFO!H30<4), IF(G30/D30*100<>0, IF(G30/D30*100>100,100,G30/D30*100), \"-\"),0)","v":74.857437861824081},{"$f":"COUNTRY_INFO!M30","v":253749},null,0,{"$f":"MAX('MDA1'!M30,MAX('MDA3'!I30,'MDA3'!L30)+MAX('MDA3'!J30,'MDA3'!M30))","v":189950},{"$f":"IF(AND(COUNTRY_INFO!I30>0,COUNTRY_INFO!I30<4),IF(J30>MAX('MDA1'!M30,MAX('MDA3'!I30,'MDA3'!L30)+MAX('MDA3'!J30,'MDA3'!M30)),MAX('MDA1'!M30,MAX('MDA3'!I30,'MDA3'!L30)+MAX('MDA3'!J30,'MDA3'!M30)),J30),0)","v":189950},{"$f":"IF(AND(COUNTRY_INFO!I30>0,COUNTRY_INFO!I30<4), IF(M30/J30*100<>0, IF(M30/J30*100>100,100,M30/J30*100), \"-\"),0)","v":74.857437861824081},{"$f":"COUNTRY_INFO!N30","v":104037},null,null,{"$f":"SUM(MAX('MDA2'!J30, 'T1'!L30, MAX(T3_R1!K30, T3_R2!K30)), MAX('MDA1'!K30, 'MDA2'!K30, 'T1'!M30, MAX(T3_R1!L30, T3_R2!L30)), MAX('MDA1'!L30, 'MDA2'!L30, 'T1'!N30, MAX(T3_R1!M30, T3_R2!M30)))","v":189950},{"$f":"IF(AND(COUNTRY_INFO!J30>1,COUNTRY_INFO!J30<4),IF(COUNTRY_INFO!E30>MAX('MDA2'!J30,'T1'!L30,MAX(T3_R1!K30,T3_R2!K30)),MAX('MDA2'!J30,'T1'!L30,MAX(T3_R1!K30,T3_R2!K30)),COUNTRY_INFO!E30),0)","v":0},{"$f":"IF(AND(COUNTRY_INFO!J30>1,COUNTRY_INFO!J30<4), IF(T30/COUNTRY_INFO!E30*100<>0, IF(T30/COUNTRY_INFO!E30*100>100,100,T30/COUNTRY_INFO!E30*100), \"-\"),0)","v":"-"},{"$f":"IF(AND(COUNTRY_INFO!J30>1,COUNTRY_INFO!J30<4),IF(COUNTRY_INFO!F30>MAX('MDA1'!K30,'MDA2'!K30,'T1'!M30,MAX(T3_R1!L30,T3_R2!L30)),MAX('MDA1'!K30,'MDA2'!K30,'T1'!M30,MAX(T3_R1!L30,T3_R2!L30)),COUNTRY_INFO!F30),0)","v":63437},{"$f":"IF(AND(COUNTRY_INFO!J30>1,COUNTRY_INFO!J30<4), IF(V30/COUNTRY_INFO!F30*100<>0, IF(V30/COUNTRY_INFO!F30*100>100,100,V30/COUNTRY_INFO!F30*100), \"-\"),0)","v":100},63437,{"$f":"IF(AND(COUNTRY_INFO!J30>1,COUNTRY_INFO!J30<4), IF(S30/P30*100<>0, IF(X30/P30*100>100,100,X30/P30*100), \"-\"),0)","v":60.975422205561479},{"$f":"COUNTRY_INFO!O30","v":20934.210000000003},null,null,{"$f":"MAX(SUM('T1'!L30:'T1'!N30),SUM('T2'!J30:'T2'!L30))","v":0},{"$f":"IF(COUNTRY_INFO!K30=1,IF(COUNTRY_INFO!F30*0.33>MAX('T1'!M30,'T2'!K30),MAX('T1'!M30,'T2'!K30),COUNTRY_INFO!F30*0.33),IF(COUNTRY_INFO!K30=2,IF(COUNTRY_INFO!F30*0.5>MAX('T1'!M30,'T2'!K30),MAX('T1'!M30,'T2'!K30),COUNTRY_INFO!F30*0.5),IF(COUNTRY_INFO!K30=3,IF(COUNTRY_INFO!F30>MAX('T1'!M30,'T2'!K30),MAX('T1'!M30,'T2'!K30),COUNTRY_INFO!F30),0)))","v":0},{"$f":"IF(AND(COUNTRY_INFO!K30>0,COUNTRY_INFO!K30<4),IF(Z30>0,IF(COUNTRY_INFO!K30=1, AD30/(COUNTRY_INFO!F30*0.33)*100, IF(COUNTRY_INFO!K30=2, AD30/(COUNTRY_INFO!F30*0.5)*100, IF(COUNTRY_INFO!K30=3, AD30/COUNTRY_INFO!F30*100))),\"-\"),0)","v":0},{"$f":"IF(COUNTRY_INFO!K30=2,IF(COUNTRY_INFO!G30*0.2>MAX('T1'!N30,'T2'!L30),MAX('T1'!N30,'T2'!L30),COUNTRY_INFO!G30*0.2),IF(COUNTRY_INFO!K30=3,IF(COUNTRY_INFO!G30>MAX('T1'!N30,'T2'!L30),MAX('T1'!N30,'T2'!L30),COUNTRY_INFO!G30),0))","v":0},{"$f":"IF(AND(COUNTRY_INFO!K30>0,COUNTRY_INFO!K30<4),IF(Z30>0,IF(COUNTRY_INFO!K30=1, 0, IF(COUNTRY_INFO!K30=2, AF30/(COUNTRY_INFO!G30*0.2)*100, IF(COUNTRY_INFO!K30=3, AF30/COUNTRY_INFO!G30*100))),\"-\"),0)","v":0},0,{"$f":"IF(AND(COUNTRY_INFO!K30>0,COUNTRY_INFO!K30<4), IF(AC30/Z30*100<>0, IF(AH30/Z30*100>100,100,AH30/Z30*100), \"-\"),0)","v":"-"},null,{"$f":"IF(AND(D30<>0, D30<>\"Unknown\",D30<>\"Stopped\",D30<>\"Not required\"),D30/COUNTRY_INFO!D30, 0)","v":1},{"$f":"IF(AND(J30<>0,J30<>\"Unknown\",J30<>\"Stopped\",J30<>\"Not required\"),J30/COUNTRY_INFO!D30, 0)","v":1},{"$f":"IF(AND(P30<>0,P30<>\"Unknown\",P30<>\"Not required\"),P30/(COUNTRY_INFO!E30+COUNTRY_INFO!F30), 0)","v":1},{"$f":"IF(AND(Z30<>0,Z30<>\"Unknown\",Z30<>\"Not required\"),IF(COUNTRY_INFO!K30=1,1,IF(COUNTRY_INFO!K30=2,0.5*COUNTRY_INFO!F30/(0.5*COUNTRY_INFO!F30+0.2*COUNTRY_INFO!G30),IF(COUNTRY_INFO!K30=3,COUNTRY_INFO!F30/(COUNTRY_INFO!F30+COUNTRY_INFO!G30)))),0)","v":1},{"$f":"IF(AND(Z30<>0,Z30<>\"Unknown\",Z30<>\"Not required\"),IF(COUNTRY_INFO!K30=1,0,IF(COUNTRY_INFO!K30=2,0.2*COUNTRY_INFO!G30/(0.5*COUNTRY_INFO!F30+0.2*COUNTRY_INFO!G30),IF(COUNTRY_INFO!K30=3,COUNTRY_INFO!G30/(COUNTRY_INFO!F30+COUNTRY_INFO!G30)))),0)","v":0},{"$f":"MAX(COUNTRY_INFO!D30*AK30*PROFILE!$G$7,COUNTRY_INFO!D30*AL30*PROFILE!$G$7)","v":10149.97569859953},{"$f":"MAX(COUNTRY_INFO!D30*AK30*PROFILE!$G$8,COUNTRY_INFO!D30*AL30*PROFILE!$G$8,COUNTRY_INFO!D30*AM30*PROFILE!$G$8)","v":40599.741191167668},{"$f":"MAX(COUNTRY_INFO!D30*AK30*PROFILE!$G$9,COUNTRY_INFO!D30*AL30*PROFILE!$G$9,COUNTRY_INFO!D30*AM30*PROFILE!$G$9,IF(AND(DISTRICT!Z30<>\"Unknown\",Z30<>\"Not required\"),COUNTRY_INFO!O30*DISTRICT!AN30,0))","v":63437.348116247056},{"$f":"MAX(COUNTRY_INFO!D30*AK30*PROFILE!$G$10,COUNTRY_INFO!D30*AL30*PROFILE!$G$10,IF(AND(DISTRICT!Z30<>\"Unknown\",Z30<>\"Not required\"),COUNTRY_INFO!O30*DISTRICT!AO30,0))","v":139561.93499398575},253749,0,{"$f":"MAX('MDA2'!J30,'T1'!L30,'T2'!J30,T3_R1!K30,T3_R2!K30)","v":0},{"$f":"MAX('MDA1'!K30,'MDA2'!K30,'MDA3'!I30,'MDA3'!L30,'T1'!M30,'T2'!K30,T3_R1!L30,T3_R2!L30)","v":97090},{"$f":"MAX('MDA1'!L30,'MDA2'!L30,'MDA3'!J30,'MDA3'!M30,'T1'!N30,'T2'!L30,T3_R1!M30,T3_R2!M30)","v":92860},189950,{"$f":"MAX('MDA2'!J30,T30)","v":0},{"$f":"MAX('MDA1'!K30,'MDA2'!K30,'MDA3'!I30,'MDA3'!L30,V30,AD30)","v":97090},{"$f":"MAX('MDA1'!L30,'MDA2'!L30,'MDA3'!J30,'MDA3'!M30,AF30)","v":92860},189950,74.857437861824081]
[{"$f":"IF(COUNTRY_INFO!A31=0,\" \",COUNTRY_INFO!A31)","v":"Guinea"},{"$f":"IF(COUNTRY_INFO!B31=0,\" \",COUNTRY_INFO!B31)","v":"Kindia"},{"$f":"IF(COUNTRY_INFO!C31=0,\" \",COUNTRY_INFO!C31)","v":"Kindia"},{"$f":"COUNTRY_INFO!L31","v":459170},null,null,{"$f":"MAX('MDA1'!M31,'MDA2'!M31)","v":352982},{"$f":"IF(AND(COUNTRY_INFO!H31>0,COUNTRY_INFO!H31<4),IF(D31>MAX('MDA1'!M31,'MDA2'!M31),MAX('MDA1'!M31,'MDA2'!M31),D31),0)","v":352982},{"$f":"IF(AND(COUNTRY_INFO!H31>0,COUNTRY_INFO!H31<4), IF(G31/D31*100<>0, IF(G31/D31*100>100,100,G31/D31*100), \"-\"),0)","v":76.873924690201889},{"$f":"COUNTRY_INFO!M31","v":459170},null,0,{"$f":"MAX('MDA1'!M31,MAX('MDA3'!I31,'MDA3'!L31)+MAX('MDA3'!J31,'MDA3'!M31))","v":352982},{"$f":"IF(AND(COUNTRY_INFO!I31>0,COUNTRY_INFO!I31<4),IF(J31>MAX('MDA1'!M31,MAX('MDA3'!I31,'MDA3'!L31)+MAX('MDA3'!J31,'MDA3'!M31)),MAX('MDA1'!M31,MAX('MDA3'!I31,'MDA3'!L31)+MAX('MDA3'!J31,'MDA3'!M31)),J31),0)","v":352982},{"$f":"IF(AND(COUNTRY_INFO!I31>0,COUNTRY_INFO!I31<4), IF(M31/J31*100<>0, IF(M31/J31*100>100,100,M31/J31*100), \"-\"),0)","v":76.873924690201889},{"$f":"COUNTRY_INFO!N31","v":188260},null,null,{"$f":"SUM(MAX('MDA2'!J31, 'T1'!L31, MAX(T3_R1!K31, T3_R2!K31)), MAX('MDA1'!K31, 'MDA2'!K31, 'T1'!M31, MAX(T3_R1!L31, T3_R2!L31)), MAX('MDA1'!L31, 'MDA2'!L31, 'T1'!N31, MAX(T3_R1!M31, T3_R2!M31)))","v":352982},{"$f":"IF(AND(COUNTRY_INFO!J31>1,COUNTRY_INFO!J31<4),IF(COUNTRY_INFO!E31>MAX('MDA2'!J31,'T1'!L31,MAX(T3_R1!K31,T3_R2!K31)),MAX('MDA2'!J31,'T1'!L31,MAX(T3_R1!K31,T3_R2!K31)),COUNTRY_INFO!E31),0)","v":0},{"$f":"IF(AND(COUNTRY_INFO!J31>1,COUNTRY_INFO!J31<4), IF(T31/COUNTRY_INFO!E31*100<>0, IF(T31/COUNTRY_INFO!E31*100>100,100,T31/COUNTRY_INFO!E31*100), \"-\"),0)","v":"-"},{"$f":"IF(AND(COUNTRY_INFO!J31>1,COUNTRY_INFO!J31<4),IF(COUNTRY_INFO!F31>MAX('MDA1'!K31,'MDA2'!K31,'T1'!M31,MAX(T3_R1!L31,T3_R2!L31)),MAX('MDA1'!K31,'MDA2'!K31,'T1'!M31,MAX(T3_R1!L31,T3_R2!L31)),COUNTRY_INFO!F31),0)","v":114793},{"$f":"IF(AND(COUNTRY_INFO!J31>1,COUNTRY_INFO!J31<4), IF(V31/COUNTRY_INFO!F31*100<>0, IF(V31/COUNTRY_INFO!F31*100>100,100,V31/COUNTRY_INFO!F31*100), \"-\"),0)","v":100},114793,{"$f":"IF(AND(COUNTRY_INFO!J31>1,COUNTRY_INFO!J31<4), IF(S31/P31*100<>0, IF(X31/P31*100>100,100,X31/P31*100), \"-\"),0)","v":60.975778179113995},{"$f":"COUNTRY_INFO!O31","v":367337},null,null,{"$f":"MAX(SUM('T1'!L31:'T1'!N31),SUM('T2'!J31:'T2'!L31))","v":0},{"$f":"IF(COUNTRY_INFO!K31=1,IF(COUNTRY_INFO!F31*0.33>MAX('T1'!M31,'T2'!K31),MAX('T1'!M31,'T2'!K31),COUNTRY_INFO!F31*0.33),IF(COUNTRY_INFO!K31=2,IF(COUNTRY_INFO!F31*0.5>MAX('T1'!M31,'T2'!K31),MAX('T1'!M31,'T2'!K31),COUNTRY_INFO!F31*0.5),IF(COUNTRY_INFO!K31=3,IF(COUNTRY_INFO!F31>MAX('T1'!M31,'T2'!K31),MAX('T1'!M31,'T2'!K31),COUNTRY_INFO!F31),0)))","v":0},{"$f":"IF(AND(COUNTRY_INFO!K31>0,COUNTRY_INFO!K31<4),IF(Z31>0,IF(COUNTRY_INFO!K31=1, AD31/(COUNTRY_INFO!F31*0.33)*100, IF(COUNTRY_INFO!K31=2, AD31/(COUNTRY_INFO!F31*0.5)*100, IF(COUNTRY_INFO!K31=3, AD31/COUNTRY_INFO!F31*100))),\"-\"),0)","v":0},{"$f":"IF(COUNTRY_INFO!K31=2,IF(COUNTRY_INFO!G31*0.2>MAX('T1'!N31,'T2'!L31),MAX('T1'!N31,'T2'!L31),COUNTRY_INFO!G31*0.2),IF(COUNTRY_INFO!K31=3,IF(COUNTRY_INFO!G31>MAX('T1'!N31,'T2'!L31),MAX('T1'!N31,'T2'!L31),COUNTRY_INFO!G31),0))","v":0},{"$f":"IF(AND(COUNTRY_INFO!K31>0,COUNTRY_INFO!K31<4),IF(Z31>0,IF(COUNTRY_INFO!K31=1, 0, IF(COUNTRY_INFO!K31=2, AF31/(COUNTRY_INFO!G31*0.2)*100, IF(COUNTRY_INFO!K31=3, AF31/COUNTRY_INFO!G31*100))),\"-\"),0)","v":0},0,{"$f":"IF(AND(COUNTRY_INFO!K31>0,COUNTRY_INFO!K31<4), IF(AC31/Z31*100<>0, IF(AH31/Z31*100>100,100,AH31/Z31*100), \"-\"),0)","v":"-"},null,{"$f":"IF(AND(D31<>0, D31<>\"Unknown\",D31<>\"Stopped\",D31<>\"Not required\"),D31/COUNTRY_INFO!D31, 0)","v":1},{"$f":"IF(AND(J31<>0,J31<>\"Unknown\",J31<>\"Stopped\",J31<>\"Not required\"),J31/COUNTRY_INFO!D31, 0)","v":1},{"$f":"IF(AND(P31<>0,P31<>\"Unknown\",P31<>\"Not required\"),P31/(COUNTRY_INFO!E31+COUNTRY_INFO!F31), 0)","v":1},{"$f":"IF(AND(Z31<>0,Z31<>\"Unknown\",Z31<>\"Not required\"),IF(COUNTRY_INFO!K31=1,1,IF(COUNTRY_INFO!K31=2,0.5*COUNTRY_INFO!F31/(0.5*COUNTRY_INFO!F31+0.2*COUNTRY_INFO!G31),IF(COUNTRY_INFO!K31=3,COUNTRY_INFO!F31/(COUNTRY_INFO!F31+COUNTRY_INFO!G31)))),0)","v":0.31250051043047666},{"$f":"IF(AND(Z31<>0,Z31<>\"Unknown\",Z31<>\"Not required\"),IF(COUNTRY_INFO!K31=1,0,IF(COUNTRY_INFO!K31=2,0.2*COUNTRY_INFO!G31/(0.5*COUNTRY_INFO!F31+0.2*COUNTRY_INFO!G31),IF(COUNTRY_INFO!K31=3,COUNTRY_INFO!G31/(COUNTRY_INFO!F31+COUNTRY_INFO!G31)))),0)","v":0.68749948956952334},{"$f":"MAX(COUNTRY_INFO!D31*AK31*PROFILE!$G$7,COUNTRY_INFO!D31*AL31*PROFILE!$G$7)","v":18366.828407307796},{"$f":"MAX(COUNTRY_INFO!D31*AK31*PROFILE!$G$8,COUNTRY_INFO!D31*AL31*PROFILE!$G$8,COUNTRY_INFO!D31*AM31*PROFILE!$G$8)","v":73467.021201062686},{"$f":"MAX(COUNTRY_INFO!D31*AK31*PROFILE!$G$9,COUNTRY_INFO!D31*AL31*PROFILE!$G$9,COUNTRY_INFO!D31*AM31*PROFILE!$G$9,IF(AND(DISTRICT!Z31<>\"Unknown\",Z31<>\"Not required\"),COUNTRY_INFO!O31*DISTRICT!AN31,0))","v":114793},{"$f":"MAX(COUNTRY_INFO!D31*AK31*PROFILE!$G$10,COUNTRY_INFO!D31*AL31*PROFILE!$G$10,IF(AND(DISTRICT!Z31<>\"Unknown\",Z31<>\"Not required\"),COUNTRY_INFO!O31*DISTRICT!AO31,0))","v":252544},459170.84960837045,0,{"$f":"MAX('MDA2'!J31,'T1'!L31,'T2'!J31,T3_R1!K31,T3_R2!K31)","v":0},{"$f":"MAX('MDA1'!K31,'MDA2'!K31,'MDA3'!I31,'MDA3'!L31,'T1'!M31,'T2'!K31,T3_R1!L31,T3_R2!L31)","v":175356},{"$f":"MAX('MDA1'!L31,'MDA2'!L31,'MDA3'!J31,'MDA3'!M31,'T1'!N31,'T2'!L31,T3_R1!M31,T3_R2!M31)","v":177626},352982,{"$f":"MAX('MDA2'!J31,T31)","v":0},{"$f":"MAX('MDA1'!K31,'MDA2'!K31,'MDA3'!I31,'MDA3'!L31,V31,AD31)","v":175356},{"$f":"MAX('MDA1'!L31,'MDA2'!L31,'MDA3'!J31,'MDA3'!M31,AF31)","v":177626},352982,76.873782449617707]
[{"$f":"IF(COUNTRY_INFO!A32=0,\" \",COUNTRY_INFO!A32)","v":"Guinea"},{"$f":"IF(COUNTRY_INFO!B32=0,\" \",COUNTRY_INFO!B32)","v":"Kindia"},{"$f":"IF(COUNTRY_INFO!C32=0,\" \",COUNTRY_INFO!C32)","v":"Telimele"},{"$f":"COUNTRY_INFO!L32","v":297061},null,null,{"$f":"MAX('MDA1'!M32,'MDA2'!M32)","v":237779},{"$f":"IF(AND(COUNTRY_INFO!H32>0,COUNTRY_INFO!H32<4),IF(D32>MAX('MDA1'!M32,'MDA2'!M32),MAX('MDA1'!M32,'MDA2'!M32),D32),0)","v":237779},{"$f":"IF(AND(COUNTRY_INFO!H32>0,COUNTRY_INFO!H32<4), IF(G32/D32*100<>0, IF(G32/D32*100>100,100,G32/D32*100), \"-\"),0)","v":80.043829381844134},{"$f":"COUNTRY_INFO!M32","v":0},null,0,{"$f":"MAX('MDA1'!M32,MAX('MDA3'!I32,'MDA3'!L32)+MAX('MDA3'!J32,'MDA3'!M32))","v":237779},{"$f":"IF(AND(COUNTRY_INFO!I32>0,COUNTRY_INFO!I32<4),IF(J32>MAX('MDA1'!M32,MAX('MDA3'!I32,'MDA3'!L32)+MAX('MDA3'!J32,'MDA3'!M32)),MAX('MDA1'!M32,MAX('MDA3'!I32,'MDA3'!L32)+MAX('MDA3'!J32,'MDA3'!M32)),J32),0)","v":0},{"$f":"IF(AND(COUNTRY_INFO!I32>0,COUNTRY_INFO!I32<4), IF(M32/J32*100<>0, IF(M32/J32*100>100,100,M32/J32*100), \"-\"),0)","v":0},{"$f":"COUNTRY_INFO!N32","v":121795},null,null,{"$f":"SUM(MAX('MDA2'!J32, 'T1'!L32, MAX(T3_R1!K32, T3_R2!K32)), MAX('MDA1'!K32, 'MDA2'!K32, 'T1'!M32, MAX(T3_R1!L32, T3_R2!L32)), MAX('MDA1'!L32, 'MDA2'!L32, 'T1'!N32, MAX(T3_R1!M32, T3_R2!M32)))","v":237779},{"$f":"IF(AND(COUNTRY_INFO!J32>1,COUNTRY_INFO!J32<4),IF(COUNTRY_INFO!E32>MAX('MDA2'!J32,'T1'!L32,MAX(T3_R1!K32,T3_R2!K32)),MAX('MDA2'!J32,'T1'!L32,MAX(T3_R1!K32,T3_R2!K32)),COUNTRY_INFO!E32),0)","v":0},{"$f":"IF(AND(COUNTRY_INFO!J32>1,COUNTRY_INFO!J32<4), IF(T32/COUNTRY_INFO!E32*100<>0, IF(T32/COUNTRY_INFO!E32*100>100,100,T32/COUNTRY_INFO!E32*100), \"-\"),0)","v":"-"},{"$f":"IF(AND(COUNTRY_INFO!J32>1,COUNTRY_INFO!J32<4),IF(COUNTRY_INFO!F32>MAX('MDA1'!K32,'MDA2'!K32,'T1'!M32,MAX(T3_R1!L32,T3_R2!L32)),MAX('MDA1'!K32,'MDA2'!K32,'T1'!M32,MAX(T3_R1!L32,T3_R2!L32)),COUNTRY_INFO!F32),0)","v":74265},{"$f":"IF(AND(COUNTRY_INFO!J32>1,COUNTRY_INFO!J32<4), IF(V32/COUNTRY_INFO!F32*100<>0, IF(V32/COUNTRY_INFO!F32*100>100,100,V32/COUNTRY_INFO!F32*100), \"-\"),0)","v":100},74265,{"$f":"IF(AND(COUNTRY_INFO!J32>1,COUNTRY_INFO!J32<4), IF(S32/P32*100<>0, IF(X32/P32*100>100,100,X32/P32*100), \"-\"),0)","v":60.975409499568947},{"$f":"COUNTRY_INFO!O32","v":24507.45},null,null,{"$f":"MAX(SUM('T1'!L32:'T1'!N32),SUM('T2'!J32:'T2'!L32))","v":0},{"$f":"IF(COUNTRY_INFO!K32=1,IF(COUNTRY_INFO!F32*0.33>MAX('T1'!M32,'T2'!K32),MAX('T1'!M32,'T2'!K32),COUNTRY_INFO!F32*0.33),IF(COUNTRY_INFO!K32=2,IF(COUNTRY_INFO!F32*0.5>MAX('T1'!M32,'T2'!K32),MAX('T1'!M32,'T2'!K32),COUNTRY_INFO!F32*0.5),IF(COUNTRY_INFO!K32=3,IF(COUNTRY_INFO!F32>MAX('T1'!M32,'T2'!K32),MAX('T1'!M32,'T2'!K32),COUNTRY_INFO!F32),0)))","v":0},{"$f":"IF(AND(COUNTRY_INFO!K32>0,COUNTRY_INFO!K32<4),IF(Z32>0,IF(COUNTRY_INFO!K32=1, AD32/(COUNTRY_INFO!F32*0.33)*100, IF(COUNTRY_INFO!K32=2, AD32/(COUNTRY_INFO!F32*0.5)*100, IF(COUNTRY_INFO!K32=3, AD32/COUNTRY_INFO!F32*100))),\"-\"),0)","v":0},{"$f":"IF(COUNTRY_INFO!K32=2,IF(COUNTRY_INFO!G32*0.2>MAX('T1'!N32,'T2'!L32),MAX('T1'!N32,'T2'!L32),COUNTRY_INFO!G32*0.2),IF(COUNTRY_INFO!K32=3,IF(COUNTRY_INFO!G32>MAX('T1'!N32,'T2'!L32),MAX('T1'!N32,'T2'!L32),COUNTRY_INFO!G32),0))","v":0},{"$f":"IF(AND(COUNTRY_INFO!K32>0,COUNTRY_INFO!K32<4),IF(Z32>0,IF(COUNTRY_INFO!K32=1, 0, IF(COUNTRY_INFO!K32=2, AF32/(COUNTRY_INFO!G32*0.2)*100, IF(COUNTRY_INFO!K32=3, AF32/COUNTRY_INFO!G32*100))),\"-\"),0)","v":0},0,{"$f":"IF(AND(COUNTRY_INFO!K32>0,COUNTRY_INFO!K32<4), IF(AC32/Z32*100<>0, IF(AH32/Z32*100>100,100,AH32/Z32*100), \"-\"),0)","v":"-"},null,{"$f":"IF(AND(D32<>0, D32<>\"Unknown\",D32<>\"Stopped\",D32<>\"Not required\"),D32/COUNTRY_INFO!D32, 0)","v":1},{"$f":"IF(AND(J32<>0,J32<>\"Unknown\",J32<>\"Stopped\",J32<>\"Not required\"),J32/COUNTRY_INFO!D32, 0)","v":0},{"$f":"IF(AND(P32<>0,P32<>\"Unknown\",P32<>\"Not required\"),P32/(COUNTRY_INFO!E32+COUNTRY_INFO!F32), 0)","v":1},{"$f":"IF(AND(Z32<>0,Z32<>\"Unknown\",Z32<>\"Not required\"),IF(COUNTRY_INFO!K32=1,1,IF(COUNTRY_INFO!K32=2,0.5*COUNTRY_INFO!F32/(0.5*COUNTRY_INFO!F32+0.2*COUNTRY_INFO!G32),IF(COUNTRY_INFO!K32=3,COUNTRY_INFO!F32/(COUNTRY_INFO!F32+COUNTRY_INFO!G32)))),0)","v":1},{"$f":"IF(AND(Z32<>0,Z32<>\"Unknown\",Z32<>\"Not required\"),IF(COUNTRY_INFO!K32=1,0,IF(COUNTRY_INFO!K32=2,0.2*COUNTRY_INFO!G32/(0.5*COUNTRY_INFO!F32+0.2*COUNTRY_INFO!G32),IF(COUNTRY_INFO!K32=3,COUNTRY_INFO!G32/(COUNTRY_INFO!F32+COUNTRY_INFO!G32)))),0)","v":0},{"$f":"MAX(COUNTRY_INFO!D32*AK32*PROFILE!$G$7,COUNTRY_INFO!D32*AL32*PROFILE!$G$7)","v":11882.458378167697},{"$f":"MAX(COUNTRY_INFO!D32*AK32*PROFILE!$G$8,COUNTRY_INFO!D32*AL32*PROFILE!$G$8,COUNTRY_INFO!D32*AM32*PROFILE!$G$8)","v":47529.644325650377},{"$f":"MAX(COUNTRY_INFO!D32*AK32*PROFILE!$G$9,COUNTRY_INFO!D32*AL32*PROFILE!$G$9,COUNTRY_INFO!D32*AM32*PROFILE!$G$9,IF(AND(DISTRICT!Z32<>\"Unknown\",Z32<>\"Not required\"),COUNTRY_INFO!O32*DISTRICT!AN32,0))","v":74265.364863548108},{"$f":"MAX(COUNTRY_INFO!D32*AK32*PROFILE!$G$10,COUNTRY_INFO!D32*AL32*PROFILE!$G$10,IF(AND(DISTRICT!Z32<>\"Unknown\",Z32<>\"Not required\"),COUNTRY_INFO!O32*DISTRICT!AO32,0))","v":163383.5324326338},297061,0,{"$f":"MAX('MDA2'!J32,'T1'!L32,'T2'!J32,T3_R1!K32,T3_R2!K32)","v":0},{"$f":"MAX('MDA1'!K32,'MDA2'!K32,'MDA3'!I32,'MDA3'!L32,'T1'!M32,'T2'!K32,T3_R1!L32,T3_R2!L32)","v":93097},{"$f":"MAX('MDA1'!L32,'MDA2'!L32,'MDA3'!J32,'MDA3'!M32,'T1'!N32,'T2'!L32,T3_R1!M32,T3_R2!M32)","v":144682},237779,{"$f":"MAX('MDA2'!J32,T32)","v":0},{"$f":"MAX('MDA1'!K32,'MDA2'!K32,'MDA3'!I32,'MDA3'!L32,V32,AD32)","v":93097},{"$f":"MAX('MDA1'!L32,'MDA2'!L32,'MDA3'!J32,'MDA3'!M32,AF32)","v":144682},237779,80.043829381844134]
[{"$f":"IF(COUNTRY_INFO!A33=0,\" \",COUNTRY_INFO!A33)","v":"Guinea"},{"$f":"IF(COUNTRY_INFO!B33=0,\" \",COUNTRY_INFO!B33)","v":"Labé"},{"$f":"IF(COUNTRY_INFO!C33=0,\" \",COUNTRY_INFO!C33)","v":"Koubia"},{"$f":"COUNTRY_INFO!L33","v":0},null,null,{"$f":"MAX('MDA1'!M33,'MDA2'!M33)","v":0},{"$f":"IF(AND(COUNTRY_INFO!H33>0,COUNTRY_INFO!H33<4),IF(D33>MAX('MDA1'!M33,'MDA2'!M33),MAX('MDA1'!M33,'MDA2'!M33),D33),0)","v":0},{"$f":"IF(AND(COUNTRY_INFO!H33>0,COUNTRY_INFO!H33<4), IF(G33/D33*100<>0, IF(G33/D33*100>100,100,G33/D33*100), \"-\"),0)","v":0},{"$f":"COUNTRY_INFO!M33","v":104626},null,0,{"$f":"MAX('MDA1'!M33,MAX('MDA3'!I33,'MDA3'!L33)+MAX('MDA3'!J33,'MDA3'!M33))","v":69699},{"$f":"IF(AND(COUNTRY_INFO!I33>0,COUNTRY_INFO!I33<4),IF(J33>MAX('MDA1'!M33,MAX('MDA3'!I33,'MDA3'!L33)+MAX('MDA3'!J33,'MDA3'!M33)),MAX('MDA1'!M33,MAX('MDA3'!I33,'MDA3'!L33)+MAX('MDA3'!J33,'MDA3'!M33)),J33),0)","v":69699},{"$f":"IF(AND(COUNTRY_INFO!I33>0,COUNTRY_INFO!I33<4), IF(M33/J33*100<>0, IF(M33/J33*100>100,100,M33/J33*100), \"-\"),0)","v":66.617284422610055},{"$f":"COUNTRY_INFO!N33","v":0},null,null,{"$f":"SUM(MAX('MDA2'!J33, 'T1'!L33, MAX(T3_R1!K33, T3_R2!K33)), MAX('MDA1'!K33, 'MDA2'!K33, 'T1'!M33, MAX(T3_R1!L33, T3_R2!L33)), MAX('MDA1'!L33, 'MDA2'!L33, 'T1'!N33, MAX(T3_R1!M33, T3_R2!M33)))","v":0},{"$f":"IF(AND(COUNTRY_INFO!J33>1,COUNTRY_INFO!J33<4),IF(COUNTRY_INFO!E33>MAX('MDA2'!J33,'T1'!L33,MAX(T3_R1!K33,T3_R2!K33)),MAX('MDA2'!J33,'T1'!L33,MAX(T3_R1!K33,T3_R2!K33)),COUNTRY_INFO!E33),0)","v":0},{"$f":"IF(AND(COUNTRY_INFO!J33>1,COUNTRY_INFO!J33<4), IF(T33/COUNTRY_INFO!E33*100<>0, IF(T33/COUNTRY_INFO!E33*100>100,100,T33/COUNTRY_INFO!E33*100), \"-\"),0)","v":0},{"$f":"IF(AND(COUNTRY_INFO!J33>1,COUNTRY_INFO!J33<4),IF(COUNTRY_INFO!F33>MAX('MDA1'!K33,'MDA2'!K33,'T1'!M33,MAX(T3_R1!L33,T3_R2!L33)),MAX('MDA1'!K33,'MDA2'!K33,'T1'!M33,MAX(T3_R1!L33,T3_R2!L33)),COUNTRY_INFO!F33),0)","v":0},{"$f":"IF(AND(COUNTRY_INFO!J33>1,COUNTRY_INFO!J33<4), IF(V33/COUNTRY_INFO!F33*100<>0, IF(V33/COUNTRY_INFO!F33*100>100,100,V33/COUNTRY_INFO!F33*100), \"-\"),0)","v":0},0,{"$f":"IF(AND(COUNTRY_INFO!J33>1,COUNTRY_INFO!J33<4), IF(S33/P33*100<>0, IF(X33/P33*100>100,100,X33/P33*100), \"-\"),0)","v":0},{"$f":"COUNTRY_INFO!O33","v":24587.300000000003},null,null,{"$f":"MAX(SUM('T1'!L33:'T1'!N33),SUM('T2'!J33:'T2'!L33))","v":25870},{"$f":"IF(COUNTRY_INFO!K33=1,IF(COUNTRY_INFO!F33*0.33>MAX('T1'!M33,'T2'!K33),MAX('T1'!M33,'T2'!K33),COUNTRY_INFO!F33*0.33),IF(COUNTRY_INFO!K33=2,IF(COUNTRY_INFO!F33*0.5>MAX('T1'!M33,'T2'!K33),MAX('T1'!M33,'T2'!K33),COUNTRY_INFO!F33*0.5),IF(COUNTRY_INFO!K33=3,IF(COUNTRY_INFO!F33>MAX('T1'!M33,'T2'!K33),MAX('T1'!M33,'T2'!K33),COUNTRY_INFO!F33),0)))","v":13078.5},{"$f":"IF(AND(COUNTRY_INFO!K33>0,COUNTRY_INFO!K33<4),IF(Z33>0,IF(COUNTRY_INFO!K33=1, AD33/(COUNTRY_INFO!F33*0.33)*100, IF(COUNTRY_INFO!K33=2, AD33/(COUNTRY_INFO!F33*0.5)*100, IF(COUNTRY_INFO!K33=3, AD33/COUNTRY_INFO!F33*100))),\"-\"),0)","v":100},{"$f":"IF(COUNTRY_INFO!K33=2,IF(COUNTRY_INFO!G33*0.2>MAX('T1'!N33,'T2'!L33),MAX('T1'!N33,'T2'!L33),COUNTRY_INFO!G33*0.2),IF(COUNTRY_INFO!K33=3,IF(COUNTRY_INFO!G33>MAX('T1'!N33,'T2'!L33),MAX('T1'!N33,'T2'!L33),COUNTRY_INFO!G33),0))","v":0},{"$f":"IF(AND(COUNTRY_INFO!K33>0,COUNTRY_INFO!K33<4),IF(Z33>0,IF(COUNTRY_INFO!K33=1, 0, IF(COUNTRY_INFO!K33=2, AF33/(COUNTRY_INFO!G33*0.2)*100, IF(COUNTRY_INFO!K33=3, AF33/COUNTRY_INFO!G33*100))),\"-\"),0)","v":0},13078.5,{"$f":"IF(AND(COUNTRY_INFO!K33>0,COUNTRY_INFO!K33<4), IF(AC33/Z33*100<>0, IF(AH33/Z33*100>100,100,AH33/Z33*100), \"-\"),0)","v":53.192095106010008},null,{"$f":"IF(AND(D33<>0, D33<>\"Unknown\",D33<>\"Stopped\",D33<>\"Not required\"),D33/COUNTRY_INFO!D33, 0)","v":0},{"$f":"IF(AND(J33<>0,J33<>\"Unknown\",J33<>\"Stopped\",J33<>\"Not required\"),J33/COUNTRY_INFO!D33, 0)","v":1},{"$f":"IF(AND(P33<>0,P33<>\"Unknown\",P33<>\"Not required\"),P33/(COUNTRY_INFO!E33+COUNTRY_INFO!F33), 0)","v":0},{"$f":"IF(AND(Z33<>0,Z33<>\"Unknown\",Z33<>\"Not required\"),IF(COUNTRY_INFO!K33=1,1,IF(COUNTRY_INFO!K33=2,0.5*COUNTRY_INFO!F33/(0.5*COUNTRY_INFO!F33+0.2*COUNTRY_INFO!G33),IF(COUNTRY_INFO!K33=3,COUNTRY_INFO!F33/(COUNTRY_INFO!F33+COUNTRY_INFO!G33)))),0)","v":0.53192095106010007},{"$f":"IF(AND(Z33<>0,Z33<>\"Unknown\",Z33<>\"Not required\"),IF(COUNTRY_INFO!K33=1,0,IF(COUNTRY_INFO!K33=2,0.2*COUNTRY_INFO!G33/(0.5*COUNTRY_INFO!F33+0.2*COUNTRY_INFO!G33),IF(COUNTRY_INFO!K33=3,COUNTRY_INFO!G33/(COUNTRY_INFO!F33+COUNTRY_INFO!G33)))),0)","v":0.46807904893989988},{"$f":"MAX(COUNTRY_INFO!D33*AK33*PROFILE!$G$7,COUNTRY_INFO!D33*AL33*PROFILE!$G$7)","v":4185.0464728596935},{"$f":"MAX(COUNTRY_INFO!D33*AK33*PROFILE!$G$8,COUNTRY_INFO!D33*AL33*PROFILE!$G$8,COUNTRY_INFO!D33*AM33*PROFILE!$G$8)","v":16740.119259059575},{"$f":"MAX(COUNTRY_INFO!D33*AK33*PROFILE!$G$9,COUNTRY_INFO!D33*AL33*PROFILE!$G$9,COUNTRY_INFO!D33*AM33*PROFILE!$G$9,IF(AND(DISTRICT!Z33<>\"Unknown\",Z33<>\"Not required\"),COUNTRY_INFO!O33*DISTRICT!AN33,0))","v":26156.540455373084},{"$f":"MAX(COUNTRY_INFO!D33*AK33*PROFILE!$G$10,COUNTRY_INFO!D33*AL33*PROFILE!$G$10,IF(AND(DISTRICT!Z33<>\"Unknown\",Z33<>\"Not required\"),COUNTRY_INFO!O33*DISTRICT!AO33,0))","v":57544.293812707641},104626,"Y",{"$f":"MAX('MDA2'!J33,'T1'!L33,'T2'!J33,T3_R1!K33,T3_R2!K33)","v":0},{"$f":"MAX('MDA1'!K33,'MDA2'!K33,'MDA3'!I33,'MDA3'!L33,'T1'!M33,'T2'!K33,T3_R1!L33,T3_R2!L33)","v":25870},{"$f":"MAX('MDA1'!L33,'MDA2'!L33,'MDA3'!J33,'MDA3'!M33,'T1'!N33,'T2'!L33,T3_R1!M33,T3_R2!M33)","v":52274},78144,{"$f":"MAX('MDA2'!J33,T33)","v":0},{"$f":"MAX('MDA1'!K33,'MDA2'!K33,'MDA3'!I33,'MDA3'!L33,V33,AD33)","v":17425},{"$f":"MAX('MDA1'!L33,'MDA2'!L33,'MDA3'!J33,'MDA3'!M33,AF33)","v":52274},69699,66.617284422610055]
[{"$f":"IF(COUNTRY_INFO!A34=0,\" \",COUNTRY_INFO!A34)","v":"Guinea"},{"$f":"IF(COUNTRY_INFO!B34=0,\" \",COUNTRY_INFO!B34)","v":"Labé"},{"$f":"IF(COUNTRY_INFO!C34=0,\" \",COUNTRY_INFO!C34)","v":"Labé"},{"$f":"COUNTRY_INFO!L34","v":0},null,null,{"$f":"MAX('MDA1'!M34,'MDA2'!M34)","v":0},{"$f":"IF(AND(COUNTRY_INFO!H34>0,COUNTRY_INFO!H34<4),IF(D34>MAX('MDA1'!M34,'MDA2'!M34),MAX('MDA1'!M34,'MDA2'!M34),D34),0)","v":0},{"$f":"IF(AND(COUNTRY_INFO!H34>0,COUNTRY_INFO!H34<4), IF(G34/D34*100<>0, IF(G34/D34*100>100,100,G34/D34*100), \"-\"),0)","v":0},{"$f":"COUNTRY_INFO!M34","v":0},null,0,{"$f":"MAX('MDA1'!M34,MAX('MDA3'!I34,'MDA3'!L34)+MAX('MDA3'!J34,'MDA3'!M34))","v":0},{"$f":"IF(AND(COUNTRY_INFO!I34>0,COUNTRY_INFO!I34<4),IF(J34>MAX('MDA1'!M34,MAX('MDA3'!I34,'MDA3'!L34)+MAX('MDA3'!J34,'MDA3'!M34)),MAX('MDA1'!M34,MAX('MDA3'!I34,'MDA3'!L34)+MAX('MDA3'!J34,'MDA3'!M34)),J34),0)","v":0},{"$f":"IF(AND(COUNTRY_INFO!I34>0,COUNTRY_INFO!I34<4), IF(M34/J34*100<>0, IF(M34/J34*100>100,100,M34/J34*100), \"-\"),0)","v":0},{"$f":"COUNTRY_INFO!N34","v":0},null,null,{"$f":"SUM(MAX('MDA2'!J34, 'T1'!L34, MAX(T3_R1!K34, T3_R2!K34)), MAX('MDA1'!K34, 'MDA2'!K34, 'T1'!M34, MAX(T3_R1!L34, T3_R2!L34)), MAX('MDA1'!L34, 'MDA2'!L34, 'T1'!N34, MAX(T3_R1!M34, T3_R2!M34)))","v":0},{"$f":"IF(AND(COUNTRY_INFO!J34>1,COUNTRY_INFO!J34<4),IF(COUNTRY_INFO!E34>MAX('MDA2'!J34,'T1'!L34,MAX(T3_R1!K34,T3_R2!K34)),MAX('MDA2'!J34,'T1'!L34,MAX(T3_R1!K34,T3_R2!K34)),COUNTRY_INFO!E34),0)","v":0},{"$f":"IF(AND(COUNTRY_INFO!J34>1,COUNTRY_INFO!J34<4), IF(T34/COUNTRY_INFO!E34*100<>0, IF(T34/COUNTRY_INFO!E34*100>100,100,T34/COUNTRY_INFO!E34*100), \"-\"),0)","v":0},{"$f":"IF(AND(COUNTRY_INFO!J34>1,COUNTRY_INFO!J34<4),IF(COUNTRY_INFO!F34>MAX('MDA1'!K34,'MDA2'!K34,'T1'!M34,MAX(T3_R1!L34,T3_R2!L34)),MAX('MDA1'!K34,'MDA2'!K34,'T1'!M34,MAX(T3_R1!L34,T3_R2!L34)),COUNTRY_INFO!F34),0)","v":0},{"$f":"IF(AND(COUNTRY_INFO!J34>1,COUNTRY_INFO!J34<4), IF(V34/COUNTRY_INFO!F34*100<>0, IF(V34/COUNTRY_INFO!F34*100>100,100,V34/COUNTRY_INFO!F34*100), \"-\"),0)","v":0},0,{"$f":"IF(AND(COUNTRY_INFO!J34>1,COUNTRY_INFO!J34<4), IF(S34/P34*100<>0, IF(X34/P34*100>100,100,X34/P34*100), \"-\"),0)","v":0},{"$f":"COUNTRY_INFO!O34","v":27483.06},null,null,{"$f":"MAX(SUM('T1'!L34:'T1'!N34),SUM('T2'!J34:'T2'!L34))","v":0},{"$f":"IF(COUNTRY_INFO!K34=1,IF(COUNTRY_INFO!F34*0.33>MAX('T1'!M34,'T2'!K34),MAX('T1'!M34,'T2'!K34),COUNTRY_INFO!F34*0.33),IF(COUNTRY_INFO!K34=2,IF(COUNTRY_INFO!F34*0.5>MAX('T1'!M34,'T2'!K34),MAX('T1'!M34,'T2'!K34),COUNTRY_INFO!F34*0.5),IF(COUNTRY_INFO!K34=3,IF(COUNTRY_INFO!F34>MAX('T1'!M34,'T2'!K34),MAX('T1'!M34,'T2'!K34),COUNTRY_INFO!F34),0)))","v":0},{"$f":"IF(AND(COUNTRY_INFO!K34>0,COUNTRY_INFO!K34<4),IF(Z34>0,IF(COUNTRY_INFO!K34=1, AD34/(COUNTRY_INFO!F34*0.33)*100, IF(COUNTRY_INFO!K34=2, AD34/(COUNTRY_INFO!F34*0.5)*100, IF(COUNTRY_INFO!K34=3, AD34/COUNTRY_INFO!F34*100))),\"-\"),0)","v":0},{"$f":"IF(COUNTRY_INFO!K34=2,IF(COUNTRY_INFO!G34*0.2>MAX('T1'!N34,'T2'!L34),MAX('T1'!N34,'T2'!L34),COUNTRY_INFO!G34*0.2),IF(COUNTRY_INFO!K34=3,IF(COUNTRY_INFO!G34>MAX('T1'!N34,'T2'!L34),MAX('T1'!N34,'T2'!L34),COUNTRY_INFO!G34),0))","v":0},{"$f":"IF(AND(COUNTRY_INFO!K34>0,COUNTRY_INFO!K34<4),IF(Z34>0,IF(COUNTRY_INFO!K34=1, 0, IF(COUNTRY_INFO!K34=2, AF34/(COUNTRY_INFO!G34*0.2)*100, IF(COUNTRY_INFO!K34=3, AF34/COUNTRY_INFO!G34*100))),\"-\"),0)","v":0},0,{"$f":"IF(AND(COUNTRY_INFO!K34>0,COUNTRY_INFO!K34<4), IF(AC34/Z34*100<>0, IF(AH34/Z34*100>100,100,AH34/Z34*100), \"-\"),0)","v":"-"},null,{"$f":"IF(AND(D34<>0, D34<>\"Unknown\",D34<>\"Stopped\",D34<>\"Not required\"),D34/COUNTRY_INFO!D34, 0)","v":0},{"$f":"IF(AND(J34<>0,J34<>\"Unknown\",J34<>\"Stopped\",J34<>\"Not required\"),J34/COUNTRY_INFO!D34, 0)","v":0},{"$f":"IF(AND(P34<>0,P34<>\"Unknown\",P34<>\"Not required\"),P34/(COUNTRY_INFO!E34+COUNTRY_INFO!F34), 0)","v":0},{"$f":"IF(AND(Z34<>0,Z34<>\"Unknown\",Z34<>\"Not required\"),IF(COUNTRY_INFO!K34=1,1,IF(COUNTRY_INFO!K34=2,0.5*COUNTRY_INFO!F34/(0.5*COUNTRY_INFO!F34+0.2*COUNTRY_INFO!G34),IF(COUNTRY_INFO!K34=3,COUNTRY_INFO!F34/(COUNTRY_INFO!F34+COUNTRY_INFO!G34)))),0)","v":1},{"$f":"IF(AND(Z34<>0,Z34<>\"Unknown\",Z34<>\"Not required\"),IF(COUNTRY_INFO!K34=1,0,IF(COUNTRY_INFO!K34=2,0.2*COUNTRY_INFO!G34/(0.5*COUNTRY_INFO!F34+0.2*COUNTRY_INFO!G34),IF(COUNTRY_INFO!K34=3,COUNTRY_INFO!G34/(COUNTRY_INFO!F34+COUNTRY_INFO!G34)))),0)","v":0},{"$f":"MAX(COUNTRY_INFO!D34*AK34*PROFILE!$G$7,COUNTRY_INFO!D34*AL34*PROFILE!$G$7)","v":0},{"$f":"MAX(COUNTRY_INFO!D34*AK34*PROFILE!$G$8,COUNTRY_INFO!D34*AL34*PROFILE!$G$8,COUNTRY_INFO!D34*AM34*PROFILE!$G$8)","v":0},{"$f":"MAX(COUNTRY_INFO!D34*AK34*PROFILE!$G$9,COUNTRY_INFO!D34*AL34*PROFILE!$G$9,COUNTRY_INFO!D34*AM34*PROFILE!$G$9,IF(AND(DISTRICT!Z34<>\"Unknown\",Z34<>\"Not required\"),COUNTRY_INFO!O34*DISTRICT!AN34,0))","v":27483.06},{"$f":"MAX(COUNTRY_INFO!D34*AK34*PROFILE!$G$10,COUNTRY_INFO!D34*AL34*PROFILE!$G$10,IF(AND(DISTRICT!Z34<>\"Unknown\",Z34<>\"Not required\"),COUNTRY_INFO!O34*DISTRICT!AO34,0))","v":0},27483.06,0,{"$f":"MAX('MDA2'!J34,'T1'!L34,'T2'!J34,T3_R1!K34,T3_R2!K34)","v":0},{"$f":"MAX('MDA1'!K34,'MDA2'!K34,'MDA3'!I34,'MDA3'!L34,'T1'!M34,'T2'!K34,T3_R1!L34,T3_R2!L34)","v":0},{"$f":"MAX('MDA1'!L34,'MDA2'!L34,'MDA3'!J34,'MDA3'!M34,'T1'!N34,'T2'!L34,T3_R1!M34,T3_R2!M34)","v":0},0,{"$f":"MAX('MDA2'!J34,T34)","v":0},{"$f":"MAX('MDA1'!K34,'MDA2'!K34,'MDA3'!I34,'MDA3'!L34,V34,AD34)","v":0},{"$f":"MAX('MDA1'!L34,'MDA2'!L34,'MDA3'!J34,'MDA3'!M34,AF34)","v":0},0,0]
[{"$f":"IF(COUNTRY_INFO!A35=0,\" \",COUNTRY_INFO!A35)","v":"Guinea"},{"$f":"IF(COUNTRY_INFO!B35=0,\" \",COUNTRY_INFO!B35)","v":"Labé"},{"$f":"IF(COUNTRY_INFO!C35=0,\" \",COUNTRY_INFO!C35)","v":"Lelouma"},{"$f":"COUNTRY_INFO!L35","v":170323},null,null,{"$f":"MAX('MDA1'!M35,'MDA2'!M35)","v":125499},{"$f":"IF(AND(COUNTRY_INFO!H35>0,COUNTRY_INFO!H35<4),IF(D35>MAX('MDA1'!M35,'MDA2'!M35),MAX('MDA1'!M35,'MDA2'!M35),D35),0)","v":125499},{"$f":"IF(AND(COUNTRY_INFO!H35>0,COUNTRY_INFO!H35<4), IF(G35/D35*100<>0, IF(G35/D35*100>100,100,G35/D35*100), \"-\"),0)","v":73.682943583661626},{"$f":"COUNTRY_INFO!M35","v":170323},null,0,{"$f":"MAX('MDA1'!M35,MAX('MDA3'!I35,'MDA3'!L35)+MAX('MDA3'!J35,'MDA3'!M35))","v":125499},{"$f":"IF(AND(COUNTRY_INFO!I35>0,COUNTRY_INFO!I35<4),IF(J35>MAX('MDA1'!M35,MAX('MDA3'!I35,'MDA3'!L35)+MAX('MDA3'!J35,'MDA3'!M35)),MAX('MDA1'!M35,MAX('MDA3'!I35,'MDA3'!L35)+MAX('MDA3'!J35,'MDA3'!M35)),J35),0)","v":125499},{"$f":"IF(AND(COUNTRY_INFO!I35>0,COUNTRY_INFO!I35<4), IF(M35/J35*100<>0, IF(M35/J35*100>100,100,M35/J35*100), \"-\"),0)","v":73.682943583661626},{"$f":"COUNTRY_INFO!N35","v":69833},null,null,{"$f":"SUM(MAX('MDA2'!J35, 'T1'!L35, MAX(T3_R1!K35, T3_R2!K35)), MAX('MDA1'!K35, 'MDA2'!K35, 'T1'!M35, MAX(T3_R1!L35, T3_R2!L35)), MAX('MDA1'!L35, 'MDA2'!L35, 'T1'!N35, MAX(T3_R1!M35, T3_R2!M35)))","v":125499},{"$f":"IF(AND(COUNTRY_INFO!J35>1,COUNTRY_INFO!J35<4),IF(COUNTRY_INFO!E35>MAX('MDA2'!J35,'T1'!L35,MAX(T3_R1!K35,T3_R2!K35)),MAX('MDA2'!J35,'T1'!L35,MAX(T3_R1!K35,T3_R2!K35)),COUNTRY_INFO!E35),0)","v":0},{"$f":"IF(AND(COUNTRY_INFO!J35>1,COUNTRY_INFO!J35<4), IF(T35/COUNTRY_INFO!E35*100<>0, IF(T35/COUNTRY_INFO!E35*100>100,100,T35/COUNTRY_INFO!E35*100), \"-\"),0)","v":"-"},{"$f":"IF(AND(COUNTRY_INFO!J35>1,COUNTRY_INFO!J35<4),IF(COUNTRY_INFO!F35>MAX('MDA1'!K35,'MDA2'!K35,'T1'!M35,MAX(T3_R1!L35,T3_R2!L35)),MAX('MDA1'!K35,'MDA2'!K35,'T1'!M35,MAX(T3_R1!L35,T3_R2!L35)),COUNTRY_INFO!F35),0)","v":42581},{"$f":"IF(AND(COUNTRY_INFO!J35>1,COUNTRY_INFO!J35<4), IF(V35/COUNTRY_INFO!F35*100<>0, IF(V35/COUNTRY_INFO!F35*100>100,100,V35/COUNTRY_INFO!F35*100), \"-\"),0)","v":100},42581,{"$f":"IF(AND(COUNTRY_INFO!J35>1,COUNTRY_INFO!J35<4), IF(S35/P35*100<>0, IF(X35/P35*100>100,100,X35/P35*100), \"-\"),0)","v":60.97547004997638},{"$f":"COUNTRY_INFO!O35","v":136259},null,null,{"$f":"MAX(SUM('T1'!L35:'T1'!N35),SUM('T2'!J35:'T2'!L35))","v":42850},{"$f":"IF(COUNTRY_INFO!K35=1,IF(COUNTRY_INFO!F35*0.33>MAX('T1'!M35,'T2'!K35),MAX('T1'!M35,'T2'!K35),COUNTRY_INFO!F35*0.33),IF(COUNTRY_INFO!K35=2,IF(COUNTRY_INFO!F35*0.5>MAX('T1'!M35,'T2'!K35),MAX('T1'!M35,'T2'!K35),COUNTRY_INFO!F35*0.5),IF(COUNTRY_INFO!K35=3,IF(COUNTRY_INFO!F35>MAX('T1'!M35,'T2'!K35),MAX('T1'!M35,'T2'!K35),COUNTRY_INFO!F35),0)))","v":42581},{"$f":"IF(AND(COUNTRY_INFO!K35>0,COUNTRY_INFO!K35<4),IF(Z35>0,IF(COUNTRY_INFO!K35=1, AD35/(COUNTRY_INFO!F35*0.33)*100, IF(COUNTRY_INFO!K35=2, AD35/(COUNTRY_INFO!F35*0.5)*100, IF(COUNTRY_INFO!K35=3, AD35/COUNTRY_INFO!F35*100))),\"-\"),0)","v":100},{"$f":"IF(COUNTRY_INFO!K35=2,IF(COUNTRY_INFO!G35*0.2>MAX('T1'!N35,'T2'!L35),MAX('T1'!N35,'T2'!L35),COUNTRY_INFO!G35*0.2),IF(COUNTRY_INFO!K35=3,IF(COUNTRY_INFO!G35>MAX('T1'!N35,'T2'!L35),MAX('T1'!N35,'T2'!L35),COUNTRY_INFO!G35),0))","v":0},{"$f":"IF(AND(COUNTRY_INFO!K35>0,COUNTRY_INFO!K35<4),IF(Z35>0,IF(COUNTRY_INFO!K35=1, 0, IF(COUNTRY_INFO!K35=2, AF35/(COUNTRY_INFO!G35*0.2)*100, IF(COUNTRY_INFO!K35=3, AF35/COUNTRY_INFO!G35*100))),\"-\"),0)","v":0},42581,{"$f":"IF(AND(COUNTRY_INFO!K35>0,COUNTRY_INFO!K35<4), IF(AC35/Z35*100<>0, IF(AH35/Z35*100>100,100,AH35/Z35*100), \"-\"),0)","v":31.250045868529785},null,{"$f":"IF(AND(D35<>0, D35<>\"Unknown\",D35<>\"Stopped\",D35<>\"Not required\"),D35/COUNTRY_INFO!D35, 0)","v":1},{"$f":"IF(AND(J35<>0,J35<>\"Unknown\",J35<>\"Stopped\",J35<>\"Not required\"),J35/COUNTRY_INFO!D35, 0)","v":1},{"$f":"IF(AND(P35<>0,P35<>\"Unknown\",P35<>\"Not required\"),P35/(COUNTRY_INFO!E35+COUNTRY_INFO!F35), 0)","v":1},{"$f":"IF(AND(Z35<>0,Z35<>\"Unknown\",Z35<>\"Not required\"),IF(COUNTRY_INFO!K35=1,1,IF(COUNTRY_INFO!K35=2,0.5*COUNTRY_INFO!F35/(0.5*COUNTRY_INFO!F35+0.2*COUNTRY_INFO!G35),IF(COUNTRY_INFO!K35=3,COUNTRY_INFO!F35/(COUNTRY_INFO!F35+COUNTRY_INFO!G35)))),0)","v":0.31250045868529785},{"$f":"IF(AND(Z35<>0,Z35<>\"Unknown\",Z35<>\"Not required\"),IF(COUNTRY_INFO!K35=1,0,IF(COUNTRY_INFO!K35=2,0.2*COUNTRY_INFO!G35/(0.5*COUNTRY_INFO!F35+0.2*COUNTRY_INFO!G35),IF(COUNTRY_INFO!K35=3,COUNTRY_INFO!G35/(COUNTRY_INFO!F35+COUNTRY_INFO!G35)))),0)","v":0.68749954131470215},{"$f":"MAX(COUNTRY_INFO!D35*AK35*PROFILE!$G$7,COUNTRY_INFO!D35*AL35*PROFILE!$G$7)","v":6812.930537312729},{"$f":"MAX(COUNTRY_INFO!D35*AK35*PROFILE!$G$8,COUNTRY_INFO!D35*AL35*PROFILE!$G$8,COUNTRY_INFO!D35*AM35*PROFILE!$G$8)","v":27251.613676913999},{"$f":"MAX(COUNTRY_INFO!D35*AK35*PROFILE!$G$9,COUNTRY_INFO!D35*AL35*PROFILE!$G$9,COUNTRY_INFO!D35*AM35*PROFILE!$G$9,IF(AND(DISTRICT!Z35<>\"Unknown\",Z35<>\"Not required\"),COUNTRY_INFO!O35*DISTRICT!AN35,0))","v":42581},{"$f":"MAX(COUNTRY_INFO!D35*AK35*PROFILE!$G$10,COUNTRY_INFO!D35*AL35*PROFILE!$G$10,IF(AND(DISTRICT!Z35<>\"Unknown\",Z35<>\"Not required\"),COUNTRY_INFO!O35*DISTRICT!AO35,0))","v":93678},170323.54421422671,"Y",{"$f":"MAX('MDA2'!J35,'T1'!L35,'T2'!J35,T3_R1!K35,T3_R2!K35)","v":0},{"$f":"MAX('MDA1'!K35,'MDA2'!K35,'MDA3'!I35,'MDA3'!L35,'T1'!M35,'T2'!K35,T3_R1!L35,T3_R2!L35)","v":55509},{"$f":"MAX('MDA1'!L35,'MDA2'!L35,'MDA3'!J35,'MDA3'!M35,'T1'!N35,'T2'!L35,T3_R1!M35,T3_R2!M35)","v":69990},125499,{"$f":"MAX('MDA2'!J35,T35)","v":0},{"$f":"MAX('MDA1'!K35,'MDA2'!K35,'MDA3'!I35,'MDA3'!L35,V35,AD35)","v":55509},{"$f":"MAX('MDA1'!L35,'MDA2'!L35,'MDA3'!J35,'MDA3'!M35,AF35)","v":69990},125499,73.682708153461135]
[{"$f":"IF(COUNTRY_INFO!A36=0,\" \",COUNTRY_INFO!A36)","v":"Guinea"},{"$f":"IF(COUNTRY_INFO!B36=0,\" \",COUNTRY_INFO!B36)","v":"Labé"},{"$f":"IF(COUNTRY_INFO!C36=0,\" \",COUNTRY_INFO!C36)","v":"Mali"},{"$f":"COUNTRY_INFO!L36","v":300812},null,null,{"$f":"MAX('MDA1'!M36,'MDA2'!M36)","v":237118},{"$f":"IF(AND(COUNTRY_INFO!H36>0,COUNTRY_INFO!H36<4),IF(D36>MAX('MDA1'!M36,'MDA2'!M36),MAX('MDA1'!M36,'MDA2'!M36),D36),0)","v":237118},{"$f":"IF(AND(COUNTRY_INFO!H36>0,COUNTRY_INFO!H36<4), IF(G36/D36*100<>0, IF(G36/D36*100>100,100,G36/D36*100), \"-\"),0)","v":78.825977687060359},{"$f":"COUNTRY_INFO!M36","v":300812},null,0,{"$f":"MAX('MDA1'!M36,MAX('MDA3'!I36,'MDA3'!L36)+MAX('MDA3'!J36,'MDA3'!M36))","v":237118},{"$f":"IF(AND(COUNTRY_INFO!I36>0,COUNTRY_INFO!I36<4),IF(J36>MAX('MDA1'!M36,MAX('MDA3'!I36,'MDA3'!L36)+MAX('MDA3'!J36,'MDA3'!M36)),MAX('MDA1'!M36,MAX('MDA3'!I36,'MDA3'!L36)+MAX('MDA3'!J36,'MDA3'!M36)),J36),0)","v":237118},{"$f":"IF(AND(COUNTRY_INFO!I36>0,COUNTRY_INFO!I36<4), IF(M36/J36*100<>0, IF(M36/J36*100>100,100,M36/J36*100), \"-\"),0)","v":78.825977687060359},{"$f":"COUNTRY_INFO!N36","v":0},null,null,{"$f":"SUM(MAX('MDA2'!J36, 'T1'!L36, MAX(T3_R1!K36, T3_R2!K36)), MAX('MDA1'!K36, 'MDA2'!K36, 'T1'!M36, MAX(T3_R1!L36, T3_R2!L36)), MAX('MDA1'!L36, 'MDA2'!L36, 'T1'!N36, MAX(T3_R1!M36, T3_R2!M36)))","v":237118},{"$f":"IF(AND(COUNTRY_INFO!J36>1,COUNTRY_INFO!J36<4),IF(COUNTRY_INFO!E36>MAX('MDA2'!J36,'T1'!L36,MAX(T3_R1!K36,T3_R2!K36)),MAX('MDA2'!J36,'T1'!L36,MAX(T3_R1!K36,T3_R2!K36)),COUNTRY_INFO!E36),0)","v":0},{"$f":"IF(AND(COUNTRY_INFO!J36>1,COUNTRY_INFO!J36<4), IF(T36/COUNTRY_INFO!E36*100<>0, IF(T36/COUNTRY_INFO!E36*100>100,100,T36/COUNTRY_INFO!E36*100), \"-\"),0)","v":0},{"$f":"IF(AND(COUNTRY_INFO!J36>1,COUNTRY_INFO!J36<4),IF(COUNTRY_INFO!F36>MAX('MDA1'!K36,'MDA2'!K36,'T1'!M36,MAX(T3_R1!L36,T3_R2!L36)),MAX('MDA1'!K36,'MDA2'!K36,'T1'!M36,MAX(T3_R1!L36,T3_R2!L36)),COUNTRY_INFO!F36),0)","v":0},{"$f":"IF(AND(COUNTRY_INFO!J36>1,COUNTRY_INFO!J36<4), IF(V36/COUNTRY_INFO!F36*100<>0, IF(V36/COUNTRY_INFO!F36*100>100,100,V36/COUNTRY_INFO!F36*100), \"-\"),0)","v":0},0,{"$f":"IF(AND(COUNTRY_INFO!J36>1,COUNTRY_INFO!J36<4), IF(S36/P36*100<>0, IF(X36/P36*100>100,100,X36/P36*100), \"-\"),0)","v":0},{"$f":"COUNTRY_INFO!O36","v":24816.99},null,null,{"$f":"MAX(SUM('T1'!L36:'T1'!N36),SUM('T2'!J36:'T2'!L36))","v":0},{"$f":"IF(COUNTRY_INFO!K36=1,IF(COUNTRY_INFO!F36*0.33>MAX('T1'!M36,'T2'!K36),MAX('T1'!M36,'T2'!K36),COUNTRY_INFO!F36*0.33),IF(COUNTRY_INFO!K36=2,IF(COUNTRY_INFO!F36*0.5>MAX('T1'!M36,'T2'!K36),MAX('T1'!M36,'T2'!K36),COUNTRY_INFO!F36*0.5),IF(COUNTRY_INFO!K36=3,IF(COUNTRY_INFO!F36>MAX('T1'!M36,'T2'!K36),MAX('T1'!M36,'T2'!K36),COUNTRY_INFO!F36),0)))","v":0},{"$f":"IF(AND(COUNTRY_INFO!K36>0,COUNTRY_INFO!K36<4),IF(Z36>0,IF(COUNTRY_INFO!K36=1, AD36/(COUNTRY_INFO!F36*0.33)*100, IF(COUNTRY_INFO!K36=2, AD36/(COUNTRY_INFO!F36*0.5)*100, IF(COUNTRY_INFO!K36=3, AD36/COUNTRY_INFO!F36*100))),\"-\"),0)","v":0},{"$f":"IF(COUNTRY_INFO!K36=2,IF(COUNTRY_INFO!G36*0.2>MAX('T1'!N36,'T2'!L36),MAX('T1'!N36,'T2'!L36),COUNTRY_INFO!G36*0.2),IF(COUNTRY_INFO!K36=3,IF(COUNTRY_INFO!G36>MAX('T1'!N36,'T2'!L36),MAX('T1'!N36,'T2'!L36),COUNTRY_INFO!G36),0))","v":0},{"$f":"IF(AND(COUNTRY_INFO!K36>0,COUNTRY_INFO!K36<4),IF(Z36>0,IF(COUNTRY_INFO!K36=1, 0, IF(COUNTRY_INFO!K36=2, AF36/(COUNTRY_INFO!G36*0.2)*100, IF(COUNTRY_INFO!K36=3, AF36/COUNTRY_INFO!G36*100))),\"-\"),0)","v":0},0,{"$f":"IF(AND(COUNTRY_INFO!K36>0,COUNTRY_INFO!K36<4), IF(AC36/Z36*100<>0, IF(AH36/Z36*100>100,100,AH36/Z36*100), \"-\"),0)","v":"-"},null,{"$f":"IF(AND(D36<>0, D36<>\"Unknown\",D36<>\"Stopped\",D36<>\"Not required\"),D36/COUNTRY_INFO!D36, 0)","v":1},{"$f":"IF(AND(J36<>0,J36<>\"Unknown\",J36<>\"Stopped\",J36<>\"Not required\"),J36/COUNTRY_INFO!D36, 0)","v":1},{"$f":"IF(AND(P36<>0,P36<>\"Unknown\",P36<>\"Not required\"),P36/(COUNTRY_INFO!E36+COUNTRY_INFO!F36), 0)","v":0},{"$f":"IF(AND(Z36<>0,Z36<>\"Unknown\",Z36<>\"Not required\"),IF(COUNTRY_INFO!K36=1,1,IF(COUNTRY_INFO!K36=2,0.5*COUNTRY_INFO!F36/(0.5*COUNTRY_INFO!F36+0.2*COUNTRY_INFO!G36),IF(COUNTRY_INFO!K36=3,COUNTRY_INFO!F36/(COUNTRY_INFO!F36+COUNTRY_INFO!G36)))),0)","v":1},{"$f":"IF(AND(Z36<>0,Z36<>\"Unknown\",Z36<>\"Not required\"),IF(COUNTRY_INFO!K36=1,0,IF(COUNTRY_INFO!K36=2,0.2*COUNTRY_INFO!G36/(0.5*COUNTRY_INFO!F36+0.2*COUNTRY_INFO!G36),IF(COUNTRY_INFO!K36=3,COUNTRY_INFO!G36/(COUNTRY_INFO!F36+COUNTRY_INFO!G36)))),0)","v":0},{"$f":"MAX(COUNTRY_INFO!D36*AK36*PROFILE!$G$7,COUNTRY_INFO!D36*AL36*PROFILE!$G$7)","v":12032.498610229486},{"$f":"MAX(COUNTRY_INFO!D36*AK36*PROFILE!$G$8,COUNTRY_INFO!D36*AL36*PROFILE!$G$8,COUNTRY_INFO!D36*AM36*PROFILE!$G$8)","v":48129.802865026177},{"$f":"MAX(COUNTRY_INFO!D36*AK36*PROFILE!$G$9,COUNTRY_INFO!D36*AL36*PROFILE!$G$9,COUNTRY_INFO!D36*AM36*PROFILE!$G$9,IF(AND(DISTRICT!Z36<>\"Unknown\",Z36<>\"Not required\"),COUNTRY_INFO!O36*DISTRICT!AN36,0))","v":75203.116313934283},{"$f":"MAX(COUNTRY_INFO!D36*AK36*PROFILE!$G$10,COUNTRY_INFO!D36*AL36*PROFILE!$G$10,IF(AND(DISTRICT!Z36<>\"Unknown\",Z36<>\"Not required\"),COUNTRY_INFO!O36*DISTRICT!AO36,0))","v":165446.58221081004},300812,0,{"$f":"MAX('MDA2'!J36,'T1'!L36,'T2'!J36,T3_R1!K36,T3_R2!K36)","v":0},{"$f":"MAX('MDA1'!K36,'MDA2'!K36,'MDA3'!I36,'MDA3'!L36,'T1'!M36,'T2'!K36,T3_R1!L36,T3_R2!L36)","v":83411},{"$f":"MAX('MDA1'!L36,'MDA2'!L36,'MDA3'!J36,'MDA3'!M36,'T1'!N36,'T2'!L36,T3_R1!M36,T3_R2!M36)","v":153707},237118,{"$f":"MAX('MDA2'!J36,T36)","v":0},{"$f":"MAX('MDA1'!K36,'MDA2'!K36,'MDA3'!I36,'MDA3'!L36,V36,AD36)","v":83411},{"$f":"MAX('MDA1'!L36,'MDA2'!L36,'MDA3'!J36,'MDA3'!M36,AF36)","v":153707},237118,78.825977687060359]
[{"$f":"IF(COUNTRY_INFO!A37=0,\" \",COUNTRY_INFO!A37)","v":"Guinea"},{"$f":"IF(COUNTRY_INFO!B37=0,\" \",COUNTRY_INFO!B37)","v":"Labé"},{"$f":"IF(COUNTRY_INFO!C37=0,\" \",COUNTRY_INFO!C37)","v":"Tougué"},{"$f":"COUNTRY_INFO!L37","v":129808},null,null,{"$f":"MAX('MDA1'!M37,'MDA2'!M37)","v":98221},{"$f":"IF(AND(COUNTRY_INFO!H37>0,COUNTRY_INFO!H37<4),IF(D37>MAX('MDA1'!M37,'MDA2'!M37),MAX('MDA1'!M37,'MDA2'!M37),D37),0)","v":98221},{"$f":"IF(AND(COUNTRY_INFO!H37>0,COUNTRY_INFO!H37<4), IF(G37/D37*100<>0, IF(G37/D37*100>100,100,G37/D37*100), \"-\"),0)","v":75.666368790829523},{"$f":"COUNTRY_INFO!M37","v":129808},null,0,{"$f":"MAX('MDA1'!M37,MAX('MDA3'!I37,'MDA3'!L37)+MAX('MDA3'!J37,'MDA3'!M37))","v":98221},{"$f":"IF(AND(COUNTRY_INFO!I37>0,COUNTRY_INFO!I37<4),IF(J37>MAX('MDA1'!M37,MAX('MDA3'!I37,'MDA3'!L37)+MAX('MDA3'!J37,'MDA3'!M37)),MAX('MDA1'!M37,MAX('MDA3'!I37,'MDA3'!L37)+MAX('MDA3'!J37,'MDA3'!M37)),J37),0)","v":98221},{"$f":"IF(AND(COUNTRY_INFO!I37>0,COUNTRY_INFO!I37<4), IF(M37/J37*100<>0, IF(M37/J37*100>100,100,M37/J37*100), \"-\"),0)","v":75.666368790829523},{"$f":"COUNTRY_INFO!N37","v":0},null,null,{"$f":"SUM(MAX('MDA2'!J37, 'T1'!L37, MAX(T3_R1!K37, T3_R2!K37)), MAX('MDA1'!K37, 'MDA2'!K37, 'T1'!M37, MAX(T3_R1!L37, T3_R2!L37)), MAX('MDA1'!L37, 'MDA2'!L37, 'T1'!N37, MAX(T3_R1!M37, T3_R2!M37)))","v":98221},{"$f":"IF(AND(COUNTRY_INFO!J37>1,COUNTRY_INFO!J37<4),IF(COUNTRY_INFO!E37>MAX('MDA2'!J37,'T1'!L37,MAX(T3_R1!K37,T3_R2!K37)),MAX('MDA2'!J37,'T1'!L37,MAX(T3_R1!K37,T3_R2!K37)),COUNTRY_INFO!E37),0)","v":0},{"$f":"IF(AND(COUNTRY_INFO!J37>1,COUNTRY_INFO!J37<4), IF(T37/COUNTRY_INFO!E37*100<>0, IF(T37/COUNTRY_INFO!E37*100>100,100,T37/COUNTRY_INFO!E37*100), \"-\"),0)","v":0},{"$f":"IF(AND(COUNTRY_INFO!J37>1,COUNTRY_INFO!J37<4),IF(COUNTRY_INFO!F37>MAX('MDA1'!K37,'MDA2'!K37,'T1'!M37,MAX(T3_R1!L37,T3_R2!L37)),MAX('MDA1'!K37,'MDA2'!K37,'T1'!M37,MAX(T3_R1!L37,T3_R2!L37)),COUNTRY_INFO!F37),0)","v":0},{"$f":"IF(AND(COUNTRY_INFO!J37>1,COUNTRY_INFO!J37<4), IF(V37/COUNTRY_INFO!F37*100<>0, IF(V37/COUNTRY_INFO!F37*100>100,100,V37/COUNTRY_INFO!F37*100), \"-\"),0)","v":0},0,{"$f":"IF(AND(COUNTRY_INFO!J37>1,COUNTRY_INFO!J37<4), IF(S37/P37*100<>0, IF(X37/P37*100>100,100,X37/P37*100), \"-\"),0)","v":0},{"$f":"COUNTRY_INFO!O37","v":0},null,null,{"$f":"MAX(SUM('T1'!L37:'T1'!N37),SUM('T2'!J37:'T2'!L37))","v":0},{"$f":"IF(COUNTRY_INFO!K37=1,IF(COUNTRY_INFO!F37*0.33>MAX('T1'!M37,'T2'!K37),MAX('T1'!M37,'T2'!K37),COUNTRY_INFO!F37*0.33),IF(COUNTRY_INFO!K37=2,IF(COUNTRY_INFO!F37*0.5>MAX('T1'!M37,'T2'!K37),MAX('T1'!M37,'T2'!K37),COUNTRY_INFO!F37*0.5),IF(COUNTRY_INFO!K37=3,IF(COUNTRY_INFO!F37>MAX('T1'!M37,'T2'!K37),MAX('T1'!M37,'T2'!K37),COUNTRY_INFO!F37),0)))","v":0},{"$f":"IF(AND(COUNTRY_INFO!K37>0,COUNTRY_INFO!K37<4),IF(Z37>0,IF(COUNTRY_INFO!K37=1, AD37/(COUNTRY_INFO!F37*0.33)*100, IF(COUNTRY_INFO!K37=2, AD37/(COUNTRY_INFO!F37*0.5)*100, IF(COUNTRY_INFO!K37=3, AD37/COUNTRY_INFO!F37*100))),\"-\"),0)","v":0},{"$f":"IF(COUNTRY_INFO!K37=2,IF(COUNTRY_INFO!G37*0.2>MAX('T1'!N37,'T2'!L37),MAX('T1'!N37,'T2'!L37),COUNTRY_INFO!G37*0.2),IF(COUNTRY_INFO!K37=3,IF(COUNTRY_INFO!G37>MAX('T1'!N37,'T2'!L37),MAX('T1'!N37,'T2'!L37),COUNTRY_INFO!G37),0))","v":0},{"$f":"IF(AND(COUNTRY_INFO!K37>0,COUNTRY_INFO!K37<4),IF(Z37>0,IF(COUNTRY_INFO!K37=1, 0, IF(COUNTRY_INFO!K37=2, AF37/(COUNTRY_INFO!G37*0.2)*100, IF(COUNTRY_INFO!K37=3, AF37/COUNTRY_INFO!G37*100))),\"-\"),0)","v":0},0,{"$f":"IF(AND(COUNTRY_INFO!K37>0,COUNTRY_INFO!K37<4), IF(AC37/Z37*100<>0, IF(AH37/Z37*100>100,100,AH37/Z37*100), \"-\"),0)","v":0},null,{"$f":"IF(AND(D37<>0, D37<>\"Unknown\",D37<>\"Stopped\",D37<>\"Not required\"),D37/COUNTRY_INFO!D37, 0)","v":1},{"$f":"IF(AND(J37<>0,J37<>\"Unknown\",J37<>\"Stopped\",J37<>\"Not required\"),J37/COUNTRY_INFO!D37, 0)","v":1},{"$f":"IF(AND(P37<>0,P37<>\"Unknown\",P37<>\"Not required\"),P37/(COUNTRY_INFO!E37+COUNTRY_INFO!F37), 0)","v":0},{"$f":"IF(AND(Z37<>0,Z37<>\"Unknown\",Z37<>\"Not required\"),IF(COUNTRY_INFO!K37=1,1,IF(COUNTRY_INFO!K37=2,0.5*COUNTRY_INFO!F37/(0.5*COUNTRY_INFO!F37+0.2*COUNTRY_INFO!G37),IF(COUNTRY_INFO!K37=3,COUNTRY_INFO!F37/(COUNTRY_INFO!F37+COUNTRY_INFO!G37)))),0)","v":0},{"$f":"IF(AND(Z37<>0,Z37<>\"Unknown\",Z37<>\"Not required\"),IF(COUNTRY_INFO!K37=1,0,IF(COUNTRY_INFO!K37=2,0.2*COUNTRY_INFO!G37/(0.5*COUNTRY_INFO!F37+0.2*COUNTRY_INFO!G37),IF(COUNTRY_INFO!K37=3,COUNTRY_INFO!G37/(COUNTRY_INFO!F37+COUNTRY_INFO!G37)))),0)","v":0},{"$f":"MAX(COUNTRY_INFO!D37*AK37*PROFILE!$G$7,COUNTRY_INFO!D37*AL37*PROFILE!$G$7)","v":5192.3280307855703},{"$f":"MAX(COUNTRY_INFO!D37*AK37*PROFILE!$G$8,COUNTRY_INFO!D37*AL37*PROFILE!$G$8,COUNTRY_INFO!D37*AM37*PROFILE!$G$8)","v":20769.22945329082},{"$f":"MAX(COUNTRY_INFO!D37*AK37*PROFILE!$G$9,COUNTRY_INFO!D37*AL37*PROFILE!$G$9,COUNTRY_INFO!D37*AM37*PROFILE!$G$9,IF(AND(DISTRICT!Z37<>\"Unknown\",Z37<>\"Not required\"),COUNTRY_INFO!O37*DISTRICT!AN37,0))","v":32452.050192409813},{"$f":"MAX(COUNTRY_INFO!D37*AK37*PROFILE!$G$10,COUNTRY_INFO!D37*AL37*PROFILE!$G$10,IF(AND(DISTRICT!Z37<>\"Unknown\",Z37<>\"Not required\"),COUNTRY_INFO!O37*DISTRICT!AO37,0))","v":71394.392323513792},129808,"Y",{"$f":"MAX('MDA2'!J37,'T1'!L37,'T2'!J37,T3_R1!K37,T3_R2!K37)","v":0},{"$f":"MAX('MDA1'!K37,'MDA2'!K37,'MDA3'!I37,'MDA3'!L37,'T1'!M37,'T2'!K37,T3_R1!L37,T3_R2!L37)","v":48758},{"$f":"MAX('MDA1'!L37,'MDA2'!L37,'MDA3'!J37,'MDA3'!M37,'T1'!N37,'T2'!L37,T3_R1!M37,T3_R2!M37)","v":49463},98221,{"$f":"MAX('MDA2'!J37,T37)","v":0},{"$f":"MAX('MDA1'!K37,'MDA2'!K37,'MDA3'!I37,'MDA3'!L37,V37,AD37)","v":48758},{"$f":"MAX('MDA1'!L37,'MDA2'!L37,'MDA3'!J37,'MDA3'!M37,AF37)","v":49463},98221,75.666368790829523]
[{"$f":"IF(COUNTRY_INFO!A38=0,\" \",COUNTRY_INFO!A38)","v":"Guinea"},{"$f":"IF(COUNTRY_INFO!B38=0,\" \",COUNTRY_INFO!B38)","v":"Mamou"},{"$f":"IF(COUNTRY_INFO!C38=0,\" \",COUNTRY_INFO!C38)","v":"Dalaba"},{"$f":"COUNTRY_INFO!L38","v":139623},null,null,{"$f":"MAX('MDA1'!M38,'MDA2'!M38)","v":115930},{"$f":"IF(AND(COUNTRY_INFO!H38>0,COUNTRY_INFO!H38<4),IF(D38>MAX('MDA1'!M38,'MDA2'!M38),MAX('MDA1'!M38,'MDA2'!M38),D38),0)","v":115930},{"$f":"IF(AND(COUNTRY_INFO!H38>0,COUNTRY_INFO!H38<4), IF(G38/D38*100<>0, IF(G38/D38*100>100,100,G38/D38*100), \"-\"),0)","v":83.030732758929403},{"$f":"COUNTRY_INFO!M38","v":0},null,0,{"$f":"MAX('MDA1'!M38,MAX('MDA3'!I38,'MDA3'!L38)+MAX('MDA3'!J38,'MDA3'!M38))","v":115930},{"$f":"IF(AND(COUNTRY_INFO!I38>0,COUNTRY_INFO!I38<4),IF(J38>MAX('MDA1'!M38,MAX('MDA3'!I38,'MDA3'!L38)+MAX('MDA3'!J38,'MDA3'!M38)),MAX('MDA1'!M38,MAX('MDA3'!I38,'MDA3'!L38)+MAX('MDA3'!J38,'MDA3'!M38)),J38),0)","v":0},{"$f":"IF(AND(COUNTRY_INFO!I38>0,COUNTRY_INFO!I38<4), IF(M38/J38*100<>0, IF(M38/J38*100>100,100,M38/J38*100), \"-\"),0)","v":0},{"$f":"COUNTRY_INFO!N38","v":57246},null,null,{"$f":"SUM(MAX('MDA2'!J38, 'T1'!L38, MAX(T3_R1!K38, T3_R2!K38)), MAX('MDA1'!K38, 'MDA2'!K38, 'T1'!M38, MAX(T3_R1!L38, T3_R2!L38)), MAX('MDA1'!L38, 'MDA2'!L38, 'T1'!N38, MAX(T3_R1!M38, T3_R2!M38)))","v":115930},{"$f":"IF(AND(COUNTRY_INFO!J38>1,COUNTRY_INFO!J38<4),IF(COUNTRY_INFO!E38>MAX('MDA2'!J38,'T1'!L38,MAX(T3_R1!K38,T3_R2!K38)),MAX('MDA2'!J38,'T1'!L38,MAX(T3_R1!K38,T3_R2!K38)),COUNTRY_INFO!E38),0)","v":0},{"$f":"IF(AND(COUNTRY_INFO!J38>1,COUNTRY_INFO!J38<4), IF(T38/COUNTRY_INFO!E38*100<>0, IF(T38/COUNTRY_INFO!E38*100>100,100,T38/COUNTRY_INFO!E38*100), \"-\"),0)","v":"-"},{"$f":"IF(AND(COUNTRY_INFO!J38>1,COUNTRY_INFO!J38<4),IF(COUNTRY_INFO!F38>MAX('MDA1'!K38,'MDA2'!K38,'T1'!M38,MAX(T3_R1!L38,T3_R2!L38)),MAX('MDA1'!K38,'MDA2'!K38,'T1'!M38,MAX(T3_R1!L38,T3_R2!L38)),COUNTRY_INFO!F38),0)","v":34906},{"$f":"IF(AND(COUNTRY_INFO!J38>1,COUNTRY_INFO!J38<4), IF(V38/COUNTRY_INFO!F38*100<>0, IF(V38/COUNTRY_INFO!F38*100>100,100,V38/COUNTRY_INFO!F38*100), \"-\"),0)","v":100},34906,{"$f":"IF(AND(COUNTRY_INFO!J38>1,COUNTRY_INFO!J38<4), IF(S38/P38*100<>0, IF(X38/P38*100>100,100,X38/P38*100), \"-\"),0)","v":60.975439332005735},{"$f":"COUNTRY_INFO!O38","v":0},null,null,{"$f":"MAX(SUM('T1'!L38:'T1'!N38),SUM('T2'!J38:'T2'!L38))","v":0},{"$f":"IF(COUNTRY_INFO!K38=1,IF(COUNTRY_INFO!F38*0.33>MAX('T1'!M38,'T2'!K38),MAX('T1'!M38,'T2'!K38),COUNTRY_INFO!F38*0.33),IF(COUNTRY_INFO!K38=2,IF(COUNTRY_INFO!F38*0.5>MAX('T1'!M38,'T2'!K38),MAX('T1'!M38,'T2'!K38),COUNTRY_INFO!F38*0.5),IF(COUNTRY_INFO!K38=3,IF(COUNTRY_INFO!F38>MAX('T1'!M38,'T2'!K38),MAX('T1'!M38,'T2'!K38),COUNTRY_INFO!F38),0)))","v":0},{"$f":"IF(AND(COUNTRY_INFO!K38>0,COUNTRY_INFO!K38<4),IF(Z38>0,IF(COUNTRY_INFO!K38=1, AD38/(COUNTRY_INFO!F38*0.33)*100, IF(COUNTRY_INFO!K38=2, AD38/(COUNTRY_INFO!F38*0.5)*100, IF(COUNTRY_INFO!K38=3, AD38/COUNTRY_INFO!F38*100))),\"-\"),0)","v":0},{"$f":"IF(COUNTRY_INFO!K38=2,IF(COUNTRY_INFO!G38*0.2>MAX('T1'!N38,'T2'!L38),MAX('T1'!N38,'T2'!L38),COUNTRY_INFO!G38*0.2),IF(COUNTRY_INFO!K38=3,IF(COUNTRY_INFO!G38>MAX('T1'!N38,'T2'!L38),MAX('T1'!N38,'T2'!L38),COUNTRY_INFO!G38),0))","v":0},{"$f":"IF(AND(COUNTRY_INFO!K38>0,COUNTRY_INFO!K38<4),IF(Z38>0,IF(COUNTRY_INFO!K38=1, 0, IF(COUNTRY_INFO!K38=2, AF38/(COUNTRY_INFO!G38*0.2)*100, IF(COUNTRY_INFO!K38=3, AF38/COUNTRY_INFO!G38*100))),\"-\"),0)","v":0},0,{"$f":"IF(AND(COUNTRY_INFO!K38>0,COUNTRY_INFO!K38<4), IF(AC38/Z38*100<>0, IF(AH38/Z38*100>100,100,AH38/Z38*100), \"-\"),0)","v":0},null,{"$f":"IF(AND(D38<>0, D38<>\"Unknown\",D38<>\"Stopped\",D38<>\"Not required\"),D38/COUNTRY_INFO!D38, 0)","v":1},{"$f":"IF(AND(J38<>0,J38<>\"Unknown\",J38<>\"Stopped\",J38<>\"Not required\"),J38/COUNTRY_INFO!D38, 0)","v":0},{"$f":"IF(AND(P38<>0,P38<>\"Unknown\",P38<>\"Not required\"),P38/(COUNTRY_INFO!E38+COUNTRY_INFO!F38), 0)","v":1},{"$f":"IF(AND(Z38<>0,Z38<>\"Unknown\",Z38<>\"Not required\"),IF(COUNTRY_INFO!K38=1,1,IF(COUNTRY_INFO!K38=2,0.5*COUNTRY_INFO!F38/(0.5*COUNTRY_INFO!F38+0.2*COUNTRY_INFO!G38),IF(COUNTRY_INFO!K38=3,COUNTRY_INFO!F38/(COUNTRY_INFO!F38+COUNTRY_INFO!G38)))),0)","v":0},{"$f":"IF(AND(Z38<>0,Z38<>\"Unknown\",Z38<>\"Not required\"),IF(COUNTRY_INFO!K38=1,0,IF(COUNTRY_INFO!K38=2,0.2*COUNTRY_INFO!G38/(0.5*COUNTRY_INFO!F38+0.2*COUNTRY_INFO!G38),IF(COUNTRY_INFO!K38=3,COUNTRY_INFO!G38/(COUNTRY_INFO!F38+COUNTRY_INFO!G38)))),0)","v":0},{"$f":"MAX(COUNTRY_INFO!D38*AK38*PROFILE!$G$7,COUNTRY_INFO!D38*AL38*PROFILE!$G$7)","v":5584.9286380067006},{"$f":"MAX(COUNTRY_INFO!D38*AK38*PROFILE!$G$8,COUNTRY_INFO!D38*AL38*PROFILE!$G$8,COUNTRY_INFO!D38*AM38*PROFILE!$G$8)","v":22339.625631369592},{"$f":"MAX(COUNTRY_INFO!D38*AK38*PROFILE!$G$9,COUNTRY_INFO!D38*AL38*PROFILE!$G$9,COUNTRY_INFO!D38*AM38*PROFILE!$G$9,IF(AND(DISTRICT!Z38<>\"Unknown\",Z38<>\"Not required\"),COUNTRY_INFO!O38*DISTRICT!AN38,0))","v":34905.803987541876},{"$f":"MAX(COUNTRY_INFO!D38*AK38*PROFILE!$G$10,COUNTRY_INFO!D38*AL38*PROFILE!$G$10,IF(AND(DISTRICT!Z38<>\"Unknown\",Z38<>\"Not required\"),COUNTRY_INFO!O38*DISTRICT!AO38,0))","v":76792.641743081826},139623,"Y",{"$f":"MAX('MDA2'!J38,'T1'!L38,'T2'!J38,T3_R1!K38,T3_R2!K38)","v":0},{"$f":"MAX('MDA1'!K38,'MDA2'!K38,'MDA3'!I38,'MDA3'!L38,'T1'!M38,'T2'!K38,T3_R1!L38,T3_R2!L38)","v":50887},{"$f":"MAX('MDA1'!L38,'MDA2'!L38,'MDA3'!J38,'MDA3'!M38,'T1'!N38,'T2'!L38,T3_R1!M38,T3_R2!M38)","v":65043},115930,{"$f":"MAX('MDA2'!J38,T38)","v":0},{"$f":"MAX('MDA1'!K38,'MDA2'!K38,'MDA3'!I38,'MDA3'!L38,V38,AD38)","v":50887},{"$f":"MAX('MDA1'!L38,'MDA2'!L38,'MDA3'!J38,'MDA3'!M38,AF38)","v":65043},115930,83.030732758929403]
[{"$f":"IF(COUNTRY_INFO!A39=0,\" \",COUNTRY_INFO!A39)","v":"Guinea"},{"$f":"IF(COUNTRY_INFO!B39=0,\" \",COUNTRY_INFO!B39)","v":"Mamou"},{"$f":"IF(COUNTRY_INFO!C39=0,\" \",COUNTRY_INFO!C39)","v":"Mamou"},{"$f":"COUNTRY_INFO!L39","v":333171},null,null,{"$f":"MAX('MDA1'!M39,'MDA2'!M39)","v":291095},{"$f":"IF(AND(COUNTRY_INFO!H39>0,COUNTRY_INFO!H39<4),IF(D39>MAX('MDA1'!M39,'MDA2'!M39),MAX('MDA1'!M39,'MDA2'!M39),D39),0)","v":291095},{"$f":"IF(AND(COUNTRY_INFO!H39>0,COUNTRY_INFO!H39<4), IF(G39/D39*100<>0, IF(G39/D39*100>100,100,G39/D39*100), \"-\"),0)","v":87.371049701204484},{"$f":"COUNTRY_INFO!M39","v":333171},null,0,{"$f":"MAX('MDA1'!M39,MAX('MDA3'!I39,'MDA3'!L39)+MAX('MDA3'!J39,'MDA3'!M39))","v":291095},{"$f":"IF(AND(COUNTRY_INFO!I39>0,COUNTRY_INFO!I39<4),IF(J39>MAX('MDA1'!M39,MAX('MDA3'!I39,'MDA3'!L39)+MAX('MDA3'!J39,'MDA3'!M39)),MAX('MDA1'!M39,MAX('MDA3'!I39,'MDA3'!L39)+MAX('MDA3'!J39,'MDA3'!M39)),J39),0)","v":291095},{"$f":"IF(AND(COUNTRY_INFO!I39>0,COUNTRY_INFO!I39<4), IF(M39/J39*100<>0, IF(M39/J39*100>100,100,M39/J39*100), \"-\"),0)","v":87.371049701204484},{"$f":"COUNTRY_INFO!N39","v":0},null,null,{"$f":"SUM(MAX('MDA2'!J39, 'T1'!L39, MAX(T3_R1!K39, T3_R2!K39)), MAX('MDA1'!K39, 'MDA2'!K39, 'T1'!M39, MAX(T3_R1!L39, T3_R2!L39)), MAX('MDA1'!L39, 'MDA2'!L39, 'T1'!N39, MAX(T3_R1!M39, T3_R2!M39)))","v":291095},{"$f":"IF(AND(COUNTRY_INFO!J39>1,COUNTRY_INFO!J39<4),IF(COUNTRY_INFO!E39>MAX('MDA2'!J39,'T1'!L39,MAX(T3_R1!K39,T3_R2!K39)),MAX('MDA2'!J39,'T1'!L39,MAX(T3_R1!K39,T3_R2!K39)),COUNTRY_INFO!E39),0)","v":0},{"$f":"IF(AND(COUNTRY_INFO!J39>1,COUNTRY_INFO!J39<4), IF(T39/COUNTRY_INFO!E39*100<>0, IF(T39/COUNTRY_INFO!E39*100>100,100,T39/COUNTRY_INFO!E39*100), \"-\"),0)","v":0},{"$f":"IF(AND(COUNTRY_INFO!J39>1,COUNTRY_INFO!J39<4),IF(COUNTRY_INFO!F39>MAX('MDA1'!K39,'MDA2'!K39,'T1'!M39,MAX(T3_R1!L39,T3_R2!L39)),MAX('MDA1'!K39,'MDA2'!K39,'T1'!M39,MAX(T3_R1!L39,T3_R2!L39)),COUNTRY_INFO!F39),0)","v":0},{"$f":"IF(AND(COUNTRY_INFO!J39>1,COUNTRY_INFO!J39<4), IF(V39/COUNTRY_INFO!F39*100<>0, IF(V39/COUNTRY_INFO!F39*100>100,100,V39/COUNTRY_INFO!F39*100), \"-\"),0)","v":0},0,{"$f":"IF(AND(COUNTRY_INFO!J39>1,COUNTRY_INFO!J39<4), IF(S39/P39*100<>0, IF(X39/P39*100>100,100,X39/P39*100), \"-\"),0)","v":0},{"$f":"COUNTRY_INFO!O39","v":78295.3},null,null,{"$f":"MAX(SUM('T1'!L39:'T1'!N39),SUM('T2'!J39:'T2'!L39))","v":109018},{"$f":"IF(COUNTRY_INFO!K39=1,IF(COUNTRY_INFO!F39*0.33>MAX('T1'!M39,'T2'!K39),MAX('T1'!M39,'T2'!K39),COUNTRY_INFO!F39*0.33),IF(COUNTRY_INFO!K39=2,IF(COUNTRY_INFO!F39*0.5>MAX('T1'!M39,'T2'!K39),MAX('T1'!M39,'T2'!K39),COUNTRY_INFO!F39*0.5),IF(COUNTRY_INFO!K39=3,IF(COUNTRY_INFO!F39>MAX('T1'!M39,'T2'!K39),MAX('T1'!M39,'T2'!K39),COUNTRY_INFO!F39),0)))","v":41646.5},{"$f":"IF(AND(COUNTRY_INFO!K39>0,COUNTRY_INFO!K39<4),IF(Z39>0,IF(COUNTRY_INFO!K39=1, AD39/(COUNTRY_INFO!F39*0.33)*100, IF(COUNTRY_INFO!K39=2, AD39/(COUNTRY_INFO!F39*0.5)*100, IF(COUNTRY_INFO!K39=3, AD39/COUNTRY_INFO!F39*100))),\"-\"),0)","v":100},{"$f":"IF(COUNTRY_INFO!K39=2,IF(COUNTRY_INFO!G39*0.2>MAX('T1'!N39,'T2'!L39),MAX('T1'!N39,'T2'!L39),COUNTRY_INFO!G39*0.2),IF(COUNTRY_INFO!K39=3,IF(COUNTRY_INFO!G39>MAX('T1'!N39,'T2'!L39),MAX('T1'!N39,'T2'!L39),COUNTRY_INFO!G39),0))","v":0},{"$f":"IF(AND(COUNTRY_INFO!K39>0,COUNTRY_INFO!K39<4),IF(Z39>0,IF(COUNTRY_INFO!K39=1, 0, IF(COUNTRY_INFO!K39=2, AF39/(COUNTRY_INFO!G39*0.2)*100, IF(COUNTRY_INFO!K39=3, AF39/COUNTRY_INFO!G39*100))),\"-\"),0)","v":0},41646.5,{"$f":"IF(AND(COUNTRY_INFO!K39>0,COUNTRY_INFO!K39<4), IF(AC39/Z39*100<>0, IF(AH39/Z39*100>100,100,AH39/Z39*100), \"-\"),0)","v":53.191570886119599},null,{"$f":"IF(AND(D39<>0, D39<>\"Unknown\",D39<>\"Stopped\",D39<>\"Not required\"),D39/COUNTRY_INFO!D39, 0)","v":1},{"$f":"IF(AND(J39<>0,J39<>\"Unknown\",J39<>\"Stopped\",J39<>\"Not required\"),J39/COUNTRY_INFO!D39, 0)","v":1},{"$f":"IF(AND(P39<>0,P39<>\"Unknown\",P39<>\"Not required\"),P39/(COUNTRY_INFO!E39+COUNTRY_INFO!F39), 0)","v":0},{"$f":"IF(AND(Z39<>0,Z39<>\"Unknown\",Z39<>\"Not required\"),IF(COUNTRY_INFO!K39=1,1,IF(COUNTRY_INFO!K39=2,0.5*COUNTRY_INFO!F39/(0.5*COUNTRY_INFO!F39+0.2*COUNTRY_INFO!G39),IF(COUNTRY_INFO!K39=3,COUNTRY_INFO!F39/(COUNTRY_INFO!F39+COUNTRY_INFO!G39)))),0)","v":0.53191570886119599},{"$f":"IF(AND(Z39<>0,Z39<>\"Unknown\",Z39<>\"Not required\"),IF(COUNTRY_INFO!K39=1,0,IF(COUNTRY_INFO!K39=2,0.2*COUNTRY_INFO!G39/(0.5*COUNTRY_INFO!F39+0.2*COUNTRY_INFO!G39),IF(COUNTRY_INFO!K39=3,COUNTRY_INFO!G39/(COUNTRY_INFO!F39+COUNTRY_INFO!G39)))),0)","v":0.46808429113880401},{"$f":"MAX(COUNTRY_INFO!D39*AK39*PROFILE!$G$7,COUNTRY_INFO!D39*AL39*PROFILE!$G$7)","v":13326.860612172281},{"$f":"MAX(COUNTRY_INFO!D39*AK39*PROFILE!$G$8,COUNTRY_INFO!D39*AL39*PROFILE!$G$8,COUNTRY_INFO!D39*AM39*PROFILE!$G$8)","v":53307.230264562706},{"$f":"MAX(COUNTRY_INFO!D39*AK39*PROFILE!$G$9,COUNTRY_INFO!D39*AL39*PROFILE!$G$9,COUNTRY_INFO!D39*AM39*PROFILE!$G$9,IF(AND(DISTRICT!Z39<>\"Unknown\",Z39<>\"Not required\"),COUNTRY_INFO!O39*DISTRICT!AN39,0))","v":83292.878826076747},{"$f":"MAX(COUNTRY_INFO!D39*AK39*PROFILE!$G$10,COUNTRY_INFO!D39*AL39*PROFILE!$G$10,IF(AND(DISTRICT!Z39<>\"Unknown\",Z39<>\"Not required\"),COUNTRY_INFO!O39*DISTRICT!AO39,0))","v":183244.03029718826},333171,"Y",{"$f":"MAX('MDA2'!J39,'T1'!L39,'T2'!J39,T3_R1!K39,T3_R2!K39)","v":0},{"$f":"MAX('MDA1'!K39,'MDA2'!K39,'MDA3'!I39,'MDA3'!L39,'T1'!M39,'T2'!K39,T3_R1!L39,T3_R2!L39)","v":123519},{"$f":"MAX('MDA1'!L39,'MDA2'!L39,'MDA3'!J39,'MDA3'!M39,'T1'!N39,'T2'!L39,T3_R1!M39,T3_R2!M39)","v":167576},291095,{"$f":"MAX('MDA2'!J39,T39)","v":0},{"$f":"MAX('MDA1'!K39,'MDA2'!K39,'MDA3'!I39,'MDA3'!L39,V39,AD39)","v":123519},{"$f":"MAX('MDA1'!L39,'MDA2'!L39,'MDA3'!J39,'MDA3'!M39,AF39)","v":167576},291095,87.371049701204484]
[{"$f":"IF(COUNTRY_INFO!A40=0,\" \",COUNTRY_INFO!A40)","v":"Guinea"},{"$f":"IF(COUNTRY_INFO!B40=0,\" \",COUNTRY_INFO!B40)","v":"Mamou"},{"$f":"IF(COUNTRY_INFO!C40=0,\" \",COUNTRY_INFO!C40)","v":"Pita"},{"$f":"COUNTRY_INFO!L40","v":290920},null,null,{"$f":"MAX('MDA1'!M40,'MDA2'!M40)","v":231774},{"$f":"IF(AND(COUNTRY_INFO!H40>0,COUNTRY_INFO!H40<4),IF(D40>MAX('MDA1'!M40,'MDA2'!M40),MAX('MDA1'!M40,'MDA2'!M40),D40),0)","v":231774},{"$f":"IF(AND(COUNTRY_INFO!H40>0,COUNTRY_INFO!H40<4), IF(G40/D40*100<>0, IF(G40/D40*100>100,100,G40/D40*100), \"-\"),0)","v":79.669324900316241},{"$f":"COUNTRY_INFO!M40","v":0},null,0,{"$f":"MAX('MDA1'!M40,MAX('MDA3'!I40,'MDA3'!L40)+MAX('MDA3'!J40,'MDA3'!M40))","v":231774},{"$f":"IF(AND(COUNTRY_INFO!I40>0,COUNTRY_INFO!I40<4),IF(J40>MAX('MDA1'!M40,MAX('MDA3'!I40,'MDA3'!L40)+MAX('MDA3'!J40,'MDA3'!M40)),MAX('MDA1'!M40,MAX('MDA3'!I40,'MDA3'!L40)+MAX('MDA3'!J40,'MDA3'!M40)),J40),0)","v":0},{"$f":"IF(AND(COUNTRY_INFO!I40>0,COUNTRY_INFO!I40<4), IF(M40/J40*100<>0, IF(M40/J40*100>100,100,M40/J40*100), \"-\"),0)","v":0},{"$f":"COUNTRY_INFO!N40","v":119277},null,null,{"$f":"SUM(MAX('MDA2'!J40, 'T1'!L40, MAX(T3_R1!K40, T3_R2!K40)), MAX('MDA1'!K40, 'MDA2'!K40, 'T1'!M40, MAX(T3_R1!L40, T3_R2!L40)), MAX('MDA1'!L40, 'MDA2'!L40, 'T1'!N40, MAX(T3_R1!M40, T3_R2!M40)))","v":231774},{"$f":"IF(AND(COUNTRY_INFO!J40>1,COUNTRY_INFO!J40<4),IF(COUNTRY_INFO!E40>MAX('MDA2'!J40,'T1'!L40,MAX(T3_R1!K40,T3_R2!K40)),MAX('MDA2'!J40,'T1'!L40,MAX(T3_R1!K40,T3_R2!K40)),COUNTRY_INFO!E40),0)","v":0},{"$f":"IF(AND(COUNTRY_INFO!J40>1,COUNTRY_INFO!J40<4), IF(T40/COUNTRY_INFO!E40*100<>0, IF(T40/COUNTRY_INFO!E40*100>100,100,T40/COUNTRY_INFO!E40*100), \"-\"),0)","v":"-"},{"$f":"IF(AND(COUNTRY_INFO!J40>1,COUNTRY_INFO!J40<4),IF(COUNTRY_INFO!F40>MAX('MDA1'!K40,'MDA2'!K40,'T1'!M40,MAX(T3_R1!L40,T3_R2!L40)),MAX('MDA1'!K40,'MDA2'!K40,'T1'!M40,MAX(T3_R1!L40,T3_R2!L40)),COUNTRY_INFO!F40),0)","v":72730},{"$f":"IF(AND(COUNTRY_INFO!J40>1,COUNTRY_INFO!J40<4), IF(V40/COUNTRY_INFO!F40*100<>0, IF(V40/COUNTRY_INFO!F40*100>100,100,V40/COUNTRY_INFO!F40*100), \"-\"),0)","v":100},72730,{"$f":"IF(AND(COUNTRY_INFO!J40>1,COUNTRY_INFO!J40<4), IF(S40/P40*100<>0, IF(X40/P40*100>100,100,X40/P40*100), \"-\"),0)","v":60.975711998122016},{"$f":"COUNTRY_INFO!O40","v":0},null,null,{"$f":"MAX(SUM('T1'!L40:'T1'!N40),SUM('T2'!J40:'T2'!L40))","v":0},{"$f":"IF(COUNTRY_INFO!K40=1,IF(COUNTRY_INFO!F40*0.33>MAX('T1'!M40,'T2'!K40),MAX('T1'!M40,'T2'!K40),COUNTRY_INFO!F40*0.33),IF(COUNTRY_INFO!K40=2,IF(COUNTRY_INFO!F40*0.5>MAX('T1'!M40,'T2'!K40),MAX('T1'!M40,'T2'!K40),COUNTRY_INFO!F40*0.5),IF(COUNTRY_INFO!K40=3,IF(COUNTRY_INFO!F40>MAX('T1'!M40,'T2'!K40),MAX('T1'!M40,'T2'!K40),COUNTRY_INFO!F40),0)))","v":0},{"$f":"IF(AND(COUNTRY_INFO!K40>0,COUNTRY_INFO!K40<4),IF(Z40>0,IF(COUNTRY_INFO!K40=1, AD40/(COUNTRY_INFO!F40*0.33)*100, IF(COUNTRY_INFO!K40=2, AD40/(COUNTRY_INFO!F40*0.5)*100, IF(COUNTRY_INFO!K40=3, AD40/COUNTRY_INFO!F40*100))),\"-\"),0)","v":0},{"$f":"IF(COUNTRY_INFO!K40=2,IF(COUNTRY_INFO!G40*0.2>MAX('T1'!N40,'T2'!L40),MAX('T1'!N40,'T2'!L40),COUNTRY_INFO!G40*0.2),IF(COUNTRY_INFO!K40=3,IF(COUNTRY_INFO!G40>MAX('T1'!N40,'T2'!L40),MAX('T1'!N40,'T2'!L40),COUNTRY_INFO!G40),0))","v":0},{"$f":"IF(AND(COUNTRY_INFO!K40>0,COUNTRY_INFO!K40<4),IF(Z40>0,IF(COUNTRY_INFO!K40=1, 0, IF(COUNTRY_INFO!K40=2, AF40/(COUNTRY_INFO!G40*0.2)*100, IF(COUNTRY_INFO!K40=3, AF40/COUNTRY_INFO!G40*100))),\"-\"),0)","v":0},0,{"$f":"IF(AND(COUNTRY_INFO!K40>0,COUNTRY_INFO!K40<4), IF(AC40/Z40*100<>0, IF(AH40/Z40*100>100,100,AH40/Z40*100), \"-\"),0)","v":0},null,{"$f":"IF(AND(D40<>0, D40<>\"Unknown\",D40<>\"Stopped\",D40<>\"Not required\"),D40/COUNTRY_INFO!D40, 0)","v":1},{"$f":"IF(AND(J40<>0,J40<>\"Unknown\",J40<>\"Stopped\",J40<>\"Not required\"),J40/COUNTRY_INFO!D40, 0)","v":0},{"$f":"IF(AND(P40<>0,P40<>\"Unknown\",P40<>\"Not required\"),P40/(COUNTRY_INFO!E40+COUNTRY_INFO!F40), 0)","v":1},{"$f":"IF(AND(Z40<>0,Z40<>\"Unknown\",Z40<>\"Not required\"),IF(COUNTRY_INFO!K40=1,1,IF(COUNTRY_INFO!K40=2,0.5*COUNTRY_INFO!F40/(0.5*COUNTRY_INFO!F40+0.2*COUNTRY_INFO!G40),IF(COUNTRY_INFO!K40=3,COUNTRY_INFO!F40/(COUNTRY_INFO!F40+COUNTRY_INFO!G40)))),0)","v":0},{"$f":"IF(AND(Z40<>0,Z40<>\"Unknown\",Z40<>\"Not required\"),IF(COUNTRY_INFO!K40=1,0,IF(COUNTRY_INFO!K40=2,0.2*COUNTRY_INFO!G40/(0.5*COUNTRY_INFO!F40+0.2*COUNTRY_INFO!G40),IF(COUNTRY_INFO!K40=3,COUNTRY_INFO!G40/(COUNTRY_INFO!F40+COUNTRY_INFO!G40)))),0)","v":0},{"$f":"MAX(COUNTRY_INFO!D40*AK40*PROFILE!$G$7,COUNTRY_INFO!D40*AL40*PROFILE!$G$7)","v":11636.817998244624},{"$f":"MAX(COUNTRY_INFO!D40*AK40*PROFILE!$G$8,COUNTRY_INFO!D40*AL40*PROFILE!$G$8,COUNTRY_INFO!D40*AM40*PROFILE!$G$8)","v":46547.086716930891},{"$f":"MAX(COUNTRY_INFO!D40*AK40*PROFILE!$G$9,COUNTRY_INFO!D40*AL40*PROFILE!$G$9,COUNTRY_INFO!D40*AM40*PROFILE!$G$9,IF(AND(DISTRICT!Z40<>\"Unknown\",Z40<>\"Not required\"),COUNTRY_INFO!O40*DISTRICT!AN40,0))","v":72730.112489028892},{"$f":"MAX(COUNTRY_INFO!D40*AK40*PROFILE!$G$10,COUNTRY_INFO!D40*AL40*PROFILE!$G$10,IF(AND(DISTRICT!Z40<>\"Unknown\",Z40<>\"Not required\"),COUNTRY_INFO!O40*DISTRICT!AO40,0))","v":160005.98279579557},290920,"Y",{"$f":"MAX('MDA2'!J40,'T1'!L40,'T2'!J40,T3_R1!K40,T3_R2!K40)","v":0},{"$f":"MAX('MDA1'!K40,'MDA2'!K40,'MDA3'!I40,'MDA3'!L40,'T1'!M40,'T2'!K40,T3_R1!L40,T3_R2!L40)","v":110131},{"$f":"MAX('MDA1'!L40,'MDA2'!L40,'MDA3'!J40,'MDA3'!M40,'T1'!N40,'T2'!L40,T3_R1!M40,T3_R2!M40)","v":121643},231774,{"$f":"MAX('MDA2'!J40,T40)","v":0},{"$f":"MAX('MDA1'!K40,'MDA2'!K40,'MDA3'!I40,'MDA3'!L40,V40,AD40)","v":110131},{"$f":"MAX('MDA1'!L40,'MDA2'!L40,'MDA3'!J40,'MDA3'!M40,AF40)","v":121643},231774,79.669324900316241]
[{"$f":"IF(COUNTRY_INFO!A41=0,\" \",COUNTRY_INFO!A41)","v":"Guinea"},{"$f":"IF(COUNTRY_INFO!B41=0,\" \",COUNTRY_INFO!B41)","v":"N'Zérékoré"},{"$f":"IF(COUNTRY_INFO!C41=0,\" \",COUNTRY_INFO!C41)","v":"Beyla"},{"$f":"COUNTRY_INFO!L41","v":340587},null,null,{"$f":"MAX('MDA1'!M41,'MDA2'!M41)","v":239306},{"$f":"IF(AND(COUNTRY_INFO!H41>0,COUNTRY_INFO!H41<4),IF(D41>MAX('MDA1'!M41,'MDA2'!M41),MAX('MDA1'!M41,'MDA2'!M41),D41),0)","v":239306},{"$f":"IF(AND(COUNTRY_INFO!H41>0,COUNTRY_INFO!H41<4), IF(G41/D41*100<>0, IF(G41/D41*100>100,100,G41/D41*100), \"-\"),0)","v":70.262810970471563},{"$f":"COUNTRY_INFO!M41","v":340587},null,0,{"$f":"MAX('MDA1'!M41,MAX('MDA3'!I41,'MDA3'!L41)+MAX('MDA3'!J41,'MDA3'!M41))","v":239306},{"$f":"IF(AND(COUNTRY_INFO!I41>0,COUNTRY_INFO!I41<4),IF(J41>MAX('MDA1'!M41,MAX('MDA3'!I41,'MDA3'!L41)+MAX('MDA3'!J41,'MDA3'!M41)),MAX('MDA1'!M41,MAX('MDA3'!I41,'MDA3'!L41)+MAX('MDA3'!J41,'MDA3'!M41)),J41),0)","v":239306},{"$f":"IF(AND(COUNTRY_INFO!I41>0,COUNTRY_INFO!I41<4), IF(M41/J41*100<>0, IF(M41/J41*100>100,100,M41/J41*100), \"-\"),0)","v":70.262810970471563},{"$f":"COUNTRY_INFO!N41","v":139641},null,null,{"$f":"SUM(MAX('MDA2'!J41, 'T1'!L41, MAX(T3_R1!K41, T3_R2!K41)), MAX('MDA1'!K41, 'MDA2'!K41, 'T1'!M41, MAX(T3_R1!L41, T3_R2!L41)), MAX('MDA1'!L41, 'MDA2'!L41, 'T1'!N41, MAX(T3_R1!M41, T3_R2!M41)))","v":239306},{"$f":"IF(AND(COUNTRY_INFO!J41>1,COUNTRY_INFO!J41<4),IF(COUNTRY_INFO!E41>MAX('MDA2'!J41,'T1'!L41,MAX(T3_R1!K41,T3_R2!K41)),MAX('MDA2'!J41,'T1'!L41,MAX(T3_R1!K41,T3_R2!K41)),COUNTRY_INFO!E41),0)","v":0},{"$f":"IF(AND(COUNTRY_INFO!J41>1,COUNTRY_INFO!J41<4), IF(T41/COUNTRY_INFO!E41*100<>0, IF(T41/COUNTRY_INFO!E41*100>100,100,T41/COUNTRY_INFO!E41*100), \"-\"),0)","v":"-"},{"$f":"IF(AND(COUNTRY_INFO!J41>1,COUNTRY_INFO!J41<4),IF(COUNTRY_INFO!F41>MAX('MDA1'!K41,'MDA2'!K41,'T1'!M41,MAX(T3_R1!L41,T3_R2!L41)),MAX('MDA1'!K41,'MDA2'!K41,'T1'!M41,MAX(T3_R1!L41,T3_R2!L41)),COUNTRY_INFO!F41),0)","v":85147},{"$f":"IF(AND(COUNTRY_INFO!J41>1,COUNTRY_INFO!J41<4), IF(V41/COUNTRY_INFO!F41*100<>0, IF(V41/COUNTRY_INFO!F41*100>100,100,V41/COUNTRY_INFO!F41*100), \"-\"),0)","v":100},85147,{"$f":"IF(AND(COUNTRY_INFO!J41>1,COUNTRY_INFO!J41<4), IF(S41/P41*100<>0, IF(X41/P41*100>100,100,X41/P41*100), \"-\"),0)","v":60.97564468888077},{"$f":"COUNTRY_INFO!O41","v":272470},null,null,{"$f":"MAX(SUM('T1'!L41:'T1'!N41),SUM('T2'!J41:'T2'!L41))","v":89742},{"$f":"IF(COUNTRY_INFO!K41=1,IF(COUNTRY_INFO!F41*0.33>MAX('T1'!M41,'T2'!K41),MAX('T1'!M41,'T2'!K41),COUNTRY_INFO!F41*0.33),IF(COUNTRY_INFO!K41=2,IF(COUNTRY_INFO!F41*0.5>MAX('T1'!M41,'T2'!K41),MAX('T1'!M41,'T2'!K41),COUNTRY_INFO!F41*0.5),IF(COUNTRY_INFO!K41=3,IF(COUNTRY_INFO!F41>MAX('T1'!M41,'T2'!K41),MAX('T1'!M41,'T2'!K41),COUNTRY_INFO!F41),0)))","v":85147},{"$f":"IF(AND(COUNTRY_INFO!K41>0,COUNTRY_INFO!K41<4),IF(Z41>0,IF(COUNTRY_INFO!K41=1, AD41/(COUNTRY_INFO!F41*0.33)*100, IF(COUNTRY_INFO!K41=2, AD41/(COUNTRY_INFO!F41*0.5)*100, IF(COUNTRY_INFO!K41=3, AD41/COUNTRY_INFO!F41*100))),\"-\"),0)","v":100},{"$f":"IF(COUNTRY_INFO!K41=2,IF(COUNTRY_INFO!G41*0.2>MAX('T1'!N41,'T2'!L41),MAX('T1'!N41,'T2'!L41),COUNTRY_INFO!G41*0.2),IF(COUNTRY_INFO!K41=3,IF(COUNTRY_INFO!G41>MAX('T1'!N41,'T2'!L41),MAX('T1'!N41,'T2'!L41),COUNTRY_INFO!G41),0))","v":0},{"$f":"IF(AND(COUNTRY_INFO!K41>0,COUNTRY_INFO!K41<4),IF(Z41>0,IF(COUNTRY_INFO!K41=1, 0, IF(COUNTRY_INFO!K41=2, AF41/(COUNTRY_INFO!G41*0.2)*100, IF(COUNTRY_INFO!K41=3, AF41/COUNTRY_INFO!G41*100))),\"-\"),0)","v":0},85147,{"$f":"IF(AND(COUNTRY_INFO!K41>0,COUNTRY_INFO!K41<4), IF(AC41/Z41*100<>0, IF(AH41/Z41*100>100,100,AH41/Z41*100), \"-\"),0)","v":31.250045876610272},null,{"$f":"IF(AND(D41<>0, D41<>\"Unknown\",D41<>\"Stopped\",D41<>\"Not required\"),D41/COUNTRY_INFO!D41, 0)","v":1},{"$f":"IF(AND(J41<>0,J41<>\"Unknown\",J41<>\"Stopped\",J41<>\"Not required\"),J41/COUNTRY_INFO!D41, 0)","v":1},{"$f":"IF(AND(P41<>0,P41<>\"Unknown\",P41<>\"Not required\"),P41/(COUNTRY_INFO!E41+COUNTRY_INFO!F41), 0)","v":1},{"$f":"IF(AND(Z41<>0,Z41<>\"Unknown\",Z41<>\"Not required\"),IF(COUNTRY_INFO!K41=1,1,IF(COUNTRY_INFO!K41=2,0.5*COUNTRY_INFO!F41/(0.5*COUNTRY_INFO!F41+0.2*COUNTRY_INFO!G41),IF(COUNTRY_INFO!K41=3,COUNTRY_INFO!F41/(COUNTRY_INFO!F41+COUNTRY_INFO!G41)))),0)","v":0.31250045876610272},{"$f":"IF(AND(Z41<>0,Z41<>\"Unknown\",Z41<>\"Not required\"),IF(COUNTRY_INFO!K41=1,0,IF(COUNTRY_INFO!K41=2,0.2*COUNTRY_INFO!G41/(0.5*COUNTRY_INFO!F41+0.2*COUNTRY_INFO!G41),IF(COUNTRY_INFO!K41=3,COUNTRY_INFO!G41/(COUNTRY_INFO!F41+COUNTRY_INFO!G41)))),0)","v":0.68749954123389734},{"$f":"MAX(COUNTRY_INFO!D41*AK41*PROFILE!$G$7,COUNTRY_INFO!D41*AL41*PROFILE!$G$7)","v":13623.501070975326},{"$f":"MAX(COUNTRY_INFO!D41*AK41*PROFILE!$G$8,COUNTRY_INFO!D41*AL41*PROFILE!$G$8,COUNTRY_INFO!D41*AM41*PROFILE!$G$8)","v":54493.787376802356},{"$f":"MAX(COUNTRY_INFO!D41*AK41*PROFILE!$G$9,COUNTRY_INFO!D41*AL41*PROFILE!$G$9,COUNTRY_INFO!D41*AM41*PROFILE!$G$9,IF(AND(DISTRICT!Z41<>\"Unknown\",Z41<>\"Not required\"),COUNTRY_INFO!O41*DISTRICT!AN41,0))","v":85147.000000000015},{"$f":"MAX(COUNTRY_INFO!D41*AK41*PROFILE!$G$10,COUNTRY_INFO!D41*AL41*PROFILE!$G$10,IF(AND(DISTRICT!Z41<>\"Unknown\",Z41<>\"Not required\"),COUNTRY_INFO!O41*DISTRICT!AO41,0))","v":187323},340587.28844777768,"Y",{"$f":"MAX('MDA2'!J41,'T1'!L41,'T2'!J41,T3_R1!K41,T3_R2!K41)","v":0},{"$f":"MAX('MDA1'!K41,'MDA2'!K41,'MDA3'!I41,'MDA3'!L41,'T1'!M41,'T2'!K41,T3_R1!L41,T3_R2!L41)","v":119576},{"$f":"MAX('MDA1'!L41,'MDA2'!L41,'MDA3'!J41,'MDA3'!M41,'T1'!N41,'T2'!L41,T3_R1!M41,T3_R2!M41)","v":119730},239306,{"$f":"MAX('MDA2'!J41,T41)","v":0},{"$f":"MAX('MDA1'!K41,'MDA2'!K41,'MDA3'!I41,'MDA3'!L41,V41,AD41)","v":119576},{"$f":"MAX('MDA1'!L41,'MDA2'!L41,'MDA3'!J41,'MDA3'!M41,AF41)","v":119730},239306,70.262751463988607]
[{"$f":"IF(COUNTRY_INFO!A42=0,\" \",COUNTRY_INFO!A42)","v":"Guinea"},{"$f":"IF(COUNTRY_INFO!B42=0,\" \",COUNTRY_INFO!B42)","v":"N'Zérékoré"},{"$f":"IF(COUNTRY_INFO!C42=0,\" \",COUNTRY_INFO!C42)","v":"Gueckedou"},{"$f":"COUNTRY_INFO!L42","v":303539},null,null,{"$f":"MAX('MDA1'!M42,'MDA2'!M42)","v":233352},{"$f":"IF(AND(COUNTRY_INFO!H42>0,COUNTRY_INFO!H42<4),IF(D42>MAX('MDA1'!M42,'MDA2'!M42),MAX('MDA1'!M42,'MDA2'!M42),D42),0)","v":233352},{"$f":"IF(AND(COUNTRY_INFO!H42>0,COUNTRY_INFO!H42<4), IF(G42/D42*100<>0, IF(G42/D42*100>100,100,G42/D42*100), \"-\"),0)","v":76.877106401483829},{"$f":"COUNTRY_INFO!M42","v":303539},null,0,{"$f":"MAX('MDA1'!M42,MAX('MDA3'!I42,'MDA3'!L42)+MAX('MDA3'!J42,'MDA3'!M42))","v":233352},{"$f":"IF(AND(COUNTRY_INFO!I42>0,COUNTRY_INFO!I42<4),IF(J42>MAX('MDA1'!M42,MAX('MDA3'!I42,'MDA3'!L42)+MAX('MDA3'!J42,'MDA3'!M42)),MAX('MDA1'!M42,MAX('MDA3'!I42,'MDA3'!L42)+MAX('MDA3'!J42,'MDA3'!M42)),J42),0)","v":233352},{"$f":"IF(AND(COUNTRY_INFO!I42>0,COUNTRY_INFO!I42<4), IF(M42/J42*100<>0, IF(M42/J42*100>100,100,M42/J42*100), \"-\"),0)","v":76.877106401483829},{"$f":"COUNTRY_INFO!N42","v":124451},null,null,{"$f":"SUM(MAX('MDA2'!J42, 'T1'!L42, MAX(T3_R1!K42, T3_R2!K42)), MAX('MDA1'!K42, 'MDA2'!K42, 'T1'!M42, MAX(T3_R1!L42, T3_R2!L42)), MAX('MDA1'!L42, 'MDA2'!L42, 'T1'!N42, MAX(T3_R1!M42, T3_R2!M42)))","v":233352},{"$f":"IF(AND(COUNTRY_INFO!J42>1,COUNTRY_INFO!J42<4),IF(COUNTRY_INFO!E42>MAX('MDA2'!J42,'T1'!L42,MAX(T3_R1!K42,T3_R2!K42)),MAX('MDA2'!J42,'T1'!L42,MAX(T3_R1!K42,T3_R2!K42)),COUNTRY_INFO!E42),0)","v":0},{"$f":"IF(AND(COUNTRY_INFO!J42>1,COUNTRY_INFO!J42<4), IF(T42/COUNTRY_INFO!E42*100<>0, IF(T42/COUNTRY_INFO!E42*100>100,100,T42/COUNTRY_INFO!E42*100), \"-\"),0)","v":"-"},{"$f":"IF(AND(COUNTRY_INFO!J42>1,COUNTRY_INFO!J42<4),IF(COUNTRY_INFO!F42>MAX('MDA1'!K42,'MDA2'!K42,'T1'!M42,MAX(T3_R1!L42,T3_R2!L42)),MAX('MDA1'!K42,'MDA2'!K42,'T1'!M42,MAX(T3_R1!L42,T3_R2!L42)),COUNTRY_INFO!F42),0)","v":75885},{"$f":"IF(AND(COUNTRY_INFO!J42>1,COUNTRY_INFO!J42<4), IF(V42/COUNTRY_INFO!F42*100<>0, IF(V42/COUNTRY_INFO!F42*100>100,100,V42/COUNTRY_INFO!F42*100), \"-\"),0)","v":100},75885,{"$f":"IF(AND(COUNTRY_INFO!J42>1,COUNTRY_INFO!J42<4), IF(S42/P42*100<>0, IF(X42/P42*100>100,100,X42/P42*100), \"-\"),0)","v":60.975805738804837},{"$f":"COUNTRY_INFO!O42","v":242831},null,null,{"$f":"MAX(SUM('T1'!L42:'T1'!N42),SUM('T2'!J42:'T2'!L42))","v":76668},{"$f":"IF(COUNTRY_INFO!K42=1,IF(COUNTRY_INFO!F42*0.33>MAX('T1'!M42,'T2'!K42),MAX('T1'!M42,'T2'!K42),COUNTRY_INFO!F42*0.33),IF(COUNTRY_INFO!K42=2,IF(COUNTRY_INFO!F42*0.5>MAX('T1'!M42,'T2'!K42),MAX('T1'!M42,'T2'!K42),COUNTRY_INFO!F42*0.5),IF(COUNTRY_INFO!K42=3,IF(COUNTRY_INFO!F42>MAX('T1'!M42,'T2'!K42),MAX('T1'!M42,'T2'!K42),COUNTRY_INFO!F42),0)))","v":75885},{"$f":"IF(AND(COUNTRY_INFO!K42>0,COUNTRY_INFO!K42<4),IF(Z42>0,IF(COUNTRY_INFO!K42=1, AD42/(COUNTRY_INFO!F42*0.33)*100, IF(COUNTRY_INFO!K42=2, AD42/(COUNTRY_INFO!F42*0.5)*100, IF(COUNTRY_INFO!K42=3, AD42/COUNTRY_INFO!F42*100))),\"-\"),0)","v":100},{"$f":"IF(COUNTRY_INFO!K42=2,IF(COUNTRY_INFO!G42*0.2>MAX('T1'!N42,'T2'!L42),MAX('T1'!N42,'T2'!L42),COUNTRY_INFO!G42*0.2),IF(COUNTRY_INFO!K42=3,IF(COUNTRY_INFO!G42>MAX('T1'!N42,'T2'!L42),MAX('T1'!N42,'T2'!L42),COUNTRY_INFO!G42),0))","v":0},{"$f":"IF(AND(COUNTRY_INFO!K42>0,COUNTRY_INFO!K42<4),IF(Z42>0,IF(COUNTRY_INFO!K42=1, 0, IF(COUNTRY_INFO!K42=2, AF42/(COUNTRY_INFO!G42*0.2)*100, IF(COUNTRY_INFO!K42=3, AF42/COUNTRY_INFO!G42*100))),\"-\"),0)","v":0},75885,{"$f":"IF(AND(COUNTRY_INFO!K42>0,COUNTRY_INFO!K42<4), IF(AC42/Z42*100<>0, IF(AH42/Z42*100>100,100,AH42/Z42*100), \"-\"),0)","v":31.250128690323724},null,{"$f":"IF(AND(D42<>0, D42<>\"Unknown\",D42<>\"Stopped\",D42<>\"Not required\"),D42/COUNTRY_INFO!D42, 0)","v":1},{"$f":"IF(AND(J42<>0,J42<>\"Unknown\",J42<>\"Stopped\",J42<>\"Not required\"),J42/COUNTRY_INFO!D42, 0)","v":1},{"$f":"IF(AND(P42<>0,P42<>\"Unknown\",P42<>\"Not required\"),P42/(COUNTRY_INFO!E42+COUNTRY_INFO!F42), 0)","v":1},{"$f":"IF(AND(Z42<>0,Z42<>\"Unknown\",Z42<>\"Not required\"),IF(COUNTRY_INFO!K42=1,1,IF(COUNTRY_INFO!K42=2,0.5*COUNTRY_INFO!F42/(0.5*COUNTRY_INFO!F42+0.2*COUNTRY_INFO!G42),IF(COUNTRY_INFO!K42=3,COUNTRY_INFO!F42/(COUNTRY_INFO!F42+COUNTRY_INFO!G42)))),0)","v":0.31250128690323725},{"$f":"IF(AND(Z42<>0,Z42<>\"Unknown\",Z42<>\"Not required\"),IF(COUNTRY_INFO!K42=1,0,IF(COUNTRY_INFO!K42=2,0.2*COUNTRY_INFO!G42/(0.5*COUNTRY_INFO!F42+0.2*COUNTRY_INFO!G42),IF(COUNTRY_INFO!K42=3,COUNTRY_INFO!G42/(COUNTRY_INFO!F42+COUNTRY_INFO!G42)))),0)","v":0.6874987130967628},{"$f":"MAX(COUNTRY_INFO!D42*AK42*PROFILE!$G$7,COUNTRY_INFO!D42*AL42*PROFILE!$G$7)","v":12141.578778939829},{"$f":"MAX(COUNTRY_INFO!D42*AK42*PROFILE!$G$8,COUNTRY_INFO!D42*AL42*PROFILE!$G$8,COUNTRY_INFO!D42*AM42*PROFILE!$G$8)","v":48566.121803143433},{"$f":"MAX(COUNTRY_INFO!D42*AK42*PROFILE!$G$9,COUNTRY_INFO!D42*AL42*PROFILE!$G$9,COUNTRY_INFO!D42*AM42*PROFILE!$G$9,IF(AND(DISTRICT!Z42<>\"Unknown\",Z42<>\"Not required\"),COUNTRY_INFO!O42*DISTRICT!AN42,0))","v":75885},{"$f":"MAX(COUNTRY_INFO!D42*AK42*PROFILE!$G$10,COUNTRY_INFO!D42*AL42*PROFILE!$G$10,IF(AND(DISTRICT!Z42<>\"Unknown\",Z42<>\"Not required\"),COUNTRY_INFO!O42*DISTRICT!AO42,0))","v":166946.43204954281},303539.1326316261,"Y",{"$f":"MAX('MDA2'!J42,'T1'!L42,'T2'!J42,T3_R1!K42,T3_R2!K42)","v":0},{"$f":"MAX('MDA1'!K42,'MDA2'!K42,'MDA3'!I42,'MDA3'!L42,'T1'!M42,'T2'!K42,T3_R1!L42,T3_R2!L42)","v":97268},{"$f":"MAX('MDA1'!L42,'MDA2'!L42,'MDA3'!J42,'MDA3'!M42,'T1'!N42,'T2'!L42,T3_R1!M42,T3_R2!M42)","v":136084},233352,{"$f":"MAX('MDA2'!J42,T42)","v":0},{"$f":"MAX('MDA1'!K42,'MDA2'!K42,'MDA3'!I42,'MDA3'!L42,V42,AD42)","v":97268},{"$f":"MAX('MDA1'!L42,'MDA2'!L42,'MDA3'!J42,'MDA3'!M42,AF42)","v":136084},233352,76.877072809981001]
[{"$f":"IF(COUNTRY_INFO!A43=0,\" \",COUNTRY_INFO!A43)","v":"Guinea"},{"$f":"IF(COUNTRY_INFO!B43=0,\" \",COUNTRY_INFO!B43)","v":"N'Zérékoré"},{"$f":"IF(COUNTRY_INFO!C43=0,\" \",COUNTRY_INFO!C43)","v":"Lola"},{"$f":"COUNTRY_INFO!L43","v":0},null,null,{"$f":"MAX('MDA1'!M43,'MDA2'!M43)","v":0},{"$f":"IF(AND(COUNTRY_INFO!H43>0,COUNTRY_INFO!H43<4),IF(D43>MAX('MDA1'!M43,'MDA2'!M43),MAX('MDA1'!M43,'MDA2'!M43),D43),0)","v":0},{"$f":"IF(AND(COUNTRY_INFO!H43>0,COUNTRY_INFO!H43<4), IF(G43/D43*100<>0, IF(G43/D43*100>100,100,G43/D43*100), \"-\"),0)","v":0},{"$f":"COUNTRY_INFO!M43","v":179193},null,0,{"$f":"MAX('MDA1'!M43,MAX('MDA3'!I43,'MDA3'!L43)+MAX('MDA3'!J43,'MDA3'!M43))","v":0},{"$f":"IF(AND(COUNTRY_INFO!I43>0,COUNTRY_INFO!I43<4),IF(J43>MAX('MDA1'!M43,MAX('MDA3'!I43,'MDA3'!L43)+MAX('MDA3'!J43,'MDA3'!M43)),MAX('MDA1'!M43,MAX('MDA3'!I43,'MDA3'!L43)+MAX('MDA3'!J43,'MDA3'!M43)),J43),0)","v":0},{"$f":"IF(AND(COUNTRY_INFO!I43>0,COUNTRY_INFO!I43<4), IF(M43/J43*100<>0, IF(M43/J43*100>100,100,M43/J43*100), \"-\"),0)","v":"-"},{"$f":"COUNTRY_INFO!N43","v":73469},null,null,{"$f":"SUM(MAX('MDA2'!J43, 'T1'!L43, MAX(T3_R1!K43, T3_R2!K43)), MAX('MDA1'!K43, 'MDA2'!K43, 'T1'!M43, MAX(T3_R1!L43, T3_R2!L43)), MAX('MDA1'!L43, 'MDA2'!L43, 'T1'!N43, MAX(T3_R1!M43, T3_R2!M43)))","v":0},{"$f":"IF(AND(COUNTRY_INFO!J43>1,COUNTRY_INFO!J43<4),IF(COUNTRY_INFO!E43>MAX('MDA2'!J43,'T1'!L43,MAX(T3_R1!K43,T3_R2!K43)),MAX('MDA2'!J43,'T1'!L43,MAX(T3_R1!K43,T3_R2!K43)),COUNTRY_INFO!E43),0)","v":0},{"$f":"IF(AND(COUNTRY_INFO!J43>1,COUNTRY_INFO!J43<4), IF(T43/COUNTRY_INFO!E43*100<>0, IF(T43/COUNTRY_INFO!E43*100>100,100,T43/COUNTRY_INFO!E43*100), \"-\"),0)","v":"-"},{"$f":"IF(AND(COUNTRY_INFO!J43>1,COUNTRY_INFO!J43<4),IF(COUNTRY_INFO!F43>MAX('MDA1'!K43,'MDA2'!K43,'T1'!M43,MAX(T3_R1!L43,T3_R2!L43)),MAX('MDA1'!K43,'MDA2'!K43,'T1'!M43,MAX(T3_R1!L43,T3_R2!L43)),COUNTRY_INFO!F43),0)","v":0},{"$f":"IF(AND(COUNTRY_INFO!J43>1,COUNTRY_INFO!J43<4), IF(V43/COUNTRY_INFO!F43*100<>0, IF(V43/COUNTRY_INFO!F43*100>100,100,V43/COUNTRY_INFO!F43*100), \"-\"),0)","v":"-"},0,{"$f":"IF(AND(COUNTRY_INFO!J43>1,COUNTRY_INFO!J43<4), IF(S43/P43*100<>0, IF(X43/P43*100>100,100,X43/P43*100), \"-\"),0)","v":"-"},{"$f":"COUNTRY_INFO!O43","v":143354},null,null,{"$f":"MAX(SUM('T1'!L43:'T1'!N43),SUM('T2'!J43:'T2'!L43))","v":0},{"$f":"IF(COUNTRY_INFO!K43=1,IF(COUNTRY_INFO!F43*0.33>MAX('T1'!M43,'T2'!K43),MAX('T1'!M43,'T2'!K43),COUNTRY_INFO!F43*0.33),IF(COUNTRY_INFO!K43=2,IF(COUNTRY_INFO!F43*0.5>MAX('T1'!M43,'T2'!K43),MAX('T1'!M43,'T2'!K43),COUNTRY_INFO!F43*0.5),IF(COUNTRY_INFO!K43=3,IF(COUNTRY_INFO!F43>MAX('T1'!M43,'T2'!K43),MAX('T1'!M43,'T2'!K43),COUNTRY_INFO!F43),0)))","v":0},{"$f":"IF(AND(COUNTRY_INFO!K43>0,COUNTRY_INFO!K43<4),IF(Z43>0,IF(COUNTRY_INFO!K43=1, AD43/(COUNTRY_INFO!F43*0.33)*100, IF(COUNTRY_INFO!K43=2, AD43/(COUNTRY_INFO!F43*0.5)*100, IF(COUNTRY_INFO!K43=3, AD43/COUNTRY_INFO!F43*100))),\"-\"),0)","v":0},{"$f":"IF(COUNTRY_INFO!K43=2,IF(COUNTRY_INFO!G43*0.2>MAX('T1'!N43,'T2'!L43),MAX('T1'!N43,'T2'!L43),COUNTRY_INFO!G43*0.2),IF(COUNTRY_INFO!K43=3,IF(COUNTRY_INFO!G43>MAX('T1'!N43,'T2'!L43),MAX('T1'!N43,'T2'!L43),COUNTRY_INFO!G43),0))","v":0},{"$f":"IF(AND(COUNTRY_INFO!K43>0,COUNTRY_INFO!K43<4),IF(Z43>0,IF(COUNTRY_INFO!K43=1, 0, IF(COUNTRY_INFO!K43=2, AF43/(COUNTRY_INFO!G43*0.2)*100, IF(COUNTRY_INFO!K43=3, AF43/COUNTRY_INFO!G43*100))),\"-\"),0)","v":0},0,{"$f":"IF(AND(COUNTRY_INFO!K43>0,COUNTRY_INFO!K43<4), IF(AC43/Z43*100<>0, IF(AH43/Z43*100>100,100,AH43/Z43*100), \"-\"),0)","v":"-"},null,{"$f":"IF(AND(D43<>0, D43<>\"Unknown\",D43<>\"Stopped\",D43<>\"Not required\"),D43/COUNTRY_INFO!D43, 0)","v":0},{"$f":"IF(AND(J43<>0,J43<>\"Unknown\",J43<>\"Stopped\",J43<>\"Not required\"),J43/COUNTRY_INFO!D43, 0)","v":1},{"$f":"IF(AND(P43<>0,P43<>\"Unknown\",P43<>\"Not required\"),P43/(COUNTRY_INFO!E43+COUNTRY_INFO!F43), 0)","v":1},{"$f":"IF(AND(Z43<>0,Z43<>\"Unknown\",Z43<>\"Not required\"),IF(COUNTRY_INFO!K43=1,1,IF(COUNTRY_INFO!K43=2,0.5*COUNTRY_INFO!F43/(0.5*COUNTRY_INFO!F43+0.2*COUNTRY_INFO!G43),IF(COUNTRY_INFO!K43=3,COUNTRY_INFO!F43/(COUNTRY_INFO!F43+COUNTRY_INFO!G43)))),0)","v":0.31249912803270224},{"$f":"IF(AND(Z43<>0,Z43<>\"Unknown\",Z43<>\"Not required\"),IF(COUNTRY_INFO!K43=1,0,IF(COUNTRY_INFO!K43=2,0.2*COUNTRY_INFO!G43/(0.5*COUNTRY_INFO!F43+0.2*COUNTRY_INFO!G43),IF(COUNTRY_INFO!K43=3,COUNTRY_INFO!G43/(COUNTRY_INFO!F43+COUNTRY_INFO!G43)))),0)","v":0.6875008719672977},{"$f":"MAX(COUNTRY_INFO!D43*AK43*PROFILE!$G$7,COUNTRY_INFO!D43*AL43*PROFILE!$G$7)","v":7167.7310860698781},{"$f":"MAX(COUNTRY_INFO!D43*AK43*PROFILE!$G$8,COUNTRY_INFO!D43*AL43*PROFILE!$G$8,COUNTRY_INFO!D43*AM43*PROFILE!$G$8)","v":28670.810222971944},{"$f":"MAX(COUNTRY_INFO!D43*AK43*PROFILE!$G$9,COUNTRY_INFO!D43*AL43*PROFILE!$G$9,COUNTRY_INFO!D43*AM43*PROFILE!$G$9,IF(AND(DISTRICT!Z43<>\"Unknown\",Z43<>\"Not required\"),COUNTRY_INFO!O43*DISTRICT!AN43,0))","v":44798.319287936734},{"$f":"MAX(COUNTRY_INFO!D43*AK43*PROFILE!$G$10,COUNTRY_INFO!D43*AL43*PROFILE!$G$10,IF(AND(DISTRICT!Z43<>\"Unknown\",Z43<>\"Not required\"),COUNTRY_INFO!O43*DISTRICT!AO43,0))","v":98556.139403021443},179193,0,{"$f":"MAX('MDA2'!J43,'T1'!L43,'T2'!J43,T3_R1!K43,T3_R2!K43)","v":0},{"$f":"MAX('MDA1'!K43,'MDA2'!K43,'MDA3'!I43,'MDA3'!L43,'T1'!M43,'T2'!K43,T3_R1!L43,T3_R2!L43)","v":0},{"$f":"MAX('MDA1'!L43,'MDA2'!L43,'MDA3'!J43,'MDA3'!M43,'T1'!N43,'T2'!L43,T3_R1!M43,T3_R2!M43)","v":0},0,{"$f":"MAX('MDA2'!J43,T43)","v":0},{"$f":"MAX('MDA1'!K43,'MDA2'!K43,'MDA3'!I43,'MDA3'!L43,V43,AD43)","v":0},{"$f":"MAX('MDA1'!L43,'MDA2'!L43,'MDA3'!J43,'MDA3'!M43,AF43)","v":0},0,0]
[{"$f":"IF(COUNTRY_INFO!A44=0,\" \",COUNTRY_INFO!A44)","v":"Guinea"},{"$f":"IF(COUNTRY_INFO!B44=0,\" \",COUNTRY_INFO!B44)","v":"N'Zérékoré"},{"$f":"IF(COUNTRY_INFO!C44=0,\" \",COUNTRY_INFO!C44)","v":"Macenta"},{"$f":"COUNTRY_INFO!L44","v":290843},null,null,{"$f":"MAX('MDA1'!M44,'MDA2'!M44)","v":223450},{"$f":"IF(AND(COUNTRY_INFO!H44>0,COUNTRY_INFO!H44<4),IF(D44>MAX('MDA1'!M44,'MDA2'!M44),MAX('MDA1'!M44,'MDA2'!M44),D44),0)","v":223450},{"$f":"IF(AND(COUNTRY_INFO!H44>0,COUNTRY_INFO!H44<4), IF(G44/D44*100<>0, IF(G44/D44*100>100,100,G44/D44*100), \"-\"),0)","v":76.828391950296208},{"$f":"COUNTRY_INFO!M44","v":290843},null,0,{"$f":"MAX('MDA1'!M44,MAX('MDA3'!I44,'MDA3'!L44)+MAX('MDA3'!J44,'MDA3'!M44))","v":223450},{"$f":"IF(AND(COUNTRY_INFO!I44>0,COUNTRY_INFO!I44<4),IF(J44>MAX('MDA1'!M44,MAX('MDA3'!I44,'MDA3'!L44)+MAX('MDA3'!J44,'MDA3'!M44)),MAX('MDA1'!M44,MAX('MDA3'!I44,'MDA3'!L44)+MAX('MDA3'!J44,'MDA3'!M44)),J44),0)","v":223450},{"$f":"IF(AND(COUNTRY_INFO!I44>0,COUNTRY_INFO!I44<4), IF(M44/J44*100<>0, IF(M44/J44*100>100,100,M44/J44*100), \"-\"),0)","v":76.828391950296208},{"$f":"COUNTRY_INFO!N44","v":119246},null,null,{"$f":"SUM(MAX('MDA2'!J44, 'T1'!L44, MAX(T3_R1!K44, T3_R2!K44)), MAX('MDA1'!K44, 'MDA2'!K44, 'T1'!M44, MAX(T3_R1!L44, T3_R2!L44)), MAX('MDA1'!L44, 'MDA2'!L44, 'T1'!N44, MAX(T3_R1!M44, T3_R2!M44)))","v":223450},{"$f":"IF(AND(COUNTRY_INFO!J44>1,COUNTRY_INFO!J44<4),IF(COUNTRY_INFO!E44>MAX('MDA2'!J44,'T1'!L44,MAX(T3_R1!K44,T3_R2!K44)),MAX('MDA2'!J44,'T1'!L44,MAX(T3_R1!K44,T3_R2!K44)),COUNTRY_INFO!E44),0)","v":0},{"$f":"IF(AND(COUNTRY_INFO!J44>1,COUNTRY_INFO!J44<4), IF(T44/COUNTRY_INFO!E44*100<>0, IF(T44/COUNTRY_INFO!E44*100>100,100,T44/COUNTRY_INFO!E44*100), \"-\"),0)","v":"-"},{"$f":"IF(AND(COUNTRY_INFO!J44>1,COUNTRY_INFO!J44<4),IF(COUNTRY_INFO!F44>MAX('MDA1'!K44,'MDA2'!K44,'T1'!M44,MAX(T3_R1!L44,T3_R2!L44)),MAX('MDA1'!K44,'MDA2'!K44,'T1'!M44,MAX(T3_R1!L44,T3_R2!L44)),COUNTRY_INFO!F44),0)","v":72711},{"$f":"IF(AND(COUNTRY_INFO!J44>1,COUNTRY_INFO!J44<4), IF(V44/COUNTRY_INFO!F44*100<>0, IF(V44/COUNTRY_INFO!F44*100>100,100,V44/COUNTRY_INFO!F44*100), \"-\"),0)","v":100},72711,{"$f":"IF(AND(COUNTRY_INFO!J44>1,COUNTRY_INFO!J44<4), IF(S44/P44*100<>0, IF(X44/P44*100>100,100,X44/P44*100), \"-\"),0)","v":60.975630209818355},{"$f":"COUNTRY_INFO!O44","v":68348.3},null,null,{"$f":"MAX(SUM('T1'!L44:'T1'!N44),SUM('T2'!J44:'T2'!L44))","v":87868},{"$f":"IF(COUNTRY_INFO!K44=1,IF(COUNTRY_INFO!F44*0.33>MAX('T1'!M44,'T2'!K44),MAX('T1'!M44,'T2'!K44),COUNTRY_INFO!F44*0.33),IF(COUNTRY_INFO!K44=2,IF(COUNTRY_INFO!F44*0.5>MAX('T1'!M44,'T2'!K44),MAX('T1'!M44,'T2'!K44),COUNTRY_INFO!F44*0.5),IF(COUNTRY_INFO!K44=3,IF(COUNTRY_INFO!F44>MAX('T1'!M44,'T2'!K44),MAX('T1'!M44,'T2'!K44),COUNTRY_INFO!F44),0)))","v":36355.5},{"$f":"IF(AND(COUNTRY_INFO!K44>0,COUNTRY_INFO!K44<4),IF(Z44>0,IF(COUNTRY_INFO!K44=1, AD44/(COUNTRY_INFO!F44*0.33)*100, IF(COUNTRY_INFO!K44=2, AD44/(COUNTRY_INFO!F44*0.5)*100, IF(COUNTRY_INFO!K44=3, AD44/COUNTRY_INFO!F44*100))),\"-\"),0)","v":100},{"$f":"IF(COUNTRY_INFO!K44=2,IF(COUNTRY_INFO!G44*0.2>MAX('T1'!N44,'T2'!L44),MAX('T1'!N44,'T2'!L44),COUNTRY_INFO!G44*0.2),IF(COUNTRY_INFO!K44=3,IF(COUNTRY_INFO!G44>MAX('T1'!N44,'T2'!L44),MAX('T1'!N44,'T2'!L44),COUNTRY_INFO!G44),0))","v":0},{"$f":"IF(AND(COUNTRY_INFO!K44>0,COUNTRY_INFO!K44<4),IF(Z44>0,IF(COUNTRY_INFO!K44=1, 0, IF(COUNTRY_INFO!K44=2, AF44/(COUNTRY_INFO!G44*0.2)*100, IF(COUNTRY_INFO!K44=3, AF44/COUNTRY_INFO!G44*100))),\"-\"),0)","v":0},36355.5,{"$f":"IF(AND(COUNTRY_INFO!K44>0,COUNTRY_INFO!K44<4), IF(AC44/Z44*100<>0, IF(AH44/Z44*100>100,100,AH44/Z44*100), \"-\"),0)","v":53.191520491365551},null,{"$f":"IF(AND(D44<>0, D44<>\"Unknown\",D44<>\"Stopped\",D44<>\"Not required\"),D44/COUNTRY_INFO!D44, 0)","v":1},{"$f":"IF(AND(J44<>0,J44<>\"Unknown\",J44<>\"Stopped\",J44<>\"Not required\"),J44/COUNTRY_INFO!D44, 0)","v":1},{"$f":"IF(AND(P44<>0,P44<>\"Unknown\",P44<>\"Not required\"),P44/(COUNTRY_INFO!E44+COUNTRY_INFO!F44), 0)","v":1},{"$f":"IF(AND(Z44<>0,Z44<>\"Unknown\",Z44<>\"Not required\"),IF(COUNTRY_INFO!K44=1,1,IF(COUNTRY_INFO!K44=2,0.5*COUNTRY_INFO!F44/(0.5*COUNTRY_INFO!F44+0.2*COUNTRY_INFO!G44),IF(COUNTRY_INFO!K44=3,COUNTRY_INFO!F44/(COUNTRY_INFO!F44+COUNTRY_INFO!G44)))),0)","v":0.53191520491365551},{"$f":"IF(AND(Z44<>0,Z44<>\"Unknown\",Z44<>\"Not required\"),IF(COUNTRY_INFO!K44=1,0,IF(COUNTRY_INFO!K44=2,0.2*COUNTRY_INFO!G44/(0.5*COUNTRY_INFO!F44+0.2*COUNTRY_INFO!G44),IF(COUNTRY_INFO!K44=3,COUNTRY_INFO!G44/(COUNTRY_INFO!F44+COUNTRY_INFO!G44)))),0)","v":0.46808479508634454},{"$f":"MAX(COUNTRY_INFO!D44*AK44*PROFILE!$G$7,COUNTRY_INFO!D44*AL44*PROFILE!$G$7)","v":11633.737993480892},{"$f":"MAX(COUNTRY_INFO!D44*AK44*PROFILE!$G$8,COUNTRY_INFO!D44*AL44*PROFILE!$G$8,COUNTRY_INFO!D44*AM44*PROFILE!$G$8)","v":46534.766746914378},{"$f":"MAX(COUNTRY_INFO!D44*AK44*PROFILE!$G$9,COUNTRY_INFO!D44*AL44*PROFILE!$G$9,COUNTRY_INFO!D44*AM44*PROFILE!$G$9,IF(AND(DISTRICT!Z44<>\"Unknown\",Z44<>\"Not required\"),COUNTRY_INFO!O44*DISTRICT!AN44,0))","v":72710.862459255572},{"$f":"MAX(COUNTRY_INFO!D44*AK44*PROFILE!$G$10,COUNTRY_INFO!D44*AL44*PROFILE!$G$10,IF(AND(DISTRICT!Z44<>\"Unknown\",Z44<>\"Not required\"),COUNTRY_INFO!O44*DISTRICT!AO44,0))","v":159963.63280034915},290843,"Y",{"$f":"MAX('MDA2'!J44,'T1'!L44,'T2'!J44,T3_R1!K44,T3_R2!K44)","v":0},{"$f":"MAX('MDA1'!K44,'MDA2'!K44,'MDA3'!I44,'MDA3'!L44,'T1'!M44,'T2'!K44,T3_R1!L44,T3_R2!L44)","v":105439},{"$f":"MAX('MDA1'!L44,'MDA2'!L44,'MDA3'!J44,'MDA3'!M44,'T1'!N44,'T2'!L44,T3_R1!M44,T3_R2!M44)","v":118011},223450,{"$f":"MAX('MDA2'!J44,T44)","v":0},{"$f":"MAX('MDA1'!K44,'MDA2'!K44,'MDA3'!I44,'MDA3'!L44,V44,AD44)","v":105439},{"$f":"MAX('MDA1'!L44,'MDA2'!L44,'MDA3'!J44,'MDA3'!M44,AF44)","v":118011},223450,76.828391950296208]
[{"$f":"IF(COUNTRY_INFO!A45=0,\" \",COUNTRY_INFO!A45)","v":"Guinea"},{"$f":"IF(COUNTRY_INFO!B45=0,\" \",COUNTRY_INFO!B45)","v":"N'Zérékoré"},{"$f":"IF(COUNTRY_INFO!C45=0,\" \",COUNTRY_INFO!C45)","v":"N'Zérékoré"},{"$f":"COUNTRY_INFO!L45","v":0},null,null,{"$f":"MAX('MDA1'!M45,'MDA2'!M45)","v":0},{"$f":"IF(AND(COUNTRY_INFO!H45>0,COUNTRY_INFO!H45<4),IF(D45>MAX('MDA1'!M45,'MDA2'!M45),MAX('MDA1'!M45,'MDA2'!M45),D45),0)","v":0},{"$f":"IF(AND(COUNTRY_INFO!H45>0,COUNTRY_INFO!H45<4), IF(G45/D45*100<>0, IF(G45/D45*100>100,100,G45/D45*100), \"-\"),0)","v":0},{"$f":"COUNTRY_INFO!M45","v":414607},null,0,{"$f":"MAX('MDA1'!M45,MAX('MDA3'!I45,'MDA3'!L45)+MAX('MDA3'!J45,'MDA3'!M45))","v":0},{"$f":"IF(AND(COUNTRY_INFO!I45>0,COUNTRY_INFO!I45<4),IF(J45>MAX('MDA1'!M45,MAX('MDA3'!I45,'MDA3'!L45)+MAX('MDA3'!J45,'MDA3'!M45)),MAX('MDA1'!M45,MAX('MDA3'!I45,'MDA3'!L45)+MAX('MDA3'!J45,'MDA3'!M45)),J45),0)","v":0},{"$f":"IF(AND(COUNTRY_INFO!I45>0,COUNTRY_INFO!I45<4), IF(M45/J45*100<>0, IF(M45/J45*100>100,100,M45/J45*100), \"-\"),0)","v":"-"},{"$f":"COUNTRY_INFO!N45","v":169989},null,null,{"$f":"SUM(MAX('MDA2'!J45, 'T1'!L45, MAX(T3_R1!K45, T3_R2!K45)), MAX('MDA1'!K45, 'MDA2'!K45, 'T1'!M45, MAX(T3_R1!L45, T3_R2!L45)), MAX('MDA1'!L45, 'MDA2'!L45, 'T1'!N45, MAX(T3_R1!M45, T3_R2!M45)))","v":0},{"$f":"IF(AND(COUNTRY_INFO!J45>1,COUNTRY_INFO!J45<4),IF(COUNTRY_INFO!E45>MAX('MDA2'!J45,'T1'!L45,MAX(T3_R1!K45,T3_R2!K45)),MAX('MDA2'!J45,'T1'!L45,MAX(T3_R1!K45,T3_R2!K45)),COUNTRY_INFO!E45),0)","v":0},{"$f":"IF(AND(COUNTRY_INFO!J45>1,COUNTRY_INFO!J45<4), IF(T45/COUNTRY_INFO!E45*100<>0, IF(T45/COUNTRY_INFO!E45*100>100,100,T45/COUNTRY_INFO!E45*100), \"-\"),0)","v":"-"},{"$f":"IF(AND(COUNTRY_INFO!J45>1,COUNTRY_INFO!J45<4),IF(COUNTRY_INFO!F45>MAX('MDA1'!K45,'MDA2'!K45,'T1'!M45,MAX(T3_R1!L45,T3_R2!L45)),MAX('MDA1'!K45,'MDA2'!K45,'T1'!M45,MAX(T3_R1!L45,T3_R2!L45)),COUNTRY_INFO!F45),0)","v":0},{"$f":"IF(AND(COUNTRY_INFO!J45>1,COUNTRY_INFO!J45<4), IF(V45/COUNTRY_INFO!F45*100<>0, IF(V45/COUNTRY_INFO!F45*100>100,100,V45/COUNTRY_INFO!F45*100), \"-\"),0)","v":"-"},0,{"$f":"IF(AND(COUNTRY_INFO!J45>1,COUNTRY_INFO!J45<4), IF(S45/P45*100<>0, IF(X45/P45*100>100,100,X45/P45*100), \"-\"),0)","v":"-"},{"$f":"COUNTRY_INFO!O45","v":331686},null,null,{"$f":"MAX(SUM('T1'!L45:'T1'!N45),SUM('T2'!J45:'T2'!L45))","v":0},{"$f":"IF(COUNTRY_INFO!K45=1,IF(COUNTRY_INFO!F45*0.33>MAX('T1'!M45,'T2'!K45),MAX('T1'!M45,'T2'!K45),COUNTRY_INFO!F45*0.33),IF(COUNTRY_INFO!K45=2,IF(COUNTRY_INFO!F45*0.5>MAX('T1'!M45,'T2'!K45),MAX('T1'!M45,'T2'!K45),COUNTRY_INFO!F45*0.5),IF(COUNTRY_INFO!K45=3,IF(COUNTRY_INFO!F45>MAX('T1'!M45,'T2'!K45),MAX('T1'!M45,'T2'!K45),COUNTRY_INFO!F45),0)))","v":0},{"$f":"IF(AND(COUNTRY_INFO!K45>0,COUNTRY_INFO!K45<4),IF(Z45>0,IF(COUNTRY_INFO!K45=1, AD45/(COUNTRY_INFO!F45*0.33)*100, IF(COUNTRY_INFO!K45=2, AD45/(COUNTRY_INFO!F45*0.5)*100, IF(COUNTRY_INFO!K45=3, AD45/COUNTRY_INFO!F45*100))),\"-\"),0)","v":0},{"$f":"IF(COUNTRY_INFO!K45=2,IF(COUNTRY_INFO!G45*0.2>MAX('T1'!N45,'T2'!L45),MAX('T1'!N45,'T2'!L45),COUNTRY_INFO!G45*0.2),IF(COUNTRY_INFO!K45=3,IF(COUNTRY_INFO!G45>MAX('T1'!N45,'T2'!L45),MAX('T1'!N45,'T2'!L45),COUNTRY_INFO!G45),0))","v":0},{"$f":"IF(AND(COUNTRY_INFO!K45>0,COUNTRY_INFO!K45<4),IF(Z45>0,IF(COUNTRY_INFO!K45=1, 0, IF(COUNTRY_INFO!K45=2, AF45/(COUNTRY_INFO!G45*0.2)*100, IF(COUNTRY_INFO!K45=3, AF45/COUNTRY_INFO!G45*100))),\"-\"),0)","v":0},0,{"$f":"IF(AND(COUNTRY_INFO!K45>0,COUNTRY_INFO!K45<4), IF(AC45/Z45*100<>0, IF(AH45/Z45*100>100,100,AH45/Z45*100), \"-\"),0)","v":"-"},null,{"$f":"IF(AND(D45<>0, D45<>\"Unknown\",D45<>\"Stopped\",D45<>\"Not required\"),D45/COUNTRY_INFO!D45, 0)","v":0},{"$f":"IF(AND(J45<>0,J45<>\"Unknown\",J45<>\"Stopped\",J45<>\"Not required\"),J45/COUNTRY_INFO!D45, 0)","v":1},{"$f":"IF(AND(P45<>0,P45<>\"Unknown\",P45<>\"Not required\"),P45/(COUNTRY_INFO!E45+COUNTRY_INFO!F45), 0)","v":1},{"$f":"IF(AND(Z45<>0,Z45<>\"Unknown\",Z45<>\"Not required\"),IF(COUNTRY_INFO!K45=1,1,IF(COUNTRY_INFO!K45=2,0.5*COUNTRY_INFO!F45/(0.5*COUNTRY_INFO!F45+0.2*COUNTRY_INFO!G45),IF(COUNTRY_INFO!K45=3,COUNTRY_INFO!F45/(COUNTRY_INFO!F45+COUNTRY_INFO!G45)))),0)","v":0.31250037686245424},{"$f":"IF(AND(Z45<>0,Z45<>\"Unknown\",Z45<>\"Not required\"),IF(COUNTRY_INFO!K45=1,0,IF(COUNTRY_INFO!K45=2,0.2*COUNTRY_INFO!G45/(0.5*COUNTRY_INFO!F45+0.2*COUNTRY_INFO!G45),IF(COUNTRY_INFO!K45=3,COUNTRY_INFO!G45/(COUNTRY_INFO!F45+COUNTRY_INFO!G45)))),0)","v":0.68749962313754576},{"$f":"MAX(COUNTRY_INFO!D45*AK45*PROFILE!$G$7,COUNTRY_INFO!D45*AL45*PROFILE!$G$7)","v":16584.305650344457},{"$f":"MAX(COUNTRY_INFO!D45*AK45*PROFILE!$G$8,COUNTRY_INFO!D45*AL45*PROFILE!$G$8,COUNTRY_INFO!D45*AM45*PROFILE!$G$8)","v":66336.958553714314},{"$f":"MAX(COUNTRY_INFO!D45*AK45*PROFILE!$G$9,COUNTRY_INFO!D45*AL45*PROFILE!$G$9,COUNTRY_INFO!D45*AM45*PROFILE!$G$9,IF(AND(DISTRICT!Z45<>\"Unknown\",Z45<>\"Not required\"),COUNTRY_INFO!O45*DISTRICT!AN45,0))","v":103652},{"$f":"MAX(COUNTRY_INFO!D45*AK45*PROFILE!$G$10,COUNTRY_INFO!D45*AL45*PROFILE!$G$10,IF(AND(DISTRICT!Z45<>\"Unknown\",Z45<>\"Not required\"),COUNTRY_INFO!O45*DISTRICT!AO45,0))","v":228034},414607.2642040588,0,{"$f":"MAX('MDA2'!J45,'T1'!L45,'T2'!J45,T3_R1!K45,T3_R2!K45)","v":0},{"$f":"MAX('MDA1'!K45,'MDA2'!K45,'MDA3'!I45,'MDA3'!L45,'T1'!M45,'T2'!K45,T3_R1!L45,T3_R2!L45)","v":0},{"$f":"MAX('MDA1'!L45,'MDA2'!L45,'MDA3'!J45,'MDA3'!M45,'T1'!N45,'T2'!L45,T3_R1!M45,T3_R2!M45)","v":0},0,{"$f":"MAX('MDA2'!J45,T45)","v":0},{"$f":"MAX('MDA1'!K45,'MDA2'!K45,'MDA3'!I45,'MDA3'!L45,V45,AD45)","v":0},{"$f":"MAX('MDA1'!L45,'MDA2'!L45,'MDA3'!J45,'MDA3'!M45,AF45)","v":0},0,0]
[{"$f":"IF(COUNTRY_INFO!A46=0,\" \",COUNTRY_INFO!A46)","v":"Guinea"},{"$f":"IF(COUNTRY_INFO!B46=0,\" \",COUNTRY_INFO!B46)","v":"N'Zérékoré"},{"$f":"IF(COUNTRY_INFO!C46=0,\" \",COUNTRY_INFO!C46)","v":"Yomou"},{"$f":"COUNTRY_INFO!L46","v":0},null,null,{"$f":"MAX('MDA1'!M46,'MDA2'!M46)","v":0},{"$f":"IF(AND(COUNTRY_INFO!H46>0,COUNTRY_INFO!H46<4),IF(D46>MAX('MDA1'!M46,'MDA2'!M46),MAX('MDA1'!M46,'MDA2'!M46),D46),0)","v":0},{"$f":"IF(AND(COUNTRY_INFO!H46>0,COUNTRY_INFO!H46<4), IF(G46/D46*100<>0, IF(G46/D46*100>100,100,G46/D46*100), \"-\"),0)","v":0},{"$f":"COUNTRY_INFO!M46","v":119459},null,0,{"$f":"MAX('MDA1'!M46,MAX('MDA3'!I46,'MDA3'!L46)+MAX('MDA3'!J46,'MDA3'!M46))","v":0},{"$f":"IF(AND(COUNTRY_INFO!I46>0,COUNTRY_INFO!I46<4),IF(J46>MAX('MDA1'!M46,MAX('MDA3'!I46,'MDA3'!L46)+MAX('MDA3'!J46,'MDA3'!M46)),MAX('MDA1'!M46,MAX('MDA3'!I46,'MDA3'!L46)+MAX('MDA3'!J46,'MDA3'!M46)),J46),0)","v":0},{"$f":"IF(AND(COUNTRY_INFO!I46>0,COUNTRY_INFO!I46<4), IF(M46/J46*100<>0, IF(M46/J46*100>100,100,M46/J46*100), \"-\"),0)","v":"-"},{"$f":"COUNTRY_INFO!N46","v":0},null,null,{"$f":"SUM(MAX('MDA2'!J46, 'T1'!L46, MAX(T3_R1!K46, T3_R2!K46)), MAX('MDA1'!K46, 'MDA2'!K46, 'T1'!M46, MAX(T3_R1!L46, T3_R2!L46)), MAX('MDA1'!L46, 'MDA2'!L46, 'T1'!N46, MAX(T3_R1!M46, T3_R2!M46)))","v":0},{"$f":"IF(AND(COUNTRY_INFO!J46>1,COUNTRY_INFO!J46<4),IF(COUNTRY_INFO!E46>MAX('MDA2'!J46,'T1'!L46,MAX(T3_R1!K46,T3_R2!K46)),MAX('MDA2'!J46,'T1'!L46,MAX(T3_R1!K46,T3_R2!K46)),COUNTRY_INFO!E46),0)","v":0},{"$f":"IF(AND(COUNTRY_INFO!J46>1,COUNTRY_INFO!J46<4), IF(T46/COUNTRY_INFO!E46*100<>0, IF(T46/COUNTRY_INFO!E46*100>100,100,T46/COUNTRY_INFO!E46*100), \"-\"),0)","v":0},{"$f":"IF(AND(COUNTRY_INFO!J46>1,COUNTRY_INFO!J46<4),IF(COUNTRY_INFO!F46>MAX('MDA1'!K46,'MDA2'!K46,'T1'!M46,MAX(T3_R1!L46,T3_R2!L46)),MAX('MDA1'!K46,'MDA2'!K46,'T1'!M46,MAX(T3_R1!L46,T3_R2!L46)),COUNTRY_INFO!F46),0)","v":0},{"$f":"IF(AND(COUNTRY_INFO!J46>1,COUNTRY_INFO!J46<4), IF(V46/COUNTRY_INFO!F46*100<>0, IF(V46/COUNTRY_INFO!F46*100>100,100,V46/COUNTRY_INFO!F46*100), \"-\"),0)","v":0},0,{"$f":"IF(AND(COUNTRY_INFO!J46>1,COUNTRY_INFO!J46<4), IF(S46/P46*100<>0, IF(X46/P46*100>100,100,X46/P46*100), \"-\"),0)","v":0},{"$f":"COUNTRY_INFO!O46","v":95567},null,null,{"$f":"MAX(SUM('T1'!L46:'T1'!N46),SUM('T2'!J46:'T2'!L46))","v":0},{"$f":"IF(COUNTRY_INFO!K46=1,IF(COUNTRY_INFO!F46*0.33>MAX('T1'!M46,'T2'!K46),MAX('T1'!M46,'T2'!K46),COUNTRY_INFO!F46*0.33),IF(COUNTRY_INFO!K46=2,IF(COUNTRY_INFO!F46*0.5>MAX('T1'!M46,'T2'!K46),MAX('T1'!M46,'T2'!K46),COUNTRY_INFO!F46*0.5),IF(COUNTRY_INFO!K46=3,IF(COUNTRY_INFO!F46>MAX('T1'!M46,'T2'!K46),MAX('T1'!M46,'T2'!K46),COUNTRY_INFO!F46),0)))","v":0},{"$f":"IF(AND(COUNTRY_INFO!K46>0,COUNTRY_INFO!K46<4),IF(Z46>0,IF(COUNTRY_INFO!K46=1, AD46/(COUNTRY_INFO!F46*0.33)*100, IF(COUNTRY_INFO!K46=2, AD46/(COUNTRY_INFO!F46*0.5)*100, IF(COUNTRY_INFO!K46=3, AD46/COUNTRY_INFO!F46*100))),\"-\"),0)","v":0},{"$f":"IF(COUNTRY_INFO!K46=2,IF(COUNTRY_INFO!G46*0.2>MAX('T1'!N46,'T2'!L46),MAX('T1'!N46,'T2'!L46),COUNTRY_INFO!G46*0.2),IF(COUNTRY_INFO!K46=3,IF(COUNTRY_INFO!G46>MAX('T1'!N46,'T2'!L46),MAX('T1'!N46,'T2'!L46),COUNTRY_INFO!G46),0))","v":0},{"$f":"IF(AND(COUNTRY_INFO!K46>0,COUNTRY_INFO!K46<4),IF(Z46>0,IF(COUNTRY_INFO!K46=1, 0, IF(COUNTRY_INFO!K46=2, AF46/(COUNTRY_INFO!G46*0.2)*100, IF(COUNTRY_INFO!K46=3, AF46/COUNTRY_INFO!G46*100))),\"-\"),0)","v":0},0,{"$f":"IF(AND(COUNTRY_INFO!K46>0,COUNTRY_INFO!K46<4), IF(AC46/Z46*100<>0, IF(AH46/Z46*100>100,100,AH46/Z46*100), \"-\"),0)","v":"-"},null,{"$f":"IF(AND(D46<>0, D46<>\"Unknown\",D46<>\"Stopped\",D46<>\"Not required\"),D46/COUNTRY_INFO!D46, 0)","v":0},{"$f":"IF(AND(J46<>0,J46<>\"Unknown\",J46<>\"Stopped\",J46<>\"Not required\"),J46/COUNTRY_INFO!D46, 0)","v":1},{"$f":"IF(AND(P46<>0,P46<>\"Unknown\",P46<>\"Not required\"),P46/(COUNTRY_INFO!E46+COUNTRY_INFO!F46), 0)","v":0},{"$f":"IF(AND(Z46<>0,Z46<>\"Unknown\",Z46<>\"Not required\"),IF(COUNTRY_INFO!K46=1,1,IF(COUNTRY_INFO!K46=2,0.5*COUNTRY_INFO!F46/(0.5*COUNTRY_INFO!F46+0.2*COUNTRY_INFO!G46),IF(COUNTRY_INFO!K46=3,COUNTRY_INFO!F46/(COUNTRY_INFO!F46+COUNTRY_INFO!G46)))),0)","v":0.31250326995720279},{"$f":"IF(AND(Z46<>0,Z46<>\"Unknown\",Z46<>\"Not required\"),IF(COUNTRY_INFO!K46=1,0,IF(COUNTRY_INFO!K46=2,0.2*COUNTRY_INFO!G46/(0.5*COUNTRY_INFO!F46+0.2*COUNTRY_INFO!G46),IF(COUNTRY_INFO!K46=3,COUNTRY_INFO!G46/(COUNTRY_INFO!F46+COUNTRY_INFO!G46)))),0)","v":0.68749673004279721},{"$f":"MAX(COUNTRY_INFO!D46*AK46*PROFILE!$G$7,COUNTRY_INFO!D46*AL46*PROFILE!$G$7)","v":4778.3673905276519},{"$f":"MAX(COUNTRY_INFO!D46*AK46*PROFILE!$G$8,COUNTRY_INFO!D46*AL46*PROFILE!$G$8,COUNTRY_INFO!D46*AM46*PROFILE!$G$8)","v":19113.393483149484},{"$f":"MAX(COUNTRY_INFO!D46*AK46*PROFILE!$G$9,COUNTRY_INFO!D46*AL46*PROFILE!$G$9,COUNTRY_INFO!D46*AM46*PROFILE!$G$9,IF(AND(DISTRICT!Z46<>\"Unknown\",Z46<>\"Not required\"),COUNTRY_INFO!O46*DISTRICT!AN46,0))","v":29865},{"$f":"MAX(COUNTRY_INFO!D46*AK46*PROFILE!$G$10,COUNTRY_INFO!D46*AL46*PROFILE!$G$10,IF(AND(DISTRICT!Z46<>\"Unknown\",Z46<>\"Not required\"),COUNTRY_INFO!O46*DISTRICT!AO46,0))","v":65702.442935525032},119459.20380920217,0,{"$f":"MAX('MDA2'!J46,'T1'!L46,'T2'!J46,T3_R1!K46,T3_R2!K46)","v":0},{"$f":"MAX('MDA1'!K46,'MDA2'!K46,'MDA3'!I46,'MDA3'!L46,'T1'!M46,'T2'!K46,T3_R1!L46,T3_R2!L46)","v":0},{"$f":"MAX('MDA1'!L46,'MDA2'!L46,'MDA3'!J46,'MDA3'!M46,'T1'!N46,'T2'!L46,T3_R1!M46,T3_R2!M46)","v":0},0,{"$f":"MAX('MDA2'!J46,T46)","v":0},{"$f":"MAX('MDA1'!K46,'MDA2'!K46,'MDA3'!I46,'MDA3'!L46,V46,AD46)","v":0},{"$f":"MAX('MDA1'!L46,'MDA2'!L46,'MDA3'!J46,'MDA3'!M46,AF46)","v":0},0,0]

{"sheet":"SUMMARY","index":10,"n_rows":70,"n_cols":8,"rows_kept":70,"cut":false,"hidden":false,"merged":[[15,1,15,3],[0,1,0,5],[1,1,1,7],[5,1,11,7],[3,3,3,5],[32,1,32,2],[33,1,33,2],[34,1,34,2],[35,1,35,2],[23,1,23,5],[31,1,31,2],[24,1,24,5],[25,1,25,5],[26,1,26,5],[27,1,27,5],[69,1,69,2],[36,1,36,2],[37,1,37,2],[38,1,38,2],[66,1,66,7],[62,1,62,2],[54,1,60,7],[68,1,68,2],[63,3,64,7],[49,1,49,7],[62,3,62,7],[50,3,50,4]]}
[]
[null,"PC Joint Reporting Form v.3"]
[]
[null,"Country",null,{"$f":"IF(INTRO!$E$34<>0,INTRO!$E$34,\" \")","v":"Guinea"},null,null,"Year",{"$f":"IF(INTRO!$E$36<>0,INTRO!$E$36,\" \")","v":2016}]
[]
[null,"National authorities are requested to complete the Joint Reporting Form (JRF) for submission to the World Health Organization any time before 15 August of the current year for reporting data on PC interventions implemented during the previous year."]
[]
[]
[]
[]
[]
[]
[]
[null,"Number of people received treatment (at least once) for the diseases"]
[]
[null,null,null,null,"PreSAC","SAC","Adults","Total"]
[null,"Lymphatic filariasis",null,null,"Not eligible",2497549,3138417,{"$f":"SUM(E17:G17)","v":5635966}]
[null,"Onchocerciasis",null,null,"Not eligible",2514974,3190691,{"$f":"SUM(E18:G18)","v":5705665}]
[null,"Soil-transmitted helminthiases",null,null,0,2497549,3138417,{"$f":"SUM(E19:G19)","v":5635966}]
[null,"Schistosomiasis",null,null,"Not targeted",1147335,0,{"$f":"SUM(E20:G20)","v":1147335}]
[]
[null,"Coverage of PC interventions for the diseases (%)"]
[]
[null,null,null,null,null,null,"Geographical","National"]
[null,"Lymphatic filariasis",null,null,null,null,100,78.696814225945275]
[null,"Onchocerciasis",null,null,null,null,87.5,69.969278600069131]
[null,"Soil-transmitted helminthiases",null,null,null,null,88.235294117647058,53.836091118736675]
[null,"Schistosomiasis",null,null,null,null,48.387096774193552,21.683823076901874]
[]
[null,"Number of people treated and programme coverage (%) by PC interventions"]
[]
[null,null,null,"PreSAC","SAC","Adults","Total","Coverage (%)"]
[null,"MDA 1 (IVM+ALB)",null,"Not eligible",{"$f":"'MDA1'!$K$4","v":2497549},{"$f":"'MDA1'!$L$4","v":3138417},{"$f":"'MDA1'!$M$4","v":5635966},{"$f":"'MDA1'!$Q$4","v":98.370952537125405}]
[null,"MDA 2 (DEC+ALB)",null,{"$f":"'MDA2'!$J$4","v":0},{"$f":"'MDA2'!$K$4","v":0},{"$f":"'MDA2'!$L$4","v":0},{"$f":"'MDA2'!$M$4","v":0},{"$f":"'MDA2'!$Q$4","v":" "}]
[null,"MDA 3 (IVM)",null,"Not eligible",{"$f":"'MDA3'!$O$4","v":17425},{"$f":"'MDA3'!$P$4","v":52274},{"$f":"'MDA3'!$Q$4","v":69699},{"$f":"'MDA3'!$T$4","v":10.652322759312129}]
[null,"T 1 (PZQ+ALB/MBD)",null,{"$f":"IF('T1'!$L$4<>0,'T1'!$L$4,\"Not targeted\")","v":"Not targeted"},{"$f":"'T1'!$M$4","v":0},{"$f":"IF('T1'!$N$4<>0,'T1'!$N$4,\"Not targeted\")","v":"Not targeted"},{"$f":"'T1'!$O$4","v":0},{"$f":"'T1'!$S$4","v":" "}]
[null,"T 2 (PZQ)",null,{"$f":"IF('T2'!$J$4<>0,'T2'!$J$4,\"Not targeted\")","v":"Not targeted"},{"$f":"'T2'!$K$4","v":1147335},{"$f":"'T2'!$L$4","v":0},{"$f":"'T2'!$M$4","v":1147335},{"$f":"'T2'!$Q$4","v":92.465645785095859}]
[null,"T 3 (ALB/MBD) - round 1",null,{"$f":"T3_R1!$K$4","v":0},{"$f":"T3_R1!$L$4","v":0},{"$f":"IF(T3_R1!$M$4<>0,T3_R1!$M$4,\"Not targeted\")","v":"Not targeted"},{"$f":"T3_R1!$N$4","v":0},{"$f":"T3_R1!$R$4","v":"-"}]
[null,"T 3 (ALB/MBD) - round 2",null,{"$f":"T3_R2!$K$4","v":0},{"$f":"T3_R2!$L$4","v":0},{"$f":"IF(T3_R2!$M$4<>0,T3_R2!$M$4,\"Not targeted\")","v":"Not targeted"},{"$f":"T3_R2!$N$4","v":0},{"$f":"T3_R2!$R$4","v":" "}]
[]
[null,"Inventory of PC medicines in the country"]
[]
[null,null,"IVM","DEC","ALB (LF)","ALB (STH)","MBD","PZQ"]
[null,"Available"]
[null,"Distributed"]
[null,"Wasted"]
[null,"Received"]
[null,"Remaining",{"$f":"C44-C45-C46+C47","v":0},0,0,0,0,0]
[]
[null,"Please indicate the medicine has been used to treat PreSAC for STH and delivery channels"]
[null,"PC medicine",null,"Delivery channels",null,null,"Source"]
[]
[null,"Additional information"]
[]
[null,"Il reste 4 DS à traiter en Octobre 2016 à l'IVM par la stratégie du TIDC (Koubia, N'Zérékoré, Lola et Yomou. Ces DS sont endémiques à l'onchocercose mais pas à la filariose lymphatique. Nous devons traiter aussi 11 DS avec du PZQ et 2 DS avec PZQ+ALB en Octobre 2016. Il n'y a pas eu de traitement de masse pour les EAPréS"]
[]
[]
[]
[]
[]
[]
[]
[null,"Name and signature of NTD coordinator or Ministry of Health representative:",null,"GOEPOGUI ANDRE"]
[null,null,null,"2017-04-15"]
[null,"Date:"]
[]
[null,"Please send the national report (signed and in electronic format) to the concerned WR with copy to:"]
[]
[null,"WHO headquarters",null,"PC_JointForms@who.int"]
[null,"WHO Regional Office",null,"Regional Advisor for NTD"]

{"sheet":"PROFILE","index":11,"n_rows":122,"n_cols":8,"rows_kept":122,"cut":false,"hidden":true,"merged":[[12,1,12,6],[44,1,44,3],[48,1,48,3],[52,1,52,3],[62,1,62,3],[26,1,26,3],[18,1,18,6],[13,1,13,6],[15,1,15,6],[14,1,14,6],[60,1,60,3],[0,1,0,5],[1,1,1,7],[3,3,3,5],[66,1,66,3],[70,1,70,3],[23,1,23,3],[24,1,24,3],[25,1,25,3],[56,1,56,3],[5,3,5,5],[27,1,27,3],[31,1,31,3],[39,1,39,3],[6,1,6,2],[7,1,7,2],[8,1,8,2],[9,1,9,2],[4,1,4,7],[5,1,5,2],[77,1,77,3],[16,1,16,6],[9,3,9,5],[40,1,40,3],[74,1,74,3],[76,1,76,3],[6,3,6,5],[7,3,7,5],[8,3,8,5],[75,1,75,3],[20,1,20,3],[11,1,11,6],[17,1,17,6],[121,1,122,7],[81,6,81,7],[83,6,83,7],[85,6,85,7],[82,6,82,7],[84,6,84,7]]}
[]
[null,"PC Joint Reporting Form v.3 - Country Profile"]
[]
[null,"Country",null,{"$f":"IF(INTRO!$E$34<>0,INTRO!$E$34,\" \")","v":"Guinea"},null,null,"Year",{"$f":"IF(INTRO!$E$36<>0,INTRO!$E$36,\" \")","v":2016}]
[null,"!!! WARNING !!!\nBefore analysing data in the country profile please be ensure that your report in the SUMMARY tab is updated"]
[null,"Total population",null,null,null,null,1,{"$f":"COUNTRY_INFO!D4","v":10991383}]
[null,"Population — other age groups",null,null,null,null,{"$f":"IF($H$6<>0,H7/$H$6,0)","v":4.0000061866645897E-2},{"$f":"H6-SUM(H8:H10)","v":439656}]
[null,"Population — Pre-SAC",null,{"$f":"INTRO!B48","v":"1-4 years age"},null,null,{"$f":"IF($H$6<>0,H8/$H$6,0)","v":0.15999961060405229},{"$f":"COUNTRY_INFO!E4","v":1758617}]
[null,"Population — SAC",null,{"$f":"INTRO!B49","v":"5-14 years age"},null,null,{"$f":"IF($H$6<>0,H9/$H$6,0)","v":0.25000038666653684},{"$f":"COUNTRY_INFO!F4","v":2747850}]
[null,"Population — Adults",null,{"$f":"INTRO!B50","v":"15 years +"},null,null,0.54999994086276494,{"$f":"COUNTRY_INFO!G4","v":6045260}]
[]
[null,"Total number of people requiring PC for at least one disease (LF, ONCHO, STH, SCH)",null,null,null,null,null,{"$f":"DISTRICT!AT6","v":8390400.485220816}]
[null,"Proportion of total number of people requiring PC for at least one disease out of total population",null,null,null,null,null,{"$f":"IF(H6<>0,H12/H6,0)","v":0.76336167024848611}]
[null,"Total number of people received PC for at least one disease (LF, ONCHO, STH, SCH)",null,null,null,null,null,{"$f":"DISTRICT!AY6","v":5714110}]
[null,"Total number of people in need who received PC for at least one disease (LF, ONCHO, STH, SCH)",null,null,null,null,null,{"$f":"DISTRICT!BC6","v":5705665}]
[null,"Coverage of PC for at least one disease (LF, ONCHO, STH, SCH)",null,null,null,null,null,{"$f":"DISTRICT!BD6","v":0.68002296315297284}]
[null,"Number of IUs received treatment for all diseases requiring PC in those IUs",null,null,null,null,null,{"$f":"DISTRICT!AU6","v":18}]
[null,"Population requring PC in IUs which received treatment for all diseases in need of PC",null,null,null,null,null,{"$f":"SUMIF(DISTRICT!AU9:AU1000,\"Y\",DISTRICT!AT9:AT1000)","v":4945005.6875991849}]
[null,"Population received PC in IUs which were treated for all diseases in need of PC",null,null,null,null,null,{"$f":"SUMIF(DISTRICT!AU9:AU1000,\"Y\",DISTRICT!AY9:AY1000)","v":3875221}]
[]
[null,null,null,null,"LF","ONCHO","STH","SCH"]
[]
[null,"Diseases requiring PC in the country",null,null,{"$f":"IF(INTRO!E38=\"Endemic\",\"Yes\",\"No\")","v":"Yes"},{"$f":"IF(INTRO!E40=\"Endemic\",\"Yes\",\"No\")","v":"Yes"},{"$f":"IF(INTRO!E42=\"Endemic\",\"Yes\",\"No\")","v":"Yes"},{"$f":"IF(INTRO!E44=\"Endemic\",\"Yes\",\"No\")","v":"Yes"}]
[null,"Number of implementation units (IUs) in the country",null,null,{"$f":"IF(E23=\"Yes\",INTRO!$E$46,\"-\")","v":38},{"$f":"IF(F23=\"Yes\",INTRO!$E$46,\"-\")","v":38},{"$f":"IF(G23=\"Yes\",INTRO!$E$46,\"-\")","v":38},{"$f":"IF(H23=\"Yes\",INTRO!$E$46,\"-\")","v":38}]
[null,"Number of IUs with endemicity status known",null,null,{"$f":"IF(E23=\"Yes\",E24-E26,\"-\")","v":38},{"$f":"IF(F23=\"Yes\",F24-F26,\"-\")","v":38},{"$f":"IF(G23=\"Yes\",G24-G26,\"-\")","v":38},{"$f":"IF(H23=\"Yes\",H24-H26,\"-\")","v":38}]
[null,"Number of IUs with endemicity status unknown",null,null,{"$f":"IF(E23=\"Yes\",E24-(992-COUNTIF(COUNTRY_INFO!H$9:H$1000,\"\"))+COUNTIF(COUNTRY_INFO!H$9:H$1000,\"=4\"),\"-\")","v":0},{"$f":"IF(F23=\"Yes\",F24-(992-COUNTIF(COUNTRY_INFO!I$9:I$1000,\"\"))+COUNTIF(COUNTRY_INFO!I$9:I$1000,\"=4\"),\"-\")","v":0},{"$f":"IF(G23=\"Yes\",G24-(992-COUNTIF(COUNTRY_INFO!J$9:J$1000,\"\"))+COUNTIF(COUNTRY_INFO!J$9:J$1000,\"=4\")+COUNTIF(COUNTRY_INFO!J$9:J$1000,\"=5\"),\"-\")","v":0},{"$f":"IF(H23=\"Yes\",H24-(992-COUNTIF(COUNTRY_INFO!K$9:K$1000,\"\"))+COUNTIF(COUNTRY_INFO!K$9:K$1000,\"=4\")+COUNTIF(COUNTRY_INFO!K$9:K$1000,\"=5\"),\"-\")","v":0}]
[null,"Number of non-endemic IUs",null,null,{"$f":"IF(E23=\"Yes\",COUNTIF(COUNTRY_INFO!H$9:H$1000,\"=0\"),\"-\")","v":14},{"$f":"IF(F23=\"Yes\",COUNTIF(COUNTRY_INFO!I$9:I$1000,\"=0\"),\"-\")","v":14},{"$f":"IF(G23=\"Yes\",COUNTIF(COUNTRY_INFO!J$9:J$1000,\"=0\"),\"-\")","v":0},{"$f":"IF(H23=\"Yes\",COUNTIF(COUNTRY_INFO!K$9:K$1000,\"=0\"),\"-\")","v":7}]
[null,"Number of IUs requiring PC (total)",null,null,{"$f":"COUNTIF(COUNTRY_INFO!H$9:H$1000,\"=1\")","v":24},{"$f":"COUNTIF(COUNTRY_INFO!I$9:I$1000,\"=1\")","v":24},{"$f":"SUM(G30:G31)","v":17},{"$f":"SUM(H29:H31)","v":31}]
[null,null,null,"low prevalence",null,null,{"$f":"COUNTIF(COUNTRY_INFO!J$9:J$1000,\"=1\")","v":21},{"$f":"COUNTIF(COUNTRY_INFO!K$9:K$1000,\"=1\")","v":10}]
[null,null,null,"moderate prevalence",null,null,{"$f":"COUNTIF(COUNTRY_INFO!J$9:J$1000,\"=2\")","v":9},{"$f":"COUNTIF(COUNTRY_INFO!K$9:K$1000,\"=2\")","v":9}]
[null,null,null,"high prevalence",null,null,{"$f":"COUNTIF(COUNTRY_INFO!J$9:J$1000,\"=3\")","v":8},{"$f":"COUNTIF(COUNTRY_INFO!K$9:K$1000,\"=3\")","v":12}]
[null,"Population requiring PC in the country (total)",null,null,{"$f":"COUNTRY_INFO!L4","v":7161619},{"$f":"COUNTRY_INFO!M4","v":6781592},{"$f":"COUNTRY_INFO!N4","v":2079265},{"$f":"COUNTRY_INFO!O4","v":3678502.62}]
[null,null,"Pre-SAC","moderate prevalence",null,null,{"$f":"SUMIF(COUNTRY_INFO!J$9:J$1000,\"=2\",COUNTRY_INFO!E$9:E$1000)","v":433391}]
[null,null,null,"high prevalence",null,null,{"$f":"SUMIF(COUNTRY_INFO!J$9:J$1000,\"=3\",COUNTRY_INFO!E$9:E$1000)","v":378029}]
[null,null,"SAC","low prevalence",null,null,null,{"$f":"SUMIF(COUNTRY_INFO!K$9:K$1000,\"=1\",COUNTRY_INFO!F$9:F$1000)*0.33","v":240657.12000000002}]
[null,null,null,"moderate prevalence",null,null,{"$f":"SUMIF(COUNTRY_INFO!J$9:J$1000,\"=2\",COUNTRY_INFO!F$9:F$1000)","v":677173},{"$f":"SUMIF(COUNTRY_INFO!K$9:K$1000,\"=2\",COUNTRY_INFO!F$9:F$1000)*0.5","v":466884.5}]
[null,null,null,"high prevalence",null,null,{"$f":"SUMIF(COUNTRY_INFO!J$9:J$1000,\"=3\",COUNTRY_INFO!F$9:F$1000)","v":590672},{"$f":"SUMIF(COUNTRY_INFO!K$9:K$1000,\"=3\",COUNTRY_INFO!F$9:F$1000)","v":800033}]
[null,null,"Adults","moderate prevalence",null,null,null,{"$f":"SUMIF(COUNTRY_INFO!K$9:K$1000,\"=2\",COUNTRY_INFO!G$9:G$1000)*0.2","v":410858}]
[null,null,null,"high prevalence",null,null,null,{"$f":"SUMIF(COUNTRY_INFO!K$9:K$1000,\"=3\",COUNTRY_INFO!G$9:G$1000)","v":1760070}]
[null,"Number of IUs where PC was implemented (total)",null,null,{"$f":"COUNTIF(DISTRICT!G$9:G$1000,\">0\")","v":24},{"$f":"COUNTIF(DISTRICT!M$9:M$1000,\">0\")","v":25},{"$f":"COUNTIF(DISTRICT!S$9:S$1000,\">0\")","v":24},{"$f":"COUNTIF(DISTRICT!AC$9:AC$1000,\">0\")","v":15}]
[null,"Number of IUs in need where PC was implemented (total)",null,null,{"$f":"COUNTIF(DISTRICT!H$9:H$1000,\">0\")","v":24},{"$f":"COUNTIF(DISTRICT!N$9:N$1000,\">0\")","v":21},{"$f":"COUNTIF(DISTRICT!X$9:X$1000,\">0\")","v":15},{"$f":"COUNTIF(DISTRICT!AH$9:AH$1000,\">0\")","v":15}]
[null,null,"Pre-SAC",null,null,null,{"$f":"COUNTIF(DISTRICT!T$9:T$1000,\">0\")","v":0}]
[null,null,"SAC",null,null,null,{"$f":"COUNTIF(DISTRICT!V$9:V$1000,\">0\")","v":15},{"$f":"COUNTIF(DISTRICT!AD$9:AD$1000,\">0\")","v":15}]
[null,null,"Adults",null,null,null,null,{"$f":"COUNTIF(DISTRICT!AF$9:AF$1000,\">0\")","v":0}]
[null,"Number of individuals treated (total)",null,null,{"$f":"DISTRICT!G4","v":5635966},{"$f":"DISTRICT!M4","v":5705665},{"$f":"DISTRICT!S4","v":5635966},{"$f":"DISTRICT!AC4","v":1147335}]
[null,null,"Pre-SAC",null,{"$f":"SUMMARY!$E17","v":"Not eligible"},{"$f":"SUMMARY!$E18","v":"Not eligible"},{"$f":"SUMMARY!$E19","v":0},{"$f":"SUMMARY!$E20","v":"Not targeted"}]
[null,null,"SAC",null,{"$f":"SUMMARY!$F17","v":2497549},{"$f":"SUMMARY!$F18","v":2514974},{"$f":"SUMMARY!$F19","v":2497549},{"$f":"SUMMARY!$F20","v":1147335}]
[null,null,"Adults",null,{"$f":"SUMMARY!$G17","v":3138417},{"$f":"SUMMARY!$G18","v":3190691},{"$f":"SUMMARY!$G19","v":3138417},{"$f":"SUMMARY!$G20","v":0}]
[null,"Number of individuals in need treated (total)",null,null,{"$f":"DISTRICT!H4","v":5635966},{"$f":"DISTRICT!N4","v":4745031},{"$f":"DISTRICT!X4","v":1119395},{"$f":"DISTRICT!AH4","v":797640}]
[null,null,"Pre-SAC",null,null,null,{"$f":"DISTRICT!T4","v":0}]
[null,null,"SAC",null,null,null,{"$f":"DISTRICT!V4","v":1119395},{"$f":"DISTRICT!AD4","v":797640}]
[null,null,"Adults",null,null,null,null,{"$f":"DISTRICT!AF4","v":0}]
[null,"Geographical coverage (all ages)",null,null,{"$f":"IF(E28<>0,E41/E28,0)","v":1},{"$f":"IF(F28<>0,F41/F28,0)","v":0.875},{"$f":"IF(G28<>0,G41/G28,0)","v":0.88235294117647056},{"$f":"IF(H28<>0,H41/H28,0)","v":0.4838709677419355}]
[null,null,"Pre-SAC",null,null,null,{"$f":"IF(G28<>0,G42/G28,0)","v":0}]
[null,null,"SAC",null,null,null,{"$f":"IF(G28<>0,G43/G28,0)","v":0.88235294117647056},{"$f":"IF(H28<>0,H43/H28,0)","v":0.4838709677419355}]
[null,null,"Adults",null,null,null,null,{"$f":"IF(SUM(H30:H31)<>0,H44/SUM(H30:H31),0)","v":0}]
[null,"National coverage (total)",null,null,{"$f":"IF(E32<>0,E49/E32,0)","v":0.78696814225945277},{"$f":"IF(F32<>0,F49/F32,0)","v":0.69969278600069129},{"$f":"IF(G32<>0,G49/G32,0)","v":0.53836091118736673},{"$f":"IF(H32<>0,H49/H32,0)","v":0.21683823076901873}]
[null,null,"Pre-SAC",null,null,null,{"$f":"IF(SUM(G33:G34)<>0,G50/SUM(G33:G34),0)","v":0}]
[null,null,"SAC",null,null,null,{"$f":"IF(SUM(G36:G37)<>0,G51/SUM(G36:G37),0)","v":0.88291155464587545},{"$f":"IF(SUM(H35:H37)<>0,H51/SUM(H35:H37),0)","v":0.52908823843160746}]
[null,null,"Adults",null,null,null,null,{"$f":"IF(SUM(H38:H39)<>0,H52/SUM(H38:H39),0)","v":0}]
[null,null,null,null,"LF","ONCHO","STH","SCH"]
[]
[null,"Number of IUs achieved effective coverage (all ages)",null,null,{"$f":"COUNTIF(DISTRICT!I$9:I$1000,\">=65\")","v":24},{"$f":"COUNTIF(DISTRICT!O$9:O$1000,\">=65\")","v":21},{"$f":"COUNTIF(DISTRICT!Y$9:Y$1000,\">=75\")","v":0},{"$f":"COUNTIF(DISTRICT!AI$9:AI$1000,\">=75\")","v":0}]
[null,null,"Pre-SAC",null,null,null,{"$f":"COUNTIF(DISTRICT!U$9:U$1000,\">=75\")","v":0}]
[null,null,"SAC",null,null,null,{"$f":"COUNTIF(DISTRICT!W$9:W$1000,\">=75\")","v":15},{"$f":"COUNTIF(DISTRICT!AE$9:AE$1000,\">=75\")","v":15}]
[null,null,"Adults",null,null,null,null,{"$f":"COUNTIF(DISTRICT!AG$9:AG$1000,\">=75\")","v":0}]
[null,"Number of individuals in need treated in IUs achieved effective coverage (total)",null,null,{"$f":"SUMIF(DISTRICT!I9:I1000,\">=65\",DISTRICT!H9:H1000)","v":5635966},{"$f":"SUMIF(DISTRICT!O9:O1000,\">=65\",DISTRICT!N9:N1000)","v":4745031},{"$f":"SUMIF(DISTRICT!Y9:Y1000,\">=75\",DISTRICT!X9:X1000)","v":0},{"$f":"SUMIF(DISTRICT!AI9:AI1000,\">=75\",DISTRICT!AH9:AH1000)","v":0}]
[null,null,"Pre-SAC",null,null,null,{"$f":"SUMIF(DISTRICT!U9:U1000,\">=75\",DISTRICT!T9:T1000)","v":0}]
[null,null,"SAC",null,null,null,{"$f":"SUMIF(DISTRICT!W9:W1000,\">=75\",DISTRICT!V9:V1000)","v":1119395},{"$f":"SUMIF(DISTRICT!AE9:AE1000,\">=75\",DISTRICT!AD9:AD1000)","v":797640}]
[null,null,"Adults",null,null,null,null,{"$f":"SUMIF(DISTRICT!AG9:AG1000,\">=75\",DISTRICT!AF9:AF1000)","v":0}]
[null,"Proportion of IUs requiring PC and achieved effective coverage (total)",null,null,{"$f":"IF(E41<>0,E63/E41,0)","v":1},{"$f":"IF(F41<>0,F63/F41,0)","v":1},{"$f":"IF(G41<>0,G63/G41,0)","v":0},{"$f":"IF(H41<>0,H63/H41,0)","v":0}]
[null,null,"Pre-SAC",null,null,null,{"$f":"IF(G42<>0,G64/G42,0)","v":0}]
[null,null,"SAC",null,null,null,{"$f":"IF(G43<>0,G65/G43,0)","v":1},{"$f":"IF(H43<>0,H65/H43,0)","v":1}]
[null,null,"Adults",null,null,null,null,{"$f":"IF(H44<>0,H66/H44,0)","v":0}]
[null,"Number of implementation units where PC was stopped (i.e. under surveillance)",null,null,{"$f":"COUNTIF(COUNTRY_INFO!H$9:H$1000,\"=99\")","v":0},{"$f":"COUNTIF(COUNTRY_INFO!I$9:I$1000,\"=99\")","v":0}]
[null,"Number of individuals in IUs no longer requiring PC (stopped)",null,null,{"$f":"SUMIF(COUNTRY_INFO!H$9:H$1000,\"=99\",COUNTRY_INFO!D$9:D$1000)","v":0},{"$f":"SUMIF(COUNTRY_INFO!I$9:I$1000,\"=99\",COUNTRY_INFO!D$9:D$1000)","v":0}]
[null,"Number of individuals living in IUs not targeted with PC (total)",null,null,{"$f":"SUMIF(DISTRICT!H$9:H$1000,\"=0\",DISTRICT!D$9:D$1000)","v":0},{"$f":"SUMIF(DISTRICT!N$9:N$1000,\"=0\",DISTRICT!J$9:J$1000)","v":713259},{"$f":"SUMIF(DISTRICT!X$9:X$1000,\"=0\",DISTRICT!P$9:P$1000)","v":243458},{"$f":"SUMIF(DISTRICT!AH$9:AH$1000,\"=0\",DISTRICT!Z$9:Z$1000)","v":1502458.42}]
[null,null,null,null,{"$f":"E32-E49","v":1525653},{"$f":"F32-F49","v":2036561},959870,2880862.62]
[null,"Number of IUs requiring and receiving PC",null,null,{"$f":"E28-E41","v":0},{"$f":"F28-F41","v":3},2,16]
[null,null,null,null,{"$f":"E24-E28-E26","v":14},14,21,{"$f":"H24-H28-H26","v":7}]
[]
[null,null,null,null,null,null,"Requiring and receiving PC"]
[null,null,null,null,null,null,"Requiring and not receiving PC"]
[null,null,null,null,null,null,"Not requiring PC"]
[null,null,null,null,null,null,"Status unknown"]
[]
[]
[]
[]
[]
[]
[]
[]
[]
[]
[]
[]
[]
[]
[]
[]
[]
[]
[]
[]
[]
[]
[]
[]
[]
[]
[]
[]
[]
[]
[]
[]
[]
[]
[]
[]
[null,"Click here to access data Preventive Chemotherapy Data Portal"]