{"text_format":"1","workbook":"xlsx","n_sheets":13,"sheets":["INTRO","COUNTRY_INFO","MDA1","MDA4","MDA3","T1","T2","T3_R1","T3_R2","DISTRICT","SUMMARY","PROFILE","DATA_POLICY"],"not_rendered":{"charts":8,"images":3,"macros":1,"external_links":0,"defined_names":5,"comments":11,"pivot_tables":0},"unopened":[],"bounds":{"document_bytes":16777216,"sheet_cells":100000,"rows_first":2000,"rows_last":500,"rows_between":2000,"halvings":0,"cell_chars":16384,"cell_head_chars":4096},"cells_cut":0,"cells_raw":0,"read":"whole","date_system":"1900"}

{"sheet":"INTRO","index":0,"n_rows":50,"n_cols":5,"rows_kept":50,"cut":false,"hidden":false,"merged":[[0,2,0,4],[7,2,7,4],[8,2,8,4],[1,1,1,4],[2,1,2,4],[3,1,3,4],[4,1,4,4],[5,1,5,4],[9,2,9,4],[11,2,11,4],[12,1,12,4],[13,1,13,4],[14,1,14,4],[22,1,22,4],[23,2,24,4],[25,1,25,4],[15,1,15,4],[16,1,16,4],[17,1,17,4],[18,1,18,4],[19,2,19,4],[45,1,45,2],[10,2,10,4],[41,1,41,2],[43,1,43,2],[46,1,46,4],[33,1,33,2],[35,1,35,2],[26,2,27,4],[37,1,37,2],[39,1,39,2],[28,1,28,4],[29,2,29,4],[30,1,30,4],[31,1,31,4],[20,1,20,4],[21,2,21,4]]}
[null,null,"Cette version sera utilisée par les pays endémiques à la Loase"]
[null,"Formulaire de Rapport Commun v.3.1 (L)"]
[]
[null,"Le but de ce formulaire de rapport commun - disponible sous forme de fichier Excel - est de mettre à disposition des autorités sanitaires nationales et des gestionnaires de données un outil standardisé qui réponde aux défis, facilite l'intégration et par conséquent contribue à améliorer la gestion de programme. Ce formulaire tend à standardiser le rapport de résultats des programmes nationaux, améliore la disponibilité et la coordination des données de chimioprévention à travers les Bureaux des Régions de l'Organisation mondiale de la Santé. \nLes autorités nationales sont priées de compléter ce formulaire et de le soumettre à l'Organisation mondiale de la Santé avant le 15 août de l'année en cours pour rapporter les données des activités de chimioprévention mises en oeuvre l'année précédente."]
[]
[null,"Structure de l'application (feuilles de travail) :"]
[]
[null,"INTRO","Cette feuille contient des instructions pour compléter le formulaire de rapport commun et des informations sur le statut de la chimioprévention pour les maladies d'endémie du pays. "]
[null,"COUNTRY_INFO","Cette feuille contient des informations sur la structure administrative du pays, la population par groupe d'âge, le statut d'endémicité pour chaque maladie, la population devant être traitée par chimioprévention, les interventions prévues et les interventions mises en oeuvre. "]
[null,"MDA1, MDA2, MDA3, T1, T2 et T3","Ces feuilles contiennent des informations sur l'endémicité des districts ciblés pour le traitement aux médicaments spécifiques pour la chimioprévention, les plans de traitement, et le nombre de personnes traitées par groupe d'âge. "]
[null,"DISTRICT","Cette feuille contient un résumé sur les personnes traitées, par maladie, au niveau de mise en oeuvre. Si les données par genre (sexe) sont disponibles, merci de les saisir.  "]
[null,"SUMMARY","Cette feuille contient un résumé sur les personnes traitées, par maladie et par type d'intervention de chimioprévention. Avant de générer le rapport (exécuter macro), veuillez sélectionner la maladie pour laquelle vous souhaitez un rapport. Veuillez suivre le même processus pour générer les divers rapports. \nCette feuille doit être imprimée et soumise comme formulaire de rapport commun (voir les instructions pour la soumission du formulaire sous la feuille SUMMARY). "]
[]
[null,"Instructions pour la saisie des données"]
[]
[null,"La plupart des cellules des feuilles de travail mentionnées ci-dessus contiennent des formules calculées automatiquement en fonction du protocole de traitement recommandé par l'OMS pour chaque maladie.\nVoir : http://www.who.int/neglected_diseases/preventive_chemotherapy/pct_manual/en/index.html"]
[]
[null,"Veuillez entrer vos données dans les cellules en fonction de leur code de couleur :"]
[]
[null,null,"Blanc - la cellule n'est pas protégée. Veuillez entrer la valeur de l'indicateur demandé."]
[]
[null,null,"Jaune - la cellule est protégée et inclut le nom de l'indicateur. Aucune entrée de données requise."]
[]
[null,null,"Orange - la cellule n'est pas protégée et contient un menu déroulant. Veuillez sélectionner la valeur dans le menu déroulant. "]
[]
[]
[null,null,"Vert - la cellule n'est pas protégée et contient des formules. Veuillez changer la valeur indiquée uniquement si vos données sont différentes de celles calculées automatiquement.  "]
[]
[]
[null,null,"Bleu - la cellule est protégée et contient des formules. Aucune entrée de données requise. "]
[]
[null,"Données pays"]
[]
[null,"PAYS",null,null,"Gabon"]
[]
[null,"Année de rapport des données",null,null,2018]
[]
[null,"Le pays est-il endémique à la filariose lymphatique (FL) ?",null,null,"Endémique"]
[]
[null,"Le pays est-il endémique à l'onchocercose (ONCHO) ? ",null,null,"Endémique"]
[]
[null,"Le pays est-il endémique aux géohelminthiases (STH) ?",null,null,"Endémique"]
[]
[null,"Le pays est-il endémique à la schistosomiase (SCH) ?",null,null,"Endémique"]
[]
[null,"Combien d'unités administratives compte le pays ?",null,null,51]
[null,"Si les données démographiques par groupe d'âge ne sont pas disponibles au second niveau administratif, veuillez entrer la proportion (%) de population, par groupe d'âge, du pays. Si les données sont disponibles, veuillez laisser les cellules vierges."]
[null,"1-4 ans","Enfants d'âge pré-scolaire (EAPréS)",null,0.12]
[null,"5-14 ans","Enfants d'âge scolaire (EAS)",null,0.23250000000000001]
[null,"15 ans et plus","Adultes",null,0.59]

{"sheet":"COUNTRY_INFO","index":1,"n_rows":59,"n_cols":24,"rows_kept":59,"cut":false,"hidden":false,"merged":[[3,0,3,2],[3,7,3,11],[3,20,3,21],[5,0,5,2],[3,16,3,19],[5,16,5,19],[5,3,5,6],[5,7,5,11],[5,12,5,15],[5,20,5,21]]}
["INFORMATIONS PAYS"]
["Structure administrative, population par groupe d'âge, statut d'endémicité, interventions planifiées et interventions mises en oeuvre"]
[]
["TOTAL",null,null,{"$f":"SUM(D$9:D$1000)","v":2066520},{"$f":"SUM(E$9:E$1000)","v":247981},{"$f":"SUM(F$9:F$1000)","v":516636},{"$f":"SUM(G$9:G$1000)","v":1219249},null,null,null,null,null,{"$f":"SUM(M$9:M$1000)","v":361121},{"$f":"SUM(N$9:N$1000)","v":721771},{"$f":"SUM(O$9:O$1000)","v":483207},{"$f":"SUM(P$9:P$1000)","v":192878.62000000005}]
[]
["Structure administrative du pays",null,null,"Population",null,null,null,"Endémicité",null,null,null,null,"Population nécessitant la CP",null,null,null,"Nombre de tournées de traitement prévues pour l'année",null,null,null,"Mise en oeuvre de la chimioprévention"]
["Pays","Région/Département","District","Total","EAPréS","EAS","Adultes","FL","Oncho","STH","SCH","Loa","FL","Oncho","STH","SCH","FL","Oncho","STH","SCH","TOURNEE 1","TOURNEE 2","IU_ID","IU_Name"]
[]
[{"$f":"IF(INTRO!$E$34<>0,INTRO!$E$34,\"\")","v":"Gabon"},"Libreville-Owendo","Libreville 1",278514,33422,69629,164323,0,4,2,1,1,{"$f":"IF(INTRO!$E$38=\"Endémique\", IF($H9>0, IF($H9=4,\"Inconnu\", IF($H9=99,\"Interrompu\", $D9)), 0),\"Non requis\")","v":0},{"$f":"IF(INTRO!$E$40=\"Endémique\", IF($I9>0, IF($I9=4,\"Inconnu\",IF($I9=99,\"Interrompu\", $D9)), 0),\"Non requis\")","v":"Inconnu"},{"$f":"IF(INTRO!$E$42=\"Endémique\", IF(AND($J9>1,$J9<5), IF($J9=4, \"Inconnu\", E9+F9), 0),\"Non requis\")","v":103051},{"$f":"IF(INTRO!$E$44=\"Endémique\", IF(AND($K9>0,$K9<5), IF($K9=4,\"Inconnu\", IF($K9=1, $F9*0.33, IF($K9=2, $F9*0.5+$G9*0.2, SUM(F9:G9)))), 0),\"Non requis\")","v":22977.57},0,0,1,1,"T1 (PZQ+ALB/MBD)",null,20330,"Libreville 1"]
[{"$f":"IF(INTRO!$E$34<>0,INTRO!$E$34,\"\")","v":"Gabon"},"Libreville-Owendo","Libreville 2",294595,35351,73649,173811,0,4,1,1,1,{"$f":"IF(INTRO!$E$38=\"Endémique\", IF($H10>0, IF($H10=4,\"Inconnu\", IF($H10=99,\"Interrompu\", $D10)), 0),\"Non requis\")","v":0},{"$f":"IF(INTRO!$E$40=\"Endémique\", IF($I10>0, IF($I10=4,\"Inconnu\",IF($I10=99,\"Interrompu\", $D10)), 0),\"Non requis\")","v":"Inconnu"},{"$f":"IF(INTRO!$E$42=\"Endémique\", IF(AND($J10>1,$J10<5), IF($J10=4, \"Inconnu\", E10+F10), 0),\"Non requis\")","v":0},{"$f":"IF(INTRO!$E$44=\"Endémique\", IF(AND($K10>0,$K10<5), IF($K10=4,\"Inconnu\", IF($K10=1, $F10*0.33, IF($K10=2, $F10*0.5+$G10*0.2, SUM(F10:G10)))), 0),\"Non requis\")","v":24304.170000000002},0,0,0,1,"T2 (PZQ)",null,20331,"Libreville 2"]
[{"$f":"IF(INTRO!$E$34<>0,INTRO!$E$34,\"\")","v":"Gabon"},"Libreville-Owendo","Libreville 3",229341,27521,57335,135311,0,4,1,1,1,{"$f":"IF(INTRO!$E$38=\"Endémique\", IF($H11>0, IF($H11=4,\"Inconnu\", IF($H11=99,\"Interrompu\", $D11)), 0),\"Non requis\")","v":0},{"$f":"IF(INTRO!$E$40=\"Endémique\", IF($I11>0, IF($I11=4,\"Inconnu\",IF($I11=99,\"Interrompu\", $D11)), 0),\"Non requis\")","v":"Inconnu"},{"$f":"IF(INTRO!$E$42=\"Endémique\", IF(AND($J11>1,$J11<5), IF($J11=4, \"Inconnu\", E11+F11), 0),\"Non requis\")","v":0},{"$f":"IF(INTRO!$E$44=\"Endémique\", IF(AND($K11>0,$K11<5), IF($K11=4,\"Inconnu\", IF($K11=1, $F11*0.33, IF($K11=2, $F11*0.5+$G11*0.2, SUM(F11:G11)))), 0),\"Non requis\")","v":18920.55},0,0,0,1,"T2 (PZQ)",null,20332,"Libreville 3"]
[{"$f":"IF(INTRO!$E$34<>0,INTRO!$E$34,\"\")","v":"Gabon"},"Libreville-Owendo","Owendo",87257,10471,21814,51482,0,4,1,1,1,{"$f":"IF(INTRO!$E$38=\"Endémique\", IF($H12>0, IF($H12=4,\"Inconnu\", IF($H12=99,\"Interrompu\", $D12)), 0),\"Non requis\")","v":0},{"$f":"IF(INTRO!$E$40=\"Endémique\", IF($I12>0, IF($I12=4,\"Inconnu\",IF($I12=99,\"Interrompu\", $D12)), 0),\"Non requis\")","v":"Inconnu"},{"$f":"IF(INTRO!$E$42=\"Endémique\", IF(AND($J12>1,$J12<5), IF($J12=4, \"Inconnu\", E12+F12), 0),\"Non requis\")","v":0},{"$f":"IF(INTRO!$E$44=\"Endémique\", IF(AND($K12>0,$K12<5), IF($K12=4,\"Inconnu\", IF($K12=1, $F12*0.33, IF($K12=2, $F12*0.5+$G12*0.2, SUM(F12:G12)))), 0),\"Non requis\")","v":7198.62},0,0,0,1,"T2 (PZQ)",null,20334,"Owendo"]
[{"$f":"IF(INTRO!$E$34<>0,INTRO!$E$34,\"\")","v":"Gabon"},"Ouest","Komo-Mondah",96045,11525,24011,56667,1,0,2,1,1,{"$f":"IF(INTRO!$E$38=\"Endémique\", IF($H13>0, IF($H13=4,\"Inconnu\", IF($H13=99,\"Interrompu\", $D13)), 0),\"Non requis\")","v":96045},{"$f":"IF(INTRO!$E$40=\"Endémique\", IF($I13>0, IF($I13=4,\"Inconnu\",IF($I13=99,\"Interrompu\", $D13)), 0),\"Non requis\")","v":0},{"$f":"IF(INTRO!$E$42=\"Endémique\", IF(AND($J13>1,$J13<5), IF($J13=4, \"Inconnu\", E13+F13), 0),\"Non requis\")","v":35536},{"$f":"IF(INTRO!$E$44=\"Endémique\", IF(AND($K13>0,$K13<5), IF($K13=4,\"Inconnu\", IF($K13=1, $F13*0.33, IF($K13=2, $F13*0.5+$G13*0.2, SUM(F13:G13)))), 0),\"Non requis\")","v":7923.63},0,0,1,1,"T1 (PZQ+ALB/MBD)",null,20333,"Komo-Mondah"]
[{"$f":"IF(INTRO!$E$34<>0,INTRO!$E$34,\"\")","v":"Gabon"},"Ouest","Komo-Kango",18684,2242,4671,11024,0,4,2,2,1,{"$f":"IF(INTRO!$E$38=\"Endémique\", IF($H14>0, IF($H14=4,\"Inconnu\", IF($H14=99,\"Interrompu\", $D14)), 0),\"Non requis\")","v":0},{"$f":"IF(INTRO!$E$40=\"Endémique\", IF($I14>0, IF($I14=4,\"Inconnu\",IF($I14=99,\"Interrompu\", $D14)), 0),\"Non requis\")","v":"Inconnu"},{"$f":"IF(INTRO!$E$42=\"Endémique\", IF(AND($J14>1,$J14<5), IF($J14=4, \"Inconnu\", E14+F14), 0),\"Non requis\")","v":6913},{"$f":"IF(INTRO!$E$44=\"Endémique\", IF(AND($K14>0,$K14<5), IF($K14=4,\"Inconnu\", IF($K14=1, $F14*0.33, IF($K14=2, $F14*0.5+$G14*0.2, SUM(F14:G14)))), 0),\"Non requis\")","v":4540.3},0,0,1,1,"T1 (PZQ+ALB/MBD)",null,20329,"Komo-Kango"]
[{"$f":"IF(INTRO!$E$34<>0,INTRO!$E$34,\"\")","v":"Gabon"},"Ouest","Noya",4900,588,1225,2891,0,0,3,1,1,{"$f":"IF(INTRO!$E$38=\"Endémique\", IF($H15>0, IF($H15=4,\"Inconnu\", IF($H15=99,\"Interrompu\", $D15)), 0),\"Non requis\")","v":0},{"$f":"IF(INTRO!$E$40=\"Endémique\", IF($I15>0, IF($I15=4,\"Inconnu\",IF($I15=99,\"Interrompu\", $D15)), 0),\"Non requis\")","v":0},{"$f":"IF(INTRO!$E$42=\"Endémique\", IF(AND($J15>1,$J15<5), IF($J15=4, \"Inconnu\", E15+F15), 0),\"Non requis\")","v":1813},{"$f":"IF(INTRO!$E$44=\"Endémique\", IF(AND($K15>0,$K15<5), IF($K15=4,\"Inconnu\", IF($K15=1, $F15*0.33, IF($K15=2, $F15*0.5+$G15*0.2, SUM(F15:G15)))), 0),\"Non requis\")","v":404.25},0,0,2,1,"T1 (PZQ+ALB/MBD)","T3 (ALB/MBD)",20328,"Noya"]
[{"$f":"IF(INTRO!$E$34<>0,INTRO!$E$34,\"\")","v":"Gabon"},"Sud-Est","Bayi-brikolo",6310,757,1578,3723,0,4,3,0,1,{"$f":"IF(INTRO!$E$38=\"Endémique\", IF($H16>0, IF($H16=4,\"Inconnu\", IF($H16=99,\"Interrompu\", $D16)), 0),\"Non requis\")","v":0},{"$f":"IF(INTRO!$E$40=\"Endémique\", IF($I16>0, IF($I16=4,\"Inconnu\",IF($I16=99,\"Interrompu\", $D16)), 0),\"Non requis\")","v":"Inconnu"},{"$f":"IF(INTRO!$E$42=\"Endémique\", IF(AND($J16>1,$J16<5), IF($J16=4, \"Inconnu\", E16+F16), 0),\"Non requis\")","v":2335},{"$f":"IF(INTRO!$E$44=\"Endémique\", IF(AND($K16>0,$K16<5), IF($K16=4,\"Inconnu\", IF($K16=1, $F16*0.33, IF($K16=2, $F16*0.5+$G16*0.2, SUM(F16:G16)))), 0),\"Non requis\")","v":0},0,0,2,0,"T3 (ALB/MBD)","T3 (ALB/MBD)",20335,"Bayi-brikolo"]
[{"$f":"IF(INTRO!$E$34<>0,INTRO!$E$34,\"\")","v":"Gabon"},"Sud-Est","Lékoni-Lékori",12685,1522,3171,7484,0,0,3,1,1,{"$f":"IF(INTRO!$E$38=\"Endémique\", IF($H17>0, IF($H17=4,\"Inconnu\", IF($H17=99,\"Interrompu\", $D17)), 0),\"Non requis\")","v":0},{"$f":"IF(INTRO!$E$40=\"Endémique\", IF($I17>0, IF($I17=4,\"Inconnu\",IF($I17=99,\"Interrompu\", $D17)), 0),\"Non requis\")","v":0},{"$f":"IF(INTRO!$E$42=\"Endémique\", IF(AND($J17>1,$J17<5), IF($J17=4, \"Inconnu\", E17+F17), 0),\"Non requis\")","v":4693},{"$f":"IF(INTRO!$E$44=\"Endémique\", IF(AND($K17>0,$K17<5), IF($K17=4,\"Inconnu\", IF($K17=1, $F17*0.33, IF($K17=2, $F17*0.5+$G17*0.2, SUM(F17:G17)))), 0),\"Non requis\")","v":1046.43},0,0,2,1,"T1 (PZQ+ALB/MBD)","T3 (ALB/MBD)",20336,"Lékoni-lékori"]
[{"$f":"IF(INTRO!$E$34<>0,INTRO!$E$34,\"\")","v":"Gabon"},"Sud-Est","Lékoko",5673,681,1418,3347,0,0,2,1,1,{"$f":"IF(INTRO!$E$38=\"Endémique\", IF($H18>0, IF($H18=4,\"Inconnu\", IF($H18=99,\"Interrompu\", $D18)), 0),\"Non requis\")","v":0},{"$f":"IF(INTRO!$E$40=\"Endémique\", IF($I18>0, IF($I18=4,\"Inconnu\",IF($I18=99,\"Interrompu\", $D18)), 0),\"Non requis\")","v":0},{"$f":"IF(INTRO!$E$42=\"Endémique\", IF(AND($J18>1,$J18<5), IF($J18=4, \"Inconnu\", E18+F18), 0),\"Non requis\")","v":2099},{"$f":"IF(INTRO!$E$44=\"Endémique\", IF(AND($K18>0,$K18<5), IF($K18=4,\"Inconnu\", IF($K18=1, $F18*0.33, IF($K18=2, $F18*0.5+$G18*0.2, SUM(F18:G18)))), 0),\"Non requis\")","v":467.94},0,0,1,1,"T1 (PZQ+ALB/MBD)",null,20337,"Lékoko"]
[{"$f":"IF(INTRO!$E$34<>0,INTRO!$E$34,\"\")","v":"Gabon"},"Sud-Est","Djouori-Agnili",6215,746,1554,3667,1,4,2,0,1,{"$f":"IF(INTRO!$E$38=\"Endémique\", IF($H19>0, IF($H19=4,\"Inconnu\", IF($H19=99,\"Interrompu\", $D19)), 0),\"Non requis\")","v":6215},{"$f":"IF(INTRO!$E$40=\"Endémique\", IF($I19>0, IF($I19=4,\"Inconnu\",IF($I19=99,\"Interrompu\", $D19)), 0),\"Non requis\")","v":"Inconnu"},{"$f":"IF(INTRO!$E$42=\"Endémique\", IF(AND($J19>1,$J19<5), IF($J19=4, \"Inconnu\", E19+F19), 0),\"Non requis\")","v":2300},{"$f":"IF(INTRO!$E$44=\"Endémique\", IF(AND($K19>0,$K19<5), IF($K19=4,\"Inconnu\", IF($K19=1, $F19*0.33, IF($K19=2, $F19*0.5+$G19*0.2, SUM(F19:G19)))), 0),\"Non requis\")","v":0},0,0,1,0,"T3 (ALB/MBD)",null,20338,"Djouori-Agnili"]
[{"$f":"IF(INTRO!$E$34<>0,INTRO!$E$34,\"\")","v":"Gabon"},"Sud-Est","Ogooué-Létili",5223,627,1306,3082,0,4,3,0,1,{"$f":"IF(INTRO!$E$38=\"Endémique\", IF($H20>0, IF($H20=4,\"Inconnu\", IF($H20=99,\"Interrompu\", $D20)), 0),\"Non requis\")","v":0},{"$f":"IF(INTRO!$E$40=\"Endémique\", IF($I20>0, IF($I20=4,\"Inconnu\",IF($I20=99,\"Interrompu\", $D20)), 0),\"Non requis\")","v":"Inconnu"},{"$f":"IF(INTRO!$E$42=\"Endémique\", IF(AND($J20>1,$J20<5), IF($J20=4, \"Inconnu\", E20+F20), 0),\"Non requis\")","v":1933},{"$f":"IF(INTRO!$E$44=\"Endémique\", IF(AND($K20>0,$K20<5), IF($K20=4,\"Inconnu\", IF($K20=1, $F20*0.33, IF($K20=2, $F20*0.5+$G20*0.2, SUM(F20:G20)))), 0),\"Non requis\")","v":0},0,0,2,0,"T3 (ALB/MBD)","T3 (ALB/MBD)",20339,"Ogooué -létili"]
[{"$f":"IF(INTRO!$E$34<>0,INTRO!$E$34,\"\")","v":"Gabon"},"Sud-Est","Mpassa",157036,18844,39259,92651,0,1,2,1,1,{"$f":"IF(INTRO!$E$38=\"Endémique\", IF($H21>0, IF($H21=4,\"Inconnu\", IF($H21=99,\"Interrompu\", $D21)), 0),\"Non requis\")","v":0},{"$f":"IF(INTRO!$E$40=\"Endémique\", IF($I21>0, IF($I21=4,\"Inconnu\",IF($I21=99,\"Interrompu\", $D21)), 0),\"Non requis\")","v":157036},{"$f":"IF(INTRO!$E$42=\"Endémique\", IF(AND($J21>1,$J21<5), IF($J21=4, \"Inconnu\", E21+F21), 0),\"Non requis\")","v":58103},{"$f":"IF(INTRO!$E$44=\"Endémique\", IF(AND($K21>0,$K21<5), IF($K21=4,\"Inconnu\", IF($K21=1, $F21*0.33, IF($K21=2, $F21*0.5+$G21*0.2, SUM(F21:G21)))), 0),\"Non requis\")","v":12955.470000000001},0,0,1,1,"T1 (PZQ+ALB/MBD)",null,20340,"Mpassa"]
[{"$f":"IF(INTRO!$E$34<>0,INTRO!$E$34,\"\")","v":"Gabon"},"Sud-Est","Plateaux",12587,1510,3147,7426,0,4,3,1,0,{"$f":"IF(INTRO!$E$38=\"Endémique\", IF($H22>0, IF($H22=4,\"Inconnu\", IF($H22=99,\"Interrompu\", $D22)), 0),\"Non requis\")","v":0},{"$f":"IF(INTRO!$E$40=\"Endémique\", IF($I22>0, IF($I22=4,\"Inconnu\",IF($I22=99,\"Interrompu\", $D22)), 0),\"Non requis\")","v":"Inconnu"},{"$f":"IF(INTRO!$E$42=\"Endémique\", IF(AND($J22>1,$J22<5), IF($J22=4, \"Inconnu\", E22+F22), 0),\"Non requis\")","v":4657},{"$f":"IF(INTRO!$E$44=\"Endémique\", IF(AND($K22>0,$K22<5), IF($K22=4,\"Inconnu\", IF($K22=1, $F22*0.33, IF($K22=2, $F22*0.5+$G22*0.2, SUM(F22:G22)))), 0),\"Non requis\")","v":1038.51},0,0,2,1,"T1 (PZQ+ALB/MBD)","T3 (ALB/MBD)",20341,"Plateaux"]
[{"$f":"IF(INTRO!$E$34<>0,INTRO!$E$34,\"\")","v":"Gabon"},"Sud-Est","Lébombi-Léyou",69577,8349,17394,41050,0,1,2,1,1,{"$f":"IF(INTRO!$E$38=\"Endémique\", IF($H23>0, IF($H23=4,\"Inconnu\", IF($H23=99,\"Interrompu\", $D23)), 0),\"Non requis\")","v":0},{"$f":"IF(INTRO!$E$40=\"Endémique\", IF($I23>0, IF($I23=4,\"Inconnu\",IF($I23=99,\"Interrompu\", $D23)), 0),\"Non requis\")","v":69577},{"$f":"IF(INTRO!$E$42=\"Endémique\", IF(AND($J23>1,$J23<5), IF($J23=4, \"Inconnu\", E23+F23), 0),\"Non requis\")","v":25743},{"$f":"IF(INTRO!$E$44=\"Endémique\", IF(AND($K23>0,$K23<5), IF($K23=4,\"Inconnu\", IF($K23=1, $F23*0.33, IF($K23=2, $F23*0.5+$G23*0.2, SUM(F23:G23)))), 0),\"Non requis\")","v":5740.02},0,0,1,1,"T1 (PZQ+ALB/MBD)",null,20342,"Lébombi-Léyou"]
[{"$f":"IF(INTRO!$E$34<>0,INTRO!$E$34,\"\")","v":"Gabon"},"Sud-Est","Lékabi-Léwolo",10131,1216,2533,5977,0,4,2,1,1,{"$f":"IF(INTRO!$E$38=\"Endémique\", IF($H24>0, IF($H24=4,\"Inconnu\", IF($H24=99,\"Interrompu\", $D24)), 0),\"Non requis\")","v":0},{"$f":"IF(INTRO!$E$40=\"Endémique\", IF($I24>0, IF($I24=4,\"Inconnu\",IF($I24=99,\"Interrompu\", $D24)), 0),\"Non requis\")","v":"Inconnu"},{"$f":"IF(INTRO!$E$42=\"Endémique\", IF(AND($J24>1,$J24<5), IF($J24=4, \"Inconnu\", E24+F24), 0),\"Non requis\")","v":3749},{"$f":"IF(INTRO!$E$44=\"Endémique\", IF(AND($K24>0,$K24<5), IF($K24=4,\"Inconnu\", IF($K24=1, $F24*0.33, IF($K24=2, $F24*0.5+$G24*0.2, SUM(F24:G24)))), 0),\"Non requis\")","v":835.89},0,0,1,1,"T1 (PZQ+ALB/MBD)",null,20343,"Lékabi-léwolo"]
[{"$f":"IF(INTRO!$E$34<>0,INTRO!$E$34,\"\")","v":"Gabon"},"Sud-Est","Sébé-Brikolo",19036,2284,4759,11231,0,1,2,1,1,{"$f":"IF(INTRO!$E$38=\"Endémique\", IF($H25>0, IF($H25=4,\"Inconnu\", IF($H25=99,\"Interrompu\", $D25)), 0),\"Non requis\")","v":0},{"$f":"IF(INTRO!$E$40=\"Endémique\", IF($I25>0, IF($I25=4,\"Inconnu\",IF($I25=99,\"Interrompu\", $D25)), 0),\"Non requis\")","v":19036},{"$f":"IF(INTRO!$E$42=\"Endémique\", IF(AND($J25>1,$J25<5), IF($J25=4, \"Inconnu\", E25+F25), 0),\"Non requis\")","v":7043},{"$f":"IF(INTRO!$E$44=\"Endémique\", IF(AND($K25>0,$K25<5), IF($K25=4,\"Inconnu\", IF($K25=1, $F25*0.33, IF($K25=2, $F25*0.5+$G25*0.2, SUM(F25:G25)))), 0),\"Non requis\")","v":1570.47},0,0,1,1,"T1 (PZQ+ALB/MBD)",null,20344,"Sébé-brikoli"]
[{"$f":"IF(INTRO!$E$34<>0,INTRO!$E$34,\"\")","v":"Gabon"},"Sud-Est","Djoué",6271,753,1568,3700,0,4,3,1,1,{"$f":"IF(INTRO!$E$38=\"Endémique\", IF($H26>0, IF($H26=4,\"Inconnu\", IF($H26=99,\"Interrompu\", $D26)), 0),\"Non requis\")","v":0},{"$f":"IF(INTRO!$E$40=\"Endémique\", IF($I26>0, IF($I26=4,\"Inconnu\",IF($I26=99,\"Interrompu\", $D26)), 0),\"Non requis\")","v":"Inconnu"},{"$f":"IF(INTRO!$E$42=\"Endémique\", IF(AND($J26>1,$J26<5), IF($J26=4, \"Inconnu\", E26+F26), 0),\"Non requis\")","v":2321},{"$f":"IF(INTRO!$E$44=\"Endémique\", IF(AND($K26>0,$K26<5), IF($K26=4,\"Inconnu\", IF($K26=1, $F26*0.33, IF($K26=2, $F26*0.5+$G26*0.2, SUM(F26:G26)))), 0),\"Non requis\")","v":517.44000000000005},0,0,2,1,"T1 (PZQ+ALB/MBD)","T3 (ALB/MBD)",20345,"Djoué"]
[{"$f":"IF(INTRO!$E$34<>0,INTRO!$E$34,\"\")","v":"Gabon"},"Centre","Ogooué-et-Lacs",60282,7234,15071,35566,0,0,2,2,1,{"$f":"IF(INTRO!$E$38=\"Endémique\", IF($H27>0, IF($H27=4,\"Inconnu\", IF($H27=99,\"Interrompu\", $D27)), 0),\"Non requis\")","v":0},{"$f":"IF(INTRO!$E$40=\"Endémique\", IF($I27>0, IF($I27=4,\"Inconnu\",IF($I27=99,\"Interrompu\", $D27)), 0),\"Non requis\")","v":0},{"$f":"IF(INTRO!$E$42=\"Endémique\", IF(AND($J27>1,$J27<5), IF($J27=4, \"Inconnu\", E27+F27), 0),\"Non requis\")","v":22305},{"$f":"IF(INTRO!$E$44=\"Endémique\", IF(AND($K27>0,$K27<5), IF($K27=4,\"Inconnu\", IF($K27=1, $F27*0.33, IF($K27=2, $F27*0.5+$G27*0.2, SUM(F27:G27)))), 0),\"Non requis\")","v":14648.7},0,0,1,1,"T1 (PZQ+ALB/MBD)",null,20346,"Ogooué et Lacs"]
[{"$f":"IF(INTRO!$E$34<>0,INTRO!$E$34,\"\")","v":"Gabon"},"Centre","Abanga-Bigné",16969,2036,4242,10012,1,1,2,1,1,{"$f":"IF(INTRO!$E$38=\"Endémique\", IF($H28>0, IF($H28=4,\"Inconnu\", IF($H28=99,\"Interrompu\", $D28)), 0),\"Non requis\")","v":16969},{"$f":"IF(INTRO!$E$40=\"Endémique\", IF($I28>0, IF($I28=4,\"Inconnu\",IF($I28=99,\"Interrompu\", $D28)), 0),\"Non requis\")","v":16969},{"$f":"IF(INTRO!$E$42=\"Endémique\", IF(AND($J28>1,$J28<5), IF($J28=4, \"Inconnu\", E28+F28), 0),\"Non requis\")","v":6278},{"$f":"IF(INTRO!$E$44=\"Endémique\", IF(AND($K28>0,$K28<5), IF($K28=4,\"Inconnu\", IF($K28=1, $F28*0.33, IF($K28=2, $F28*0.5+$G28*0.2, SUM(F28:G28)))), 0),\"Non requis\")","v":1399.8600000000001},0,0,1,1,"T1 (PZQ+ALB/MBD)",null,20347,"Abanga -Bigné"]
[{"$f":"IF(INTRO!$E$34<>0,INTRO!$E$34,\"\")","v":"Gabon"},"Centre-Sud","Tsamba-Magotsi",15465,1856,3866,9124,0,1,2,2,1,{"$f":"IF(INTRO!$E$38=\"Endémique\", IF($H29>0, IF($H29=4,\"Inconnu\", IF($H29=99,\"Interrompu\", $D29)), 0),\"Non requis\")","v":0},{"$f":"IF(INTRO!$E$40=\"Endémique\", IF($I29>0, IF($I29=4,\"Inconnu\",IF($I29=99,\"Interrompu\", $D29)), 0),\"Non requis\")","v":15465},{"$f":"IF(INTRO!$E$42=\"Endémique\", IF(AND($J29>1,$J29<5), IF($J29=4, \"Inconnu\", E29+F29), 0),\"Non requis\")","v":5722},{"$f":"IF(INTRO!$E$44=\"Endémique\", IF(AND($K29>0,$K29<5), IF($K29=4,\"Inconnu\", IF($K29=1, $F29*0.33, IF($K29=2, $F29*0.5+$G29*0.2, SUM(F29:G29)))), 0),\"Non requis\")","v":3757.8},0,0,1,1,"T1 (PZQ+ALB/MBD)",null,20348,"Tsamba -Magotsi"]
[{"$f":"IF(INTRO!$E$34<>0,INTRO!$E$34,\"\")","v":"Gabon"},"Centre-Sud","Louetsi-Wano",12637,1516,3159,7456,1,1,3,1,1,{"$f":"IF(INTRO!$E$38=\"Endémique\", IF($H30>0, IF($H30=4,\"Inconnu\", IF($H30=99,\"Interrompu\", $D30)), 0),\"Non requis\")","v":12637},{"$f":"IF(INTRO!$E$40=\"Endémique\", IF($I30>0, IF($I30=4,\"Inconnu\",IF($I30=99,\"Interrompu\", $D30)), 0),\"Non requis\")","v":12637},{"$f":"IF(INTRO!$E$42=\"Endémique\", IF(AND($J30>1,$J30<5), IF($J30=4, \"Inconnu\", E30+F30), 0),\"Non requis\")","v":4675},{"$f":"IF(INTRO!$E$44=\"Endémique\", IF(AND($K30>0,$K30<5), IF($K30=4,\"Inconnu\", IF($K30=1, $F30*0.33, IF($K30=2, $F30*0.5+$G30*0.2, SUM(F30:G30)))), 0),\"Non requis\")","v":1042.47},0,0,2,1,"T1 (PZQ+ALB/MBD)","T3 (ALB/MBD)",20349,"Louetsi-Wano"]
[{"$f":"IF(INTRO!$E$34<>0,INTRO!$E$34,\"\")","v":"Gabon"},"Centre-Sud","Louetsi-Bibaka",3169,380,792,1870,1,0,3,0,1,{"$f":"IF(INTRO!$E$38=\"Endémique\", IF($H31>0, IF($H31=4,\"Inconnu\", IF($H31=99,\"Interrompu\", $D31)), 0),\"Non requis\")","v":3169},{"$f":"IF(INTRO!$E$40=\"Endémique\", IF($I31>0, IF($I31=4,\"Inconnu\",IF($I31=99,\"Interrompu\", $D31)), 0),\"Non requis\")","v":0},{"$f":"IF(INTRO!$E$42=\"Endémique\", IF(AND($J31>1,$J31<5), IF($J31=4, \"Inconnu\", E31+F31), 0),\"Non requis\")","v":1172},{"$f":"IF(INTRO!$E$44=\"Endémique\", IF(AND($K31>0,$K31<5), IF($K31=4,\"Inconnu\", IF($K31=1, $F31*0.33, IF($K31=2, $F31*0.5+$G31*0.2, SUM(F31:G31)))), 0),\"Non requis\")","v":0},0,0,2,0,"T3 (ALB/MBD)","T3 (ALB/MBD)",20350,"Louetsi-Bibaka"]
[{"$f":"IF(INTRO!$E$34<>0,INTRO!$E$34,\"\")","v":"Gabon"},"Centre-Sud","Ndolou",6115,734,1529,3608,1,0,2,1,1,{"$f":"IF(INTRO!$E$38=\"Endémique\", IF($H32>0, IF($H32=4,\"Inconnu\", IF($H32=99,\"Interrompu\", $D32)), 0),\"Non requis\")","v":6115},{"$f":"IF(INTRO!$E$40=\"Endémique\", IF($I32>0, IF($I32=4,\"Inconnu\",IF($I32=99,\"Interrompu\", $D32)), 0),\"Non requis\")","v":0},{"$f":"IF(INTRO!$E$42=\"Endémique\", IF(AND($J32>1,$J32<5), IF($J32=4, \"Inconnu\", E32+F32), 0),\"Non requis\")","v":2263},{"$f":"IF(INTRO!$E$44=\"Endémique\", IF(AND($K32>0,$K32<5), IF($K32=4,\"Inconnu\", IF($K32=1, $F32*0.33, IF($K32=2, $F32*0.5+$G32*0.2, SUM(F32:G32)))), 0),\"Non requis\")","v":504.57000000000005},0,0,1,1,"T1 (PZQ+ALB/MBD)",null,20351,"Ndolou"]
[{"$f":"IF(INTRO!$E$34<>0,INTRO!$E$34,\"\")","v":"Gabon"},"Centre-Sud","Boumi-Louetsi",21994,2639,5499,12976,1,1,3,1,1,{"$f":"IF(INTRO!$E$38=\"Endémique\", IF($H33>0, IF($H33=4,\"Inconnu\", IF($H33=99,\"Interrompu\", $D33)), 0),\"Non requis\")","v":21994},{"$f":"IF(INTRO!$E$40=\"Endémique\", IF($I33>0, IF($I33=4,\"Inconnu\",IF($I33=99,\"Interrompu\", $D33)), 0),\"Non requis\")","v":21994},{"$f":"IF(INTRO!$E$42=\"Endémique\", IF(AND($J33>1,$J33<5), IF($J33=4, \"Inconnu\", E33+F33), 0),\"Non requis\")","v":8138},{"$f":"IF(INTRO!$E$44=\"Endémique\", IF(AND($K33>0,$K33<5), IF($K33=4,\"Inconnu\", IF($K33=1, $F33*0.33, IF($K33=2, $F33*0.5+$G33*0.2, SUM(F33:G33)))), 0),\"Non requis\")","v":1814.67},0,0,2,1,"T1 (PZQ+ALB/MBD)","T3 (ALB/MBD)",20352,"Boumi-Louetsi"]
[{"$f":"IF(INTRO!$E$34<>0,INTRO!$E$34,\"\")","v":"Gabon"},"Centre-Sud","Ogoulou",10025,1203,2506,5915,1,1,3,1,1,{"$f":"IF(INTRO!$E$38=\"Endémique\", IF($H34>0, IF($H34=4,\"Inconnu\", IF($H34=99,\"Interrompu\", $D34)), 0),\"Non requis\")","v":10025},{"$f":"IF(INTRO!$E$40=\"Endémique\", IF($I34>0, IF($I34=4,\"Inconnu\",IF($I34=99,\"Interrompu\", $D34)), 0),\"Non requis\")","v":10025},{"$f":"IF(INTRO!$E$42=\"Endémique\", IF(AND($J34>1,$J34<5), IF($J34=4, \"Inconnu\", E34+F34), 0),\"Non requis\")","v":3709},{"$f":"IF(INTRO!$E$44=\"Endémique\", IF(AND($K34>0,$K34<5), IF($K34=4,\"Inconnu\", IF($K34=1, $F34*0.33, IF($K34=2, $F34*0.5+$G34*0.2, SUM(F34:G34)))), 0),\"Non requis\")","v":826.98},0,0,2,1,"T1 (PZQ+ALB/MBD)","T3 (ALB/MBD)",20353,"Ogoulou"]
[{"$f":"IF(INTRO!$E$34<>0,INTRO!$E$34,\"\")","v":"Gabon"},"Centre-Sud","Douya-Onoye",36126,4335,9032,21314,1,1,2,2,1,{"$f":"IF(INTRO!$E$38=\"Endémique\", IF($H35>0, IF($H35=4,\"Inconnu\", IF($H35=99,\"Interrompu\", $D35)), 0),\"Non requis\")","v":36126},{"$f":"IF(INTRO!$E$40=\"Endémique\", IF($I35>0, IF($I35=4,\"Inconnu\",IF($I35=99,\"Interrompu\", $D35)), 0),\"Non requis\")","v":36126},{"$f":"IF(INTRO!$E$42=\"Endémique\", IF(AND($J35>1,$J35<5), IF($J35=4, \"Inconnu\", E35+F35), 0),\"Non requis\")","v":13367},{"$f":"IF(INTRO!$E$44=\"Endémique\", IF(AND($K35>0,$K35<5), IF($K35=4,\"Inconnu\", IF($K35=1, $F35*0.33, IF($K35=2, $F35*0.5+$G35*0.2, SUM(F35:G35)))), 0),\"Non requis\")","v":8778.7999999999993},0,0,1,1,"T1 (PZQ+ALB/MBD)",null,20354,"Douya-Onoye"]
[{"$f":"IF(INTRO!$E$34<>0,INTRO!$E$34,\"\")","v":"Gabon"},"Centre-Sud","Dola",9094,1091,2274,5365,0,1,2,1,1,{"$f":"IF(INTRO!$E$38=\"Endémique\", IF($H36>0, IF($H36=4,\"Inconnu\", IF($H36=99,\"Interrompu\", $D36)), 0),\"Non requis\")","v":0},{"$f":"IF(INTRO!$E$40=\"Endémique\", IF($I36>0, IF($I36=4,\"Inconnu\",IF($I36=99,\"Interrompu\", $D36)), 0),\"Non requis\")","v":9094},{"$f":"IF(INTRO!$E$42=\"Endémique\", IF(AND($J36>1,$J36<5), IF($J36=4, \"Inconnu\", E36+F36), 0),\"Non requis\")","v":3365},{"$f":"IF(INTRO!$E$44=\"Endémique\", IF(AND($K36>0,$K36<5), IF($K36=4,\"Inconnu\", IF($K36=1, $F36*0.33, IF($K36=2, $F36*0.5+$G36*0.2, SUM(F36:G36)))), 0),\"Non requis\")","v":750.42000000000007},0,0,1,1,"T1 (PZQ+ALB/MBD)",null,20355,"Dola"]
[{"$f":"IF(INTRO!$E$34<>0,INTRO!$E$34,\"\")","v":"Gabon"},"Centre-Sud","Mougalaba",1442,173,361,851,1,0,3,1,1,{"$f":"IF(INTRO!$E$38=\"Endémique\", IF($H37>0, IF($H37=4,\"Inconnu\", IF($H37=99,\"Interrompu\", $D37)), 0),\"Non requis\")","v":1442},{"$f":"IF(INTRO!$E$40=\"Endémique\", IF($I37>0, IF($I37=4,\"Inconnu\",IF($I37=99,\"Interrompu\", $D37)), 0),\"Non requis\")","v":0},{"$f":"IF(INTRO!$E$42=\"Endémique\", IF(AND($J37>1,$J37<5), IF($J37=4, \"Inconnu\", E37+F37), 0),\"Non requis\")","v":534},{"$f":"IF(INTRO!$E$44=\"Endémique\", IF(AND($K37>0,$K37<5), IF($K37=4,\"Inconnu\", IF($K37=1, $F37*0.33, IF($K37=2, $F37*0.5+$G37*0.2, SUM(F37:G37)))), 0),\"Non requis\")","v":119.13000000000001},0,0,2,1,"T1 (PZQ+ALB/MBD)","T3 (ALB/MBD)",20356,"Mougalaba"]
[{"$f":"IF(INTRO!$E$34<>0,INTRO!$E$34,\"\")","v":"Gabon"},"Sud","Doutsila",4391,527,1098,2591,0,4,3,1,1,{"$f":"IF(INTRO!$E$38=\"Endémique\", IF($H38>0, IF($H38=4,\"Inconnu\", IF($H38=99,\"Interrompu\", $D38)), 0),\"Non requis\")","v":0},{"$f":"IF(INTRO!$E$40=\"Endémique\", IF($I38>0, IF($I38=4,\"Inconnu\",IF($I38=99,\"Interrompu\", $D38)), 0),\"Non requis\")","v":"Inconnu"},{"$f":"IF(INTRO!$E$42=\"Endémique\", IF(AND($J38>1,$J38<5), IF($J38=4, \"Inconnu\", E38+F38), 0),\"Non requis\")","v":1625},{"$f":"IF(INTRO!$E$44=\"Endémique\", IF(AND($K38>0,$K38<5), IF($K38=4,\"Inconnu\", IF($K38=1, $F38*0.33, IF($K38=2, $F38*0.5+$G38*0.2, SUM(F38:G38)))), 0),\"Non requis\")","v":362.34000000000003},0,0,2,1,"T1 (PZQ+ALB/MBD)","T3 (ALB/MBD)",20357,"Doutsila"]
[{"$f":"IF(INTRO!$E$34<>0,INTRO!$E$34,\"\")","v":"Gabon"},"Sud","Basse-Banio",7344,881,1836,4333,1,1,2,1,1,{"$f":"IF(INTRO!$E$38=\"Endémique\", IF($H39>0, IF($H39=4,\"Inconnu\", IF($H39=99,\"Interrompu\", $D39)), 0),\"Non requis\")","v":7344},{"$f":"IF(INTRO!$E$40=\"Endémique\", IF($I39>0, IF($I39=4,\"Inconnu\",IF($I39=99,\"Interrompu\", $D39)), 0),\"Non requis\")","v":7344},{"$f":"IF(INTRO!$E$42=\"Endémique\", IF(AND($J39>1,$J39<5), IF($J39=4, \"Inconnu\", E39+F39), 0),\"Non requis\")","v":2717},{"$f":"IF(INTRO!$E$44=\"Endémique\", IF(AND($K39>0,$K39<5), IF($K39=4,\"Inconnu\", IF($K39=1, $F39*0.33, IF($K39=2, $F39*0.5+$G39*0.2, SUM(F39:G39)))), 0),\"Non requis\")","v":605.88},0,0,1,1,"T1 (PZQ+ALB/MBD)",null,20358,"Basse-Banio"]
[{"$f":"IF(INTRO!$E$34<>0,INTRO!$E$34,\"\")","v":"Gabon"},"Sud","Douigny",7491,899,1873,4420,0,0,3,0,1,{"$f":"IF(INTRO!$E$38=\"Endémique\", IF($H40>0, IF($H40=4,\"Inconnu\", IF($H40=99,\"Interrompu\", $D40)), 0),\"Non requis\")","v":0},{"$f":"IF(INTRO!$E$40=\"Endémique\", IF($I40>0, IF($I40=4,\"Inconnu\",IF($I40=99,\"Interrompu\", $D40)), 0),\"Non requis\")","v":0},{"$f":"IF(INTRO!$E$42=\"Endémique\", IF(AND($J40>1,$J40<5), IF($J40=4, \"Inconnu\", E40+F40), 0),\"Non requis\")","v":2772},{"$f":"IF(INTRO!$E$44=\"Endémique\", IF(AND($K40>0,$K40<5), IF($K40=4,\"Inconnu\", IF($K40=1, $F40*0.33, IF($K40=2, $F40*0.5+$G40*0.2, SUM(F40:G40)))), 0),\"Non requis\")","v":0},0,0,2,0,"T3 (ALB/MBD)","T3 (ALB/MBD)",20359,"Douigny"]
[{"$f":"IF(INTRO!$E$34<>0,INTRO!$E$34,\"\")","v":"Gabon"},"Sud","Mongo",3743,449,936,2208,0,1,2,1,1,{"$f":"IF(INTRO!$E$38=\"Endémique\", IF($H41>0, IF($H41=4,\"Inconnu\", IF($H41=99,\"Interrompu\", $D41)), 0),\"Non requis\")","v":0},{"$f":"IF(INTRO!$E$40=\"Endémique\", IF($I41>0, IF($I41=4,\"Inconnu\",IF($I41=99,\"Interrompu\", $D41)), 0),\"Non requis\")","v":3743},{"$f":"IF(INTRO!$E$42=\"Endémique\", IF(AND($J41>1,$J41<5), IF($J41=4, \"Inconnu\", E41+F41), 0),\"Non requis\")","v":1385},{"$f":"IF(INTRO!$E$44=\"Endémique\", IF(AND($K41>0,$K41<5), IF($K41=4,\"Inconnu\", IF($K41=1, $F41*0.33, IF($K41=2, $F41*0.5+$G41*0.2, SUM(F41:G41)))), 0),\"Non requis\")","v":308.88},0,0,1,1,"T1 (PZQ+ALB/MBD)",null,20360,"Mongo"]
[{"$f":"IF(INTRO!$E$34<>0,INTRO!$E$34,\"\")","v":"Gabon"},"Sud","Haute-Banio",1884,226,471,1112,0,4,3,0,1,{"$f":"IF(INTRO!$E$38=\"Endémique\", IF($H42>0, IF($H42=4,\"Inconnu\", IF($H42=99,\"Interrompu\", $D42)), 0),\"Non requis\")","v":0},{"$f":"IF(INTRO!$E$40=\"Endémique\", IF($I42>0, IF($I42=4,\"Inconnu\",IF($I42=99,\"Interrompu\", $D42)), 0),\"Non requis\")","v":"Inconnu"},{"$f":"IF(INTRO!$E$42=\"Endémique\", IF(AND($J42>1,$J42<5), IF($J42=4, \"Inconnu\", E42+F42), 0),\"Non requis\")","v":697},{"$f":"IF(INTRO!$E$44=\"Endémique\", IF(AND($K42>0,$K42<5), IF($K42=4,\"Inconnu\", IF($K42=1, $F42*0.33, IF($K42=2, $F42*0.5+$G42*0.2, SUM(F42:G42)))), 0),\"Non requis\")","v":0},0,0,2,0,"T3 (ALB/MBD)","T3 (ALB/MBD)",20361,"Haute-Banio"]
[{"$f":"IF(INTRO!$E$34<>0,INTRO!$E$34,\"\")","v":"Gabon"},"Sud","Mougoutsi",31732,3808,7933,18722,0,1,2,1,1,{"$f":"IF(INTRO!$E$38=\"Endémique\", IF($H43>0, IF($H43=4,\"Inconnu\", IF($H43=99,\"Interrompu\", $D43)), 0),\"Non requis\")","v":0},{"$f":"IF(INTRO!$E$40=\"Endémique\", IF($I43>0, IF($I43=4,\"Inconnu\",IF($I43=99,\"Interrompu\", $D43)), 0),\"Non requis\")","v":31732},{"$f":"IF(INTRO!$E$42=\"Endémique\", IF(AND($J43>1,$J43<5), IF($J43=4, \"Inconnu\", E43+F43), 0),\"Non requis\")","v":11741},{"$f":"IF(INTRO!$E$44=\"Endémique\", IF(AND($K43>0,$K43<5), IF($K43=4,\"Inconnu\", IF($K43=1, $F43*0.33, IF($K43=2, $F43*0.5+$G43*0.2, SUM(F43:G43)))), 0),\"Non requis\")","v":2617.8900000000003},0,0,1,1,"T1 (PZQ+ALB/MBD)",null,20362,"Mougoutsi"]
[{"$f":"IF(INTRO!$E$34<>0,INTRO!$E$34,\"\")","v":"Gabon"},"Est","Lopé",15841,1901,3960,9346,1,1,2,1,1,{"$f":"IF(INTRO!$E$38=\"Endémique\", IF($H44>0, IF($H44=4,\"Inconnu\", IF($H44=99,\"Interrompu\", $D44)), 0),\"Non requis\")","v":15841},{"$f":"IF(INTRO!$E$40=\"Endémique\", IF($I44>0, IF($I44=4,\"Inconnu\",IF($I44=99,\"Interrompu\", $D44)), 0),\"Non requis\")","v":15841},{"$f":"IF(INTRO!$E$42=\"Endémique\", IF(AND($J44>1,$J44<5), IF($J44=4, \"Inconnu\", E44+F44), 0),\"Non requis\")","v":5861},{"$f":"IF(INTRO!$E$44=\"Endémique\", IF(AND($K44>0,$K44<5), IF($K44=4,\"Inconnu\", IF($K44=1, $F44*0.33, IF($K44=2, $F44*0.5+$G44*0.2, SUM(F44:G44)))), 0),\"Non requis\")","v":1306.8},0,0,1,1,"T1 (PZQ+ALB/MBD)",null,20363,"Lopé"]
[{"$f":"IF(INTRO!$E$34<>0,INTRO!$E$34,\"\")","v":"Gabon"},"Est","Ivindo",34879,4185,8720,20579,1,1,2,1,1,{"$f":"IF(INTRO!$E$38=\"Endémique\", IF($H45>0, IF($H45=4,\"Inconnu\", IF($H45=99,\"Interrompu\", $D45)), 0),\"Non requis\")","v":34879},{"$f":"IF(INTRO!$E$40=\"Endémique\", IF($I45>0, IF($I45=4,\"Inconnu\",IF($I45=99,\"Interrompu\", $D45)), 0),\"Non requis\")","v":34879},{"$f":"IF(INTRO!$E$42=\"Endémique\", IF(AND($J45>1,$J45<5), IF($J45=4, \"Inconnu\", E45+F45), 0),\"Non requis\")","v":12905},{"$f":"IF(INTRO!$E$44=\"Endémique\", IF(AND($K45>0,$K45<5), IF($K45=4,\"Inconnu\", IF($K45=1, $F45*0.33, IF($K45=2, $F45*0.5+$G45*0.2, SUM(F45:G45)))), 0),\"Non requis\")","v":2877.6},0,0,1,1,"T1 (PZQ+ALB/MBD)",null,20364,"Ivindo"]
[{"$f":"IF(INTRO!$E$34<>0,INTRO!$E$34,\"\")","v":"Gabon"},"Est","Zadié",16488,1979,4122,9728,1,1,3,0,1,{"$f":"IF(INTRO!$E$38=\"Endémique\", IF($H46>0, IF($H46=4,\"Inconnu\", IF($H46=99,\"Interrompu\", $D46)), 0),\"Non requis\")","v":16488},{"$f":"IF(INTRO!$E$40=\"Endémique\", IF($I46>0, IF($I46=4,\"Inconnu\",IF($I46=99,\"Interrompu\", $D46)), 0),\"Non requis\")","v":16488},{"$f":"IF(INTRO!$E$42=\"Endémique\", IF(AND($J46>1,$J46<5), IF($J46=4, \"Inconnu\", E46+F46), 0),\"Non requis\")","v":6101},{"$f":"IF(INTRO!$E$44=\"Endémique\", IF(AND($K46>0,$K46<5), IF($K46=4,\"Inconnu\", IF($K46=1, $F46*0.33, IF($K46=2, $F46*0.5+$G46*0.2, SUM(F46:G46)))), 0),\"Non requis\")","v":0},0,0,2,0,"T3 (ALB/MBD)","T3 (ALB/MBD)",20365,"Zadié"]
[{"$f":"IF(INTRO!$E$34<>0,INTRO!$E$34,\"\")","v":"Gabon"},"Est","Mvoung",5606,673,1402,3308,1,1,3,1,1,{"$f":"IF(INTRO!$E$38=\"Endémique\", IF($H47>0, IF($H47=4,\"Inconnu\", IF($H47=99,\"Interrompu\", $D47)), 0),\"Non requis\")","v":5606},{"$f":"IF(INTRO!$E$40=\"Endémique\", IF($I47>0, IF($I47=4,\"Inconnu\",IF($I47=99,\"Interrompu\", $D47)), 0),\"Non requis\")","v":5606},{"$f":"IF(INTRO!$E$42=\"Endémique\", IF(AND($J47>1,$J47<5), IF($J47=4, \"Inconnu\", E47+F47), 0),\"Non requis\")","v":2075},{"$f":"IF(INTRO!$E$44=\"Endémique\", IF(AND($K47>0,$K47<5), IF($K47=4,\"Inconnu\", IF($K47=1, $F47*0.33, IF($K47=2, $F47*0.5+$G47*0.2, SUM(F47:G47)))), 0),\"Non requis\")","v":462.66},0,0,2,1,"T1 (PZQ+ALB/MBD)","T3 (ALB/MBD)",20366,"Mvoung"]
[{"$f":"IF(INTRO!$E$34<>0,INTRO!$E$34,\"\")","v":"Gabon"},"Centre-Est","Offoué-Onoye",3946,474,987,2328,1,1,3,1,1,{"$f":"IF(INTRO!$E$38=\"Endémique\", IF($H48>0, IF($H48=4,\"Inconnu\", IF($H48=99,\"Interrompu\", $D48)), 0),\"Non requis\")","v":3946},{"$f":"IF(INTRO!$E$40=\"Endémique\", IF($I48>0, IF($I48=4,\"Inconnu\",IF($I48=99,\"Interrompu\", $D48)), 0),\"Non requis\")","v":3946},{"$f":"IF(INTRO!$E$42=\"Endémique\", IF(AND($J48>1,$J48<5), IF($J48=4, \"Inconnu\", E48+F48), 0),\"Non requis\")","v":1461},{"$f":"IF(INTRO!$E$44=\"Endémique\", IF(AND($K48>0,$K48<5), IF($K48=4,\"Inconnu\", IF($K48=1, $F48*0.33, IF($K48=2, $F48*0.5+$G48*0.2, SUM(F48:G48)))), 0),\"Non requis\")","v":325.71000000000004},0,0,2,1,"T1 (PZQ+ALB/MBD)","T3 (ALB/MBD)",20367,"Offoué-Onoye"]
[{"$f":"IF(INTRO!$E$34<>0,INTRO!$E$34,\"\")","v":"Gabon"},"Centre-Est","Lolo-Bouenguidi",32984,3958,8246,19461,1,1,2,2,1,{"$f":"IF(INTRO!$E$38=\"Endémique\", IF($H49>0, IF($H49=4,\"Inconnu\", IF($H49=99,\"Interrompu\", $D49)), 0),\"Non requis\")","v":32984},{"$f":"IF(INTRO!$E$40=\"Endémique\", IF($I49>0, IF($I49=4,\"Inconnu\",IF($I49=99,\"Interrompu\", $D49)), 0),\"Non requis\")","v":32984},{"$f":"IF(INTRO!$E$42=\"Endémique\", IF(AND($J49>1,$J49<5), IF($J49=4, \"Inconnu\", E49+F49), 0),\"Non requis\")","v":12204},{"$f":"IF(INTRO!$E$44=\"Endémique\", IF(AND($K49>0,$K49<5), IF($K49=4,\"Inconnu\", IF($K49=1, $F49*0.33, IF($K49=2, $F49*0.5+$G49*0.2, SUM(F49:G49)))), 0),\"Non requis\")","v":8015.2000000000007},0,0,1,1,"T1 (PZQ+ALB/MBD)",null,20368,"Lolo-Bouenguidi"]
[{"$f":"IF(INTRO!$E$34<>0,INTRO!$E$34,\"\")","v":"Gabon"},"Centre-Est","Mulundu",33296,3996,8324,19645,1,1,2,1,1,{"$f":"IF(INTRO!$E$38=\"Endémique\", IF($H50>0, IF($H50=4,\"Inconnu\", IF($H50=99,\"Interrompu\", $D50)), 0),\"Non requis\")","v":33296},{"$f":"IF(INTRO!$E$40=\"Endémique\", IF($I50>0, IF($I50=4,\"Inconnu\",IF($I50=99,\"Interrompu\", $D50)), 0),\"Non requis\")","v":33296},{"$f":"IF(INTRO!$E$42=\"Endémique\", IF(AND($J50>1,$J50<5), IF($J50=4, \"Inconnu\", E50+F50), 0),\"Non requis\")","v":12320},{"$f":"IF(INTRO!$E$44=\"Endémique\", IF(AND($K50>0,$K50<5), IF($K50=4,\"Inconnu\", IF($K50=1, $F50*0.33, IF($K50=2, $F50*0.5+$G50*0.2, SUM(F50:G50)))), 0),\"Non requis\")","v":2746.92},0,0,1,1,"T1 (PZQ+ALB/MBD)",null,20369,"Mulundu"]
[{"$f":"IF(INTRO!$E$34<>0,INTRO!$E$34,\"\")","v":"Gabon"},"Centre-Est","Lombo-Bouenguidi",5498,660,1375,3244,0,1,3,1,1,{"$f":"IF(INTRO!$E$38=\"Endémique\", IF($H51>0, IF($H51=4,\"Inconnu\", IF($H51=99,\"Interrompu\", $D51)), 0),\"Non requis\")","v":0},{"$f":"IF(INTRO!$E$40=\"Endémique\", IF($I51>0, IF($I51=4,\"Inconnu\",IF($I51=99,\"Interrompu\", $D51)), 0),\"Non requis\")","v":5498},{"$f":"IF(INTRO!$E$42=\"Endémique\", IF(AND($J51>1,$J51<5), IF($J51=4, \"Inconnu\", E51+F51), 0),\"Non requis\")","v":2035},{"$f":"IF(INTRO!$E$44=\"Endémique\", IF(AND($K51>0,$K51<5), IF($K51=4,\"Inconnu\", IF($K51=1, $F51*0.33, IF($K51=2, $F51*0.5+$G51*0.2, SUM(F51:G51)))), 0),\"Non requis\")","v":453.75},0,0,2,1,"T1 (PZQ+ALB/MBD)","T3 (ALB/MBD)",20370,"Lombo-Bouenguidi"]
[{"$f":"IF(INTRO!$E$34<>0,INTRO!$E$34,\"\")","v":"Gabon"},"Maritime","Ndougou",11762,1411,2941,6940,0,4,2,1,1,{"$f":"IF(INTRO!$E$38=\"Endémique\", IF($H52>0, IF($H52=4,\"Inconnu\", IF($H52=99,\"Interrompu\", $D52)), 0),\"Non requis\")","v":0},{"$f":"IF(INTRO!$E$40=\"Endémique\", IF($I52>0, IF($I52=4,\"Inconnu\",IF($I52=99,\"Interrompu\", $D52)), 0),\"Non requis\")","v":"Inconnu"},{"$f":"IF(INTRO!$E$42=\"Endémique\", IF(AND($J52>1,$J52<5), IF($J52=4, \"Inconnu\", E52+F52), 0),\"Non requis\")","v":4352},{"$f":"IF(INTRO!$E$44=\"Endémique\", IF(AND($K52>0,$K52<5), IF($K52=4,\"Inconnu\", IF($K52=1, $F52*0.33, IF($K52=2, $F52*0.5+$G52*0.2, SUM(F52:G52)))), 0),\"Non requis\")","v":970.53000000000009},0,0,1,1,"T1 (PZQ+ALB/MBD)",null,20371,"Ndougou"]
[{"$f":"IF(INTRO!$E$34<>0,INTRO!$E$34,\"\")","v":"Gabon"},"Maritime","Etimboué",5252,630,1313,3099,0,0,2,1,1,{"$f":"IF(INTRO!$E$38=\"Endémique\", IF($H53>0, IF($H53=4,\"Inconnu\", IF($H53=99,\"Interrompu\", $D53)), 0),\"Non requis\")","v":0},{"$f":"IF(INTRO!$E$40=\"Endémique\", IF($I53>0, IF($I53=4,\"Inconnu\",IF($I53=99,\"Interrompu\", $D53)), 0),\"Non requis\")","v":0},{"$f":"IF(INTRO!$E$42=\"Endémique\", IF(AND($J53>1,$J53<5), IF($J53=4, \"Inconnu\", E53+F53), 0),\"Non requis\")","v":1943},{"$f":"IF(INTRO!$E$44=\"Endémique\", IF(AND($K53>0,$K53<5), IF($K53=4,\"Inconnu\", IF($K53=1, $F53*0.33, IF($K53=2, $F53*0.5+$G53*0.2, SUM(F53:G53)))), 0),\"Non requis\")","v":433.29},0,0,1,1,"T1 (PZQ+ALB/MBD)",null,20372,"Etimboué"]
[{"$f":"IF(INTRO!$E$34<>0,INTRO!$E$34,\"\")","v":"Gabon"},"Maritime","Bendjé",149376,17925,37344,88132,0,4,1,1,1,{"$f":"IF(INTRO!$E$38=\"Endémique\", IF($H54>0, IF($H54=4,\"Inconnu\", IF($H54=99,\"Interrompu\", $D54)), 0),\"Non requis\")","v":0},{"$f":"IF(INTRO!$E$40=\"Endémique\", IF($I54>0, IF($I54=4,\"Inconnu\",IF($I54=99,\"Interrompu\", $D54)), 0),\"Non requis\")","v":"Inconnu"},{"$f":"IF(INTRO!$E$42=\"Endémique\", IF(AND($J54>1,$J54<5), IF($J54=4, \"Inconnu\", E54+F54), 0),\"Non requis\")","v":0},{"$f":"IF(INTRO!$E$44=\"Endémique\", IF(AND($K54>0,$K54<5), IF($K54=4,\"Inconnu\", IF($K54=1, $F54*0.33, IF($K54=2, $F54*0.5+$G54*0.2, SUM(F54:G54)))), 0),\"Non requis\")","v":12323.52},0,0,0,1,"T2 (PZQ)",null,20373,"Bendjé"]
[{"$f":"IF(INTRO!$E$34<>0,INTRO!$E$34,\"\")","v":"Gabon"},"Nord","Ntem",53420,6410,13355,31518,0,1,3,1,1,{"$f":"IF(INTRO!$E$38=\"Endémique\", IF($H55>0, IF($H55=4,\"Inconnu\", IF($H55=99,\"Interrompu\", $D55)), 0),\"Non requis\")","v":0},{"$f":"IF(INTRO!$E$40=\"Endémique\", IF($I55>0, IF($I55=4,\"Inconnu\",IF($I55=99,\"Interrompu\", $D55)), 0),\"Non requis\")","v":53420},{"$f":"IF(INTRO!$E$42=\"Endémique\", IF(AND($J55>1,$J55<5), IF($J55=4, \"Inconnu\", E55+F55), 0),\"Non requis\")","v":19765},{"$f":"IF(INTRO!$E$44=\"Endémique\", IF(AND($K55>0,$K55<5), IF($K55=4,\"Inconnu\", IF($K55=1, $F55*0.33, IF($K55=2, $F55*0.5+$G55*0.2, SUM(F55:G55)))), 0),\"Non requis\")","v":4407.1500000000005},0,0,2,1,"T1 (PZQ+ALB/MBD)","T3 (ALB/MBD)",20374,"Ntem"]
[{"$f":"IF(INTRO!$E$34<>0,INTRO!$E$34,\"\")","v":"Gabon"},"Nord","Haut - Komo",5263,632,1316,3105,0,1,3,1,1,{"$f":"IF(INTRO!$E$38=\"Endémique\", IF($H56>0, IF($H56=4,\"Inconnu\", IF($H56=99,\"Interrompu\", $D56)), 0),\"Non requis\")","v":0},{"$f":"IF(INTRO!$E$40=\"Endémique\", IF($I56>0, IF($I56=4,\"Inconnu\",IF($I56=99,\"Interrompu\", $D56)), 0),\"Non requis\")","v":5263},{"$f":"IF(INTRO!$E$42=\"Endémique\", IF(AND($J56>1,$J56<5), IF($J56=4, \"Inconnu\", E56+F56), 0),\"Non requis\")","v":1948},{"$f":"IF(INTRO!$E$44=\"Endémique\", IF(AND($K56>0,$K56<5), IF($K56=4,\"Inconnu\", IF($K56=1, $F56*0.33, IF($K56=2, $F56*0.5+$G56*0.2, SUM(F56:G56)))), 0),\"Non requis\")","v":434.28000000000003},0,0,2,1,"T1 (PZQ+ALB/MBD)","T3 (ALB/MBD)",20375,"Haut-Komo"]
[{"$f":"IF(INTRO!$E$34<>0,INTRO!$E$34,\"\")","v":"Gabon"},"Nord","Haut-Ntem",17439,2093,4360,10289,0,1,3,1,1,{"$f":"IF(INTRO!$E$38=\"Endémique\", IF($H57>0, IF($H57=4,\"Inconnu\", IF($H57=99,\"Interrompu\", $D57)), 0),\"Non requis\")","v":0},{"$f":"IF(INTRO!$E$40=\"Endémique\", IF($I57>0, IF($I57=4,\"Inconnu\",IF($I57=99,\"Interrompu\", $D57)), 0),\"Non requis\")","v":17439},{"$f":"IF(INTRO!$E$42=\"Endémique\", IF(AND($J57>1,$J57<5), IF($J57=4, \"Inconnu\", E57+F57), 0),\"Non requis\")","v":6453},{"$f":"IF(INTRO!$E$44=\"Endémique\", IF(AND($K57>0,$K57<5), IF($K57=4,\"Inconnu\", IF($K57=1, $F57*0.33, IF($K57=2, $F57*0.5+$G57*0.2, SUM(F57:G57)))), 0),\"Non requis\")","v":1438.8},0,0,2,1,"T1 (PZQ+ALB/MBD)","T3 (ALB/MBD)",20376,"Haut-Ntem"]
[{"$f":"IF(INTRO!$E$34<>0,INTRO!$E$34,\"\")","v":"Gabon"},"Nord","Okano",19154,2298,4789,11301,0,0,3,1,1,{"$f":"IF(INTRO!$E$38=\"Endémique\", IF($H58>0, IF($H58=4,\"Inconnu\", IF($H58=99,\"Interrompu\", $D58)), 0),\"Non requis\")","v":0},{"$f":"IF(INTRO!$E$40=\"Endémique\", IF($I58>0, IF($I58=4,\"Inconnu\",IF($I58=99,\"Interrompu\", $D58)), 0),\"Non requis\")","v":0},{"$f":"IF(INTRO!$E$42=\"Endémique\", IF(AND($J58>1,$J58<5), IF($J58=4, \"Inconnu\", E58+F58), 0),\"Non requis\")","v":7087},{"$f":"IF(INTRO!$E$44=\"Endémique\", IF(AND($K58>0,$K58<5), IF($K58=4,\"Inconnu\", IF($K58=1, $F58*0.33, IF($K58=2, $F58*0.5+$G58*0.2, SUM(F58:G58)))), 0),\"Non requis\")","v":1580.3700000000001},0,0,2,1,"T1 (PZQ+ALB/MBD)","T3 (ALB/MBD)",20377,"Okano"]
[{"$f":"IF(INTRO!$E$34<>0,INTRO!$E$34,\"\")","v":"Gabon"},"Nord","Woleu",86333,10360,21583,50936,0,1,2,1,1,{"$f":"IF(INTRO!$E$38=\"Endémique\", IF($H59>0, IF($H59=4,\"Inconnu\", IF($H59=99,\"Interrompu\", $D59)), 0),\"Non requis\")","v":0},{"$f":"IF(INTRO!$E$40=\"Endémique\", IF($I59>0, IF($I59=4,\"Inconnu\",IF($I59=99,\"Interrompu\", $D59)), 0),\"Non requis\")","v":86333},{"$f":"IF(INTRO!$E$42=\"Endémique\", IF(AND($J59>1,$J59<5), IF($J59=4, \"Inconnu\", E59+F59), 0),\"Non requis\")","v":31943},{"$f":"IF(INTRO!$E$44=\"Endémique\", IF(AND($K59>0,$K59<5), IF($K59=4,\"Inconnu\", IF($K59=1, $F59*0.33, IF($K59=2, $F59*0.5+$G59*0.2, SUM(F59:G59)))), 0),\"Non requis\")","v":7122.39},0,0,1,1,"T1 (PZQ+ALB/MBD)",null,20378,"Woleu"]

{"sheet":"MDA1","index":2,"n_rows":59,"n_cols":17,"rows_kept":59,"cut":false,"hidden":false,"merged":[[5,13,5,16],[3,0,3,2],[5,0,5,2],[5,5,5,8],[5,9,5,12],[5,3,6,3],[5,4,6,4]]}
["MDA 1 - Ivermectine (IVM) et Albendazole (ALB)"]
["Structure administrative, population nécessitant une chimioprévention par groupe d'âge, population traitée par groupe d'âge et couverture"]
[]
["TOTAL",null,null,null,null,null,{"$f":"SUM(G$9:G$1000)","v":0},{"$f":"SUM(H$9:H$1000)","v":0},{"$f":"SUM(I$9:I$1000)","v":0},null,{"$f":"SUM(K$9:K$1000)","v":0},{"$f":"SUM(L$9:L$1000)","v":0},{"$f":"SUM(M$9:M$1000)","v":0},null,{"$f":"IF(G4<>0, IF(K4/G4*100=0, \"-\", K4/G4*100), \" \")","v":" "},{"$f":"IF(H4<>0, IF(L4/H4*100=0, \"-\", L4/H4*100), \" \")","v":" "},{"$f":"IF(I4<>0, IF(M4/I4*100=0, \"-\", M4/I4*100), \" \")","v":" "}]
[]
["Structure administrative du pays",null,null,"Mise en oeuvre \nde la CP","Date","Population ciblée pour MDA 1",null,null,null,"Population traitée",null,null,null,"Couverture du Programme (%)"]
["Pays","Région/Département","District",null,null,"EAPréS","EAS","Adultes","Total","EAPréS","EAS","Adultes","Total","EAPréS","EAS","Adultes","Total"]
[]
[{"$f":"IF(COUNTRY_INFO!A9=0,\" \",COUNTRY_INFO!A9)","v":"Gabon"},{"$f":"IF(COUNTRY_INFO!B9=0,\" \",COUNTRY_INFO!B9)","v":"Libreville-Owendo"},{"$f":"IF(COUNTRY_INFO!C9=0,\" \",COUNTRY_INFO!C9)","v":"Libreville 1"},{"$f":"IF(COUNTRY_INFO!$U$9:$U$1000=\"MDA1 (IVM+ALB)\", COUNTRY_INFO!$U$9:$U$1000, \" \")","v":" "},null,null,null,null,{"$f":"SUM(F9:H9)","v":0},null,null,null,{"$f":"SUM(J9:L9)","v":0},null,{"$f":"IF(G9<>0, IF(K9/G9*100=0, \"-\", K9/G9*100), \" \")","v":" "},{"$f":"IF(H9<>0, IF(L9/H9*100=0, \"-\", L9/H9*100), \" \")","v":" "}," "]
[{"$f":"IF(COUNTRY_INFO!A10=0,\" \",COUNTRY_INFO!A10)","v":"Gabon"},{"$f":"IF(COUNTRY_INFO!B10=0,\" \",COUNTRY_INFO!B10)","v":"Libreville-Owendo"},{"$f":"IF(COUNTRY_INFO!C10=0,\" \",COUNTRY_INFO!C10)","v":"Libreville 2"},{"$f":"IF(COUNTRY_INFO!$U$9:$U$1000=\"MDA1 (IVM+ALB)\", COUNTRY_INFO!$U$9:$U$1000, \" \")","v":" "},null,null,null,null,{"$f":"SUM(F10:H10)","v":0},null,null,null,{"$f":"SUM(J10:L10)","v":0},null,{"$f":"IF(G10<>0, IF(K10/G10*100=0, \"-\", K10/G10*100), \" \")","v":" "},{"$f":"IF(H10<>0, IF(L10/H10*100=0, \"-\", L10/H10*100), \" \")","v":" "},{"$f":"IF(I10<>0, IF(M10/I10*100=0, \"-\", M10/I10*100), \" \")","v":" "}]
[{"$f":"IF(COUNTRY_INFO!A11=0,\" \",COUNTRY_INFO!A11)","v":"Gabon"},{"$f":"IF(COUNTRY_INFO!B11=0,\" \",COUNTRY_INFO!B11)","v":"Libreville-Owendo"},{"$f":"IF(COUNTRY_INFO!C11=0,\" \",COUNTRY_INFO!C11)","v":"Libreville 3"},{"$f":"IF(COUNTRY_INFO!$U$9:$U$1000=\"MDA1 (IVM+ALB)\", COUNTRY_INFO!$U$9:$U$1000, \" \")","v":" "},null,null,null,null,0,null,null,null,0,null," "," "," "]
[{"$f":"IF(COUNTRY_INFO!A12=0,\" \",COUNTRY_INFO!A12)","v":"Gabon"},{"$f":"IF(COUNTRY_INFO!B12=0,\" \",COUNTRY_INFO!B12)","v":"Libreville-Owendo"},{"$f":"IF(COUNTRY_INFO!C12=0,\" \",COUNTRY_INFO!C12)","v":"Owendo"},{"$f":"IF(COUNTRY_INFO!$U$9:$U$1000=\"MDA1 (IVM+ALB)\", COUNTRY_INFO!$U$9:$U$1000, \" \")","v":" "},null,null,null,null,0,null,null,null,0,null," "," "," "]
[{"$f":"IF(COUNTRY_INFO!A13=0,\" \",COUNTRY_INFO!A13)","v":"Gabon"},{"$f":"IF(COUNTRY_INFO!B13=0,\" \",COUNTRY_INFO!B13)","v":"Ouest"},{"$f":"IF(COUNTRY_INFO!C13=0,\" \",COUNTRY_INFO!C13)","v":"Komo-Mondah"},{"$f":"IF(COUNTRY_INFO!$U$9:$U$1000=\"MDA1 (IVM+ALB)\", COUNTRY_INFO!$U$9:$U$1000, \" \")","v":" "},null,null,null,null,0,null,null,null,0,null," "," "," "]
[{"$f":"IF(COUNTRY_INFO!A14=0,\" \",COUNTRY_INFO!A14)","v":"Gabon"},{"$f":"IF(COUNTRY_INFO!B14=0,\" \",COUNTRY_INFO!B14)","v":"Ouest"},{"$f":"IF(COUNTRY_INFO!C14=0,\" \",COUNTRY_INFO!C14)","v":"Komo-Kango"},{"$f":"IF(COUNTRY_INFO!$U$9:$U$1000=\"MDA1 (IVM+ALB)\", COUNTRY_INFO!$U$9:$U$1000, \" \")","v":" "},null,null,null,null,0,null,null,null,0,null," "," "," "]
[{"$f":"IF(COUNTRY_INFO!A15=0,\" \",COUNTRY_INFO!A15)","v":"Gabon"},{"$f":"IF(COUNTRY_INFO!B15=0,\" \",COUNTRY_INFO!B15)","v":"Ouest"},{"$f":"IF(COUNTRY_INFO!C15=0,\" \",COUNTRY_INFO!C15)","v":"Noya"},{"$f":"IF(COUNTRY_INFO!$U$9:$U$1000=\"MDA1 (IVM+ALB)\", COUNTRY_INFO!$U$9:$U$1000, \" \")","v":" "},null,null,null,null,0,null,null,null,0,null," "," "," "]
[{"$f":"IF(COUNTRY_INFO!A16=0,\" \",COUNTRY_INFO!A16)","v":"Gabon"},{"$f":"IF(COUNTRY_INFO!B16=0,\" \",COUNTRY_INFO!B16)","v":"Sud-Est"},{"$f":"IF(COUNTRY_INFO!C16=0,\" \",COUNTRY_INFO!C16)","v":"Bayi-brikolo"},{"$f":"IF(COUNTRY_INFO!$U$9:$U$1000=\"MDA1 (IVM+ALB)\", COUNTRY_INFO!$U$9:$U$1000, \" \")","v":" "},null,null,null,null,0,null,null,null,0,null," "," "," "]
[{"$f":"IF(COUNTRY_INFO!A17=0,\" \",COUNTRY_INFO!A17)","v":"Gabon"},{"$f":"IF(COUNTRY_INFO!B17=0,\" \",COUNTRY_INFO!B17)","v":"Sud-Est"},{"$f":"IF(COUNTRY_INFO!C17=0,\" \",COUNTRY_INFO!C17)","v":"Lékoni-Lékori"},{"$f":"IF(COUNTRY_INFO!$U$9:$U$1000=\"MDA1 (IVM+ALB)\", COUNTRY_INFO!$U$9:$U$1000, \" \")","v":" "},null,null,null,null,0,null,null,null,0,null," "," "," "]
[{"$f":"IF(COUNTRY_INFO!A18=0,\" \",COUNTRY_INFO!A18)","v":"Gabon"},{"$f":"IF(COUNTRY_INFO!B18=0,\" \",COUNTRY_INFO!B18)","v":"Sud-Est"},{"$f":"IF(COUNTRY_INFO!C18=0,\" \",COUNTRY_INFO!C18)","v":"Lékoko"},{"$f":"IF(COUNTRY_INFO!$U$9:$U$1000=\"MDA1 (IVM+ALB)\", COUNTRY_INFO!$U$9:$U$1000, \" \")","v":" "},null,null,null,null,0,null,null,null,0,null," "," "," "]
[{"$f":"IF(COUNTRY_INFO!A19=0,\" \",COUNTRY_INFO!A19)","v":"Gabon"},{"$f":"IF(COUNTRY_INFO!B19=0,\" \",COUNTRY_INFO!B19)","v":"Sud-Est"},{"$f":"IF(COUNTRY_INFO!C19=0,\" \",COUNTRY_INFO!C19)","v":"Djouori-Agnili"},{"$f":"IF(COUNTRY_INFO!$U$9:$U$1000=\"MDA1 (IVM+ALB)\", COUNTRY_INFO!$U$9:$U$1000, \" \")","v":" "},null,null,null,null,0,null,null,null,0,null," "," "," "]
[{"$f":"IF(COUNTRY_INFO!A20=0,\" \",COUNTRY_INFO!A20)","v":"Gabon"},{"$f":"IF(COUNTRY_INFO!B20=0,\" \",COUNTRY_INFO!B20)","v":"Sud-Est"},{"$f":"IF(COUNTRY_INFO!C20=0,\" \",COUNTRY_INFO!C20)","v":"Ogooué-Létili"},{"$f":"IF(COUNTRY_INFO!$U$9:$U$1000=\"MDA1 (IVM+ALB)\", COUNTRY_INFO!$U$9:$U$1000, \" \")","v":" "},null,null,null,null,0,null,null,null,0,null," "," "," "]
[{"$f":"IF(COUNTRY_INFO!A21=0,\" \",COUNTRY_INFO!A21)","v":"Gabon"},{"$f":"IF(COUNTRY_INFO!B21=0,\" \",COUNTRY_INFO!B21)","v":"Sud-Est"},{"$f":"IF(COUNTRY_INFO!C21=0,\" \",COUNTRY_INFO!C21)","v":"Mpassa"},{"$f":"IF(COUNTRY_INFO!$U$9:$U$1000=\"MDA1 (IVM+ALB)\", COUNTRY_INFO!$U$9:$U$1000, \" \")","v":" "},null,null,null,null,0,null,null,null,0,null," "," "," "]
[{"$f":"IF(COUNTRY_INFO!A22=0,\" \",COUNTRY_INFO!A22)","v":"Gabon"},{"$f":"IF(COUNTRY_INFO!B22=0,\" \",COUNTRY_INFO!B22)","v":"Sud-Est"},{"$f":"IF(COUNTRY_INFO!C22=0,\" \",COUNTRY_INFO!C22)","v":"Plateaux"},{"$f":"IF(COUNTRY_INFO!$U$9:$U$1000=\"MDA1 (IVM+ALB)\", COUNTRY_INFO!$U$9:$U$1000, \" \")","v":" "},null,null,null,null,0,null,null,null,0,null," "," "," "]
[{"$f":"IF(COUNTRY_INFO!A23=0,\" \",COUNTRY_INFO!A23)","v":"Gabon"},{"$f":"IF(COUNTRY_INFO!B23=0,\" \",COUNTRY_INFO!B23)","v":"Sud-Est"},{"$f":"IF(COUNTRY_INFO!C23=0,\" \",COUNTRY_INFO!C23)","v":"Lébombi-Léyou"},{"$f":"IF(COUNTRY_INFO!$U$9:$U$1000=\"MDA1 (IVM+ALB)\", COUNTRY_INFO!$U$9:$U$1000, \" \")","v":" "},null,null,null,null,0,null,null,null,0,null," "," "," "]
[{"$f":"IF(COUNTRY_INFO!A24=0,\" \",COUNTRY_INFO!A24)","v":"Gabon"},{"$f":"IF(COUNTRY_INFO!B24=0,\" \",COUNTRY_INFO!B24)","v":"Sud-Est"},{"$f":"IF(COUNTRY_INFO!C24=0,\" \",COUNTRY_INFO!C24)","v":"Lékabi-Léwolo"},{"$f":"IF(COUNTRY_INFO!$U$9:$U$1000=\"MDA1 (IVM+ALB)\", COUNTRY_INFO!$U$9:$U$1000, \" \")","v":" "},null,null,null,null,0,null,null,null,0,null," "," "," "]
[{"$f":"IF(COUNTRY_INFO!A25=0,\" \",COUNTRY_INFO!A25)","v":"Gabon"},{"$f":"IF(COUNTRY_INFO!B25=0,\" \",COUNTRY_INFO!B25)","v":"Sud-Est"},{"$f":"IF(COUNTRY_INFO!C25=0,\" \",COUNTRY_INFO!C25)","v":"Sébé-Brikolo"},{"$f":"IF(COUNTRY_INFO!$U$9:$U$1000=\"MDA1 (IVM+ALB)\", COUNTRY_INFO!$U$9:$U$1000, \" \")","v":" "},null,null,null,null,0,null,null,null,0,null," "," "," "]
[{"$f":"IF(COUNTRY_INFO!A26=0,\" \",COUNTRY_INFO!A26)","v":"Gabon"},{"$f":"IF(COUNTRY_INFO!B26=0,\" \",COUNTRY_INFO!B26)","v":"Sud-Est"},{"$f":"IF(COUNTRY_INFO!C26=0,\" \",COUNTRY_INFO!C26)","v":"Djoué"},{"$f":"IF(COUNTRY_INFO!$U$9:$U$1000=\"MDA1 (IVM+ALB)\", COUNTRY_INFO!$U$9:$U$1000, \" \")","v":" "},null,null,null,null,0,null,null,null,0,null," "," "," "]
[{"$f":"IF(COUNTRY_INFO!A27=0,\" \",COUNTRY_INFO!A27)","v":"Gabon"},{"$f":"IF(COUNTRY_INFO!B27=0,\" \",COUNTRY_INFO!B27)","v":"Centre"},{"$f":"IF(COUNTRY_INFO!C27=0,\" \",COUNTRY_INFO!C27)","v":"Ogooué-et-Lacs"},{"$f":"IF(COUNTRY_INFO!$U$9:$U$1000=\"MDA1 (IVM+ALB)\", COUNTRY_INFO!$U$9:$U$1000, \" \")","v":" "},null,null,null,null,0,null,null,null,0,null," "," "," "]
[{"$f":"IF(COUNTRY_INFO!A28=0,\" \",COUNTRY_INFO!A28)","v":"Gabon"},{"$f":"IF(COUNTRY_INFO!B28=0,\" \",COUNTRY_INFO!B28)","v":"Centre"},{"$f":"IF(COUNTRY_INFO!C28=0,\" \",COUNTRY_INFO!C28)","v":"Abanga-Bigné"},{"$f":"IF(COUNTRY_INFO!$U$9:$U$1000=\"MDA1 (IVM+ALB)\", COUNTRY_INFO!$U$9:$U$1000, \" \")","v":" "},null,null,null,null,0,null,null,null,0,null," "," "," "]
[{"$f":"IF(COUNTRY_INFO!A29=0,\" \",COUNTRY_INFO!A29)","v":"Gabon"},{"$f":"IF(COUNTRY_INFO!B29=0,\" \",COUNTRY_INFO!B29)","v":"Centre-Sud"},{"$f":"IF(COUNTRY_INFO!C29=0,\" \",COUNTRY_INFO!C29)","v":"Tsamba-Magotsi"},{"$f":"IF(COUNTRY_INFO!$U$9:$U$1000=\"MDA1 (IVM+ALB)\", COUNTRY_INFO!$U$9:$U$1000, \" \")","v":" "},null,null,null,null,0,null,null,null,0,null," "," "," "]
[{"$f":"IF(COUNTRY_INFO!A30=0,\" \",COUNTRY_INFO!A30)","v":"Gabon"},{"$f":"IF(COUNTRY_INFO!B30=0,\" \",COUNTRY_INFO!B30)","v":"Centre-Sud"},{"$f":"IF(COUNTRY_INFO!C30=0,\" \",COUNTRY_INFO!C30)","v":"Louetsi-Wano"},{"$f":"IF(COUNTRY_INFO!$U$9:$U$1000=\"MDA1 (IVM+ALB)\", COUNTRY_INFO!$U$9:$U$1000, \" \")","v":" "},null,null,null,null,0,null,null,null,0,null," "," "," "]
[{"$f":"IF(COUNTRY_INFO!A31=0,\" \",COUNTRY_INFO!A31)","v":"Gabon"},{"$f":"IF(COUNTRY_INFO!B31=0,\" \",COUNTRY_INFO!B31)","v":"Centre-Sud"},{"$f":"IF(COUNTRY_INFO!C31=0,\" \",COUNTRY_INFO!C31)","v":"Louetsi-Bibaka"},{"$f":"IF(COUNTRY_INFO!$U$9:$U$1000=\"MDA1 (IVM+ALB)\", COUNTRY_INFO!$U$9:$U$1000, \" \")","v":" "},null,null,null,null,0,null,null,null,0,null," "," "," "]
[{"$f":"IF(COUNTRY_INFO!A32=0,\" \",COUNTRY_INFO!A32)","v":"Gabon"},{"$f":"IF(COUNTRY_INFO!B32=0,\" \",COUNTRY_INFO!B32)","v":"Centre-Sud"},{"$f":"IF(COUNTRY_INFO!C32=0,\" \",COUNTRY_INFO!C32)","v":"Ndolou"},{"$f":"IF(COUNTRY_INFO!$U$9:$U$1000=\"MDA1 (IVM+ALB)\", COUNTRY_INFO!$U$9:$U$1000, \" \")","v":" "},null,null,null,null,0,null,null,null,0,null," "," "," "]
[{"$f":"IF(COUNTRY_INFO!A33=0,\" \",COUNTRY_INFO!A33)","v":"Gabon"},{"$f":"IF(COUNTRY_INFO!B33=0,\" \",COUNTRY_INFO!B33)","v":"Centre-Sud"},{"$f":"IF(COUNTRY_INFO!C33=0,\" \",COUNTRY_INFO!C33)","v":"Boumi-Louetsi"},{"$f":"IF(COUNTRY_INFO!$U$9:$U$1000=\"MDA1 (IVM+ALB)\", COUNTRY_INFO!$U$9:$U$1000, \" \")","v":" "},null,null,null,null,0,null,null,null,0,null," "," "," "]
[{"$f":"IF(COUNTRY_INFO!A34=0,\" \",COUNTRY_INFO!A34)","v":"Gabon"},{"$f":"IF(COUNTRY_INFO!B34=0,\" \",COUNTRY_INFO!B34)","v":"Centre-Sud"},{"$f":"IF(COUNTRY_INFO!C34=0,\" \",COUNTRY_INFO!C34)","v":"Ogoulou"},{"$f":"IF(COUNTRY_INFO!$U$9:$U$1000=\"MDA1 (IVM+ALB)\", COUNTRY_INFO!$U$9:$U$1000, \" \")","v":" "},null,null,null,null,0,null,null,null,0,null," "," "," "]
[{"$f":"IF(COUNTRY_INFO!A35=0,\" \",COUNTRY_INFO!A35)","v":"Gabon"},{"$f":"IF(COUNTRY_INFO!B35=0,\" \",COUNTRY_INFO!B35)","v":"Centre-Sud"},{"$f":"IF(COUNTRY_INFO!C35=0,\" \",COUNTRY_INFO!C35)","v":"Douya-Onoye"},{"$f":"IF(COUNTRY_INFO!$U$9:$U$1000=\"MDA1 (IVM+ALB)\", COUNTRY_INFO!$U$9:$U$1000, \" \")","v":" "},null,null,null,null,0,null,null,null,0,null," "," "," "]
[{"$f":"IF(COUNTRY_INFO!A36=0,\" \",COUNTRY_INFO!A36)","v":"Gabon"},{"$f":"IF(COUNTRY_INFO!B36=0,\" \",COUNTRY_INFO!B36)","v":"Centre-Sud"},{"$f":"IF(COUNTRY_INFO!C36=0,\" \",COUNTRY_INFO!C36)","v":"Dola"},{"$f":"IF(COUNTRY_INFO!$U$9:$U$1000=\"MDA1 (IVM+ALB)\", COUNTRY_INFO!$U$9:$U$1000, \" \")","v":" "},null,null,null,null,0,null,null,null,0,null," "," "," "]
[{"$f":"IF(COUNTRY_INFO!A37=0,\" \",COUNTRY_INFO!A37)","v":"Gabon"},{"$f":"IF(COUNTRY_INFO!B37=0,\" \",COUNTRY_INFO!B37)","v":"Centre-Sud"},{"$f":"IF(COUNTRY_INFO!C37=0,\" \",COUNTRY_INFO!C37)","v":"Mougalaba"},{"$f":"IF(COUNTRY_INFO!$U$9:$U$1000=\"MDA1 (IVM+ALB)\", COUNTRY_INFO!$U$9:$U$1000, \" \")","v":" "},null,null,null,null,0,null,null,null,0,null," "," "," "]
[{"$f":"IF(COUNTRY_INFO!A38=0,\" \",COUNTRY_INFO!A38)","v":"Gabon"},{"$f":"IF(COUNTRY_INFO!B38=0,\" \",COUNTRY_INFO!B38)","v":"Sud"},{"$f":"IF(COUNTRY_INFO!C38=0,\" \",COUNTRY_INFO!C38)","v":"Doutsila"},{"$f":"IF(COUNTRY_INFO!$U$9:$U$1000=\"MDA1 (IVM+ALB)\", COUNTRY_INFO!$U$9:$U$1000, \" \")","v":" "},null,null,null,null,0,null,null,null,0,null," "," "," "]
[{"$f":"IF(COUNTRY_INFO!A39=0,\" \",COUNTRY_INFO!A39)","v":"Gabon"},{"$f":"IF(COUNTRY_INFO!B39=0,\" \",COUNTRY_INFO!B39)","v":"Sud"},{"$f":"IF(COUNTRY_INFO!C39=0,\" \",COUNTRY_INFO!C39)","v":"Basse-Banio"},{"$f":"IF(COUNTRY_INFO!$U$9:$U$1000=\"MDA1 (IVM+ALB)\", COUNTRY_INFO!$U$9:$U$1000, \" \")","v":" "},null,null,null,null,0,null,null,null,0,null," "," "," "]
[{"$f":"IF(COUNTRY_INFO!A40=0,\" \",COUNTRY_INFO!A40)","v":"Gabon"},{"$f":"IF(COUNTRY_INFO!B40=0,\" \",COUNTRY_INFO!B40)","v":"Sud"},{"$f":"IF(COUNTRY_INFO!C40=0,\" \",COUNTRY_INFO!C40)","v":"Douigny"},{"$f":"IF(COUNTRY_INFO!$U$9:$U$1000=\"MDA1 (IVM+ALB)\", COUNTRY_INFO!$U$9:$U$1000, \" \")","v":" "},null,null,null,null,0,null,null,null,0,null," "," "," "]
[{"$f":"IF(COUNTRY_INFO!A41=0,\" \",COUNTRY_INFO!A41)","v":"Gabon"},{"$f":"IF(COUNTRY_INFO!B41=0,\" \",COUNTRY_INFO!B41)","v":"Sud"},{"$f":"IF(COUNTRY_INFO!C41=0,\" \",COUNTRY_INFO!C41)","v":"Mongo"},{"$f":"IF(COUNTRY_INFO!$U$9:$U$1000=\"MDA1 (IVM+ALB)\", COUNTRY_INFO!$U$9:$U$1000, \" \")","v":" "},null,null,null,null,0,null,null,null,0,null," "," "," "]
[{"$f":"IF(COUNTRY_INFO!A42=0,\" \",COUNTRY_INFO!A42)","v":"Gabon"},{"$f":"IF(COUNTRY_INFO!B42=0,\" \",COUNTRY_INFO!B42)","v":"Sud"},{"$f":"IF(COUNTRY_INFO!C42=0,\" \",COUNTRY_INFO!C42)","v":"Haute-Banio"},{"$f":"IF(COUNTRY_INFO!$U$9:$U$1000=\"MDA1 (IVM+ALB)\", COUNTRY_INFO!$U$9:$U$1000, \" \")","v":" "},null,null,null,null,0,null,null,null,0,null," "," "," "]
[{"$f":"IF(COUNTRY_INFO!A43=0,\" \",COUNTRY_INFO!A43)","v":"Gabon"},{"$f":"IF(COUNTRY_INFO!B43=0,\" \",COUNTRY_INFO!B43)","v":"Sud"},{"$f":"IF(COUNTRY_INFO!C43=0,\" \",COUNTRY_INFO!C43)","v":"Mougoutsi"},{"$f":"IF(COUNTRY_INFO!$U$9:$U$1000=\"MDA1 (IVM+ALB)\", COUNTRY_INFO!$U$9:$U$1000, \" \")","v":" "},null,null,null,null,0,null,null,null,0,null," "," "," "]
[{"$f":"IF(COUNTRY_INFO!A44=0,\" \",COUNTRY_INFO!A44)","v":"Gabon"},{"$f":"IF(COUNTRY_INFO!B44=0,\" \",COUNTRY_INFO!B44)","v":"Est"},{"$f":"IF(COUNTRY_INFO!C44=0,\" \",COUNTRY_INFO!C44)","v":"Lopé"},{"$f":"IF(COUNTRY_INFO!$U$9:$U$1000=\"MDA1 (IVM+ALB)\", COUNTRY_INFO!$U$9:$U$1000, \" \")","v":" "},null,null,null,null,0,null,null,null,0,null," "," "," "]
[{"$f":"IF(COUNTRY_INFO!A45=0,\" \",COUNTRY_INFO!A45)","v":"Gabon"},{"$f":"IF(COUNTRY_INFO!B45=0,\" \",COUNTRY_INFO!B45)","v":"Est"},{"$f":"IF(COUNTRY_INFO!C45=0,\" \",COUNTRY_INFO!C45)","v":"Ivindo"},{"$f":"IF(COUNTRY_INFO!$U$9:$U$1000=\"MDA1 (IVM+ALB)\", COUNTRY_INFO!$U$9:$U$1000, \" \")","v":" "},null,null,null,null,0,null,null,null,0,null," "," "," "]
[{"$f":"IF(COUNTRY_INFO!A46=0,\" \",COUNTRY_INFO!A46)","v":"Gabon"},{"$f":"IF(COUNTRY_INFO!B46=0,\" \",COUNTRY_INFO!B46)","v":"Est"},{"$f":"IF(COUNTRY_INFO!C46=0,\" \",COUNTRY_INFO!C46)","v":"Zadié"},{"$f":"IF(COUNTRY_INFO!$U$9:$U$1000=\"MDA1 (IVM+ALB)\", COUNTRY_INFO!$U$9:$U$1000, \" \")","v":" "},null,null,null,null,0,null,null,null,0,null," "," "," "]
[{"$f":"IF(COUNTRY_INFO!A47=0,\" \",COUNTRY_INFO!A47)","v":"Gabon"},{"$f":"IF(COUNTRY_INFO!B47=0,\" \",COUNTRY_INFO!B47)","v":"Est"},{"$f":"IF(COUNTRY_INFO!C47=0,\" \",COUNTRY_INFO!C47)","v":"Mvoung"},{"$f":"IF(COUNTRY_INFO!$U$9:$U$1000=\"MDA1 (IVM+ALB)\", COUNTRY_INFO!$U$9:$U$1000, \" \")","v":" "},null,null,null,null,0,null,null,null,0,null," "," "," "]
[{"$f":"IF(COUNTRY_INFO!A48=0,\" \",COUNTRY_INFO!A48)","v":"Gabon"},{"$f":"IF(COUNTRY_INFO!B48=0,\" \",COUNTRY_INFO!B48)","v":"Centre-Est"},{"$f":"IF(COUNTRY_INFO!C48=0,\" \",COUNTRY_INFO!C48)","v":"Offoué-Onoye"},{"$f":"IF(COUNTRY_INFO!$U$9:$U$1000=\"MDA1 (IVM+ALB)\", COUNTRY_INFO!$U$9:$U$1000, \" \")","v":" "},null,null,null,null,0,null,null,null,0,null," "," "," "]
[{"$f":"IF(COUNTRY_INFO!A49=0,\" \",COUNTRY_INFO!A49)","v":"Gabon"},{"$f":"IF(COUNTRY_INFO!B49=0,\" \",COUNTRY_INFO!B49)","v":"Centre-Est"},{"$f":"IF(COUNTRY_INFO!C49=0,\" \",COUNTRY_INFO!C49)","v":"Lolo-Bouenguidi"},{"$f":"IF(COUNTRY_INFO!$U$9:$U$1000=\"MDA1 (IVM+ALB)\", COUNTRY_INFO!$U$9:$U$1000, \" \")","v":" "},null,null,null,null,0,null,null,null,0,null," "," "," "]
[{"$f":"IF(COUNTRY_INFO!A50=0,\" \",COUNTRY_INFO!A50)","v":"Gabon"},{"$f":"IF(COUNTRY_INFO!B50=0,\" \",COUNTRY_INFO!B50)","v":"Centre-Est"},{"$f":"IF(COUNTRY_INFO!C50=0,\" \",COUNTRY_INFO!C50)","v":"Mulundu"},{"$f":"IF(COUNTRY_INFO!$U$9:$U$1000=\"MDA1 (IVM+ALB)\", COUNTRY_INFO!$U$9:$U$1000, \" \")","v":" "},null,null,null,null,0,null,null,null,0,null," "," "," "]
[{"$f":"IF(COUNTRY_INFO!A51=0,\" \",COUNTRY_INFO!A51)","v":"Gabon"},{"$f":"IF(COUNTRY_INFO!B51=0,\" \",COUNTRY_INFO!B51)","v":"Centre-Est"},{"$f":"IF(COUNTRY_INFO!C51=0,\" \",COUNTRY_INFO!C51)","v":"Lombo-Bouenguidi"},{"$f":"IF(COUNTRY_INFO!$U$9:$U$1000=\"MDA1 (IVM+ALB)\", COUNTRY_INFO!$U$9:$U$1000, \" \")","v":" "},null,null,null,null,0,null,null,null,0,null," "," "," "]
[{"$f":"IF(COUNTRY_INFO!A52=0,\" \",COUNTRY_INFO!A52)","v":"Gabon"},{"$f":"IF(COUNTRY_INFO!B52=0,\" \",COUNTRY_INFO!B52)","v":"Maritime"},{"$f":"IF(COUNTRY_INFO!C52=0,\" \",COUNTRY_INFO!C52)","v":"Ndougou"},{"$f":"IF(COUNTRY_INFO!$U$9:$U$1000=\"MDA1 (IVM+ALB)\", COUNTRY_INFO!$U$9:$U$1000, \" \")","v":" "},null,null,null,null,0,null,null,null,0,null," "," "," "]
[{"$f":"IF(COUNTRY_INFO!A53=0,\" \",COUNTRY_INFO!A53)","v":"Gabon"},{"$f":"IF(COUNTRY_INFO!B53=0,\" \",COUNTRY_INFO!B53)","v":"Maritime"},{"$f":"IF(COUNTRY_INFO!C53=0,\" \",COUNTRY_INFO!C53)","v":"Etimboué"},{"$f":"IF(COUNTRY_INFO!$U$9:$U$1000=\"MDA1 (IVM+ALB)\", COUNTRY_INFO!$U$9:$U$1000, \" \")","v":" "},null,null,null,null,0,null,null,null,0,null," "," "," "]
[{"$f":"IF(COUNTRY_INFO!A54=0,\" \",COUNTRY_INFO!A54)","v":"Gabon"},{"$f":"IF(COUNTRY_INFO!B54=0,\" \",COUNTRY_INFO!B54)","v":"Maritime"},{"$f":"IF(COUNTRY_INFO!C54=0,\" \",COUNTRY_INFO!C54)","v":"Bendjé"},{"$f":"IF(COUNTRY_INFO!$U$9:$U$1000=\"MDA1 (IVM+ALB)\", COUNTRY_INFO!$U$9:$U$1000, \" \")","v":" "},null,null,null,null,0,null,null,null,0,null," "," "," "]
[{"$f":"IF(COUNTRY_INFO!A55=0,\" \",COUNTRY_INFO!A55)","v":"Gabon"},{"$f":"IF(COUNTRY_INFO!B55=0,\" \",COUNTRY_INFO!B55)","v":"Nord"},{"$f":"IF(COUNTRY_INFO!C55=0,\" \",COUNTRY_INFO!C55)","v":"Ntem"},{"$f":"IF(COUNTRY_INFO!$U$9:$U$1000=\"MDA1 (IVM+ALB)\", COUNTRY_INFO!$U$9:$U$1000, \" \")","v":" "},null,null,null,null,0,null,null,null,0,null," "," "," "]
[{"$f":"IF(COUNTRY_INFO!A56=0,\" \",COUNTRY_INFO!A56)","v":"Gabon"},{"$f":"IF(COUNTRY_INFO!B56=0,\" \",COUNTRY_INFO!B56)","v":"Nord"},{"$f":"IF(COUNTRY_INFO!C56=0,\" \",COUNTRY_INFO!C56)","v":"Haut - Komo"},{"$f":"IF(COUNTRY_INFO!$U$9:$U$1000=\"MDA1 (IVM+ALB)\", COUNTRY_INFO!$U$9:$U$1000, \" \")","v":" "},null,null,null,null,0,null,null,null,0,null," "," "," "]
[{"$f":"IF(COUNTRY_INFO!A57=0,\" \",COUNTRY_INFO!A57)","v":"Gabon"},{"$f":"IF(COUNTRY_INFO!B57=0,\" \",COUNTRY_INFO!B57)","v":"Nord"},{"$f":"IF(COUNTRY_INFO!C57=0,\" \",COUNTRY_INFO!C57)","v":"Haut-Ntem"},{"$f":"IF(COUNTRY_INFO!$U$9:$U$1000=\"MDA1 (IVM+ALB)\", COUNTRY_INFO!$U$9:$U$1000, \" \")","v":" "},null,null,null,null,0,null,null,null,0,null," "," "," "]
[{"$f":"IF(COUNTRY_INFO!A58=0,\" \",COUNTRY_INFO!A58)","v":"Gabon"},{"$f":"IF(COUNTRY_INFO!B58=0,\" \",COUNTRY_INFO!B58)","v":"Nord"},{"$f":"IF(COUNTRY_INFO!C58=0,\" \",COUNTRY_INFO!C58)","v":"Okano"},{"$f":"IF(COUNTRY_INFO!$U$9:$U$1000=\"MDA1 (IVM+ALB)\", COUNTRY_INFO!$U$9:$U$1000, \" \")","v":" "},null,null,null,null,0,null,null,null,0,null," "," "," "]
[{"$f":"IF(COUNTRY_INFO!A59=0,\" \",COUNTRY_INFO!A59)","v":"Gabon"},{"$f":"IF(COUNTRY_INFO!B59=0,\" \",COUNTRY_INFO!B59)","v":"Nord"},{"$f":"IF(COUNTRY_INFO!C59=0,\" \",COUNTRY_INFO!C59)","v":"Woleu"},{"$f":"IF(COUNTRY_INFO!$U$9:$U$1000=\"MDA1 (IVM+ALB)\", COUNTRY_INFO!$U$9:$U$1000, \" \")","v":" "},null,null,null,null,0,null,null,null,0,null," "," "," "]

{"sheet":"MDA4","index":3,"n_rows":59,"n_cols":25,"rows_kept":59,"cut":false,"hidden":false,"merged":[[5,5,5,8],[5,13,5,16],[5,21,5,24],[3,0,3,2],[5,0,5,2],[5,3,6,3],[5,4,6,4],[5,9,5,12],[5,17,5,20]]}
["MDA 4 - Albendazole (ALB) ou 2 x Albendazole (ALB)"]
["Structure administrative, population nécessitant une chimioprévention par groupe d'âge, population traitée par groupe d'âge et couverture"]
[]
["TOTAL",null,null,null,null,{"$f":"SUM(F$9:F$1000)","v":0},{"$f":"SUM(G$9:G$1000)","v":0},0,0,0,0,0,0,0,0,0,0,0,0,0,0,{"$f":"IF(F4<>0, IF(N4/F4*100=0, \"-\", N4/F4*100), \" \")","v":" "},{"$f":"IF(G4<>0, IF(O4/G4*100=0, \"-\", O4/G4*100), \" \")","v":" "},{"$f":"IF(H4<>0, IF(P4/H4*100=0, \"-\", P4/H4*100), \" \")","v":" "},{"$f":"IF(I4<>0, IF(Q4/I4*100=0, \"-\", Q4/I4*100), \" \")","v":" "}]
[]
["Structure administrative du pays",null,null,"Mise en oeuvre \nde la CP","Date","Population ciblée pour MDA 4",null,null,null,"Population traitée - tournée 1",null,null,null,"Population traitée - tournée 2",null,null,null,"Population traitée",null,null,null,"Couverture du Programme (%)"]
["Pays","Région/Département","District",null,null,"EAPréS","EAS","Adultes","Total","EAPréS","EAS","Adultes","Total","EAPréS","EAS","Adultes","Total","EAPréS","EAS","Adultes","Total","EAPréS","EAS","Adultes","Total"]
[]
[{"$f":"IF(COUNTRY_INFO!A9=0,\" \",COUNTRY_INFO!A9)","v":"Gabon"},{"$f":"IF(COUNTRY_INFO!B9=0,\" \",COUNTRY_INFO!B9)","v":"Libreville-Owendo"},{"$f":"IF(COUNTRY_INFO!C9=0,\" \",COUNTRY_INFO!C9)","v":"Libreville 1"},{"$f":"IF(COUNTRY_INFO!$U$9:$U$1000=\"MDA4 (ALB/2*ALB)\", COUNTRY_INFO!$U$9:$U$1000, \" \")","v":" "},null,null,null,null,{"$f":"SUM(F9:H9)","v":0},null,null,null,{"$f":"SUM(J9:L9)","v":0},null,null,null,{"$f":"SUM(N9:P9)","v":0},{"$f":"MAX(J9,N9)","v":0},{"$f":"MAX(K9,O9)","v":0},{"$f":"MAX(L9,P9)","v":0},{"$f":"SUM(R9:T9)","v":0},{"$f":"IF(F9<>0, IF(R9/F9*100=0, \"-\",R9/F9*100), \" \")","v":" "},{"$f":"IF(G9<>0, IF(S9/G9*100=0, \"-\", S9/G9*100), \" \")","v":" "},{"$f":"IF(H9<>0, IF(T9/H9*100=0, \"-\", T9/H9*100), \" \")","v":" "},{"$f":"IF(I9<>0, IF(U9/I9*100=0, \"-\", U9/I9*100), \" \")","v":" "}]
[{"$f":"IF(COUNTRY_INFO!A10=0,\" \",COUNTRY_INFO!A10)","v":"Gabon"},{"$f":"IF(COUNTRY_INFO!B10=0,\" \",COUNTRY_INFO!B10)","v":"Libreville-Owendo"},{"$f":"IF(COUNTRY_INFO!C10=0,\" \",COUNTRY_INFO!C10)","v":"Libreville 2"},{"$f":"IF(COUNTRY_INFO!$U$9:$U$1000=\"MDA4 (ALB/2*ALB)\", COUNTRY_INFO!$U$9:$U$1000, \" \")","v":" "},null,null,null,null,{"$f":"SUM(F10:H10)","v":0},null,null,null,{"$f":"SUM(J10:L10)","v":0},null,null,null,{"$f":"SUM(N10:P10)","v":0},0,0,0,0," "," "," "," "]
[{"$f":"IF(COUNTRY_INFO!A11=0,\" \",COUNTRY_INFO!A11)","v":"Gabon"},{"$f":"IF(COUNTRY_INFO!B11=0,\" \",COUNTRY_INFO!B11)","v":"Libreville-Owendo"},{"$f":"IF(COUNTRY_INFO!C11=0,\" \",COUNTRY_INFO!C11)","v":"Libreville 3"},{"$f":"IF(COUNTRY_INFO!$U$9:$U$1000=\"MDA4 (ALB/2*ALB)\", COUNTRY_INFO!$U$9:$U$1000, \" \")","v":" "},null,null,null,null,0,null,null,null,0,null,null,null,0,0,0,0,0," "," "," "," "]
[{"$f":"IF(COUNTRY_INFO!A12=0,\" \",COUNTRY_INFO!A12)","v":"Gabon"},{"$f":"IF(COUNTRY_INFO!B12=0,\" \",COUNTRY_INFO!B12)","v":"Libreville-Owendo"},{"$f":"IF(COUNTRY_INFO!C12=0,\" \",COUNTRY_INFO!C12)","v":"Owendo"},{"$f":"IF(COUNTRY_INFO!$U$9:$U$1000=\"MDA4 (ALB/2*ALB)\", COUNTRY_INFO!$U$9:$U$1000, \" \")","v":" "},null,null,null,null,0,null,null,null,0,null,null,null,0,0,0,0,0," "," "," "," "]
[{"$f":"IF(COUNTRY_INFO!A13=0,\" \",COUNTRY_INFO!A13)","v":"Gabon"},{"$f":"IF(COUNTRY_INFO!B13=0,\" \",COUNTRY_INFO!B13)","v":"Ouest"},{"$f":"IF(COUNTRY_INFO!C13=0,\" \",COUNTRY_INFO!C13)","v":"Komo-Mondah"},{"$f":"IF(COUNTRY_INFO!$U$9:$U$1000=\"MDA4 (ALB/2*ALB)\", COUNTRY_INFO!$U$9:$U$1000, \" \")","v":" "},null,null,null,null,0,null,null,null,0,null,null,null,0,0,0,0,0," "," "," "," "]
[{"$f":"IF(COUNTRY_INFO!A14=0,\" \",COUNTRY_INFO!A14)","v":"Gabon"},{"$f":"IF(COUNTRY_INFO!B14=0,\" \",COUNTRY_INFO!B14)","v":"Ouest"},{"$f":"IF(COUNTRY_INFO!C14=0,\" \",COUNTRY_INFO!C14)","v":"Komo-Kango"},{"$f":"IF(COUNTRY_INFO!$U$9:$U$1000=\"MDA4 (ALB/2*ALB)\", COUNTRY_INFO!$U$9:$U$1000, \" \")","v":" "},null,null,null,null,0,null,null,null,0,null,null,null,0,0,0,0,0," "," "," "," "]
[{"$f":"IF(COUNTRY_INFO!A15=0,\" \",COUNTRY_INFO!A15)","v":"Gabon"},{"$f":"IF(COUNTRY_INFO!B15=0,\" \",COUNTRY_INFO!B15)","v":"Ouest"},{"$f":"IF(COUNTRY_INFO!C15=0,\" \",COUNTRY_INFO!C15)","v":"Noya"},{"$f":"IF(COUNTRY_INFO!$U$9:$U$1000=\"MDA4 (ALB/2*ALB)\", COUNTRY_INFO!$U$9:$U$1000, \" \")","v":" "},null,null,null,null,0,null,null,null,0,null,null,null,0,0,0,0,0," "," "," "," "]
[{"$f":"IF(COUNTRY_INFO!A16=0,\" \",COUNTRY_INFO!A16)","v":"Gabon"},{"$f":"IF(COUNTRY_INFO!B16=0,\" \",COUNTRY_INFO!B16)","v":"Sud-Est"},{"$f":"IF(COUNTRY_INFO!C16=0,\" \",COUNTRY_INFO!C16)","v":"Bayi-brikolo"},{"$f":"IF(COUNTRY_INFO!$U$9:$U$1000=\"MDA4 (ALB/2*ALB)\", COUNTRY_INFO!$U$9:$U$1000, \" \")","v":" "},null,null,null,null,0,null,null,null,0,null,null,null,0,0,0,0,0," "," "," "," "]
[{"$f":"IF(COUNTRY_INFO!A17=0,\" \",COUNTRY_INFO!A17)","v":"Gabon"},{"$f":"IF(COUNTRY_INFO!B17=0,\" \",COUNTRY_INFO!B17)","v":"Sud-Est"},{"$f":"IF(COUNTRY_INFO!C17=0,\" \",COUNTRY_INFO!C17)","v":"Lékoni-Lékori"},{"$f":"IF(COUNTRY_INFO!$U$9:$U$1000=\"MDA4 (ALB/2*ALB)\", COUNTRY_INFO!$U$9:$U$1000, \" \")","v":" "},null,null,null,null,0,null,null,null,0,null,null,null,0,0,0,0,0," "," "," "," "]
[{"$f":"IF(COUNTRY_INFO!A18=0,\" \",COUNTRY_INFO!A18)","v":"Gabon"},{"$f":"IF(COUNTRY_INFO!B18=0,\" \",COUNTRY_INFO!B18)","v":"Sud-Est"},{"$f":"IF(COUNTRY_INFO!C18=0,\" \",COUNTRY_INFO!C18)","v":"Lékoko"},{"$f":"IF(COUNTRY_INFO!$U$9:$U$1000=\"MDA4 (ALB/2*ALB)\", COUNTRY_INFO!$U$9:$U$1000, \" \")","v":" "},null,null,null,null,0,null,null,null,0,null,null,null,0,0,0,0,0," "," "," "," "]
[{"$f":"IF(COUNTRY_INFO!A19=0,\" \",COUNTRY_INFO!A19)","v":"Gabon"},{"$f":"IF(COUNTRY_INFO!B19=0,\" \",COUNTRY_INFO!B19)","v":"Sud-Est"},{"$f":"IF(COUNTRY_INFO!C19=0,\" \",COUNTRY_INFO!C19)","v":"Djouori-Agnili"},{"$f":"IF(COUNTRY_INFO!$U$9:$U$1000=\"MDA4 (ALB/2*ALB)\", COUNTRY_INFO!$U$9:$U$1000, \" \")","v":" "},null,null,null,null,0,null,null,null,0,null,null,null,0,0,0,0,0," "," "," "," "]
[{"$f":"IF(COUNTRY_INFO!A20=0,\" \",COUNTRY_INFO!A20)","v":"Gabon"},{"$f":"IF(COUNTRY_INFO!B20=0,\" \",COUNTRY_INFO!B20)","v":"Sud-Est"},{"$f":"IF(COUNTRY_INFO!C20=0,\" \",COUNTRY_INFO!C20)","v":"Ogooué-Létili"},{"$f":"IF(COUNTRY_INFO!$U$9:$U$1000=\"MDA4 (ALB/2*ALB)\", COUNTRY_INFO!$U$9:$U$1000, \" \")","v":" "},null,null,null,null,0,null,null,null,0,null,null,null,0,0,0,0,0," "," "," "," "]
[{"$f":"IF(COUNTRY_INFO!A21=0,\" \",COUNTRY_INFO!A21)","v":"Gabon"},{"$f":"IF(COUNTRY_INFO!B21=0,\" \",COUNTRY_INFO!B21)","v":"Sud-Est"},{"$f":"IF(COUNTRY_INFO!C21=0,\" \",COUNTRY_INFO!C21)","v":"Mpassa"},{"$f":"IF(COUNTRY_INFO!$U$9:$U$1000=\"MDA4 (ALB/2*ALB)\", COUNTRY_INFO!$U$9:$U$1000, \" \")","v":" "},null,null,null,null,0,null,null,null,0,null,null,null,0,0,0,0,0," "," "," "," "]
[{"$f":"IF(COUNTRY_INFO!A22=0,\" \",COUNTRY_INFO!A22)","v":"Gabon"},{"$f":"IF(COUNTRY_INFO!B22=0,\" \",COUNTRY_INFO!B22)","v":"Sud-Est"},{"$f":"IF(COUNTRY_INFO!C22=0,\" \",COUNTRY_INFO!C22)","v":"Plateaux"},{"$f":"IF(COUNTRY_INFO!$U$9:$U$1000=\"MDA4 (ALB/2*ALB)\", COUNTRY_INFO!$U$9:$U$1000, \" \")","v":" "},null,null,null,null,0,null,null,null,0,null,null,null,0,0,0,0,0," "," "," "," "]
[{"$f":"IF(COUNTRY_INFO!A23=0,\" \",COUNTRY_INFO!A23)","v":"Gabon"},{"$f":"IF(COUNTRY_INFO!B23=0,\" \",COUNTRY_INFO!B23)","v":"Sud-Est"},{"$f":"IF(COUNTRY_INFO!C23=0,\" \",COUNTRY_INFO!C23)","v":"Lébombi-Léyou"},{"$f":"IF(COUNTRY_INFO!$U$9:$U$1000=\"MDA4 (ALB/2*ALB)\", COUNTRY_INFO!$U$9:$U$1000, \" \")","v":" "},null,null,null,null,0,null,null,null,0,null,null,null,0,0,0,0,0," "," "," "," "]
[{"$f":"IF(COUNTRY_INFO!A24=0,\" \",COUNTRY_INFO!A24)","v":"Gabon"},{"$f":"IF(COUNTRY_INFO!B24=0,\" \",COUNTRY_INFO!B24)","v":"Sud-Est"},{"$f":"IF(COUNTRY_INFO!C24=0,\" \",COUNTRY_INFO!C24)","v":"Lékabi-Léwolo"},{"$f":"IF(COUNTRY_INFO!$U$9:$U$1000=\"MDA4 (ALB/2*ALB)\", COUNTRY_INFO!$U$9:$U$1000, \" \")","v":" "},null,null,null,null,0,null,null,null,0,null,null,null,0,0,0,0,0," "," "," "," "]
[{"$f":"IF(COUNTRY_INFO!A25=0,\" \",COUNTRY_INFO!A25)","v":"Gabon"},{"$f":"IF(COUNTRY_INFO!B25=0,\" \",COUNTRY_INFO!B25)","v":"Sud-Est"},{"$f":"IF(COUNTRY_INFO!C25=0,\" \",COUNTRY_INFO!C25)","v":"Sébé-Brikolo"},{"$f":"IF(COUNTRY_INFO!$U$9:$U$1000=\"MDA4 (ALB/2*ALB)\", COUNTRY_INFO!$U$9:$U$1000, \" \")","v":" "},null,null,null,null,0,null,null,null,0,null,null,null,0,0,0,0,0," "," "," "," "]
[{"$f":"IF(COUNTRY_INFO!A26=0,\" \",COUNTRY_INFO!A26)","v":"Gabon"},{"$f":"IF(COUNTRY_INFO!B26=0,\" \",COUNTRY_INFO!B26)","v":"Sud-Est"},{"$f":"IF(COUNTRY_INFO!C26=0,\" \",COUNTRY_INFO!C26)","v":"Djoué"},{"$f":"IF(COUNTRY_INFO!$U$9:$U$1000=\"MDA4 (ALB/2*ALB)\", COUNTRY_INFO!$U$9:$U$1000, \" \")","v":" "},null,null,null,null,0,null,null,null,0,null,null,null,0,0,0,0,0," "," "," "," "]
[{"$f":"IF(COUNTRY_INFO!A27=0,\" \",COUNTRY_INFO!A27)","v":"Gabon"},{"$f":"IF(COUNTRY_INFO!B27=0,\" \",COUNTRY_INFO!B27)","v":"Centre"},{"$f":"IF(COUNTRY_INFO!C27=0,\" \",COUNTRY_INFO!C27)","v":"Ogooué-et-Lacs"},{"$f":"IF(COUNTRY_INFO!$U$9:$U$1000=\"MDA4 (ALB/2*ALB)\", COUNTRY_INFO!$U$9:$U$1000, \" \")","v":" "},null,null,null,null,0,null,null,null,0,null,null,null,0,0,0,0,0," "," "," "," "]
[{"$f":"IF(COUNTRY_INFO!A28=0,\" \",COUNTRY_INFO!A28)","v":"Gabon"},{"$f":"IF(COUNTRY_INFO!B28=0,\" \",COUNTRY_INFO!B28)","v":"Centre"},{"$f":"IF(COUNTRY_INFO!C28=0,\" \",COUNTRY_INFO!C28)","v":"Abanga-Bigné"},{"$f":"IF(COUNTRY_INFO!$U$9:$U$1000=\"MDA4 (ALB/2*ALB)\", COUNTRY_INFO!$U$9:$U$1000, \" \")","v":" "},null,null,null,null,0,null,null,null,0,null,null,null,0,0,0,0,0," "," "," "," "]
[{"$f":"IF(COUNTRY_INFO!A29=0,\" \",COUNTRY_INFO!A29)","v":"Gabon"},{"$f":"IF(COUNTRY_INFO!B29=0,\" \",COUNTRY_INFO!B29)","v":"Centre-Sud"},{"$f":"IF(COUNTRY_INFO!C29=0,\" \",COUNTRY_INFO!C29)","v":"Tsamba-Magotsi"},{"$f":"IF(COUNTRY_INFO!$U$9:$U$1000=\"MDA4 (ALB/2*ALB)\", COUNTRY_INFO!$U$9:$U$1000, \" \")","v":" "},null,null,null,null,0,null,null,null,0,null,null,null,0,0,0,0,0," "," "," "," "]
[{"$f":"IF(COUNTRY_INFO!A30=0,\" \",COUNTRY_INFO!A30)","v":"Gabon"},{"$f":"IF(COUNTRY_INFO!B30=0,\" \",COUNTRY_INFO!B30)","v":"Centre-Sud"},{"$f":"IF(COUNTRY_INFO!C30=0,\" \",COUNTRY_INFO!C30)","v":"Louetsi-Wano"},{"$f":"IF(COUNTRY_INFO!$U$9:$U$1000=\"MDA4 (ALB/2*ALB)\", COUNTRY_INFO!$U$9:$U$1000, \" \")","v":" "},null,null,null,null,0,null,null,null,0,null,null,null,0,0,0,0,0," "," "," "," "]
[{"$f":"IF(COUNTRY_INFO!A31=0,\" \",COUNTRY_INFO!A31)","v":"Gabon"},{"$f":"IF(COUNTRY_INFO!B31=0,\" \",COUNTRY_INFO!B31)","v":"Centre-Sud"},{"$f":"IF(COUNTRY_INFO!C31=0,\" \",COUNTRY_INFO!C31)","v":"Louetsi-Bibaka"},{"$f":"IF(COUNTRY_INFO!$U$9:$U$1000=\"MDA4 (ALB/2*ALB)\", COUNTRY_INFO!$U$9:$U$1000, \" \")","v":" "},null,null,null,null,0,null,null,null,0,null,null,null,0,0,0,0,0," "," "," "," "]
[{"$f":"IF(COUNTRY_INFO!A32=0,\" \",COUNTRY_INFO!A32)","v":"Gabon"},{"$f":"IF(COUNTRY_INFO!B32=0,\" \",COUNTRY_INFO!B32)","v":"Centre-Sud"},{"$f":"IF(COUNTRY_INFO!C32=0,\" \",COUNTRY_INFO!C32)","v":"Ndolou"},{"$f":"IF(COUNTRY_INFO!$U$9:$U$1000=\"MDA4 (ALB/2*ALB)\", COUNTRY_INFO!$U$9:$U$1000, \" \")","v":" "},null,null,null,null,0,null,null,null,0,null,null,null,0,0,0,0,0," "," "," "," "]
[{"$f":"IF(COUNTRY_INFO!A33=0,\" \",COUNTRY_INFO!A33)","v":"Gabon"},{"$f":"IF(COUNTRY_INFO!B33=0,\" \",COUNTRY_INFO!B33)","v":"Centre-Sud"},{"$f":"IF(COUNTRY_INFO!C33=0,\" \",COUNTRY_INFO!C33)","v":"Boumi-Louetsi"},{"$f":"IF(COUNTRY_INFO!$U$9:$U$1000=\"MDA4 (ALB/2*ALB)\", COUNTRY_INFO!$U$9:$U$1000, \" \")","v":" "},null,null,null,null,0,null,null,null,0,null,null,null,0,0,0,0,0," "," "," "," "]
[{"$f":"IF(COUNTRY_INFO!A34=0,\" \",COUNTRY_INFO!A34)","v":"Gabon"},{"$f":"IF(COUNTRY_INFO!B34=0,\" \",COUNTRY_INFO!B34)","v":"Centre-Sud"},{"$f":"IF(COUNTRY_INFO!C34=0,\" \",COUNTRY_INFO!C34)","v":"Ogoulou"},{"$f":"IF(COUNTRY_INFO!$U$9:$U$1000=\"MDA4 (ALB/2*ALB)\", COUNTRY_INFO!$U$9:$U$1000, \" \")","v":" "},null,null,null,null,0,null,null,null,0,null,null,null,0,0,0,0,0," "," "," "," "]
[{"$f":"IF(COUNTRY_INFO!A35=0,\" \",COUNTRY_INFO!A35)","v":"Gabon"},{"$f":"IF(COUNTRY_INFO!B35=0,\" \",COUNTRY_INFO!B35)","v":"Centre-Sud"},{"$f":"IF(COUNTRY_INFO!C35=0,\" \",COUNTRY_INFO!C35)","v":"Douya-Onoye"},{"$f":"IF(COUNTRY_INFO!$U$9:$U$1000=\"MDA4 (ALB/2*ALB)\", COUNTRY_INFO!$U$9:$U$1000, \" \")","v":" "},null,null,null,null,0,null,null,null,0,null,null,null,0,0,0,0,0," "," "," "," "]
[{"$f":"IF(COUNTRY_INFO!A36=0,\" \",COUNTRY_INFO!A36)","v":"Gabon"},{"$f":"IF(COUNTRY_INFO!B36=0,\" \",COUNTRY_INFO!B36)","v":"Centre-Sud"},{"$f":"IF(COUNTRY_INFO!C36=0,\" \",COUNTRY_INFO!C36)","v":"Dola"},{"$f":"IF(COUNTRY_INFO!$U$9:$U$1000=\"MDA4 (ALB/2*ALB)\", COUNTRY_INFO!$U$9:$U$1000, \" \")","v":" "},null,null,null,null,0,null,null,null,0,null,null,null,0,0,0,0,0," "," "," "," "]
[{"$f":"IF(COUNTRY_INFO!A37=0,\" \",COUNTRY_INFO!A37)","v":"Gabon"},{"$f":"IF(COUNTRY_INFO!B37=0,\" \",COUNTRY_INFO!B37)","v":"Centre-Sud"},{"$f":"IF(COUNTRY_INFO!C37=0,\" \",COUNTRY_INFO!C37)","v":"Mougalaba"},{"$f":"IF(COUNTRY_INFO!$U$9:$U$1000=\"MDA4 (ALB/2*ALB)\", COUNTRY_INFO!$U$9:$U$1000, \" \")","v":" "},null,null,null,null,0,null,null,null,0,null,null,null,0,0,0,0,0," "," "," "," "]
[{"$f":"IF(COUNTRY_INFO!A38=0,\" \",COUNTRY_INFO!A38)","v":"Gabon"},{"$f":"IF(COUNTRY_INFO!B38=0,\" \",COUNTRY_INFO!B38)","v":"Sud"},{"$f":"IF(COUNTRY_INFO!C38=0,\" \",COUNTRY_INFO!C38)","v":"Doutsila"},{"$f":"IF(COUNTRY_INFO!$U$9:$U$1000=\"MDA4 (ALB/2*ALB)\", COUNTRY_INFO!$U$9:$U$1000, \" \")","v":" "},null,null,null,null,0,null,null,null,0,null,null,null,0,0,0,0,0," "," "," "," "]
[{"$f":"IF(COUNTRY_INFO!A39=0,\" \",COUNTRY_INFO!A39)","v":"Gabon"},{"$f":"IF(COUNTRY_INFO!B39=0,\" \",COUNTRY_INFO!B39)","v":"Sud"},{"$f":"IF(COUNTRY_INFO!C39=0,\" \",COUNTRY_INFO!C39)","v":"Basse-Banio"},{"$f":"IF(COUNTRY_INFO!$U$9:$U$1000=\"MDA4 (ALB/2*ALB)\", COUNTRY_INFO!$U$9:$U$1000, \" \")","v":" "},null,null,null,null,0,null,null,null,0,null,null,null,0,0,0,0,0," "," "," "," "]
[{"$f":"IF(COUNTRY_INFO!A40=0,\" \",COUNTRY_INFO!A40)","v":"Gabon"},{"$f":"IF(COUNTRY_INFO!B40=0,\" \",COUNTRY_INFO!B40)","v":"Sud"},{"$f":"IF(COUNTRY_INFO!C40=0,\" \",COUNTRY_INFO!C40)","v":"Douigny"},{"$f":"IF(COUNTRY_INFO!$U$9:$U$1000=\"MDA4 (ALB/2*ALB)\", COUNTRY_INFO!$U$9:$U$1000, \" \")","v":" "},null,null,null,null,0,null,null,null,0,null,null,null,0,0,0,0,0," "," "," "," "]
[{"$f":"IF(COUNTRY_INFO!A41=0,\" \",COUNTRY_INFO!A41)","v":"Gabon"},{"$f":"IF(COUNTRY_INFO!B41=0,\" \",COUNTRY_INFO!B41)","v":"Sud"},{"$f":"IF(COUNTRY_INFO!C41=0,\" \",COUNTRY_INFO!C41)","v":"Mongo"},{"$f":"IF(COUNTRY_INFO!$U$9:$U$1000=\"MDA4 (ALB/2*ALB)\", COUNTRY_INFO!$U$9:$U$1000, \" \")","v":" "},null,null,null,null,0,null,null,null,0,null,null,null,0,{"$f":"MAX(J41,N41)","v":0},{"$f":"MAX(K41,O41)","v":0},{"$f":"MAX(L41,P41)","v":0},{"$f":"SUM(R41:T41)","v":0},{"$f":"IF(F41<>0, IF(R41/F41*100=0, \"-\",R41/F41*100), \" \")","v":" "},{"$f":"IF(G41<>0, IF(S41/G41*100=0, \"-\", S41/G41*100), \" \")","v":" "},{"$f":"IF(H41<>0, IF(T41/H41*100=0, \"-\", T41/H41*100), \" \")","v":" "},{"$f":"IF(I41<>0, IF(U41/I41*100=0, \"-\", U41/I41*100), \" \")","v":" "}]
[{"$f":"IF(COUNTRY_INFO!A42=0,\" \",COUNTRY_INFO!A42)","v":"Gabon"},{"$f":"IF(COUNTRY_INFO!B42=0,\" \",COUNTRY_INFO!B42)","v":"Sud"},{"$f":"IF(COUNTRY_INFO!C42=0,\" \",COUNTRY_INFO!C42)","v":"Haute-Banio"},{"$f":"IF(COUNTRY_INFO!$U$9:$U$1000=\"MDA4 (ALB/2*ALB)\", COUNTRY_INFO!$U$9:$U$1000, \" \")","v":" "},null,null,null,null,0,null,null,null,0,null,null,null,0,0,0,0,0," "," "," "," "]
[{"$f":"IF(COUNTRY_INFO!A43=0,\" \",COUNTRY_INFO!A43)","v":"Gabon"},{"$f":"IF(COUNTRY_INFO!B43=0,\" \",COUNTRY_INFO!B43)","v":"Sud"},{"$f":"IF(COUNTRY_INFO!C43=0,\" \",COUNTRY_INFO!C43)","v":"Mougoutsi"},{"$f":"IF(COUNTRY_INFO!$U$9:$U$1000=\"MDA4 (ALB/2*ALB)\", COUNTRY_INFO!$U$9:$U$1000, \" \")","v":" "},null,null,null,null,0,null,null,null,0,null,null,null,0,0,0,0,0," "," "," "," "]
[{"$f":"IF(COUNTRY_INFO!A44=0,\" \",COUNTRY_INFO!A44)","v":"Gabon"},{"$f":"IF(COUNTRY_INFO!B44=0,\" \",COUNTRY_INFO!B44)","v":"Est"},{"$f":"IF(COUNTRY_INFO!C44=0,\" \",COUNTRY_INFO!C44)","v":"Lopé"},{"$f":"IF(COUNTRY_INFO!$U$9:$U$1000=\"MDA4 (ALB/2*ALB)\", COUNTRY_INFO!$U$9:$U$1000, \" \")","v":" "},null,null,null,null,0,null,null,null,0,null,null,null,0,0,0,0,0," "," "," "," "]
[{"$f":"IF(COUNTRY_INFO!A45=0,\" \",COUNTRY_INFO!A45)","v":"Gabon"},{"$f":"IF(COUNTRY_INFO!B45=0,\" \",COUNTRY_INFO!B45)","v":"Est"},{"$f":"IF(COUNTRY_INFO!C45=0,\" \",COUNTRY_INFO!C45)","v":"Ivindo"},{"$f":"IF(COUNTRY_INFO!$U$9:$U$1000=\"MDA4 (ALB/2*ALB)\", COUNTRY_INFO!$U$9:$U$1000, \" \")","v":" "},null,null,null,null,0,null,null,null,0,null,null,null,0,0,0,0,0," "," "," "," "]
[{"$f":"IF(COUNTRY_INFO!A46=0,\" \",COUNTRY_INFO!A46)","v":"Gabon"},{"$f":"IF(COUNTRY_INFO!B46=0,\" \",COUNTRY_INFO!B46)","v":"Est"},{"$f":"IF(COUNTRY_INFO!C46=0,\" \",COUNTRY_INFO!C46)","v":"Zadié"},{"$f":"IF(COUNTRY_INFO!$U$9:$U$1000=\"MDA4 (ALB/2*ALB)\", COUNTRY_INFO!$U$9:$U$1000, \" \")","v":" "},null,null,null,null,0,null,null,null,0,null,null,null,0,0,0,0,0," "," "," "," "]
[{"$f":"IF(COUNTRY_INFO!A47=0,\" \",COUNTRY_INFO!A47)","v":"Gabon"},{"$f":"IF(COUNTRY_INFO!B47=0,\" \",COUNTRY_INFO!B47)","v":"Est"},{"$f":"IF(COUNTRY_INFO!C47=0,\" \",COUNTRY_INFO!C47)","v":"Mvoung"},{"$f":"IF(COUNTRY_INFO!$U$9:$U$1000=\"MDA4 (ALB/2*ALB)\", COUNTRY_INFO!$U$9:$U$1000, \" \")","v":" "},null,null,null,null,0,null,null,null,0,null,null,null,0,0,0,0,0," "," "," "," "]
[{"$f":"IF(COUNTRY_INFO!A48=0,\" \",COUNTRY_INFO!A48)","v":"Gabon"},{"$f":"IF(COUNTRY_INFO!B48=0,\" \",COUNTRY_INFO!B48)","v":"Centre-Est"},{"$f":"IF(COUNTRY_INFO!C48=0,\" \",COUNTRY_INFO!C48)","v":"Offoué-Onoye"},{"$f":"IF(COUNTRY_INFO!$U$9:$U$1000=\"MDA4 (ALB/2*ALB)\", COUNTRY_INFO!$U$9:$U$1000, \" \")","v":" "},null,null,null,null,0,null,null,null,0,null,null,null,0,0,0,0,0," "," "," "," "]
[{"$f":"IF(COUNTRY_INFO!A49=0,\" \",COUNTRY_INFO!A49)","v":"Gabon"},{"$f":"IF(COUNTRY_INFO!B49=0,\" \",COUNTRY_INFO!B49)","v":"Centre-Est"},{"$f":"IF(COUNTRY_INFO!C49=0,\" \",COUNTRY_INFO!C49)","v":"Lolo-Bouenguidi"},{"$f":"IF(COUNTRY_INFO!$U$9:$U$1000=\"MDA4 (ALB/2*ALB)\", COUNTRY_INFO!$U$9:$U$1000, \" \")","v":" "},null,null,null,null,0,null,null,null,0,null,null,null,0,0,0,0,0," "," "," "," "]
[{"$f":"IF(COUNTRY_INFO!A50=0,\" \",COUNTRY_INFO!A50)","v":"Gabon"},{"$f":"IF(COUNTRY_INFO!B50=0,\" \",COUNTRY_INFO!B50)","v":"Centre-Est"},{"$f":"IF(COUNTRY_INFO!C50=0,\" \",COUNTRY_INFO!C50)","v":"Mulundu"},{"$f":"IF(COUNTRY_INFO!$U$9:$U$1000=\"MDA4 (ALB/2*ALB)\", COUNTRY_INFO!$U$9:$U$1000, \" \")","v":" "},null,null,null,null,0,null,null,null,0,null,null,null,0,0,0,0,0," "," "," "," "]
[{"$f":"IF(COUNTRY_INFO!A51=0,\" \",COUNTRY_INFO!A51)","v":"Gabon"},{"$f":"IF(COUNTRY_INFO!B51=0,\" \",COUNTRY_INFO!B51)","v":"Centre-Est"},{"$f":"IF(COUNTRY_INFO!C51=0,\" \",COUNTRY_INFO!C51)","v":"Lombo-Bouenguidi"},{"$f":"IF(COUNTRY_INFO!$U$9:$U$1000=\"MDA4 (ALB/2*ALB)\", COUNTRY_INFO!$U$9:$U$1000, \" \")","v":" "},null,null,null,null,0,null,null,null,0,null,null,null,0,0,0,0,0," "," "," "," "]
[{"$f":"IF(COUNTRY_INFO!A52=0,\" \",COUNTRY_INFO!A52)","v":"Gabon"},{"$f":"IF(COUNTRY_INFO!B52=0,\" \",COUNTRY_INFO!B52)","v":"Maritime"},{"$f":"IF(COUNTRY_INFO!C52=0,\" \",COUNTRY_INFO!C52)","v":"Ndougou"},{"$f":"IF(COUNTRY_INFO!$U$9:$U$1000=\"MDA4 (ALB/2*ALB)\", COUNTRY_INFO!$U$9:$U$1000, \" \")","v":" "},null,null,null,null,0,null,null,null,0,null,null,null,0,0,0,0,0," "," "," "," "]
[{"$f":"IF(COUNTRY_INFO!A53=0,\" \",COUNTRY_INFO!A53)","v":"Gabon"},{"$f":"IF(COUNTRY_INFO!B53=0,\" \",COUNTRY_INFO!B53)","v":"Maritime"},{"$f":"IF(COUNTRY_INFO!C53=0,\" \",COUNTRY_INFO!C53)","v":"Etimboué"},{"$f":"IF(COUNTRY_INFO!$U$9:$U$1000=\"MDA4 (ALB/2*ALB)\", COUNTRY_INFO!$U$9:$U$1000, \" \")","v":" "},null,null,null,null,0,null,null,null,0,null,null,null,0,0,0,0,0," "," "," "," "]
[{"$f":"IF(COUNTRY_INFO!A54=0,\" \",COUNTRY_INFO!A54)","v":"Gabon"},{"$f":"IF(COUNTRY_INFO!B54=0,\" \",COUNTRY_INFO!B54)","v":"Maritime"},{"$f":"IF(COUNTRY_INFO!C54=0,\" \",COUNTRY_INFO!C54)","v":"Bendjé"},{"$f":"IF(COUNTRY_INFO!$U$9:$U$1000=\"MDA4 (ALB/2*ALB)\", COUNTRY_INFO!$U$9:$U$1000, \" \")","v":" "},null,null,null,null,0,null,null,null,0,null,null,null,0,0,0,0,0," "," "," "," "]
[{"$f":"IF(COUNTRY_INFO!A55=0,\" \",COUNTRY_INFO!A55)","v":"Gabon"},{"$f":"IF(COUNTRY_INFO!B55=0,\" \",COUNTRY_INFO!B55)","v":"Nord"},{"$f":"IF(COUNTRY_INFO!C55=0,\" \",COUNTRY_INFO!C55)","v":"Ntem"},{"$f":"IF(COUNTRY_INFO!$U$9:$U$1000=\"MDA4 (ALB/2*ALB)\", COUNTRY_INFO!$U$9:$U$1000, \" \")","v":" "},null,null,null,null,0,null,null,null,0,null,null,null,0,0,0,0,0," "," "," "," "]
[{"$f":"IF(COUNTRY_INFO!A56=0,\" \",COUNTRY_INFO!A56)","v":"Gabon"},{"$f":"IF(COUNTRY_INFO!B56=0,\" \",COUNTRY_INFO!B56)","v":"Nord"},{"$f":"IF(COUNTRY_INFO!C56=0,\" \",COUNTRY_INFO!C56)","v":"Haut - Komo"},{"$f":"IF(COUNTRY_INFO!$U$9:$U$1000=\"MDA4 (ALB/2*ALB)\", COUNTRY_INFO!$U$9:$U$1000, \" \")","v":" "},null,null,null,null,0,null,null,null,0,null,null,null,0,0,0,0,0," "," "," "," "]
[{"$f":"IF(COUNTRY_INFO!A57=0,\" \",COUNTRY_INFO!A57)","v":"Gabon"},{"$f":"IF(COUNTRY_INFO!B57=0,\" \",COUNTRY_INFO!B57)","v":"Nord"},{"$f":"IF(COUNTRY_INFO!C57=0,\" \",COUNTRY_INFO!C57)","v":"Haut-Ntem"},{"$f":"IF(COUNTRY_INFO!$U$9:$U$1000=\"MDA4 (ALB/2*ALB)\", COUNTRY_INFO!$U$9:$U$1000, \" \")","v":" "},null,null,null,null,0,null,null,null,0,null,null,null,0,0,0,0,0," "," "," "," "]
[{"$f":"IF(COUNTRY_INFO!A58=0,\" \",COUNTRY_INFO!A58)","v":"Gabon"},{"$f":"IF(COUNTRY_INFO!B58=0,\" \",COUNTRY_INFO!B58)","v":"Nord"},{"$f":"IF(COUNTRY_INFO!C58=0,\" \",COUNTRY_INFO!C58)","v":"Okano"},{"$f":"IF(COUNTRY_INFO!$U$9:$U$1000=\"MDA4 (ALB/2*ALB)\", COUNTRY_INFO!$U$9:$U$1000, \" \")","v":" "},null,null,null,null,0,null,null,null,0,null,null,null,0,0,0,0,0," "," "," "," "]
[{"$f":"IF(COUNTRY_INFO!A59=0,\" \",COUNTRY_INFO!A59)","v":"Gabon"},{"$f":"IF(COUNTRY_INFO!B59=0,\" \",COUNTRY_INFO!B59)","v":"Nord"},{"$f":"IF(COUNTRY_INFO!C59=0,\" \",COUNTRY_INFO!C59)","v":"Woleu"},{"$f":"IF(COUNTRY_INFO!$U$9:$U$1000=\"MDA4 (ALB/2*ALB)\", COUNTRY_INFO!$U$9:$U$1000, \" \")","v":" "},null,null,null,null,0,null,null,null,0,null,null,null,0,0,0,0,0," "," "," "," "]

{"sheet":"MDA3","index":4,"n_rows":59,"n_cols":20,"rows_kept":59,"cut":false,"hidden":false,"merged":[[5,5,5,7],[5,17,5,19],[3,0,3,2],[5,0,5,2],[5,3,6,3],[5,4,6,4],[5,8,5,10],[5,11,5,13],[5,14,5,16]]}
["MDA 3 - Ivermectine (IVM) "]
["Structure administrative, population nécessitant une chimioprévention par groupe d'âge, population traitée par groupe d'âge et couverture"]
[]
["TOTAL",null,null,null,null,{"$f":"SUM(F$9:F$1000)","v":0},0,0,0,0,0,0,0,0,0,0,0,{"$f":"IF(F4<>0, IF(O4/F4*100=0, \"-\", O4/F4*100), \" \")","v":" "},{"$f":"IF(G4<>0, IF(P4/G4*100=0, \"-\", P4/G4*100), \" \")","v":" "},{"$f":"IF(H4<>0, IF(Q4/H4*100=0, \"-\", Q4/H4*100), \" \")","v":" "}]
[]
["Structure administrative du pays",null,null,"Mise en oeuvre \nde la CP","Date","Population ciblée pour MDA 3",null,null,"Population traitée - tournée 1",null,null,"Population traitée - tournée 2",null,null,"Population traitée",null,null,"Couverture du Programme (%)"]
["Pays","Région/Département","District",null,null,"EAS","Adultes","Total","EAS","Adultes","Total","EAS","Adultes","Total","EAS","Adultes","Total","EAS","Adultes","Total"]
[]
[{"$f":"IF(COUNTRY_INFO!A9=0,\" \",COUNTRY_INFO!A9)","v":"Gabon"},{"$f":"IF(COUNTRY_INFO!B9=0,\" \",COUNTRY_INFO!B9)","v":"Libreville-Owendo"},{"$f":"IF(COUNTRY_INFO!C9=0,\" \",COUNTRY_INFO!C9)","v":"Libreville 1"},{"$f":"IF(COUNTRY_INFO!$U$9:$U$1000=\"MDA3 (IVM)\", COUNTRY_INFO!$U$9:$U$1000, \" \")","v":" "},null,null,null,{"$f":"SUM(F9:G9)","v":0},null,null,{"$f":"SUM(I9:J9)","v":0},null,null,{"$f":"SUM(L9:M9)","v":0},{"$f":"MAX(I9,L9)","v":0},0,{"$f":"SUM(O9:P9)","v":0},{"$f":"IF(F9<>0, IF(MAX(I9,L9)/F9*100=0, \"-\", MAX(I9,L9)/F9*100), \" \")","v":" "}," ",{"$f":"IF(H9<>0, IF((MAX(I9,L9)+MAX(J9,M9))/H9*100=0, \"-\",(MAX(I9,L9)+MAX(J9,M9))/H9*100), \" \")","v":" "}]
[{"$f":"IF(COUNTRY_INFO!A10=0,\" \",COUNTRY_INFO!A10)","v":"Gabon"},{"$f":"IF(COUNTRY_INFO!B10=0,\" \",COUNTRY_INFO!B10)","v":"Libreville-Owendo"},{"$f":"IF(COUNTRY_INFO!C10=0,\" \",COUNTRY_INFO!C10)","v":"Libreville 2"},{"$f":"IF(COUNTRY_INFO!$U$9:$U$1000=\"MDA3 (IVM)\", COUNTRY_INFO!$U$9:$U$1000, \" \")","v":" "},null,null,null,{"$f":"SUM(F10:G10)","v":0},null,null,{"$f":"SUM(I10:J10)","v":0},null,null,{"$f":"SUM(L10:M10)","v":0},{"$f":"MAX(I10,L10)","v":0},{"$f":"MAX(J10,M10)","v":0},{"$f":"SUM(O10:P10)","v":0},{"$f":"IF(F10<>0, IF(MAX(I10,L10)/F10*100=0, \"-\", MAX(I10,L10)/F10*100), \" \")","v":" "},{"$f":"IF(G10<>0, IF(MAX(J10,M10)/G10*100=0, \"-\", MAX(J10,M10)/G10*100), \" \")","v":" "},{"$f":"IF(H10<>0, IF((MAX(I10,L10)+MAX(J10,M10))/H10*100=0, \"-\",(MAX(I10,L10)+MAX(J10,M10))/H10*100), \" \")","v":" "}]
[{"$f":"IF(COUNTRY_INFO!A11=0,\" \",COUNTRY_INFO!A11)","v":"Gabon"},{"$f":"IF(COUNTRY_INFO!B11=0,\" \",COUNTRY_INFO!B11)","v":"Libreville-Owendo"},{"$f":"IF(COUNTRY_INFO!C11=0,\" \",COUNTRY_INFO!C11)","v":"Libreville 3"},{"$f":"IF(COUNTRY_INFO!$U$9:$U$1000=\"MDA3 (IVM)\", COUNTRY_INFO!$U$9:$U$1000, \" \")","v":" "},null,null,null,0,null,null,0,null,null,0,0,0,0," "," "," "]
[{"$f":"IF(COUNTRY_INFO!A12=0,\" \",COUNTRY_INFO!A12)","v":"Gabon"},{"$f":"IF(COUNTRY_INFO!B12=0,\" \",COUNTRY_INFO!B12)","v":"Libreville-Owendo"},{"$f":"IF(COUNTRY_INFO!C12=0,\" \",COUNTRY_INFO!C12)","v":"Owendo"},{"$f":"IF(COUNTRY_INFO!$U$9:$U$1000=\"MDA3 (IVM)\", COUNTRY_INFO!$U$9:$U$1000, \" \")","v":" "},null,null,null,0,null,null,0,null,null,0,0,0,0," "," "," "]
[{"$f":"IF(COUNTRY_INFO!A13=0,\" \",COUNTRY_INFO!A13)","v":"Gabon"},{"$f":"IF(COUNTRY_INFO!B13=0,\" \",COUNTRY_INFO!B13)","v":"Ouest"},{"$f":"IF(COUNTRY_INFO!C13=0,\" \",COUNTRY_INFO!C13)","v":"Komo-Mondah"},{"$f":"IF(COUNTRY_INFO!$U$9:$U$1000=\"MDA3 (IVM)\", COUNTRY_INFO!$U$9:$U$1000, \" \")","v":" "},null,null,null,0,null,null,0,null,null,0,0,0,0," "," "," "]
[{"$f":"IF(COUNTRY_INFO!A14=0,\" \",COUNTRY_INFO!A14)","v":"Gabon"},{"$f":"IF(COUNTRY_INFO!B14=0,\" \",COUNTRY_INFO!B14)","v":"Ouest"},{"$f":"IF(COUNTRY_INFO!C14=0,\" \",COUNTRY_INFO!C14)","v":"Komo-Kango"},{"$f":"IF(COUNTRY_INFO!$U$9:$U$1000=\"MDA3 (IVM)\", COUNTRY_INFO!$U$9:$U$1000, \" \")","v":" "},null,null,null,0,null,null,0,null,null,0,0,0,0," "," "," "]
[{"$f":"IF(COUNTRY_INFO!A15=0,\" \",COUNTRY_INFO!A15)","v":"Gabon"},{"$f":"IF(COUNTRY_INFO!B15=0,\" \",COUNTRY_INFO!B15)","v":"Ouest"},{"$f":"IF(COUNTRY_INFO!C15=0,\" \",COUNTRY_INFO!C15)","v":"Noya"},{"$f":"IF(COUNTRY_INFO!$U$9:$U$1000=\"MDA3 (IVM)\", COUNTRY_INFO!$U$9:$U$1000, \" \")","v":" "},null,null,null,0,null,null,0,null,null,0,0,0,0," "," "," "]
[{"$f":"IF(COUNTRY_INFO!A16=0,\" \",COUNTRY_INFO!A16)","v":"Gabon"},{"$f":"IF(COUNTRY_INFO!B16=0,\" \",COUNTRY_INFO!B16)","v":"Sud-Est"},{"$f":"IF(COUNTRY_INFO!C16=0,\" \",COUNTRY_INFO!C16)","v":"Bayi-brikolo"},{"$f":"IF(COUNTRY_INFO!$U$9:$U$1000=\"MDA3 (IVM)\", COUNTRY_INFO!$U$9:$U$1000, \" \")","v":" "},null,null,null,0,null,null,0,null,null,0,0,0,0," "," "," "]
[{"$f":"IF(COUNTRY_INFO!A17=0,\" \",COUNTRY_INFO!A17)","v":"Gabon"},{"$f":"IF(COUNTRY_INFO!B17=0,\" \",COUNTRY_INFO!B17)","v":"Sud-Est"},{"$f":"IF(COUNTRY_INFO!C17=0,\" \",COUNTRY_INFO!C17)","v":"Lékoni-Lékori"},{"$f":"IF(COUNTRY_INFO!$U$9:$U$1000=\"MDA3 (IVM)\", COUNTRY_INFO!$U$9:$U$1000, \" \")","v":" "},null,null,null,0,null,null,0,null,null,0,0,0,0," "," "," "]
[{"$f":"IF(COUNTRY_INFO!A18=0,\" \",COUNTRY_INFO!A18)","v":"Gabon"},{"$f":"IF(COUNTRY_INFO!B18=0,\" \",COUNTRY_INFO!B18)","v":"Sud-Est"},{"$f":"IF(COUNTRY_INFO!C18=0,\" \",COUNTRY_INFO!C18)","v":"Lékoko"},{"$f":"IF(COUNTRY_INFO!$U$9:$U$1000=\"MDA3 (IVM)\", COUNTRY_INFO!$U$9:$U$1000, \" \")","v":" "},null,null,null,0,null,null,0,null,null,0,0,0,0," "," "," "]
[{"$f":"IF(COUNTRY_INFO!A19=0,\" \",COUNTRY_INFO!A19)","v":"Gabon"},{"$f":"IF(COUNTRY_INFO!B19=0,\" \",COUNTRY_INFO!B19)","v":"Sud-Est"},{"$f":"IF(COUNTRY_INFO!C19=0,\" \",COUNTRY_INFO!C19)","v":"Djouori-Agnili"},{"$f":"IF(COUNTRY_INFO!$U$9:$U$1000=\"MDA3 (IVM)\", COUNTRY_INFO!$U$9:$U$1000, \" \")","v":" "},null,null,null,0,null,null,0,null,null,0,0,0,0," "," "," "]
[{"$f":"IF(COUNTRY_INFO!A20=0,\" \",COUNTRY_INFO!A20)","v":"Gabon"},{"$f":"IF(COUNTRY_INFO!B20=0,\" \",COUNTRY_INFO!B20)","v":"Sud-Est"},{"$f":"IF(COUNTRY_INFO!C20=0,\" \",COUNTRY_INFO!C20)","v":"Ogooué-Létili"},{"$f":"IF(COUNTRY_INFO!$U$9:$U$1000=\"MDA3 (IVM)\", COUNTRY_INFO!$U$9:$U$1000, \" \")","v":" "},null,null,null,0,null,null,0,null,null,0,0,0,0," "," "," "]
[{"$f":"IF(COUNTRY_INFO!A21=0,\" \",COUNTRY_INFO!A21)","v":"Gabon"},{"$f":"IF(COUNTRY_INFO!B21=0,\" \",COUNTRY_INFO!B21)","v":"Sud-Est"},{"$f":"IF(COUNTRY_INFO!C21=0,\" \",COUNTRY_INFO!C21)","v":"Mpassa"},{"$f":"IF(COUNTRY_INFO!$U$9:$U$1000=\"MDA3 (IVM)\", COUNTRY_INFO!$U$9:$U$1000, \" \")","v":" "},null,null,null,0,null,null,0,null,null,0,0,0,0," "," "," "]
[{"$f":"IF(COUNTRY_INFO!A22=0,\" \",COUNTRY_INFO!A22)","v":"Gabon"},{"$f":"IF(COUNTRY_INFO!B22=0,\" \",COUNTRY_INFO!B22)","v":"Sud-Est"},{"$f":"IF(COUNTRY_INFO!C22=0,\" \",COUNTRY_INFO!C22)","v":"Plateaux"},{"$f":"IF(COUNTRY_INFO!$U$9:$U$1000=\"MDA3 (IVM)\", COUNTRY_INFO!$U$9:$U$1000, \" \")","v":" "},null,null,null,0,null,null,0,null,null,0,0,0,0," "," "," "]
[{"$f":"IF(COUNTRY_INFO!A23=0,\" \",COUNTRY_INFO!A23)","v":"Gabon"},{"$f":"IF(COUNTRY_INFO!B23=0,\" \",COUNTRY_INFO!B23)","v":"Sud-Est"},{"$f":"IF(COUNTRY_INFO!C23=0,\" \",COUNTRY_INFO!C23)","v":"Lébombi-Léyou"},{"$f":"IF(COUNTRY_INFO!$U$9:$U$1000=\"MDA3 (IVM)\", COUNTRY_INFO!$U$9:$U$1000, \" \")","v":" "},null,null,null,0,null,null,0,null,null,0,0,0,0," "," "," "]
[{"$f":"IF(COUNTRY_INFO!A24=0,\" \",COUNTRY_INFO!A24)","v":"Gabon"},{"$f":"IF(COUNTRY_INFO!B24=0,\" \",COUNTRY_INFO!B24)","v":"Sud-Est"},{"$f":"IF(COUNTRY_INFO!C24=0,\" \",COUNTRY_INFO!C24)","v":"Lékabi-Léwolo"},{"$f":"IF(COUNTRY_INFO!$U$9:$U$1000=\"MDA3 (IVM)\", COUNTRY_INFO!$U$9:$U$1000, \" \")","v":" "},null,null,null,0,null,null,0,null,null,0,0,0,0," "," "," "]
[{"$f":"IF(COUNTRY_INFO!A25=0,\" \",COUNTRY_INFO!A25)","v":"Gabon"},{"$f":"IF(COUNTRY_INFO!B25=0,\" \",COUNTRY_INFO!B25)","v":"Sud-Est"},{"$f":"IF(COUNTRY_INFO!C25=0,\" \",COUNTRY_INFO!C25)","v":"Sébé-Brikolo"},{"$f":"IF(COUNTRY_INFO!$U$9:$U$1000=\"MDA3 (IVM)\", COUNTRY_INFO!$U$9:$U$1000, \" \")","v":" "},null,null,null,0,null,null,0,null,null,0,0,0,0," "," "," "]
[{"$f":"IF(COUNTRY_INFO!A26=0,\" \",COUNTRY_INFO!A26)","v":"Gabon"},{"$f":"IF(COUNTRY_INFO!B26=0,\" \",COUNTRY_INFO!B26)","v":"Sud-Est"},{"$f":"IF(COUNTRY_INFO!C26=0,\" \",COUNTRY_INFO!C26)","v":"Djoué"},{"$f":"IF(COUNTRY_INFO!$U$9:$U$1000=\"MDA3 (IVM)\", COUNTRY_INFO!$U$9:$U$1000, \" \")","v":" "},null,null,null,0,null,null,0,null,null,0,0,0,0," "," "," "]
[{"$f":"IF(COUNTRY_INFO!A27=0,\" \",COUNTRY_INFO!A27)","v":"Gabon"},{"$f":"IF(COUNTRY_INFO!B27=0,\" \",COUNTRY_INFO!B27)","v":"Centre"},{"$f":"IF(COUNTRY_INFO!C27=0,\" \",COUNTRY_INFO!C27)","v":"Ogooué-et-Lacs"},{"$f":"IF(COUNTRY_INFO!$U$9:$U$1000=\"MDA3 (IVM)\", COUNTRY_INFO!$U$9:$U$1000, \" \")","v":" "},null,null,null,0,null,null,0,null,null,0,0,0,0," "," "," "]
[{"$f":"IF(COUNTRY_INFO!A28=0,\" \",COUNTRY_INFO!A28)","v":"Gabon"},{"$f":"IF(COUNTRY_INFO!B28=0,\" \",COUNTRY_INFO!B28)","v":"Centre"},{"$f":"IF(COUNTRY_INFO!C28=0,\" \",COUNTRY_INFO!C28)","v":"Abanga-Bigné"},{"$f":"IF(COUNTRY_INFO!$U$9:$U$1000=\"MDA3 (IVM)\", COUNTRY_INFO!$U$9:$U$1000, \" \")","v":" "},null,null,null,0,null,null,0,null,null,0,0,0,0," "," "," "]
[{"$f":"IF(COUNTRY_INFO!A29=0,\" \",COUNTRY_INFO!A29)","v":"Gabon"},{"$f":"IF(COUNTRY_INFO!B29=0,\" \",COUNTRY_INFO!B29)","v":"Centre-Sud"},{"$f":"IF(COUNTRY_INFO!C29=0,\" \",COUNTRY_INFO!C29)","v":"Tsamba-Magotsi"},{"$f":"IF(COUNTRY_INFO!$U$9:$U$1000=\"MDA3 (IVM)\", COUNTRY_INFO!$U$9:$U$1000, \" \")","v":" "},null,null,null,0,null,null,0,null,null,0,0,0,0," "," "," "]
[{"$f":"IF(COUNTRY_INFO!A30=0,\" \",COUNTRY_INFO!A30)","v":"Gabon"},{"$f":"IF(COUNTRY_INFO!B30=0,\" \",COUNTRY_INFO!B30)","v":"Centre-Sud"},{"$f":"IF(COUNTRY_INFO!C30=0,\" \",COUNTRY_INFO!C30)","v":"Louetsi-Wano"},{"$f":"IF(COUNTRY_INFO!$U$9:$U$1000=\"MDA3 (IVM)\", COUNTRY_INFO!$U$9:$U$1000, \" \")","v":" "},null,null,null,0,null,null,0,null,null,0,0,0,0," "," "," "]
[{"$f":"IF(COUNTRY_INFO!A31=0,\" \",COUNTRY_INFO!A31)","v":"Gabon"},{"$f":"IF(COUNTRY_INFO!B31=0,\" \",COUNTRY_INFO!B31)","v":"Centre-Sud"},{"$f":"IF(COUNTRY_INFO!C31=0,\" \",COUNTRY_INFO!C31)","v":"Louetsi-Bibaka"},{"$f":"IF(COUNTRY_INFO!$U$9:$U$1000=\"MDA3 (IVM)\", COUNTRY_INFO!$U$9:$U$1000, \" \")","v":" "},null,null,null,0,null,null,0,null,null,0,0,0,0," "," "," "]
[{"$f":"IF(COUNTRY_INFO!A32=0,\" \",COUNTRY_INFO!A32)","v":"Gabon"},{"$f":"IF(COUNTRY_INFO!B32=0,\" \",COUNTRY_INFO!B32)","v":"Centre-Sud"},{"$f":"IF(COUNTRY_INFO!C32=0,\" \",COUNTRY_INFO!C32)","v":"Ndolou"},{"$f":"IF(COUNTRY_INFO!$U$9:$U$1000=\"MDA3 (IVM)\", COUNTRY_INFO!$U$9:$U$1000, \" \")","v":" "},null,null,null,0,null,null,0,null,null,0,0,0,0," "," "," "]
[{"$f":"IF(COUNTRY_INFO!A33=0,\" \",COUNTRY_INFO!A33)","v":"Gabon"},{"$f":"IF(COUNTRY_INFO!B33=0,\" \",COUNTRY_INFO!B33)","v":"Centre-Sud"},{"$f":"IF(COUNTRY_INFO!C33=0,\" \",COUNTRY_INFO!C33)","v":"Boumi-Louetsi"},{"$f":"IF(COUNTRY_INFO!$U$9:$U$1000=\"MDA3 (IVM)\", COUNTRY_INFO!$U$9:$U$1000, \" \")","v":" "},null,null,null,0,null,null,0,null,null,0,0,0,0," "," "," "]
[{"$f":"IF(COUNTRY_INFO!A34=0,\" \",COUNTRY_INFO!A34)","v":"Gabon"},{"$f":"IF(COUNTRY_INFO!B34=0,\" \",COUNTRY_INFO!B34)","v":"Centre-Sud"},{"$f":"IF(COUNTRY_INFO!C34=0,\" \",COUNTRY_INFO!C34)","v":"Ogoulou"},{"$f":"IF(COUNTRY_INFO!$U$9:$U$1000=\"MDA3 (IVM)\", COUNTRY_INFO!$U$9:$U$1000, \" \")","v":" "},null,null,null,0,null,null,0,null,null,0,0,0,0," "," "," "]
[{"$f":"IF(COUNTRY_INFO!A35=0,\" \",COUNTRY_INFO!A35)","v":"Gabon"},{"$f":"IF(COUNTRY_INFO!B35=0,\" \",COUNTRY_INFO!B35)","v":"Centre-Sud"},{"$f":"IF(COUNTRY_INFO!C35=0,\" \",COUNTRY_INFO!C35)","v":"Douya-Onoye"},{"$f":"IF(COUNTRY_INFO!$U$9:$U$1000=\"MDA3 (IVM)\", COUNTRY_INFO!$U$9:$U$1000, \" \")","v":" "},null,null,null,0,null,null,0,null,null,0,0,0,0," "," "," "]
[{"$f":"IF(COUNTRY_INFO!A36=0,\" \",COUNTRY_INFO!A36)","v":"Gabon"},{"$f":"IF(COUNTRY_INFO!B36=0,\" \",COUNTRY_INFO!B36)","v":"Centre-Sud"},{"$f":"IF(COUNTRY_INFO!C36=0,\" \",COUNTRY_INFO!C36)","v":"Dola"},{"$f":"IF(COUNTRY_INFO!$U$9:$U$1000=\"MDA3 (IVM)\", COUNTRY_INFO!$U$9:$U$1000, \" \")","v":" "},null,null,null,0,null,null,0,null,null,0,0,0,0," "," "," "]
[{"$f":"IF(COUNTRY_INFO!A37=0,\" \",COUNTRY_INFO!A37)","v":"Gabon"},{"$f":"IF(COUNTRY_INFO!B37=0,\" \",COUNTRY_INFO!B37)","v":"Centre-Sud"},{"$f":"IF(COUNTRY_INFO!C37=0,\" \",COUNTRY_INFO!C37)","v":"Mougalaba"},{"$f":"IF(COUNTRY_INFO!$U$9:$U$1000=\"MDA3 (IVM)\", COUNTRY_INFO!$U$9:$U$1000, \" \")","v":" "},null,null,null,0,null,null,0,null,null,0,0,0,0," "," "," "]
[{"$f":"IF(COUNTRY_INFO!A38=0,\" \",COUNTRY_INFO!A38)","v":"Gabon"},{"$f":"IF(COUNTRY_INFO!B38=0,\" \",COUNTRY_INFO!B38)","v":"Sud"},{"$f":"IF(COUNTRY_INFO!C38=0,\" \",COUNTRY_INFO!C38)","v":"Doutsila"},{"$f":"IF(COUNTRY_INFO!$U$9:$U$1000=\"MDA3 (IVM)\", COUNTRY_INFO!$U$9:$U$1000, \" \")","v":" "},null,null,null,0,null,null,0,null,null,0,0,0,0," "," "," "]
[{"$f":"IF(COUNTRY_INFO!A39=0,\" \",COUNTRY_INFO!A39)","v":"Gabon"},{"$f":"IF(COUNTRY_INFO!B39=0,\" \",COUNTRY_INFO!B39)","v":"Sud"},{"$f":"IF(COUNTRY_INFO!C39=0,\" \",COUNTRY_INFO!C39)","v":"Basse-Banio"},{"$f":"IF(COUNTRY_INFO!$U$9:$U$1000=\"MDA3 (IVM)\", COUNTRY_INFO!$U$9:$U$1000, \" \")","v":" "},null,null,null,0,null,null,0,null,null,0,0,0,0," "," "," "]
[{"$f":"IF(COUNTRY_INFO!A40=0,\" \",COUNTRY_INFO!A40)","v":"Gabon"},{"$f":"IF(COUNTRY_INFO!B40=0,\" \",COUNTRY_INFO!B40)","v":"Sud"},{"$f":"IF(COUNTRY_INFO!C40=0,\" \",COUNTRY_INFO!C40)","v":"Douigny"},{"$f":"IF(COUNTRY_INFO!$U$9:$U$1000=\"MDA3 (IVM)\", COUNTRY_INFO!$U$9:$U$1000, \" \")","v":" "},null,null,null,0,null,null,0,null,null,0,0,0,0," "," "," "]
[{"$f":"IF(COUNTRY_INFO!A41=0,\" \",COUNTRY_INFO!A41)","v":"Gabon"},{"$f":"IF(COUNTRY_INFO!B41=0,\" \",COUNTRY_INFO!B41)","v":"Sud"},{"$f":"IF(COUNTRY_INFO!C41=0,\" \",COUNTRY_INFO!C41)","v":"Mongo"},{"$f":"IF(COUNTRY_INFO!$U$9:$U$1000=\"MDA3 (IVM)\", COUNTRY_INFO!$U$9:$U$1000, \" \")","v":" "},null,null,null,0,null,null,0,null,null,0,0,0,0," "," "," "]
[{"$f":"IF(COUNTRY_INFO!A42=0,\" \",COUNTRY_INFO!A42)","v":"Gabon"},{"$f":"IF(COUNTRY_INFO!B42=0,\" \",COUNTRY_INFO!B42)","v":"Sud"},{"$f":"IF(COUNTRY_INFO!C42=0,\" \",COUNTRY_INFO!C42)","v":"Haute-Banio"},{"$f":"IF(COUNTRY_INFO!$U$9:$U$1000=\"MDA3 (IVM)\", COUNTRY_INFO!$U$9:$U$1000, \" \")","v":" "},null,null,null,0,null,null,0,null,null,0,0,0,0," "," "," "]
[{"$f":"IF(COUNTRY_INFO!A43=0,\" \",COUNTRY_INFO!A43)","v":"Gabon"},{"$f":"IF(COUNTRY_INFO!B43=0,\" \",COUNTRY_INFO!B43)","v":"Sud"},{"$f":"IF(COUNTRY_INFO!C43=0,\" \",COUNTRY_INFO!C43)","v":"Mougoutsi"},{"$f":"IF(COUNTRY_INFO!$U$9:$U$1000=\"MDA3 (IVM)\", COUNTRY_INFO!$U$9:$U$1000, \" \")","v":" "},null,null,null,0,null,null,0,null,null,0,0,0,0," "," "," "]
[{"$f":"IF(COUNTRY_INFO!A44=0,\" \",COUNTRY_INFO!A44)","v":"Gabon"},{"$f":"IF(COUNTRY_INFO!B44=0,\" \",COUNTRY_INFO!B44)","v":"Est"},{"$f":"IF(COUNTRY_INFO!C44=0,\" \",COUNTRY_INFO!C44)","v":"Lopé"},{"$f":"IF(COUNTRY_INFO!$U$9:$U$1000=\"MDA3 (IVM)\", COUNTRY_INFO!$U$9:$U$1000, \" \")","v":" "},null,null,null,0,null,null,0,null,null,0,0,0,0," "," "," "]
[{"$f":"IF(COUNTRY_INFO!A45=0,\" \",COUNTRY_INFO!A45)","v":"Gabon"},{"$f":"IF(COUNTRY_INFO!B45=0,\" \",COUNTRY_INFO!B45)","v":"Est"},{"$f":"IF(COUNTRY_INFO!C45=0,\" \",COUNTRY_INFO!C45)","v":"Ivindo"},{"$f":"IF(COUNTRY_INFO!$U$9:$U$1000=\"MDA3 (IVM)\", COUNTRY_INFO!$U$9:$U$1000, \" \")","v":" "},null,null,null,0,null,null,0,null,null,0,0,0,0," "," "," "]
[{"$f":"IF(COUNTRY_INFO!A46=0,\" \",COUNTRY_INFO!A46)","v":"Gabon"},{"$f":"IF(COUNTRY_INFO!B46=0,\" \",COUNTRY_INFO!B46)","v":"Est"},{"$f":"IF(COUNTRY_INFO!C46=0,\" \",COUNTRY_INFO!C46)","v":"Zadié"},{"$f":"IF(COUNTRY_INFO!$U$9:$U$1000=\"MDA3 (IVM)\", COUNTRY_INFO!$U$9:$U$1000, \" \")","v":" "},null,null,null,0,null,null,0,null,null,0,0,0,0," "," "," "]
[{"$f":"IF(COUNTRY_INFO!A47=0,\" \",COUNTRY_INFO!A47)","v":"Gabon"},{"$f":"IF(COUNTRY_INFO!B47=0,\" \",COUNTRY_INFO!B47)","v":"Est"},{"$f":"IF(COUNTRY_INFO!C47=0,\" \",COUNTRY_INFO!C47)","v":"Mvoung"},{"$f":"IF(COUNTRY_INFO!$U$9:$U$1000=\"MDA3 (IVM)\", COUNTRY_INFO!$U$9:$U$1000, \" \")","v":" "},null,null,null,0,null,null,0,null,null,0,0,0,0," "," "," "]
[{"$f":"IF(COUNTRY_INFO!A48=0,\" \",COUNTRY_INFO!A48)","v":"Gabon"},{"$f":"IF(COUNTRY_INFO!B48=0,\" \",COUNTRY_INFO!B48)","v":"Centre-Est"},{"$f":"IF(COUNTRY_INFO!C48=0,\" \",COUNTRY_INFO!C48)","v":"Offoué-Onoye"},{"$f":"IF(COUNTRY_INFO!$U$9:$U$1000=\"MDA3 (IVM)\", COUNTRY_INFO!$U$9:$U$1000, \" \")","v":" "},null,null,null,0,null,null,0,null,null,0,0,0,0," "," "," "]
[{"$f":"IF(COUNTRY_INFO!A49=0,\" \",COUNTRY_INFO!A49)","v":"Gabon"},{"$f":"IF(COUNTRY_INFO!B49=0,\" \",COUNTRY_INFO!B49)","v":"Centre-Est"},{"$f":"IF(COUNTRY_INFO!C49=0,\" \",COUNTRY_INFO!C49)","v":"Lolo-Bouenguidi"},{"$f":"IF(COUNTRY_INFO!$U$9:$U$1000=\"MDA3 (IVM)\", COUNTRY_INFO!$U$9:$U$1000, \" \")","v":" "},null,null,null,0,null,null,0,null,null,0,0,0,0," "," "," "]
[{"$f":"IF(COUNTRY_INFO!A50=0,\" \",COUNTRY_INFO!A50)","v":"Gabon"},{"$f":"IF(COUNTRY_INFO!B50=0,\" \",COUNTRY_INFO!B50)","v":"Centre-Est"},{"$f":"IF(COUNTRY_INFO!C50=0,\" \",COUNTRY_INFO!C50)","v":"Mulundu"},{"$f":"IF(COUNTRY_INFO!$U$9:$U$1000=\"MDA3 (IVM)\", COUNTRY_INFO!$U$9:$U$1000, \" \")","v":" "},null,null,null,0,null,null,0,null,null,0,0,0,0," "," "," "]
[{"$f":"IF(COUNTRY_INFO!A51=0,\" \",COUNTRY_INFO!A51)","v":"Gabon"},{"$f":"IF(COUNTRY_INFO!B51=0,\" \",COUNTRY_INFO!B51)","v":"Centre-Est"},{"$f":"IF(COUNTRY_INFO!C51=0,\" \",COUNTRY_INFO!C51)","v":"Lombo-Bouenguidi"},{"$f":"IF(COUNTRY_INFO!$U$9:$U$1000=\"MDA3 (IVM)\", COUNTRY_INFO!$U$9:$U$1000, \" \")","v":" "},null,null,null,0,null,null,0,null,null,0,0,0,0," "," "," "]
[{"$f":"IF(COUNTRY_INFO!A52=0,\" \",COUNTRY_INFO!A52)","v":"Gabon"},{"$f":"IF(COUNTRY_INFO!B52=0,\" \",COUNTRY_INFO!B52)","v":"Maritime"},{"$f":"IF(COUNTRY_INFO!C52=0,\" \",COUNTRY_INFO!C52)","v":"Ndougou"},{"$f":"IF(COUNTRY_INFO!$U$9:$U$1000=\"MDA3 (IVM)\", COUNTRY_INFO!$U$9:$U$1000, \" \")","v":" "},null,null,null,0,null,null,0,null,null,0,0,0,0," "," "," "]
[{"$f":"IF(COUNTRY_INFO!A53=0,\" \",COUNTRY_INFO!A53)","v":"Gabon"},{"$f":"IF(COUNTRY_INFO!B53=0,\" \",COUNTRY_INFO!B53)","v":"Maritime"},{"$f":"IF(COUNTRY_INFO!C53=0,\" \",COUNTRY_INFO!C53)","v":"Etimboué"},{"$f":"IF(COUNTRY_INFO!$U$9:$U$1000=\"MDA3 (IVM)\", COUNTRY_INFO!$U$9:$U$1000, \" \")","v":" "},null,null,null,0,null,null,0,null,null,0,0,0,0," "," "," "]
[{"$f":"IF(COUNTRY_INFO!A54=0,\" \",COUNTRY_INFO!A54)","v":"Gabon"},{"$f":"IF(COUNTRY_INFO!B54=0,\" \",COUNTRY_INFO!B54)","v":"Maritime"},{"$f":"IF(COUNTRY_INFO!C54=0,\" \",COUNTRY_INFO!C54)","v":"Bendjé"},{"$f":"IF(COUNTRY_INFO!$U$9:$U$1000=\"MDA3 (IVM)\", COUNTRY_INFO!$U$9:$U$1000, \" \")","v":" "},null,null,null,0,null,null,0,null,null,0,0,0,0," "," "," "]
[{"$f":"IF(COUNTRY_INFO!A55=0,\" \",COUNTRY_INFO!A55)","v":"Gabon"},{"$f":"IF(COUNTRY_INFO!B55=0,\" \",COUNTRY_INFO!B55)","v":"Nord"},{"$f":"IF(COUNTRY_INFO!C55=0,\" \",COUNTRY_INFO!C55)","v":"Ntem"},{"$f":"IF(COUNTRY_INFO!$U$9:$U$1000=\"MDA3 (IVM)\", COUNTRY_INFO!$U$9:$U$1000, \" \")","v":" "},null,null,null,0,null,null,0,null,null,0,0,0,0," "," "," "]
[{"$f":"IF(COUNTRY_INFO!A56=0,\" \",COUNTRY_INFO!A56)","v":"Gabon"},{"$f":"IF(COUNTRY_INFO!B56=0,\" \",COUNTRY_INFO!B56)","v":"Nord"},{"$f":"IF(COUNTRY_INFO!C56=0,\" \",COUNTRY_INFO!C56)","v":"Haut - Komo"},{"$f":"IF(COUNTRY_INFO!$U$9:$U$1000=\"MDA3 (IVM)\", COUNTRY_INFO!$U$9:$U$1000, \" \")","v":" "},null,null,null,0,null,null,0,null,null,0,0,0,0," "," "," "]
[{"$f":"IF(COUNTRY_INFO!A57=0,\" \",COUNTRY_INFO!A57)","v":"Gabon"},{"$f":"IF(COUNTRY_INFO!B57=0,\" \",COUNTRY_INFO!B57)","v":"Nord"},{"$f":"IF(COUNTRY_INFO!C57=0,\" \",COUNTRY_INFO!C57)","v":"Haut-Ntem"},{"$f":"IF(COUNTRY_INFO!$U$9:$U$1000=\"MDA3 (IVM)\", COUNTRY_INFO!$U$9:$U$1000, \" \")","v":" "},null,null,null,0,null,null,0,null,null,0,0,0,0," "," "," "]
[{"$f":"IF(COUNTRY_INFO!A58=0,\" \",COUNTRY_INFO!A58)","v":"Gabon"},{"$f":"IF(COUNTRY_INFO!B58=0,\" \",COUNTRY_INFO!B58)","v":"Nord"},{"$f":"IF(COUNTRY_INFO!C58=0,\" \",COUNTRY_INFO!C58)","v":"Okano"},{"$f":"IF(COUNTRY_INFO!$U$9:$U$1000=\"MDA3 (IVM)\", COUNTRY_INFO!$U$9:$U$1000, \" \")","v":" "},null,null,null,0,null,null,0,null,null,0,0,0,0," "," "," "]
[{"$f":"IF(COUNTRY_INFO!A59=0,\" \",COUNTRY_INFO!A59)","v":"Gabon"},{"$f":"IF(COUNTRY_INFO!B59=0,\" \",COUNTRY_INFO!B59)","v":"Nord"},{"$f":"IF(COUNTRY_INFO!C59=0,\" \",COUNTRY_INFO!C59)","v":"Woleu"},{"$f":"IF(COUNTRY_INFO!$U$9:$U$1000=\"MDA3 (IVM)\", COUNTRY_INFO!$U$9:$U$1000, \" \")","v":" "},null,null,null,0,null,null,0,null,null,0,0,0,0," "," "," "]

{"sheet":"T1","index":5,"n_rows":59,"n_cols":19,"rows_kept":59,"cut":false,"hidden":false,"merged":[[5,6,5,10],[5,11,5,14],[5,15,5,18],[3,0,3,2],[5,0,5,2],[5,3,6,3],[5,5,6,5],[5,4,6,4]]}
["T 1 - Praziquantel (PZQ) et Albendazole (ALB) ou Mebendazole (MBD)"]
["Structure administrative, population nécessitant une chimioprévention par groupe d'âge, population traitée par groupe d'âge et couverture"]
[]
["TOTAL",null,null,null,null,null,{"$f":"SUM(G$9:G$1000)","v":0},274630,274630,0,{"$f":"SUM(K$9:K$1000)","v":274630},0,117555,0,117555,{"$f":"IF(G4<>0, IF(L4/G4*100=0, \"-\", L4/G4*100), \" \")","v":" "},{"$f":"IF(OR(I4<>0,H4<>0), IF(M4/MAX(H4,I4)*100=0, \"-\", M4/MAX(H4,I4)*100), \" \")","v":42.804864727087356},{"$f":"IF(J4<>0, IF(N4/J4*100=0, \"-\", N4/J4*100), \" \")","v":" "},{"$f":"IF(K4<>0, IF(O4/K4*100=0, \"-\", O4/K4*100), \" \")","v":42.804864727087356}]
[]
["Structure administrative du pays",null,null,"Mise en oeuvre \nde la CP","Médica-ment","Date","Population ciblée pour T1",null,null,null,null,"Population traitée",null,null,null,"Couverture du Programme (%)"]
["Pays","Région/Département","District",null,null,null,"EAPréS (ALB)","EAS (ALB)","EAS (PZQ)","Adultes (PZQ)","Total","EAPréS","EAS","Adultes","Total","EAPréS","EAS","Adultes","Total"]
[]
[{"$f":"IF(COUNTRY_INFO!A9=0,\" \",COUNTRY_INFO!A9)","v":"Gabon"},{"$f":"IF(COUNTRY_INFO!B9=0,\" \",COUNTRY_INFO!B9)","v":"Libreville-Owendo"},{"$f":"IF(COUNTRY_INFO!C9=0,\" \",COUNTRY_INFO!C9)","v":"Libreville 1"},{"$f":"IF(OR(COUNTRY_INFO!$U$9:$U$1000=\"T1 (PZQ+ALB/MBD)\",COUNTRY_INFO!$V$9:$V$1000=\"T1 (PZQ+ALB/MBD)\"), \"T1 (PZQ+ALB/MBD)\", \" \")","v":"T1 (PZQ+ALB/MBD)"},"PZQ+MBD","072018",null,29461,29461,null,{"$f":"MAX(H9:I9)+G9+J9","v":29461},null,14518,null,{"$f":"SUM(L9:N9)","v":14518},{"$f":"IF(G9<>0, IF(L9/G9*100=0, \"-\", L9/G9*100), \" \")","v":" "},{"$f":"IF(OR(I9<>0,H9<>0), IF(M9/MAX(H9,I9)*100=0, \"-\", M9/MAX(H9,I9)*100), \" \")","v":49.278707443739179},{"$f":"IF(J9<>0, IF(N9/J9*100=0, \"-\", N9/J9*100), \" \")","v":" "},49.278707443739179]
[{"$f":"IF(COUNTRY_INFO!A10=0,\" \",COUNTRY_INFO!A10)","v":"Gabon"},{"$f":"IF(COUNTRY_INFO!B10=0,\" \",COUNTRY_INFO!B10)","v":"Libreville-Owendo"},{"$f":"IF(COUNTRY_INFO!C10=0,\" \",COUNTRY_INFO!C10)","v":"Libreville 2"},{"$f":"IF(OR(COUNTRY_INFO!$U$9:$U$1000=\"T1 (PZQ+ALB/MBD)\",COUNTRY_INFO!$V$9:$V$1000=\"T1 (PZQ+ALB/MBD)\"), \"T1 (PZQ+ALB/MBD)\", \" \")","v":" "},null,null,null,null,null,null,{"$f":"MAX(H10:I10)+G10+J10","v":0},null,null,null,{"$f":"SUM(L10:N10)","v":0},{"$f":"IF(G10<>0, IF(L10/G10*100=0, \"-\", L10/G10*100), \" \")","v":" "},{"$f":"IF(OR(I10<>0,H10<>0), IF(M10/MAX(H10,I10)*100=0, \"-\", M10/MAX(H10,I10)*100), \" \")","v":" "},{"$f":"IF(J10<>0, IF(N10/J10*100=0, \"-\", N10/J10*100), \" \")","v":" "},{"$f":"IF(K10<>0, IF(O10/K10*100=0, \"-\", O10/K10*100), \" \")","v":" "}]
[{"$f":"IF(COUNTRY_INFO!A11=0,\" \",COUNTRY_INFO!A11)","v":"Gabon"},{"$f":"IF(COUNTRY_INFO!B11=0,\" \",COUNTRY_INFO!B11)","v":"Libreville-Owendo"},{"$f":"IF(COUNTRY_INFO!C11=0,\" \",COUNTRY_INFO!C11)","v":"Libreville 3"},{"$f":"IF(OR(COUNTRY_INFO!$U$9:$U$1000=\"T1 (PZQ+ALB/MBD)\",COUNTRY_INFO!$V$9:$V$1000=\"T1 (PZQ+ALB/MBD)\"), \"T1 (PZQ+ALB/MBD)\", \" \")","v":" "},null,null,null,null,null,null,0,null,null,null,0," "," "," "," "]
[{"$f":"IF(COUNTRY_INFO!A12=0,\" \",COUNTRY_INFO!A12)","v":"Gabon"},{"$f":"IF(COUNTRY_INFO!B12=0,\" \",COUNTRY_INFO!B12)","v":"Libreville-Owendo"},{"$f":"IF(COUNTRY_INFO!C12=0,\" \",COUNTRY_INFO!C12)","v":"Owendo"},{"$f":"IF(OR(COUNTRY_INFO!$U$9:$U$1000=\"T1 (PZQ+ALB/MBD)\",COUNTRY_INFO!$V$9:$V$1000=\"T1 (PZQ+ALB/MBD)\"), \"T1 (PZQ+ALB/MBD)\", \" \")","v":" "},null,null,null,null,null,null,0,null,null,null,0," "," "," "," "]
[{"$f":"IF(COUNTRY_INFO!A13=0,\" \",COUNTRY_INFO!A13)","v":"Gabon"},{"$f":"IF(COUNTRY_INFO!B13=0,\" \",COUNTRY_INFO!B13)","v":"Ouest"},{"$f":"IF(COUNTRY_INFO!C13=0,\" \",COUNTRY_INFO!C13)","v":"Komo-Mondah"},{"$f":"IF(OR(COUNTRY_INFO!$U$9:$U$1000=\"T1 (PZQ+ALB/MBD)\",COUNTRY_INFO!$V$9:$V$1000=\"T1 (PZQ+ALB/MBD)\"), \"T1 (PZQ+ALB/MBD)\", \" \")","v":"T1 (PZQ+ALB/MBD)"},"PZQ+MBD","072018",null,24011,24011,null,24011,null,18181,null,18181," ",75.719461913289749," ",75.719461913289749]
[{"$f":"IF(COUNTRY_INFO!A14=0,\" \",COUNTRY_INFO!A14)","v":"Gabon"},{"$f":"IF(COUNTRY_INFO!B14=0,\" \",COUNTRY_INFO!B14)","v":"Ouest"},{"$f":"IF(COUNTRY_INFO!C14=0,\" \",COUNTRY_INFO!C14)","v":"Komo-Kango"},{"$f":"IF(OR(COUNTRY_INFO!$U$9:$U$1000=\"T1 (PZQ+ALB/MBD)\",COUNTRY_INFO!$V$9:$V$1000=\"T1 (PZQ+ALB/MBD)\"), \"T1 (PZQ+ALB/MBD)\", \" \")","v":"T1 (PZQ+ALB/MBD)"},"PZQ+MBD","072018",null,4671,4671,null,4671,null,1677,null,1677," ",35.902376364804113," ",35.902376364804113]
[{"$f":"IF(COUNTRY_INFO!A15=0,\" \",COUNTRY_INFO!A15)","v":"Gabon"},{"$f":"IF(COUNTRY_INFO!B15=0,\" \",COUNTRY_INFO!B15)","v":"Ouest"},{"$f":"IF(COUNTRY_INFO!C15=0,\" \",COUNTRY_INFO!C15)","v":"Noya"},{"$f":"IF(OR(COUNTRY_INFO!$U$9:$U$1000=\"T1 (PZQ+ALB/MBD)\",COUNTRY_INFO!$V$9:$V$1000=\"T1 (PZQ+ALB/MBD)\"), \"T1 (PZQ+ALB/MBD)\", \" \")","v":"T1 (PZQ+ALB/MBD)"},"PZQ+MBD","072018",null,1225,1225,null,1225,null,777,null,777," ",63.428571428571423," ",63.428571428571423]
[{"$f":"IF(COUNTRY_INFO!A16=0,\" \",COUNTRY_INFO!A16)","v":"Gabon"},{"$f":"IF(COUNTRY_INFO!B16=0,\" \",COUNTRY_INFO!B16)","v":"Sud-Est"},{"$f":"IF(COUNTRY_INFO!C16=0,\" \",COUNTRY_INFO!C16)","v":"Bayi-brikolo"},{"$f":"IF(OR(COUNTRY_INFO!$U$9:$U$1000=\"T1 (PZQ+ALB/MBD)\",COUNTRY_INFO!$V$9:$V$1000=\"T1 (PZQ+ALB/MBD)\"), \"T1 (PZQ+ALB/MBD)\", \" \")","v":" "},null,null,null,null,null,null,0,null,null,null,0," "," "," "," "]
[{"$f":"IF(COUNTRY_INFO!A17=0,\" \",COUNTRY_INFO!A17)","v":"Gabon"},{"$f":"IF(COUNTRY_INFO!B17=0,\" \",COUNTRY_INFO!B17)","v":"Sud-Est"},{"$f":"IF(COUNTRY_INFO!C17=0,\" \",COUNTRY_INFO!C17)","v":"Lékoni-Lékori"},{"$f":"IF(OR(COUNTRY_INFO!$U$9:$U$1000=\"T1 (PZQ+ALB/MBD)\",COUNTRY_INFO!$V$9:$V$1000=\"T1 (PZQ+ALB/MBD)\"), \"T1 (PZQ+ALB/MBD)\", \" \")","v":"T1 (PZQ+ALB/MBD)"},"PZQ+MBD","072018",null,3171,3171,null,3171,null,1121,null,1121," ",35.351624093345947," ",35.351624093345947]
[{"$f":"IF(COUNTRY_INFO!A18=0,\" \",COUNTRY_INFO!A18)","v":"Gabon"},{"$f":"IF(COUNTRY_INFO!B18=0,\" \",COUNTRY_INFO!B18)","v":"Sud-Est"},{"$f":"IF(COUNTRY_INFO!C18=0,\" \",COUNTRY_INFO!C18)","v":"Lékoko"},{"$f":"IF(OR(COUNTRY_INFO!$U$9:$U$1000=\"T1 (PZQ+ALB/MBD)\",COUNTRY_INFO!$V$9:$V$1000=\"T1 (PZQ+ALB/MBD)\"), \"T1 (PZQ+ALB/MBD)\", \" \")","v":"T1 (PZQ+ALB/MBD)"},"PZQ+MBD","072018",null,1418,1418,null,1418,null,602,null,602," ",42.454160789844849," ",42.454160789844849]
[{"$f":"IF(COUNTRY_INFO!A19=0,\" \",COUNTRY_INFO!A19)","v":"Gabon"},{"$f":"IF(COUNTRY_INFO!B19=0,\" \",COUNTRY_INFO!B19)","v":"Sud-Est"},{"$f":"IF(COUNTRY_INFO!C19=0,\" \",COUNTRY_INFO!C19)","v":"Djouori-Agnili"},{"$f":"IF(OR(COUNTRY_INFO!$U$9:$U$1000=\"T1 (PZQ+ALB/MBD)\",COUNTRY_INFO!$V$9:$V$1000=\"T1 (PZQ+ALB/MBD)\"), \"T1 (PZQ+ALB/MBD)\", \" \")","v":" "},null,null,null,null,null,null,0,null,null,null,0," "," "," "," "]
[{"$f":"IF(COUNTRY_INFO!A20=0,\" \",COUNTRY_INFO!A20)","v":"Gabon"},{"$f":"IF(COUNTRY_INFO!B20=0,\" \",COUNTRY_INFO!B20)","v":"Sud-Est"},{"$f":"IF(COUNTRY_INFO!C20=0,\" \",COUNTRY_INFO!C20)","v":"Ogooué-Létili"},{"$f":"IF(OR(COUNTRY_INFO!$U$9:$U$1000=\"T1 (PZQ+ALB/MBD)\",COUNTRY_INFO!$V$9:$V$1000=\"T1 (PZQ+ALB/MBD)\"), \"T1 (PZQ+ALB/MBD)\", \" \")","v":" "},null,null,null,null,null,null,0,null,null,null,0," "," "," "," "]
[{"$f":"IF(COUNTRY_INFO!A21=0,\" \",COUNTRY_INFO!A21)","v":"Gabon"},{"$f":"IF(COUNTRY_INFO!B21=0,\" \",COUNTRY_INFO!B21)","v":"Sud-Est"},{"$f":"IF(COUNTRY_INFO!C21=0,\" \",COUNTRY_INFO!C21)","v":"Mpassa"},{"$f":"IF(OR(COUNTRY_INFO!$U$9:$U$1000=\"T1 (PZQ+ALB/MBD)\",COUNTRY_INFO!$V$9:$V$1000=\"T1 (PZQ+ALB/MBD)\"), \"T1 (PZQ+ALB/MBD)\", \" \")","v":"T1 (PZQ+ALB/MBD)"},"PZQ+MBD","072018",null,39259,39259,null,39259,null,8624,null,8624," ",21.966937517511909," ",21.966937517511909]
[{"$f":"IF(COUNTRY_INFO!A22=0,\" \",COUNTRY_INFO!A22)","v":"Gabon"},{"$f":"IF(COUNTRY_INFO!B22=0,\" \",COUNTRY_INFO!B22)","v":"Sud-Est"},{"$f":"IF(COUNTRY_INFO!C22=0,\" \",COUNTRY_INFO!C22)","v":"Plateaux"},{"$f":"IF(OR(COUNTRY_INFO!$U$9:$U$1000=\"T1 (PZQ+ALB/MBD)\",COUNTRY_INFO!$V$9:$V$1000=\"T1 (PZQ+ALB/MBD)\"), \"T1 (PZQ+ALB/MBD)\", \" \")","v":"T1 (PZQ+ALB/MBD)"},"PZQ+MBD","072018",null,3147,3147,null,3147,null,1916,null,1916," ",60.88338099777566," ",60.88338099777566]
[{"$f":"IF(COUNTRY_INFO!A23=0,\" \",COUNTRY_INFO!A23)","v":"Gabon"},{"$f":"IF(COUNTRY_INFO!B23=0,\" \",COUNTRY_INFO!B23)","v":"Sud-Est"},{"$f":"IF(COUNTRY_INFO!C23=0,\" \",COUNTRY_INFO!C23)","v":"Lébombi-Léyou"},{"$f":"IF(OR(COUNTRY_INFO!$U$9:$U$1000=\"T1 (PZQ+ALB/MBD)\",COUNTRY_INFO!$V$9:$V$1000=\"T1 (PZQ+ALB/MBD)\"), \"T1 (PZQ+ALB/MBD)\", \" \")","v":"T1 (PZQ+ALB/MBD)"},"PZQ+MBD","072018",null,17394,17394,null,17394,null,6545,null,6545," ",37.627917672760724," ",37.627917672760724]
[{"$f":"IF(COUNTRY_INFO!A24=0,\" \",COUNTRY_INFO!A24)","v":"Gabon"},{"$f":"IF(COUNTRY_INFO!B24=0,\" \",COUNTRY_INFO!B24)","v":"Sud-Est"},{"$f":"IF(COUNTRY_INFO!C24=0,\" \",COUNTRY_INFO!C24)","v":"Lékabi-Léwolo"},{"$f":"IF(OR(COUNTRY_INFO!$U$9:$U$1000=\"T1 (PZQ+ALB/MBD)\",COUNTRY_INFO!$V$9:$V$1000=\"T1 (PZQ+ALB/MBD)\"), \"T1 (PZQ+ALB/MBD)\", \" \")","v":"T1 (PZQ+ALB/MBD)"},"PZQ+MBD","072018",null,2533,2533,null,2533,null,635,null,635," ",25.069088037899721," ",25.069088037899721]
[{"$f":"IF(COUNTRY_INFO!A25=0,\" \",COUNTRY_INFO!A25)","v":"Gabon"},{"$f":"IF(COUNTRY_INFO!B25=0,\" \",COUNTRY_INFO!B25)","v":"Sud-Est"},{"$f":"IF(COUNTRY_INFO!C25=0,\" \",COUNTRY_INFO!C25)","v":"Sébé-Brikolo"},{"$f":"IF(OR(COUNTRY_INFO!$U$9:$U$1000=\"T1 (PZQ+ALB/MBD)\",COUNTRY_INFO!$V$9:$V$1000=\"T1 (PZQ+ALB/MBD)\"), \"T1 (PZQ+ALB/MBD)\", \" \")","v":"T1 (PZQ+ALB/MBD)"},"PZQ+MBD","072018",null,4759,4759,null,4759,null,1816,null,1816," ",38.159277159067031," ",38.159277159067031]
[{"$f":"IF(COUNTRY_INFO!A26=0,\" \",COUNTRY_INFO!A26)","v":"Gabon"},{"$f":"IF(COUNTRY_INFO!B26=0,\" \",COUNTRY_INFO!B26)","v":"Sud-Est"},{"$f":"IF(COUNTRY_INFO!C26=0,\" \",COUNTRY_INFO!C26)","v":"Djoué"},{"$f":"IF(OR(COUNTRY_INFO!$U$9:$U$1000=\"T1 (PZQ+ALB/MBD)\",COUNTRY_INFO!$V$9:$V$1000=\"T1 (PZQ+ALB/MBD)\"), \"T1 (PZQ+ALB/MBD)\", \" \")","v":"T1 (PZQ+ALB/MBD)"},"PZQ+MBD","072018",null,1568,1568,null,1568,null,1446,null,1446," ",92.219387755102048," ",92.219387755102048]
[{"$f":"IF(COUNTRY_INFO!A27=0,\" \",COUNTRY_INFO!A27)","v":"Gabon"},{"$f":"IF(COUNTRY_INFO!B27=0,\" \",COUNTRY_INFO!B27)","v":"Centre"},{"$f":"IF(COUNTRY_INFO!C27=0,\" \",COUNTRY_INFO!C27)","v":"Ogooué-et-Lacs"},{"$f":"IF(OR(COUNTRY_INFO!$U$9:$U$1000=\"T1 (PZQ+ALB/MBD)\",COUNTRY_INFO!$V$9:$V$1000=\"T1 (PZQ+ALB/MBD)\"), \"T1 (PZQ+ALB/MBD)\", \" \")","v":"T1 (PZQ+ALB/MBD)"},"PZQ+MBD","072018",null,15071,15071,null,15071,null,7477,null,7477," ",49.611837303430427," ",49.611837303430427]
[{"$f":"IF(COUNTRY_INFO!A28=0,\" \",COUNTRY_INFO!A28)","v":"Gabon"},{"$f":"IF(COUNTRY_INFO!B28=0,\" \",COUNTRY_INFO!B28)","v":"Centre"},{"$f":"IF(COUNTRY_INFO!C28=0,\" \",COUNTRY_INFO!C28)","v":"Abanga-Bigné"},{"$f":"IF(OR(COUNTRY_INFO!$U$9:$U$1000=\"T1 (PZQ+ALB/MBD)\",COUNTRY_INFO!$V$9:$V$1000=\"T1 (PZQ+ALB/MBD)\"), \"T1 (PZQ+ALB/MBD)\", \" \")","v":"T1 (PZQ+ALB/MBD)"},"PZQ+MBD","072018",null,4242,4242,null,4242,null,1863,null,1863," ",43.917963224893917," ",43.917963224893917]
[{"$f":"IF(COUNTRY_INFO!A29=0,\" \",COUNTRY_INFO!A29)","v":"Gabon"},{"$f":"IF(COUNTRY_INFO!B29=0,\" \",COUNTRY_INFO!B29)","v":"Centre-Sud"},{"$f":"IF(COUNTRY_INFO!C29=0,\" \",COUNTRY_INFO!C29)","v":"Tsamba-Magotsi"},{"$f":"IF(OR(COUNTRY_INFO!$U$9:$U$1000=\"T1 (PZQ+ALB/MBD)\",COUNTRY_INFO!$V$9:$V$1000=\"T1 (PZQ+ALB/MBD)\"), \"T1 (PZQ+ALB/MBD)\", \" \")","v":"T1 (PZQ+ALB/MBD)"},"PZQ+MBD","072018",null,3866,3866,null,3866,null,2264,null,2264," ",58.561821003621318," ",58.561821003621318]
[{"$f":"IF(COUNTRY_INFO!A30=0,\" \",COUNTRY_INFO!A30)","v":"Gabon"},{"$f":"IF(COUNTRY_INFO!B30=0,\" \",COUNTRY_INFO!B30)","v":"Centre-Sud"},{"$f":"IF(COUNTRY_INFO!C30=0,\" \",COUNTRY_INFO!C30)","v":"Louetsi-Wano"},{"$f":"IF(OR(COUNTRY_INFO!$U$9:$U$1000=\"T1 (PZQ+ALB/MBD)\",COUNTRY_INFO!$V$9:$V$1000=\"T1 (PZQ+ALB/MBD)\"), \"T1 (PZQ+ALB/MBD)\", \" \")","v":"T1 (PZQ+ALB/MBD)"},"PZQ+MBD","072018",null,3159,3159,null,3159,null,2272,null,2272," ",71.921494143716373," ",71.921494143716373]
[{"$f":"IF(COUNTRY_INFO!A31=0,\" \",COUNTRY_INFO!A31)","v":"Gabon"},{"$f":"IF(COUNTRY_INFO!B31=0,\" \",COUNTRY_INFO!B31)","v":"Centre-Sud"},{"$f":"IF(COUNTRY_INFO!C31=0,\" \",COUNTRY_INFO!C31)","v":"Louetsi-Bibaka"},{"$f":"IF(OR(COUNTRY_INFO!$U$9:$U$1000=\"T1 (PZQ+ALB/MBD)\",COUNTRY_INFO!$V$9:$V$1000=\"T1 (PZQ+ALB/MBD)\"), \"T1 (PZQ+ALB/MBD)\", \" \")","v":" "},null,null,null,null,null,null,0,null,null,null,0," "," "," "," "]
[{"$f":"IF(COUNTRY_INFO!A32=0,\" \",COUNTRY_INFO!A32)","v":"Gabon"},{"$f":"IF(COUNTRY_INFO!B32=0,\" \",COUNTRY_INFO!B32)","v":"Centre-Sud"},{"$f":"IF(COUNTRY_INFO!C32=0,\" \",COUNTRY_INFO!C32)","v":"Ndolou"},{"$f":"IF(OR(COUNTRY_INFO!$U$9:$U$1000=\"T1 (PZQ+ALB/MBD)\",COUNTRY_INFO!$V$9:$V$1000=\"T1 (PZQ+ALB/MBD)\"), \"T1 (PZQ+ALB/MBD)\", \" \")","v":"T1 (PZQ+ALB/MBD)"},"PZQ+MBD","072018",null,1529,1529,null,1529,null,1028,null,1028," ",67.233485938521909," ",67.233485938521909]
[{"$f":"IF(COUNTRY_INFO!A33=0,\" \",COUNTRY_INFO!A33)","v":"Gabon"},{"$f":"IF(COUNTRY_INFO!B33=0,\" \",COUNTRY_INFO!B33)","v":"Centre-Sud"},{"$f":"IF(COUNTRY_INFO!C33=0,\" \",COUNTRY_INFO!C33)","v":"Boumi-Louetsi"},{"$f":"IF(OR(COUNTRY_INFO!$U$9:$U$1000=\"T1 (PZQ+ALB/MBD)\",COUNTRY_INFO!$V$9:$V$1000=\"T1 (PZQ+ALB/MBD)\"), \"T1 (PZQ+ALB/MBD)\", \" \")","v":"T1 (PZQ+ALB/MBD)"},"PZQ+MBD","072018",null,5499,5499,null,5499,null,1838,null,1838," ",33.424258956173851," ",33.424258956173851]
[{"$f":"IF(COUNTRY_INFO!A34=0,\" \",COUNTRY_INFO!A34)","v":"Gabon"},{"$f":"IF(COUNTRY_INFO!B34=0,\" \",COUNTRY_INFO!B34)","v":"Centre-Sud"},{"$f":"IF(COUNTRY_INFO!C34=0,\" \",COUNTRY_INFO!C34)","v":"Ogoulou"},{"$f":"IF(OR(COUNTRY_INFO!$U$9:$U$1000=\"T1 (PZQ+ALB/MBD)\",COUNTRY_INFO!$V$9:$V$1000=\"T1 (PZQ+ALB/MBD)\"), \"T1 (PZQ+ALB/MBD)\", \" \")","v":"T1 (PZQ+ALB/MBD)"},"PZQ+MBD","072018",null,2506,2506,null,2506,null,1759,null,1759," ",70.191540303272149," ",70.191540303272149]
[{"$f":"IF(COUNTRY_INFO!A35=0,\" \",COUNTRY_INFO!A35)","v":"Gabon"},{"$f":"IF(COUNTRY_INFO!B35=0,\" \",COUNTRY_INFO!B35)","v":"Centre-Sud"},{"$f":"IF(COUNTRY_INFO!C35=0,\" \",COUNTRY_INFO!C35)","v":"Douya-Onoye"},{"$f":"IF(OR(COUNTRY_INFO!$U$9:$U$1000=\"T1 (PZQ+ALB/MBD)\",COUNTRY_INFO!$V$9:$V$1000=\"T1 (PZQ+ALB/MBD)\"), \"T1 (PZQ+ALB/MBD)\", \" \")","v":"T1 (PZQ+ALB/MBD)"},"PZQ+MBD","072018",null,9032,9032,null,9032,null,4826,null,4826," ",53.432240921169175," ",53.432240921169175]
[{"$f":"IF(COUNTRY_INFO!A36=0,\" \",COUNTRY_INFO!A36)","v":"Gabon"},{"$f":"IF(COUNTRY_INFO!B36=0,\" \",COUNTRY_INFO!B36)","v":"Centre-Sud"},{"$f":"IF(COUNTRY_INFO!C36=0,\" \",COUNTRY_INFO!C36)","v":"Dola"},{"$f":"IF(OR(COUNTRY_INFO!$U$9:$U$1000=\"T1 (PZQ+ALB/MBD)\",COUNTRY_INFO!$V$9:$V$1000=\"T1 (PZQ+ALB/MBD)\"), \"T1 (PZQ+ALB/MBD)\", \" \")","v":"T1 (PZQ+ALB/MBD)"},"PZQ+MBD","072018",null,2274,2274,null,2274,null,1476,null,1476," ",64.907651715039577," ",64.907651715039577]
[{"$f":"IF(COUNTRY_INFO!A37=0,\" \",COUNTRY_INFO!A37)","v":"Gabon"},{"$f":"IF(COUNTRY_INFO!B37=0,\" \",COUNTRY_INFO!B37)","v":"Centre-Sud"},{"$f":"IF(COUNTRY_INFO!C37=0,\" \",COUNTRY_INFO!C37)","v":"Mougalaba"},{"$f":"IF(OR(COUNTRY_INFO!$U$9:$U$1000=\"T1 (PZQ+ALB/MBD)\",COUNTRY_INFO!$V$9:$V$1000=\"T1 (PZQ+ALB/MBD)\"), \"T1 (PZQ+ALB/MBD)\", \" \")","v":"T1 (PZQ+ALB/MBD)"},"PZQ+MBD","072018",null,361,361,null,361,null,296,null,296," ",81.99445983379502," ",81.99445983379502]
[{"$f":"IF(COUNTRY_INFO!A38=0,\" \",COUNTRY_INFO!A38)","v":"Gabon"},{"$f":"IF(COUNTRY_INFO!B38=0,\" \",COUNTRY_INFO!B38)","v":"Sud"},{"$f":"IF(COUNTRY_INFO!C38=0,\" \",COUNTRY_INFO!C38)","v":"Doutsila"},{"$f":"IF(OR(COUNTRY_INFO!$U$9:$U$1000=\"T1 (PZQ+ALB/MBD)\",COUNTRY_INFO!$V$9:$V$1000=\"T1 (PZQ+ALB/MBD)\"), \"T1 (PZQ+ALB/MBD)\", \" \")","v":"T1 (PZQ+ALB/MBD)"},"PZQ+MBD","072018",null,1098,1098,null,1098,null,283,null,283," ",25.774134790528237," ",25.774134790528237]
[{"$f":"IF(COUNTRY_INFO!A39=0,\" \",COUNTRY_INFO!A39)","v":"Gabon"},{"$f":"IF(COUNTRY_INFO!B39=0,\" \",COUNTRY_INFO!B39)","v":"Sud"},{"$f":"IF(COUNTRY_INFO!C39=0,\" \",COUNTRY_INFO!C39)","v":"Basse-Banio"},{"$f":"IF(OR(COUNTRY_INFO!$U$9:$U$1000=\"T1 (PZQ+ALB/MBD)\",COUNTRY_INFO!$V$9:$V$1000=\"T1 (PZQ+ALB/MBD)\"), \"T1 (PZQ+ALB/MBD)\", \" \")","v":"T1 (PZQ+ALB/MBD)"},"PZQ+MBD","072018",null,1836,1836,null,1836,null,772,null,772," ",42.047930283224403," ",42.047930283224403]
[{"$f":"IF(COUNTRY_INFO!A40=0,\" \",COUNTRY_INFO!A40)","v":"Gabon"},{"$f":"IF(COUNTRY_INFO!B40=0,\" \",COUNTRY_INFO!B40)","v":"Sud"},{"$f":"IF(COUNTRY_INFO!C40=0,\" \",COUNTRY_INFO!C40)","v":"Douigny"},{"$f":"IF(OR(COUNTRY_INFO!$U$9:$U$1000=\"T1 (PZQ+ALB/MBD)\",COUNTRY_INFO!$V$9:$V$1000=\"T1 (PZQ+ALB/MBD)\"), \"T1 (PZQ+ALB/MBD)\", \" \")","v":" "},null,null,null,null,null,null,0,null,null,null,0," "," "," "," "]
[{"$f":"IF(COUNTRY_INFO!A41=0,\" \",COUNTRY_INFO!A41)","v":"Gabon"},{"$f":"IF(COUNTRY_INFO!B41=0,\" \",COUNTRY_INFO!B41)","v":"Sud"},{"$f":"IF(COUNTRY_INFO!C41=0,\" \",COUNTRY_INFO!C41)","v":"Mongo"},{"$f":"IF(OR(COUNTRY_INFO!$U$9:$U$1000=\"T1 (PZQ+ALB/MBD)\",COUNTRY_INFO!$V$9:$V$1000=\"T1 (PZQ+ALB/MBD)\"), \"T1 (PZQ+ALB/MBD)\", \" \")","v":"T1 (PZQ+ALB/MBD)"},"PZQ+MBD","072018",null,936,936,null,936,null,440,null,440," ",47.008547008547005," ",47.008547008547005]
[{"$f":"IF(COUNTRY_INFO!A42=0,\" \",COUNTRY_INFO!A42)","v":"Gabon"},{"$f":"IF(COUNTRY_INFO!B42=0,\" \",COUNTRY_INFO!B42)","v":"Sud"},{"$f":"IF(COUNTRY_INFO!C42=0,\" \",COUNTRY_INFO!C42)","v":"Haute-Banio"},{"$f":"IF(OR(COUNTRY_INFO!$U$9:$U$1000=\"T1 (PZQ+ALB/MBD)\",COUNTRY_INFO!$V$9:$V$1000=\"T1 (PZQ+ALB/MBD)\"), \"T1 (PZQ+ALB/MBD)\", \" \")","v":" "},null,null,null,null,null,null,0,null,null,null,0," "," "," "," "]
[{"$f":"IF(COUNTRY_INFO!A43=0,\" \",COUNTRY_INFO!A43)","v":"Gabon"},{"$f":"IF(COUNTRY_INFO!B43=0,\" \",COUNTRY_INFO!B43)","v":"Sud"},{"$f":"IF(COUNTRY_INFO!C43=0,\" \",COUNTRY_INFO!C43)","v":"Mougoutsi"},{"$f":"IF(OR(COUNTRY_INFO!$U$9:$U$1000=\"T1 (PZQ+ALB/MBD)\",COUNTRY_INFO!$V$9:$V$1000=\"T1 (PZQ+ALB/MBD)\"), \"T1 (PZQ+ALB/MBD)\", \" \")","v":"T1 (PZQ+ALB/MBD)"},"PZQ+MBD","072018",null,7933,7933,null,7933,null,3365,null,3365," ",42.417748644901046," ",42.417748644901046]
[{"$f":"IF(COUNTRY_INFO!A44=0,\" \",COUNTRY_INFO!A44)","v":"Gabon"},{"$f":"IF(COUNTRY_INFO!B44=0,\" \",COUNTRY_INFO!B44)","v":"Est"},{"$f":"IF(COUNTRY_INFO!C44=0,\" \",COUNTRY_INFO!C44)","v":"Lopé"},{"$f":"IF(OR(COUNTRY_INFO!$U$9:$U$1000=\"T1 (PZQ+ALB/MBD)\",COUNTRY_INFO!$V$9:$V$1000=\"T1 (PZQ+ALB/MBD)\"), \"T1 (PZQ+ALB/MBD)\", \" \")","v":"T1 (PZQ+ALB/MBD)"},"PZQ+MBD","072018",null,3960,3960,null,3960,null,1231,null,1231," ",31.085858585858585," ",31.085858585858585]
[{"$f":"IF(COUNTRY_INFO!A45=0,\" \",COUNTRY_INFO!A45)","v":"Gabon"},{"$f":"IF(COUNTRY_INFO!B45=0,\" \",COUNTRY_INFO!B45)","v":"Est"},{"$f":"IF(COUNTRY_INFO!C45=0,\" \",COUNTRY_INFO!C45)","v":"Ivindo"},{"$f":"IF(OR(COUNTRY_INFO!$U$9:$U$1000=\"T1 (PZQ+ALB/MBD)\",COUNTRY_INFO!$V$9:$V$1000=\"T1 (PZQ+ALB/MBD)\"), \"T1 (PZQ+ALB/MBD)\", \" \")","v":"T1 (PZQ+ALB/MBD)"},"PZQ+MBD","072018",null,8720,8720,null,8720,null,3986,null,3986," ",45.711009174311926," ",45.711009174311926]
[{"$f":"IF(COUNTRY_INFO!A46=0,\" \",COUNTRY_INFO!A46)","v":"Gabon"},{"$f":"IF(COUNTRY_INFO!B46=0,\" \",COUNTRY_INFO!B46)","v":"Est"},{"$f":"IF(COUNTRY_INFO!C46=0,\" \",COUNTRY_INFO!C46)","v":"Zadié"},{"$f":"IF(OR(COUNTRY_INFO!$U$9:$U$1000=\"T1 (PZQ+ALB/MBD)\",COUNTRY_INFO!$V$9:$V$1000=\"T1 (PZQ+ALB/MBD)\"), \"T1 (PZQ+ALB/MBD)\", \" \")","v":" "},null,null,null,null,null,null,0,null,null,null,0," "," "," "," "]
[{"$f":"IF(COUNTRY_INFO!A47=0,\" \",COUNTRY_INFO!A47)","v":"Gabon"},{"$f":"IF(COUNTRY_INFO!B47=0,\" \",COUNTRY_INFO!B47)","v":"Est"},{"$f":"IF(COUNTRY_INFO!C47=0,\" \",COUNTRY_INFO!C47)","v":"Mvoung"},{"$f":"IF(OR(COUNTRY_INFO!$U$9:$U$1000=\"T1 (PZQ+ALB/MBD)\",COUNTRY_INFO!$V$9:$V$1000=\"T1 (PZQ+ALB/MBD)\"), \"T1 (PZQ+ALB/MBD)\", \" \")","v":"T1 (PZQ+ALB/MBD)"},"PZQ+MBD","072018",null,1402,1402,null,1402,null,678,null,678," ",48.359486447931523," ",48.359486447931523]
[{"$f":"IF(COUNTRY_INFO!A48=0,\" \",COUNTRY_INFO!A48)","v":"Gabon"},{"$f":"IF(COUNTRY_INFO!B48=0,\" \",COUNTRY_INFO!B48)","v":"Centre-Est"},{"$f":"IF(COUNTRY_INFO!C48=0,\" \",COUNTRY_INFO!C48)","v":"Offoué-Onoye"},{"$f":"IF(OR(COUNTRY_INFO!$U$9:$U$1000=\"T1 (PZQ+ALB/MBD)\",COUNTRY_INFO!$V$9:$V$1000=\"T1 (PZQ+ALB/MBD)\"), \"T1 (PZQ+ALB/MBD)\", \" \")","v":"T1 (PZQ+ALB/MBD)"},"PZQ+MBD","072018",null,987,987,null,987,null,490,null,490," ",49.645390070921984," ",49.645390070921984]
[{"$f":"IF(COUNTRY_INFO!A49=0,\" \",COUNTRY_INFO!A49)","v":"Gabon"},{"$f":"IF(COUNTRY_INFO!B49=0,\" \",COUNTRY_INFO!B49)","v":"Centre-Est"},{"$f":"IF(COUNTRY_INFO!C49=0,\" \",COUNTRY_INFO!C49)","v":"Lolo-Bouenguidi"},{"$f":"IF(OR(COUNTRY_INFO!$U$9:$U$1000=\"T1 (PZQ+ALB/MBD)\",COUNTRY_INFO!$V$9:$V$1000=\"T1 (PZQ+ALB/MBD)\"), \"T1 (PZQ+ALB/MBD)\", \" \")","v":"T1 (PZQ+ALB/MBD)"},"PZQ+MBD","072018",null,8246,8246,null,8246,null,3203,null,3203," ",38.843075430511767," ",38.843075430511767]
[{"$f":"IF(COUNTRY_INFO!A50=0,\" \",COUNTRY_INFO!A50)","v":"Gabon"},{"$f":"IF(COUNTRY_INFO!B50=0,\" \",COUNTRY_INFO!B50)","v":"Centre-Est"},{"$f":"IF(COUNTRY_INFO!C50=0,\" \",COUNTRY_INFO!C50)","v":"Mulundu"},{"$f":"IF(OR(COUNTRY_INFO!$U$9:$U$1000=\"T1 (PZQ+ALB/MBD)\",COUNTRY_INFO!$V$9:$V$1000=\"T1 (PZQ+ALB/MBD)\"), \"T1 (PZQ+ALB/MBD)\", \" \")","v":"T1 (PZQ+ALB/MBD)"},"PZQ+MBD","072018",null,8324,8324,null,8324,null,3541,null,3541," ",42.539644401729937," ",42.539644401729937]
[{"$f":"IF(COUNTRY_INFO!A51=0,\" \",COUNTRY_INFO!A51)","v":"Gabon"},{"$f":"IF(COUNTRY_INFO!B51=0,\" \",COUNTRY_INFO!B51)","v":"Centre-Est"},{"$f":"IF(COUNTRY_INFO!C51=0,\" \",COUNTRY_INFO!C51)","v":"Lombo-Bouenguidi"},{"$f":"IF(OR(COUNTRY_INFO!$U$9:$U$1000=\"T1 (PZQ+ALB/MBD)\",COUNTRY_INFO!$V$9:$V$1000=\"T1 (PZQ+ALB/MBD)\"), \"T1 (PZQ+ALB/MBD)\", \" \")","v":"T1 (PZQ+ALB/MBD)"},"PZQ+MBD","072018",null,1375,1375,null,1375,null,772,null,772," ",56.145454545454541," ",56.145454545454541]
[{"$f":"IF(COUNTRY_INFO!A52=0,\" \",COUNTRY_INFO!A52)","v":"Gabon"},{"$f":"IF(COUNTRY_INFO!B52=0,\" \",COUNTRY_INFO!B52)","v":"Maritime"},{"$f":"IF(COUNTRY_INFO!C52=0,\" \",COUNTRY_INFO!C52)","v":"Ndougou"},{"$f":"IF(OR(COUNTRY_INFO!$U$9:$U$1000=\"T1 (PZQ+ALB/MBD)\",COUNTRY_INFO!$V$9:$V$1000=\"T1 (PZQ+ALB/MBD)\"), \"T1 (PZQ+ALB/MBD)\", \" \")","v":"T1 (PZQ+ALB/MBD)"},"PZQ+MBD","072018",null,2941,2941,null,2941,null,993,null,993," ",33.764025841550492," ",33.764025841550492]
[{"$f":"IF(COUNTRY_INFO!A53=0,\" \",COUNTRY_INFO!A53)","v":"Gabon"},{"$f":"IF(COUNTRY_INFO!B53=0,\" \",COUNTRY_INFO!B53)","v":"Maritime"},{"$f":"IF(COUNTRY_INFO!C53=0,\" \",COUNTRY_INFO!C53)","v":"Etimboué"},{"$f":"IF(OR(COUNTRY_INFO!$U$9:$U$1000=\"T1 (PZQ+ALB/MBD)\",COUNTRY_INFO!$V$9:$V$1000=\"T1 (PZQ+ALB/MBD)\"), \"T1 (PZQ+ALB/MBD)\", \" \")","v":"T1 (PZQ+ALB/MBD)"},"PZQ+MBD","072018",null,1313,1313,null,1313,null,794,null,794," ",60.472201066260467," ",60.472201066260467]
[{"$f":"IF(COUNTRY_INFO!A54=0,\" \",COUNTRY_INFO!A54)","v":"Gabon"},{"$f":"IF(COUNTRY_INFO!B54=0,\" \",COUNTRY_INFO!B54)","v":"Maritime"},{"$f":"IF(COUNTRY_INFO!C54=0,\" \",COUNTRY_INFO!C54)","v":"Bendjé"},{"$f":"IF(OR(COUNTRY_INFO!$U$9:$U$1000=\"T1 (PZQ+ALB/MBD)\",COUNTRY_INFO!$V$9:$V$1000=\"T1 (PZQ+ALB/MBD)\"), \"T1 (PZQ+ALB/MBD)\", \" \")","v":" "},null,null,null,null,null,null,0,null,null,null,0," "," "," "," "]
[{"$f":"IF(COUNTRY_INFO!A55=0,\" \",COUNTRY_INFO!A55)","v":"Gabon"},{"$f":"IF(COUNTRY_INFO!B55=0,\" \",COUNTRY_INFO!B55)","v":"Nord"},{"$f":"IF(COUNTRY_INFO!C55=0,\" \",COUNTRY_INFO!C55)","v":"Ntem"},{"$f":"IF(OR(COUNTRY_INFO!$U$9:$U$1000=\"T1 (PZQ+ALB/MBD)\",COUNTRY_INFO!$V$9:$V$1000=\"T1 (PZQ+ALB/MBD)\"), \"T1 (PZQ+ALB/MBD)\", \" \")","v":"T1 (PZQ+ALB/MBD)"},"PZQ+MBD","072018",null,13355,13355,null,13355,null,3575,null,3575," ",26.769000374391617," ",26.769000374391617]
[{"$f":"IF(COUNTRY_INFO!A56=0,\" \",COUNTRY_INFO!A56)","v":"Gabon"},{"$f":"IF(COUNTRY_INFO!B56=0,\" \",COUNTRY_INFO!B56)","v":"Nord"},{"$f":"IF(COUNTRY_INFO!C56=0,\" \",COUNTRY_INFO!C56)","v":"Haut - Komo"},{"$f":"IF(OR(COUNTRY_INFO!$U$9:$U$1000=\"T1 (PZQ+ALB/MBD)\",COUNTRY_INFO!$V$9:$V$1000=\"T1 (PZQ+ALB/MBD)\"), \"T1 (PZQ+ALB/MBD)\", \" \")","v":"T1 (PZQ+ALB/MBD)"},"PZQ+MBD","072018",null,1316,1316,null,1316,null,517,null,517," ",39.285714285714285," ",39.285714285714285]
[{"$f":"IF(COUNTRY_INFO!A57=0,\" \",COUNTRY_INFO!A57)","v":"Gabon"},{"$f":"IF(COUNTRY_INFO!B57=0,\" \",COUNTRY_INFO!B57)","v":"Nord"},{"$f":"IF(COUNTRY_INFO!C57=0,\" \",COUNTRY_INFO!C57)","v":"Haut-Ntem"},{"$f":"IF(OR(COUNTRY_INFO!$U$9:$U$1000=\"T1 (PZQ+ALB/MBD)\",COUNTRY_INFO!$V$9:$V$1000=\"T1 (PZQ+ALB/MBD)\"), \"T1 (PZQ+ALB/MBD)\", \" \")","v":"T1 (PZQ+ALB/MBD)"},"PZQ+MBD","072018",null,4360,4360,null,4360,null,1527,null,1527," ",35.022935779816514," ",35.022935779816514]
[{"$f":"IF(COUNTRY_INFO!A58=0,\" \",COUNTRY_INFO!A58)","v":"Gabon"},{"$f":"IF(COUNTRY_INFO!B58=0,\" \",COUNTRY_INFO!B58)","v":"Nord"},{"$f":"IF(COUNTRY_INFO!C58=0,\" \",COUNTRY_INFO!C58)","v":"Okano"},{"$f":"IF(OR(COUNTRY_INFO!$U$9:$U$1000=\"T1 (PZQ+ALB/MBD)\",COUNTRY_INFO!$V$9:$V$1000=\"T1 (PZQ+ALB/MBD)\"), \"T1 (PZQ+ALB/MBD)\", \" \")","v":"T1 (PZQ+ALB/MBD)"},"PZQ+MBD","072018",null,4789,4789,null,4789,null,2052,null,2052," ",42.848193777406557," ",42.848193777406557]
[{"$f":"IF(COUNTRY_INFO!A59=0,\" \",COUNTRY_INFO!A59)","v":"Gabon"},{"$f":"IF(COUNTRY_INFO!B59=0,\" \",COUNTRY_INFO!B59)","v":"Nord"},{"$f":"IF(COUNTRY_INFO!C59=0,\" \",COUNTRY_INFO!C59)","v":"Woleu"},{"$f":"IF(OR(COUNTRY_INFO!$U$9:$U$1000=\"T1 (PZQ+ALB/MBD)\",COUNTRY_INFO!$V$9:$V$1000=\"T1 (PZQ+ALB/MBD)\"), \"T1 (PZQ+ALB/MBD)\", \" \")","v":"T1 (PZQ+ALB/MBD)"},"PZQ+MBD","072018",null,21583,21583,null,21583,null,6379,null,6379," ",29.555668813417967," ",29.555668813417967]

{"sheet":"T2","index":6,"n_rows":59,"n_cols":17,"rows_kept":59,"cut":false,"hidden":false,"merged":[[5,5,5,8],[5,9,5,12],[5,13,5,16],[3,0,3,2],[5,0,5,2],[5,3,6,3],[5,4,6,4]]}
["T 2 - Praziquantel (PZQ) "]
["Structure administrative, population nécessitant une chimioprévention par groupe d'âge, population traitée par groupe d'âge et couverture"]
[]
["TOTAL",null,null,null,null,{"$f":"SUM(F$9:F$1000)","v":0},143445,0,143445,0,71553,0,71553,{"$f":"IF(F4<>0, IF(J4/F4*100=0, \"-\", J4/F4*100), \" \")","v":" "},{"$f":"IF(G4<>0, IF(K4/G4*100=0, \"-\", K4/G4*100), \" \")","v":49.881836243856533},{"$f":"IF(H4<>0, IF(L4/H4*100=0, \"-\", L4/H4*100), \" \")","v":" "},{"$f":"IF(I4<>0, IF(M4/I4*100=0, \"-\", M4/I4*100), \" \")","v":49.881836243856533}]
[]
["Structure administrative du pays",null,null,"Mise en oeuvre \nde la CP","Date","Population ciblée pour T2",null,null,null,"Population traitée",null,null,null,"Couverture du Programme (%)"]
["Pays","Région/Département","District",null,null,"EAPréS","EAS","Adultes","Total","EAPréS","EAS","Adultes","Total","EAPréS","EAS","Adultes","Total"]
[]
[{"$f":"IF(COUNTRY_INFO!A9=0,\" \",COUNTRY_INFO!A9)","v":"Gabon"},{"$f":"IF(COUNTRY_INFO!B9=0,\" \",COUNTRY_INFO!B9)","v":"Libreville-Owendo"},{"$f":"IF(COUNTRY_INFO!C9=0,\" \",COUNTRY_INFO!C9)","v":"Libreville 1"},{"$f":"IF(OR(COUNTRY_INFO!$U$9:$U$1000=\"T2 (PZQ)\",COUNTRY_INFO!$V$9:$V$1000=\"T2 (PZQ)\"), \"T2 (PZQ)\", \" \")","v":" "},null,null,null,null,{"$f":"SUM(F9:H9)","v":0},null,null,null,{"$f":"SUM(J9:L9)","v":0},{"$f":"IF(F9<>0, IF(J9/F9*100=0, \"-\", J9/F9*100), \" \")","v":" "}," "," "," "]
[{"$f":"IF(COUNTRY_INFO!A10=0,\" \",COUNTRY_INFO!A10)","v":"Gabon"},{"$f":"IF(COUNTRY_INFO!B10=0,\" \",COUNTRY_INFO!B10)","v":"Libreville-Owendo"},{"$f":"IF(COUNTRY_INFO!C10=0,\" \",COUNTRY_INFO!C10)","v":"Libreville 2"},{"$f":"IF(OR(COUNTRY_INFO!$U$9:$U$1000=\"T2 (PZQ)\",COUNTRY_INFO!$V$9:$V$1000=\"T2 (PZQ)\"), \"T2 (PZQ)\", \" \")","v":"T2 (PZQ)"},"072018",null,73649,null,{"$f":"SUM(F10:H10)","v":73649},null,16778,null,{"$f":"SUM(J10:L10)","v":16778},{"$f":"IF(F10<>0, IF(J10/F10*100=0, \"-\", J10/F10*100), \" \")","v":" "},{"$f":"IF(G10<>0, IF(K10/G10*100=0, \"-\", K10/G10*100), \" \")","v":22.781028934540863},{"$f":"IF(H10<>0, IF(L10/H10*100=0, \"-\", L10/H10*100), \" \")","v":" "},{"$f":"IF(I10<>0, IF(M10/I10*100=0, \"-\", M10/I10*100), \" \")","v":22.781028934540863}]
[{"$f":"IF(COUNTRY_INFO!A11=0,\" \",COUNTRY_INFO!A11)","v":"Gabon"},{"$f":"IF(COUNTRY_INFO!B11=0,\" \",COUNTRY_INFO!B11)","v":"Libreville-Owendo"},{"$f":"IF(COUNTRY_INFO!C11=0,\" \",COUNTRY_INFO!C11)","v":"Libreville 3"},{"$f":"IF(OR(COUNTRY_INFO!$U$9:$U$1000=\"T2 (PZQ)\",COUNTRY_INFO!$V$9:$V$1000=\"T2 (PZQ)\"), \"T2 (PZQ)\", \" \")","v":"T2 (PZQ)"},"072018",null,23508,null,23508,null,10309,null,10309," ",43.853156372298791," ",43.853156372298791]
[{"$f":"IF(COUNTRY_INFO!A12=0,\" \",COUNTRY_INFO!A12)","v":"Gabon"},{"$f":"IF(COUNTRY_INFO!B12=0,\" \",COUNTRY_INFO!B12)","v":"Libreville-Owendo"},{"$f":"IF(COUNTRY_INFO!C12=0,\" \",COUNTRY_INFO!C12)","v":"Owendo"},{"$f":"IF(OR(COUNTRY_INFO!$U$9:$U$1000=\"T2 (PZQ)\",COUNTRY_INFO!$V$9:$V$1000=\"T2 (PZQ)\"), \"T2 (PZQ)\", \" \")","v":"T2 (PZQ)"},"072018",null,8944,null,8944,null,7122,null,7122," ",79.628801431127016," ",79.628801431127016]
[{"$f":"IF(COUNTRY_INFO!A13=0,\" \",COUNTRY_INFO!A13)","v":"Gabon"},{"$f":"IF(COUNTRY_INFO!B13=0,\" \",COUNTRY_INFO!B13)","v":"Ouest"},{"$f":"IF(COUNTRY_INFO!C13=0,\" \",COUNTRY_INFO!C13)","v":"Komo-Mondah"},{"$f":"IF(OR(COUNTRY_INFO!$U$9:$U$1000=\"T2 (PZQ)\",COUNTRY_INFO!$V$9:$V$1000=\"T2 (PZQ)\"), \"T2 (PZQ)\", \" \")","v":" "},null,null,null,null,0,null,null,null,0," "," "," "," "]
[{"$f":"IF(COUNTRY_INFO!A14=0,\" \",COUNTRY_INFO!A14)","v":"Gabon"},{"$f":"IF(COUNTRY_INFO!B14=0,\" \",COUNTRY_INFO!B14)","v":"Ouest"},{"$f":"IF(COUNTRY_INFO!C14=0,\" \",COUNTRY_INFO!C14)","v":"Komo-Kango"},{"$f":"IF(OR(COUNTRY_INFO!$U$9:$U$1000=\"T2 (PZQ)\",COUNTRY_INFO!$V$9:$V$1000=\"T2 (PZQ)\"), \"T2 (PZQ)\", \" \")","v":" "},null,null,null,null,0,null,null,null,0," "," "," "," "]
[{"$f":"IF(COUNTRY_INFO!A15=0,\" \",COUNTRY_INFO!A15)","v":"Gabon"},{"$f":"IF(COUNTRY_INFO!B15=0,\" \",COUNTRY_INFO!B15)","v":"Ouest"},{"$f":"IF(COUNTRY_INFO!C15=0,\" \",COUNTRY_INFO!C15)","v":"Noya"},{"$f":"IF(OR(COUNTRY_INFO!$U$9:$U$1000=\"T2 (PZQ)\",COUNTRY_INFO!$V$9:$V$1000=\"T2 (PZQ)\"), \"T2 (PZQ)\", \" \")","v":" "},null,null,null,null,0,null,null,null,0," "," "," "," "]
[{"$f":"IF(COUNTRY_INFO!A16=0,\" \",COUNTRY_INFO!A16)","v":"Gabon"},{"$f":"IF(COUNTRY_INFO!B16=0,\" \",COUNTRY_INFO!B16)","v":"Sud-Est"},{"$f":"IF(COUNTRY_INFO!C16=0,\" \",COUNTRY_INFO!C16)","v":"Bayi-brikolo"},{"$f":"IF(OR(COUNTRY_INFO!$U$9:$U$1000=\"T2 (PZQ)\",COUNTRY_INFO!$V$9:$V$1000=\"T2 (PZQ)\"), \"T2 (PZQ)\", \" \")","v":" "},null,null,null,null,0,null,null,null,0," "," "," "," "]
[{"$f":"IF(COUNTRY_INFO!A17=0,\" \",COUNTRY_INFO!A17)","v":"Gabon"},{"$f":"IF(COUNTRY_INFO!B17=0,\" \",COUNTRY_INFO!B17)","v":"Sud-Est"},{"$f":"IF(COUNTRY_INFO!C17=0,\" \",COUNTRY_INFO!C17)","v":"Lékoni-Lékori"},{"$f":"IF(OR(COUNTRY_INFO!$U$9:$U$1000=\"T2 (PZQ)\",COUNTRY_INFO!$V$9:$V$1000=\"T2 (PZQ)\"), \"T2 (PZQ)\", \" \")","v":" "},null,null,null,null,0,null,null,null,0," "," "," "," "]
[{"$f":"IF(COUNTRY_INFO!A18=0,\" \",COUNTRY_INFO!A18)","v":"Gabon"},{"$f":"IF(COUNTRY_INFO!B18=0,\" \",COUNTRY_INFO!B18)","v":"Sud-Est"},{"$f":"IF(COUNTRY_INFO!C18=0,\" \",COUNTRY_INFO!C18)","v":"Lékoko"},{"$f":"IF(OR(COUNTRY_INFO!$U$9:$U$1000=\"T2 (PZQ)\",COUNTRY_INFO!$V$9:$V$1000=\"T2 (PZQ)\"), \"T2 (PZQ)\", \" \")","v":" "},null,null,null,null,0,null,null,null,0," "," "," "," "]
[{"$f":"IF(COUNTRY_INFO!A19=0,\" \",COUNTRY_INFO!A19)","v":"Gabon"},{"$f":"IF(COUNTRY_INFO!B19=0,\" \",COUNTRY_INFO!B19)","v":"Sud-Est"},{"$f":"IF(COUNTRY_INFO!C19=0,\" \",COUNTRY_INFO!C19)","v":"Djouori-Agnili"},{"$f":"IF(OR(COUNTRY_INFO!$U$9:$U$1000=\"T2 (PZQ)\",COUNTRY_INFO!$V$9:$V$1000=\"T2 (PZQ)\"), \"T2 (PZQ)\", \" \")","v":" "},null,null,null,null,0,null,null,null,0," "," "," "," "]
[{"$f":"IF(COUNTRY_INFO!A20=0,\" \",COUNTRY_INFO!A20)","v":"Gabon"},{"$f":"IF(COUNTRY_INFO!B20=0,\" \",COUNTRY_INFO!B20)","v":"Sud-Est"},{"$f":"IF(COUNTRY_INFO!C20=0,\" \",COUNTRY_INFO!C20)","v":"Ogooué-Létili"},{"$f":"IF(OR(COUNTRY_INFO!$U$9:$U$1000=\"T2 (PZQ)\",COUNTRY_INFO!$V$9:$V$1000=\"T2 (PZQ)\"), \"T2 (PZQ)\", \" \")","v":" "},null,null,null,null,0,null,null,null,0," "," "," "," "]
[{"$f":"IF(COUNTRY_INFO!A21=0,\" \",COUNTRY_INFO!A21)","v":"Gabon"},{"$f":"IF(COUNTRY_INFO!B21=0,\" \",COUNTRY_INFO!B21)","v":"Sud-Est"},{"$f":"IF(COUNTRY_INFO!C21=0,\" \",COUNTRY_INFO!C21)","v":"Mpassa"},{"$f":"IF(OR(COUNTRY_INFO!$U$9:$U$1000=\"T2 (PZQ)\",COUNTRY_INFO!$V$9:$V$1000=\"T2 (PZQ)\"), \"T2 (PZQ)\", \" \")","v":" "},null,null,null,null,0,null,null,null,0," "," "," "," "]
[{"$f":"IF(COUNTRY_INFO!A22=0,\" \",COUNTRY_INFO!A22)","v":"Gabon"},{"$f":"IF(COUNTRY_INFO!B22=0,\" \",COUNTRY_INFO!B22)","v":"Sud-Est"},{"$f":"IF(COUNTRY_INFO!C22=0,\" \",COUNTRY_INFO!C22)","v":"Plateaux"},{"$f":"IF(OR(COUNTRY_INFO!$U$9:$U$1000=\"T2 (PZQ)\",COUNTRY_INFO!$V$9:$V$1000=\"T2 (PZQ)\"), \"T2 (PZQ)\", \" \")","v":" "},null,null,null,null,0,null,null,null,0," "," "," "," "]
[{"$f":"IF(COUNTRY_INFO!A23=0,\" \",COUNTRY_INFO!A23)","v":"Gabon"},{"$f":"IF(COUNTRY_INFO!B23=0,\" \",COUNTRY_INFO!B23)","v":"Sud-Est"},{"$f":"IF(COUNTRY_INFO!C23=0,\" \",COUNTRY_INFO!C23)","v":"Lébombi-Léyou"},{"$f":"IF(OR(COUNTRY_INFO!$U$9:$U$1000=\"T2 (PZQ)\",COUNTRY_INFO!$V$9:$V$1000=\"T2 (PZQ)\"), \"T2 (PZQ)\", \" \")","v":" "},null,null,null,null,0,null,null,null,0," "," "," "," "]
[{"$f":"IF(COUNTRY_INFO!A24=0,\" \",COUNTRY_INFO!A24)","v":"Gabon"},{"$f":"IF(COUNTRY_INFO!B24=0,\" \",COUNTRY_INFO!B24)","v":"Sud-Est"},{"$f":"IF(COUNTRY_INFO!C24=0,\" \",COUNTRY_INFO!C24)","v":"Lékabi-Léwolo"},{"$f":"IF(OR(COUNTRY_INFO!$U$9:$U$1000=\"T2 (PZQ)\",COUNTRY_INFO!$V$9:$V$1000=\"T2 (PZQ)\"), \"T2 (PZQ)\", \" \")","v":" "},null,null,null,null,0,null,null,null,0," "," "," "," "]
[{"$f":"IF(COUNTRY_INFO!A25=0,\" \",COUNTRY_INFO!A25)","v":"Gabon"},{"$f":"IF(COUNTRY_INFO!B25=0,\" \",COUNTRY_INFO!B25)","v":"Sud-Est"},{"$f":"IF(COUNTRY_INFO!C25=0,\" \",COUNTRY_INFO!C25)","v":"Sébé-Brikolo"},{"$f":"IF(OR(COUNTRY_INFO!$U$9:$U$1000=\"T2 (PZQ)\",COUNTRY_INFO!$V$9:$V$1000=\"T2 (PZQ)\"), \"T2 (PZQ)\", \" \")","v":" "},null,null,null,null,0,null,null,null,0," "," "," "," "]
[{"$f":"IF(COUNTRY_INFO!A26=0,\" \",COUNTRY_INFO!A26)","v":"Gabon"},{"$f":"IF(COUNTRY_INFO!B26=0,\" \",COUNTRY_INFO!B26)","v":"Sud-Est"},{"$f":"IF(COUNTRY_INFO!C26=0,\" \",COUNTRY_INFO!C26)","v":"Djoué"},{"$f":"IF(OR(COUNTRY_INFO!$U$9:$U$1000=\"T2 (PZQ)\",COUNTRY_INFO!$V$9:$V$1000=\"T2 (PZQ)\"), \"T2 (PZQ)\", \" \")","v":" "},null,null,null,null,0,null,null,null,0," "," "," "," "]
[{"$f":"IF(COUNTRY_INFO!A27=0,\" \",COUNTRY_INFO!A27)","v":"Gabon"},{"$f":"IF(COUNTRY_INFO!B27=0,\" \",COUNTRY_INFO!B27)","v":"Centre"},{"$f":"IF(COUNTRY_INFO!C27=0,\" \",COUNTRY_INFO!C27)","v":"Ogooué-et-Lacs"},{"$f":"IF(OR(COUNTRY_INFO!$U$9:$U$1000=\"T2 (PZQ)\",COUNTRY_INFO!$V$9:$V$1000=\"T2 (PZQ)\"), \"T2 (PZQ)\", \" \")","v":" "},null,null,null,null,0,null,null,null,0," "," "," "," "]
[{"$f":"IF(COUNTRY_INFO!A28=0,\" \",COUNTRY_INFO!A28)","v":"Gabon"},{"$f":"IF(COUNTRY_INFO!B28=0,\" \",COUNTRY_INFO!B28)","v":"Centre"},{"$f":"IF(COUNTRY_INFO!C28=0,\" \",COUNTRY_INFO!C28)","v":"Abanga-Bigné"},{"$f":"IF(OR(COUNTRY_INFO!$U$9:$U$1000=\"T2 (PZQ)\",COUNTRY_INFO!$V$9:$V$1000=\"T2 (PZQ)\"), \"T2 (PZQ)\", \" \")","v":" "},null,null,null,null,0,null,null,null,0," "," "," "," "]
[{"$f":"IF(COUNTRY_INFO!A29=0,\" \",COUNTRY_INFO!A29)","v":"Gabon"},{"$f":"IF(COUNTRY_INFO!B29=0,\" \",COUNTRY_INFO!B29)","v":"Centre-Sud"},{"$f":"IF(COUNTRY_INFO!C29=0,\" \",COUNTRY_INFO!C29)","v":"Tsamba-Magotsi"},{"$f":"IF(OR(COUNTRY_INFO!$U$9:$U$1000=\"T2 (PZQ)\",COUNTRY_INFO!$V$9:$V$1000=\"T2 (PZQ)\"), \"T2 (PZQ)\", \" \")","v":" "},null,null,null,null,0,null,null,null,0," "," "," "," "]
[{"$f":"IF(COUNTRY_INFO!A30=0,\" \",COUNTRY_INFO!A30)","v":"Gabon"},{"$f":"IF(COUNTRY_INFO!B30=0,\" \",COUNTRY_INFO!B30)","v":"Centre-Sud"},{"$f":"IF(COUNTRY_INFO!C30=0,\" \",COUNTRY_INFO!C30)","v":"Louetsi-Wano"},{"$f":"IF(OR(COUNTRY_INFO!$U$9:$U$1000=\"T2 (PZQ)\",COUNTRY_INFO!$V$9:$V$1000=\"T2 (PZQ)\"), \"T2 (PZQ)\", \" \")","v":" "},null,null,null,null,0,null,null,null,0," "," "," "," "]
[{"$f":"IF(COUNTRY_INFO!A31=0,\" \",COUNTRY_INFO!A31)","v":"Gabon"},{"$f":"IF(COUNTRY_INFO!B31=0,\" \",COUNTRY_INFO!B31)","v":"Centre-Sud"},{"$f":"IF(COUNTRY_INFO!C31=0,\" \",COUNTRY_INFO!C31)","v":"Louetsi-Bibaka"},{"$f":"IF(OR(COUNTRY_INFO!$U$9:$U$1000=\"T2 (PZQ)\",COUNTRY_INFO!$V$9:$V$1000=\"T2 (PZQ)\"), \"T2 (PZQ)\", \" \")","v":" "},null,null,null,null,0,null,null,null,0," "," "," "," "]
[{"$f":"IF(COUNTRY_INFO!A32=0,\" \",COUNTRY_INFO!A32)","v":"Gabon"},{"$f":"IF(COUNTRY_INFO!B32=0,\" \",COUNTRY_INFO!B32)","v":"Centre-Sud"},{"$f":"IF(COUNTRY_INFO!C32=0,\" \",COUNTRY_INFO!C32)","v":"Ndolou"},{"$f":"IF(OR(COUNTRY_INFO!$U$9:$U$1000=\"T2 (PZQ)\",COUNTRY_INFO!$V$9:$V$1000=\"T2 (PZQ)\"), \"T2 (PZQ)\", \" \")","v":" "},null,null,null,null,0,null,null,null,0," "," "," "," "]
[{"$f":"IF(COUNTRY_INFO!A33=0,\" \",COUNTRY_INFO!A33)","v":"Gabon"},{"$f":"IF(COUNTRY_INFO!B33=0,\" \",COUNTRY_INFO!B33)","v":"Centre-Sud"},{"$f":"IF(COUNTRY_INFO!C33=0,\" \",COUNTRY_INFO!C33)","v":"Boumi-Louetsi"},{"$f":"IF(OR(COUNTRY_INFO!$U$9:$U$1000=\"T2 (PZQ)\",COUNTRY_INFO!$V$9:$V$1000=\"T2 (PZQ)\"), \"T2 (PZQ)\", \" \")","v":" "},null,null,null,null,0,null,null,null,0," "," "," "," "]
[{"$f":"IF(COUNTRY_INFO!A34=0,\" \",COUNTRY_INFO!A34)","v":"Gabon"},{"$f":"IF(COUNTRY_INFO!B34=0,\" \",COUNTRY_INFO!B34)","v":"Centre-Sud"},{"$f":"IF(COUNTRY_INFO!C34=0,\" \",COUNTRY_INFO!C34)","v":"Ogoulou"},{"$f":"IF(OR(COUNTRY_INFO!$U$9:$U$1000=\"T2 (PZQ)\",COUNTRY_INFO!$V$9:$V$1000=\"T2 (PZQ)\"), \"T2 (PZQ)\", \" \")","v":" "},null,null,null,null,0,null,null,null,0," "," "," "," "]
[{"$f":"IF(COUNTRY_INFO!A35=0,\" \",COUNTRY_INFO!A35)","v":"Gabon"},{"$f":"IF(COUNTRY_INFO!B35=0,\" \",COUNTRY_INFO!B35)","v":"Centre-Sud"},{"$f":"IF(COUNTRY_INFO!C35=0,\" \",COUNTRY_INFO!C35)","v":"Douya-Onoye"},{"$f":"IF(OR(COUNTRY_INFO!$U$9:$U$1000=\"T2 (PZQ)\",COUNTRY_INFO!$V$9:$V$1000=\"T2 (PZQ)\"), \"T2 (PZQ)\", \" \")","v":" "},null,null,null,null,0,null,null,null,0," "," "," "," "]
[{"$f":"IF(COUNTRY_INFO!A36=0,\" \",COUNTRY_INFO!A36)","v":"Gabon"},{"$f":"IF(COUNTRY_INFO!B36=0,\" \",COUNTRY_INFO!B36)","v":"Centre-Sud"},{"$f":"IF(COUNTRY_INFO!C36=0,\" \",COUNTRY_INFO!C36)","v":"Dola"},{"$f":"IF(OR(COUNTRY_INFO!$U$9:$U$1000=\"T2 (PZQ)\",COUNTRY_INFO!$V$9:$V$1000=\"T2 (PZQ)\"), \"T2 (PZQ)\", \" \")","v":" "},null,null,null,null,0,null,null,null,0," "," "," "," "]
[{"$f":"IF(COUNTRY_INFO!A37=0,\" \",COUNTRY_INFO!A37)","v":"Gabon"},{"$f":"IF(COUNTRY_INFO!B37=0,\" \",COUNTRY_INFO!B37)","v":"Centre-Sud"},{"$f":"IF(COUNTRY_INFO!C37=0,\" \",COUNTRY_INFO!C37)","v":"Mougalaba"},{"$f":"IF(OR(COUNTRY_INFO!$U$9:$U$1000=\"T2 (PZQ)\",COUNTRY_INFO!$V$9:$V$1000=\"T2 (PZQ)\"), \"T2 (PZQ)\", \" \")","v":" "},null,null,null,null,0,null,null,null,0," "," "," "," "]
[{"$f":"IF(COUNTRY_INFO!A38=0,\" \",COUNTRY_INFO!A38)","v":"Gabon"},{"$f":"IF(COUNTRY_INFO!B38=0,\" \",COUNTRY_INFO!B38)","v":"Sud"},{"$f":"IF(COUNTRY_INFO!C38=0,\" \",COUNTRY_INFO!C38)","v":"Doutsila"},{"$f":"IF(OR(COUNTRY_INFO!$U$9:$U$1000=\"T2 (PZQ)\",COUNTRY_INFO!$V$9:$V$1000=\"T2 (PZQ)\"), \"T2 (PZQ)\", \" \")","v":" "},null,null,null,null,0,null,null,null,0," "," "," "," "]
[{"$f":"IF(COUNTRY_INFO!A39=0,\" \",COUNTRY_INFO!A39)","v":"Gabon"},{"$f":"IF(COUNTRY_INFO!B39=0,\" \",COUNTRY_INFO!B39)","v":"Sud"},{"$f":"IF(COUNTRY_INFO!C39=0,\" \",COUNTRY_INFO!C39)","v":"Basse-Banio"},{"$f":"IF(OR(COUNTRY_INFO!$U$9:$U$1000=\"T2 (PZQ)\",COUNTRY_INFO!$V$9:$V$1000=\"T2 (PZQ)\"), \"T2 (PZQ)\", \" \")","v":" "},null,null,null,null,0,null,null,null,0," "," "," "," "]
[{"$f":"IF(COUNTRY_INFO!A40=0,\" \",COUNTRY_INFO!A40)","v":"Gabon"},{"$f":"IF(COUNTRY_INFO!B40=0,\" \",COUNTRY_INFO!B40)","v":"Sud"},{"$f":"IF(COUNTRY_INFO!C40=0,\" \",COUNTRY_INFO!C40)","v":"Douigny"},{"$f":"IF(OR(COUNTRY_INFO!$U$9:$U$1000=\"T2 (PZQ)\",COUNTRY_INFO!$V$9:$V$1000=\"T2 (PZQ)\"), \"T2 (PZQ)\", \" \")","v":" "},null,null,null,null,0,null,null,null,0," "," "," "," "]
[{"$f":"IF(COUNTRY_INFO!A41=0,\" \",COUNTRY_INFO!A41)","v":"Gabon"},{"$f":"IF(COUNTRY_INFO!B41=0,\" \",COUNTRY_INFO!B41)","v":"Sud"},{"$f":"IF(COUNTRY_INFO!C41=0,\" \",COUNTRY_INFO!C41)","v":"Mongo"},{"$f":"IF(OR(COUNTRY_INFO!$U$9:$U$1000=\"T2 (PZQ)\",COUNTRY_INFO!$V$9:$V$1000=\"T2 (PZQ)\"), \"T2 (PZQ)\", \" \")","v":" "},null,null,null,null,0,null,null,null,0," "," "," "," "]
[{"$f":"IF(COUNTRY_INFO!A42=0,\" \",COUNTRY_INFO!A42)","v":"Gabon"},{"$f":"IF(COUNTRY_INFO!B42=0,\" \",COUNTRY_INFO!B42)","v":"Sud"},{"$f":"IF(COUNTRY_INFO!C42=0,\" \",COUNTRY_INFO!C42)","v":"Haute-Banio"},{"$f":"IF(OR(COUNTRY_INFO!$U$9:$U$1000=\"T2 (PZQ)\",COUNTRY_INFO!$V$9:$V$1000=\"T2 (PZQ)\"), \"T2 (PZQ)\", \" \")","v":" "},null,null,null,null,0,null,null,null,0," "," "," "," "]
[{"$f":"IF(COUNTRY_INFO!A43=0,\" \",COUNTRY_INFO!A43)","v":"Gabon"},{"$f":"IF(COUNTRY_INFO!B43=0,\" \",COUNTRY_INFO!B43)","v":"Sud"},{"$f":"IF(COUNTRY_INFO!C43=0,\" \",COUNTRY_INFO!C43)","v":"Mougoutsi"},{"$f":"IF(OR(COUNTRY_INFO!$U$9:$U$1000=\"T2 (PZQ)\",COUNTRY_INFO!$V$9:$V$1000=\"T2 (PZQ)\"), \"T2 (PZQ)\", \" \")","v":" "},null,null,null,null,0,null,null,null,0," "," "," "," "]
[{"$f":"IF(COUNTRY_INFO!A44=0,\" \",COUNTRY_INFO!A44)","v":"Gabon"},{"$f":"IF(COUNTRY_INFO!B44=0,\" \",COUNTRY_INFO!B44)","v":"Est"},{"$f":"IF(COUNTRY_INFO!C44=0,\" \",COUNTRY_INFO!C44)","v":"Lopé"},{"$f":"IF(OR(COUNTRY_INFO!$U$9:$U$1000=\"T2 (PZQ)\",COUNTRY_INFO!$V$9:$V$1000=\"T2 (PZQ)\"), \"T2 (PZQ)\", \" \")","v":" "},null,null,null,null,0,null,null,null,0," "," "," "," "]
[{"$f":"IF(COUNTRY_INFO!A45=0,\" \",COUNTRY_INFO!A45)","v":"Gabon"},{"$f":"IF(COUNTRY_INFO!B45=0,\" \",COUNTRY_INFO!B45)","v":"Est"},{"$f":"IF(COUNTRY_INFO!C45=0,\" \",COUNTRY_INFO!C45)","v":"Ivindo"},{"$f":"IF(OR(COUNTRY_INFO!$U$9:$U$1000=\"T2 (PZQ)\",COUNTRY_INFO!$V$9:$V$1000=\"T2 (PZQ)\"), \"T2 (PZQ)\", \" \")","v":" "},null,null,null,null,0,null,null,null,0," "," "," "," "]
[{"$f":"IF(COUNTRY_INFO!A46=0,\" \",COUNTRY_INFO!A46)","v":"Gabon"},{"$f":"IF(COUNTRY_INFO!B46=0,\" \",COUNTRY_INFO!B46)","v":"Est"},{"$f":"IF(COUNTRY_INFO!C46=0,\" \",COUNTRY_INFO!C46)","v":"Zadié"},{"$f":"IF(OR(COUNTRY_INFO!$U$9:$U$1000=\"T2 (PZQ)\",COUNTRY_INFO!$V$9:$V$1000=\"T2 (PZQ)\"), \"T2 (PZQ)\", \" \")","v":" "},null,null,null,null,0,null,null,null,0," "," "," "," "]
[{"$f":"IF(COUNTRY_INFO!A47=0,\" \",COUNTRY_INFO!A47)","v":"Gabon"},{"$f":"IF(COUNTRY_INFO!B47=0,\" \",COUNTRY_INFO!B47)","v":"Est"},{"$f":"IF(COUNTRY_INFO!C47=0,\" \",COUNTRY_INFO!C47)","v":"Mvoung"},{"$f":"IF(OR(COUNTRY_INFO!$U$9:$U$1000=\"T2 (PZQ)\",COUNTRY_INFO!$V$9:$V$1000=\"T2 (PZQ)\"), \"T2 (PZQ)\", \" \")","v":" "},null,null,null,null,0,null,null,null,0," "," "," "," "]
[{"$f":"IF(COUNTRY_INFO!A48=0,\" \",COUNTRY_INFO!A48)","v":"Gabon"},{"$f":"IF(COUNTRY_INFO!B48=0,\" \",COUNTRY_INFO!B48)","v":"Centre-Est"},{"$f":"IF(COUNTRY_INFO!C48=0,\" \",COUNTRY_INFO!C48)","v":"Offoué-Onoye"},{"$f":"IF(OR(COUNTRY_INFO!$U$9:$U$1000=\"T2 (PZQ)\",COUNTRY_INFO!$V$9:$V$1000=\"T2 (PZQ)\"), \"T2 (PZQ)\", \" \")","v":" "},null,null,null,null,0,null,null,null,0," "," "," "," "]
[{"$f":"IF(COUNTRY_INFO!A49=0,\" \",COUNTRY_INFO!A49)","v":"Gabon"},{"$f":"IF(COUNTRY_INFO!B49=0,\" \",COUNTRY_INFO!B49)","v":"Centre-Est"},{"$f":"IF(COUNTRY_INFO!C49=0,\" \",COUNTRY_INFO!C49)","v":"Lolo-Bouenguidi"},{"$f":"IF(OR(COUNTRY_INFO!$U$9:$U$1000=\"T2 (PZQ)\",COUNTRY_INFO!$V$9:$V$1000=\"T2 (PZQ)\"), \"T2 (PZQ)\", \" \")","v":" "},null,null,null,null,0,null,null,null,0," "," "," "," "]
[{"$f":"IF(COUNTRY_INFO!A50=0,\" \",COUNTRY_INFO!A50)","v":"Gabon"},{"$f":"IF(COUNTRY_INFO!B50=0,\" \",COUNTRY_INFO!B50)","v":"Centre-Est"},{"$f":"IF(COUNTRY_INFO!C50=0,\" \",COUNTRY_INFO!C50)","v":"Mulundu"},{"$f":"IF(OR(COUNTRY_INFO!$U$9:$U$1000=\"T2 (PZQ)\",COUNTRY_INFO!$V$9:$V$1000=\"T2 (PZQ)\"), \"T2 (PZQ)\", \" \")","v":" "},null,null,null,null,0,null,null,null,0," "," "," "," "]
[{"$f":"IF(COUNTRY_INFO!A51=0,\" \",COUNTRY_INFO!A51)","v":"Gabon"},{"$f":"IF(COUNTRY_INFO!B51=0,\" \",COUNTRY_INFO!B51)","v":"Centre-Est"},{"$f":"IF(COUNTRY_INFO!C51=0,\" \",COUNTRY_INFO!C51)","v":"Lombo-Bouenguidi"},{"$f":"IF(OR(COUNTRY_INFO!$U$9:$U$1000=\"T2 (PZQ)\",COUNTRY_INFO!$V$9:$V$1000=\"T2 (PZQ)\"), \"T2 (PZQ)\", \" \")","v":" "},null,null,null,null,0,null,null,null,0," "," "," "," "]
[{"$f":"IF(COUNTRY_INFO!A52=0,\" \",COUNTRY_INFO!A52)","v":"Gabon"},{"$f":"IF(COUNTRY_INFO!B52=0,\" \",COUNTRY_INFO!B52)","v":"Maritime"},{"$f":"IF(COUNTRY_INFO!C52=0,\" \",COUNTRY_INFO!C52)","v":"Ndougou"},{"$f":"IF(OR(COUNTRY_INFO!$U$9:$U$1000=\"T2 (PZQ)\",COUNTRY_INFO!$V$9:$V$1000=\"T2 (PZQ)\"), \"T2 (PZQ)\", \" \")","v":" "},null,null,null,null,0,null,null,null,0," "," "," "," "]
[{"$f":"IF(COUNTRY_INFO!A53=0,\" \",COUNTRY_INFO!A53)","v":"Gabon"},{"$f":"IF(COUNTRY_INFO!B53=0,\" \",COUNTRY_INFO!B53)","v":"Maritime"},{"$f":"IF(COUNTRY_INFO!C53=0,\" \",COUNTRY_INFO!C53)","v":"Etimboué"},{"$f":"IF(OR(COUNTRY_INFO!$U$9:$U$1000=\"T2 (PZQ)\",COUNTRY_INFO!$V$9:$V$1000=\"T2 (PZQ)\"), \"T2 (PZQ)\", \" \")","v":" "},null,null,null,null,0,null,null,null,0," "," "," "," "]
[{"$f":"IF(COUNTRY_INFO!A54=0,\" \",COUNTRY_INFO!A54)","v":"Gabon"},{"$f":"IF(COUNTRY_INFO!B54=0,\" \",COUNTRY_INFO!B54)","v":"Maritime"},{"$f":"IF(COUNTRY_INFO!C54=0,\" \",COUNTRY_INFO!C54)","v":"Bendjé"},{"$f":"IF(OR(COUNTRY_INFO!$U$9:$U$1000=\"T2 (PZQ)\",COUNTRY_INFO!$V$9:$V$1000=\"T2 (PZQ)\"), \"T2 (PZQ)\", \" \")","v":"T2 (PZQ)"},"072018",null,37344,null,37344,null,37344,null,37344," ",100," ",100]
[{"$f":"IF(COUNTRY_INFO!A55=0,\" \",COUNTRY_INFO!A55)","v":"Gabon"},{"$f":"IF(COUNTRY_INFO!B55=0,\" \",COUNTRY_INFO!B55)","v":"Nord"},{"$f":"IF(COUNTRY_INFO!C55=0,\" \",COUNTRY_INFO!C55)","v":"Ntem"},{"$f":"IF(OR(COUNTRY_INFO!$U$9:$U$1000=\"T2 (PZQ)\",COUNTRY_INFO!$V$9:$V$1000=\"T2 (PZQ)\"), \"T2 (PZQ)\", \" \")","v":" "},null,null,null,null,0,null,null,null,0," "," "," "," "]
[{"$f":"IF(COUNTRY_INFO!A56=0,\" \",COUNTRY_INFO!A56)","v":"Gabon"},{"$f":"IF(COUNTRY_INFO!B56=0,\" \",COUNTRY_INFO!B56)","v":"Nord"},{"$f":"IF(COUNTRY_INFO!C56=0,\" \",COUNTRY_INFO!C56)","v":"Haut - Komo"},{"$f":"IF(OR(COUNTRY_INFO!$U$9:$U$1000=\"T2 (PZQ)\",COUNTRY_INFO!$V$9:$V$1000=\"T2 (PZQ)\"), \"T2 (PZQ)\", \" \")","v":" "},null,null,null,null,0,null,null,null,0," "," "," "," "]
[{"$f":"IF(COUNTRY_INFO!A57=0,\" \",COUNTRY_INFO!A57)","v":"Gabon"},{"$f":"IF(COUNTRY_INFO!B57=0,\" \",COUNTRY_INFO!B57)","v":"Nord"},{"$f":"IF(COUNTRY_INFO!C57=0,\" \",COUNTRY_INFO!C57)","v":"Haut-Ntem"},{"$f":"IF(OR(COUNTRY_INFO!$U$9:$U$1000=\"T2 (PZQ)\",COUNTRY_INFO!$V$9:$V$1000=\"T2 (PZQ)\"), \"T2 (PZQ)\", \" \")","v":" "},null,null,null,null,0,null,null,null,0," "," "," "," "]
[{"$f":"IF(COUNTRY_INFO!A58=0,\" \",COUNTRY_INFO!A58)","v":"Gabon"},{"$f":"IF(COUNTRY_INFO!B58=0,\" \",COUNTRY_INFO!B58)","v":"Nord"},{"$f":"IF(COUNTRY_INFO!C58=0,\" \",COUNTRY_INFO!C58)","v":"Okano"},{"$f":"IF(OR(COUNTRY_INFO!$U$9:$U$1000=\"T2 (PZQ)\",COUNTRY_INFO!$V$9:$V$1000=\"T2 (PZQ)\"), \"T2 (PZQ)\", \" \")","v":" "},null,null,null,null,0,null,null,null,0," "," "," "," "]
[{"$f":"IF(COUNTRY_INFO!A59=0,\" \",COUNTRY_INFO!A59)","v":"Gabon"},{"$f":"IF(COUNTRY_INFO!B59=0,\" \",COUNTRY_INFO!B59)","v":"Nord"},{"$f":"IF(COUNTRY_INFO!C59=0,\" \",COUNTRY_INFO!C59)","v":"Woleu"},{"$f":"IF(OR(COUNTRY_INFO!$U$9:$U$1000=\"T2 (PZQ)\",COUNTRY_INFO!$V$9:$V$1000=\"T2 (PZQ)\"), \"T2 (PZQ)\", \" \")","v":" "},null,null,null,null,0,null,null,null,0," "," "," "," "]

{"sheet":"T3_R1","index":7,"n_rows":59,"n_cols":18,"rows_kept":59,"cut":false,"hidden":false,"merged":[[5,6,5,9],[5,10,5,13],[5,14,5,17],[3,0,3,2],[5,0,5,2],[5,3,6,3],[5,5,6,5],[5,4,6,4]]}
["T 3 - Albendazole (ALB) ou Mebendazole (MBD) - Tournée 1"]
["Structure administrative, population nécessitant une chimioprévention par groupe d'âge, population traitée par groupe d'âge et couverture"]
[]
["TOTAL",null,null,null,null,null,{"$f":"SUM(G$9:G$1000)","v":0},40217,0,40217,0,29226,0,29226,{"$f":"IF(G4<>0, IF(K4/G4*100=0, \"-\", K4/G4*100), \" \")","v":" "},{"$f":"IF(H4<>0, IF(L4/H4*100=0, \"-\", L4/H4*100), \" \")","v":72.670761120919011},{"$f":"IF(I4<>0, IF(M4/I4*100=0, \"-\", M4/I4*100), \" \")","v":" "},{"$f":"IF(J4<>0, IF(N4/J4*100=0, \"-\", N4/J4*100), \" \")","v":72.670761120919011}]
[]
["Structure administrative du pays",null,null,"Mise en oeuvre \nde la CP","Médica-ment","Date","Population ciblée pour T3",null,null,null,"Population traitée",null,null,null,"Couverture du Programme (%)"]
["Pays","Région/Département","District",null,null,null,"EAPréS","EAS","Adultes","Total","EAPréS","EAS","Adultes","Total","EAPréS","EAS","Adultes","Total"]
[]
[{"$f":"IF(COUNTRY_INFO!A9=0,\" \",COUNTRY_INFO!A9)","v":"Gabon"},{"$f":"IF(COUNTRY_INFO!B9=0,\" \",COUNTRY_INFO!B9)","v":"Libreville-Owendo"},{"$f":"IF(COUNTRY_INFO!C9=0,\" \",COUNTRY_INFO!C9)","v":"Libreville 1"},{"$f":"IF(OR(COUNTRY_INFO!$U$9:$U$1000=\"T3 (ALB/MBD)\",COUNTRY_INFO!$V$9:$V$1000=\"T3 (ALB/MBD)\"), \"T3 (ALB/MBD)\", \" \")","v":" "},null,null,null,null,null,{"$f":"SUM(G9:I9)","v":0},null,null,null,{"$f":"SUM(K9:M9)","v":0},{"$f":"IF(G9<>0, IF(K9/G9*100=0, \"-\", K9/G9*100), \" \")","v":" "}," "," "," "]
[{"$f":"IF(COUNTRY_INFO!A10=0,\" \",COUNTRY_INFO!A10)","v":"Gabon"},{"$f":"IF(COUNTRY_INFO!B10=0,\" \",COUNTRY_INFO!B10)","v":"Libreville-Owendo"},{"$f":"IF(COUNTRY_INFO!C10=0,\" \",COUNTRY_INFO!C10)","v":"Libreville 2"},{"$f":"IF(OR(COUNTRY_INFO!$U$9:$U$1000=\"T3 (ALB/MBD)\",COUNTRY_INFO!$V$9:$V$1000=\"T3 (ALB/MBD)\"), \"T3 (ALB/MBD)\", \" \")","v":" "},null,null,null,null,null,{"$f":"SUM(G10:I10)","v":0},null,null,null,{"$f":"SUM(K10:M10)","v":0},{"$f":"IF(G10<>0, IF(K10/G10*100=0, \"-\", K10/G10*100), \" \")","v":" "},{"$f":"IF(H10<>0, IF(L10/H10*100=0, \"-\", L10/H10*100), \" \")","v":" "},{"$f":"IF(I10<>0, IF(M10/I10*100=0, \"-\", M10/I10*100), \" \")","v":" "},{"$f":"IF(J10<>0, IF(N10/J10*100=0, \"-\", N10/J10*100), \" \")","v":" "}]
[{"$f":"IF(COUNTRY_INFO!A11=0,\" \",COUNTRY_INFO!A11)","v":"Gabon"},{"$f":"IF(COUNTRY_INFO!B11=0,\" \",COUNTRY_INFO!B11)","v":"Libreville-Owendo"},{"$f":"IF(COUNTRY_INFO!C11=0,\" \",COUNTRY_INFO!C11)","v":"Libreville 3"},{"$f":"IF(OR(COUNTRY_INFO!$U$9:$U$1000=\"T3 (ALB/MBD)\",COUNTRY_INFO!$V$9:$V$1000=\"T3 (ALB/MBD)\"), \"T3 (ALB/MBD)\", \" \")","v":" "},null,null,null,null,null,0,null,null,null,0," "," "," "," "]
[{"$f":"IF(COUNTRY_INFO!A12=0,\" \",COUNTRY_INFO!A12)","v":"Gabon"},{"$f":"IF(COUNTRY_INFO!B12=0,\" \",COUNTRY_INFO!B12)","v":"Libreville-Owendo"},{"$f":"IF(COUNTRY_INFO!C12=0,\" \",COUNTRY_INFO!C12)","v":"Owendo"},{"$f":"IF(OR(COUNTRY_INFO!$U$9:$U$1000=\"T3 (ALB/MBD)\",COUNTRY_INFO!$V$9:$V$1000=\"T3 (ALB/MBD)\"), \"T3 (ALB/MBD)\", \" \")","v":" "},null,null,null,null,null,0,null,null,null,0," "," "," "," "]
[{"$f":"IF(COUNTRY_INFO!A13=0,\" \",COUNTRY_INFO!A13)","v":"Gabon"},{"$f":"IF(COUNTRY_INFO!B13=0,\" \",COUNTRY_INFO!B13)","v":"Ouest"},{"$f":"IF(COUNTRY_INFO!C13=0,\" \",COUNTRY_INFO!C13)","v":"Komo-Mondah"},{"$f":"IF(OR(COUNTRY_INFO!$U$9:$U$1000=\"T3 (ALB/MBD)\",COUNTRY_INFO!$V$9:$V$1000=\"T3 (ALB/MBD)\"), \"T3 (ALB/MBD)\", \" \")","v":" "},null,null,null,null,null,0,null,null,null,0," "," "," "," "]
[{"$f":"IF(COUNTRY_INFO!A14=0,\" \",COUNTRY_INFO!A14)","v":"Gabon"},{"$f":"IF(COUNTRY_INFO!B14=0,\" \",COUNTRY_INFO!B14)","v":"Ouest"},{"$f":"IF(COUNTRY_INFO!C14=0,\" \",COUNTRY_INFO!C14)","v":"Komo-Kango"},{"$f":"IF(OR(COUNTRY_INFO!$U$9:$U$1000=\"T3 (ALB/MBD)\",COUNTRY_INFO!$V$9:$V$1000=\"T3 (ALB/MBD)\"), \"T3 (ALB/MBD)\", \" \")","v":" "},null,null,null,null,null,0,null,null,null,0," "," "," "," "]
[{"$f":"IF(COUNTRY_INFO!A15=0,\" \",COUNTRY_INFO!A15)","v":"Gabon"},{"$f":"IF(COUNTRY_INFO!B15=0,\" \",COUNTRY_INFO!B15)","v":"Ouest"},{"$f":"IF(COUNTRY_INFO!C15=0,\" \",COUNTRY_INFO!C15)","v":"Noya"},{"$f":"IF(OR(COUNTRY_INFO!$U$9:$U$1000=\"T3 (ALB/MBD)\",COUNTRY_INFO!$V$9:$V$1000=\"T3 (ALB/MBD)\"), \"T3 (ALB/MBD)\", \" \")","v":"T3 (ALB/MBD)"},"MBD","012019",null,989,null,989,null,947,null,947," ",95.753286147623868," ",95.753286147623868]
[{"$f":"IF(COUNTRY_INFO!A16=0,\" \",COUNTRY_INFO!A16)","v":"Gabon"},{"$f":"IF(COUNTRY_INFO!B16=0,\" \",COUNTRY_INFO!B16)","v":"Sud-Est"},{"$f":"IF(COUNTRY_INFO!C16=0,\" \",COUNTRY_INFO!C16)","v":"Bayi-brikolo"},{"$f":"IF(OR(COUNTRY_INFO!$U$9:$U$1000=\"T3 (ALB/MBD)\",COUNTRY_INFO!$V$9:$V$1000=\"T3 (ALB/MBD)\"), \"T3 (ALB/MBD)\", \" \")","v":"T3 (ALB/MBD)"},"MBD","072018",null,1578,null,1578,null,1139,null,1139," ",72.179974651457542," ",72.179974651457542]
[{"$f":"IF(COUNTRY_INFO!A17=0,\" \",COUNTRY_INFO!A17)","v":"Gabon"},{"$f":"IF(COUNTRY_INFO!B17=0,\" \",COUNTRY_INFO!B17)","v":"Sud-Est"},{"$f":"IF(COUNTRY_INFO!C17=0,\" \",COUNTRY_INFO!C17)","v":"Lékoni-Lékori"},{"$f":"IF(OR(COUNTRY_INFO!$U$9:$U$1000=\"T3 (ALB/MBD)\",COUNTRY_INFO!$V$9:$V$1000=\"T3 (ALB/MBD)\"), \"T3 (ALB/MBD)\", \" \")","v":"T3 (ALB/MBD)"},"MBD","012019",null,1349,null,1349,null,1253,null,1253," ",92.88361749444033," ",92.88361749444033]
[{"$f":"IF(COUNTRY_INFO!A18=0,\" \",COUNTRY_INFO!A18)","v":"Gabon"},{"$f":"IF(COUNTRY_INFO!B18=0,\" \",COUNTRY_INFO!B18)","v":"Sud-Est"},{"$f":"IF(COUNTRY_INFO!C18=0,\" \",COUNTRY_INFO!C18)","v":"Lékoko"},{"$f":"IF(OR(COUNTRY_INFO!$U$9:$U$1000=\"T3 (ALB/MBD)\",COUNTRY_INFO!$V$9:$V$1000=\"T3 (ALB/MBD)\"), \"T3 (ALB/MBD)\", \" \")","v":" "},null,null,null,null,null,0,null,null,null,0," "," "," "," "]
[{"$f":"IF(COUNTRY_INFO!A19=0,\" \",COUNTRY_INFO!A19)","v":"Gabon"},{"$f":"IF(COUNTRY_INFO!B19=0,\" \",COUNTRY_INFO!B19)","v":"Sud-Est"},{"$f":"IF(COUNTRY_INFO!C19=0,\" \",COUNTRY_INFO!C19)","v":"Djouori-Agnili"},{"$f":"IF(OR(COUNTRY_INFO!$U$9:$U$1000=\"T3 (ALB/MBD)\",COUNTRY_INFO!$V$9:$V$1000=\"T3 (ALB/MBD)\"), \"T3 (ALB/MBD)\", \" \")","v":"T3 (ALB/MBD)"},"MBD","072018",null,1554,null,1554,null,706,null,706," ",45.431145431145431," ",45.431145431145431]
[{"$f":"IF(COUNTRY_INFO!A20=0,\" \",COUNTRY_INFO!A20)","v":"Gabon"},{"$f":"IF(COUNTRY_INFO!B20=0,\" \",COUNTRY_INFO!B20)","v":"Sud-Est"},{"$f":"IF(COUNTRY_INFO!C20=0,\" \",COUNTRY_INFO!C20)","v":"Ogooué-Létili"},{"$f":"IF(OR(COUNTRY_INFO!$U$9:$U$1000=\"T3 (ALB/MBD)\",COUNTRY_INFO!$V$9:$V$1000=\"T3 (ALB/MBD)\"), \"T3 (ALB/MBD)\", \" \")","v":"T3 (ALB/MBD)"},"MBD","072018",null,1306,null,1306,null,667,null,667," ",51.071975497702915," ",51.071975497702915]
[{"$f":"IF(COUNTRY_INFO!A21=0,\" \",COUNTRY_INFO!A21)","v":"Gabon"},{"$f":"IF(COUNTRY_INFO!B21=0,\" \",COUNTRY_INFO!B21)","v":"Sud-Est"},{"$f":"IF(COUNTRY_INFO!C21=0,\" \",COUNTRY_INFO!C21)","v":"Mpassa"},{"$f":"IF(OR(COUNTRY_INFO!$U$9:$U$1000=\"T3 (ALB/MBD)\",COUNTRY_INFO!$V$9:$V$1000=\"T3 (ALB/MBD)\"), \"T3 (ALB/MBD)\", \" \")","v":" "},null,null,null,null,null,0,null,null,null,0," "," "," "," "]
[{"$f":"IF(COUNTRY_INFO!A22=0,\" \",COUNTRY_INFO!A22)","v":"Gabon"},{"$f":"IF(COUNTRY_INFO!B22=0,\" \",COUNTRY_INFO!B22)","v":"Sud-Est"},{"$f":"IF(COUNTRY_INFO!C22=0,\" \",COUNTRY_INFO!C22)","v":"Plateaux"},{"$f":"IF(OR(COUNTRY_INFO!$U$9:$U$1000=\"T3 (ALB/MBD)\",COUNTRY_INFO!$V$9:$V$1000=\"T3 (ALB/MBD)\"), \"T3 (ALB/MBD)\", \" \")","v":"T3 (ALB/MBD)"},"MBD","012019",null,1400,null,1400,null,1353,null,1353," ",96.642857142857139," ",96.642857142857139]
[{"$f":"IF(COUNTRY_INFO!A23=0,\" \",COUNTRY_INFO!A23)","v":"Gabon"},{"$f":"IF(COUNTRY_INFO!B23=0,\" \",COUNTRY_INFO!B23)","v":"Sud-Est"},{"$f":"IF(COUNTRY_INFO!C23=0,\" \",COUNTRY_INFO!C23)","v":"Lébombi-Léyou"},{"$f":"IF(OR(COUNTRY_INFO!$U$9:$U$1000=\"T3 (ALB/MBD)\",COUNTRY_INFO!$V$9:$V$1000=\"T3 (ALB/MBD)\"), \"T3 (ALB/MBD)\", \" \")","v":" "},null,null,null,null,null,0,null,null,null,0," "," "," "," "]
[{"$f":"IF(COUNTRY_INFO!A24=0,\" \",COUNTRY_INFO!A24)","v":"Gabon"},{"$f":"IF(COUNTRY_INFO!B24=0,\" \",COUNTRY_INFO!B24)","v":"Sud-Est"},{"$f":"IF(COUNTRY_INFO!C24=0,\" \",COUNTRY_INFO!C24)","v":"Lékabi-Léwolo"},{"$f":"IF(OR(COUNTRY_INFO!$U$9:$U$1000=\"T3 (ALB/MBD)\",COUNTRY_INFO!$V$9:$V$1000=\"T3 (ALB/MBD)\"), \"T3 (ALB/MBD)\", \" \")","v":" "},null,null,null,null,null,0,null,null,null,0," "," "," "," "]
[{"$f":"IF(COUNTRY_INFO!A25=0,\" \",COUNTRY_INFO!A25)","v":"Gabon"},{"$f":"IF(COUNTRY_INFO!B25=0,\" \",COUNTRY_INFO!B25)","v":"Sud-Est"},{"$f":"IF(COUNTRY_INFO!C25=0,\" \",COUNTRY_INFO!C25)","v":"Sébé-Brikolo"},{"$f":"IF(OR(COUNTRY_INFO!$U$9:$U$1000=\"T3 (ALB/MBD)\",COUNTRY_INFO!$V$9:$V$1000=\"T3 (ALB/MBD)\"), \"T3 (ALB/MBD)\", \" \")","v":" "},null,null,null,null,null,0,null,null,null,0," "," "," "," "]
[{"$f":"IF(COUNTRY_INFO!A26=0,\" \",COUNTRY_INFO!A26)","v":"Gabon"},{"$f":"IF(COUNTRY_INFO!B26=0,\" \",COUNTRY_INFO!B26)","v":"Sud-Est"},{"$f":"IF(COUNTRY_INFO!C26=0,\" \",COUNTRY_INFO!C26)","v":"Djoué"},{"$f":"IF(OR(COUNTRY_INFO!$U$9:$U$1000=\"T3 (ALB/MBD)\",COUNTRY_INFO!$V$9:$V$1000=\"T3 (ALB/MBD)\"), \"T3 (ALB/MBD)\", \" \")","v":"T3 (ALB/MBD)"},"MBD","012019",null,403,null,403,null,403,null,403," ",100," ",100]
[{"$f":"IF(COUNTRY_INFO!A27=0,\" \",COUNTRY_INFO!A27)","v":"Gabon"},{"$f":"IF(COUNTRY_INFO!B27=0,\" \",COUNTRY_INFO!B27)","v":"Centre"},{"$f":"IF(COUNTRY_INFO!C27=0,\" \",COUNTRY_INFO!C27)","v":"Ogooué-et-Lacs"},{"$f":"IF(OR(COUNTRY_INFO!$U$9:$U$1000=\"T3 (ALB/MBD)\",COUNTRY_INFO!$V$9:$V$1000=\"T3 (ALB/MBD)\"), \"T3 (ALB/MBD)\", \" \")","v":" "},null,null,null,null,null,0,null,null,null,0," "," "," "," "]
[{"$f":"IF(COUNTRY_INFO!A28=0,\" \",COUNTRY_INFO!A28)","v":"Gabon"},{"$f":"IF(COUNTRY_INFO!B28=0,\" \",COUNTRY_INFO!B28)","v":"Centre"},{"$f":"IF(COUNTRY_INFO!C28=0,\" \",COUNTRY_INFO!C28)","v":"Abanga-Bigné"},{"$f":"IF(OR(COUNTRY_INFO!$U$9:$U$1000=\"T3 (ALB/MBD)\",COUNTRY_INFO!$V$9:$V$1000=\"T3 (ALB/MBD)\"), \"T3 (ALB/MBD)\", \" \")","v":" "},null,null,null,null,null,0,null,null,null,0," "," "," "," "]
[{"$f":"IF(COUNTRY_INFO!A29=0,\" \",COUNTRY_INFO!A29)","v":"Gabon"},{"$f":"IF(COUNTRY_INFO!B29=0,\" \",COUNTRY_INFO!B29)","v":"Centre-Sud"},{"$f":"IF(COUNTRY_INFO!C29=0,\" \",COUNTRY_INFO!C29)","v":"Tsamba-Magotsi"},{"$f":"IF(OR(COUNTRY_INFO!$U$9:$U$1000=\"T3 (ALB/MBD)\",COUNTRY_INFO!$V$9:$V$1000=\"T3 (ALB/MBD)\"), \"T3 (ALB/MBD)\", \" \")","v":" "},null,null,null,null,null,0,null,null,null,0," "," "," "," "]
[{"$f":"IF(COUNTRY_INFO!A30=0,\" \",COUNTRY_INFO!A30)","v":"Gabon"},{"$f":"IF(COUNTRY_INFO!B30=0,\" \",COUNTRY_INFO!B30)","v":"Centre-Sud"},{"$f":"IF(COUNTRY_INFO!C30=0,\" \",COUNTRY_INFO!C30)","v":"Louetsi-Wano"},{"$f":"IF(OR(COUNTRY_INFO!$U$9:$U$1000=\"T3 (ALB/MBD)\",COUNTRY_INFO!$V$9:$V$1000=\"T3 (ALB/MBD)\"), \"T3 (ALB/MBD)\", \" \")","v":"T3 (ALB/MBD)"},"MBD","012019",null,2595,null,2595,null,2364,null,2364," ",91.098265895953759," ",91.098265895953759]
[{"$f":"IF(COUNTRY_INFO!A31=0,\" \",COUNTRY_INFO!A31)","v":"Gabon"},{"$f":"IF(COUNTRY_INFO!B31=0,\" \",COUNTRY_INFO!B31)","v":"Centre-Sud"},{"$f":"IF(COUNTRY_INFO!C31=0,\" \",COUNTRY_INFO!C31)","v":"Louetsi-Bibaka"},{"$f":"IF(OR(COUNTRY_INFO!$U$9:$U$1000=\"T3 (ALB/MBD)\",COUNTRY_INFO!$V$9:$V$1000=\"T3 (ALB/MBD)\"), \"T3 (ALB/MBD)\", \" \")","v":"T3 (ALB/MBD)"},"MBD","072018",null,792,null,792,null,538,null,538," ",67.929292929292927," ",67.929292929292927]
[{"$f":"IF(COUNTRY_INFO!A32=0,\" \",COUNTRY_INFO!A32)","v":"Gabon"},{"$f":"IF(COUNTRY_INFO!B32=0,\" \",COUNTRY_INFO!B32)","v":"Centre-Sud"},{"$f":"IF(COUNTRY_INFO!C32=0,\" \",COUNTRY_INFO!C32)","v":"Ndolou"},{"$f":"IF(OR(COUNTRY_INFO!$U$9:$U$1000=\"T3 (ALB/MBD)\",COUNTRY_INFO!$V$9:$V$1000=\"T3 (ALB/MBD)\"), \"T3 (ALB/MBD)\", \" \")","v":" "},null,null,null,null,null,0,null,null,null,0," "," "," "," "]
[{"$f":"IF(COUNTRY_INFO!A33=0,\" \",COUNTRY_INFO!A33)","v":"Gabon"},{"$f":"IF(COUNTRY_INFO!B33=0,\" \",COUNTRY_INFO!B33)","v":"Centre-Sud"},{"$f":"IF(COUNTRY_INFO!C33=0,\" \",COUNTRY_INFO!C33)","v":"Boumi-Louetsi"},{"$f":"IF(OR(COUNTRY_INFO!$U$9:$U$1000=\"T3 (ALB/MBD)\",COUNTRY_INFO!$V$9:$V$1000=\"T3 (ALB/MBD)\"), \"T3 (ALB/MBD)\", \" \")","v":"T3 (ALB/MBD)"},"MBD","012019",null,1938,null,1938,null,1762,null,1762," ",90.918472652218782," ",90.918472652218782]
[{"$f":"IF(COUNTRY_INFO!A34=0,\" \",COUNTRY_INFO!A34)","v":"Gabon"},{"$f":"IF(COUNTRY_INFO!B34=0,\" \",COUNTRY_INFO!B34)","v":"Centre-Sud"},{"$f":"IF(COUNTRY_INFO!C34=0,\" \",COUNTRY_INFO!C34)","v":"Ogoulou"},{"$f":"IF(OR(COUNTRY_INFO!$U$9:$U$1000=\"T3 (ALB/MBD)\",COUNTRY_INFO!$V$9:$V$1000=\"T3 (ALB/MBD)\"), \"T3 (ALB/MBD)\", \" \")","v":"T3 (ALB/MBD)"},"MBD","012019",null,1818,null,1818,null,1125,null,1125," ",61.881188118811878," ",61.881188118811878]
[{"$f":"IF(COUNTRY_INFO!A35=0,\" \",COUNTRY_INFO!A35)","v":"Gabon"},{"$f":"IF(COUNTRY_INFO!B35=0,\" \",COUNTRY_INFO!B35)","v":"Centre-Sud"},{"$f":"IF(COUNTRY_INFO!C35=0,\" \",COUNTRY_INFO!C35)","v":"Douya-Onoye"},{"$f":"IF(OR(COUNTRY_INFO!$U$9:$U$1000=\"T3 (ALB/MBD)\",COUNTRY_INFO!$V$9:$V$1000=\"T3 (ALB/MBD)\"), \"T3 (ALB/MBD)\", \" \")","v":" "},null,null,null,null,null,0,null,null,null,0," "," "," "," "]
[{"$f":"IF(COUNTRY_INFO!A36=0,\" \",COUNTRY_INFO!A36)","v":"Gabon"},{"$f":"IF(COUNTRY_INFO!B36=0,\" \",COUNTRY_INFO!B36)","v":"Centre-Sud"},{"$f":"IF(COUNTRY_INFO!C36=0,\" \",COUNTRY_INFO!C36)","v":"Dola"},{"$f":"IF(OR(COUNTRY_INFO!$U$9:$U$1000=\"T3 (ALB/MBD)\",COUNTRY_INFO!$V$9:$V$1000=\"T3 (ALB/MBD)\"), \"T3 (ALB/MBD)\", \" \")","v":" "},null,null,null,null,null,0,null,null,null,0," "," "," "," "]
[{"$f":"IF(COUNTRY_INFO!A37=0,\" \",COUNTRY_INFO!A37)","v":"Gabon"},{"$f":"IF(COUNTRY_INFO!B37=0,\" \",COUNTRY_INFO!B37)","v":"Centre-Sud"},{"$f":"IF(COUNTRY_INFO!C37=0,\" \",COUNTRY_INFO!C37)","v":"Mougalaba"},{"$f":"IF(OR(COUNTRY_INFO!$U$9:$U$1000=\"T3 (ALB/MBD)\",COUNTRY_INFO!$V$9:$V$1000=\"T3 (ALB/MBD)\"), \"T3 (ALB/MBD)\", \" \")","v":"T3 (ALB/MBD)"},"MBD","012019",null,237,null,237,null,237,null,237," ",100," ",100]
[{"$f":"IF(COUNTRY_INFO!A38=0,\" \",COUNTRY_INFO!A38)","v":"Gabon"},{"$f":"IF(COUNTRY_INFO!B38=0,\" \",COUNTRY_INFO!B38)","v":"Sud"},{"$f":"IF(COUNTRY_INFO!C38=0,\" \",COUNTRY_INFO!C38)","v":"Doutsila"},{"$f":"IF(OR(COUNTRY_INFO!$U$9:$U$1000=\"T3 (ALB/MBD)\",COUNTRY_INFO!$V$9:$V$1000=\"T3 (ALB/MBD)\"), \"T3 (ALB/MBD)\", \" \")","v":"T3 (ALB/MBD)"},"MBD","012019",null,504,null,504,null,401,null,401," ",79.563492063492063," ",79.563492063492063]
[{"$f":"IF(COUNTRY_INFO!A39=0,\" \",COUNTRY_INFO!A39)","v":"Gabon"},{"$f":"IF(COUNTRY_INFO!B39=0,\" \",COUNTRY_INFO!B39)","v":"Sud"},{"$f":"IF(COUNTRY_INFO!C39=0,\" \",COUNTRY_INFO!C39)","v":"Basse-Banio"},{"$f":"IF(OR(COUNTRY_INFO!$U$9:$U$1000=\"T3 (ALB/MBD)\",COUNTRY_INFO!$V$9:$V$1000=\"T3 (ALB/MBD)\"), \"T3 (ALB/MBD)\", \" \")","v":" "},null,null,null,null,null,0,null,null,null,0," "," "," "," "]
[{"$f":"IF(COUNTRY_INFO!A40=0,\" \",COUNTRY_INFO!A40)","v":"Gabon"},{"$f":"IF(COUNTRY_INFO!B40=0,\" \",COUNTRY_INFO!B40)","v":"Sud"},{"$f":"IF(COUNTRY_INFO!C40=0,\" \",COUNTRY_INFO!C40)","v":"Douigny"},{"$f":"IF(OR(COUNTRY_INFO!$U$9:$U$1000=\"T3 (ALB/MBD)\",COUNTRY_INFO!$V$9:$V$1000=\"T3 (ALB/MBD)\"), \"T3 (ALB/MBD)\", \" \")","v":"T3 (ALB/MBD)"},"MBD","072018",null,1873,null,1873,null,922,null,922," ",49.225840896956754," ",49.225840896956754]
[{"$f":"IF(COUNTRY_INFO!A41=0,\" \",COUNTRY_INFO!A41)","v":"Gabon"},{"$f":"IF(COUNTRY_INFO!B41=0,\" \",COUNTRY_INFO!B41)","v":"Sud"},{"$f":"IF(COUNTRY_INFO!C41=0,\" \",COUNTRY_INFO!C41)","v":"Mongo"},{"$f":"IF(OR(COUNTRY_INFO!$U$9:$U$1000=\"T3 (ALB/MBD)\",COUNTRY_INFO!$V$9:$V$1000=\"T3 (ALB/MBD)\"), \"T3 (ALB/MBD)\", \" \")","v":" "},null,null,null,null,null,0,null,null,null,0," "," "," "," "]
[{"$f":"IF(COUNTRY_INFO!A42=0,\" \",COUNTRY_INFO!A42)","v":"Gabon"},{"$f":"IF(COUNTRY_INFO!B42=0,\" \",COUNTRY_INFO!B42)","v":"Sud"},{"$f":"IF(COUNTRY_INFO!C42=0,\" \",COUNTRY_INFO!C42)","v":"Haute-Banio"},{"$f":"IF(OR(COUNTRY_INFO!$U$9:$U$1000=\"T3 (ALB/MBD)\",COUNTRY_INFO!$V$9:$V$1000=\"T3 (ALB/MBD)\"), \"T3 (ALB/MBD)\", \" \")","v":"T3 (ALB/MBD)"},"MBD","072018",null,471,null,471,null,294,null,294," ",62.420382165605091," ",62.420382165605091]
[{"$f":"IF(COUNTRY_INFO!A43=0,\" \",COUNTRY_INFO!A43)","v":"Gabon"},{"$f":"IF(COUNTRY_INFO!B43=0,\" \",COUNTRY_INFO!B43)","v":"Sud"},{"$f":"IF(COUNTRY_INFO!C43=0,\" \",COUNTRY_INFO!C43)","v":"Mougoutsi"},{"$f":"IF(OR(COUNTRY_INFO!$U$9:$U$1000=\"T3 (ALB/MBD)\",COUNTRY_INFO!$V$9:$V$1000=\"T3 (ALB/MBD)\"), \"T3 (ALB/MBD)\", \" \")","v":" "},null,null,null,null,null,0,null,null,null,0," "," "," "," "]
[{"$f":"IF(COUNTRY_INFO!A44=0,\" \",COUNTRY_INFO!A44)","v":"Gabon"},{"$f":"IF(COUNTRY_INFO!B44=0,\" \",COUNTRY_INFO!B44)","v":"Est"},{"$f":"IF(COUNTRY_INFO!C44=0,\" \",COUNTRY_INFO!C44)","v":"Lopé"},{"$f":"IF(OR(COUNTRY_INFO!$U$9:$U$1000=\"T3 (ALB/MBD)\",COUNTRY_INFO!$V$9:$V$1000=\"T3 (ALB/MBD)\"), \"T3 (ALB/MBD)\", \" \")","v":" "},null,null,null,null,null,0,null,null,null,0," "," "," "," "]
[{"$f":"IF(COUNTRY_INFO!A45=0,\" \",COUNTRY_INFO!A45)","v":"Gabon"},{"$f":"IF(COUNTRY_INFO!B45=0,\" \",COUNTRY_INFO!B45)","v":"Est"},{"$f":"IF(COUNTRY_INFO!C45=0,\" \",COUNTRY_INFO!C45)","v":"Ivindo"},{"$f":"IF(OR(COUNTRY_INFO!$U$9:$U$1000=\"T3 (ALB/MBD)\",COUNTRY_INFO!$V$9:$V$1000=\"T3 (ALB/MBD)\"), \"T3 (ALB/MBD)\", \" \")","v":" "},null,null,null,null,null,0,null,null,null,0," "," "," "," "]
[{"$f":"IF(COUNTRY_INFO!A46=0,\" \",COUNTRY_INFO!A46)","v":"Gabon"},{"$f":"IF(COUNTRY_INFO!B46=0,\" \",COUNTRY_INFO!B46)","v":"Est"},{"$f":"IF(COUNTRY_INFO!C46=0,\" \",COUNTRY_INFO!C46)","v":"Zadié"},{"$f":"IF(OR(COUNTRY_INFO!$U$9:$U$1000=\"T3 (ALB/MBD)\",COUNTRY_INFO!$V$9:$V$1000=\"T3 (ALB/MBD)\"), \"T3 (ALB/MBD)\", \" \")","v":"T3 (ALB/MBD)"},"MBD","072018",null,4122,null,4122,null,1131,null,1131," ",27.438136826783115," ",27.438136826783115]
[{"$f":"IF(COUNTRY_INFO!A47=0,\" \",COUNTRY_INFO!A47)","v":"Gabon"},{"$f":"IF(COUNTRY_INFO!B47=0,\" \",COUNTRY_INFO!B47)","v":"Est"},{"$f":"IF(COUNTRY_INFO!C47=0,\" \",COUNTRY_INFO!C47)","v":"Mvoung"},{"$f":"IF(OR(COUNTRY_INFO!$U$9:$U$1000=\"T3 (ALB/MBD)\",COUNTRY_INFO!$V$9:$V$1000=\"T3 (ALB/MBD)\"), \"T3 (ALB/MBD)\", \" \")","v":"T3 (ALB/MBD)"},"MBD","012019",null,846,null,846,null,799,null,799," ",94.444444444444443," ",94.444444444444443]
[{"$f":"IF(COUNTRY_INFO!A48=0,\" \",COUNTRY_INFO!A48)","v":"Gabon"},{"$f":"IF(COUNTRY_INFO!B48=0,\" \",COUNTRY_INFO!B48)","v":"Centre-Est"},{"$f":"IF(COUNTRY_INFO!C48=0,\" \",COUNTRY_INFO!C48)","v":"Offoué-Onoye"},{"$f":"IF(OR(COUNTRY_INFO!$U$9:$U$1000=\"T3 (ALB/MBD)\",COUNTRY_INFO!$V$9:$V$1000=\"T3 (ALB/MBD)\"), \"T3 (ALB/MBD)\", \" \")","v":"T3 (ALB/MBD)"},"MBD","012019",null,582,null,582,null,577,null,577," ",99.140893470790388," ",99.140893470790388]
[{"$f":"IF(COUNTRY_INFO!A49=0,\" \",COUNTRY_INFO!A49)","v":"Gabon"},{"$f":"IF(COUNTRY_INFO!B49=0,\" \",COUNTRY_INFO!B49)","v":"Centre-Est"},{"$f":"IF(COUNTRY_INFO!C49=0,\" \",COUNTRY_INFO!C49)","v":"Lolo-Bouenguidi"},{"$f":"IF(OR(COUNTRY_INFO!$U$9:$U$1000=\"T3 (ALB/MBD)\",COUNTRY_INFO!$V$9:$V$1000=\"T3 (ALB/MBD)\"), \"T3 (ALB/MBD)\", \" \")","v":" "},null,null,null,null,null,0,null,null,null,0," "," "," "," "]
[{"$f":"IF(COUNTRY_INFO!A50=0,\" \",COUNTRY_INFO!A50)","v":"Gabon"},{"$f":"IF(COUNTRY_INFO!B50=0,\" \",COUNTRY_INFO!B50)","v":"Centre-Est"},{"$f":"IF(COUNTRY_INFO!C50=0,\" \",COUNTRY_INFO!C50)","v":"Mulundu"},{"$f":"IF(OR(COUNTRY_INFO!$U$9:$U$1000=\"T3 (ALB/MBD)\",COUNTRY_INFO!$V$9:$V$1000=\"T3 (ALB/MBD)\"), \"T3 (ALB/MBD)\", \" \")","v":" "},null,null,null,null,null,0,null,null,null,0," "," "," "," "]
[{"$f":"IF(COUNTRY_INFO!A51=0,\" \",COUNTRY_INFO!A51)","v":"Gabon"},{"$f":"IF(COUNTRY_INFO!B51=0,\" \",COUNTRY_INFO!B51)","v":"Centre-Est"},{"$f":"IF(COUNTRY_INFO!C51=0,\" \",COUNTRY_INFO!C51)","v":"Lombo-Bouenguidi"},{"$f":"IF(OR(COUNTRY_INFO!$U$9:$U$1000=\"T3 (ALB/MBD)\",COUNTRY_INFO!$V$9:$V$1000=\"T3 (ALB/MBD)\"), \"T3 (ALB/MBD)\", \" \")","v":"T3 (ALB/MBD)"},"MBD","012019",null,775,null,775,null,775,null,775," ",100," ",100]
[{"$f":"IF(COUNTRY_INFO!A52=0,\" \",COUNTRY_INFO!A52)","v":"Gabon"},{"$f":"IF(COUNTRY_INFO!B52=0,\" \",COUNTRY_INFO!B52)","v":"Maritime"},{"$f":"IF(COUNTRY_INFO!C52=0,\" \",COUNTRY_INFO!C52)","v":"Ndougou"},{"$f":"IF(OR(COUNTRY_INFO!$U$9:$U$1000=\"T3 (ALB/MBD)\",COUNTRY_INFO!$V$9:$V$1000=\"T3 (ALB/MBD)\"), \"T3 (ALB/MBD)\", \" \")","v":" "},null,null,null,null,null,0,null,null,null,0," "," "," "," "]
[{"$f":"IF(COUNTRY_INFO!A53=0,\" \",COUNTRY_INFO!A53)","v":"Gabon"},{"$f":"IF(COUNTRY_INFO!B53=0,\" \",COUNTRY_INFO!B53)","v":"Maritime"},{"$f":"IF(COUNTRY_INFO!C53=0,\" \",COUNTRY_INFO!C53)","v":"Etimboué"},{"$f":"IF(OR(COUNTRY_INFO!$U$9:$U$1000=\"T3 (ALB/MBD)\",COUNTRY_INFO!$V$9:$V$1000=\"T3 (ALB/MBD)\"), \"T3 (ALB/MBD)\", \" \")","v":" "},null,null,null,null,null,0,null,null,null,0," "," "," "," "]
[{"$f":"IF(COUNTRY_INFO!A54=0,\" \",COUNTRY_INFO!A54)","v":"Gabon"},{"$f":"IF(COUNTRY_INFO!B54=0,\" \",COUNTRY_INFO!B54)","v":"Maritime"},{"$f":"IF(COUNTRY_INFO!C54=0,\" \",COUNTRY_INFO!C54)","v":"Bendjé"},{"$f":"IF(OR(COUNTRY_INFO!$U$9:$U$1000=\"T3 (ALB/MBD)\",COUNTRY_INFO!$V$9:$V$1000=\"T3 (ALB/MBD)\"), \"T3 (ALB/MBD)\", \" \")","v":" "},null,null,null,null,null,0,null,null,null,0," "," "," "," "]
[{"$f":"IF(COUNTRY_INFO!A55=0,\" \",COUNTRY_INFO!A55)","v":"Gabon"},{"$f":"IF(COUNTRY_INFO!B55=0,\" \",COUNTRY_INFO!B55)","v":"Nord"},{"$f":"IF(COUNTRY_INFO!C55=0,\" \",COUNTRY_INFO!C55)","v":"Ntem"},{"$f":"IF(OR(COUNTRY_INFO!$U$9:$U$1000=\"T3 (ALB/MBD)\",COUNTRY_INFO!$V$9:$V$1000=\"T3 (ALB/MBD)\"), \"T3 (ALB/MBD)\", \" \")","v":"T3 (ALB/MBD)"},"MBD","012019",null,8174,null,8174,null,5837,null,5837," ",71.409346709077553," ",71.409346709077553]
[{"$f":"IF(COUNTRY_INFO!A56=0,\" \",COUNTRY_INFO!A56)","v":"Gabon"},{"$f":"IF(COUNTRY_INFO!B56=0,\" \",COUNTRY_INFO!B56)","v":"Nord"},{"$f":"IF(COUNTRY_INFO!C56=0,\" \",COUNTRY_INFO!C56)","v":"Haut - Komo"},{"$f":"IF(OR(COUNTRY_INFO!$U$9:$U$1000=\"T3 (ALB/MBD)\",COUNTRY_INFO!$V$9:$V$1000=\"T3 (ALB/MBD)\"), \"T3 (ALB/MBD)\", \" \")","v":"T3 (ALB/MBD)"},"MBD","012019",null,717,null,717,null,619,null,619," ",86.331938633193857," ",86.331938633193857]
[{"$f":"IF(COUNTRY_INFO!A57=0,\" \",COUNTRY_INFO!A57)","v":"Gabon"},{"$f":"IF(COUNTRY_INFO!B57=0,\" \",COUNTRY_INFO!B57)","v":"Nord"},{"$f":"IF(COUNTRY_INFO!C57=0,\" \",COUNTRY_INFO!C57)","v":"Haut-Ntem"},{"$f":"IF(OR(COUNTRY_INFO!$U$9:$U$1000=\"T3 (ALB/MBD)\",COUNTRY_INFO!$V$9:$V$1000=\"T3 (ALB/MBD)\"), \"T3 (ALB/MBD)\", \" \")","v":"T3 (ALB/MBD)"},"MBD","012019",null,2303,null,2303,null,1684,null,1684," ",73.122014763352155," ",73.122014763352155]
[{"$f":"IF(COUNTRY_INFO!A58=0,\" \",COUNTRY_INFO!A58)","v":"Gabon"},{"$f":"IF(COUNTRY_INFO!B58=0,\" \",COUNTRY_INFO!B58)","v":"Nord"},{"$f":"IF(COUNTRY_INFO!C58=0,\" \",COUNTRY_INFO!C58)","v":"Okano"},{"$f":"IF(OR(COUNTRY_INFO!$U$9:$U$1000=\"T3 (ALB/MBD)\",COUNTRY_INFO!$V$9:$V$1000=\"T3 (ALB/MBD)\"), \"T3 (ALB/MBD)\", \" \")","v":"T3 (ALB/MBD)"},"MBD","012019",null,3891,null,3891,null,3693,null,3693," ",94.911333847340018," ",94.911333847340018]
[{"$f":"IF(COUNTRY_INFO!A59=0,\" \",COUNTRY_INFO!A59)","v":"Gabon"},{"$f":"IF(COUNTRY_INFO!B59=0,\" \",COUNTRY_INFO!B59)","v":"Nord"},{"$f":"IF(COUNTRY_INFO!C59=0,\" \",COUNTRY_INFO!C59)","v":"Woleu"},{"$f":"IF(OR(COUNTRY_INFO!$U$9:$U$1000=\"T3 (ALB/MBD)\",COUNTRY_INFO!$V$9:$V$1000=\"T3 (ALB/MBD)\"), \"T3 (ALB/MBD)\", \" \")","v":" "},null,null,null,null,null,0,null,null,null,0," "," "," "," "]

{"sheet":"T3_R2","index":8,"n_rows":59,"n_cols":18,"rows_kept":59,"cut":false,"hidden":false,"merged":[[5,6,5,9],[5,10,5,13],[5,14,5,17],[3,0,3,2],[5,0,5,2],[5,3,6,3],[5,5,6,5],[5,4,6,4]]}
["T 3 - Albendazole (ALB) ou Mebendazole (MBD) - Tournée 2"]
["Structure administrative, population nécessitant une chimioprévention par groupe d'âge, population traitée par groupe d'âge et couverture"]
[]
["TOTAL",null,null,null,null,null,{"$f":"SUM(G$9:G$1000)","v":0},5873,0,5873,0,3853,0,3853,{"$f":"IF(G4<>0, IF(K4/G4*100=0, \"-\", K4/G4*100), \" \")","v":" "},{"$f":"IF(H4<>0, IF(L4/H4*100=0, \"-\", L4/H4*100), \" \")","v":65.605312446790393},{"$f":"IF(I4<>0, IF(M4/I4*100=0, \"-\", M4/I4*100), \" \")","v":" "},{"$f":"IF(J4<>0, IF(N4/J4*100=0, \"-\", N4/J4*100), \" \")","v":65.605312446790393}]
[]
["Structure administrative du pays",null,null,"Mise en oeuvre \nde la CP","Médica-ment","Date","Population ciblée pour T3",null,null,null,"Population traitée",null,null,null,"Couverture du Programme (%)"]
["Pays","Région/Département","District",null,null,null,"EAPréS","EAS","Adultes","Total","EAPréS","EAS","Adultes","Total","EAPréS","EAS","Adultes","Total"]
[]
[{"$f":"IF(COUNTRY_INFO!A9=0,\" \",COUNTRY_INFO!A9)","v":"Gabon"},{"$f":"IF(COUNTRY_INFO!B9=0,\" \",COUNTRY_INFO!B9)","v":"Libreville-Owendo"},{"$f":"IF(COUNTRY_INFO!C9=0,\" \",COUNTRY_INFO!C9)","v":"Libreville 1"},{"$f":"IF(AND(COUNTRY_INFO!$U$9:$U$1000=\"T3 (ALB/MBD)\",COUNTRY_INFO!$V$9:$V$1000=\"T3 (ALB/MBD)\"), \"T3 (ALB/MBD)\", \" \")","v":" "},null,null,null,null,null,{"$f":"SUM(G9:I9)","v":0},null,null,null,{"$f":"SUM(K9:M9)","v":0},{"$f":"IF(G9<>0, IF(K9/G9*100=0, \"-\", K9/G9*100), \" \")","v":" "}," "," "," "]
[{"$f":"IF(COUNTRY_INFO!A10=0,\" \",COUNTRY_INFO!A10)","v":"Gabon"},{"$f":"IF(COUNTRY_INFO!B10=0,\" \",COUNTRY_INFO!B10)","v":"Libreville-Owendo"},{"$f":"IF(COUNTRY_INFO!C10=0,\" \",COUNTRY_INFO!C10)","v":"Libreville 2"},{"$f":"IF(AND(COUNTRY_INFO!$U$9:$U$1000=\"T3 (ALB/MBD)\",COUNTRY_INFO!$V$9:$V$1000=\"T3 (ALB/MBD)\"), \"T3 (ALB/MBD)\", \" \")","v":" "},null,null,null,null,null,{"$f":"SUM(G10:I10)","v":0},null,null,null,{"$f":"SUM(K10:M10)","v":0},{"$f":"IF(G10<>0, IF(K10/G10*100=0, \"-\", K10/G10*100), \" \")","v":" "},{"$f":"IF(H10<>0, IF(L10/H10*100=0, \"-\", L10/H10*100), \" \")","v":" "},{"$f":"IF(I10<>0, IF(M10/I10*100=0, \"-\", M10/I10*100), \" \")","v":" "},{"$f":"IF(J10<>0, IF(N10/J10*100=0, \"-\", N10/J10*100), \" \")","v":" "}]
[{"$f":"IF(COUNTRY_INFO!A11=0,\" \",COUNTRY_INFO!A11)","v":"Gabon"},{"$f":"IF(COUNTRY_INFO!B11=0,\" \",COUNTRY_INFO!B11)","v":"Libreville-Owendo"},{"$f":"IF(COUNTRY_INFO!C11=0,\" \",COUNTRY_INFO!C11)","v":"Libreville 3"},{"$f":"IF(AND(COUNTRY_INFO!$U$9:$U$1000=\"T3 (ALB/MBD)\",COUNTRY_INFO!$V$9:$V$1000=\"T3 (ALB/MBD)\"), \"T3 (ALB/MBD)\", \" \")","v":" "},null,null,null,null,null,0,null,null,null,0," "," "," "," "]
[{"$f":"IF(COUNTRY_INFO!A12=0,\" \",COUNTRY_INFO!A12)","v":"Gabon"},{"$f":"IF(COUNTRY_INFO!B12=0,\" \",COUNTRY_INFO!B12)","v":"Libreville-Owendo"},{"$f":"IF(COUNTRY_INFO!C12=0,\" \",COUNTRY_INFO!C12)","v":"Owendo"},{"$f":"IF(AND(COUNTRY_INFO!$U$9:$U$1000=\"T3 (ALB/MBD)\",COUNTRY_INFO!$V$9:$V$1000=\"T3 (ALB/MBD)\"), \"T3 (ALB/MBD)\", \" \")","v":" "},null,null,null,null,null,0,null,null,null,0," "," "," "," "]
[{"$f":"IF(COUNTRY_INFO!A13=0,\" \",COUNTRY_INFO!A13)","v":"Gabon"},{"$f":"IF(COUNTRY_INFO!B13=0,\" \",COUNTRY_INFO!B13)","v":"Ouest"},{"$f":"IF(COUNTRY_INFO!C13=0,\" \",COUNTRY_INFO!C13)","v":"Komo-Mondah"},{"$f":"IF(AND(COUNTRY_INFO!$U$9:$U$1000=\"T3 (ALB/MBD)\",COUNTRY_INFO!$V$9:$V$1000=\"T3 (ALB/MBD)\"), \"T3 (ALB/MBD)\", \" \")","v":" "},null,null,null,null,null,0,null,null,null,0," "," "," "," "]
[{"$f":"IF(COUNTRY_INFO!A14=0,\" \",COUNTRY_INFO!A14)","v":"Gabon"},{"$f":"IF(COUNTRY_INFO!B14=0,\" \",COUNTRY_INFO!B14)","v":"Ouest"},{"$f":"IF(COUNTRY_INFO!C14=0,\" \",COUNTRY_INFO!C14)","v":"Komo-Kango"},{"$f":"IF(AND(COUNTRY_INFO!$U$9:$U$1000=\"T3 (ALB/MBD)\",COUNTRY_INFO!$V$9:$V$1000=\"T3 (ALB/MBD)\"), \"T3 (ALB/MBD)\", \" \")","v":" "},null,null,null,null,null,0,null,null,null,0," "," "," "," "]
[{"$f":"IF(COUNTRY_INFO!A15=0,\" \",COUNTRY_INFO!A15)","v":"Gabon"},{"$f":"IF(COUNTRY_INFO!B15=0,\" \",COUNTRY_INFO!B15)","v":"Ouest"},{"$f":"IF(COUNTRY_INFO!C15=0,\" \",COUNTRY_INFO!C15)","v":"Noya"},{"$f":"IF(AND(COUNTRY_INFO!$U$9:$U$1000=\"T3 (ALB/MBD)\",COUNTRY_INFO!$V$9:$V$1000=\"T3 (ALB/MBD)\"), \"T3 (ALB/MBD)\", \" \")","v":" "},null,null,null,null,null,0,null,null,null,0," "," "," "," "]
[{"$f":"IF(COUNTRY_INFO!A16=0,\" \",COUNTRY_INFO!A16)","v":"Gabon"},{"$f":"IF(COUNTRY_INFO!B16=0,\" \",COUNTRY_INFO!B16)","v":"Sud-Est"},{"$f":"IF(COUNTRY_INFO!C16=0,\" \",COUNTRY_INFO!C16)","v":"Bayi-brikolo"},{"$f":"IF(AND(COUNTRY_INFO!$U$9:$U$1000=\"T3 (ALB/MBD)\",COUNTRY_INFO!$V$9:$V$1000=\"T3 (ALB/MBD)\"), \"T3 (ALB/MBD)\", \" \")","v":"T3 (ALB/MBD)"},"MBD","012019",null,380,null,380,null,380,null,380," ",100," ",100]
[{"$f":"IF(COUNTRY_INFO!A17=0,\" \",COUNTRY_INFO!A17)","v":"Gabon"},{"$f":"IF(COUNTRY_INFO!B17=0,\" \",COUNTRY_INFO!B17)","v":"Sud-Est"},{"$f":"IF(COUNTRY_INFO!C17=0,\" \",COUNTRY_INFO!C17)","v":"Lékoni-Lékori"},{"$f":"IF(AND(COUNTRY_INFO!$U$9:$U$1000=\"T3 (ALB/MBD)\",COUNTRY_INFO!$V$9:$V$1000=\"T3 (ALB/MBD)\"), \"T3 (ALB/MBD)\", \" \")","v":" "},null,null,null,null,null,0,null,null,null,0," "," "," "," "]
[{"$f":"IF(COUNTRY_INFO!A18=0,\" \",COUNTRY_INFO!A18)","v":"Gabon"},{"$f":"IF(COUNTRY_INFO!B18=0,\" \",COUNTRY_INFO!B18)","v":"Sud-Est"},{"$f":"IF(COUNTRY_INFO!C18=0,\" \",COUNTRY_INFO!C18)","v":"Lékoko"},{"$f":"IF(AND(COUNTRY_INFO!$U$9:$U$1000=\"T3 (ALB/MBD)\",COUNTRY_INFO!$V$9:$V$1000=\"T3 (ALB/MBD)\"), \"T3 (ALB/MBD)\", \" \")","v":" "},null,null,null,null,null,0,null,null,null,0," "," "," "," "]
[{"$f":"IF(COUNTRY_INFO!A19=0,\" \",COUNTRY_INFO!A19)","v":"Gabon"},{"$f":"IF(COUNTRY_INFO!B19=0,\" \",COUNTRY_INFO!B19)","v":"Sud-Est"},{"$f":"IF(COUNTRY_INFO!C19=0,\" \",COUNTRY_INFO!C19)","v":"Djouori-Agnili"},{"$f":"IF(AND(COUNTRY_INFO!$U$9:$U$1000=\"T3 (ALB/MBD)\",COUNTRY_INFO!$V$9:$V$1000=\"T3 (ALB/MBD)\"), \"T3 (ALB/MBD)\", \" \")","v":" "},null,null,null,null,null,0,null,null,null,0," "," "," "," "]
[{"$f":"IF(COUNTRY_INFO!A20=0,\" \",COUNTRY_INFO!A20)","v":"Gabon"},{"$f":"IF(COUNTRY_INFO!B20=0,\" \",COUNTRY_INFO!B20)","v":"Sud-Est"},{"$f":"IF(COUNTRY_INFO!C20=0,\" \",COUNTRY_INFO!C20)","v":"Ogooué-Létili"},{"$f":"IF(AND(COUNTRY_INFO!$U$9:$U$1000=\"T3 (ALB/MBD)\",COUNTRY_INFO!$V$9:$V$1000=\"T3 (ALB/MBD)\"), \"T3 (ALB/MBD)\", \" \")","v":"T3 (ALB/MBD)"},"MBD","012019",null,373,null,373,null,373,null,373," ",100," ",100]
[{"$f":"IF(COUNTRY_INFO!A21=0,\" \",COUNTRY_INFO!A21)","v":"Gabon"},{"$f":"IF(COUNTRY_INFO!B21=0,\" \",COUNTRY_INFO!B21)","v":"Sud-Est"},{"$f":"IF(COUNTRY_INFO!C21=0,\" \",COUNTRY_INFO!C21)","v":"Mpassa"},{"$f":"IF(AND(COUNTRY_INFO!$U$9:$U$1000=\"T3 (ALB/MBD)\",COUNTRY_INFO!$V$9:$V$1000=\"T3 (ALB/MBD)\"), \"T3 (ALB/MBD)\", \" \")","v":" "},null,null,null,null,null,0,null,null,null,0," "," "," "," "]
[{"$f":"IF(COUNTRY_INFO!A22=0,\" \",COUNTRY_INFO!A22)","v":"Gabon"},{"$f":"IF(COUNTRY_INFO!B22=0,\" \",COUNTRY_INFO!B22)","v":"Sud-Est"},{"$f":"IF(COUNTRY_INFO!C22=0,\" \",COUNTRY_INFO!C22)","v":"Plateaux"},{"$f":"IF(AND(COUNTRY_INFO!$U$9:$U$1000=\"T3 (ALB/MBD)\",COUNTRY_INFO!$V$9:$V$1000=\"T3 (ALB/MBD)\"), \"T3 (ALB/MBD)\", \" \")","v":" "},null,null,null,null,null,0,null,null,null,0," "," "," "," "]
[{"$f":"IF(COUNTRY_INFO!A23=0,\" \",COUNTRY_INFO!A23)","v":"Gabon"},{"$f":"IF(COUNTRY_INFO!B23=0,\" \",COUNTRY_INFO!B23)","v":"Sud-Est"},{"$f":"IF(COUNTRY_INFO!C23=0,\" \",COUNTRY_INFO!C23)","v":"Lébombi-Léyou"},{"$f":"IF(AND(COUNTRY_INFO!$U$9:$U$1000=\"T3 (ALB/MBD)\",COUNTRY_INFO!$V$9:$V$1000=\"T3 (ALB/MBD)\"), \"T3 (ALB/MBD)\", \" \")","v":" "},null,null,null,null,null,0,null,null,null,0," "," "," "," "]
[{"$f":"IF(COUNTRY_INFO!A24=0,\" \",COUNTRY_INFO!A24)","v":"Gabon"},{"$f":"IF(COUNTRY_INFO!B24=0,\" \",COUNTRY_INFO!B24)","v":"Sud-Est"},{"$f":"IF(COUNTRY_INFO!C24=0,\" \",COUNTRY_INFO!C24)","v":"Lékabi-Léwolo"},{"$f":"IF(AND(COUNTRY_INFO!$U$9:$U$1000=\"T3 (ALB/MBD)\",COUNTRY_INFO!$V$9:$V$1000=\"T3 (ALB/MBD)\"), \"T3 (ALB/MBD)\", \" \")","v":" "},null,null,null,null,null,0,null,null,null,0," "," "," "," "]
[{"$f":"IF(COUNTRY_INFO!A25=0,\" \",COUNTRY_INFO!A25)","v":"Gabon"},{"$f":"IF(COUNTRY_INFO!B25=0,\" \",COUNTRY_INFO!B25)","v":"Sud-Est"},{"$f":"IF(COUNTRY_INFO!C25=0,\" \",COUNTRY_INFO!C25)","v":"Sébé-Brikolo"},{"$f":"IF(AND(COUNTRY_INFO!$U$9:$U$1000=\"T3 (ALB/MBD)\",COUNTRY_INFO!$V$9:$V$1000=\"T3 (ALB/MBD)\"), \"T3 (ALB/MBD)\", \" \")","v":" "},null,null,null,null,null,0,null,null,null,0," "," "," "," "]
[{"$f":"IF(COUNTRY_INFO!A26=0,\" \",COUNTRY_INFO!A26)","v":"Gabon"},{"$f":"IF(COUNTRY_INFO!B26=0,\" \",COUNTRY_INFO!B26)","v":"Sud-Est"},{"$f":"IF(COUNTRY_INFO!C26=0,\" \",COUNTRY_INFO!C26)","v":"Djoué"},{"$f":"IF(AND(COUNTRY_INFO!$U$9:$U$1000=\"T3 (ALB/MBD)\",COUNTRY_INFO!$V$9:$V$1000=\"T3 (ALB/MBD)\"), \"T3 (ALB/MBD)\", \" \")","v":" "},null,null,null,null,null,0,null,null,null,0," "," "," "," "]
[{"$f":"IF(COUNTRY_INFO!A27=0,\" \",COUNTRY_INFO!A27)","v":"Gabon"},{"$f":"IF(COUNTRY_INFO!B27=0,\" \",COUNTRY_INFO!B27)","v":"Centre"},{"$f":"IF(COUNTRY_INFO!C27=0,\" \",COUNTRY_INFO!C27)","v":"Ogooué-et-Lacs"},{"$f":"IF(AND(COUNTRY_INFO!$U$9:$U$1000=\"T3 (ALB/MBD)\",COUNTRY_INFO!$V$9:$V$1000=\"T3 (ALB/MBD)\"), \"T3 (ALB/MBD)\", \" \")","v":" "},null,null,null,null,null,0,null,null,null,0," "," "," "," "]
[{"$f":"IF(COUNTRY_INFO!A28=0,\" \",COUNTRY_INFO!A28)","v":"Gabon"},{"$f":"IF(COUNTRY_INFO!B28=0,\" \",COUNTRY_INFO!B28)","v":"Centre"},{"$f":"IF(COUNTRY_INFO!C28=0,\" \",COUNTRY_INFO!C28)","v":"Abanga-Bigné"},{"$f":"IF(AND(COUNTRY_INFO!$U$9:$U$1000=\"T3 (ALB/MBD)\",COUNTRY_INFO!$V$9:$V$1000=\"T3 (ALB/MBD)\"), \"T3 (ALB/MBD)\", \" \")","v":" "},null,null,null,null,null,0,null,null,null,0," "," "," "," "]
[{"$f":"IF(COUNTRY_INFO!A29=0,\" \",COUNTRY_INFO!A29)","v":"Gabon"},{"$f":"IF(COUNTRY_INFO!B29=0,\" \",COUNTRY_INFO!B29)","v":"Centre-Sud"},{"$f":"IF(COUNTRY_INFO!C29=0,\" \",COUNTRY_INFO!C29)","v":"Tsamba-Magotsi"},{"$f":"IF(AND(COUNTRY_INFO!$U$9:$U$1000=\"T3 (ALB/MBD)\",COUNTRY_INFO!$V$9:$V$1000=\"T3 (ALB/MBD)\"), \"T3 (ALB/MBD)\", \" \")","v":" "},null,null,null,null,null,0,null,null,null,0," "," "," "," "]
[{"$f":"IF(COUNTRY_INFO!A30=0,\" \",COUNTRY_INFO!A30)","v":"Gabon"},{"$f":"IF(COUNTRY_INFO!B30=0,\" \",COUNTRY_INFO!B30)","v":"Centre-Sud"},{"$f":"IF(COUNTRY_INFO!C30=0,\" \",COUNTRY_INFO!C30)","v":"Louetsi-Wano"},{"$f":"IF(AND(COUNTRY_INFO!$U$9:$U$1000=\"T3 (ALB/MBD)\",COUNTRY_INFO!$V$9:$V$1000=\"T3 (ALB/MBD)\"), \"T3 (ALB/MBD)\", \" \")","v":" "},null,null,null,null,null,0,null,null,null,0," "," "," "," "]
[{"$f":"IF(COUNTRY_INFO!A31=0,\" \",COUNTRY_INFO!A31)","v":"Gabon"},{"$f":"IF(COUNTRY_INFO!B31=0,\" \",COUNTRY_INFO!B31)","v":"Centre-Sud"},{"$f":"IF(COUNTRY_INFO!C31=0,\" \",COUNTRY_INFO!C31)","v":"Louetsi-Bibaka"},{"$f":"IF(AND(COUNTRY_INFO!$U$9:$U$1000=\"T3 (ALB/MBD)\",COUNTRY_INFO!$V$9:$V$1000=\"T3 (ALB/MBD)\"), \"T3 (ALB/MBD)\", \" \")","v":"T3 (ALB/MBD)"},"MBD","012019",null,515,null,515,null,515,null,515," ",100," ",100]
[{"$f":"IF(COUNTRY_INFO!A32=0,\" \",COUNTRY_INFO!A32)","v":"Gabon"},{"$f":"IF(COUNTRY_INFO!B32=0,\" \",COUNTRY_INFO!B32)","v":"Centre-Sud"},{"$f":"IF(COUNTRY_INFO!C32=0,\" \",COUNTRY_INFO!C32)","v":"Ndolou"},{"$f":"IF(AND(COUNTRY_INFO!$U$9:$U$1000=\"T3 (ALB/MBD)\",COUNTRY_INFO!$V$9:$V$1000=\"T3 (ALB/MBD)\"), \"T3 (ALB/MBD)\", \" \")","v":" "},null,null,null,null,null,0,null,null,null,0," "," "," "," "]
[{"$f":"IF(COUNTRY_INFO!A33=0,\" \",COUNTRY_INFO!A33)","v":"Gabon"},{"$f":"IF(COUNTRY_INFO!B33=0,\" \",COUNTRY_INFO!B33)","v":"Centre-Sud"},{"$f":"IF(COUNTRY_INFO!C33=0,\" \",COUNTRY_INFO!C33)","v":"Boumi-Louetsi"},{"$f":"IF(AND(COUNTRY_INFO!$U$9:$U$1000=\"T3 (ALB/MBD)\",COUNTRY_INFO!$V$9:$V$1000=\"T3 (ALB/MBD)\"), \"T3 (ALB/MBD)\", \" \")","v":" "},null,null,null,null,null,0,null,null,null,0," "," "," "," "]
[{"$f":"IF(COUNTRY_INFO!A34=0,\" \",COUNTRY_INFO!A34)","v":"Gabon"},{"$f":"IF(COUNTRY_INFO!B34=0,\" \",COUNTRY_INFO!B34)","v":"Centre-Sud"},{"$f":"IF(COUNTRY_INFO!C34=0,\" \",COUNTRY_INFO!C34)","v":"Ogoulou"},{"$f":"IF(AND(COUNTRY_INFO!$U$9:$U$1000=\"T3 (ALB/MBD)\",COUNTRY_INFO!$V$9:$V$1000=\"T3 (ALB/MBD)\"), \"T3 (ALB/MBD)\", \" \")","v":" "},null,null,null,null,null,0,null,null,null,0," "," "," "," "]
[{"$f":"IF(COUNTRY_INFO!A35=0,\" \",COUNTRY_INFO!A35)","v":"Gabon"},{"$f":"IF(COUNTRY_INFO!B35=0,\" \",COUNTRY_INFO!B35)","v":"Centre-Sud"},{"$f":"IF(COUNTRY_INFO!C35=0,\" \",COUNTRY_INFO!C35)","v":"Douya-Onoye"},{"$f":"IF(AND(COUNTRY_INFO!$U$9:$U$1000=\"T3 (ALB/MBD)\",COUNTRY_INFO!$V$9:$V$1000=\"T3 (ALB/MBD)\"), \"T3 (ALB/MBD)\", \" \")","v":" "},null,null,null,null,null,0,null,null,null,0," "," "," "," "]
[{"$f":"IF(COUNTRY_INFO!A36=0,\" \",COUNTRY_INFO!A36)","v":"Gabon"},{"$f":"IF(COUNTRY_INFO!B36=0,\" \",COUNTRY_INFO!B36)","v":"Centre-Sud"},{"$f":"IF(COUNTRY_INFO!C36=0,\" \",COUNTRY_INFO!C36)","v":"Dola"},{"$f":"IF(AND(COUNTRY_INFO!$U$9:$U$1000=\"T3 (ALB/MBD)\",COUNTRY_INFO!$V$9:$V$1000=\"T3 (ALB/MBD)\"), \"T3 (ALB/MBD)\", \" \")","v":" "},null,null,null,null,null,0,null,null,null,0," "," "," "," "]
[{"$f":"IF(COUNTRY_INFO!A37=0,\" \",COUNTRY_INFO!A37)","v":"Gabon"},{"$f":"IF(COUNTRY_INFO!B37=0,\" \",COUNTRY_INFO!B37)","v":"Centre-Sud"},{"$f":"IF(COUNTRY_INFO!C37=0,\" \",COUNTRY_INFO!C37)","v":"Mougalaba"},{"$f":"IF(AND(COUNTRY_INFO!$U$9:$U$1000=\"T3 (ALB/MBD)\",COUNTRY_INFO!$V$9:$V$1000=\"T3 (ALB/MBD)\"), \"T3 (ALB/MBD)\", \" \")","v":" "},null,null,null,null,null,0,null,null,null,0," "," "," "," "]
[{"$f":"IF(COUNTRY_INFO!A38=0,\" \",COUNTRY_INFO!A38)","v":"Gabon"},{"$f":"IF(COUNTRY_INFO!B38=0,\" \",COUNTRY_INFO!B38)","v":"Sud"},{"$f":"IF(COUNTRY_INFO!C38=0,\" \",COUNTRY_INFO!C38)","v":"Doutsila"},{"$f":"IF(AND(COUNTRY_INFO!$U$9:$U$1000=\"T3 (ALB/MBD)\",COUNTRY_INFO!$V$9:$V$1000=\"T3 (ALB/MBD)\"), \"T3 (ALB/MBD)\", \" \")","v":" "},null,null,null,null,null,0,null,null,null,0," "," "," "," "]
[{"$f":"IF(COUNTRY_INFO!A39=0,\" \",COUNTRY_INFO!A39)","v":"Gabon"},{"$f":"IF(COUNTRY_INFO!B39=0,\" \",COUNTRY_INFO!B39)","v":"Sud"},{"$f":"IF(COUNTRY_INFO!C39=0,\" \",COUNTRY_INFO!C39)","v":"Basse-Banio"},{"$f":"IF(AND(COUNTRY_INFO!$U$9:$U$1000=\"T3 (ALB/MBD)\",COUNTRY_INFO!$V$9:$V$1000=\"T3 (ALB/MBD)\"), \"T3 (ALB/MBD)\", \" \")","v":" "},null,null,null,null,null,0,null,null,null,0," "," "," "," "]
[{"$f":"IF(COUNTRY_INFO!A40=0,\" \",COUNTRY_INFO!A40)","v":"Gabon"},{"$f":"IF(COUNTRY_INFO!B40=0,\" \",COUNTRY_INFO!B40)","v":"Sud"},{"$f":"IF(COUNTRY_INFO!C40=0,\" \",COUNTRY_INFO!C40)","v":"Douigny"},{"$f":"IF(AND(COUNTRY_INFO!$U$9:$U$1000=\"T3 (ALB/MBD)\",COUNTRY_INFO!$V$9:$V$1000=\"T3 (ALB/MBD)\"), \"T3 (ALB/MBD)\", \" \")","v":"T3 (ALB/MBD)"},"MBD","012019",null,909,null,909,null,608,null,608," ",66.886688668866896," ",66.886688668866896]
[{"$f":"IF(COUNTRY_INFO!A41=0,\" \",COUNTRY_INFO!A41)","v":"Gabon"},{"$f":"IF(COUNTRY_INFO!B41=0,\" \",COUNTRY_INFO!B41)","v":"Sud"},{"$f":"IF(COUNTRY_INFO!C41=0,\" \",COUNTRY_INFO!C41)","v":"Mongo"},{"$f":"IF(AND(COUNTRY_INFO!$U$9:$U$1000=\"T3 (ALB/MBD)\",COUNTRY_INFO!$V$9:$V$1000=\"T3 (ALB/MBD)\"), \"T3 (ALB/MBD)\", \" \")","v":" "},null,null,null,null,null,0,null,null,null,0," "," "," "," "]
[{"$f":"IF(COUNTRY_INFO!A42=0,\" \",COUNTRY_INFO!A42)","v":"Gabon"},{"$f":"IF(COUNTRY_INFO!B42=0,\" \",COUNTRY_INFO!B42)","v":"Sud"},{"$f":"IF(COUNTRY_INFO!C42=0,\" \",COUNTRY_INFO!C42)","v":"Haute-Banio"},{"$f":"IF(AND(COUNTRY_INFO!$U$9:$U$1000=\"T3 (ALB/MBD)\",COUNTRY_INFO!$V$9:$V$1000=\"T3 (ALB/MBD)\"), \"T3 (ALB/MBD)\", \" \")","v":"T3 (ALB/MBD)"},"MBD","012019",null,471,null,471,null,150,null,150," ",31.847133757961782," ",31.847133757961782]
[{"$f":"IF(COUNTRY_INFO!A43=0,\" \",COUNTRY_INFO!A43)","v":"Gabon"},{"$f":"IF(COUNTRY_INFO!B43=0,\" \",COUNTRY_INFO!B43)","v":"Sud"},{"$f":"IF(COUNTRY_INFO!C43=0,\" \",COUNTRY_INFO!C43)","v":"Mougoutsi"},{"$f":"IF(AND(COUNTRY_INFO!$U$9:$U$1000=\"T3 (ALB/MBD)\",COUNTRY_INFO!$V$9:$V$1000=\"T3 (ALB/MBD)\"), \"T3 (ALB/MBD)\", \" \")","v":" "},null,null,null,null,null,0,null,null,null,0," "," "," "," "]
[{"$f":"IF(COUNTRY_INFO!A44=0,\" \",COUNTRY_INFO!A44)","v":"Gabon"},{"$f":"IF(COUNTRY_INFO!B44=0,\" \",COUNTRY_INFO!B44)","v":"Est"},{"$f":"IF(COUNTRY_INFO!C44=0,\" \",COUNTRY_INFO!C44)","v":"Lopé"},{"$f":"IF(AND(COUNTRY_INFO!$U$9:$U$1000=\"T3 (ALB/MBD)\",COUNTRY_INFO!$V$9:$V$1000=\"T3 (ALB/MBD)\"), \"T3 (ALB/MBD)\", \" \")","v":" "},null,null,null,null,null,0,null,null,null,0," "," "," "," "]
[{"$f":"IF(COUNTRY_INFO!A45=0,\" \",COUNTRY_INFO!A45)","v":"Gabon"},{"$f":"IF(COUNTRY_INFO!B45=0,\" \",COUNTRY_INFO!B45)","v":"Est"},{"$f":"IF(COUNTRY_INFO!C45=0,\" \",COUNTRY_INFO!C45)","v":"Ivindo"},{"$f":"IF(AND(COUNTRY_INFO!$U$9:$U$1000=\"T3 (ALB/MBD)\",COUNTRY_INFO!$V$9:$V$1000=\"T3 (ALB/MBD)\"), \"T3 (ALB/MBD)\", \" \")","v":" "},null,null,null,null,null,0,null,null,null,0," "," "," "," "]
[{"$f":"IF(COUNTRY_INFO!A46=0,\" \",COUNTRY_INFO!A46)","v":"Gabon"},{"$f":"IF(COUNTRY_INFO!B46=0,\" \",COUNTRY_INFO!B46)","v":"Est"},{"$f":"IF(COUNTRY_INFO!C46=0,\" \",COUNTRY_INFO!C46)","v":"Zadié"},{"$f":"IF(AND(COUNTRY_INFO!$U$9:$U$1000=\"T3 (ALB/MBD)\",COUNTRY_INFO!$V$9:$V$1000=\"T3 (ALB/MBD)\"), \"T3 (ALB/MBD)\", \" \")","v":"T3 (ALB/MBD)"},"MBD","012019",null,3225,null,3225,null,1827,null,1827," ",56.651162790697676," ",56.651162790697676]
[{"$f":"IF(COUNTRY_INFO!A47=0,\" \",COUNTRY_INFO!A47)","v":"Gabon"},{"$f":"IF(COUNTRY_INFO!B47=0,\" \",COUNTRY_INFO!B47)","v":"Est"},{"$f":"IF(COUNTRY_INFO!C47=0,\" \",COUNTRY_INFO!C47)","v":"Mvoung"},{"$f":"IF(AND(COUNTRY_INFO!$U$9:$U$1000=\"T3 (ALB/MBD)\",COUNTRY_INFO!$V$9:$V$1000=\"T3 (ALB/MBD)\"), \"T3 (ALB/MBD)\", \" \")","v":" "},null,null,null,null,null,0,null,null,null,0," "," "," "," "]
[{"$f":"IF(COUNTRY_INFO!A48=0,\" \",COUNTRY_INFO!A48)","v":"Gabon"},{"$f":"IF(COUNTRY_INFO!B48=0,\" \",COUNTRY_INFO!B48)","v":"Centre-Est"},{"$f":"IF(COUNTRY_INFO!C48=0,\" \",COUNTRY_INFO!C48)","v":"Offoué-Onoye"},{"$f":"IF(AND(COUNTRY_INFO!$U$9:$U$1000=\"T3 (ALB/MBD)\",COUNTRY_INFO!$V$9:$V$1000=\"T3 (ALB/MBD)\"), \"T3 (ALB/MBD)\", \" \")","v":" "},null,null,null,null,null,0,null,null,null,0," "," "," "," "]
[{"$f":"IF(COUNTRY_INFO!A49=0,\" \",COUNTRY_INFO!A49)","v":"Gabon"},{"$f":"IF(COUNTRY_INFO!B49=0,\" \",COUNTRY_INFO!B49)","v":"Centre-Est"},{"$f":"IF(COUNTRY_INFO!C49=0,\" \",COUNTRY_INFO!C49)","v":"Lolo-Bouenguidi"},{"$f":"IF(AND(COUNTRY_INFO!$U$9:$U$1000=\"T3 (ALB/MBD)\",COUNTRY_INFO!$V$9:$V$1000=\"T3 (ALB/MBD)\"), \"T3 (ALB/MBD)\", \" \")","v":" "},null,null,null,null,null,0,null,null,null,0," "," "," "," "]
[{"$f":"IF(COUNTRY_INFO!A50=0,\" \",COUNTRY_INFO!A50)","v":"Gabon"},{"$f":"IF(COUNTRY_INFO!B50=0,\" \",COUNTRY_INFO!B50)","v":"Centre-Est"},{"$f":"IF(COUNTRY_INFO!C50=0,\" \",COUNTRY_INFO!C50)","v":"Mulundu"},{"$f":"IF(AND(COUNTRY_INFO!$U$9:$U$1000=\"T3 (ALB/MBD)\",COUNTRY_INFO!$V$9:$V$1000=\"T3 (ALB/MBD)\"), \"T3 (ALB/MBD)\", \" \")","v":" "},null,null,null,null,null,0,null,null,null,0," "," "," "," "]
[{"$f":"IF(COUNTRY_INFO!A51=0,\" \",COUNTRY_INFO!A51)","v":"Gabon"},{"$f":"IF(COUNTRY_INFO!B51=0,\" \",COUNTRY_INFO!B51)","v":"Centre-Est"},{"$f":"IF(COUNTRY_INFO!C51=0,\" \",COUNTRY_INFO!C51)","v":"Lombo-Bouenguidi"},{"$f":"IF(AND(COUNTRY_INFO!$U$9:$U$1000=\"T3 (ALB/MBD)\",COUNTRY_INFO!$V$9:$V$1000=\"T3 (ALB/MBD)\"), \"T3 (ALB/MBD)\", \" \")","v":" "},null,null,null,null,null,0,null,null,null,0," "," "," "," "]
[{"$f":"IF(COUNTRY_INFO!A52=0,\" \",COUNTRY_INFO!A52)","v":"Gabon"},{"$f":"IF(COUNTRY_INFO!B52=0,\" \",COUNTRY_INFO!B52)","v":"Maritime"},{"$f":"IF(COUNTRY_INFO!C52=0,\" \",COUNTRY_INFO!C52)","v":"Ndougou"},{"$f":"IF(AND(COUNTRY_INFO!$U$9:$U$1000=\"T3 (ALB/MBD)\",COUNTRY_INFO!$V$9:$V$1000=\"T3 (ALB/MBD)\"), \"T3 (ALB/MBD)\", \" \")","v":" "},null,null,null,null,null,0,null,null,null,0," "," "," "," "]
[{"$f":"IF(COUNTRY_INFO!A53=0,\" \",COUNTRY_INFO!A53)","v":"Gabon"},{"$f":"IF(COUNTRY_INFO!B53=0,\" \",COUNTRY_INFO!B53)","v":"Maritime"},{"$f":"IF(COUNTRY_INFO!C53=0,\" \",COUNTRY_INFO!C53)","v":"Etimboué"},{"$f":"IF(AND(COUNTRY_INFO!$U$9:$U$1000=\"T3 (ALB/MBD)\",COUNTRY_INFO!$V$9:$V$1000=\"T3 (ALB/MBD)\"), \"T3 (ALB/MBD)\", \" \")","v":" "},null,null,null,null,null,0,null,null,null,0," "," "," "," "]
[{"$f":"IF(COUNTRY_INFO!A54=0,\" \",COUNTRY_INFO!A54)","v":"Gabon"},{"$f":"IF(COUNTRY_INFO!B54=0,\" \",COUNTRY_INFO!B54)","v":"Maritime"},{"$f":"IF(COUNTRY_INFO!C54=0,\" \",COUNTRY_INFO!C54)","v":"Bendjé"},{"$f":"IF(AND(COUNTRY_INFO!$U$9:$U$1000=\"T3 (ALB/MBD)\",COUNTRY_INFO!$V$9:$V$1000=\"T3 (ALB/MBD)\"), \"T3 (ALB/MBD)\", \" \")","v":" "},null,null,null,null,null,0,null,null,null,0," "," "," "," "]
[{"$f":"IF(COUNTRY_INFO!A55=0,\" \",COUNTRY_INFO!A55)","v":"Gabon"},{"$f":"IF(COUNTRY_INFO!B55=0,\" \",COUNTRY_INFO!B55)","v":"Nord"},{"$f":"IF(COUNTRY_INFO!C55=0,\" \",COUNTRY_INFO!C55)","v":"Ntem"},{"$f":"IF(AND(COUNTRY_INFO!$U$9:$U$1000=\"T3 (ALB/MBD)\",COUNTRY_INFO!$V$9:$V$1000=\"T3 (ALB/MBD)\"), \"T3 (ALB/MBD)\", \" \")","v":" "},null,null,null,null,null,0,null,null,null,0," "," "," "," "]
[{"$f":"IF(COUNTRY_INFO!A56=0,\" \",COUNTRY_INFO!A56)","v":"Gabon"},{"$f":"IF(COUNTRY_INFO!B56=0,\" \",COUNTRY_INFO!B56)","v":"Nord"},{"$f":"IF(COUNTRY_INFO!C56=0,\" \",COUNTRY_INFO!C56)","v":"Haut - Komo"},{"$f":"IF(AND(COUNTRY_INFO!$U$9:$U$1000=\"T3 (ALB/MBD)\",COUNTRY_INFO!$V$9:$V$1000=\"T3 (ALB/MBD)\"), \"T3 (ALB/MBD)\", \" \")","v":" "},null,null,null,null,null,0,null,null,null,0," "," "," "," "]
[{"$f":"IF(COUNTRY_INFO!A57=0,\" \",COUNTRY_INFO!A57)","v":"Gabon"},{"$f":"IF(COUNTRY_INFO!B57=0,\" \",COUNTRY_INFO!B57)","v":"Nord"},{"$f":"IF(COUNTRY_INFO!C57=0,\" \",COUNTRY_INFO!C57)","v":"Haut-Ntem"},{"$f":"IF(AND(COUNTRY_INFO!$U$9:$U$1000=\"T3 (ALB/MBD)\",COUNTRY_INFO!$V$9:$V$1000=\"T3 (ALB/MBD)\"), \"T3 (ALB/MBD)\", \" \")","v":" "},null,null,null,null,null,0,null,null,null,0," "," "," "," "]
[{"$f":"IF(COUNTRY_INFO!A58=0,\" \",COUNTRY_INFO!A58)","v":"Gabon"},{"$f":"IF(COUNTRY_INFO!B58=0,\" \",COUNTRY_INFO!B58)","v":"Nord"},{"$f":"IF(COUNTRY_INFO!C58=0,\" \",COUNTRY_INFO!C58)","v":"Okano"},{"$f":"IF(AND(COUNTRY_INFO!$U$9:$U$1000=\"T3 (ALB/MBD)\",COUNTRY_INFO!$V$9:$V$1000=\"T3 (ALB/MBD)\"), \"T3 (ALB/MBD)\", \" \")","v":" "},null,null,null,null,null,0,null,null,null,0," "," "," "," "]
[{"$f":"IF(COUNTRY_INFO!A59=0,\" \",COUNTRY_INFO!A59)","v":"Gabon"},{"$f":"IF(COUNTRY_INFO!B59=0,\" \",COUNTRY_INFO!B59)","v":"Nord"},{"$f":"IF(COUNTRY_INFO!C59=0,\" \",COUNTRY_INFO!C59)","v":"Woleu"},{"$f":"IF(AND(COUNTRY_INFO!$U$9:$U$1000=\"T3 (ALB/MBD)\",COUNTRY_INFO!$V$9:$V$1000=\"T3 (ALB/MBD)\"), \"T3 (ALB/MBD)\", \" \")","v":" "},null,null,null,null,null,0,null,null,null,0," "," "," "," "]

{"sheet":"DISTRICT","index":9,"n_rows":59,"n_cols":56,"rows_kept":59,"cut":false,"hidden":false,"merged":[[3,0,3,2],[5,0,5,2],[5,4,5,8],[5,10,5,14],[5,16,5,24],[5,26,5,34],[5,3,6,3],[5,9,6,9],[5,15,6,15],[5,25,6,25]]}
["Nombre d'individus traités"]
["Structure administrative, population traitée par groupe d'âge et sexe"]
[]
["TOTAL",null,null,{"$f":"SUM(D$9:D$1000)","v":361121},{"$f":"SUM(E$9:E$1000)","v":0},{"$f":"SUM(F$9:F$1000)","v":0},{"$f":"SUM(G$9:G$1000)","v":0},{"$f":"SUM(H$9:H$1000)","v":0},{"$f":"IF(D4>0, IF(H4/D4*100<>0, H4/D4*100, \"-\"),0)","v":"-"},{"$f":"SUM(J$9:J$1000)","v":721771},{"$f":"SUM(K$9:K$1000)","v":0},{"$f":"SUM(L$9:L$1000)","v":0},{"$f":"SUM(M$9:M$1000)","v":0},{"$f":"SUM(N$9:N$1000)","v":0},{"$f":"IF(J4>0, IF(N4/J4*100<>0, N4/J4*100, \"-\"),0)","v":"-"},{"$f":"SUM(P$9:P$1000)","v":483207},{"$f":"SUM(Q$9:Q$1000)","v":60782},{"$f":"SUM(R$9:R$1000)","v":62170},{"$f":"SUM(S$9:S$1000)","v":128533},{"$f":"SUM(T$9:T$1000)","v":0},null,128533,null,{"$f":"SUM(X$9:X$1000)","v":128533},{"$f":"IF(P4>0, IF(X4/P4*100<>0, X4/P4*100, \"-\"),0)","v":26.599987169060054},{"$f":"SUM(Z$9:Z$1000)","v":192878.62000000005},80333,82666,189108,141006.87000000002,null,0,null,141006.87000000002,{"$f":"IF(Z4>0, IF(AH4/Z4*100<>0, AH4/Z4*100, \"-\"),0)","v":73.106531973320827}]
[]
["Structure administrative du pays",null,null,"Population nécessitant la CP pour FL","Population traitée pour la filariose lymphatique",null,null,null,null,"Population nécessitant la CP pour ONCHO","Population traitée pour l'onchocercose",null,null,null,null,"Population nécessitant la CP pour STH","Population traitée pour les géohelminthiases",null,null,null,null,null,null,null,null,"Population nécessitant la CP pour SCH","Population traitée pour la schistosomiase",null,null,null,null,null,null,null,null,null,null,null,null,null,null,{"$f":"SUM(AP9:AP1000)","v":33387.533185258304},156713.23526072816,389238.40173973644,501825.51867535757,{"$f":"SUM(AT9:AT1000)","v":1081164.6888610804},{"$f":"COUNTIF(AU9:AU1000,\"Y\")","v":21},{"$f":"SUM(AV9:AV1000)","v":0},200086,0,{"$f":"SUM(AY9:AY1000)","v":200086},0,175065.52,0,175065.52,{"$f":"IF(AT6<>0,BC6/AT6,0)","v":0.16192308332268726}]
["Pays","Région/Département","District",null,"Masculine","Féminine","Total traité","Total traité ayant besoin de CP","(%)",null,"Masculine","Féminine","Total traité","Total traité ayant besoin de CP","(%)",null,"Masculine","Féminine","Total traité","EAPréS traité ayant besoin de CP","EAPréS (%)","EAS traité ayant besoin de CP","EAS (%)","Total traité ayant besoin de CP","(%)",null,"Masculine","Féminine","Total traité","EAS traité ayant besoin de CP","EAS (%)","Adultes traité ayant besoin de CP","Adultes (%)","Total traité ayant besoin de CP","(%)",null,"LF","ONCHO","STH","SCH-SAC","SCH_Adults","<1","PreSAC","SAC","Adults","Total","Dis","PreSAC","SAC","Adults","Total","PreSAC","SAC","Adults","Total","Coverage"]
[]
[{"$f":"IF(COUNTRY_INFO!A9=0,\" \",COUNTRY_INFO!A9)","v":"Gabon"},{"$f":"IF(COUNTRY_INFO!B9=0,\" \",COUNTRY_INFO!B9)","v":"Libreville-Owendo"},{"$f":"IF(COUNTRY_INFO!C9=0,\" \",COUNTRY_INFO!C9)","v":"Libreville 1"},{"$f":"COUNTRY_INFO!M9","v":0},null,null,{"$f":"MAX('MDA1'!M9,'MDA4'!U9)","v":0},{"$f":"IF(AND(COUNTRY_INFO!H9>0,COUNTRY_INFO!H9<4),IF(D9>MAX('MDA1'!M9,'MDA4'!U9),MAX('MDA1'!M9,'MDA4'!U9),D9),0)","v":0},{"$f":"IF(AND(COUNTRY_INFO!H9>0,COUNTRY_INFO!H9<4), IF(G9/D9*100<>0, IF(G9/D9*100>100,100,G9/D9*100), \"-\"),0)","v":0},{"$f":"COUNTRY_INFO!N9","v":"Inconnu"},null,null,{"$f":"MAX('MDA1'!M9,MAX('MDA3'!I9,'MDA3'!L9)+MAX('MDA3'!J9,'MDA3'!M9))","v":0},{"$f":"IF(AND(COUNTRY_INFO!I9>0,COUNTRY_INFO!I9<4),IF(J9>MAX('MDA1'!M9,MAX('MDA3'!I9,'MDA3'!L9)+MAX('MDA3'!J9,'MDA3'!M9)),MAX('MDA1'!M9,MAX('MDA3'!I9,'MDA3'!L9)+MAX('MDA3'!J9,'MDA3'!M9)),J9),0)","v":0},{"$f":"IF(AND(COUNTRY_INFO!I9>0,COUNTRY_INFO!I9<4), IF(M9/J9*100<>0, IF(M9/J9*100>100,100,M9/J9*100), \"-\"),0)","v":0},{"$f":"COUNTRY_INFO!O9","v":103051},6880,7638,{"$f":"SUM(MAX('MDA4'!N9, 'T1'!L9, MAX(T3_R1!K9, T3_R2!K9)), MAX('MDA1'!K9, 'MDA4'!O9, 'T1'!M9, MAX(T3_R1!L9, T3_R2!L9)), MAX('MDA1'!L9, 'MDA4'!P9, 'T1'!N9, MAX(T3_R1!M9, T3_R2!M9)))","v":14518},{"$f":"IF(AND(COUNTRY_INFO!J9>1,COUNTRY_INFO!J9<4),IF(COUNTRY_INFO!E9>MAX('MDA4'!N9,'T1'!L9,MAX(T3_R1!K9,T3_R2!K9)),MAX('MDA4'!N9,'T1'!L9,MAX(T3_R1!K9,T3_R2!K9)),COUNTRY_INFO!E9),0)","v":0},{"$f":"IF(AND(COUNTRY_INFO!J9>1,COUNTRY_INFO!J9<4), IF(T9/COUNTRY_INFO!E9*100<>0, IF(T9/COUNTRY_INFO!E9*100>100,100,T9/COUNTRY_INFO!E9*100), \"-\"),0)","v":"-"},{"$f":"IF(AND(COUNTRY_INFO!J9>1,COUNTRY_INFO!J9<4),IF(COUNTRY_INFO!F9>MAX('MDA1'!K9,'MDA4'!O9,'T1'!M9,MAX(T3_R1!L9,T3_R2!L9)),MAX('MDA1'!K9,'MDA4'!O9,'T1'!M9,MAX(T3_R1!L9,T3_R2!L9)),COUNTRY_INFO!F9),0)","v":14518},{"$f":"IF(AND(COUNTRY_INFO!J9>1,COUNTRY_INFO!J9<4), IF(V9/COUNTRY_INFO!F9*100<>0, IF(V9/COUNTRY_INFO!F9*100>100,100,V9/COUNTRY_INFO!F9*100), \"-\"),0)","v":20.850507690761034},{"$f":"SUM(T9,V9)","v":14518},{"$f":"IF(AND(COUNTRY_INFO!J9>1,COUNTRY_INFO!J9<4), IF(S9/P9*100<>0, IF(X9/P9*100>100,100,X9/P9*100), \"-\"),0)","v":14.088169935274767},{"$f":"COUNTRY_INFO!P9","v":22977.57},6880,7638,{"$f":"MAX('T1'!L9,'T2'!J9)+MAX('T1'!M9,'T2'!K9)+MAX('T1'!N9,'T2'!L9)","v":14518},{"$f":"IF(COUNTRY_INFO!K9=1,IF(COUNTRY_INFO!F9*0.33>MAX('T1'!M9,'T2'!K9),MAX('T1'!M9,'T2'!K9),COUNTRY_INFO!F9*0.33),IF(COUNTRY_INFO!K9=2,IF(COUNTRY_INFO!F9*0.5>MAX('T1'!M9,'T2'!K9),MAX('T1'!M9,'T2'!K9),COUNTRY_INFO!F9*0.5),IF(COUNTRY_INFO!K9=3,IF(COUNTRY_INFO!F9>MAX('T1'!M9,'T2'!K9),MAX('T1'!M9,'T2'!K9),COUNTRY_INFO!F9),0)))","v":14518},{"$f":"IF(AND(COUNTRY_INFO!K9>0,COUNTRY_INFO!K9<4),IF(Z9>0,IF(COUNTRY_INFO!K9=1, AD9/(COUNTRY_INFO!F9*0.33)*100, IF(COUNTRY_INFO!K9=2, AD9/(COUNTRY_INFO!F9*0.5)*100, IF(COUNTRY_INFO!K9=3, AD9/COUNTRY_INFO!F9*100))),\"-\"),0)","v":63.1833566386698},{"$f":"IF(COUNTRY_INFO!K9=2,IF(COUNTRY_INFO!G9*0.2>MAX('T1'!N9,'T2'!L9),MAX('T1'!N9,'T2'!L9),COUNTRY_INFO!G9*0.2),IF(COUNTRY_INFO!K9=3,IF(COUNTRY_INFO!G9>MAX('T1'!N9,'T2'!L9),MAX('T1'!N9,'T2'!L9),COUNTRY_INFO!G9),0))","v":0},{"$f":"IF(AND(COUNTRY_INFO!K9>0,COUNTRY_INFO!K9<4),IF(Z9>0,IF(COUNTRY_INFO!K9=1, 0, IF(COUNTRY_INFO!K9=2, AF9/(COUNTRY_INFO!G9*0.2)*100, IF(COUNTRY_INFO!K9=3, AF9/COUNTRY_INFO!G9*100))),\"-\"),0)","v":0},{"$f":"SUM(AD9,AF9)","v":14518},{"$f":"IF(AND(COUNTRY_INFO!K9>0,COUNTRY_INFO!K9<4), IF(AC9/Z9*100<>0, IF(AH9/Z9*100>100,100,AH9/Z9*100), \"-\"),0)","v":63.1833566386698},null,{"$f":"IF(AND(D9<>0, D9<>\"Inconnu\",D9<>\"Interrompu\",D9<>\"Non requis\"),D9/COUNTRY_INFO!D9, 0)","v":0},{"$f":"IF(AND(J9<>0,J9<>\"Inconnu\",J9<>\"Interrompu\",J9<>\"Non requis\"),J9/COUNTRY_INFO!D9, 0)","v":0},{"$f":"IF(AND(P9<>0,P9<>\"Inconnu\",P9<>\"Non requis\"),P9/(COUNTRY_INFO!E9+COUNTRY_INFO!F9), 0)","v":1},{"$f":"IF(AND(Z9<>0,Z9<>\"Inconnu\",Z9<>\"Non requis\"),IF(COUNTRY_INFO!K9=1,1,IF(COUNTRY_INFO!K9=2,0.5*COUNTRY_INFO!F9/(0.5*COUNTRY_INFO!F9+0.2*COUNTRY_INFO!G9),IF(COUNTRY_INFO!K9=3,COUNTRY_INFO!F9/(COUNTRY_INFO!F9+COUNTRY_INFO!G9)))),0)","v":1},{"$f":"IF(AND(Z9<>0,Z9<>\"Inconnu\",Z9<>\"Non requis\"),IF(COUNTRY_INFO!K9=1,0,IF(COUNTRY_INFO!K9=2,0.2*COUNTRY_INFO!G9/(0.5*COUNTRY_INFO!F9+0.2*COUNTRY_INFO!G9),IF(COUNTRY_INFO!K9=3,COUNTRY_INFO!G9/(COUNTRY_INFO!F9+COUNTRY_INFO!G9)))),0)","v":0},{"$f":"MAX(COUNTRY_INFO!D9*AK9*PROFILE!$G$7,COUNTRY_INFO!D9*AL9*PROFILE!$G$7)","v":0},{"$f":"MAX(COUNTRY_INFO!D9*AK9*PROFILE!$G$8,COUNTRY_INFO!D9*AL9*PROFILE!$G$8,COUNTRY_INFO!D9*AM9*PROFILE!$G$8)","v":33421.491315835316},{"$f":"MAX(COUNTRY_INFO!D9*AK9*PROFILE!$G$9,COUNTRY_INFO!D9*AL9*PROFILE!$G$9,COUNTRY_INFO!D9*AM9*PROFILE!$G$9,IF(AND(DISTRICT!Z9<>\"Inconnu\",Z9<>\"Non requis\"),COUNTRY_INFO!P9*DISTRICT!AN9,0))","v":69629.308646420061},{"$f":"MAX(COUNTRY_INFO!D9*AK9*PROFILE!$G$10,COUNTRY_INFO!D9*AL9*PROFILE!$G$10,IF(AND(DISTRICT!Z9<>\"Inconnu\",Z9<>\"Non requis\"),COUNTRY_INFO!P9*DISTRICT!AO9,0))","v":0},{"$f":"SUM(AP9:AS9)","v":103050.79996225538},{"$f":"IF(COUNTIFS(AK9:AN9,\">0\")=0,0, IF(COUNTIFS(AK9:AN9,\">0\")<=IF(AND(OR(D9>=0,D9=\"Non requis\",D9=\"Inconnu\",D9=\"Interrompu\"),D9>0,H9>0),1,0)+IF(AND(OR(J9>=0,J9=\"Non requis\",J9=\"Inconnu\",J9=\"Interrompu\"),J9>0,N9>0),1,0)+IF(AND(OR(P9>=0,P9=\"Non requis\",P9=\"Inconnu\"),P9>0,X9>0),1,0)+IF(AND(OR(Z9>=0,Z9=\"Non requis\",Z9=\"Inconnu\"),Z9>0,AH9>0),1,0),\"Y\",0))","v":"Y"},{"$f":"MAX('MDA4'!R9,'T1'!L9,'T2'!J9,T3_R1!K9,T3_R2!K9)","v":0},{"$f":"MAX('MDA1'!K9,'MDA4'!S9,'MDA3'!I9,'MDA3'!L9,'T1'!M9,'T2'!K9,T3_R1!L9,T3_R2!L9)","v":14518},{"$f":"MAX('MDA1'!L9,'MDA4'!T9,'MDA3'!J9,'MDA3'!M9,'T1'!N9,'T2'!L9,T3_R1!M9,T3_R2!M9)","v":0},{"$f":"SUM(AV9:AX9)","v":14518},{"$f":"MAX('MDA4'!R9,T9)","v":0},{"$f":"MAX('MDA1'!K9,'MDA4'!S9,'MDA3'!I9,'MDA3'!L9,V9,AD9)","v":14518},{"$f":"MAX('MDA1'!L9,'MDA4'!T9,'MDA3'!J9,'MDA3'!M9,AF9)","v":0},{"$f":"IF(AT9<SUM(AZ9:BB9), AT9,SUM(AZ9:BB9))","v":14518},{"$f":"IF(AT9<>0,BC9/AT9*100,0)","v":14.088197282619387}]
[{"$f":"IF(COUNTRY_INFO!A10=0,\" \",COUNTRY_INFO!A10)","v":"Gabon"},{"$f":"IF(COUNTRY_INFO!B10=0,\" \",COUNTRY_INFO!B10)","v":"Libreville-Owendo"},{"$f":"IF(COUNTRY_INFO!C10=0,\" \",COUNTRY_INFO!C10)","v":"Libreville 2"},{"$f":"COUNTRY_INFO!M10","v":0},null,null,{"$f":"MAX('MDA1'!M10,'MDA4'!U10)","v":0},{"$f":"IF(AND(COUNTRY_INFO!H10>0,COUNTRY_INFO!H10<4),IF(D10>MAX('MDA1'!M10,'MDA4'!U10),MAX('MDA1'!M10,'MDA4'!U10),D10),0)","v":0},{"$f":"IF(AND(COUNTRY_INFO!H10>0,COUNTRY_INFO!H10<4), IF(G10/D10*100<>0, IF(G10/D10*100>100,100,G10/D10*100), \"-\"),0)","v":0},{"$f":"COUNTRY_INFO!N10","v":"Inconnu"},null,null,{"$f":"MAX('MDA1'!M10,MAX('MDA3'!I10,'MDA3'!L10)+MAX('MDA3'!J10,'MDA3'!M10))","v":0},{"$f":"IF(AND(COUNTRY_INFO!I10>0,COUNTRY_INFO!I10<4),IF(J10>MAX('MDA1'!M10,MAX('MDA3'!I10,'MDA3'!L10)+MAX('MDA3'!J10,'MDA3'!M10)),MAX('MDA1'!M10,MAX('MDA3'!I10,'MDA3'!L10)+MAX('MDA3'!J10,'MDA3'!M10)),J10),0)","v":0},{"$f":"IF(AND(COUNTRY_INFO!I10>0,COUNTRY_INFO!I10<4), IF(M10/J10*100<>0, IF(M10/J10*100>100,100,M10/J10*100), \"-\"),0)","v":0},{"$f":"COUNTRY_INFO!O10","v":0},null,null,{"$f":"SUM(MAX('MDA4'!N10, 'T1'!L10, MAX(T3_R1!K10, T3_R2!K10)), MAX('MDA1'!K10, 'MDA4'!O10, 'T1'!M10, MAX(T3_R1!L10, T3_R2!L10)), MAX('MDA1'!L10, 'MDA4'!P10, 'T1'!N10, MAX(T3_R1!M10, T3_R2!M10)))","v":0},{"$f":"IF(AND(COUNTRY_INFO!J10>1,COUNTRY_INFO!J10<4),IF(COUNTRY_INFO!E10>MAX('MDA4'!N10,'T1'!L10,MAX(T3_R1!K10,T3_R2!K10)),MAX('MDA4'!N10,'T1'!L10,MAX(T3_R1!K10,T3_R2!K10)),COUNTRY_INFO!E10),0)","v":0},{"$f":"IF(AND(COUNTRY_INFO!J10>1,COUNTRY_INFO!J10<4), IF(T10/COUNTRY_INFO!E10*100<>0, IF(T10/COUNTRY_INFO!E10*100>100,100,T10/COUNTRY_INFO!E10*100), \"-\"),0)","v":0},{"$f":"IF(AND(COUNTRY_INFO!J10>1,COUNTRY_INFO!J10<4),IF(COUNTRY_INFO!F10>MAX('MDA1'!K10,'MDA4'!O10,'T1'!M10,MAX(T3_R1!L10,T3_R2!L10)),MAX('MDA1'!K10,'MDA4'!O10,'T1'!M10,MAX(T3_R1!L10,T3_R2!L10)),COUNTRY_INFO!F10),0)","v":0},{"$f":"IF(AND(COUNTRY_INFO!J10>1,COUNTRY_INFO!J10<4), IF(V10/COUNTRY_INFO!F10*100<>0, IF(V10/COUNTRY_INFO!F10*100>100,100,V10/COUNTRY_INFO!F10*100), \"-\"),0)","v":0},{"$f":"SUM(T10,V10)","v":0},{"$f":"IF(AND(COUNTRY_INFO!J10>1,COUNTRY_INFO!J10<4), IF(S10/P10*100<>0, IF(X10/P10*100>100,100,X10/P10*100), \"-\"),0)","v":0},{"$f":"COUNTRY_INFO!P10","v":24304.170000000002},8114,8664,{"$f":"MAX('T1'!L10,'T2'!J10)+MAX('T1'!M10,'T2'!K10)+MAX('T1'!N10,'T2'!L10)","v":16778},{"$f":"IF(COUNTRY_INFO!K10=1,IF(COUNTRY_INFO!F10*0.33>MAX('T1'!M10,'T2'!K10),MAX('T1'!M10,'T2'!K10),COUNTRY_INFO!F10*0.33),IF(COUNTRY_INFO!K10=2,IF(COUNTRY_INFO!F10*0.5>MAX('T1'!M10,'T2'!K10),MAX('T1'!M10,'T2'!K10),COUNTRY_INFO!F10*0.5),IF(COUNTRY_INFO!K10=3,IF(COUNTRY_INFO!F10>MAX('T1'!M10,'T2'!K10),MAX('T1'!M10,'T2'!K10),COUNTRY_INFO!F10),0)))","v":16778},{"$f":"IF(AND(COUNTRY_INFO!K10>0,COUNTRY_INFO!K10<4),IF(Z10>0,IF(COUNTRY_INFO!K10=1, AD10/(COUNTRY_INFO!F10*0.33)*100, IF(COUNTRY_INFO!K10=2, AD10/(COUNTRY_INFO!F10*0.5)*100, IF(COUNTRY_INFO!K10=3, AD10/COUNTRY_INFO!F10*100))),\"-\"),0)","v":69.03342101376019},{"$f":"IF(COUNTRY_INFO!K10=2,IF(COUNTRY_INFO!G10*0.2>MAX('T1'!N10,'T2'!L10),MAX('T1'!N10,'T2'!L10),COUNTRY_INFO!G10*0.2),IF(COUNTRY_INFO!K10=3,IF(COUNTRY_INFO!G10>MAX('T1'!N10,'T2'!L10),MAX('T1'!N10,'T2'!L10),COUNTRY_INFO!G10),0))","v":0},{"$f":"IF(AND(COUNTRY_INFO!K10>0,COUNTRY_INFO!K10<4),IF(Z10>0,IF(COUNTRY_INFO!K10=1, 0, IF(COUNTRY_INFO!K10=2, AF10/(COUNTRY_INFO!G10*0.2)*100, IF(COUNTRY_INFO!K10=3, AF10/COUNTRY_INFO!G10*100))),\"-\"),0)","v":0},{"$f":"SUM(AD10,AF10)","v":16778},{"$f":"IF(AND(COUNTRY_INFO!K10>0,COUNTRY_INFO!K10<4), IF(AC10/Z10*100<>0, IF(AH10/Z10*100>100,100,AH10/Z10*100), \"-\"),0)","v":69.03342101376019},null,{"$f":"IF(AND(D10<>0, D10<>\"Inconnu\",D10<>\"Interrompu\",D10<>\"Non requis\"),D10/COUNTRY_INFO!D10, 0)","v":0},{"$f":"IF(AND(J10<>0,J10<>\"Inconnu\",J10<>\"Interrompu\",J10<>\"Non requis\"),J10/COUNTRY_INFO!D10, 0)","v":0},{"$f":"IF(AND(P10<>0,P10<>\"Inconnu\",P10<>\"Non requis\"),P10/(COUNTRY_INFO!E10+COUNTRY_INFO!F10), 0)","v":0},{"$f":"IF(AND(Z10<>0,Z10<>\"Inconnu\",Z10<>\"Non requis\"),IF(COUNTRY_INFO!K10=1,1,IF(COUNTRY_INFO!K10=2,0.5*COUNTRY_INFO!F10/(0.5*COUNTRY_INFO!F10+0.2*COUNTRY_INFO!G10),IF(COUNTRY_INFO!K10=3,COUNTRY_INFO!F10/(COUNTRY_INFO!F10+COUNTRY_INFO!G10)))),0)","v":1},{"$f":"IF(AND(Z10<>0,Z10<>\"Inconnu\",Z10<>\"Non requis\"),IF(COUNTRY_INFO!K10=1,0,IF(COUNTRY_INFO!K10=2,0.2*COUNTRY_INFO!G10/(0.5*COUNTRY_INFO!F10+0.2*COUNTRY_INFO!G10),IF(COUNTRY_INFO!K10=3,COUNTRY_INFO!G10/(COUNTRY_INFO!F10+COUNTRY_INFO!G10)))),0)","v":0},{"$f":"MAX(COUNTRY_INFO!D10*AK10*PROFILE!$G$7,COUNTRY_INFO!D10*AL10*PROFILE!$G$7)","v":0},{"$f":"MAX(COUNTRY_INFO!D10*AK10*PROFILE!$G$8,COUNTRY_INFO!D10*AL10*PROFILE!$G$8,COUNTRY_INFO!D10*AM10*PROFILE!$G$8)","v":0},{"$f":"MAX(COUNTRY_INFO!D10*AK10*PROFILE!$G$9,COUNTRY_INFO!D10*AL10*PROFILE!$G$9,COUNTRY_INFO!D10*AM10*PROFILE!$G$9,IF(AND(DISTRICT!Z10<>\"Inconnu\",Z10<>\"Non requis\"),COUNTRY_INFO!P10*DISTRICT!AN10,0))","v":24304.170000000002},{"$f":"MAX(COUNTRY_INFO!D10*AK10*PROFILE!$G$10,COUNTRY_INFO!D10*AL10*PROFILE!$G$10,IF(AND(DISTRICT!Z10<>\"Inconnu\",Z10<>\"Non requis\"),COUNTRY_INFO!P10*DISTRICT!AO10,0))","v":0},{"$f":"SUM(AP10:AS10)","v":24304.170000000002},"Y",{"$f":"MAX('MDA4'!R10,'T1'!L10,'T2'!J10,T3_R1!K10,T3_R2!K10)","v":0},{"$f":"MAX('MDA1'!K10,'MDA4'!S10,'MDA3'!I10,'MDA3'!L10,'T1'!M10,'T2'!K10,T3_R1!L10,T3_R2!L10)","v":16778},{"$f":"MAX('MDA1'!L10,'MDA4'!T10,'MDA3'!J10,'MDA3'!M10,'T1'!N10,'T2'!L10,T3_R1!M10,T3_R2!M10)","v":0},{"$f":"SUM(AV10:AX10)","v":16778},{"$f":"MAX('MDA4'!R10,T10)","v":0},{"$f":"MAX('MDA1'!K10,'MDA4'!S10,'MDA3'!I10,'MDA3'!L10,V10,AD10)","v":16778},{"$f":"MAX('MDA1'!L10,'MDA4'!T10,'MDA3'!J10,'MDA3'!M10,AF10)","v":0},16778,69.03342101376019]
[{"$f":"IF(COUNTRY_INFO!A11=0,\" \",COUNTRY_INFO!A11)","v":"Gabon"},{"$f":"IF(COUNTRY_INFO!B11=0,\" \",COUNTRY_INFO!B11)","v":"Libreville-Owendo"},{"$f":"IF(COUNTRY_INFO!C11=0,\" \",COUNTRY_INFO!C11)","v":"Libreville 3"},{"$f":"COUNTRY_INFO!M11","v":0},null,null,{"$f":"MAX('MDA1'!M11,'MDA4'!U11)","v":0},{"$f":"IF(AND(COUNTRY_INFO!H11>0,COUNTRY_INFO!H11<4),IF(D11>MAX('MDA1'!M11,'MDA4'!U11),MAX('MDA1'!M11,'MDA4'!U11),D11),0)","v":0},{"$f":"IF(AND(COUNTRY_INFO!H11>0,COUNTRY_INFO!H11<4), IF(G11/D11*100<>0, IF(G11/D11*100>100,100,G11/D11*100), \"-\"),0)","v":0},{"$f":"COUNTRY_INFO!N11","v":"Inconnu"},null,null,{"$f":"MAX('MDA1'!M11,MAX('MDA3'!I11,'MDA3'!L11)+MAX('MDA3'!J11,'MDA3'!M11))","v":0},{"$f":"IF(AND(COUNTRY_INFO!I11>0,COUNTRY_INFO!I11<4),IF(J11>MAX('MDA1'!M11,MAX('MDA3'!I11,'MDA3'!L11)+MAX('MDA3'!J11,'MDA3'!M11)),MAX('MDA1'!M11,MAX('MDA3'!I11,'MDA3'!L11)+MAX('MDA3'!J11,'MDA3'!M11)),J11),0)","v":0},{"$f":"IF(AND(COUNTRY_INFO!I11>0,COUNTRY_INFO!I11<4), IF(M11/J11*100<>0, IF(M11/J11*100>100,100,M11/J11*100), \"-\"),0)","v":0},{"$f":"COUNTRY_INFO!O11","v":0},null,null,{"$f":"SUM(MAX('MDA4'!N11, 'T1'!L11, MAX(T3_R1!K11, T3_R2!K11)), MAX('MDA1'!K11, 'MDA4'!O11, 'T1'!M11, MAX(T3_R1!L11, T3_R2!L11)), MAX('MDA1'!L11, 'MDA4'!P11, 'T1'!N11, MAX(T3_R1!M11, T3_R2!M11)))","v":0},{"$f":"IF(AND(COUNTRY_INFO!J11>1,COUNTRY_INFO!J11<4),IF(COUNTRY_INFO!E11>MAX('MDA4'!N11,'T1'!L11,MAX(T3_R1!K11,T3_R2!K11)),MAX('MDA4'!N11,'T1'!L11,MAX(T3_R1!K11,T3_R2!K11)),COUNTRY_INFO!E11),0)","v":0},{"$f":"IF(AND(COUNTRY_INFO!J11>1,COUNTRY_INFO!J11<4), IF(T11/COUNTRY_INFO!E11*100<>0, IF(T11/COUNTRY_INFO!E11*100>100,100,T11/COUNTRY_INFO!E11*100), \"-\"),0)","v":0},{"$f":"IF(AND(COUNTRY_INFO!J11>1,COUNTRY_INFO!J11<4),IF(COUNTRY_INFO!F11>MAX('MDA1'!K11,'MDA4'!O11,'T1'!M11,MAX(T3_R1!L11,T3_R2!L11)),MAX('MDA1'!K11,'MDA4'!O11,'T1'!M11,MAX(T3_R1!L11,T3_R2!L11)),COUNTRY_INFO!F11),0)","v":0},{"$f":"IF(AND(COUNTRY_INFO!J11>1,COUNTRY_INFO!J11<4), IF(V11/COUNTRY_INFO!F11*100<>0, IF(V11/COUNTRY_INFO!F11*100>100,100,V11/COUNTRY_INFO!F11*100), \"-\"),0)","v":0},0,{"$f":"IF(AND(COUNTRY_INFO!J11>1,COUNTRY_INFO!J11<4), IF(S11/P11*100<>0, IF(X11/P11*100>100,100,X11/P11*100), \"-\"),0)","v":0},{"$f":"COUNTRY_INFO!P11","v":18920.55},5103,5206,{"$f":"MAX('T1'!L11,'T2'!J11)+MAX('T1'!M11,'T2'!K11)+MAX('T1'!N11,'T2'!L11)","v":10309},{"$f":"IF(COUNTRY_INFO!K11=1,IF(COUNTRY_INFO!F11*0.33>MAX('T1'!M11,'T2'!K11),MAX('T1'!M11,'T2'!K11),COUNTRY_INFO!F11*0.33),IF(COUNTRY_INFO!K11=2,IF(COUNTRY_INFO!F11*0.5>MAX('T1'!M11,'T2'!K11),MAX('T1'!M11,'T2'!K11),COUNTRY_INFO!F11*0.5),IF(COUNTRY_INFO!K11=3,IF(COUNTRY_INFO!F11>MAX('T1'!M11,'T2'!K11),MAX('T1'!M11,'T2'!K11),COUNTRY_INFO!F11),0)))","v":10309},{"$f":"IF(AND(COUNTRY_INFO!K11>0,COUNTRY_INFO!K11<4),IF(Z11>0,IF(COUNTRY_INFO!K11=1, AD11/(COUNTRY_INFO!F11*0.33)*100, IF(COUNTRY_INFO!K11=2, AD11/(COUNTRY_INFO!F11*0.5)*100, IF(COUNTRY_INFO!K11=3, AD11/COUNTRY_INFO!F11*100))),\"-\"),0)","v":54.485731123038185},{"$f":"IF(COUNTRY_INFO!K11=2,IF(COUNTRY_INFO!G11*0.2>MAX('T1'!N11,'T2'!L11),MAX('T1'!N11,'T2'!L11),COUNTRY_INFO!G11*0.2),IF(COUNTRY_INFO!K11=3,IF(COUNTRY_INFO!G11>MAX('T1'!N11,'T2'!L11),MAX('T1'!N11,'T2'!L11),COUNTRY_INFO!G11),0))","v":0},{"$f":"IF(AND(COUNTRY_INFO!K11>0,COUNTRY_INFO!K11<4),IF(Z11>0,IF(COUNTRY_INFO!K11=1, 0, IF(COUNTRY_INFO!K11=2, AF11/(COUNTRY_INFO!G11*0.2)*100, IF(COUNTRY_INFO!K11=3, AF11/COUNTRY_INFO!G11*100))),\"-\"),0)","v":0},10309,{"$f":"IF(AND(COUNTRY_INFO!K11>0,COUNTRY_INFO!K11<4), IF(AC11/Z11*100<>0, IF(AH11/Z11*100>100,100,AH11/Z11*100), \"-\"),0)","v":54.485731123038185},null,{"$f":"IF(AND(D11<>0, D11<>\"Inconnu\",D11<>\"Interrompu\",D11<>\"Non requis\"),D11/COUNTRY_INFO!D11, 0)","v":0},{"$f":"IF(AND(J11<>0,J11<>\"Inconnu\",J11<>\"Interrompu\",J11<>\"Non requis\"),J11/COUNTRY_INFO!D11, 0)","v":0},{"$f":"IF(AND(P11<>0,P11<>\"Inconnu\",P11<>\"Non requis\"),P11/(COUNTRY_INFO!E11+COUNTRY_INFO!F11), 0)","v":0},{"$f":"IF(AND(Z11<>0,Z11<>\"Inconnu\",Z11<>\"Non requis\"),IF(COUNTRY_INFO!K11=1,1,IF(COUNTRY_INFO!K11=2,0.5*COUNTRY_INFO!F11/(0.5*COUNTRY_INFO!F11+0.2*COUNTRY_INFO!G11),IF(COUNTRY_INFO!K11=3,COUNTRY_INFO!F11/(COUNTRY_INFO!F11+COUNTRY_INFO!G11)))),0)","v":1},{"$f":"IF(AND(Z11<>0,Z11<>\"Inconnu\",Z11<>\"Non requis\"),IF(COUNTRY_INFO!K11=1,0,IF(COUNTRY_INFO!K11=2,0.2*COUNTRY_INFO!G11/(0.5*COUNTRY_INFO!F11+0.2*COUNTRY_INFO!G11),IF(COUNTRY_INFO!K11=3,COUNTRY_INFO!G11/(COUNTRY_INFO!F11+COUNTRY_INFO!G11)))),0)","v":0},{"$f":"MAX(COUNTRY_INFO!D11*AK11*PROFILE!$G$7,COUNTRY_INFO!D11*AL11*PROFILE!$G$7)","v":0},{"$f":"MAX(COUNTRY_INFO!D11*AK11*PROFILE!$G$8,COUNTRY_INFO!D11*AL11*PROFILE!$G$8,COUNTRY_INFO!D11*AM11*PROFILE!$G$8)","v":0},{"$f":"MAX(COUNTRY_INFO!D11*AK11*PROFILE!$G$9,COUNTRY_INFO!D11*AL11*PROFILE!$G$9,COUNTRY_INFO!D11*AM11*PROFILE!$G$9,IF(AND(DISTRICT!Z11<>\"Inconnu\",Z11<>\"Non requis\"),COUNTRY_INFO!P11*DISTRICT!AN11,0))","v":18920.55},{"$f":"MAX(COUNTRY_INFO!D11*AK11*PROFILE!$G$10,COUNTRY_INFO!D11*AL11*PROFILE!$G$10,IF(AND(DISTRICT!Z11<>\"Inconnu\",Z11<>\"Non requis\"),COUNTRY_INFO!P11*DISTRICT!AO11,0))","v":0},18920.55,"Y",{"$f":"MAX('MDA4'!R11,'T1'!L11,'T2'!J11,T3_R1!K11,T3_R2!K11)","v":0},{"$f":"MAX('MDA1'!K11,'MDA4'!S11,'MDA3'!I11,'MDA3'!L11,'T1'!M11,'T2'!K11,T3_R1!L11,T3_R2!L11)","v":10309},{"$f":"MAX('MDA1'!L11,'MDA4'!T11,'MDA3'!J11,'MDA3'!M11,'T1'!N11,'T2'!L11,T3_R1!M11,T3_R2!M11)","v":0},10309,{"$f":"MAX('MDA4'!R11,T11)","v":0},{"$f":"MAX('MDA1'!K11,'MDA4'!S11,'MDA3'!I11,'MDA3'!L11,V11,AD11)","v":10309},{"$f":"MAX('MDA1'!L11,'MDA4'!T11,'MDA3'!J11,'MDA3'!M11,AF11)","v":0},10309,54.485731123038185]
[{"$f":"IF(COUNTRY_INFO!A12=0,\" \",COUNTRY_INFO!A12)","v":"Gabon"},{"$f":"IF(COUNTRY_INFO!B12=0,\" \",COUNTRY_INFO!B12)","v":"Libreville-Owendo"},{"$f":"IF(COUNTRY_INFO!C12=0,\" \",COUNTRY_INFO!C12)","v":"Owendo"},{"$f":"COUNTRY_INFO!M12","v":0},null,null,{"$f":"MAX('MDA1'!M12,'MDA4'!U12)","v":0},{"$f":"IF(AND(COUNTRY_INFO!H12>0,COUNTRY_INFO!H12<4),IF(D12>MAX('MDA1'!M12,'MDA4'!U12),MAX('MDA1'!M12,'MDA4'!U12),D12),0)","v":0},{"$f":"IF(AND(COUNTRY_INFO!H12>0,COUNTRY_INFO!H12<4), IF(G12/D12*100<>0, IF(G12/D12*100>100,100,G12/D12*100), \"-\"),0)","v":0},{"$f":"COUNTRY_INFO!N12","v":"Inconnu"},null,null,{"$f":"MAX('MDA1'!M12,MAX('MDA3'!I12,'MDA3'!L12)+MAX('MDA3'!J12,'MDA3'!M12))","v":0},{"$f":"IF(AND(COUNTRY_INFO!I12>0,COUNTRY_INFO!I12<4),IF(J12>MAX('MDA1'!M12,MAX('MDA3'!I12,'MDA3'!L12)+MAX('MDA3'!J12,'MDA3'!M12)),MAX('MDA1'!M12,MAX('MDA3'!I12,'MDA3'!L12)+MAX('MDA3'!J12,'MDA3'!M12)),J12),0)","v":0},{"$f":"IF(AND(COUNTRY_INFO!I12>0,COUNTRY_INFO!I12<4), IF(M12/J12*100<>0, IF(M12/J12*100>100,100,M12/J12*100), \"-\"),0)","v":0},{"$f":"COUNTRY_INFO!O12","v":0},null,null,{"$f":"SUM(MAX('MDA4'!N12, 'T1'!L12, MAX(T3_R1!K12, T3_R2!K12)), MAX('MDA1'!K12, 'MDA4'!O12, 'T1'!M12, MAX(T3_R1!L12, T3_R2!L12)), MAX('MDA1'!L12, 'MDA4'!P12, 'T1'!N12, MAX(T3_R1!M12, T3_R2!M12)))","v":0},{"$f":"IF(AND(COUNTRY_INFO!J12>1,COUNTRY_INFO!J12<4),IF(COUNTRY_INFO!E12>MAX('MDA4'!N12,'T1'!L12,MAX(T3_R1!K12,T3_R2!K12)),MAX('MDA4'!N12,'T1'!L12,MAX(T3_R1!K12,T3_R2!K12)),COUNTRY_INFO!E12),0)","v":0},{"$f":"IF(AND(COUNTRY_INFO!J12>1,COUNTRY_INFO!J12<4), IF(T12/COUNTRY_INFO!E12*100<>0, IF(T12/COUNTRY_INFO!E12*100>100,100,T12/COUNTRY_INFO!E12*100), \"-\"),0)","v":0},{"$f":"IF(AND(COUNTRY_INFO!J12>1,COUNTRY_INFO!J12<4),IF(COUNTRY_INFO!F12>MAX('MDA1'!K12,'MDA4'!O12,'T1'!M12,MAX(T3_R1!L12,T3_R2!L12)),MAX('MDA1'!K12,'MDA4'!O12,'T1'!M12,MAX(T3_R1!L12,T3_R2!L12)),COUNTRY_INFO!F12),0)","v":0},{"$f":"IF(AND(COUNTRY_INFO!J12>1,COUNTRY_INFO!J12<4), IF(V12/COUNTRY_INFO!F12*100<>0, IF(V12/COUNTRY_INFO!F12*100>100,100,V12/COUNTRY_INFO!F12*100), \"-\"),0)","v":0},0,{"$f":"IF(AND(COUNTRY_INFO!J12>1,COUNTRY_INFO!J12<4), IF(S12/P12*100<>0, IF(X12/P12*100>100,100,X12/P12*100), \"-\"),0)","v":0},{"$f":"COUNTRY_INFO!P12","v":7198.62},3444,3678,{"$f":"MAX('T1'!L12,'T2'!J12)+MAX('T1'!M12,'T2'!K12)+MAX('T1'!N12,'T2'!L12)","v":7122},{"$f":"IF(COUNTRY_INFO!K12=1,IF(COUNTRY_INFO!F12*0.33>MAX('T1'!M12,'T2'!K12),MAX('T1'!M12,'T2'!K12),COUNTRY_INFO!F12*0.33),IF(COUNTRY_INFO!K12=2,IF(COUNTRY_INFO!F12*0.5>MAX('T1'!M12,'T2'!K12),MAX('T1'!M12,'T2'!K12),COUNTRY_INFO!F12*0.5),IF(COUNTRY_INFO!K12=3,IF(COUNTRY_INFO!F12>MAX('T1'!M12,'T2'!K12),MAX('T1'!M12,'T2'!K12),COUNTRY_INFO!F12),0)))","v":7122},{"$f":"IF(AND(COUNTRY_INFO!K12>0,COUNTRY_INFO!K12<4),IF(Z12>0,IF(COUNTRY_INFO!K12=1, AD12/(COUNTRY_INFO!F12*0.33)*100, IF(COUNTRY_INFO!K12=2, AD12/(COUNTRY_INFO!F12*0.5)*100, IF(COUNTRY_INFO!K12=3, AD12/COUNTRY_INFO!F12*100))),\"-\"),0)","v":98.935629328954718},{"$f":"IF(COUNTRY_INFO!K12=2,IF(COUNTRY_INFO!G12*0.2>MAX('T1'!N12,'T2'!L12),MAX('T1'!N12,'T2'!L12),COUNTRY_INFO!G12*0.2),IF(COUNTRY_INFO!K12=3,IF(COUNTRY_INFO!G12>MAX('T1'!N12,'T2'!L12),MAX('T1'!N12,'T2'!L12),COUNTRY_INFO!G12),0))","v":0},{"$f":"IF(AND(COUNTRY_INFO!K12>0,COUNTRY_INFO!K12<4),IF(Z12>0,IF(COUNTRY_INFO!K12=1, 0, IF(COUNTRY_INFO!K12=2, AF12/(COUNTRY_INFO!G12*0.2)*100, IF(COUNTRY_INFO!K12=3, AF12/COUNTRY_INFO!G12*100))),\"-\"),0)","v":0},7122,{"$f":"IF(AND(COUNTRY_INFO!K12>0,COUNTRY_INFO!K12<4), IF(AC12/Z12*100<>0, IF(AH12/Z12*100>100,100,AH12/Z12*100), \"-\"),0)","v":98.935629328954718},null,{"$f":"IF(AND(D12<>0, D12<>\"Inconnu\",D12<>\"Interrompu\",D12<>\"Non requis\"),D12/COUNTRY_INFO!D12, 0)","v":0},{"$f":"IF(AND(J12<>0,J12<>\"Inconnu\",J12<>\"Interrompu\",J12<>\"Non requis\"),J12/COUNTRY_INFO!D12, 0)","v":0},{"$f":"IF(AND(P12<>0,P12<>\"Inconnu\",P12<>\"Non requis\"),P12/(COUNTRY_INFO!E12+COUNTRY_INFO!F12), 0)","v":0},{"$f":"IF(AND(Z12<>0,Z12<>\"Inconnu\",Z12<>\"Non requis\"),IF(COUNTRY_INFO!K12=1,1,IF(COUNTRY_INFO!K12=2,0.5*COUNTRY_INFO!F12/(0.5*COUNTRY_INFO!F12+0.2*COUNTRY_INFO!G12),IF(COUNTRY_INFO!K12=3,COUNTRY_INFO!F12/(COUNTRY_INFO!F12+COUNTRY_INFO!G12)))),0)","v":1},{"$f":"IF(AND(Z12<>0,Z12<>\"Inconnu\",Z12<>\"Non requis\"),IF(COUNTRY_INFO!K12=1,0,IF(COUNTRY_INFO!K12=2,0.2*COUNTRY_INFO!G12/(0.5*COUNTRY_INFO!F12+0.2*COUNTRY_INFO!G12),IF(COUNTRY_INFO!K12=3,COUNTRY_INFO!G12/(COUNTRY_INFO!F12+COUNTRY_INFO!G12)))),0)","v":0},{"$f":"MAX(COUNTRY_INFO!D12*AK12*PROFILE!$G$7,COUNTRY_INFO!D12*AL12*PROFILE!$G$7)","v":0},{"$f":"MAX(COUNTRY_INFO!D12*AK12*PROFILE!$G$8,COUNTRY_INFO!D12*AL12*PROFILE!$G$8,COUNTRY_INFO!D12*AM12*PROFILE!$G$8)","v":0},{"$f":"MAX(COUNTRY_INFO!D12*AK12*PROFILE!$G$9,COUNTRY_INFO!D12*AL12*PROFILE!$G$9,COUNTRY_INFO!D12*AM12*PROFILE!$G$9,IF(AND(DISTRICT!Z12<>\"Inconnu\",Z12<>\"Non requis\"),COUNTRY_INFO!P12*DISTRICT!AN12,0))","v":7198.62},{"$f":"MAX(COUNTRY_INFO!D12*AK12*PROFILE!$G$10,COUNTRY_INFO!D12*AL12*PROFILE!$G$10,IF(AND(DISTRICT!Z12<>\"Inconnu\",Z12<>\"Non requis\"),COUNTRY_INFO!P12*DISTRICT!AO12,0))","v":0},7198.62,"Y",{"$f":"MAX('MDA4'!R12,'T1'!L12,'T2'!J12,T3_R1!K12,T3_R2!K12)","v":0},{"$f":"MAX('MDA1'!K12,'MDA4'!S12,'MDA3'!I12,'MDA3'!L12,'T1'!M12,'T2'!K12,T3_R1!L12,T3_R2!L12)","v":7122},{"$f":"MAX('MDA1'!L12,'MDA4'!T12,'MDA3'!J12,'MDA3'!M12,'T1'!N12,'T2'!L12,T3_R1!M12,T3_R2!M12)","v":0},7122,{"$f":"MAX('MDA4'!R12,T12)","v":0},{"$f":"MAX('MDA1'!K12,'MDA4'!S12,'MDA3'!I12,'MDA3'!L12,V12,AD12)","v":7122},{"$f":"MAX('MDA1'!L12,'MDA4'!T12,'MDA3'!J12,'MDA3'!M12,AF12)","v":0},7122,98.935629328954718]
[{"$f":"IF(COUNTRY_INFO!A13=0,\" \",COUNTRY_INFO!A13)","v":"Gabon"},{"$f":"IF(COUNTRY_INFO!B13=0,\" \",COUNTRY_INFO!B13)","v":"Ouest"},{"$f":"IF(COUNTRY_INFO!C13=0,\" \",COUNTRY_INFO!C13)","v":"Komo-Mondah"},{"$f":"COUNTRY_INFO!M13","v":96045},null,null,{"$f":"MAX('MDA1'!M13,'MDA4'!U13)","v":0},{"$f":"IF(AND(COUNTRY_INFO!H13>0,COUNTRY_INFO!H13<4),IF(D13>MAX('MDA1'!M13,'MDA4'!U13),MAX('MDA1'!M13,'MDA4'!U13),D13),0)","v":0},{"$f":"IF(AND(COUNTRY_INFO!H13>0,COUNTRY_INFO!H13<4), IF(G13/D13*100<>0, IF(G13/D13*100>100,100,G13/D13*100), \"-\"),0)","v":"-"},{"$f":"COUNTRY_INFO!N13","v":0},null,null,{"$f":"MAX('MDA1'!M13,MAX('MDA3'!I13,'MDA3'!L13)+MAX('MDA3'!J13,'MDA3'!M13))","v":0},{"$f":"IF(AND(COUNTRY_INFO!I13>0,COUNTRY_INFO!I13<4),IF(J13>MAX('MDA1'!M13,MAX('MDA3'!I13,'MDA3'!L13)+MAX('MDA3'!J13,'MDA3'!M13)),MAX('MDA1'!M13,MAX('MDA3'!I13,'MDA3'!L13)+MAX('MDA3'!J13,'MDA3'!M13)),J13),0)","v":0},{"$f":"IF(AND(COUNTRY_INFO!I13>0,COUNTRY_INFO!I13<4), IF(M13/J13*100<>0, IF(M13/J13*100>100,100,M13/J13*100), \"-\"),0)","v":0},{"$f":"COUNTRY_INFO!O13","v":35536},8778,9403,{"$f":"SUM(MAX('MDA4'!N13, 'T1'!L13, MAX(T3_R1!K13, T3_R2!K13)), MAX('MDA1'!K13, 'MDA4'!O13, 'T1'!M13, MAX(T3_R1!L13, T3_R2!L13)), MAX('MDA1'!L13, 'MDA4'!P13, 'T1'!N13, MAX(T3_R1!M13, T3_R2!M13)))","v":18181},{"$f":"IF(AND(COUNTRY_INFO!J13>1,COUNTRY_INFO!J13<4),IF(COUNTRY_INFO!E13>MAX('MDA4'!N13,'T1'!L13,MAX(T3_R1!K13,T3_R2!K13)),MAX('MDA4'!N13,'T1'!L13,MAX(T3_R1!K13,T3_R2!K13)),COUNTRY_INFO!E13),0)","v":0},{"$f":"IF(AND(COUNTRY_INFO!J13>1,COUNTRY_INFO!J13<4), IF(T13/COUNTRY_INFO!E13*100<>0, IF(T13/COUNTRY_INFO!E13*100>100,100,T13/COUNTRY_INFO!E13*100), \"-\"),0)","v":"-"},{"$f":"IF(AND(COUNTRY_INFO!J13>1,COUNTRY_INFO!J13<4),IF(COUNTRY_INFO!F13>MAX('MDA1'!K13,'MDA4'!O13,'T1'!M13,MAX(T3_R1!L13,T3_R2!L13)),MAX('MDA1'!K13,'MDA4'!O13,'T1'!M13,MAX(T3_R1!L13,T3_R2!L13)),COUNTRY_INFO!F13),0)","v":18181},{"$f":"IF(AND(COUNTRY_INFO!J13>1,COUNTRY_INFO!J13<4), IF(V13/COUNTRY_INFO!F13*100<>0, IF(V13/COUNTRY_INFO!F13*100>100,100,V13/COUNTRY_INFO!F13*100), \"-\"),0)","v":75.719461913289749},18181,{"$f":"IF(AND(COUNTRY_INFO!J13>1,COUNTRY_INFO!J13<4), IF(S13/P13*100<>0, IF(X13/P13*100>100,100,X13/P13*100), \"-\"),0)","v":51.162201710941012},{"$f":"COUNTRY_INFO!P13","v":7923.63},8778,9403,{"$f":"MAX('T1'!L13,'T2'!J13)+MAX('T1'!M13,'T2'!K13)+MAX('T1'!N13,'T2'!L13)","v":18181},{"$f":"IF(COUNTRY_INFO!K13=1,IF(COUNTRY_INFO!F13*0.33>MAX('T1'!M13,'T2'!K13),MAX('T1'!M13,'T2'!K13),COUNTRY_INFO!F13*0.33),IF(COUNTRY_INFO!K13=2,IF(COUNTRY_INFO!F13*0.5>MAX('T1'!M13,'T2'!K13),MAX('T1'!M13,'T2'!K13),COUNTRY_INFO!F13*0.5),IF(COUNTRY_INFO!K13=3,IF(COUNTRY_INFO!F13>MAX('T1'!M13,'T2'!K13),MAX('T1'!M13,'T2'!K13),COUNTRY_INFO!F13),0)))","v":7923.63},{"$f":"IF(AND(COUNTRY_INFO!K13>0,COUNTRY_INFO!K13<4),IF(Z13>0,IF(COUNTRY_INFO!K13=1, AD13/(COUNTRY_INFO!F13*0.33)*100, IF(COUNTRY_INFO!K13=2, AD13/(COUNTRY_INFO!F13*0.5)*100, IF(COUNTRY_INFO!K13=3, AD13/COUNTRY_INFO!F13*100))),\"-\"),0)","v":100},{"$f":"IF(COUNTRY_INFO!K13=2,IF(COUNTRY_INFO!G13*0.2>MAX('T1'!N13,'T2'!L13),MAX('T1'!N13,'T2'!L13),COUNTRY_INFO!G13*0.2),IF(COUNTRY_INFO!K13=3,IF(COUNTRY_INFO!G13>MAX('T1'!N13,'T2'!L13),MAX('T1'!N13,'T2'!L13),COUNTRY_INFO!G13),0))","v":0},{"$f":"IF(AND(COUNTRY_INFO!K13>0,COUNTRY_INFO!K13<4),IF(Z13>0,IF(COUNTRY_INFO!K13=1, 0, IF(COUNTRY_INFO!K13=2, AF13/(COUNTRY_INFO!G13*0.2)*100, IF(COUNTRY_INFO!K13=3, AF13/COUNTRY_INFO!G13*100))),\"-\"),0)","v":0},7923.63,{"$f":"IF(AND(COUNTRY_INFO!K13>0,COUNTRY_INFO!K13<4), IF(AC13/Z13*100<>0, IF(AH13/Z13*100>100,100,AH13/Z13*100), \"-\"),0)","v":100},null,{"$f":"IF(AND(D13<>0, D13<>\"Inconnu\",D13<>\"Interrompu\",D13<>\"Non requis\"),D13/COUNTRY_INFO!D13, 0)","v":1},{"$f":"IF(AND(J13<>0,J13<>\"Inconnu\",J13<>\"Interrompu\",J13<>\"Non requis\"),J13/COUNTRY_INFO!D13, 0)","v":0},{"$f":"IF(AND(P13<>0,P13<>\"Inconnu\",P13<>\"Non requis\"),P13/(COUNTRY_INFO!E13+COUNTRY_INFO!F13), 0)","v":1},{"$f":"IF(AND(Z13<>0,Z13<>\"Inconnu\",Z13<>\"Non requis\"),IF(COUNTRY_INFO!K13=1,1,IF(COUNTRY_INFO!K13=2,0.5*COUNTRY_INFO!F13/(0.5*COUNTRY_INFO!F13+0.2*COUNTRY_INFO!G13),IF(COUNTRY_INFO!K13=3,COUNTRY_INFO!F13/(COUNTRY_INFO!F13+COUNTRY_INFO!G13)))),0)","v":1},{"$f":"IF(AND(Z13<>0,Z13<>\"Inconnu\",Z13<>\"Non requis\"),IF(COUNTRY_INFO!K13=1,0,IF(COUNTRY_INFO!K13=2,0.2*COUNTRY_INFO!G13/(0.5*COUNTRY_INFO!F13+0.2*COUNTRY_INFO!G13),IF(COUNTRY_INFO!K13=3,COUNTRY_INFO!G13/(COUNTRY_INFO!F13+COUNTRY_INFO!G13)))),0)","v":0},{"$f":"MAX(COUNTRY_INFO!D13*AK13*PROFILE!$G$7,COUNTRY_INFO!D13*AL13*PROFILE!$G$7)","v":3841.4839585389927},{"$f":"MAX(COUNTRY_INFO!D13*AK13*PROFILE!$G$8,COUNTRY_INFO!D13*AL13*PROFILE!$G$8,COUNTRY_INFO!D13*AM13*PROFILE!$G$8)","v":11525.33493264038},{"$f":"MAX(COUNTRY_INFO!D13*AK13*PROFILE!$G$9,COUNTRY_INFO!D13*AL13*PROFILE!$G$9,COUNTRY_INFO!D13*AM13*PROFILE!$G$9,IF(AND(DISTRICT!Z13<>\"Inconnu\",Z13<>\"Non requis\"),COUNTRY_INFO!P13*DISTRICT!AN13,0))","v":24011.528860112652},{"$f":"MAX(COUNTRY_INFO!D13*AK13*PROFILE!$G$10,COUNTRY_INFO!D13*AL13*PROFILE!$G$10,IF(AND(DISTRICT!Z13<>\"Inconnu\",Z13<>\"Non requis\"),COUNTRY_INFO!P13*DISTRICT!AO13,0))","v":56666.652248707971},96045,0,{"$f":"MAX('MDA4'!R13,'T1'!L13,'T2'!J13,T3_R1!K13,T3_R2!K13)","v":0},{"$f":"MAX('MDA1'!K13,'MDA4'!S13,'MDA3'!I13,'MDA3'!L13,'T1'!M13,'T2'!K13,T3_R1!L13,T3_R2!L13)","v":18181},{"$f":"MAX('MDA1'!L13,'MDA4'!T13,'MDA3'!J13,'MDA3'!M13,'T1'!N13,'T2'!L13,T3_R1!M13,T3_R2!M13)","v":0},18181,{"$f":"MAX('MDA4'!R13,T13)","v":0},{"$f":"MAX('MDA1'!K13,'MDA4'!S13,'MDA3'!I13,'MDA3'!L13,V13,AD13)","v":18181},{"$f":"MAX('MDA1'!L13,'MDA4'!T13,'MDA3'!J13,'MDA3'!M13,AF13)","v":0},18181,18.929668384611382]
[{"$f":"IF(COUNTRY_INFO!A14=0,\" \",COUNTRY_INFO!A14)","v":"Gabon"},{"$f":"IF(COUNTRY_INFO!B14=0,\" \",COUNTRY_INFO!B14)","v":"Ouest"},{"$f":"IF(COUNTRY_INFO!C14=0,\" \",COUNTRY_INFO!C14)","v":"Komo-Kango"},{"$f":"COUNTRY_INFO!M14","v":0},null,null,{"$f":"MAX('MDA1'!M14,'MDA4'!U14)","v":0},{"$f":"IF(AND(COUNTRY_INFO!H14>0,COUNTRY_INFO!H14<4),IF(D14>MAX('MDA1'!M14,'MDA4'!U14),MAX('MDA1'!M14,'MDA4'!U14),D14),0)","v":0},{"$f":"IF(AND(COUNTRY_INFO!H14>0,COUNTRY_INFO!H14<4), IF(G14/D14*100<>0, IF(G14/D14*100>100,100,G14/D14*100), \"-\"),0)","v":0},{"$f":"COUNTRY_INFO!N14","v":"Inconnu"},null,null,{"$f":"MAX('MDA1'!M14,MAX('MDA3'!I14,'MDA3'!L14)+MAX('MDA3'!J14,'MDA3'!M14))","v":0},{"$f":"IF(AND(COUNTRY_INFO!I14>0,COUNTRY_INFO!I14<4),IF(J14>MAX('MDA1'!M14,MAX('MDA3'!I14,'MDA3'!L14)+MAX('MDA3'!J14,'MDA3'!M14)),MAX('MDA1'!M14,MAX('MDA3'!I14,'MDA3'!L14)+MAX('MDA3'!J14,'MDA3'!M14)),J14),0)","v":0},{"$f":"IF(AND(COUNTRY_INFO!I14>0,COUNTRY_INFO!I14<4), IF(M14/J14*100<>0, IF(M14/J14*100>100,100,M14/J14*100), \"-\"),0)","v":0},{"$f":"COUNTRY_INFO!O14","v":6913},807,870,{"$f":"SUM(MAX('MDA4'!N14, 'T1'!L14, MAX(T3_R1!K14, T3_R2!K14)), MAX('MDA1'!K14, 'MDA4'!O14, 'T1'!M14, MAX(T3_R1!L14, T3_R2!L14)), MAX('MDA1'!L14, 'MDA4'!P14, 'T1'!N14, MAX(T3_R1!M14, T3_R2!M14)))","v":1677},{"$f":"IF(AND(COUNTRY_INFO!J14>1,COUNTRY_INFO!J14<4),IF(COUNTRY_INFO!E14>MAX('MDA4'!N14,'T1'!L14,MAX(T3_R1!K14,T3_R2!K14)),MAX('MDA4'!N14,'T1'!L14,MAX(T3_R1!K14,T3_R2!K14)),COUNTRY_INFO!E14),0)","v":0},{"$f":"IF(AND(COUNTRY_INFO!J14>1,COUNTRY_INFO!J14<4), IF(T14/COUNTRY_INFO!E14*100<>0, IF(T14/COUNTRY_INFO!E14*100>100,100,T14/COUNTRY_INFO!E14*100), \"-\"),0)","v":"-"},{"$f":"IF(AND(COUNTRY_INFO!J14>1,COUNTRY_INFO!J14<4),IF(COUNTRY_INFO!F14>MAX('MDA1'!K14,'MDA4'!O14,'T1'!M14,MAX(T3_R1!L14,T3_R2!L14)),MAX('MDA1'!K14,'MDA4'!O14,'T1'!M14,MAX(T3_R1!L14,T3_R2!L14)),COUNTRY_INFO!F14),0)","v":1677},{"$f":"IF(AND(COUNTRY_INFO!J14>1,COUNTRY_INFO!J14<4), IF(V14/COUNTRY_INFO!F14*100<>0, IF(V14/COUNTRY_INFO!F14*100>100,100,V14/COUNTRY_INFO!F14*100), \"-\"),0)","v":35.902376364804113},1677,{"$f":"IF(AND(COUNTRY_INFO!J14>1,COUNTRY_INFO!J14<4), IF(S14/P14*100<>0, IF(X14/P14*100>100,100,X14/P14*100), \"-\"),0)","v":24.258643136120352},{"$f":"COUNTRY_INFO!P14","v":4540.3},807,870,{"$f":"MAX('T1'!L14,'T2'!J14)+MAX('T1'!M14,'T2'!K14)+MAX('T1'!N14,'T2'!L14)","v":1677},{"$f":"IF(COUNTRY_INFO!K14=1,IF(COUNTRY_INFO!F14*0.33>MAX('T1'!M14,'T2'!K14),MAX('T1'!M14,'T2'!K14),COUNTRY_INFO!F14*0.33),IF(COUNTRY_INFO!K14=2,IF(COUNTRY_INFO!F14*0.5>MAX('T1'!M14,'T2'!K14),MAX('T1'!M14,'T2'!K14),COUNTRY_INFO!F14*0.5),IF(COUNTRY_INFO!K14=3,IF(COUNTRY_INFO!F14>MAX('T1'!M14,'T2'!K14),MAX('T1'!M14,'T2'!K14),COUNTRY_INFO!F14),0)))","v":1677},{"$f":"IF(AND(COUNTRY_INFO!K14>0,COUNTRY_INFO!K14<4),IF(Z14>0,IF(COUNTRY_INFO!K14=1, AD14/(COUNTRY_INFO!F14*0.33)*100, IF(COUNTRY_INFO!K14=2, AD14/(COUNTRY_INFO!F14*0.5)*100, IF(COUNTRY_INFO!K14=3, AD14/COUNTRY_INFO!F14*100))),\"-\"),0)","v":71.804752729608225},{"$f":"IF(COUNTRY_INFO!K14=2,IF(COUNTRY_INFO!G14*0.2>MAX('T1'!N14,'T2'!L14),MAX('T1'!N14,'T2'!L14),COUNTRY_INFO!G14*0.2),IF(COUNTRY_INFO!K14=3,IF(COUNTRY_INFO!G14>MAX('T1'!N14,'T2'!L14),MAX('T1'!N14,'T2'!L14),COUNTRY_INFO!G14),0))","v":0},{"$f":"IF(AND(COUNTRY_INFO!K14>0,COUNTRY_INFO!K14<4),IF(Z14>0,IF(COUNTRY_INFO!K14=1, 0, IF(COUNTRY_INFO!K14=2, AF14/(COUNTRY_INFO!G14*0.2)*100, IF(COUNTRY_INFO!K14=3, AF14/COUNTRY_INFO!G14*100))),\"-\"),0)","v":0},1677,{"$f":"IF(AND(COUNTRY_INFO!K14>0,COUNTRY_INFO!K14<4), IF(AC14/Z14*100<>0, IF(AH14/Z14*100>100,100,AH14/Z14*100), \"-\"),0)","v":36.935885293923306},null,{"$f":"IF(AND(D14<>0, D14<>\"Inconnu\",D14<>\"Interrompu\",D14<>\"Non requis\"),D14/COUNTRY_INFO!D14, 0)","v":0},{"$f":"IF(AND(J14<>0,J14<>\"Inconnu\",J14<>\"Interrompu\",J14<>\"Non requis\"),J14/COUNTRY_INFO!D14, 0)","v":0},{"$f":"IF(AND(P14<>0,P14<>\"Inconnu\",P14<>\"Non requis\"),P14/(COUNTRY_INFO!E14+COUNTRY_INFO!F14), 0)","v":1},{"$f":"IF(AND(Z14<>0,Z14<>\"Inconnu\",Z14<>\"Non requis\"),IF(COUNTRY_INFO!K14=1,1,IF(COUNTRY_INFO!K14=2,0.5*COUNTRY_INFO!F14/(0.5*COUNTRY_INFO!F14+0.2*COUNTRY_INFO!G14),IF(COUNTRY_INFO!K14=3,COUNTRY_INFO!F14/(COUNTRY_INFO!F14+COUNTRY_INFO!G14)))),0)","v":0.5143933220271788},{"$f":"IF(AND(Z14<>0,Z14<>\"Inconnu\",Z14<>\"Non requis\"),IF(COUNTRY_INFO!K14=1,0,IF(COUNTRY_INFO!K14=2,0.2*COUNTRY_INFO!G14/(0.5*COUNTRY_INFO!F14+0.2*COUNTRY_INFO!G14),IF(COUNTRY_INFO!K14=3,COUNTRY_INFO!G14/(COUNTRY_INFO!F14+COUNTRY_INFO!G14)))),0)","v":0.4856066779728212},{"$f":"MAX(COUNTRY_INFO!D14*AK14*PROFILE!$G$7,COUNTRY_INFO!D14*AL14*PROFILE!$G$7)","v":0},{"$f":"MAX(COUNTRY_INFO!D14*AK14*PROFILE!$G$8,COUNTRY_INFO!D14*AL14*PROFILE!$G$8,COUNTRY_INFO!D14*AM14*PROFILE!$G$8)","v":2242.0673421984789},{"$f":"MAX(COUNTRY_INFO!D14*AK14*PROFILE!$G$9,COUNTRY_INFO!D14*AL14*PROFILE!$G$9,COUNTRY_INFO!D14*AM14*PROFILE!$G$9,IF(AND(DISTRICT!Z14<>\"Inconnu\",Z14<>\"Non requis\"),COUNTRY_INFO!P14*DISTRICT!AN14,0))","v":4671.0542477208055},{"$f":"MAX(COUNTRY_INFO!D14*AK14*PROFILE!$G$10,COUNTRY_INFO!D14*AL14*PROFILE!$G$10,IF(AND(DISTRICT!Z14<>\"Inconnu\",Z14<>\"Non requis\"),COUNTRY_INFO!P14*DISTRICT!AO14,0))","v":2204.8000000000002},9117.9215899192859,"Y",{"$f":"MAX('MDA4'!R14,'T1'!L14,'T2'!J14,T3_R1!K14,T3_R2!K14)","v":0},{"$f":"MAX('MDA1'!K14,'MDA4'!S14,'MDA3'!I14,'MDA3'!L14,'T1'!M14,'T2'!K14,T3_R1!L14,T3_R2!L14)","v":1677},{"$f":"MAX('MDA1'!L14,'MDA4'!T14,'MDA3'!J14,'MDA3'!M14,'T1'!N14,'T2'!L14,T3_R1!M14,T3_R2!M14)","v":0},1677,{"$f":"MAX('MDA4'!R14,T14)","v":0},{"$f":"MAX('MDA1'!K14,'MDA4'!S14,'MDA3'!I14,'MDA3'!L14,V14,AD14)","v":1677},{"$f":"MAX('MDA1'!L14,'MDA4'!T14,'MDA3'!J14,'MDA3'!M14,AF14)","v":0},1677,18.392349434700996]
[{"$f":"IF(COUNTRY_INFO!A15=0,\" \",COUNTRY_INFO!A15)","v":"Gabon"},{"$f":"IF(COUNTRY_INFO!B15=0,\" \",COUNTRY_INFO!B15)","v":"Ouest"},{"$f":"IF(COUNTRY_INFO!C15=0,\" \",COUNTRY_INFO!C15)","v":"Noya"},{"$f":"COUNTRY_INFO!M15","v":0},null,null,{"$f":"MAX('MDA1'!M15,'MDA4'!U15)","v":0},{"$f":"IF(AND(COUNTRY_INFO!H15>0,COUNTRY_INFO!H15<4),IF(D15>MAX('MDA1'!M15,'MDA4'!U15),MAX('MDA1'!M15,'MDA4'!U15),D15),0)","v":0},{"$f":"IF(AND(COUNTRY_INFO!H15>0,COUNTRY_INFO!H15<4), IF(G15/D15*100<>0, IF(G15/D15*100>100,100,G15/D15*100), \"-\"),0)","v":0},{"$f":"COUNTRY_INFO!N15","v":0},null,null,{"$f":"MAX('MDA1'!M15,MAX('MDA3'!I15,'MDA3'!L15)+MAX('MDA3'!J15,'MDA3'!M15))","v":0},{"$f":"IF(AND(COUNTRY_INFO!I15>0,COUNTRY_INFO!I15<4),IF(J15>MAX('MDA1'!M15,MAX('MDA3'!I15,'MDA3'!L15)+MAX('MDA3'!J15,'MDA3'!M15)),MAX('MDA1'!M15,MAX('MDA3'!I15,'MDA3'!L15)+MAX('MDA3'!J15,'MDA3'!M15)),J15),0)","v":0},{"$f":"IF(AND(COUNTRY_INFO!I15>0,COUNTRY_INFO!I15<4), IF(M15/J15*100<>0, IF(M15/J15*100>100,100,M15/J15*100), \"-\"),0)","v":0},{"$f":"COUNTRY_INFO!O15","v":1813},418,359,{"$f":"SUM(MAX('MDA4'!N15, 'T1'!L15, MAX(T3_R1!K15, T3_R2!K15)), MAX('MDA1'!K15, 'MDA4'!O15, 'T1'!M15, MAX(T3_R1!L15, T3_R2!L15)), MAX('MDA1'!L15, 'MDA4'!P15, 'T1'!N15, MAX(T3_R1!M15, T3_R2!M15)))","v":947},{"$f":"IF(AND(COUNTRY_INFO!J15>1,COUNTRY_INFO!J15<4),IF(COUNTRY_INFO!E15>MAX('MDA4'!N15,'T1'!L15,MAX(T3_R1!K15,T3_R2!K15)),MAX('MDA4'!N15,'T1'!L15,MAX(T3_R1!K15,T3_R2!K15)),COUNTRY_INFO!E15),0)","v":0},{"$f":"IF(AND(COUNTRY_INFO!J15>1,COUNTRY_INFO!J15<4), IF(T15/COUNTRY_INFO!E15*100<>0, IF(T15/COUNTRY_INFO!E15*100>100,100,T15/COUNTRY_INFO!E15*100), \"-\"),0)","v":"-"},{"$f":"IF(AND(COUNTRY_INFO!J15>1,COUNTRY_INFO!J15<4),IF(COUNTRY_INFO!F15>MAX('MDA1'!K15,'MDA4'!O15,'T1'!M15,MAX(T3_R1!L15,T3_R2!L15)),MAX('MDA1'!K15,'MDA4'!O15,'T1'!M15,MAX(T3_R1!L15,T3_R2!L15)),COUNTRY_INFO!F15),0)","v":947},{"$f":"IF(AND(COUNTRY_INFO!J15>1,COUNTRY_INFO!J15<4), IF(V15/COUNTRY_INFO!F15*100<>0, IF(V15/COUNTRY_INFO!F15*100>100,100,V15/COUNTRY_INFO!F15*100), \"-\"),0)","v":77.306122448979593},947,{"$f":"IF(AND(COUNTRY_INFO!J15>1,COUNTRY_INFO!J15<4), IF(S15/P15*100<>0, IF(X15/P15*100>100,100,X15/P15*100), \"-\"),0)","v":52.233866519580808},{"$f":"COUNTRY_INFO!P15","v":404.25},418,359,{"$f":"MAX('T1'!L15,'T2'!J15)+MAX('T1'!M15,'T2'!K15)+MAX('T1'!N15,'T2'!L15)","v":777},{"$f":"IF(COUNTRY_INFO!K15=1,IF(COUNTRY_INFO!F15*0.33>MAX('T1'!M15,'T2'!K15),MAX('T1'!M15,'T2'!K15),COUNTRY_INFO!F15*0.33),IF(COUNTRY_INFO!K15=2,IF(COUNTRY_INFO!F15*0.5>MAX('T1'!M15,'T2'!K15),MAX('T1'!M15,'T2'!K15),COUNTRY_INFO!F15*0.5),IF(COUNTRY_INFO!K15=3,IF(COUNTRY_INFO!F15>MAX('T1'!M15,'T2'!K15),MAX('T1'!M15,'T2'!K15),COUNTRY_INFO!F15),0)))","v":404.25},{"$f":"IF(AND(COUNTRY_INFO!K15>0,COUNTRY_INFO!K15<4),IF(Z15>0,IF(COUNTRY_INFO!K15=1, AD15/(COUNTRY_INFO!F15*0.33)*100, IF(COUNTRY_INFO!K15=2, AD15/(COUNTRY_INFO!F15*0.5)*100, IF(COUNTRY_INFO!K15=3, AD15/COUNTRY_INFO!F15*100))),\"-\"),0)","v":100},{"$f":"IF(COUNTRY_INFO!K15=2,IF(COUNTRY_INFO!G15*0.2>MAX('T1'!N15,'T2'!L15),MAX('T1'!N15,'T2'!L15),COUNTRY_INFO!G15*0.2),IF(COUNTRY_INFO!K15=3,IF(COUNTRY_INFO!G15>MAX('T1'!N15,'T2'!L15),MAX('T1'!N15,'T2'!L15),COUNTRY_INFO!G15),0))","v":0},{"$f":"IF(AND(COUNTRY_INFO!K15>0,COUNTRY_INFO!K15<4),IF(Z15>0,IF(COUNTRY_INFO!K15=1, 0, IF(COUNTRY_INFO!K15=2, AF15/(COUNTRY_INFO!G15*0.2)*100, IF(COUNTRY_INFO!K15=3, AF15/COUNTRY_INFO!G15*100))),\"-\"),0)","v":0},404.25,{"$f":"IF(AND(COUNTRY_INFO!K15>0,COUNTRY_INFO!K15<4), IF(AC15/Z15*100<>0, IF(AH15/Z15*100>100,100,AH15/Z15*100), \"-\"),0)","v":100},null,{"$f":"IF(AND(D15<>0, D15<>\"Inconnu\",D15<>\"Interrompu\",D15<>\"Non requis\"),D15/COUNTRY_INFO!D15, 0)","v":0},{"$f":"IF(AND(J15<>0,J15<>\"Inconnu\",J15<>\"Interrompu\",J15<>\"Non requis\"),J15/COUNTRY_INFO!D15, 0)","v":0},{"$f":"IF(AND(P15<>0,P15<>\"Inconnu\",P15<>\"Non requis\"),P15/(COUNTRY_INFO!E15+COUNTRY_INFO!F15), 0)","v":1},{"$f":"IF(AND(Z15<>0,Z15<>\"Inconnu\",Z15<>\"Non requis\"),IF(COUNTRY_INFO!K15=1,1,IF(COUNTRY_INFO!K15=2,0.5*COUNTRY_INFO!F15/(0.5*COUNTRY_INFO!F15+0.2*COUNTRY_INFO!G15),IF(COUNTRY_INFO!K15=3,COUNTRY_INFO!F15/(COUNTRY_INFO!F15+COUNTRY_INFO!G15)))),0)","v":1},{"$f":"IF(AND(Z15<>0,Z15<>\"Inconnu\",Z15<>\"Non requis\"),IF(COUNTRY_INFO!K15=1,0,IF(COUNTRY_INFO!K15=2,0.2*COUNTRY_INFO!G15/(0.5*COUNTRY_INFO!F15+0.2*COUNTRY_INFO!G15),IF(COUNTRY_INFO!K15=3,COUNTRY_INFO!G15/(COUNTRY_INFO!F15+COUNTRY_INFO!G15)))),0)","v":0},{"$f":"MAX(COUNTRY_INFO!D15*AK15*PROFILE!$G$7,COUNTRY_INFO!D15*AL15*PROFILE!$G$7)","v":0},{"$f":"MAX(COUNTRY_INFO!D15*AK15*PROFILE!$G$8,COUNTRY_INFO!D15*AL15*PROFILE!$G$8,COUNTRY_INFO!D15*AM15*PROFILE!$G$8)","v":587.99668040957749},{"$f":"MAX(COUNTRY_INFO!D15*AK15*PROFILE!$G$9,COUNTRY_INFO!D15*AL15*PROFILE!$G$9,COUNTRY_INFO!D15*AM15*PROFILE!$G$9,IF(AND(DISTRICT!Z15<>\"Inconnu\",Z15<>\"Non requis\"),COUNTRY_INFO!P15*DISTRICT!AN15,0))","v":1225.0142268160967},{"$f":"MAX(COUNTRY_INFO!D15*AK15*PROFILE!$G$10,COUNTRY_INFO!D15*AL15*PROFILE!$G$10,IF(AND(DISTRICT!Z15<>\"Inconnu\",Z15<>\"Non requis\"),COUNTRY_INFO!P15*DISTRICT!AO15,0))","v":0},1813.0109072256741,"Y",{"$f":"MAX('MDA4'!R15,'T1'!L15,'T2'!J15,T3_R1!K15,T3_R2!K15)","v":0},{"$f":"MAX('MDA1'!K15,'MDA4'!S15,'MDA3'!I15,'MDA3'!L15,'T1'!M15,'T2'!K15,T3_R1!L15,T3_R2!L15)","v":947},{"$f":"MAX('MDA1'!L15,'MDA4'!T15,'MDA3'!J15,'MDA3'!M15,'T1'!N15,'T2'!L15,T3_R1!M15,T3_R2!M15)","v":0},947,{"$f":"MAX('MDA4'!R15,T15)","v":0},{"$f":"MAX('MDA1'!K15,'MDA4'!S15,'MDA3'!I15,'MDA3'!L15,V15,AD15)","v":947},{"$f":"MAX('MDA1'!L15,'MDA4'!T15,'MDA3'!J15,'MDA3'!M15,AF15)","v":0},947,52.233552276258997]
[{"$f":"IF(COUNTRY_INFO!A16=0,\" \",COUNTRY_INFO!A16)","v":"Gabon"},{"$f":"IF(COUNTRY_INFO!B16=0,\" \",COUNTRY_INFO!B16)","v":"Sud-Est"},{"$f":"IF(COUNTRY_INFO!C16=0,\" \",COUNTRY_INFO!C16)","v":"Bayi-brikolo"},{"$f":"COUNTRY_INFO!M16","v":0},null,null,{"$f":"MAX('MDA1'!M16,'MDA4'!U16)","v":0},{"$f":"IF(AND(COUNTRY_INFO!H16>0,COUNTRY_INFO!H16<4),IF(D16>MAX('MDA1'!M16,'MDA4'!U16),MAX('MDA1'!M16,'MDA4'!U16),D16),0)","v":0},{"$f":"IF(AND(COUNTRY_INFO!H16>0,COUNTRY_INFO!H16<4), IF(G16/D16*100<>0, IF(G16/D16*100>100,100,G16/D16*100), \"-\"),0)","v":0},{"$f":"COUNTRY_INFO!N16","v":"Inconnu"},null,null,{"$f":"MAX('MDA1'!M16,MAX('MDA3'!I16,'MDA3'!L16)+MAX('MDA3'!J16,'MDA3'!M16))","v":0},{"$f":"IF(AND(COUNTRY_INFO!I16>0,COUNTRY_INFO!I16<4),IF(J16>MAX('MDA1'!M16,MAX('MDA3'!I16,'MDA3'!L16)+MAX('MDA3'!J16,'MDA3'!M16)),MAX('MDA1'!M16,MAX('MDA3'!I16,'MDA3'!L16)+MAX('MDA3'!J16,'MDA3'!M16)),J16),0)","v":0},{"$f":"IF(AND(COUNTRY_INFO!I16>0,COUNTRY_INFO!I16<4), IF(M16/J16*100<>0, IF(M16/J16*100>100,100,M16/J16*100), \"-\"),0)","v":0},{"$f":"COUNTRY_INFO!O16","v":2335},552,587,{"$f":"SUM(MAX('MDA4'!N16, 'T1'!L16, MAX(T3_R1!K16, T3_R2!K16)), MAX('MDA1'!K16, 'MDA4'!O16, 'T1'!M16, MAX(T3_R1!L16, T3_R2!L16)), MAX('MDA1'!L16, 'MDA4'!P16, 'T1'!N16, MAX(T3_R1!M16, T3_R2!M16)))","v":1139},{"$f":"IF(AND(COUNTRY_INFO!J16>1,COUNTRY_INFO!J16<4),IF(COUNTRY_INFO!E16>MAX('MDA4'!N16,'T1'!L16,MAX(T3_R1!K16,T3_R2!K16)),MAX('MDA4'!N16,'T1'!L16,MAX(T3_R1!K16,T3_R2!K16)),COUNTRY_INFO!E16),0)","v":0},{"$f":"IF(AND(COUNTRY_INFO!J16>1,COUNTRY_INFO!J16<4), IF(T16/COUNTRY_INFO!E16*100<>0, IF(T16/COUNTRY_INFO!E16*100>100,100,T16/COUNTRY_INFO!E16*100), \"-\"),0)","v":"-"},{"$f":"IF(AND(COUNTRY_INFO!J16>1,COUNTRY_INFO!J16<4),IF(COUNTRY_INFO!F16>MAX('MDA1'!K16,'MDA4'!O16,'T1'!M16,MAX(T3_R1!L16,T3_R2!L16)),MAX('MDA1'!K16,'MDA4'!O16,'T1'!M16,MAX(T3_R1!L16,T3_R2!L16)),COUNTRY_INFO!F16),0)","v":1139},{"$f":"IF(AND(COUNTRY_INFO!J16>1,COUNTRY_INFO!J16<4), IF(V16/COUNTRY_INFO!F16*100<>0, IF(V16/COUNTRY_INFO!F16*100>100,100,V16/COUNTRY_INFO!F16*100), \"-\"),0)","v":72.179974651457542},1139,{"$f":"IF(AND(COUNTRY_INFO!J16>1,COUNTRY_INFO!J16<4), IF(S16/P16*100<>0, IF(X16/P16*100>100,100,X16/P16*100), \"-\"),0)","v":48.779443254817991},{"$f":"COUNTRY_INFO!P16","v":0},null,null,{"$f":"MAX('T1'!L16,'T2'!J16)+MAX('T1'!M16,'T2'!K16)+MAX('T1'!N16,'T2'!L16)","v":0},{"$f":"IF(COUNTRY_INFO!K16=1,IF(COUNTRY_INFO!F16*0.33>MAX('T1'!M16,'T2'!K16),MAX('T1'!M16,'T2'!K16),COUNTRY_INFO!F16*0.33),IF(COUNTRY_INFO!K16=2,IF(COUNTRY_INFO!F16*0.5>MAX('T1'!M16,'T2'!K16),MAX('T1'!M16,'T2'!K16),COUNTRY_INFO!F16*0.5),IF(COUNTRY_INFO!K16=3,IF(COUNTRY_INFO!F16>MAX('T1'!M16,'T2'!K16),MAX('T1'!M16,'T2'!K16),COUNTRY_INFO!F16),0)))","v":0},{"$f":"IF(AND(COUNTRY_INFO!K16>0,COUNTRY_INFO!K16<4),IF(Z16>0,IF(COUNTRY_INFO!K16=1, AD16/(COUNTRY_INFO!F16*0.33)*100, IF(COUNTRY_INFO!K16=2, AD16/(COUNTRY_INFO!F16*0.5)*100, IF(COUNTRY_INFO!K16=3, AD16/COUNTRY_INFO!F16*100))),\"-\"),0)","v":0},{"$f":"IF(COUNTRY_INFO!K16=2,IF(COUNTRY_INFO!G16*0.2>MAX('T1'!N16,'T2'!L16),MAX('T1'!N16,'T2'!L16),COUNTRY_INFO!G16*0.2),IF(COUNTRY_INFO!K16=3,IF(COUNTRY_INFO!G16>MAX('T1'!N16,'T2'!L16),MAX('T1'!N16,'T2'!L16),COUNTRY_INFO!G16),0))","v":0},{"$f":"IF(AND(COUNTRY_INFO!K16>0,COUNTRY_INFO!K16<4),IF(Z16>0,IF(COUNTRY_INFO!K16=1, 0, IF(COUNTRY_INFO!K16=2, AF16/(COUNTRY_INFO!G16*0.2)*100, IF(COUNTRY_INFO!K16=3, AF16/COUNTRY_INFO!G16*100))),\"-\"),0)","v":0},0,{"$f":"IF(AND(COUNTRY_INFO!K16>0,COUNTRY_INFO!K16<4), IF(AC16/Z16*100<>0, IF(AH16/Z16*100>100,100,AH16/Z16*100), \"-\"),0)","v":0},null,{"$f":"IF(AND(D16<>0, D16<>\"Inconnu\",D16<>\"Interrompu\",D16<>\"Non requis\"),D16/COUNTRY_INFO!D16, 0)","v":0},{"$f":"IF(AND(J16<>0,J16<>\"Inconnu\",J16<>\"Interrompu\",J16<>\"Non requis\"),J16/COUNTRY_INFO!D16, 0)","v":0},{"$f":"IF(AND(P16<>0,P16<>\"Inconnu\",P16<>\"Non requis\"),P16/(COUNTRY_INFO!E16+COUNTRY_INFO!F16), 0)","v":1},{"$f":"IF(AND(Z16<>0,Z16<>\"Inconnu\",Z16<>\"Non requis\"),IF(COUNTRY_INFO!K16=1,1,IF(COUNTRY_INFO!K16=2,0.5*COUNTRY_INFO!F16/(0.5*COUNTRY_INFO!F16+0.2*COUNTRY_INFO!G16),IF(COUNTRY_INFO!K16=3,COUNTRY_INFO!F16/(COUNTRY_INFO!F16+COUNTRY_INFO!G16)))),0)","v":0},{"$f":"IF(AND(Z16<>0,Z16<>\"Inconnu\",Z16<>\"Non requis\"),IF(COUNTRY_INFO!K16=1,0,IF(COUNTRY_INFO!K16=2,0.2*COUNTRY_INFO!G16/(0.5*COUNTRY_INFO!F16+0.2*COUNTRY_INFO!G16),IF(COUNTRY_INFO!K16=3,COUNTRY_INFO!G16/(COUNTRY_INFO!F16+COUNTRY_INFO!G16)))),0)","v":0},{"$f":"MAX(COUNTRY_INFO!D16*AK16*PROFILE!$G$7,COUNTRY_INFO!D16*AL16*PROFILE!$G$7)","v":0},{"$f":"MAX(COUNTRY_INFO!D16*AK16*PROFILE!$G$8,COUNTRY_INFO!D16*AL16*PROFILE!$G$8,COUNTRY_INFO!D16*AM16*PROFILE!$G$8)","v":757.19572518049665},{"$f":"MAX(COUNTRY_INFO!D16*AK16*PROFILE!$G$9,COUNTRY_INFO!D16*AL16*PROFILE!$G$9,COUNTRY_INFO!D16*AM16*PROFILE!$G$9,IF(AND(DISTRICT!Z16<>\"Inconnu\",Z16<>\"Non requis\"),COUNTRY_INFO!P16*DISTRICT!AN16,0))","v":1577.5183206550141},{"$f":"MAX(COUNTRY_INFO!D16*AK16*PROFILE!$G$10,COUNTRY_INFO!D16*AL16*PROFILE!$G$10,IF(AND(DISTRICT!Z16<>\"Inconnu\",Z16<>\"Non requis\"),COUNTRY_INFO!P16*DISTRICT!AO16,0))","v":0},2334.7140458355107,"Y",{"$f":"MAX('MDA4'!R16,'T1'!L16,'T2'!J16,T3_R1!K16,T3_R2!K16)","v":0},{"$f":"MAX('MDA1'!K16,'MDA4'!S16,'MDA3'!I16,'MDA3'!L16,'T1'!M16,'T2'!K16,T3_R1!L16,T3_R2!L16)","v":1139},{"$f":"MAX('MDA1'!L16,'MDA4'!T16,'MDA3'!J16,'MDA3'!M16,'T1'!N16,'T2'!L16,T3_R1!M16,T3_R2!M16)","v":0},1139,{"$f":"MAX('MDA4'!R16,T16)","v":0},{"$f":"MAX('MDA1'!K16,'MDA4'!S16,'MDA3'!I16,'MDA3'!L16,V16,AD16)","v":1139},{"$f":"MAX('MDA1'!L16,'MDA4'!T16,'MDA3'!J16,'MDA3'!M16,AF16)","v":0},1139,48.785417727351387]
[{"$f":"IF(COUNTRY_INFO!A17=0,\" \",COUNTRY_INFO!A17)","v":"Gabon"},{"$f":"IF(COUNTRY_INFO!B17=0,\" \",COUNTRY_INFO!B17)","v":"Sud-Est"},{"$f":"IF(COUNTRY_INFO!C17=0,\" \",COUNTRY_INFO!C17)","v":"Lékoni-Lékori"},{"$f":"COUNTRY_INFO!M17","v":0},null,null,{"$f":"MAX('MDA1'!M17,'MDA4'!U17)","v":0},{"$f":"IF(AND(COUNTRY_INFO!H17>0,COUNTRY_INFO!H17<4),IF(D17>MAX('MDA1'!M17,'MDA4'!U17),MAX('MDA1'!M17,'MDA4'!U17),D17),0)","v":0},{"$f":"IF(AND(COUNTRY_INFO!H17>0,COUNTRY_INFO!H17<4), IF(G17/D17*100<>0, IF(G17/D17*100>100,100,G17/D17*100), \"-\"),0)","v":0},{"$f":"COUNTRY_INFO!N17","v":0},null,null,{"$f":"MAX('MDA1'!M17,MAX('MDA3'!I17,'MDA3'!L17)+MAX('MDA3'!J17,'MDA3'!M17))","v":0},{"$f":"IF(AND(COUNTRY_INFO!I17>0,COUNTRY_INFO!I17<4),IF(J17>MAX('MDA1'!M17,MAX('MDA3'!I17,'MDA3'!L17)+MAX('MDA3'!J17,'MDA3'!M17)),MAX('MDA1'!M17,MAX('MDA3'!I17,'MDA3'!L17)+MAX('MDA3'!J17,'MDA3'!M17)),J17),0)","v":0},{"$f":"IF(AND(COUNTRY_INFO!I17>0,COUNTRY_INFO!I17<4), IF(M17/J17*100<>0, IF(M17/J17*100>100,100,M17/J17*100), \"-\"),0)","v":0},{"$f":"COUNTRY_INFO!O17","v":4693},564,557,{"$f":"SUM(MAX('MDA4'!N17, 'T1'!L17, MAX(T3_R1!K17, T3_R2!K17)), MAX('MDA1'!K17, 'MDA4'!O17, 'T1'!M17, MAX(T3_R1!L17, T3_R2!L17)), MAX('MDA1'!L17, 'MDA4'!P17, 'T1'!N17, MAX(T3_R1!M17, T3_R2!M17)))","v":1253},{"$f":"IF(AND(COUNTRY_INFO!J17>1,COUNTRY_INFO!J17<4),IF(COUNTRY_INFO!E17>MAX('MDA4'!N17,'T1'!L17,MAX(T3_R1!K17,T3_R2!K17)),MAX('MDA4'!N17,'T1'!L17,MAX(T3_R1!K17,T3_R2!K17)),COUNTRY_INFO!E17),0)","v":0},{"$f":"IF(AND(COUNTRY_INFO!J17>1,COUNTRY_INFO!J17<4), IF(T17/COUNTRY_INFO!E17*100<>0, IF(T17/COUNTRY_INFO!E17*100>100,100,T17/COUNTRY_INFO!E17*100), \"-\"),0)","v":"-"},{"$f":"IF(AND(COUNTRY_INFO!J17>1,COUNTRY_INFO!J17<4),IF(COUNTRY_INFO!F17>MAX('MDA1'!K17,'MDA4'!O17,'T1'!M17,MAX(T3_R1!L17,T3_R2!L17)),MAX('MDA1'!K17,'MDA4'!O17,'T1'!M17,MAX(T3_R1!L17,T3_R2!L17)),COUNTRY_INFO!F17),0)","v":1253},{"$f":"IF(AND(COUNTRY_INFO!J17>1,COUNTRY_INFO!J17<4), IF(V17/COUNTRY_INFO!F17*100<>0, IF(V17/COUNTRY_INFO!F17*100>100,100,V17/COUNTRY_INFO!F17*100), \"-\"),0)","v":39.514348785871967},1253,{"$f":"IF(AND(COUNTRY_INFO!J17>1,COUNTRY_INFO!J17<4), IF(S17/P17*100<>0, IF(X17/P17*100>100,100,X17/P17*100), \"-\"),0)","v":26.699339441721715},{"$f":"COUNTRY_INFO!P17","v":1046.43},564,557,{"$f":"MAX('T1'!L17,'T2'!J17)+MAX('T1'!M17,'T2'!K17)+MAX('T1'!N17,'T2'!L17)","v":1121},{"$f":"IF(COUNTRY_INFO!K17=1,IF(COUNTRY_INFO!F17*0.33>MAX('T1'!M17,'T2'!K17),MAX('T1'!M17,'T2'!K17),COUNTRY_INFO!F17*0.33),IF(COUNTRY_INFO!K17=2,IF(COUNTRY_INFO!F17*0.5>MAX('T1'!M17,'T2'!K17),MAX('T1'!M17,'T2'!K17),COUNTRY_INFO!F17*0.5),IF(COUNTRY_INFO!K17=3,IF(COUNTRY_INFO!F17>MAX('T1'!M17,'T2'!K17),MAX('T1'!M17,'T2'!K17),COUNTRY_INFO!F17),0)))","v":1046.43},{"$f":"IF(AND(COUNTRY_INFO!K17>0,COUNTRY_INFO!K17<4),IF(Z17>0,IF(COUNTRY_INFO!K17=1, AD17/(COUNTRY_INFO!F17*0.33)*100, IF(COUNTRY_INFO!K17=2, AD17/(COUNTRY_INFO!F17*0.5)*100, IF(COUNTRY_INFO!K17=3, AD17/COUNTRY_INFO!F17*100))),\"-\"),0)","v":100},{"$f":"IF(COUNTRY_INFO!K17=2,IF(COUNTRY_INFO!G17*0.2>MAX('T1'!N17,'T2'!L17),MAX('T1'!N17,'T2'!L17),COUNTRY_INFO!G17*0.2),IF(COUNTRY_INFO!K17=3,IF(COUNTRY_INFO!G17>MAX('T1'!N17,'T2'!L17),MAX('T1'!N17,'T2'!L17),COUNTRY_INFO!G17),0))","v":0},{"$f":"IF(AND(COUNTRY_INFO!K17>0,COUNTRY_INFO!K17<4),IF(Z17>0,IF(COUNTRY_INFO!K17=1, 0, IF(COUNTRY_INFO!K17=2, AF17/(COUNTRY_INFO!G17*0.2)*100, IF(COUNTRY_INFO!K17=3, AF17/COUNTRY_INFO!G17*100))),\"-\"),0)","v":0},1046.43,{"$f":"IF(AND(COUNTRY_INFO!K17>0,COUNTRY_INFO!K17<4), IF(AC17/Z17*100<>0, IF(AH17/Z17*100>100,100,AH17/Z17*100), \"-\"),0)","v":100},null,{"$f":"IF(AND(D17<>0, D17<>\"Inconnu\",D17<>\"Interrompu\",D17<>\"Non requis\"),D17/COUNTRY_INFO!D17, 0)","v":0},{"$f":"IF(AND(J17<>0,J17<>\"Inconnu\",J17<>\"Interrompu\",J17<>\"Non requis\"),J17/COUNTRY_INFO!D17, 0)","v":0},{"$f":"IF(AND(P17<>0,P17<>\"Inconnu\",P17<>\"Non requis\"),P17/(COUNTRY_INFO!E17+COUNTRY_INFO!F17), 0)","v":1},{"$f":"IF(AND(Z17<>0,Z17<>\"Inconnu\",Z17<>\"Non requis\"),IF(COUNTRY_INFO!K17=1,1,IF(COUNTRY_INFO!K17=2,0.5*COUNTRY_INFO!F17/(0.5*COUNTRY_INFO!F17+0.2*COUNTRY_INFO!G17),IF(COUNTRY_INFO!K17=3,COUNTRY_INFO!F17/(COUNTRY_INFO!F17+COUNTRY_INFO!G17)))),0)","v":1},{"$f":"IF(AND(Z17<>0,Z17<>\"Inconnu\",Z17<>\"Non requis\"),IF(COUNTRY_INFO!K17=1,0,IF(COUNTRY_INFO!K17=2,0.2*COUNTRY_INFO!G17/(0.5*COUNTRY_INFO!F17+0.2*COUNTRY_INFO!G17),IF(COUNTRY_INFO!K17=3,COUNTRY_INFO!G17/(COUNTRY_INFO!F17+COUNTRY_INFO!G17)))),0)","v":0},{"$f":"MAX(COUNTRY_INFO!D17*AK17*PROFILE!$G$7,COUNTRY_INFO!D17*AL17*PROFILE!$G$7)","v":0},{"$f":"MAX(COUNTRY_INFO!D17*AK17*PROFILE!$G$8,COUNTRY_INFO!D17*AL17*PROFILE!$G$8,COUNTRY_INFO!D17*AM17*PROFILE!$G$8)","v":1522.1914063256102},{"$f":"MAX(COUNTRY_INFO!D17*AK17*PROFILE!$G$9,COUNTRY_INFO!D17*AL17*PROFILE!$G$9,COUNTRY_INFO!D17*AM17*PROFILE!$G$9,IF(AND(DISTRICT!Z17<>\"Inconnu\",Z17<>\"Non requis\"),COUNTRY_INFO!P17*DISTRICT!AN17,0))","v":3171.2868300330988},{"$f":"MAX(COUNTRY_INFO!D17*AK17*PROFILE!$G$10,COUNTRY_INFO!D17*AL17*PROFILE!$G$10,IF(AND(DISTRICT!Z17<>\"Inconnu\",Z17<>\"Non requis\"),COUNTRY_INFO!P17*DISTRICT!AO17,0))","v":0},4693.4782363587092,"Y",{"$f":"MAX('MDA4'!R17,'T1'!L17,'T2'!J17,T3_R1!K17,T3_R2!K17)","v":0},{"$f":"MAX('MDA1'!K17,'MDA4'!S17,'MDA3'!I17,'MDA3'!L17,'T1'!M17,'T2'!K17,T3_R1!L17,T3_R2!L17)","v":1253},{"$f":"MAX('MDA1'!L17,'MDA4'!T17,'MDA3'!J17,'MDA3'!M17,'T1'!N17,'T2'!L17,T3_R1!M17,T3_R2!M17)","v":0},1253,{"$f":"MAX('MDA4'!R17,T17)","v":0},{"$f":"MAX('MDA1'!K17,'MDA4'!S17,'MDA3'!I17,'MDA3'!L17,V17,AD17)","v":1253},{"$f":"MAX('MDA1'!L17,'MDA4'!T17,'MDA3'!J17,'MDA3'!M17,AF17)","v":0},1253,26.696618944420663]
[{"$f":"IF(COUNTRY_INFO!A18=0,\" \",COUNTRY_INFO!A18)","v":"Gabon"},{"$f":"IF(COUNTRY_INFO!B18=0,\" \",COUNTRY_INFO!B18)","v":"Sud-Est"},{"$f":"IF(COUNTRY_INFO!C18=0,\" \",COUNTRY_INFO!C18)","v":"Lékoko"},{"$f":"COUNTRY_INFO!M18","v":0},null,null,{"$f":"MAX('MDA1'!M18,'MDA4'!U18)","v":0},{"$f":"IF(AND(COUNTRY_INFO!H18>0,COUNTRY_INFO!H18<4),IF(D18>MAX('MDA1'!M18,'MDA4'!U18),MAX('MDA1'!M18,'MDA4'!U18),D18),0)","v":0},{"$f":"IF(AND(COUNTRY_INFO!H18>0,COUNTRY_INFO!H18<4), IF(G18/D18*100<>0, IF(G18/D18*100>100,100,G18/D18*100), \"-\"),0)","v":0},{"$f":"COUNTRY_INFO!N18","v":0},null,null,{"$f":"MAX('MDA1'!M18,MAX('MDA3'!I18,'MDA3'!L18)+MAX('MDA3'!J18,'MDA3'!M18))","v":0},{"$f":"IF(AND(COUNTRY_INFO!I18>0,COUNTRY_INFO!I18<4),IF(J18>MAX('MDA1'!M18,MAX('MDA3'!I18,'MDA3'!L18)+MAX('MDA3'!J18,'MDA3'!M18)),MAX('MDA1'!M18,MAX('MDA3'!I18,'MDA3'!L18)+MAX('MDA3'!J18,'MDA3'!M18)),J18),0)","v":0},{"$f":"IF(AND(COUNTRY_INFO!I18>0,COUNTRY_INFO!I18<4), IF(M18/J18*100<>0, IF(M18/J18*100>100,100,M18/J18*100), \"-\"),0)","v":0},{"$f":"COUNTRY_INFO!O18","v":2099},331,271,{"$f":"SUM(MAX('MDA4'!N18, 'T1'!L18, MAX(T3_R1!K18, T3_R2!K18)), MAX('MDA1'!K18, 'MDA4'!O18, 'T1'!M18, MAX(T3_R1!L18, T3_R2!L18)), MAX('MDA1'!L18, 'MDA4'!P18, 'T1'!N18, MAX(T3_R1!M18, T3_R2!M18)))","v":602},{"$f":"IF(AND(COUNTRY_INFO!J18>1,COUNTRY_INFO!J18<4),IF(COUNTRY_INFO!E18>MAX('MDA4'!N18,'T1'!L18,MAX(T3_R1!K18,T3_R2!K18)),MAX('MDA4'!N18,'T1'!L18,MAX(T3_R1!K18,T3_R2!K18)),COUNTRY_INFO!E18),0)","v":0},{"$f":"IF(AND(COUNTRY_INFO!J18>1,COUNTRY_INFO!J18<4), IF(T18/COUNTRY_INFO!E18*100<>0, IF(T18/COUNTRY_INFO!E18*100>100,100,T18/COUNTRY_INFO!E18*100), \"-\"),0)","v":"-"},{"$f":"IF(AND(COUNTRY_INFO!J18>1,COUNTRY_INFO!J18<4),IF(COUNTRY_INFO!F18>MAX('MDA1'!K18,'MDA4'!O18,'T1'!M18,MAX(T3_R1!L18,T3_R2!L18)),MAX('MDA1'!K18,'MDA4'!O18,'T1'!M18,MAX(T3_R1!L18,T3_R2!L18)),COUNTRY_INFO!F18),0)","v":602},{"$f":"IF(AND(COUNTRY_INFO!J18>1,COUNTRY_INFO!J18<4), IF(V18/COUNTRY_INFO!F18*100<>0, IF(V18/COUNTRY_INFO!F18*100>100,100,V18/COUNTRY_INFO!F18*100), \"-\"),0)","v":42.454160789844849},602,{"$f":"IF(AND(COUNTRY_INFO!J18>1,COUNTRY_INFO!J18<4), IF(S18/P18*100<>0, IF(X18/P18*100>100,100,X18/P18*100), \"-\"),0)","v":28.680323963792283},{"$f":"COUNTRY_INFO!P18","v":467.94},331,271,{"$f":"MAX('T1'!L18,'T2'!J18)+MAX('T1'!M18,'T2'!K18)+MAX('T1'!N18,'T2'!L18)","v":602},{"$f":"IF(COUNTRY_INFO!K18=1,IF(COUNTRY_INFO!F18*0.33>MAX('T1'!M18,'T2'!K18),MAX('T1'!M18,'T2'!K18),COUNTRY_INFO!F18*0.33),IF(COUNTRY_INFO!K18=2,IF(COUNTRY_INFO!F18*0.5>MAX('T1'!M18,'T2'!K18),MAX('T1'!M18,'T2'!K18),COUNTRY_INFO!F18*0.5),IF(COUNTRY_INFO!K18=3,IF(COUNTRY_INFO!F18>MAX('T1'!M18,'T2'!K18),MAX('T1'!M18,'T2'!K18),COUNTRY_INFO!F18),0)))","v":467.94},{"$f":"IF(AND(COUNTRY_INFO!K18>0,COUNTRY_INFO!K18<4),IF(Z18>0,IF(COUNTRY_INFO!K18=1, AD18/(COUNTRY_INFO!F18*0.33)*100, IF(COUNTRY_INFO!K18=2, AD18/(COUNTRY_INFO!F18*0.5)*100, IF(COUNTRY_INFO!K18=3, AD18/COUNTRY_INFO!F18*100))),\"-\"),0)","v":100},{"$f":"IF(COUNTRY_INFO!K18=2,IF(COUNTRY_INFO!G18*0.2>MAX('T1'!N18,'T2'!L18),MAX('T1'!N18,'T2'!L18),COUNTRY_INFO!G18*0.2),IF(COUNTRY_INFO!K18=3,IF(COUNTRY_INFO!G18>MAX('T1'!N18,'T2'!L18),MAX('T1'!N18,'T2'!L18),COUNTRY_INFO!G18),0))","v":0},{"$f":"IF(AND(COUNTRY_INFO!K18>0,COUNTRY_INFO!K18<4),IF(Z18>0,IF(COUNTRY_INFO!K18=1, 0, IF(COUNTRY_INFO!K18=2, AF18/(COUNTRY_INFO!G18*0.2)*100, IF(COUNTRY_INFO!K18=3, AF18/COUNTRY_INFO!G18*100))),\"-\"),0)","v":0},467.94,{"$f":"IF(AND(COUNTRY_INFO!K18>0,COUNTRY_INFO!K18<4), IF(AC18/Z18*100<>0, IF(AH18/Z18*100>100,100,AH18/Z18*100), \"-\"),0)","v":100},null,{"$f":"IF(AND(D18<>0, D18<>\"Inconnu\",D18<>\"Interrompu\",D18<>\"Non requis\"),D18/COUNTRY_INFO!D18, 0)","v":0},{"$f":"IF(AND(J18<>0,J18<>\"Inconnu\",J18<>\"Interrompu\",J18<>\"Non requis\"),J18/COUNTRY_INFO!D18, 0)","v":0},{"$f":"IF(AND(P18<>0,P18<>\"Inconnu\",P18<>\"Non requis\"),P18/(COUNTRY_INFO!E18+COUNTRY_INFO!F18), 0)","v":1},{"$f":"IF(AND(Z18<>0,Z18<>\"Inconnu\",Z18<>\"Non requis\"),IF(COUNTRY_INFO!K18=1,1,IF(COUNTRY_INFO!K18=2,0.5*COUNTRY_INFO!F18/(0.5*COUNTRY_INFO!F18+0.2*COUNTRY_INFO!G18),IF(COUNTRY_INFO!K18=3,COUNTRY_INFO!F18/(COUNTRY_INFO!F18+COUNTRY_INFO!G18)))),0)","v":1},{"$f":"IF(AND(Z18<>0,Z18<>\"Inconnu\",Z18<>\"Non requis\"),IF(COUNTRY_INFO!K18=1,0,IF(COUNTRY_INFO!K18=2,0.2*COUNTRY_INFO!G18/(0.5*COUNTRY_INFO!F18+0.2*COUNTRY_INFO!G18),IF(COUNTRY_INFO!K18=3,COUNTRY_INFO!G18/(COUNTRY_INFO!F18+COUNTRY_INFO!G18)))),0)","v":0},{"$f":"MAX(COUNTRY_INFO!D18*AK18*PROFILE!$G$7,COUNTRY_INFO!D18*AL18*PROFILE!$G$7)","v":0},{"$f":"MAX(COUNTRY_INFO!D18*AK18*PROFILE!$G$8,COUNTRY_INFO!D18*AL18*PROFILE!$G$8,COUNTRY_INFO!D18*AM18*PROFILE!$G$8)","v":680.75615672725166},{"$f":"MAX(COUNTRY_INFO!D18*AK18*PROFILE!$G$9,COUNTRY_INFO!D18*AL18*PROFILE!$G$9,COUNTRY_INFO!D18*AM18*PROFILE!$G$9,IF(AND(DISTRICT!Z18<>\"Inconnu\",Z18<>\"Non requis\"),COUNTRY_INFO!P18*DISTRICT!AN18,0))","v":1418.2664711689215},{"$f":"MAX(COUNTRY_INFO!D18*AK18*PROFILE!$G$10,COUNTRY_INFO!D18*AL18*PROFILE!$G$10,IF(AND(DISTRICT!Z18<>\"Inconnu\",Z18<>\"Non requis\"),COUNTRY_INFO!P18*DISTRICT!AO18,0))","v":0},2099.0226278961732,"Y",{"$f":"MAX('MDA4'!R18,'T1'!L18,'T2'!J18,T3_R1!K18,T3_R2!K18)","v":0},{"$f":"MAX('MDA1'!K18,'MDA4'!S18,'MDA3'!I18,'MDA3'!L18,'T1'!M18,'T2'!K18,T3_R1!L18,T3_R2!L18)","v":602},{"$f":"MAX('MDA1'!L18,'MDA4'!T18,'MDA3'!J18,'MDA3'!M18,'T1'!N18,'T2'!L18,T3_R1!M18,T3_R2!M18)","v":0},602,{"$f":"MAX('MDA4'!R18,T18)","v":0},{"$f":"MAX('MDA1'!K18,'MDA4'!S18,'MDA3'!I18,'MDA3'!L18,V18,AD18)","v":602},{"$f":"MAX('MDA1'!L18,'MDA4'!T18,'MDA3'!J18,'MDA3'!M18,AF18)","v":0},602,28.680014783993911]
[{"$f":"IF(COUNTRY_INFO!A19=0,\" \",COUNTRY_INFO!A19)","v":"Gabon"},{"$f":"IF(COUNTRY_INFO!B19=0,\" \",COUNTRY_INFO!B19)","v":"Sud-Est"},{"$f":"IF(COUNTRY_INFO!C19=0,\" \",COUNTRY_INFO!C19)","v":"Djouori-Agnili"},{"$f":"COUNTRY_INFO!M19","v":6215},null,null,{"$f":"MAX('MDA1'!M19,'MDA4'!U19)","v":0},{"$f":"IF(AND(COUNTRY_INFO!H19>0,COUNTRY_INFO!H19<4),IF(D19>MAX('MDA1'!M19,'MDA4'!U19),MAX('MDA1'!M19,'MDA4'!U19),D19),0)","v":0},{"$f":"IF(AND(COUNTRY_INFO!H19>0,COUNTRY_INFO!H19<4), IF(G19/D19*100<>0, IF(G19/D19*100>100,100,G19/D19*100), \"-\"),0)","v":"-"},{"$f":"COUNTRY_INFO!N19","v":"Inconnu"},null,null,{"$f":"MAX('MDA1'!M19,MAX('MDA3'!I19,'MDA3'!L19)+MAX('MDA3'!J19,'MDA3'!M19))","v":0},{"$f":"IF(AND(COUNTRY_INFO!I19>0,COUNTRY_INFO!I19<4),IF(J19>MAX('MDA1'!M19,MAX('MDA3'!I19,'MDA3'!L19)+MAX('MDA3'!J19,'MDA3'!M19)),MAX('MDA1'!M19,MAX('MDA3'!I19,'MDA3'!L19)+MAX('MDA3'!J19,'MDA3'!M19)),J19),0)","v":0},{"$f":"IF(AND(COUNTRY_INFO!I19>0,COUNTRY_INFO!I19<4), IF(M19/J19*100<>0, IF(M19/J19*100>100,100,M19/J19*100), \"-\"),0)","v":0},{"$f":"COUNTRY_INFO!O19","v":2300},353,353,{"$f":"SUM(MAX('MDA4'!N19, 'T1'!L19, MAX(T3_R1!K19, T3_R2!K19)), MAX('MDA1'!K19, 'MDA4'!O19, 'T1'!M19, MAX(T3_R1!L19, T3_R2!L19)), MAX('MDA1'!L19, 'MDA4'!P19, 'T1'!N19, MAX(T3_R1!M19, T3_R2!M19)))","v":706},{"$f":"IF(AND(COUNTRY_INFO!J19>1,COUNTRY_INFO!J19<4),IF(COUNTRY_INFO!E19>MAX('MDA4'!N19,'T1'!L19,MAX(T3_R1!K19,T3_R2!K19)),MAX('MDA4'!N19,'T1'!L19,MAX(T3_R1!K19,T3_R2!K19)),COUNTRY_INFO!E19),0)","v":0},{"$f":"IF(AND(COUNTRY_INFO!J19>1,COUNTRY_INFO!J19<4), IF(T19/COUNTRY_INFO!E19*100<>0, IF(T19/COUNTRY_INFO!E19*100>100,100,T19/COUNTRY_INFO!E19*100), \"-\"),0)","v":"-"},{"$f":"IF(AND(COUNTRY_INFO!J19>1,COUNTRY_INFO!J19<4),IF(COUNTRY_INFO!F19>MAX('MDA1'!K19,'MDA4'!O19,'T1'!M19,MAX(T3_R1!L19,T3_R2!L19)),MAX('MDA1'!K19,'MDA4'!O19,'T1'!M19,MAX(T3_R1!L19,T3_R2!L19)),COUNTRY_INFO!F19),0)","v":706},{"$f":"IF(AND(COUNTRY_INFO!J19>1,COUNTRY_INFO!J19<4), IF(V19/COUNTRY_INFO!F19*100<>0, IF(V19/COUNTRY_INFO!F19*100>100,100,V19/COUNTRY_INFO!F19*100), \"-\"),0)","v":45.431145431145431},706,{"$f":"IF(AND(COUNTRY_INFO!J19>1,COUNTRY_INFO!J19<4), IF(S19/P19*100<>0, IF(X19/P19*100>100,100,X19/P19*100), \"-\"),0)","v":30.695652173913047},{"$f":"COUNTRY_INFO!P19","v":0},null,null,{"$f":"MAX('T1'!L19,'T2'!J19)+MAX('T1'!M19,'T2'!K19)+MAX('T1'!N19,'T2'!L19)","v":0},{"$f":"IF(COUNTRY_INFO!K19=1,IF(COUNTRY_INFO!F19*0.33>MAX('T1'!M19,'T2'!K19),MAX('T1'!M19,'T2'!K19),COUNTRY_INFO!F19*0.33),IF(COUNTRY_INFO!K19=2,IF(COUNTRY_INFO!F19*0.5>MAX('T1'!M19,'T2'!K19),MAX('T1'!M19,'T2'!K19),COUNTRY_INFO!F19*0.5),IF(COUNTRY_INFO!K19=3,IF(COUNTRY_INFO!F19>MAX('T1'!M19,'T2'!K19),MAX('T1'!M19,'T2'!K19),COUNTRY_INFO!F19),0)))","v":0},{"$f":"IF(AND(COUNTRY_INFO!K19>0,COUNTRY_INFO!K19<4),IF(Z19>0,IF(COUNTRY_INFO!K19=1, AD19/(COUNTRY_INFO!F19*0.33)*100, IF(COUNTRY_INFO!K19=2, AD19/(COUNTRY_INFO!F19*0.5)*100, IF(COUNTRY_INFO!K19=3, AD19/COUNTRY_INFO!F19*100))),\"-\"),0)","v":0},{"$f":"IF(COUNTRY_INFO!K19=2,IF(COUNTRY_INFO!G19*0.2>MAX('T1'!N19,'T2'!L19),MAX('T1'!N19,'T2'!L19),COUNTRY_INFO!G19*0.2),IF(COUNTRY_INFO!K19=3,IF(COUNTRY_INFO!G19>MAX('T1'!N19,'T2'!L19),MAX('T1'!N19,'T2'!L19),COUNTRY_INFO!G19),0))","v":0},{"$f":"IF(AND(COUNTRY_INFO!K19>0,COUNTRY_INFO!K19<4),IF(Z19>0,IF(COUNTRY_INFO!K19=1, 0, IF(COUNTRY_INFO!K19=2, AF19/(COUNTRY_INFO!G19*0.2)*100, IF(COUNTRY_INFO!K19=3, AF19/COUNTRY_INFO!G19*100))),\"-\"),0)","v":0},0,{"$f":"IF(AND(COUNTRY_INFO!K19>0,COUNTRY_INFO!K19<4), IF(AC19/Z19*100<>0, IF(AH19/Z19*100>100,100,AH19/Z19*100), \"-\"),0)","v":0},null,{"$f":"IF(AND(D19<>0, D19<>\"Inconnu\",D19<>\"Interrompu\",D19<>\"Non requis\"),D19/COUNTRY_INFO!D19, 0)","v":1},{"$f":"IF(AND(J19<>0,J19<>\"Inconnu\",J19<>\"Interrompu\",J19<>\"Non requis\"),J19/COUNTRY_INFO!D19, 0)","v":0},{"$f":"IF(AND(P19<>0,P19<>\"Inconnu\",P19<>\"Non requis\"),P19/(COUNTRY_INFO!E19+COUNTRY_INFO!F19), 0)","v":1},{"$f":"IF(AND(Z19<>0,Z19<>\"Inconnu\",Z19<>\"Non requis\"),IF(COUNTRY_INFO!K19=1,1,IF(COUNTRY_INFO!K19=2,0.5*COUNTRY_INFO!F19/(0.5*COUNTRY_INFO!F19+0.2*COUNTRY_INFO!G19),IF(COUNTRY_INFO!K19=3,COUNTRY_INFO!F19/(COUNTRY_INFO!F19+COUNTRY_INFO!G19)))),0)","v":0},{"$f":"IF(AND(Z19<>0,Z19<>\"Inconnu\",Z19<>\"Non requis\"),IF(COUNTRY_INFO!K19=1,0,IF(COUNTRY_INFO!K19=2,0.2*COUNTRY_INFO!G19/(0.5*COUNTRY_INFO!F19+0.2*COUNTRY_INFO!G19),IF(COUNTRY_INFO!K19=3,COUNTRY_INFO!G19/(COUNTRY_INFO!F19+COUNTRY_INFO!G19)))),0)","v":0},{"$f":"MAX(COUNTRY_INFO!D19*AK19*PROFILE!$G$7,COUNTRY_INFO!D19*AL19*PROFILE!$G$7)","v":248.57954919381373},{"$f":"MAX(COUNTRY_INFO!D19*AK19*PROFILE!$G$8,COUNTRY_INFO!D19*AL19*PROFILE!$G$8,COUNTRY_INFO!D19*AM19*PROFILE!$G$8)","v":745.7957895399029},{"$f":"MAX(COUNTRY_INFO!D19*AK19*PROFILE!$G$9,COUNTRY_INFO!D19*AL19*PROFILE!$G$9,COUNTRY_INFO!D19*AM19*PROFILE!$G$9,IF(AND(DISTRICT!Z19<>\"Inconnu\",Z19<>\"Non requis\"),COUNTRY_INFO!P19*DISTRICT!AN19,0))","v":1553.7680448289877},{"$f":"MAX(COUNTRY_INFO!D19*AK19*PROFILE!$G$10,COUNTRY_INFO!D19*AL19*PROFILE!$G$10,IF(AND(DISTRICT!Z19<>\"Inconnu\",Z19<>\"Non requis\"),COUNTRY_INFO!P19*DISTRICT!AO19,0))","v":3666.8566164372955},6215,0,{"$f":"MAX('MDA4'!R19,'T1'!L19,'T2'!J19,T3_R1!K19,T3_R2!K19)","v":0},{"$f":"MAX('MDA1'!K19,'MDA4'!S19,'MDA3'!I19,'MDA3'!L19,'T1'!M19,'T2'!K19,T3_R1!L19,T3_R2!L19)","v":706},{"$f":"MAX('MDA1'!L19,'MDA4'!T19,'MDA3'!J19,'MDA3'!M19,'T1'!N19,'T2'!L19,T3_R1!M19,T3_R2!M19)","v":0},706,{"$f":"MAX('MDA4'!R19,T19)","v":0},{"$f":"MAX('MDA1'!K19,'MDA4'!S19,'MDA3'!I19,'MDA3'!L19,V19,AD19)","v":706},{"$f":"MAX('MDA1'!L19,'MDA4'!T19,'MDA3'!J19,'MDA3'!M19,AF19)","v":0},706,11.359613837489944]
[{"$f":"IF(COUNTRY_INFO!A20=0,\" \",COUNTRY_INFO!A20)","v":"Gabon"},{"$f":"IF(COUNTRY_INFO!B20=0,\" \",COUNTRY_INFO!B20)","v":"Sud-Est"},{"$f":"IF(COUNTRY_INFO!C20=0,\" \",COUNTRY_INFO!C20)","v":"Ogooué-Létili"},{"$f":"COUNTRY_INFO!M20","v":0},null,null,{"$f":"MAX('MDA1'!M20,'MDA4'!U20)","v":0},{"$f":"IF(AND(COUNTRY_INFO!H20>0,COUNTRY_INFO!H20<4),IF(D20>MAX('MDA1'!M20,'MDA4'!U20),MAX('MDA1'!M20,'MDA4'!U20),D20),0)","v":0},{"$f":"IF(AND(COUNTRY_INFO!H20>0,COUNTRY_INFO!H20<4), IF(G20/D20*100<>0, IF(G20/D20*100>100,100,G20/D20*100), \"-\"),0)","v":0},{"$f":"COUNTRY_INFO!N20","v":"Inconnu"},null,null,{"$f":"MAX('MDA1'!M20,MAX('MDA3'!I20,'MDA3'!L20)+MAX('MDA3'!J20,'MDA3'!M20))","v":0},{"$f":"IF(AND(COUNTRY_INFO!I20>0,COUNTRY_INFO!I20<4),IF(J20>MAX('MDA1'!M20,MAX('MDA3'!I20,'MDA3'!L20)+MAX('MDA3'!J20,'MDA3'!M20)),MAX('MDA1'!M20,MAX('MDA3'!I20,'MDA3'!L20)+MAX('MDA3'!J20,'MDA3'!M20)),J20),0)","v":0},{"$f":"IF(AND(COUNTRY_INFO!I20>0,COUNTRY_INFO!I20<4), IF(M20/J20*100<>0, IF(M20/J20*100>100,100,M20/J20*100), \"-\"),0)","v":0},{"$f":"COUNTRY_INFO!O20","v":1933},336,331,{"$f":"SUM(MAX('MDA4'!N20, 'T1'!L20, MAX(T3_R1!K20, T3_R2!K20)), MAX('MDA1'!K20, 'MDA4'!O20, 'T1'!M20, MAX(T3_R1!L20, T3_R2!L20)), MAX('MDA1'!L20, 'MDA4'!P20, 'T1'!N20, MAX(T3_R1!M20, T3_R2!M20)))","v":667},{"$f":"IF(AND(COUNTRY_INFO!J20>1,COUNTRY_INFO!J20<4),IF(COUNTRY_INFO!E20>MAX('MDA4'!N20,'T1'!L20,MAX(T3_R1!K20,T3_R2!K20)),MAX('MDA4'!N20,'T1'!L20,MAX(T3_R1!K20,T3_R2!K20)),COUNTRY_INFO!E20),0)","v":0},{"$f":"IF(AND(COUNTRY_INFO!J20>1,COUNTRY_INFO!J20<4), IF(T20/COUNTRY_INFO!E20*100<>0, IF(T20/COUNTRY_INFO!E20*100>100,100,T20/COUNTRY_INFO!E20*100), \"-\"),0)","v":"-"},{"$f":"IF(AND(COUNTRY_INFO!J20>1,COUNTRY_INFO!J20<4),IF(COUNTRY_INFO!F20>MAX('MDA1'!K20,'MDA4'!O20,'T1'!M20,MAX(T3_R1!L20,T3_R2!L20)),MAX('MDA1'!K20,'MDA4'!O20,'T1'!M20,MAX(T3_R1!L20,T3_R2!L20)),COUNTRY_INFO!F20),0)","v":667},{"$f":"IF(AND(COUNTRY_INFO!J20>1,COUNTRY_INFO!J20<4), IF(V20/COUNTRY_INFO!F20*100<>0, IF(V20/COUNTRY_INFO!F20*100>100,100,V20/COUNTRY_INFO!F20*100), \"-\"),0)","v":51.071975497702915},667,{"$f":"IF(AND(COUNTRY_INFO!J20>1,COUNTRY_INFO!J20<4), IF(S20/P20*100<>0, IF(X20/P20*100>100,100,X20/P20*100), \"-\"),0)","v":34.505949301603721},{"$f":"COUNTRY_INFO!P20","v":0},null,null,{"$f":"MAX('T1'!L20,'T2'!J20)+MAX('T1'!M20,'T2'!K20)+MAX('T1'!N20,'T2'!L20)","v":0},{"$f":"IF(COUNTRY_INFO!K20=1,IF(COUNTRY_INFO!F20*0.33>MAX('T1'!M20,'T2'!K20),MAX('T1'!M20,'T2'!K20),COUNTRY_INFO!F20*0.33),IF(COUNTRY_INFO!K20=2,IF(COUNTRY_INFO!F20*0.5>MAX('T1'!M20,'T2'!K20),MAX('T1'!M20,'T2'!K20),COUNTRY_INFO!F20*0.5),IF(COUNTRY_INFO!K20=3,IF(COUNTRY_INFO!F20>MAX('T1'!M20,'T2'!K20),MAX('T1'!M20,'T2'!K20),COUNTRY_INFO!F20),0)))","v":0},{"$f":"IF(AND(COUNTRY_INFO!K20>0,COUNTRY_INFO!K20<4),IF(Z20>0,IF(COUNTRY_INFO!K20=1, AD20/(COUNTRY_INFO!F20*0.33)*100, IF(COUNTRY_INFO!K20=2, AD20/(COUNTRY_INFO!F20*0.5)*100, IF(COUNTRY_INFO!K20=3, AD20/COUNTRY_INFO!F20*100))),\"-\"),0)","v":0},{"$f":"IF(COUNTRY_INFO!K20=2,IF(COUNTRY_INFO!G20*0.2>MAX('T1'!N20,'T2'!L20),MAX('T1'!N20,'T2'!L20),COUNTRY_INFO!G20*0.2),IF(COUNTRY_INFO!K20=3,IF(COUNTRY_INFO!G20>MAX('T1'!N20,'T2'!L20),MAX('T1'!N20,'T2'!L20),COUNTRY_INFO!G20),0))","v":0},{"$f":"IF(AND(COUNTRY_INFO!K20>0,COUNTRY_INFO!K20<4),IF(Z20>0,IF(COUNTRY_INFO!K20=1, 0, IF(COUNTRY_INFO!K20=2, AF20/(COUNTRY_INFO!G20*0.2)*100, IF(COUNTRY_INFO!K20=3, AF20/COUNTRY_INFO!G20*100))),\"-\"),0)","v":0},0,{"$f":"IF(AND(COUNTRY_INFO!K20>0,COUNTRY_INFO!K20<4), IF(AC20/Z20*100<>0, IF(AH20/Z20*100>100,100,AH20/Z20*100), \"-\"),0)","v":0},null,{"$f":"IF(AND(D20<>0, D20<>\"Inconnu\",D20<>\"Interrompu\",D20<>\"Non requis\"),D20/COUNTRY_INFO!D20, 0)","v":0},{"$f":"IF(AND(J20<>0,J20<>\"Inconnu\",J20<>\"Interrompu\",J20<>\"Non requis\"),J20/COUNTRY_INFO!D20, 0)","v":0},{"$f":"IF(AND(P20<>0,P20<>\"Inconnu\",P20<>\"Non requis\"),P20/(COUNTRY_INFO!E20+COUNTRY_INFO!F20), 0)","v":1},{"$f":"IF(AND(Z20<>0,Z20<>\"Inconnu\",Z20<>\"Non requis\"),IF(COUNTRY_INFO!K20=1,1,IF(COUNTRY_INFO!K20=2,0.5*COUNTRY_INFO!F20/(0.5*COUNTRY_INFO!F20+0.2*COUNTRY_INFO!G20),IF(COUNTRY_INFO!K20=3,COUNTRY_INFO!F20/(COUNTRY_INFO!F20+COUNTRY_INFO!G20)))),0)","v":0},{"$f":"IF(AND(Z20<>0,Z20<>\"Inconnu\",Z20<>\"Non requis\"),IF(COUNTRY_INFO!K20=1,0,IF(COUNTRY_INFO!K20=2,0.2*COUNTRY_INFO!G20/(0.5*COUNTRY_INFO!F20+0.2*COUNTRY_INFO!G20),IF(COUNTRY_INFO!K20=3,COUNTRY_INFO!G20/(COUNTRY_INFO!F20+COUNTRY_INFO!G20)))),0)","v":0},{"$f":"MAX(COUNTRY_INFO!D20*AK20*PROFILE!$G$7,COUNTRY_INFO!D20*AL20*PROFILE!$G$7)","v":0},{"$f":"MAX(COUNTRY_INFO!D20*AK20*PROFILE!$G$8,COUNTRY_INFO!D20*AL20*PROFILE!$G$8,COUNTRY_INFO!D20*AM20*PROFILE!$G$8)","v":626.7564615875965},{"$f":"MAX(COUNTRY_INFO!D20*AK20*PROFILE!$G$9,COUNTRY_INFO!D20*AL20*PROFILE!$G$9,COUNTRY_INFO!D20*AM20*PROFILE!$G$9,IF(AND(DISTRICT!Z20<>\"Inconnu\",Z20<>\"Non requis\"),COUNTRY_INFO!P20*DISTRICT!AN20,0))","v":1305.7651646245861},{"$f":"MAX(COUNTRY_INFO!D20*AK20*PROFILE!$G$10,COUNTRY_INFO!D20*AL20*PROFILE!$G$10,IF(AND(DISTRICT!Z20<>\"Inconnu\",Z20<>\"Non requis\"),COUNTRY_INFO!P20*DISTRICT!AO20,0))","v":0},1932.5216262121826,"Y",{"$f":"MAX('MDA4'!R20,'T1'!L20,'T2'!J20,T3_R1!K20,T3_R2!K20)","v":0},{"$f":"MAX('MDA1'!K20,'MDA4'!S20,'MDA3'!I20,'MDA3'!L20,'T1'!M20,'T2'!K20,T3_R1!L20,T3_R2!L20)","v":667},{"$f":"MAX('MDA1'!L20,'MDA4'!T20,'MDA3'!J20,'MDA3'!M20,'T1'!N20,'T2'!L20,T3_R1!M20,T3_R2!M20)","v":0},667,{"$f":"MAX('MDA4'!R20,T20)","v":0},{"$f":"MAX('MDA1'!K20,'MDA4'!S20,'MDA3'!I20,'MDA3'!L20,V20,AD20)","v":667},{"$f":"MAX('MDA1'!L20,'MDA4'!T20,'MDA3'!J20,'MDA3'!M20,AF20)","v":0},667,34.514490857592413]
[{"$f":"IF(COUNTRY_INFO!A21=0,\" \",COUNTRY_INFO!A21)","v":"Gabon"},{"$f":"IF(COUNTRY_INFO!B21=0,\" \",COUNTRY_INFO!B21)","v":"Sud-Est"},{"$f":"IF(COUNTRY_INFO!C21=0,\" \",COUNTRY_INFO!C21)","v":"Mpassa"},{"$f":"COUNTRY_INFO!M21","v":0},null,null,{"$f":"MAX('MDA1'!M21,'MDA4'!U21)","v":0},{"$f":"IF(AND(COUNTRY_INFO!H21>0,COUNTRY_INFO!H21<4),IF(D21>MAX('MDA1'!M21,'MDA4'!U21),MAX('MDA1'!M21,'MDA4'!U21),D21),0)","v":0},{"$f":"IF(AND(COUNTRY_INFO!H21>0,COUNTRY_INFO!H21<4), IF(G21/D21*100<>0, IF(G21/D21*100>100,100,G21/D21*100), \"-\"),0)","v":0},{"$f":"COUNTRY_INFO!N21","v":157036},null,null,{"$f":"MAX('MDA1'!M21,MAX('MDA3'!I21,'MDA3'!L21)+MAX('MDA3'!J21,'MDA3'!M21))","v":0},{"$f":"IF(AND(COUNTRY_INFO!I21>0,COUNTRY_INFO!I21<4),IF(J21>MAX('MDA1'!M21,MAX('MDA3'!I21,'MDA3'!L21)+MAX('MDA3'!J21,'MDA3'!M21)),MAX('MDA1'!M21,MAX('MDA3'!I21,'MDA3'!L21)+MAX('MDA3'!J21,'MDA3'!M21)),J21),0)","v":0},{"$f":"IF(AND(COUNTRY_INFO!I21>0,COUNTRY_INFO!I21<4), IF(M21/J21*100<>0, IF(M21/J21*100>100,100,M21/J21*100), \"-\"),0)","v":"-"},{"$f":"COUNTRY_INFO!O21","v":58103},4269,4355,{"$f":"SUM(MAX('MDA4'!N21, 'T1'!L21, MAX(T3_R1!K21, T3_R2!K21)), MAX('MDA1'!K21, 'MDA4'!O21, 'T1'!M21, MAX(T3_R1!L21, T3_R2!L21)), MAX('MDA1'!L21, 'MDA4'!P21, 'T1'!N21, MAX(T3_R1!M21, T3_R2!M21)))","v":8624},{"$f":"IF(AND(COUNTRY_INFO!J21>1,COUNTRY_INFO!J21<4),IF(COUNTRY_INFO!E21>MAX('MDA4'!N21,'T1'!L21,MAX(T3_R1!K21,T3_R2!K21)),MAX('MDA4'!N21,'T1'!L21,MAX(T3_R1!K21,T3_R2!K21)),COUNTRY_INFO!E21),0)","v":0},{"$f":"IF(AND(COUNTRY_INFO!J21>1,COUNTRY_INFO!J21<4), IF(T21/COUNTRY_INFO!E21*100<>0, IF(T21/COUNTRY_INFO!E21*100>100,100,T21/COUNTRY_INFO!E21*100), \"-\"),0)","v":"-"},{"$f":"IF(AND(COUNTRY_INFO!J21>1,COUNTRY_INFO!J21<4),IF(COUNTRY_INFO!F21>MAX('MDA1'!K21,'MDA4'!O21,'T1'!M21,MAX(T3_R1!L21,T3_R2!L21)),MAX('MDA1'!K21,'MDA4'!O21,'T1'!M21,MAX(T3_R1!L21,T3_R2!L21)),COUNTRY_INFO!F21),0)","v":8624},{"$f":"IF(AND(COUNTRY_INFO!J21>1,COUNTRY_INFO!J21<4), IF(V21/COUNTRY_INFO!F21*100<>0, IF(V21/COUNTRY_INFO!F21*100>100,100,V21/COUNTRY_INFO!F21*100), \"-\"),0)","v":21.966937517511909},8624,{"$f":"IF(AND(COUNTRY_INFO!J21>1,COUNTRY_INFO!J21<4), IF(S21/P21*100<>0, IF(X21/P21*100>100,100,X21/P21*100), \"-\"),0)","v":14.842607094298058},{"$f":"COUNTRY_INFO!P21","v":12955.470000000001},4269,4355,{"$f":"MAX('T1'!L21,'T2'!J21)+MAX('T1'!M21,'T2'!K21)+MAX('T1'!N21,'T2'!L21)","v":8624},{"$f":"IF(COUNTRY_INFO!K21=1,IF(COUNTRY_INFO!F21*0.33>MAX('T1'!M21,'T2'!K21),MAX('T1'!M21,'T2'!K21),COUNTRY_INFO!F21*0.33),IF(COUNTRY_INFO!K21=2,IF(COUNTRY_INFO!F21*0.5>MAX('T1'!M21,'T2'!K21),MAX('T1'!M21,'T2'!K21),COUNTRY_INFO!F21*0.5),IF(COUNTRY_INFO!K21=3,IF(COUNTRY_INFO!F21>MAX('T1'!M21,'T2'!K21),MAX('T1'!M21,'T2'!K21),COUNTRY_INFO!F21),0)))","v":8624},{"$f":"IF(AND(COUNTRY_INFO!K21>0,COUNTRY_INFO!K21<4),IF(Z21>0,IF(COUNTRY_INFO!K21=1, AD21/(COUNTRY_INFO!F21*0.33)*100, IF(COUNTRY_INFO!K21=2, AD21/(COUNTRY_INFO!F21*0.5)*100, IF(COUNTRY_INFO!K21=3, AD21/COUNTRY_INFO!F21*100))),\"-\"),0)","v":66.566477325793656},{"$f":"IF(COUNTRY_INFO!K21=2,IF(COUNTRY_INFO!G21*0.2>MAX('T1'!N21,'T2'!L21),MAX('T1'!N21,'T2'!L21),COUNTRY_INFO!G21*0.2),IF(COUNTRY_INFO!K21=3,IF(COUNTRY_INFO!G21>MAX('T1'!N21,'T2'!L21),MAX('T1'!N21,'T2'!L21),COUNTRY_INFO!G21),0))","v":0},{"$f":"IF(AND(COUNTRY_INFO!K21>0,COUNTRY_INFO!K21<4),IF(Z21>0,IF(COUNTRY_INFO!K21=1, 0, IF(COUNTRY_INFO!K21=2, AF21/(COUNTRY_INFO!G21*0.2)*100, IF(COUNTRY_INFO!K21=3, AF21/COUNTRY_INFO!G21*100))),\"-\"),0)","v":0},8624,{"$f":"IF(AND(COUNTRY_INFO!K21>0,COUNTRY_INFO!K21<4), IF(AC21/Z21*100<>0, IF(AH21/Z21*100>100,100,AH21/Z21*100), \"-\"),0)","v":66.566477325793656},null,{"$f":"IF(AND(D21<>0, D21<>\"Inconnu\",D21<>\"Interrompu\",D21<>\"Non requis\"),D21/COUNTRY_INFO!D21, 0)","v":0},{"$f":"IF(AND(J21<>0,J21<>\"Inconnu\",J21<>\"Interrompu\",J21<>\"Non requis\"),J21/COUNTRY_INFO!D21, 0)","v":1},{"$f":"IF(AND(P21<>0,P21<>\"Inconnu\",P21<>\"Non requis\"),P21/(COUNTRY_INFO!E21+COUNTRY_INFO!F21), 0)","v":1},{"$f":"IF(AND(Z21<>0,Z21<>\"Inconnu\",Z21<>\"Non requis\"),IF(COUNTRY_INFO!K21=1,1,IF(COUNTRY_INFO!K21=2,0.5*COUNTRY_INFO!F21/(0.5*COUNTRY_INFO!F21+0.2*COUNTRY_INFO!G21),IF(COUNTRY_INFO!K21=3,COUNTRY_INFO!F21/(COUNTRY_INFO!F21+COUNTRY_INFO!G21)))),0)","v":1},{"$f":"IF(AND(Z21<>0,Z21<>\"Inconnu\",Z21<>\"Non requis\"),IF(COUNTRY_INFO!K21=1,0,IF(COUNTRY_INFO!K21=2,0.2*COUNTRY_INFO!G21/(0.5*COUNTRY_INFO!F21+0.2*COUNTRY_INFO!G21),IF(COUNTRY_INFO!K21=3,COUNTRY_INFO!G21/(COUNTRY_INFO!F21+COUNTRY_INFO!G21)))),0)","v":0},{"$f":"MAX(COUNTRY_INFO!D21*AK21*PROFILE!$G$7,COUNTRY_INFO!D21*AL21*PROFILE!$G$7)","v":6280.9232642316547},{"$f":"MAX(COUNTRY_INFO!D21*AK21*PROFILE!$G$8,COUNTRY_INFO!D21*AL21*PROFILE!$G$8,COUNTRY_INFO!D21*AM21*PROFILE!$G$8)","v":18844.213613224165},{"$f":"MAX(COUNTRY_INFO!D21*AK21*PROFILE!$G$9,COUNTRY_INFO!D21*AL21*PROFILE!$G$9,COUNTRY_INFO!D21*AM21*PROFILE!$G$9,IF(AND(DISTRICT!Z21<>\"Inconnu\",Z21<>\"Non requis\"),COUNTRY_INFO!P21*DISTRICT!AN21,0))","v":39259.455943325011},{"$f":"MAX(COUNTRY_INFO!D21*AK21*PROFILE!$G$10,COUNTRY_INFO!D21*AL21*PROFILE!$G$10,IF(AND(DISTRICT!Z21<>\"Inconnu\",Z21<>\"Non requis\"),COUNTRY_INFO!P21*DISTRICT!AO21,0))","v":92651.407179219168},157036,0,{"$f":"MAX('MDA4'!R21,'T1'!L21,'T2'!J21,T3_R1!K21,T3_R2!K21)","v":0},{"$f":"MAX('MDA1'!K21,'MDA4'!S21,'MDA3'!I21,'MDA3'!L21,'T1'!M21,'T2'!K21,T3_R1!L21,T3_R2!L21)","v":8624},{"$f":"MAX('MDA1'!L21,'MDA4'!T21,'MDA3'!J21,'MDA3'!M21,'T1'!N21,'T2'!L21,T3_R1!M21,T3_R2!M21)","v":0},8624,{"$f":"MAX('MDA4'!R21,T21)","v":0},{"$f":"MAX('MDA1'!K21,'MDA4'!S21,'MDA3'!I21,'MDA3'!L21,V21,AD21)","v":8624},{"$f":"MAX('MDA1'!L21,'MDA4'!T21,'MDA3'!J21,'MDA3'!M21,AF21)","v":0},8624,5.4917343793779771]
[{"$f":"IF(COUNTRY_INFO!A22=0,\" \",COUNTRY_INFO!A22)","v":"Gabon"},{"$f":"IF(COUNTRY_INFO!B22=0,\" \",COUNTRY_INFO!B22)","v":"Sud-Est"},{"$f":"IF(COUNTRY_INFO!C22=0,\" \",COUNTRY_INFO!C22)","v":"Plateaux"},{"$f":"COUNTRY_INFO!M22","v":0},null,null,{"$f":"MAX('MDA1'!M22,'MDA4'!U22)","v":0},{"$f":"IF(AND(COUNTRY_INFO!H22>0,COUNTRY_INFO!H22<4),IF(D22>MAX('MDA1'!M22,'MDA4'!U22),MAX('MDA1'!M22,'MDA4'!U22),D22),0)","v":0},{"$f":"IF(AND(COUNTRY_INFO!H22>0,COUNTRY_INFO!H22<4), IF(G22/D22*100<>0, IF(G22/D22*100>100,100,G22/D22*100), \"-\"),0)","v":0},{"$f":"COUNTRY_INFO!N22","v":"Inconnu"},null,null,{"$f":"MAX('MDA1'!M22,MAX('MDA3'!I22,'MDA3'!L22)+MAX('MDA3'!J22,'MDA3'!M22))","v":0},{"$f":"IF(AND(COUNTRY_INFO!I22>0,COUNTRY_INFO!I22<4),IF(J22>MAX('MDA1'!M22,MAX('MDA3'!I22,'MDA3'!L22)+MAX('MDA3'!J22,'MDA3'!M22)),MAX('MDA1'!M22,MAX('MDA3'!I22,'MDA3'!L22)+MAX('MDA3'!J22,'MDA3'!M22)),J22),0)","v":0},{"$f":"IF(AND(COUNTRY_INFO!I22>0,COUNTRY_INFO!I22<4), IF(M22/J22*100<>0, IF(M22/J22*100>100,100,M22/J22*100), \"-\"),0)","v":0},{"$f":"COUNTRY_INFO!O22","v":4657},920,996,{"$f":"SUM(MAX('MDA4'!N22, 'T1'!L22, MAX(T3_R1!K22, T3_R2!K22)), MAX('MDA1'!K22, 'MDA4'!O22, 'T1'!M22, MAX(T3_R1!L22, T3_R2!L22)), MAX('MDA1'!L22, 'MDA4'!P22, 'T1'!N22, MAX(T3_R1!M22, T3_R2!M22)))","v":1916},{"$f":"IF(AND(COUNTRY_INFO!J22>1,COUNTRY_INFO!J22<4),IF(COUNTRY_INFO!E22>MAX('MDA4'!N22,'T1'!L22,MAX(T3_R1!K22,T3_R2!K22)),MAX('MDA4'!N22,'T1'!L22,MAX(T3_R1!K22,T3_R2!K22)),COUNTRY_INFO!E22),0)","v":0},{"$f":"IF(AND(COUNTRY_INFO!J22>1,COUNTRY_INFO!J22<4), IF(T22/COUNTRY_INFO!E22*100<>0, IF(T22/COUNTRY_INFO!E22*100>100,100,T22/COUNTRY_INFO!E22*100), \"-\"),0)","v":"-"},{"$f":"IF(AND(COUNTRY_INFO!J22>1,COUNTRY_INFO!J22<4),IF(COUNTRY_INFO!F22>MAX('MDA1'!K22,'MDA4'!O22,'T1'!M22,MAX(T3_R1!L22,T3_R2!L22)),MAX('MDA1'!K22,'MDA4'!O22,'T1'!M22,MAX(T3_R1!L22,T3_R2!L22)),COUNTRY_INFO!F22),0)","v":1916},{"$f":"IF(AND(COUNTRY_INFO!J22>1,COUNTRY_INFO!J22<4), IF(V22/COUNTRY_INFO!F22*100<>0, IF(V22/COUNTRY_INFO!F22*100>100,100,V22/COUNTRY_INFO!F22*100), \"-\"),0)","v":60.88338099777566},1916,{"$f":"IF(AND(COUNTRY_INFO!J22>1,COUNTRY_INFO!J22<4), IF(S22/P22*100<>0, IF(X22/P22*100>100,100,X22/P22*100), \"-\"),0)","v":41.142366330255534},{"$f":"COUNTRY_INFO!P22","v":1038.51},920,996,{"$f":"MAX('T1'!L22,'T2'!J22)+MAX('T1'!M22,'T2'!K22)+MAX('T1'!N22,'T2'!L22)","v":1916},{"$f":"IF(COUNTRY_INFO!K22=1,IF(COUNTRY_INFO!F22*0.33>MAX('T1'!M22,'T2'!K22),MAX('T1'!M22,'T2'!K22),COUNTRY_INFO!F22*0.33),IF(COUNTRY_INFO!K22=2,IF(COUNTRY_INFO!F22*0.5>MAX('T1'!M22,'T2'!K22),MAX('T1'!M22,'T2'!K22),COUNTRY_INFO!F22*0.5),IF(COUNTRY_INFO!K22=3,IF(COUNTRY_INFO!F22>MAX('T1'!M22,'T2'!K22),MAX('T1'!M22,'T2'!K22),COUNTRY_INFO!F22),0)))","v":1038.51},{"$f":"IF(AND(COUNTRY_INFO!K22>0,COUNTRY_INFO!K22<4),IF(Z22>0,IF(COUNTRY_INFO!K22=1, AD22/(COUNTRY_INFO!F22*0.33)*100, IF(COUNTRY_INFO!K22=2, AD22/(COUNTRY_INFO!F22*0.5)*100, IF(COUNTRY_INFO!K22=3, AD22/COUNTRY_INFO!F22*100))),\"-\"),0)","v":100},{"$f":"IF(COUNTRY_INFO!K22=2,IF(COUNTRY_INFO!G22*0.2>MAX('T1'!N22,'T2'!L22),MAX('T1'!N22,'T2'!L22),COUNTRY_INFO!G22*0.2),IF(COUNTRY_INFO!K22=3,IF(COUNTRY_INFO!G22>MAX('T1'!N22,'T2'!L22),MAX('T1'!N22,'T2'!L22),COUNTRY_INFO!G22),0))","v":0},{"$f":"IF(AND(COUNTRY_INFO!K22>0,COUNTRY_INFO!K22<4),IF(Z22>0,IF(COUNTRY_INFO!K22=1, 0, IF(COUNTRY_INFO!K22=2, AF22/(COUNTRY_INFO!G22*0.2)*100, IF(COUNTRY_INFO!K22=3, AF22/COUNTRY_INFO!G22*100))),\"-\"),0)","v":0},1038.51,{"$f":"IF(AND(COUNTRY_INFO!K22>0,COUNTRY_INFO!K22<4), IF(AC22/Z22*100<>0, IF(AH22/Z22*100>100,100,AH22/Z22*100), \"-\"),0)","v":100},null,{"$f":"IF(AND(D22<>0, D22<>\"Inconnu\",D22<>\"Interrompu\",D22<>\"Non requis\"),D22/COUNTRY_INFO!D22, 0)","v":0},{"$f":"IF(AND(J22<>0,J22<>\"Inconnu\",J22<>\"Interrompu\",J22<>\"Non requis\"),J22/COUNTRY_INFO!D22, 0)","v":0},{"$f":"IF(AND(P22<>0,P22<>\"Inconnu\",P22<>\"Non requis\"),P22/(COUNTRY_INFO!E22+COUNTRY_INFO!F22), 0)","v":1},{"$f":"IF(AND(Z22<>0,Z22<>\"Inconnu\",Z22<>\"Non requis\"),IF(COUNTRY_INFO!K22=1,1,IF(COUNTRY_INFO!K22=2,0.5*COUNTRY_INFO!F22/(0.5*COUNTRY_INFO!F22+0.2*COUNTRY_INFO!G22),IF(COUNTRY_INFO!K22=3,COUNTRY_INFO!F22/(COUNTRY_INFO!F22+COUNTRY_INFO!G22)))),0)","v":1},{"$f":"IF(AND(Z22<>0,Z22<>\"Inconnu\",Z22<>\"Non requis\"),IF(COUNTRY_INFO!K22=1,0,IF(COUNTRY_INFO!K22=2,0.2*COUNTRY_INFO!G22/(0.5*COUNTRY_INFO!F22+0.2*COUNTRY_INFO!G22),IF(COUNTRY_INFO!K22=3,COUNTRY_INFO!G22/(COUNTRY_INFO!F22+COUNTRY_INFO!G22)))),0)","v":0},{"$f":"MAX(COUNTRY_INFO!D22*AK22*PROFILE!$G$7,COUNTRY_INFO!D22*AL22*PROFILE!$G$7)","v":0},{"$f":"MAX(COUNTRY_INFO!D22*AK22*PROFILE!$G$8,COUNTRY_INFO!D22*AL22*PROFILE!$G$8,COUNTRY_INFO!D22*AM22*PROFILE!$G$8)","v":1510.4314727174187},{"$f":"MAX(COUNTRY_INFO!D22*AK22*PROFILE!$G$9,COUNTRY_INFO!D22*AL22*PROFILE!$G$9,COUNTRY_INFO!D22*AM22*PROFILE!$G$9,IF(AND(DISTRICT!Z22<>\"Inconnu\",Z22<>\"Non requis\"),COUNTRY_INFO!P22*DISTRICT!AN22,0))","v":3146.7865454967769},{"$f":"MAX(COUNTRY_INFO!D22*AK22*PROFILE!$G$10,COUNTRY_INFO!D22*AL22*PROFILE!$G$10,IF(AND(DISTRICT!Z22<>\"Inconnu\",Z22<>\"Non requis\"),COUNTRY_INFO!P22*DISTRICT!AO22,0))","v":0},4657.2180182141956,"Y",{"$f":"MAX('MDA4'!R22,'T1'!L22,'T2'!J22,T3_R1!K22,T3_R2!K22)","v":0},{"$f":"MAX('MDA1'!K22,'MDA4'!S22,'MDA3'!I22,'MDA3'!L22,'T1'!M22,'T2'!K22,T3_R1!L22,T3_R2!L22)","v":1916},{"$f":"MAX('MDA1'!L22,'MDA4'!T22,'MDA3'!J22,'MDA3'!M22,'T1'!N22,'T2'!L22,T3_R1!M22,T3_R2!M22)","v":0},1916,{"$f":"MAX('MDA4'!R22,T22)","v":0},{"$f":"MAX('MDA1'!K22,'MDA4'!S22,'MDA3'!I22,'MDA3'!L22,V22,AD22)","v":1916},{"$f":"MAX('MDA1'!L22,'MDA4'!T22,'MDA3'!J22,'MDA3'!M22,AF22)","v":0},1916,41.140440333834484]
[{"$f":"IF(COUNTRY_INFO!A23=0,\" \",COUNTRY_INFO!A23)","v":"Gabon"},{"$f":"IF(COUNTRY_INFO!B23=0,\" \",COUNTRY_INFO!B23)","v":"Sud-Est"},{"$f":"IF(COUNTRY_INFO!C23=0,\" \",COUNTRY_INFO!C23)","v":"Lébombi-Léyou"},{"$f":"COUNTRY_INFO!M23","v":0},null,null,{"$f":"MAX('MDA1'!M23,'MDA4'!U23)","v":0},{"$f":"IF(AND(COUNTRY_INFO!H23>0,COUNTRY_INFO!H23<4),IF(D23>MAX('MDA1'!M23,'MDA4'!U23),MAX('MDA1'!M23,'MDA4'!U23),D23),0)","v":0},{"$f":"IF(AND(COUNTRY_INFO!H23>0,COUNTRY_INFO!H23<4), IF(G23/D23*100<>0, IF(G23/D23*100>100,100,G23/D23*100), \"-\"),0)","v":0},{"$f":"COUNTRY_INFO!N23","v":69577},null,null,{"$f":"MAX('MDA1'!M23,MAX('MDA3'!I23,'MDA3'!L23)+MAX('MDA3'!J23,'MDA3'!M23))","v":0},{"$f":"IF(AND(COUNTRY_INFO!I23>0,COUNTRY_INFO!I23<4),IF(J23>MAX('MDA1'!M23,MAX('MDA3'!I23,'MDA3'!L23)+MAX('MDA3'!J23,'MDA3'!M23)),MAX('MDA1'!M23,MAX('MDA3'!I23,'MDA3'!L23)+MAX('MDA3'!J23,'MDA3'!M23)),J23),0)","v":0},{"$f":"IF(AND(COUNTRY_INFO!I23>0,COUNTRY_INFO!I23<4), IF(M23/J23*100<>0, IF(M23/J23*100>100,100,M23/J23*100), \"-\"),0)","v":"-"},{"$f":"COUNTRY_INFO!O23","v":25743},3190,3355,{"$f":"SUM(MAX('MDA4'!N23, 'T1'!L23, MAX(T3_R1!K23, T3_R2!K23)), MAX('MDA1'!K23, 'MDA4'!O23, 'T1'!M23, MAX(T3_R1!L23, T3_R2!L23)), MAX('MDA1'!L23, 'MDA4'!P23, 'T1'!N23, MAX(T3_R1!M23, T3_R2!M23)))","v":6545},{"$f":"IF(AND(COUNTRY_INFO!J23>1,COUNTRY_INFO!J23<4),IF(COUNTRY_INFO!E23>MAX('MDA4'!N23,'T1'!L23,MAX(T3_R1!K23,T3_R2!K23)),MAX('MDA4'!N23,'T1'!L23,MAX(T3_R1!K23,T3_R2!K23)),COUNTRY_INFO!E23),0)","v":0},{"$f":"IF(AND(COUNTRY_INFO!J23>1,COUNTRY_INFO!J23<4), IF(T23/COUNTRY_INFO!E23*100<>0, IF(T23/COUNTRY_INFO!E23*100>100,100,T23/COUNTRY_INFO!E23*100), \"-\"),0)","v":"-"},{"$f":"IF(AND(COUNTRY_INFO!J23>1,COUNTRY_INFO!J23<4),IF(COUNTRY_INFO!F23>MAX('MDA1'!K23,'MDA4'!O23,'T1'!M23,MAX(T3_R1!L23,T3_R2!L23)),MAX('MDA1'!K23,'MDA4'!O23,'T1'!M23,MAX(T3_R1!L23,T3_R2!L23)),COUNTRY_INFO!F23),0)","v":6545},{"$f":"IF(AND(COUNTRY_INFO!J23>1,COUNTRY_INFO!J23<4), IF(V23/COUNTRY_INFO!F23*100<>0, IF(V23/COUNTRY_INFO!F23*100>100,100,V23/COUNTRY_INFO!F23*100), \"-\"),0)","v":37.627917672760724},6545,{"$f":"IF(AND(COUNTRY_INFO!J23>1,COUNTRY_INFO!J23<4), IF(S23/P23*100<>0, IF(X23/P23*100>100,100,X23/P23*100), \"-\"),0)","v":25.424387212057649},{"$f":"COUNTRY_INFO!P23","v":5740.02},3190,3355,{"$f":"MAX('T1'!L23,'T2'!J23)+MAX('T1'!M23,'T2'!K23)+MAX('T1'!N23,'T2'!L23)","v":6545},{"$f":"IF(COUNTRY_INFO!K23=1,IF(COUNTRY_INFO!F23*0.33>MAX('T1'!M23,'T2'!K23),MAX('T1'!M23,'T2'!K23),COUNTRY_INFO!F23*0.33),IF(COUNTRY_INFO!K23=2,IF(COUNTRY_INFO!F23*0.5>MAX('T1'!M23,'T2'!K23),MAX('T1'!M23,'T2'!K23),COUNTRY_INFO!F23*0.5),IF(COUNTRY_INFO!K23=3,IF(COUNTRY_INFO!F23>MAX('T1'!M23,'T2'!K23),MAX('T1'!M23,'T2'!K23),COUNTRY_INFO!F23),0)))","v":5740.02},{"$f":"IF(AND(COUNTRY_INFO!K23>0,COUNTRY_INFO!K23<4),IF(Z23>0,IF(COUNTRY_INFO!K23=1, AD23/(COUNTRY_INFO!F23*0.33)*100, IF(COUNTRY_INFO!K23=2, AD23/(COUNTRY_INFO!F23*0.5)*100, IF(COUNTRY_INFO!K23=3, AD23/COUNTRY_INFO!F23*100))),\"-\"),0)","v":100},{"$f":"IF(COUNTRY_INFO!K23=2,IF(COUNTRY_INFO!G23*0.2>MAX('T1'!N23,'T2'!L23),MAX('T1'!N23,'T2'!L23),COUNTRY_INFO!G23*0.2),IF(COUNTRY_INFO!K23=3,IF(COUNTRY_INFO!G23>MAX('T1'!N23,'T2'!L23),MAX('T1'!N23,'T2'!L23),COUNTRY_INFO!G23),0))","v":0},{"$f":"IF(AND(COUNTRY_INFO!K23>0,COUNTRY_INFO!K23<4),IF(Z23>0,IF(COUNTRY_INFO!K23=1, 0, IF(COUNTRY_INFO!K23=2, AF23/(COUNTRY_INFO!G23*0.2)*100, IF(COUNTRY_INFO!K23=3, AF23/COUNTRY_INFO!G23*100))),\"-\"),0)","v":0},5740.02,{"$f":"IF(AND(COUNTRY_INFO!K23>0,COUNTRY_INFO!K23<4), IF(AC23/Z23*100<>0, IF(AH23/Z23*100>100,100,AH23/Z23*100), \"-\"),0)","v":100},null,{"$f":"IF(AND(D23<>0, D23<>\"Inconnu\",D23<>\"Interrompu\",D23<>\"Non requis\"),D23/COUNTRY_INFO!D23, 0)","v":0},{"$f":"IF(AND(J23<>0,J23<>\"Inconnu\",J23<>\"Interrompu\",J23<>\"Non requis\"),J23/COUNTRY_INFO!D23, 0)","v":1},{"$f":"IF(AND(P23<>0,P23<>\"Inconnu\",P23<>\"Non requis\"),P23/(COUNTRY_INFO!E23+COUNTRY_INFO!F23), 0)","v":1},{"$f":"IF(AND(Z23<>0,Z23<>\"Inconnu\",Z23<>\"Non requis\"),IF(COUNTRY_INFO!K23=1,1,IF(COUNTRY_INFO!K23=2,0.5*COUNTRY_INFO!F23/(0.5*COUNTRY_INFO!F23+0.2*COUNTRY_INFO!G23),IF(COUNTRY_INFO!K23=3,COUNTRY_INFO!F23/(COUNTRY_INFO!F23+COUNTRY_INFO!G23)))),0)","v":1},{"$f":"IF(AND(Z23<>0,Z23<>\"Inconnu\",Z23<>\"Non requis\"),IF(COUNTRY_INFO!K23=1,0,IF(COUNTRY_INFO!K23=2,0.2*COUNTRY_INFO!G23/(0.5*COUNTRY_INFO!F23+0.2*COUNTRY_INFO!G23),IF(COUNTRY_INFO!K23=3,COUNTRY_INFO!G23/(COUNTRY_INFO!F23+COUNTRY_INFO!G23)))),0)","v":0},{"$f":"MAX(COUNTRY_INFO!D23*AK23*PROFILE!$G$7,COUNTRY_INFO!D23*AL23*PROFILE!$G$7)","v":2782.8510529779533},{"$f":"MAX(COUNTRY_INFO!D23*AK23*PROFILE!$G$8,COUNTRY_INFO!D23*AL23*PROFILE!$G$8,COUNTRY_INFO!D23*AM23*PROFILE!$G$8)","v":8349.1928638484023},{"$f":"MAX(COUNTRY_INFO!D23*AK23*PROFILE!$G$9,COUNTRY_INFO!D23*AL23*PROFILE!$G$9,COUNTRY_INFO!D23*AM23*PROFILE!$G$9,IF(AND(DISTRICT!Z23<>\"Inconnu\",Z23<>\"Non requis\"),COUNTRY_INFO!P23*DISTRICT!AN23,0))","v":17394.452012078276},{"$f":"MAX(COUNTRY_INFO!D23*AK23*PROFILE!$G$10,COUNTRY_INFO!D23*AL23*PROFILE!$G$10,IF(AND(DISTRICT!Z23<>\"Inconnu\",Z23<>\"Non requis\"),COUNTRY_INFO!P23*DISTRICT!AO23,0))","v":41050.504071095369},69577,0,{"$f":"MAX('MDA4'!R23,'T1'!L23,'T2'!J23,T3_R1!K23,T3_R2!K23)","v":0},{"$f":"MAX('MDA1'!K23,'MDA4'!S23,'MDA3'!I23,'MDA3'!L23,'T1'!M23,'T2'!K23,T3_R1!L23,T3_R2!L23)","v":6545},{"$f":"MAX('MDA1'!L23,'MDA4'!T23,'MDA3'!J23,'MDA3'!M23,'T1'!N23,'T2'!L23,T3_R1!M23,T3_R2!M23)","v":0},6545,{"$f":"MAX('MDA4'!R23,T23)","v":0},{"$f":"MAX('MDA1'!K23,'MDA4'!S23,'MDA3'!I23,'MDA3'!L23,V23,AD23)","v":6545},{"$f":"MAX('MDA1'!L23,'MDA4'!T23,'MDA3'!J23,'MDA3'!M23,AF23)","v":0},6545,9.4068442157609553]
[{"$f":"IF(COUNTRY_INFO!A24=0,\" \",COUNTRY_INFO!A24)","v":"Gabon"},{"$f":"IF(COUNTRY_INFO!B24=0,\" \",COUNTRY_INFO!B24)","v":"Sud-Est"},{"$f":"IF(COUNTRY_INFO!C24=0,\" \",COUNTRY_INFO!C24)","v":"Lékabi-Léwolo"},{"$f":"COUNTRY_INFO!M24","v":0},null,null,{"$f":"MAX('MDA1'!M24,'MDA4'!U24)","v":0},{"$f":"IF(AND(COUNTRY_INFO!H24>0,COUNTRY_INFO!H24<4),IF(D24>MAX('MDA1'!M24,'MDA4'!U24),MAX('MDA1'!M24,'MDA4'!U24),D24),0)","v":0},{"$f":"IF(AND(COUNTRY_INFO!H24>0,COUNTRY_INFO!H24<4), IF(G24/D24*100<>0, IF(G24/D24*100>100,100,G24/D24*100), \"-\"),0)","v":0},{"$f":"COUNTRY_INFO!N24","v":"Inconnu"},null,null,{"$f":"MAX('MDA1'!M24,MAX('MDA3'!I24,'MDA3'!L24)+MAX('MDA3'!J24,'MDA3'!M24))","v":0},{"$f":"IF(AND(COUNTRY_INFO!I24>0,COUNTRY_INFO!I24<4),IF(J24>MAX('MDA1'!M24,MAX('MDA3'!I24,'MDA3'!L24)+MAX('MDA3'!J24,'MDA3'!M24)),MAX('MDA1'!M24,MAX('MDA3'!I24,'MDA3'!L24)+MAX('MDA3'!J24,'MDA3'!M24)),J24),0)","v":0},{"$f":"IF(AND(COUNTRY_INFO!I24>0,COUNTRY_INFO!I24<4), IF(M24/J24*100<>0, IF(M24/J24*100>100,100,M24/J24*100), \"-\"),0)","v":0},{"$f":"COUNTRY_INFO!O24","v":3749},323,312,{"$f":"SUM(MAX('MDA4'!N24, 'T1'!L24, MAX(T3_R1!K24, T3_R2!K24)), MAX('MDA1'!K24, 'MDA4'!O24, 'T1'!M24, MAX(T3_R1!L24, T3_R2!L24)), MAX('MDA1'!L24, 'MDA4'!P24, 'T1'!N24, MAX(T3_R1!M24, T3_R2!M24)))","v":635},{"$f":"IF(AND(COUNTRY_INFO!J24>1,COUNTRY_INFO!J24<4),IF(COUNTRY_INFO!E24>MAX('MDA4'!N24,'T1'!L24,MAX(T3_R1!K24,T3_R2!K24)),MAX('MDA4'!N24,'T1'!L24,MAX(T3_R1!K24,T3_R2!K24)),COUNTRY_INFO!E24),0)","v":0},{"$f":"IF(AND(COUNTRY_INFO!J24>1,COUNTRY_INFO!J24<4), IF(T24/COUNTRY_INFO!E24*100<>0, IF(T24/COUNTRY_INFO!E24*100>100,100,T24/COUNTRY_INFO!E24*100), \"-\"),0)","v":"-"},{"$f":"IF(AND(COUNTRY_INFO!J24>1,COUNTRY_INFO!J24<4),IF(COUNTRY_INFO!F24>MAX('MDA1'!K24,'MDA4'!O24,'T1'!M24,MAX(T3_R1!L24,T3_R2!L24)),MAX('MDA1'!K24,'MDA4'!O24,'T1'!M24,MAX(T3_R1!L24,T3_R2!L24)),COUNTRY_INFO!F24),0)","v":635},{"$f":"IF(AND(COUNTRY_INFO!J24>1,COUNTRY_INFO!J24<4), IF(V24/COUNTRY_INFO!F24*100<>0, IF(V24/COUNTRY_INFO!F24*100>100,100,V24/COUNTRY_INFO!F24*100), \"-\"),0)","v":25.069088037899721},635,{"$f":"IF(AND(COUNTRY_INFO!J24>1,COUNTRY_INFO!J24<4), IF(S24/P24*100<>0, IF(X24/P24*100>100,100,X24/P24*100), \"-\"),0)","v":16.937850093358229},{"$f":"COUNTRY_INFO!P24","v":835.89},323,312,{"$f":"MAX('T1'!L24,'T2'!J24)+MAX('T1'!M24,'T2'!K24)+MAX('T1'!N24,'T2'!L24)","v":635},{"$f":"IF(COUNTRY_INFO!K24=1,IF(COUNTRY_INFO!F24*0.33>MAX('T1'!M24,'T2'!K24),MAX('T1'!M24,'T2'!K24),COUNTRY_INFO!F24*0.33),IF(COUNTRY_INFO!K24=2,IF(COUNTRY_INFO!F24*0.5>MAX('T1'!M24,'T2'!K24),MAX('T1'!M24,'T2'!K24),COUNTRY_INFO!F24*0.5),IF(COUNTRY_INFO!K24=3,IF(COUNTRY_INFO!F24>MAX('T1'!M24,'T2'!K24),MAX('T1'!M24,'T2'!K24),COUNTRY_INFO!F24),0)))","v":635},{"$f":"IF(AND(COUNTRY_INFO!K24>0,COUNTRY_INFO!K24<4),IF(Z24>0,IF(COUNTRY_INFO!K24=1, AD24/(COUNTRY_INFO!F24*0.33)*100, IF(COUNTRY_INFO!K24=2, AD24/(COUNTRY_INFO!F24*0.5)*100, IF(COUNTRY_INFO!K24=3, AD24/COUNTRY_INFO!F24*100))),\"-\"),0)","v":75.966933448180981},{"$f":"IF(COUNTRY_INFO!K24=2,IF(COUNTRY_INFO!G24*0.2>MAX('T1'!N24,'T2'!L24),MAX('T1'!N24,'T2'!L24),COUNTRY_INFO!G24*0.2),IF(COUNTRY_INFO!K24=3,IF(COUNTRY_INFO!G24>MAX('T1'!N24,'T2'!L24),MAX('T1'!N24,'T2'!L24),COUNTRY_INFO!G24),0))","v":0},{"$f":"IF(AND(COUNTRY_INFO!K24>0,COUNTRY_INFO!K24<4),IF(Z24>0,IF(COUNTRY_INFO!K24=1, 0, IF(COUNTRY_INFO!K24=2, AF24/(COUNTRY_INFO!G24*0.2)*100, IF(COUNTRY_INFO!K24=3, AF24/COUNTRY_INFO!G24*100))),\"-\"),0)","v":0},635,{"$f":"IF(AND(COUNTRY_INFO!K24>0,COUNTRY_INFO!K24<4), IF(AC24/Z24*100<>0, IF(AH24/Z24*100>100,100,AH24/Z24*100), \"-\"),0)","v":75.966933448180981},null,{"$f":"IF(AND(D24<>0, D24<>\"Inconnu\",D24<>\"Interrompu\",D24<>\"Non requis\"),D24/COUNTRY_INFO!D24, 0)","v":0},{"$f":"IF(AND(J24<>0,J24<>\"Inconnu\",J24<>\"Interrompu\",J24<>\"Non requis\"),J24/COUNTRY_INFO!D24, 0)","v":0},{"$f":"IF(AND(P24<>0,P24<>\"Inconnu\",P24<>\"Non requis\"),P24/(COUNTRY_INFO!E24+COUNTRY_INFO!F24), 0)","v":1},{"$f":"IF(AND(Z24<>0,Z24<>\"Inconnu\",Z24<>\"Non requis\"),IF(COUNTRY_INFO!K24=1,1,IF(COUNTRY_INFO!K24=2,0.5*COUNTRY_INFO!F24/(0.5*COUNTRY_INFO!F24+0.2*COUNTRY_INFO!G24),IF(COUNTRY_INFO!K24=3,COUNTRY_INFO!F24/(COUNTRY_INFO!F24+COUNTRY_INFO!G24)))),0)","v":1},{"$f":"IF(AND(Z24<>0,Z24<>\"Inconnu\",Z24<>\"Non requis\"),IF(COUNTRY_INFO!K24=1,0,IF(COUNTRY_INFO!K24=2,0.2*COUNTRY_INFO!G24/(0.5*COUNTRY_INFO!F24+0.2*COUNTRY_INFO!G24),IF(COUNTRY_INFO!K24=3,COUNTRY_INFO!G24/(COUNTRY_INFO!F24+COUNTRY_INFO!G24)))),0)","v":0},{"$f":"MAX(COUNTRY_INFO!D24*AK24*PROFILE!$G$7,COUNTRY_INFO!D24*AL24*PROFILE!$G$7)","v":0},{"$f":"MAX(COUNTRY_INFO!D24*AK24*PROFILE!$G$8,COUNTRY_INFO!D24*AL24*PROFILE!$G$8,COUNTRY_INFO!D24*AM24*PROFILE!$G$8)","v":1215.7131365774346},{"$f":"MAX(COUNTRY_INFO!D24*AK24*PROFILE!$G$9,COUNTRY_INFO!D24*AL24*PROFILE!$G$9,COUNTRY_INFO!D24*AM24*PROFILE!$G$9,IF(AND(DISTRICT!Z24<>\"Inconnu\",Z24<>\"Non requis\"),COUNTRY_INFO!P24*DISTRICT!AN24,0))","v":2532.7794146681376},{"$f":"MAX(COUNTRY_INFO!D24*AK24*PROFILE!$G$10,COUNTRY_INFO!D24*AL24*PROFILE!$G$10,IF(AND(DISTRICT!Z24<>\"Inconnu\",Z24<>\"Non requis\"),COUNTRY_INFO!P24*DISTRICT!AO24,0))","v":0},3748.492551245572,"Y",{"$f":"MAX('MDA4'!R24,'T1'!L24,'T2'!J24,T3_R1!K24,T3_R2!K24)","v":0},{"$f":"MAX('MDA1'!K24,'MDA4'!S24,'MDA3'!I24,'MDA3'!L24,'T1'!M24,'T2'!K24,T3_R1!L24,T3_R2!L24)","v":635},{"$f":"MAX('MDA1'!L24,'MDA4'!T24,'MDA3'!J24,'MDA3'!M24,'T1'!N24,'T2'!L24,T3_R1!M24,T3_R2!M24)","v":0},635,{"$f":"MAX('MDA4'!R24,T24)","v":0},{"$f":"MAX('MDA1'!K24,'MDA4'!S24,'MDA3'!I24,'MDA3'!L24,V24,AD24)","v":635},{"$f":"MAX('MDA1'!L24,'MDA4'!T24,'MDA3'!J24,'MDA3'!M24,AF24)","v":0},635,16.940143039339866]
[{"$f":"IF(COUNTRY_INFO!A25=0,\" \",COUNTRY_INFO!A25)","v":"Gabon"},{"$f":"IF(COUNTRY_INFO!B25=0,\" \",COUNTRY_INFO!B25)","v":"Sud-Est"},{"$f":"IF(COUNTRY_INFO!C25=0,\" \",COUNTRY_INFO!C25)","v":"Sébé-Brikolo"},{"$f":"COUNTRY_INFO!M25","v":0},null,null,{"$f":"MAX('MDA1'!M25,'MDA4'!U25)","v":0},{"$f":"IF(AND(COUNTRY_INFO!H25>0,COUNTRY_INFO!H25<4),IF(D25>MAX('MDA1'!M25,'MDA4'!U25),MAX('MDA1'!M25,'MDA4'!U25),D25),0)","v":0},{"$f":"IF(AND(COUNTRY_INFO!H25>0,COUNTRY_INFO!H25<4), IF(G25/D25*100<>0, IF(G25/D25*100>100,100,G25/D25*100), \"-\"),0)","v":0},{"$f":"COUNTRY_INFO!N25","v":19036},null,null,{"$f":"MAX('MDA1'!M25,MAX('MDA3'!I25,'MDA3'!L25)+MAX('MDA3'!J25,'MDA3'!M25))","v":0},{"$f":"IF(AND(COUNTRY_INFO!I25>0,COUNTRY_INFO!I25<4),IF(J25>MAX('MDA1'!M25,MAX('MDA3'!I25,'MDA3'!L25)+MAX('MDA3'!J25,'MDA3'!M25)),MAX('MDA1'!M25,MAX('MDA3'!I25,'MDA3'!L25)+MAX('MDA3'!J25,'MDA3'!M25)),J25),0)","v":0},{"$f":"IF(AND(COUNTRY_INFO!I25>0,COUNTRY_INFO!I25<4), IF(M25/J25*100<>0, IF(M25/J25*100>100,100,M25/J25*100), \"-\"),0)","v":"-"},{"$f":"COUNTRY_INFO!O25","v":7043},930,886,{"$f":"SUM(MAX('MDA4'!N25, 'T1'!L25, MAX(T3_R1!K25, T3_R2!K25)), MAX('MDA1'!K25, 'MDA4'!O25, 'T1'!M25, MAX(T3_R1!L25, T3_R2!L25)), MAX('MDA1'!L25, 'MDA4'!P25, 'T1'!N25, MAX(T3_R1!M25, T3_R2!M25)))","v":1816},{"$f":"IF(AND(COUNTRY_INFO!J25>1,COUNTRY_INFO!J25<4),IF(COUNTRY_INFO!E25>MAX('MDA4'!N25,'T1'!L25,MAX(T3_R1!K25,T3_R2!K25)),MAX('MDA4'!N25,'T1'!L25,MAX(T3_R1!K25,T3_R2!K25)),COUNTRY_INFO!E25),0)","v":0},{"$f":"IF(AND(COUNTRY_INFO!J25>1,COUNTRY_INFO!J25<4), IF(T25/COUNTRY_INFO!E25*100<>0, IF(T25/COUNTRY_INFO!E25*100>100,100,T25/COUNTRY_INFO!E25*100), \"-\"),0)","v":"-"},{"$f":"IF(AND(COUNTRY_INFO!J25>1,COUNTRY_INFO!J25<4),IF(COUNTRY_INFO!F25>MAX('MDA1'!K25,'MDA4'!O25,'T1'!M25,MAX(T3_R1!L25,T3_R2!L25)),MAX('MDA1'!K25,'MDA4'!O25,'T1'!M25,MAX(T3_R1!L25,T3_R2!L25)),COUNTRY_INFO!F25),0)","v":1816},{"$f":"IF(AND(COUNTRY_INFO!J25>1,COUNTRY_INFO!J25<4), IF(V25/COUNTRY_INFO!F25*100<>0, IF(V25/COUNTRY_INFO!F25*100>100,100,V25/COUNTRY_INFO!F25*100), \"-\"),0)","v":38.159277159067031},1816,{"$f":"IF(AND(COUNTRY_INFO!J25>1,COUNTRY_INFO!J25<4), IF(S25/P25*100<>0, IF(X25/P25*100>100,100,X25/P25*100), \"-\"),0)","v":25.78446684651427},{"$f":"COUNTRY_INFO!P25","v":1570.47},930,886,{"$f":"MAX('T1'!L25,'T2'!J25)+MAX('T1'!M25,'T2'!K25)+MAX('T1'!N25,'T2'!L25)","v":1816},{"$f":"IF(COUNTRY_INFO!K25=1,IF(COUNTRY_INFO!F25*0.33>MAX('T1'!M25,'T2'!K25),MAX('T1'!M25,'T2'!K25),COUNTRY_INFO!F25*0.33),IF(COUNTRY_INFO!K25=2,IF(COUNTRY_INFO!F25*0.5>MAX('T1'!M25,'T2'!K25),MAX('T1'!M25,'T2'!K25),COUNTRY_INFO!F25*0.5),IF(COUNTRY_INFO!K25=3,IF(COUNTRY_INFO!F25>MAX('T1'!M25,'T2'!K25),MAX('T1'!M25,'T2'!K25),COUNTRY_INFO!F25),0)))","v":1570.47},{"$f":"IF(AND(COUNTRY_INFO!K25>0,COUNTRY_INFO!K25<4),IF(Z25>0,IF(COUNTRY_INFO!K25=1, AD25/(COUNTRY_INFO!F25*0.33)*100, IF(COUNTRY_INFO!K25=2, AD25/(COUNTRY_INFO!F25*0.5)*100, IF(COUNTRY_INFO!K25=3, AD25/COUNTRY_INFO!F25*100))),\"-\"),0)","v":100},{"$f":"IF(COUNTRY_INFO!K25=2,IF(COUNTRY_INFO!G25*0.2>MAX('T1'!N25,'T2'!L25),MAX('T1'!N25,'T2'!L25),COUNTRY_INFO!G25*0.2),IF(COUNTRY_INFO!K25=3,IF(COUNTRY_INFO!G25>MAX('T1'!N25,'T2'!L25),MAX('T1'!N25,'T2'!L25),COUNTRY_INFO!G25),0))","v":0},{"$f":"IF(AND(COUNTRY_INFO!K25>0,COUNTRY_INFO!K25<4),IF(Z25>0,IF(COUNTRY_INFO!K25=1, 0, IF(COUNTRY_INFO!K25=2, AF25/(COUNTRY_INFO!G25*0.2)*100, IF(COUNTRY_INFO!K25=3, AF25/COUNTRY_INFO!G25*100))),\"-\"),0)","v":0},1570.47,{"$f":"IF(AND(COUNTRY_INFO!K25>0,COUNTRY_INFO!K25<4), IF(AC25/Z25*100<>0, IF(AH25/Z25*100>100,100,AH25/Z25*100), \"-\"),0)","v":100},null,{"$f":"IF(AND(D25<>0, D25<>\"Inconnu\",D25<>\"Interrompu\",D25<>\"Non requis\"),D25/COUNTRY_INFO!D25, 0)","v":0},{"$f":"IF(AND(J25<>0,J25<>\"Inconnu\",J25<>\"Interrompu\",J25<>\"Non requis\"),J25/COUNTRY_INFO!D25, 0)","v":1},{"$f":"IF(AND(P25<>0,P25<>\"Inconnu\",P25<>\"Non requis\"),P25/(COUNTRY_INFO!E25+COUNTRY_INFO!F25), 0)","v":1},{"$f":"IF(AND(Z25<>0,Z25<>\"Inconnu\",Z25<>\"Non requis\"),IF(COUNTRY_INFO!K25=1,1,IF(COUNTRY_INFO!K25=2,0.5*COUNTRY_INFO!F25/(0.5*COUNTRY_INFO!F25+0.2*COUNTRY_INFO!G25),IF(COUNTRY_INFO!K25=3,COUNTRY_INFO!F25/(COUNTRY_INFO!F25+COUNTRY_INFO!G25)))),0)","v":1},{"$f":"IF(AND(Z25<>0,Z25<>\"Inconnu\",Z25<>\"Non requis\"),IF(COUNTRY_INFO!K25=1,0,IF(COUNTRY_INFO!K25=2,0.2*COUNTRY_INFO!G25/(0.5*COUNTRY_INFO!F25+0.2*COUNTRY_INFO!G25),IF(COUNTRY_INFO!K25=3,COUNTRY_INFO!G25/(COUNTRY_INFO!F25+COUNTRY_INFO!G25)))),0)","v":0},{"$f":"MAX(COUNTRY_INFO!D25*AK25*PROFILE!$G$7,COUNTRY_INFO!D25*AL25*PROFILE!$G$7)","v":761.37736097400455},{"$f":"MAX(COUNTRY_INFO!D25*AK25*PROFILE!$G$8,COUNTRY_INFO!D25*AL25*PROFILE!$G$8,COUNTRY_INFO!D25*AM25*PROFILE!$G$8)","v":2284.3071037299424},{"$f":"MAX(COUNTRY_INFO!D25*AK25*PROFILE!$G$9,COUNTRY_INFO!D25*AL25*PROFILE!$G$9,COUNTRY_INFO!D25*AM25*PROFILE!$G$9,IF(AND(DISTRICT!Z25<>\"Inconnu\",Z25<>\"Non requis\"),COUNTRY_INFO!P25*DISTRICT!AN25,0))","v":4759.0552697288194},{"$f":"MAX(COUNTRY_INFO!D25*AK25*PROFILE!$G$10,COUNTRY_INFO!D25*AL25*PROFILE!$G$10,IF(AND(DISTRICT!Z25<>\"Inconnu\",Z25<>\"Non requis\"),COUNTRY_INFO!P25*DISTRICT!AO25,0))","v":11231.260265567233},19036,0,{"$f":"MAX('MDA4'!R25,'T1'!L25,'T2'!J25,T3_R1!K25,T3_R2!K25)","v":0},{"$f":"MAX('MDA1'!K25,'MDA4'!S25,'MDA3'!I25,'MDA3'!L25,'T1'!M25,'T2'!K25,T3_R1!L25,T3_R2!L25)","v":1816},{"$f":"MAX('MDA1'!L25,'MDA4'!T25,'MDA3'!J25,'MDA3'!M25,'T1'!N25,'T2'!L25,T3_R1!M25,T3_R2!M25)","v":0},1816,{"$f":"MAX('MDA4'!R25,T25)","v":0},{"$f":"MAX('MDA1'!K25,'MDA4'!S25,'MDA3'!I25,'MDA3'!L25,V25,AD25)","v":1816},{"$f":"MAX('MDA1'!L25,'MDA4'!T25,'MDA3'!J25,'MDA3'!M25,AF25)","v":0},1816,9.5398192897667577]
[{"$f":"IF(COUNTRY_INFO!A26=0,\" \",COUNTRY_INFO!A26)","v":"Gabon"},{"$f":"IF(COUNTRY_INFO!B26=0,\" \",COUNTRY_INFO!B26)","v":"Sud-Est"},{"$f":"IF(COUNTRY_INFO!C26=0,\" \",COUNTRY_INFO!C26)","v":"Djoué"},{"$f":"COUNTRY_INFO!M26","v":0},null,null,{"$f":"MAX('MDA1'!M26,'MDA4'!U26)","v":0},{"$f":"IF(AND(COUNTRY_INFO!H26>0,COUNTRY_INFO!H26<4),IF(D26>MAX('MDA1'!M26,'MDA4'!U26),MAX('MDA1'!M26,'MDA4'!U26),D26),0)","v":0},{"$f":"IF(AND(COUNTRY_INFO!H26>0,COUNTRY_INFO!H26<4), IF(G26/D26*100<>0, IF(G26/D26*100>100,100,G26/D26*100), \"-\"),0)","v":0},{"$f":"COUNTRY_INFO!N26","v":"Inconnu"},null,null,{"$f":"MAX('MDA1'!M26,MAX('MDA3'!I26,'MDA3'!L26)+MAX('MDA3'!J26,'MDA3'!M26))","v":0},{"$f":"IF(AND(COUNTRY_INFO!I26>0,COUNTRY_INFO!I26<4),IF(J26>MAX('MDA1'!M26,MAX('MDA3'!I26,'MDA3'!L26)+MAX('MDA3'!J26,'MDA3'!M26)),MAX('MDA1'!M26,MAX('MDA3'!I26,'MDA3'!L26)+MAX('MDA3'!J26,'MDA3'!M26)),J26),0)","v":0},{"$f":"IF(AND(COUNTRY_INFO!I26>0,COUNTRY_INFO!I26<4), IF(M26/J26*100<>0, IF(M26/J26*100>100,100,M26/J26*100), \"-\"),0)","v":0},{"$f":"COUNTRY_INFO!O26","v":2321},693,753,{"$f":"SUM(MAX('MDA4'!N26, 'T1'!L26, MAX(T3_R1!K26, T3_R2!K26)), MAX('MDA1'!K26, 'MDA4'!O26, 'T1'!M26, MAX(T3_R1!L26, T3_R2!L26)), MAX('MDA1'!L26, 'MDA4'!P26, 'T1'!N26, MAX(T3_R1!M26, T3_R2!M26)))","v":1446},{"$f":"IF(AND(COUNTRY_INFO!J26>1,COUNTRY_INFO!J26<4),IF(COUNTRY_INFO!E26>MAX('MDA4'!N26,'T1'!L26,MAX(T3_R1!K26,T3_R2!K26)),MAX('MDA4'!N26,'T1'!L26,MAX(T3_R1!K26,T3_R2!K26)),COUNTRY_INFO!E26),0)","v":0},{"$f":"IF(AND(COUNTRY_INFO!J26>1,COUNTRY_INFO!J26<4), IF(T26/COUNTRY_INFO!E26*100<>0, IF(T26/COUNTRY_INFO!E26*100>100,100,T26/COUNTRY_INFO!E26*100), \"-\"),0)","v":"-"},{"$f":"IF(AND(COUNTRY_INFO!J26>1,COUNTRY_INFO!J26<4),IF(COUNTRY_INFO!F26>MAX('MDA1'!K26,'MDA4'!O26,'T1'!M26,MAX(T3_R1!L26,T3_R2!L26)),MAX('MDA1'!K26,'MDA4'!O26,'T1'!M26,MAX(T3_R1!L26,T3_R2!L26)),COUNTRY_INFO!F26),0)","v":1446},{"$f":"IF(AND(COUNTRY_INFO!J26>1,COUNTRY_INFO!J26<4), IF(V26/COUNTRY_INFO!F26*100<>0, IF(V26/COUNTRY_INFO!F26*100>100,100,V26/COUNTRY_INFO!F26*100), \"-\"),0)","v":92.219387755102048},1446,{"$f":"IF(AND(COUNTRY_INFO!J26>1,COUNTRY_INFO!J26<4), IF(S26/P26*100<>0, IF(X26/P26*100>100,100,X26/P26*100), \"-\"),0)","v":62.30073244291254},{"$f":"COUNTRY_INFO!P26","v":517.44000000000005},693,753,{"$f":"MAX('T1'!L26,'T2'!J26)+MAX('T1'!M26,'T2'!K26)+MAX('T1'!N26,'T2'!L26)","v":1446},{"$f":"IF(COUNTRY_INFO!K26=1,IF(COUNTRY_INFO!F26*0.33>MAX('T1'!M26,'T2'!K26),MAX('T1'!M26,'T2'!K26),COUNTRY_INFO!F26*0.33),IF(COUNTRY_INFO!K26=2,IF(COUNTRY_INFO!F26*0.5>MAX('T1'!M26,'T2'!K26),MAX('T1'!M26,'T2'!K26),COUNTRY_INFO!F26*0.5),IF(COUNTRY_INFO!K26=3,IF(COUNTRY_INFO!F26>MAX('T1'!M26,'T2'!K26),MAX('T1'!M26,'T2'!K26),COUNTRY_INFO!F26),0)))","v":517.44000000000005},{"$f":"IF(AND(COUNTRY_INFO!K26>0,COUNTRY_INFO!K26<4),IF(Z26>0,IF(COUNTRY_INFO!K26=1, AD26/(COUNTRY_INFO!F26*0.33)*100, IF(COUNTRY_INFO!K26=2, AD26/(COUNTRY_INFO!F26*0.5)*100, IF(COUNTRY_INFO!K26=3, AD26/COUNTRY_INFO!F26*100))),\"-\"),0)","v":100},{"$f":"IF(COUNTRY_INFO!K26=2,IF(COUNTRY_INFO!G26*0.2>MAX('T1'!N26,'T2'!L26),MAX('T1'!N26,'T2'!L26),COUNTRY_INFO!G26*0.2),IF(COUNTRY_INFO!K26=3,IF(COUNTRY_INFO!G26>MAX('T1'!N26,'T2'!L26),MAX('T1'!N26,'T2'!L26),COUNTRY_INFO!G26),0))","v":0},{"$f":"IF(AND(COUNTRY_INFO!K26>0,COUNTRY_INFO!K26<4),IF(Z26>0,IF(COUNTRY_INFO!K26=1, 0, IF(COUNTRY_INFO!K26=2, AF26/(COUNTRY_INFO!G26*0.2)*100, IF(COUNTRY_INFO!K26=3, AF26/COUNTRY_INFO!G26*100))),\"-\"),0)","v":0},517.44000000000005,{"$f":"IF(AND(COUNTRY_INFO!K26>0,COUNTRY_INFO!K26<4), IF(AC26/Z26*100<>0, IF(AH26/Z26*100>100,100,AH26/Z26*100), \"-\"),0)","v":100},null,{"$f":"IF(AND(D26<>0, D26<>\"Inconnu\",D26<>\"Interrompu\",D26<>\"Non requis\"),D26/COUNTRY_INFO!D26, 0)","v":0},{"$f":"IF(AND(J26<>0,J26<>\"Inconnu\",J26<>\"Interrompu\",J26<>\"Non requis\"),J26/COUNTRY_INFO!D26, 0)","v":0},{"$f":"IF(AND(P26<>0,P26<>\"Inconnu\",P26<>\"Non requis\"),P26/(COUNTRY_INFO!E26+COUNTRY_INFO!F26), 0)","v":1},{"$f":"IF(AND(Z26<>0,Z26<>\"Inconnu\",Z26<>\"Non requis\"),IF(COUNTRY_INFO!K26=1,1,IF(COUNTRY_INFO!K26=2,0.5*COUNTRY_INFO!F26/(0.5*COUNTRY_INFO!F26+0.2*COUNTRY_INFO!G26),IF(COUNTRY_INFO!K26=3,COUNTRY_INFO!F26/(COUNTRY_INFO!F26+COUNTRY_INFO!G26)))),0)","v":1},{"$f":"IF(AND(Z26<>0,Z26<>\"Inconnu\",Z26<>\"Non requis\"),IF(COUNTRY_INFO!K26=1,0,IF(COUNTRY_INFO!K26=2,0.2*COUNTRY_INFO!G26/(0.5*COUNTRY_INFO!F26+0.2*COUNTRY_INFO!G26),IF(COUNTRY_INFO!K26=3,COUNTRY_INFO!G26/(COUNTRY_INFO!F26+COUNTRY_INFO!G26)))),0)","v":0},{"$f":"MAX(COUNTRY_INFO!D26*AK26*PROFILE!$G$7,COUNTRY_INFO!D26*AL26*PROFILE!$G$7)","v":0},{"$f":"MAX(COUNTRY_INFO!D26*AK26*PROFILE!$G$8,COUNTRY_INFO!D26*AL26*PROFILE!$G$8,COUNTRY_INFO!D26*AM26*PROFILE!$G$8)","v":752.51575160172661},{"$f":"MAX(COUNTRY_INFO!D26*AK26*PROFILE!$G$9,COUNTRY_INFO!D26*AL26*PROFILE!$G$9,COUNTRY_INFO!D26*AM26*PROFILE!$G$9,IF(AND(DISTRICT!Z26<>\"Inconnu\",Z26<>\"Non requis\"),COUNTRY_INFO!P26*DISTRICT!AN26,0))","v":1567.7682074211716},{"$f":"MAX(COUNTRY_INFO!D26*AK26*PROFILE!$G$10,COUNTRY_INFO!D26*AL26*PROFILE!$G$10,IF(AND(DISTRICT!Z26<>\"Inconnu\",Z26<>\"Non requis\"),COUNTRY_INFO!P26*DISTRICT!AO26,0))","v":0},2320.2839590228982,"Y",{"$f":"MAX('MDA4'!R26,'T1'!L26,'T2'!J26,T3_R1!K26,T3_R2!K26)","v":0},{"$f":"MAX('MDA1'!K26,'MDA4'!S26,'MDA3'!I26,'MDA3'!L26,'T1'!M26,'T2'!K26,T3_R1!L26,T3_R2!L26)","v":1446},{"$f":"MAX('MDA1'!L26,'MDA4'!T26,'MDA3'!J26,'MDA3'!M26,'T1'!N26,'T2'!L26,T3_R1!M26,T3_R2!M26)","v":0},1446,{"$f":"MAX('MDA4'!R26,T26)","v":0},{"$f":"MAX('MDA1'!K26,'MDA4'!S26,'MDA3'!I26,'MDA3'!L26,V26,AD26)","v":1446},{"$f":"MAX('MDA1'!L26,'MDA4'!T26,'MDA3'!J26,'MDA3'!M26,AF26)","v":0},1446,62.31995848512134]
[{"$f":"IF(COUNTRY_INFO!A27=0,\" \",COUNTRY_INFO!A27)","v":"Gabon"},{"$f":"IF(COUNTRY_INFO!B27=0,\" \",COUNTRY_INFO!B27)","v":"Centre"},{"$f":"IF(COUNTRY_INFO!C27=0,\" \",COUNTRY_INFO!C27)","v":"Ogooué-et-Lacs"},{"$f":"COUNTRY_INFO!M27","v":0},null,null,{"$f":"MAX('MDA1'!M27,'MDA4'!U27)","v":0},{"$f":"IF(AND(COUNTRY_INFO!H27>0,COUNTRY_INFO!H27<4),IF(D27>MAX('MDA1'!M27,'MDA4'!U27),MAX('MDA1'!M27,'MDA4'!U27),D27),0)","v":0},{"$f":"IF(AND(COUNTRY_INFO!H27>0,COUNTRY_INFO!H27<4), IF(G27/D27*100<>0, IF(G27/D27*100>100,100,G27/D27*100), \"-\"),0)","v":0},{"$f":"COUNTRY_INFO!N27","v":0},null,null,{"$f":"MAX('MDA1'!M27,MAX('MDA3'!I27,'MDA3'!L27)+MAX('MDA3'!J27,'MDA3'!M27))","v":0},{"$f":"IF(AND(COUNTRY_INFO!I27>0,COUNTRY_INFO!I27<4),IF(J27>MAX('MDA1'!M27,MAX('MDA3'!I27,'MDA3'!L27)+MAX('MDA3'!J27,'MDA3'!M27)),MAX('MDA1'!M27,MAX('MDA3'!I27,'MDA3'!L27)+MAX('MDA3'!J27,'MDA3'!M27)),J27),0)","v":0},{"$f":"IF(AND(COUNTRY_INFO!I27>0,COUNTRY_INFO!I27<4), IF(M27/J27*100<>0, IF(M27/J27*100>100,100,M27/J27*100), \"-\"),0)","v":0},{"$f":"COUNTRY_INFO!O27","v":22305},3844,3633,{"$f":"SUM(MAX('MDA4'!N27, 'T1'!L27, MAX(T3_R1!K27, T3_R2!K27)), MAX('MDA1'!K27, 'MDA4'!O27, 'T1'!M27, MAX(T3_R1!L27, T3_R2!L27)), MAX('MDA1'!L27, 'MDA4'!P27, 'T1'!N27, MAX(T3_R1!M27, T3_R2!M27)))","v":7477},{"$f":"IF(AND(COUNTRY_INFO!J27>1,COUNTRY_INFO!J27<4),IF(COUNTRY_INFO!E27>MAX('MDA4'!N27,'T1'!L27,MAX(T3_R1!K27,T3_R2!K27)),MAX('MDA4'!N27,'T1'!L27,MAX(T3_R1!K27,T3_R2!K27)),COUNTRY_INFO!E27),0)","v":0},{"$f":"IF(AND(COUNTRY_INFO!J27>1,COUNTRY_INFO!J27<4), IF(T27/COUNTRY_INFO!E27*100<>0, IF(T27/COUNTRY_INFO!E27*100>100,100,T27/COUNTRY_INFO!E27*100), \"-\"),0)","v":"-"},{"$f":"IF(AND(COUNTRY_INFO!J27>1,COUNTRY_INFO!J27<4),IF(COUNTRY_INFO!F27>MAX('MDA1'!K27,'MDA4'!O27,'T1'!M27,MAX(T3_R1!L27,T3_R2!L27)),MAX('MDA1'!K27,'MDA4'!O27,'T1'!M27,MAX(T3_R1!L27,T3_R2!L27)),COUNTRY_INFO!F27),0)","v":7477},{"$f":"IF(AND(COUNTRY_INFO!J27>1,COUNTRY_INFO!J27<4), IF(V27/COUNTRY_INFO!F27*100<>0, IF(V27/COUNTRY_INFO!F27*100>100,100,V27/COUNTRY_INFO!F27*100), \"-\"),0)","v":49.611837303430427},7477,{"$f":"IF(AND(COUNTRY_INFO!J27>1,COUNTRY_INFO!J27<4), IF(S27/P27*100<>0, IF(X27/P27*100>100,100,X27/P27*100), \"-\"),0)","v":33.521631921093928},{"$f":"COUNTRY_INFO!P27","v":14648.7},3844,3633,{"$f":"MAX('T1'!L27,'T2'!J27)+MAX('T1'!M27,'T2'!K27)+MAX('T1'!N27,'T2'!L27)","v":7477},{"$f":"IF(COUNTRY_INFO!K27=1,IF(COUNTRY_INFO!F27*0.33>MAX('T1'!M27,'T2'!K27),MAX('T1'!M27,'T2'!K27),COUNTRY_INFO!F27*0.33),IF(COUNTRY_INFO!K27=2,IF(COUNTRY_INFO!F27*0.5>MAX('T1'!M27,'T2'!K27),MAX('T1'!M27,'T2'!K27),COUNTRY_INFO!F27*0.5),IF(COUNTRY_INFO!K27=3,IF(COUNTRY_INFO!F27>MAX('T1'!M27,'T2'!K27),MAX('T1'!M27,'T2'!K27),COUNTRY_INFO!F27),0)))","v":7477},{"$f":"IF(AND(COUNTRY_INFO!K27>0,COUNTRY_INFO!K27<4),IF(Z27>0,IF(COUNTRY_INFO!K27=1, AD27/(COUNTRY_INFO!F27*0.33)*100, IF(COUNTRY_INFO!K27=2, AD27/(COUNTRY_INFO!F27*0.5)*100, IF(COUNTRY_INFO!K27=3, AD27/COUNTRY_INFO!F27*100))),\"-\"),0)","v":99.223674606860854},{"$f":"IF(COUNTRY_INFO!K27=2,IF(COUNTRY_INFO!G27*0.2>MAX('T1'!N27,'T2'!L27),MAX('T1'!N27,'T2'!L27),COUNTRY_INFO!G27*0.2),IF(COUNTRY_INFO!K27=3,IF(COUNTRY_INFO!G27>MAX('T1'!N27,'T2'!L27),MAX('T1'!N27,'T2'!L27),COUNTRY_INFO!G27),0))","v":0},{"$f":"IF(AND(COUNTRY_INFO!K27>0,COUNTRY_INFO!K27<4),IF(Z27>0,IF(COUNTRY_INFO!K27=1, 0, IF(COUNTRY_INFO!K27=2, AF27/(COUNTRY_INFO!G27*0.2)*100, IF(COUNTRY_INFO!K27=3, AF27/COUNTRY_INFO!G27*100))),\"-\"),0)","v":0},7477,{"$f":"IF(AND(COUNTRY_INFO!K27>0,COUNTRY_INFO!K27<4), IF(AC27/Z27*100<>0, IF(AH27/Z27*100>100,100,AH27/Z27*100), \"-\"),0)","v":51.04207199273656},null,{"$f":"IF(AND(D27<>0, D27<>\"Inconnu\",D27<>\"Interrompu\",D27<>\"Non requis\"),D27/COUNTRY_INFO!D27, 0)","v":0},{"$f":"IF(AND(J27<>0,J27<>\"Inconnu\",J27<>\"Interrompu\",J27<>\"Non requis\"),J27/COUNTRY_INFO!D27, 0)","v":0},{"$f":"IF(AND(P27<>0,P27<>\"Inconnu\",P27<>\"Non requis\"),P27/(COUNTRY_INFO!E27+COUNTRY_INFO!F27), 0)","v":1},{"$f":"IF(AND(Z27<>0,Z27<>\"Inconnu\",Z27<>\"Non requis\"),IF(COUNTRY_INFO!K27=1,1,IF(COUNTRY_INFO!K27=2,0.5*COUNTRY_INFO!F27/(0.5*COUNTRY_INFO!F27+0.2*COUNTRY_INFO!G27),IF(COUNTRY_INFO!K27=3,COUNTRY_INFO!F27/(COUNTRY_INFO!F27+COUNTRY_INFO!G27)))),0)","v":0.51441424836333594},{"$f":"IF(AND(Z27<>0,Z27<>\"Inconnu\",Z27<>\"Non requis\"),IF(COUNTRY_INFO!K27=1,0,IF(COUNTRY_INFO!K27=2,0.2*COUNTRY_INFO!G27/(0.5*COUNTRY_INFO!F27+0.2*COUNTRY_INFO!G27),IF(COUNTRY_INFO!K27=3,COUNTRY_INFO!G27/(COUNTRY_INFO!F27+COUNTRY_INFO!G27)))),0)","v":0.48558575163666401},{"$f":"MAX(COUNTRY_INFO!D27*AK27*PROFILE!$G$7,COUNTRY_INFO!D27*AL27*PROFILE!$G$7)","v":0},{"$f":"MAX(COUNTRY_INFO!D27*AK27*PROFILE!$G$8,COUNTRY_INFO!D27*AL27*PROFILE!$G$8,COUNTRY_INFO!D27*AM27*PROFILE!$G$8)","v":7233.7991609081937},{"$f":"MAX(COUNTRY_INFO!D27*AK27*PROFILE!$G$9,COUNTRY_INFO!D27*AL27*PROFILE!$G$9,COUNTRY_INFO!D27*AM27*PROFILE!$G$9,IF(AND(DISTRICT!Z27<>\"Inconnu\",Z27<>\"Non requis\"),COUNTRY_INFO!P27*DISTRICT!AN27,0))","v":15070.675024679169},{"$f":"MAX(COUNTRY_INFO!D27*AK27*PROFILE!$G$10,COUNTRY_INFO!D27*AL27*PROFILE!$G$10,IF(AND(DISTRICT!Z27<>\"Inconnu\",Z27<>\"Non requis\"),COUNTRY_INFO!P27*DISTRICT!AO27,0))","v":7113.2000000000007},29417.674185587362,"Y",{"$f":"MAX('MDA4'!R27,'T1'!L27,'T2'!J27,T3_R1!K27,T3_R2!K27)","v":0},{"$f":"MAX('MDA1'!K27,'MDA4'!S27,'MDA3'!I27,'MDA3'!L27,'T1'!M27,'T2'!K27,T3_R1!L27,T3_R2!L27)","v":7477},{"$f":"MAX('MDA1'!L27,'MDA4'!T27,'MDA3'!J27,'MDA3'!M27,'T1'!N27,'T2'!L27,T3_R1!M27,T3_R2!M27)","v":0},7477,{"$f":"MAX('MDA4'!R27,T27)","v":0},{"$f":"MAX('MDA1'!K27,'MDA4'!S27,'MDA3'!I27,'MDA3'!L27,V27,AD27)","v":7477},{"$f":"MAX('MDA1'!L27,'MDA4'!T27,'MDA3'!J27,'MDA3'!M27,AF27)","v":0},7477,25.416693219286575]
[{"$f":"IF(COUNTRY_INFO!A28=0,\" \",COUNTRY_INFO!A28)","v":"Gabon"},{"$f":"IF(COUNTRY_INFO!B28=0,\" \",COUNTRY_INFO!B28)","v":"Centre"},{"$f":"IF(COUNTRY_INFO!C28=0,\" \",COUNTRY_INFO!C28)","v":"Abanga-Bigné"},{"$f":"COUNTRY_INFO!M28","v":16969},null,null,{"$f":"MAX('MDA1'!M28,'MDA4'!U28)","v":0},{"$f":"IF(AND(COUNTRY_INFO!H28>0,COUNTRY_INFO!H28<4),IF(D28>MAX('MDA1'!M28,'MDA4'!U28),MAX('MDA1'!M28,'MDA4'!U28),D28),0)","v":0},{"$f":"IF(AND(COUNTRY_INFO!H28>0,COUNTRY_INFO!H28<4), IF(G28/D28*100<>0, IF(G28/D28*100>100,100,G28/D28*100), \"-\"),0)","v":"-"},{"$f":"COUNTRY_INFO!N28","v":16969},null,null,{"$f":"MAX('MDA1'!M28,MAX('MDA3'!I28,'MDA3'!L28)+MAX('MDA3'!J28,'MDA3'!M28))","v":0},{"$f":"IF(AND(COUNTRY_INFO!I28>0,COUNTRY_INFO!I28<4),IF(J28>MAX('MDA1'!M28,MAX('MDA3'!I28,'MDA3'!L28)+MAX('MDA3'!J28,'MDA3'!M28)),MAX('MDA1'!M28,MAX('MDA3'!I28,'MDA3'!L28)+MAX('MDA3'!J28,'MDA3'!M28)),J28),0)","v":0},{"$f":"IF(AND(COUNTRY_INFO!I28>0,COUNTRY_INFO!I28<4), IF(M28/J28*100<>0, IF(M28/J28*100>100,100,M28/J28*100), \"-\"),0)","v":"-"},{"$f":"COUNTRY_INFO!O28","v":6278},906,957,{"$f":"SUM(MAX('MDA4'!N28, 'T1'!L28, MAX(T3_R1!K28, T3_R2!K28)), MAX('MDA1'!K28, 'MDA4'!O28, 'T1'!M28, MAX(T3_R1!L28, T3_R2!L28)), MAX('MDA1'!L28, 'MDA4'!P28, 'T1'!N28, MAX(T3_R1!M28, T3_R2!M28)))","v":1863},{"$f":"IF(AND(COUNTRY_INFO!J28>1,COUNTRY_INFO!J28<4),IF(COUNTRY_INFO!E28>MAX('MDA4'!N28,'T1'!L28,MAX(T3_R1!K28,T3_R2!K28)),MAX('MDA4'!N28,'T1'!L28,MAX(T3_R1!K28,T3_R2!K28)),COUNTRY_INFO!E28),0)","v":0},{"$f":"IF(AND(COUNTRY_INFO!J28>1,COUNTRY_INFO!J28<4), IF(T28/COUNTRY_INFO!E28*100<>0, IF(T28/COUNTRY_INFO!E28*100>100,100,T28/COUNTRY_INFO!E28*100), \"-\"),0)","v":"-"},{"$f":"IF(AND(COUNTRY_INFO!J28>1,COUNTRY_INFO!J28<4),IF(COUNTRY_INFO!F28>MAX('MDA1'!K28,'MDA4'!O28,'T1'!M28,MAX(T3_R1!L28,T3_R2!L28)),MAX('MDA1'!K28,'MDA4'!O28,'T1'!M28,MAX(T3_R1!L28,T3_R2!L28)),COUNTRY_INFO!F28),0)","v":1863},{"$f":"IF(AND(COUNTRY_INFO!J28>1,COUNTRY_INFO!J28<4), IF(V28/COUNTRY_INFO!F28*100<>0, IF(V28/COUNTRY_INFO!F28*100>100,100,V28/COUNTRY_INFO!F28*100), \"-\"),0)","v":43.917963224893917},1863,{"$f":"IF(AND(COUNTRY_INFO!J28>1,COUNTRY_INFO!J28<4), IF(S28/P28*100<>0, IF(X28/P28*100>100,100,X28/P28*100), \"-\"),0)","v":29.675055750238933},{"$f":"COUNTRY_INFO!P28","v":1399.8600000000001},906,957,{"$f":"MAX('T1'!L28,'T2'!J28)+MAX('T1'!M28,'T2'!K28)+MAX('T1'!N28,'T2'!L28)","v":1863},{"$f":"IF(COUNTRY_INFO!K28=1,IF(COUNTRY_INFO!F28*0.33>MAX('T1'!M28,'T2'!K28),MAX('T1'!M28,'T2'!K28),COUNTRY_INFO!F28*0.33),IF(COUNTRY_INFO!K28=2,IF(COUNTRY_INFO!F28*0.5>MAX('T1'!M28,'T2'!K28),MAX('T1'!M28,'T2'!K28),COUNTRY_INFO!F28*0.5),IF(COUNTRY_INFO!K28=3,IF(COUNTRY_INFO!F28>MAX('T1'!M28,'T2'!K28),MAX('T1'!M28,'T2'!K28),COUNTRY_INFO!F28),0)))","v":1399.8600000000001},{"$f":"IF(AND(COUNTRY_INFO!K28>0,COUNTRY_INFO!K28<4),IF(Z28>0,IF(COUNTRY_INFO!K28=1, AD28/(COUNTRY_INFO!F28*0.33)*100, IF(COUNTRY_INFO!K28=2, AD28/(COUNTRY_INFO!F28*0.5)*100, IF(COUNTRY_INFO!K28=3, AD28/COUNTRY_INFO!F28*100))),\"-\"),0)","v":100},{"$f":"IF(COUNTRY_INFO!K28=2,IF(COUNTRY_INFO!G28*0.2>MAX('T1'!N28,'T2'!L28),MAX('T1'!N28,'T2'!L28),COUNTRY_INFO!G28*0.2),IF(COUNTRY_INFO!K28=3,IF(COUNTRY_INFO!G28>MAX('T1'!N28,'T2'!L28),MAX('T1'!N28,'T2'!L28),COUNTRY_INFO!G28),0))","v":0},{"$f":"IF(AND(COUNTRY_INFO!K28>0,COUNTRY_INFO!K28<4),IF(Z28>0,IF(COUNTRY_INFO!K28=1, 0, IF(COUNTRY_INFO!K28=2, AF28/(COUNTRY_INFO!G28*0.2)*100, IF(COUNTRY_INFO!K28=3, AF28/COUNTRY_INFO!G28*100))),\"-\"),0)","v":0},1399.8600000000001,{"$f":"IF(AND(COUNTRY_INFO!K28>0,COUNTRY_INFO!K28<4), IF(AC28/Z28*100<>0, IF(AH28/Z28*100>100,100,AH28/Z28*100), \"-\"),0)","v":100},null,{"$f":"IF(AND(D28<>0, D28<>\"Inconnu\",D28<>\"Interrompu\",D28<>\"Non requis\"),D28/COUNTRY_INFO!D28, 0)","v":1},{"$f":"IF(AND(J28<>0,J28<>\"Inconnu\",J28<>\"Interrompu\",J28<>\"Non requis\"),J28/COUNTRY_INFO!D28, 0)","v":1},{"$f":"IF(AND(P28<>0,P28<>\"Inconnu\",P28<>\"Non requis\"),P28/(COUNTRY_INFO!E28+COUNTRY_INFO!F28), 0)","v":1},{"$f":"IF(AND(Z28<>0,Z28<>\"Inconnu\",Z28<>\"Non requis\"),IF(COUNTRY_INFO!K28=1,1,IF(COUNTRY_INFO!K28=2,0.5*COUNTRY_INFO!F28/(0.5*COUNTRY_INFO!F28+0.2*COUNTRY_INFO!G28),IF(COUNTRY_INFO!K28=3,COUNTRY_INFO!F28/(COUNTRY_INFO!F28+COUNTRY_INFO!G28)))),0)","v":1},{"$f":"IF(AND(Z28<>0,Z28<>\"Inconnu\",Z28<>\"Non requis\"),IF(COUNTRY_INFO!K28=1,0,IF(COUNTRY_INFO!K28=2,0.2*COUNTRY_INFO!G28/(0.5*COUNTRY_INFO!F28+0.2*COUNTRY_INFO!G28),IF(COUNTRY_INFO!K28=3,COUNTRY_INFO!G28/(COUNTRY_INFO!F28+COUNTRY_INFO!G28)))),0)","v":0},{"$f":"MAX(COUNTRY_INFO!D28*AK28*PROFILE!$G$7,COUNTRY_INFO!D28*AL28*PROFILE!$G$7)","v":678.70416255347152},{"$f":"MAX(COUNTRY_INFO!D28*AK28*PROFILE!$G$8,COUNTRY_INFO!D28*AL28*PROFILE!$G$8,COUNTRY_INFO!D28*AM28*PROFILE!$G$8)","v":2036.2685040551266},{"$f":"MAX(COUNTRY_INFO!D28*AK28*PROFILE!$G$9,COUNTRY_INFO!D28*AL28*PROFILE!$G$9,COUNTRY_INFO!D28*AM28*PROFILE!$G$9,IF(AND(DISTRICT!Z28<>\"Inconnu\",Z28<>\"Non requis\"),COUNTRY_INFO!P28*DISTRICT!AN28,0))","v":4242.2992683351722},{"$f":"MAX(COUNTRY_INFO!D28*AK28*PROFILE!$G$10,COUNTRY_INFO!D28*AL28*PROFILE!$G$10,IF(AND(DISTRICT!Z28<>\"Inconnu\",Z28<>\"Non requis\"),COUNTRY_INFO!P28*DISTRICT!AO28,0))","v":10011.72806505623},16969,0,{"$f":"MAX('MDA4'!R28,'T1'!L28,'T2'!J28,T3_R1!K28,T3_R2!K28)","v":0},{"$f":"MAX('MDA1'!K28,'MDA4'!S28,'MDA3'!I28,'MDA3'!L28,'T1'!M28,'T2'!K28,T3_R1!L28,T3_R2!L28)","v":1863},{"$f":"MAX('MDA1'!L28,'MDA4'!T28,'MDA3'!J28,'MDA3'!M28,'T1'!N28,'T2'!L28,T3_R1!M28,T3_R2!M28)","v":0},1863,{"$f":"MAX('MDA4'!R28,T28)","v":0},{"$f":"MAX('MDA1'!K28,'MDA4'!S28,'MDA3'!I28,'MDA3'!L28,V28,AD28)","v":1863},{"$f":"MAX('MDA1'!L28,'MDA4'!T28,'MDA3'!J28,'MDA3'!M28,AF28)","v":0},1863,10.978843773940715]
[{"$f":"IF(COUNTRY_INFO!A29=0,\" \",COUNTRY_INFO!A29)","v":"Gabon"},{"$f":"IF(COUNTRY_INFO!B29=0,\" \",COUNTRY_INFO!B29)","v":"Centre-Sud"},{"$f":"IF(COUNTRY_INFO!C29=0,\" \",COUNTRY_INFO!C29)","v":"Tsamba-Magotsi"},{"$f":"COUNTRY_INFO!M29","v":0},null,null,{"$f":"MAX('MDA1'!M29,'MDA4'!U29)","v":0},{"$f":"IF(AND(COUNTRY_INFO!H29>0,COUNTRY_INFO!H29<4),IF(D29>MAX('MDA1'!M29,'MDA4'!U29),MAX('MDA1'!M29,'MDA4'!U29),D29),0)","v":0},{"$f":"IF(AND(COUNTRY_INFO!H29>0,COUNTRY_INFO!H29<4), IF(G29/D29*100<>0, IF(G29/D29*100>100,100,G29/D29*100), \"-\"),0)","v":0},{"$f":"COUNTRY_INFO!N29","v":15465},null,null,{"$f":"MAX('MDA1'!M29,MAX('MDA3'!I29,'MDA3'!L29)+MAX('MDA3'!J29,'MDA3'!M29))","v":0},{"$f":"IF(AND(COUNTRY_INFO!I29>0,COUNTRY_INFO!I29<4),IF(J29>MAX('MDA1'!M29,MAX('MDA3'!I29,'MDA3'!L29)+MAX('MDA3'!J29,'MDA3'!M29)),MAX('MDA1'!M29,MAX('MDA3'!I29,'MDA3'!L29)+MAX('MDA3'!J29,'MDA3'!M29)),J29),0)","v":0},{"$f":"IF(AND(COUNTRY_INFO!I29>0,COUNTRY_INFO!I29<4), IF(M29/J29*100<>0, IF(M29/J29*100>100,100,M29/J29*100), \"-\"),0)","v":"-"},{"$f":"COUNTRY_INFO!O29","v":5722},1164,1100,{"$f":"SUM(MAX('MDA4'!N29, 'T1'!L29, MAX(T3_R1!K29, T3_R2!K29)), MAX('MDA1'!K29, 'MDA4'!O29, 'T1'!M29, MAX(T3_R1!L29, T3_R2!L29)), MAX('MDA1'!L29, 'MDA4'!P29, 'T1'!N29, MAX(T3_R1!M29, T3_R2!M29)))","v":2264},{"$f":"IF(AND(COUNTRY_INFO!J29>1,COUNTRY_INFO!J29<4),IF(COUNTRY_INFO!E29>MAX('MDA4'!N29,'T1'!L29,MAX(T3_R1!K29,T3_R2!K29)),MAX('MDA4'!N29,'T1'!L29,MAX(T3_R1!K29,T3_R2!K29)),COUNTRY_INFO!E29),0)","v":0},{"$f":"IF(AND(COUNTRY_INFO!J29>1,COUNTRY_INFO!J29<4), IF(T29/COUNTRY_INFO!E29*100<>0, IF(T29/COUNTRY_INFO!E29*100>100,100,T29/COUNTRY_INFO!E29*100), \"-\"),0)","v":"-"},{"$f":"IF(AND(COUNTRY_INFO!J29>1,COUNTRY_INFO!J29<4),IF(COUNTRY_INFO!F29>MAX('MDA1'!K29,'MDA4'!O29,'T1'!M29,MAX(T3_R1!L29,T3_R2!L29)),MAX('MDA1'!K29,'MDA4'!O29,'T1'!M29,MAX(T3_R1!L29,T3_R2!L29)),COUNTRY_INFO!F29),0)","v":2264},{"$f":"IF(AND(COUNTRY_INFO!J29>1,COUNTRY_INFO!J29<4), IF(V29/COUNTRY_INFO!F29*100<>0, IF(V29/COUNTRY_INFO!F29*100>100,100,V29/COUNTRY_INFO!F29*100), \"-\"),0)","v":58.561821003621318},2264,{"$f":"IF(AND(COUNTRY_INFO!J29>1,COUNTRY_INFO!J29<4), IF(S29/P29*100<>0, IF(X29/P29*100>100,100,X29/P29*100), \"-\"),0)","v":39.566585110101364},{"$f":"COUNTRY_INFO!P29","v":3757.8},1164,1100,{"$f":"MAX('T1'!L29,'T2'!J29)+MAX('T1'!M29,'T2'!K29)+MAX('T1'!N29,'T2'!L29)","v":2264},{"$f":"IF(COUNTRY_INFO!K29=1,IF(COUNTRY_INFO!F29*0.33>MAX('T1'!M29,'T2'!K29),MAX('T1'!M29,'T2'!K29),COUNTRY_INFO!F29*0.33),IF(COUNTRY_INFO!K29=2,IF(COUNTRY_INFO!F29*0.5>MAX('T1'!M29,'T2'!K29),MAX('T1'!M29,'T2'!K29),COUNTRY_INFO!F29*0.5),IF(COUNTRY_INFO!K29=3,IF(COUNTRY_INFO!F29>MAX('T1'!M29,'T2'!K29),MAX('T1'!M29,'T2'!K29),COUNTRY_INFO!F29),0)))","v":1933},{"$f":"IF(AND(COUNTRY_INFO!K29>0,COUNTRY_INFO!K29<4),IF(Z29>0,IF(COUNTRY_INFO!K29=1, AD29/(COUNTRY_INFO!F29*0.33)*100, IF(COUNTRY_INFO!K29=2, AD29/(COUNTRY_INFO!F29*0.5)*100, IF(COUNTRY_INFO!K29=3, AD29/COUNTRY_INFO!F29*100))),\"-\"),0)","v":100},{"$f":"IF(COUNTRY_INFO!K29=2,IF(COUNTRY_INFO!G29*0.2>MAX('T1'!N29,'T2'!L29),MAX('T1'!N29,'T2'!L29),COUNTRY_INFO!G29*0.2),IF(COUNTRY_INFO!K29=3,IF(COUNTRY_INFO!G29>MAX('T1'!N29,'T2'!L29),MAX('T1'!N29,'T2'!L29),COUNTRY_INFO!G29),0))","v":0},{"$f":"IF(AND(COUNTRY_INFO!K29>0,COUNTRY_INFO!K29<4),IF(Z29>0,IF(COUNTRY_INFO!K29=1, 0, IF(COUNTRY_INFO!K29=2, AF29/(COUNTRY_INFO!G29*0.2)*100, IF(COUNTRY_INFO!K29=3, AF29/COUNTRY_INFO!G29*100))),\"-\"),0)","v":0},1933,{"$f":"IF(AND(COUNTRY_INFO!K29>0,COUNTRY_INFO!K29<4), IF(AC29/Z29*100<>0, IF(AH29/Z29*100>100,100,AH29/Z29*100), \"-\"),0)","v":51.43967214859758},null,{"$f":"IF(AND(D29<>0, D29<>\"Inconnu\",D29<>\"Interrompu\",D29<>\"Non requis\"),D29/COUNTRY_INFO!D29, 0)","v":0},{"$f":"IF(AND(J29<>0,J29<>\"Inconnu\",J29<>\"Interrompu\",J29<>\"Non requis\"),J29/COUNTRY_INFO!D29, 0)","v":1},{"$f":"IF(AND(P29<>0,P29<>\"Inconnu\",P29<>\"Non requis\"),P29/(COUNTRY_INFO!E29+COUNTRY_INFO!F29), 0)","v":1},{"$f":"IF(AND(Z29<>0,Z29<>\"Inconnu\",Z29<>\"Non requis\"),IF(COUNTRY_INFO!K29=1,1,IF(COUNTRY_INFO!K29=2,0.5*COUNTRY_INFO!F29/(0.5*COUNTRY_INFO!F29+0.2*COUNTRY_INFO!G29),IF(COUNTRY_INFO!K29=3,COUNTRY_INFO!F29/(COUNTRY_INFO!F29+COUNTRY_INFO!G29)))),0)","v":0.51439672148597582},{"$f":"IF(AND(Z29<>0,Z29<>\"Inconnu\",Z29<>\"Non requis\"),IF(COUNTRY_INFO!K29=1,0,IF(COUNTRY_INFO!K29=2,0.2*COUNTRY_INFO!G29/(0.5*COUNTRY_INFO!F29+0.2*COUNTRY_INFO!G29),IF(COUNTRY_INFO!K29=3,COUNTRY_INFO!G29/(COUNTRY_INFO!F29+COUNTRY_INFO!G29)))),0)","v":0.48560327851402418},{"$f":"MAX(COUNTRY_INFO!D29*AK29*PROFILE!$G$7,COUNTRY_INFO!D29*AL29*PROFILE!$G$7)","v":618.54911154985189},{"$f":"MAX(COUNTRY_INFO!D29*AK29*PROFILE!$G$8,COUNTRY_INFO!D29*AL29*PROFILE!$G$8,COUNTRY_INFO!D29*AM29*PROFILE!$G$8)","v":1855.789522966146},{"$f":"MAX(COUNTRY_INFO!D29*AK29*PROFILE!$G$9,COUNTRY_INFO!D29*AL29*PROFILE!$G$9,COUNTRY_INFO!D29*AM29*PROFILE!$G$9,IF(AND(DISTRICT!Z29<>\"Inconnu\",Z29<>\"Non requis\"),COUNTRY_INFO!P29*DISTRICT!AN29,0))","v":3866.2949015736599},{"$f":"MAX(COUNTRY_INFO!D29*AK29*PROFILE!$G$10,COUNTRY_INFO!D29*AL29*PROFILE!$G$10,IF(AND(DISTRICT!Z29<>\"Inconnu\",Z29<>\"Non requis\"),COUNTRY_INFO!P29*DISTRICT!AO29,0))","v":9124.3664639103408},15464.999999999998,0,{"$f":"MAX('MDA4'!R29,'T1'!L29,'T2'!J29,T3_R1!K29,T3_R2!K29)","v":0},{"$f":"MAX('MDA1'!K29,'MDA4'!S29,'MDA3'!I29,'MDA3'!L29,'T1'!M29,'T2'!K29,T3_R1!L29,T3_R2!L29)","v":2264},{"$f":"MAX('MDA1'!L29,'MDA4'!T29,'MDA3'!J29,'MDA3'!M29,'T1'!N29,'T2'!L29,T3_R1!M29,T3_R2!M29)","v":0},2264,{"$f":"MAX('MDA4'!R29,T29)","v":0},{"$f":"MAX('MDA1'!K29,'MDA4'!S29,'MDA3'!I29,'MDA3'!L29,V29,AD29)","v":2264},{"$f":"MAX('MDA1'!L29,'MDA4'!T29,'MDA3'!J29,'MDA3'!M29,AF29)","v":0},2264,14.639508567733595]
[{"$f":"IF(COUNTRY_INFO!A30=0,\" \",COUNTRY_INFO!A30)","v":"Gabon"},{"$f":"IF(COUNTRY_INFO!B30=0,\" \",COUNTRY_INFO!B30)","v":"Centre-Sud"},{"$f":"IF(COUNTRY_INFO!C30=0,\" \",COUNTRY_INFO!C30)","v":"Louetsi-Wano"},{"$f":"COUNTRY_INFO!M30","v":12637},null,null,{"$f":"MAX('MDA1'!M30,'MDA4'!U30)","v":0},{"$f":"IF(AND(COUNTRY_INFO!H30>0,COUNTRY_INFO!H30<4),IF(D30>MAX('MDA1'!M30,'MDA4'!U30),MAX('MDA1'!M30,'MDA4'!U30),D30),0)","v":0},{"$f":"IF(AND(COUNTRY_INFO!H30>0,COUNTRY_INFO!H30<4), IF(G30/D30*100<>0, IF(G30/D30*100>100,100,G30/D30*100), \"-\"),0)","v":"-"},{"$f":"COUNTRY_INFO!N30","v":12637},null,null,{"$f":"MAX('MDA1'!M30,MAX('MDA3'!I30,'MDA3'!L30)+MAX('MDA3'!J30,'MDA3'!M30))","v":0},{"$f":"IF(AND(COUNTRY_INFO!I30>0,COUNTRY_INFO!I30<4),IF(J30>MAX('MDA1'!M30,MAX('MDA3'!I30,'MDA3'!L30)+MAX('MDA3'!J30,'MDA3'!M30)),MAX('MDA1'!M30,MAX('MDA3'!I30,'MDA3'!L30)+MAX('MDA3'!J30,'MDA3'!M30)),J30),0)","v":0},{"$f":"IF(AND(COUNTRY_INFO!I30>0,COUNTRY_INFO!I30<4), IF(M30/J30*100<>0, IF(M30/J30*100>100,100,M30/J30*100), \"-\"),0)","v":"-"},{"$f":"COUNTRY_INFO!O30","v":4675},1142,1130,{"$f":"SUM(MAX('MDA4'!N30, 'T1'!L30, MAX(T3_R1!K30, T3_R2!K30)), MAX('MDA1'!K30, 'MDA4'!O30, 'T1'!M30, MAX(T3_R1!L30, T3_R2!L30)), MAX('MDA1'!L30, 'MDA4'!P30, 'T1'!N30, MAX(T3_R1!M30, T3_R2!M30)))","v":2364},{"$f":"IF(AND(COUNTRY_INFO!J30>1,COUNTRY_INFO!J30<4),IF(COUNTRY_INFO!E30>MAX('MDA4'!N30,'T1'!L30,MAX(T3_R1!K30,T3_R2!K30)),MAX('MDA4'!N30,'T1'!L30,MAX(T3_R1!K30,T3_R2!K30)),COUNTRY_INFO!E30),0)","v":0},{"$f":"IF(AND(COUNTRY_INFO!J30>1,COUNTRY_INFO!J30<4), IF(T30/COUNTRY_INFO!E30*100<>0, IF(T30/COUNTRY_INFO!E30*100>100,100,T30/COUNTRY_INFO!E30*100), \"-\"),0)","v":"-"},{"$f":"IF(AND(COUNTRY_INFO!J30>1,COUNTRY_INFO!J30<4),IF(COUNTRY_INFO!F30>MAX('MDA1'!K30,'MDA4'!O30,'T1'!M30,MAX(T3_R1!L30,T3_R2!L30)),MAX('MDA1'!K30,'MDA4'!O30,'T1'!M30,MAX(T3_R1!L30,T3_R2!L30)),COUNTRY_INFO!F30),0)","v":2364},{"$f":"IF(AND(COUNTRY_INFO!J30>1,COUNTRY_INFO!J30<4), IF(V30/COUNTRY_INFO!F30*100<>0, IF(V30/COUNTRY_INFO!F30*100>100,100,V30/COUNTRY_INFO!F30*100), \"-\"),0)","v":74.833808167141498},2364,{"$f":"IF(AND(COUNTRY_INFO!J30>1,COUNTRY_INFO!J30<4), IF(S30/P30*100<>0, IF(X30/P30*100>100,100,X30/P30*100), \"-\"),0)","v":50.566844919786092},{"$f":"COUNTRY_INFO!P30","v":1042.47},1142,1130,{"$f":"MAX('T1'!L30,'T2'!J30)+MAX('T1'!M30,'T2'!K30)+MAX('T1'!N30,'T2'!L30)","v":2272},{"$f":"IF(COUNTRY_INFO!K30=1,IF(COUNTRY_INFO!F30*0.33>MAX('T1'!M30,'T2'!K30),MAX('T1'!M30,'T2'!K30),COUNTRY_INFO!F30*0.33),IF(COUNTRY_INFO!K30=2,IF(COUNTRY_INFO!F30*0.5>MAX('T1'!M30,'T2'!K30),MAX('T1'!M30,'T2'!K30),COUNTRY_INFO!F30*0.5),IF(COUNTRY_INFO!K30=3,IF(COUNTRY_INFO!F30>MAX('T1'!M30,'T2'!K30),MAX('T1'!M30,'T2'!K30),COUNTRY_INFO!F30),0)))","v":1042.47},{"$f":"IF(AND(COUNTRY_INFO!K30>0,COUNTRY_INFO!K30<4),IF(Z30>0,IF(COUNTRY_INFO!K30=1, AD30/(COUNTRY_INFO!F30*0.33)*100, IF(COUNTRY_INFO!K30=2, AD30/(COUNTRY_INFO!F30*0.5)*100, IF(COUNTRY_INFO!K30=3, AD30/COUNTRY_INFO!F30*100))),\"-\"),0)","v":100},{"$f":"IF(COUNTRY_INFO!K30=2,IF(COUNTRY_INFO!G30*0.2>MAX('T1'!N30,'T2'!L30),MAX('T1'!N30,'T2'!L30),COUNTRY_INFO!G30*0.2),IF(COUNTRY_INFO!K30=3,IF(COUNTRY_INFO!G30>MAX('T1'!N30,'T2'!L30),MAX('T1'!N30,'T2'!L30),COUNTRY_INFO!G30),0))","v":0},{"$f":"IF(AND(COUNTRY_INFO!K30>0,COUNTRY_INFO!K30<4),IF(Z30>0,IF(COUNTRY_INFO!K30=1, 0, IF(COUNTRY_INFO!K30=2, AF30/(COUNTRY_INFO!G30*0.2)*100, IF(COUNTRY_INFO!K30=3, AF30/COUNTRY_INFO!G30*100))),\"-\"),0)","v":0},1042.47,{"$f":"IF(AND(COUNTRY_INFO!K30>0,COUNTRY_INFO!K30<4), IF(AC30/Z30*100<>0, IF(AH30/Z30*100>100,100,AH30/Z30*100), \"-\"),0)","v":100},null,{"$f":"IF(AND(D30<>0, D30<>\"Inconnu\",D30<>\"Interrompu\",D30<>\"Non requis\"),D30/COUNTRY_INFO!D30, 0)","v":1},{"$f":"IF(AND(J30<>0,J30<>\"Inconnu\",J30<>\"Interrompu\",J30<>\"Non requis\"),J30/COUNTRY_INFO!D30, 0)","v":1},{"$f":"IF(AND(P30<>0,P30<>\"Inconnu\",P30<>\"Non requis\"),P30/(COUNTRY_INFO!E30+COUNTRY_INFO!F30), 0)","v":1},{"$f":"IF(AND(Z30<>0,Z30<>\"Inconnu\",Z30<>\"Non requis\"),IF(COUNTRY_INFO!K30=1,1,IF(COUNTRY_INFO!K30=2,0.5*COUNTRY_INFO!F30/(0.5*COUNTRY_INFO!F30+0.2*COUNTRY_INFO!G30),IF(COUNTRY_INFO!K30=3,COUNTRY_INFO!F30/(COUNTRY_INFO!F30+COUNTRY_INFO!G30)))),0)","v":1},{"$f":"IF(AND(Z30<>0,Z30<>\"Inconnu\",Z30<>\"Non requis\"),IF(COUNTRY_INFO!K30=1,0,IF(COUNTRY_INFO!K30=2,0.2*COUNTRY_INFO!G30/(0.5*COUNTRY_INFO!F30+0.2*COUNTRY_INFO!G30),IF(COUNTRY_INFO!K30=3,COUNTRY_INFO!G30/(COUNTRY_INFO!F30+COUNTRY_INFO!G30)))),0)","v":0},{"$f":"MAX(COUNTRY_INFO!D30*AK30*PROFILE!$G$7,COUNTRY_INFO!D30*AL30*PROFILE!$G$7)","v":505.43841724251394},{"$f":"MAX(COUNTRY_INFO!D30*AK30*PROFILE!$G$8,COUNTRY_INFO!D30*AL30*PROFILE!$G$8,COUNTRY_INFO!D30*AM30*PROFILE!$G$8)","v":1516.4314388440471},{"$f":"MAX(COUNTRY_INFO!D30*AK30*PROFILE!$G$9,COUNTRY_INFO!D30*AL30*PROFILE!$G$9,COUNTRY_INFO!D30*AM30*PROFILE!$G$9,IF(AND(DISTRICT!Z30<>\"Inconnu\",Z30<>\"Non requis\"),COUNTRY_INFO!P30*DISTRICT!AN30,0))","v":3159.2866906683698},{"$f":"MAX(COUNTRY_INFO!D30*AK30*PROFILE!$G$10,COUNTRY_INFO!D30*AL30*PROFILE!$G$10,IF(AND(DISTRICT!Z30<>\"Inconnu\",Z30<>\"Non requis\"),COUNTRY_INFO!P30*DISTRICT!AO30,0))","v":7455.8434532450683},12637,0,{"$f":"MAX('MDA4'!R30,'T1'!L30,'T2'!J30,T3_R1!K30,T3_R2!K30)","v":0},{"$f":"MAX('MDA1'!K30,'MDA4'!S30,'MDA3'!I30,'MDA3'!L30,'T1'!M30,'T2'!K30,T3_R1!L30,T3_R2!L30)","v":2364},{"$f":"MAX('MDA1'!L30,'MDA4'!T30,'MDA3'!J30,'MDA3'!M30,'T1'!N30,'T2'!L30,T3_R1!M30,T3_R2!M30)","v":0},2364,{"$f":"MAX('MDA4'!R30,T30)","v":0},{"$f":"MAX('MDA1'!K30,'MDA4'!S30,'MDA3'!I30,'MDA3'!L30,V30,AD30)","v":2364},{"$f":"MAX('MDA1'!L30,'MDA4'!T30,'MDA3'!J30,'MDA3'!M30,AF30)","v":0},2364,18.706971591358709]
[{"$f":"IF(COUNTRY_INFO!A31=0,\" \",COUNTRY_INFO!A31)","v":"Gabon"},{"$f":"IF(COUNTRY_INFO!B31=0,\" \",COUNTRY_INFO!B31)","v":"Centre-Sud"},{"$f":"IF(COUNTRY_INFO!C31=0,\" \",COUNTRY_INFO!C31)","v":"Louetsi-Bibaka"},{"$f":"COUNTRY_INFO!M31","v":3169},null,null,{"$f":"MAX('MDA1'!M31,'MDA4'!U31)","v":0},{"$f":"IF(AND(COUNTRY_INFO!H31>0,COUNTRY_INFO!H31<4),IF(D31>MAX('MDA1'!M31,'MDA4'!U31),MAX('MDA1'!M31,'MDA4'!U31),D31),0)","v":0},{"$f":"IF(AND(COUNTRY_INFO!H31>0,COUNTRY_INFO!H31<4), IF(G31/D31*100<>0, IF(G31/D31*100>100,100,G31/D31*100), \"-\"),0)","v":"-"},{"$f":"COUNTRY_INFO!N31","v":0},null,null,{"$f":"MAX('MDA1'!M31,MAX('MDA3'!I31,'MDA3'!L31)+MAX('MDA3'!J31,'MDA3'!M31))","v":0},{"$f":"IF(AND(COUNTRY_INFO!I31>0,COUNTRY_INFO!I31<4),IF(J31>MAX('MDA1'!M31,MAX('MDA3'!I31,'MDA3'!L31)+MAX('MDA3'!J31,'MDA3'!M31)),MAX('MDA1'!M31,MAX('MDA3'!I31,'MDA3'!L31)+MAX('MDA3'!J31,'MDA3'!M31)),J31),0)","v":0},{"$f":"IF(AND(COUNTRY_INFO!I31>0,COUNTRY_INFO!I31<4), IF(M31/J31*100<>0, IF(M31/J31*100>100,100,M31/J31*100), \"-\"),0)","v":0},{"$f":"COUNTRY_INFO!O31","v":1172},277,261,{"$f":"SUM(MAX('MDA4'!N31, 'T1'!L31, MAX(T3_R1!K31, T3_R2!K31)), MAX('MDA1'!K31, 'MDA4'!O31, 'T1'!M31, MAX(T3_R1!L31, T3_R2!L31)), MAX('MDA1'!L31, 'MDA4'!P31, 'T1'!N31, MAX(T3_R1!M31, T3_R2!M31)))","v":538},{"$f":"IF(AND(COUNTRY_INFO!J31>1,COUNTRY_INFO!J31<4),IF(COUNTRY_INFO!E31>MAX('MDA4'!N31,'T1'!L31,MAX(T3_R1!K31,T3_R2!K31)),MAX('MDA4'!N31,'T1'!L31,MAX(T3_R1!K31,T3_R2!K31)),COUNTRY_INFO!E31),0)","v":0},{"$f":"IF(AND(COUNTRY_INFO!J31>1,COUNTRY_INFO!J31<4), IF(T31/COUNTRY_INFO!E31*100<>0, IF(T31/COUNTRY_INFO!E31*100>100,100,T31/COUNTRY_INFO!E31*100), \"-\"),0)","v":"-"},{"$f":"IF(AND(COUNTRY_INFO!J31>1,COUNTRY_INFO!J31<4),IF(COUNTRY_INFO!F31>MAX('MDA1'!K31,'MDA4'!O31,'T1'!M31,MAX(T3_R1!L31,T3_R2!L31)),MAX('MDA1'!K31,'MDA4'!O31,'T1'!M31,MAX(T3_R1!L31,T3_R2!L31)),COUNTRY_INFO!F31),0)","v":538},{"$f":"IF(AND(COUNTRY_INFO!J31>1,COUNTRY_INFO!J31<4), IF(V31/COUNTRY_INFO!F31*100<>0, IF(V31/COUNTRY_INFO!F31*100>100,100,V31/COUNTRY_INFO!F31*100), \"-\"),0)","v":67.929292929292927},538,{"$f":"IF(AND(COUNTRY_INFO!J31>1,COUNTRY_INFO!J31<4), IF(S31/P31*100<>0, IF(X31/P31*100>100,100,X31/P31*100), \"-\"),0)","v":45.904436860068259},{"$f":"COUNTRY_INFO!P31","v":0},null,null,{"$f":"MAX('T1'!L31,'T2'!J31)+MAX('T1'!M31,'T2'!K31)+MAX('T1'!N31,'T2'!L31)","v":0},{"$f":"IF(COUNTRY_INFO!K31=1,IF(COUNTRY_INFO!F31*0.33>MAX('T1'!M31,'T2'!K31),MAX('T1'!M31,'T2'!K31),COUNTRY_INFO!F31*0.33),IF(COUNTRY_INFO!K31=2,IF(COUNTRY_INFO!F31*0.5>MAX('T1'!M31,'T2'!K31),MAX('T1'!M31,'T2'!K31),COUNTRY_INFO!F31*0.5),IF(COUNTRY_INFO!K31=3,IF(COUNTRY_INFO!F31>MAX('T1'!M31,'T2'!K31),MAX('T1'!M31,'T2'!K31),COUNTRY_INFO!F31),0)))","v":0},{"$f":"IF(AND(COUNTRY_INFO!K31>0,COUNTRY_INFO!K31<4),IF(Z31>0,IF(COUNTRY_INFO!K31=1, AD31/(COUNTRY_INFO!F31*0.33)*100, IF(COUNTRY_INFO!K31=2, AD31/(COUNTRY_INFO!F31*0.5)*100, IF(COUNTRY_INFO!K31=3, AD31/COUNTRY_INFO!F31*100))),\"-\"),0)","v":0},{"$f":"IF(COUNTRY_INFO!K31=2,IF(COUNTRY_INFO!G31*0.2>MAX('T1'!N31,'T2'!L31),MAX('T1'!N31,'T2'!L31),COUNTRY_INFO!G31*0.2),IF(COUNTRY_INFO!K31=3,IF(COUNTRY_INFO!G31>MAX('T1'!N31,'T2'!L31),MAX('T1'!N31,'T2'!L31),COUNTRY_INFO!G31),0))","v":0},{"$f":"IF(AND(COUNTRY_INFO!K31>0,COUNTRY_INFO!K31<4),IF(Z31>0,IF(COUNTRY_INFO!K31=1, 0, IF(COUNTRY_INFO!K31=2, AF31/(COUNTRY_INFO!G31*0.2)*100, IF(COUNTRY_INFO!K31=3, AF31/COUNTRY_INFO!G31*100))),\"-\"),0)","v":0},0,{"$f":"IF(AND(COUNTRY_INFO!K31>0,COUNTRY_INFO!K31<4), IF(AC31/Z31*100<>0, IF(AH31/Z31*100>100,100,AH31/Z31*100), \"-\"),0)","v":0},null,{"$f":"IF(AND(D31<>0, D31<>\"Inconnu\",D31<>\"Interrompu\",D31<>\"Non requis\"),D31/COUNTRY_INFO!D31, 0)","v":1},{"$f":"IF(AND(J31<>0,J31<>\"Inconnu\",J31<>\"Interrompu\",J31<>\"Non requis\"),J31/COUNTRY_INFO!D31, 0)","v":0},{"$f":"IF(AND(P31<>0,P31<>\"Inconnu\",P31<>\"Non requis\"),P31/(COUNTRY_INFO!E31+COUNTRY_INFO!F31), 0)","v":1},{"$f":"IF(AND(Z31<>0,Z31<>\"Inconnu\",Z31<>\"Non requis\"),IF(COUNTRY_INFO!K31=1,1,IF(COUNTRY_INFO!K31=2,0.5*COUNTRY_INFO!F31/(0.5*COUNTRY_INFO!F31+0.2*COUNTRY_INFO!G31),IF(COUNTRY_INFO!K31=3,COUNTRY_INFO!F31/(COUNTRY_INFO!F31+COUNTRY_INFO!G31)))),0)","v":0},{"$f":"IF(AND(Z31<>0,Z31<>\"Inconnu\",Z31<>\"Non requis\"),IF(COUNTRY_INFO!K31=1,0,IF(COUNTRY_INFO!K31=2,0.2*COUNTRY_INFO!G31/(0.5*COUNTRY_INFO!F31+0.2*COUNTRY_INFO!G31),IF(COUNTRY_INFO!K31=3,COUNTRY_INFO!G31/(COUNTRY_INFO!F31+COUNTRY_INFO!G31)))),0)","v":0},{"$f":"MAX(COUNTRY_INFO!D31*AK31*PROFILE!$G$7,COUNTRY_INFO!D31*AL31*PROFILE!$G$7)","v":126.74957222770648},{"$f":"MAX(COUNTRY_INFO!D31*AK31*PROFILE!$G$8,COUNTRY_INFO!D31*AL31*PROFILE!$G$8,COUNTRY_INFO!D31*AM31*PROFILE!$G$8)","v":380.27785310570431},{"$f":"MAX(COUNTRY_INFO!D31*AK31*PROFILE!$G$9,COUNTRY_INFO!D31*AL31*PROFILE!$G$9,COUNTRY_INFO!D31*AM31*PROFILE!$G$9,IF(AND(DISTRICT!Z31<>\"Inconnu\",Z31<>\"Non requis\"),COUNTRY_INFO!P31*DISTRICT!AN31,0))","v":792.25920097555309},{"$f":"MAX(COUNTRY_INFO!D31*AK31*PROFILE!$G$10,COUNTRY_INFO!D31*AL31*PROFILE!$G$10,IF(AND(DISTRICT!Z31<>\"Inconnu\",Z31<>\"Non requis\"),COUNTRY_INFO!P31*DISTRICT!AO31,0))","v":1869.7133736910359},3169,0,{"$f":"MAX('MDA4'!R31,'T1'!L31,'T2'!J31,T3_R1!K31,T3_R2!K31)","v":0},{"$f":"MAX('MDA1'!K31,'MDA4'!S31,'MDA3'!I31,'MDA3'!L31,'T1'!M31,'T2'!K31,T3_R1!L31,T3_R2!L31)","v":538},{"$f":"MAX('MDA1'!L31,'MDA4'!T31,'MDA3'!J31,'MDA3'!M31,'T1'!N31,'T2'!L31,T3_R1!M31,T3_R2!M31)","v":0},538,{"$f":"MAX('MDA4'!R31,T31)","v":0},{"$f":"MAX('MDA1'!K31,'MDA4'!S31,'MDA3'!I31,'MDA3'!L31,V31,AD31)","v":538},{"$f":"MAX('MDA1'!L31,'MDA4'!T31,'MDA3'!J31,'MDA3'!M31,AF31)","v":0},538,16.976964342063741]
[{"$f":"IF(COUNTRY_INFO!A32=0,\" \",COUNTRY_INFO!A32)","v":"Gabon"},{"$f":"IF(COUNTRY_INFO!B32=0,\" \",COUNTRY_INFO!B32)","v":"Centre-Sud"},{"$f":"IF(COUNTRY_INFO!C32=0,\" \",COUNTRY_INFO!C32)","v":"Ndolou"},{"$f":"COUNTRY_INFO!M32","v":6115},null,null,{"$f":"MAX('MDA1'!M32,'MDA4'!U32)","v":0},{"$f":"IF(AND(COUNTRY_INFO!H32>0,COUNTRY_INFO!H32<4),IF(D32>MAX('MDA1'!M32,'MDA4'!U32),MAX('MDA1'!M32,'MDA4'!U32),D32),0)","v":0},{"$f":"IF(AND(COUNTRY_INFO!H32>0,COUNTRY_INFO!H32<4), IF(G32/D32*100<>0, IF(G32/D32*100>100,100,G32/D32*100), \"-\"),0)","v":"-"},{"$f":"COUNTRY_INFO!N32","v":0},null,null,{"$f":"MAX('MDA1'!M32,MAX('MDA3'!I32,'MDA3'!L32)+MAX('MDA3'!J32,'MDA3'!M32))","v":0},{"$f":"IF(AND(COUNTRY_INFO!I32>0,COUNTRY_INFO!I32<4),IF(J32>MAX('MDA1'!M32,MAX('MDA3'!I32,'MDA3'!L32)+MAX('MDA3'!J32,'MDA3'!M32)),MAX('MDA1'!M32,MAX('MDA3'!I32,'MDA3'!L32)+MAX('MDA3'!J32,'MDA3'!M32)),J32),0)","v":0},{"$f":"IF(AND(COUNTRY_INFO!I32>0,COUNTRY_INFO!I32<4), IF(M32/J32*100<>0, IF(M32/J32*100>100,100,M32/J32*100), \"-\"),0)","v":0},{"$f":"COUNTRY_INFO!O32","v":2263},494,534,{"$f":"SUM(MAX('MDA4'!N32, 'T1'!L32, MAX(T3_R1!K32, T3_R2!K32)), MAX('MDA1'!K32, 'MDA4'!O32, 'T1'!M32, MAX(T3_R1!L32, T3_R2!L32)), MAX('MDA1'!L32, 'MDA4'!P32, 'T1'!N32, MAX(T3_R1!M32, T3_R2!M32)))","v":1028},{"$f":"IF(AND(COUNTRY_INFO!J32>1,COUNTRY_INFO!J32<4),IF(COUNTRY_INFO!E32>MAX('MDA4'!N32,'T1'!L32,MAX(T3_R1!K32,T3_R2!K32)),MAX('MDA4'!N32,'T1'!L32,MAX(T3_R1!K32,T3_R2!K32)),COUNTRY_INFO!E32),0)","v":0},{"$f":"IF(AND(COUNTRY_INFO!J32>1,COUNTRY_INFO!J32<4), IF(T32/COUNTRY_INFO!E32*100<>0, IF(T32/COUNTRY_INFO!E32*100>100,100,T32/COUNTRY_INFO!E32*100), \"-\"),0)","v":"-"},{"$f":"IF(AND(COUNTRY_INFO!J32>1,COUNTRY_INFO!J32<4),IF(COUNTRY_INFO!F32>MAX('MDA1'!K32,'MDA4'!O32,'T1'!M32,MAX(T3_R1!L32,T3_R2!L32)),MAX('MDA1'!K32,'MDA4'!O32,'T1'!M32,MAX(T3_R1!L32,T3_R2!L32)),COUNTRY_INFO!F32),0)","v":1028},{"$f":"IF(AND(COUNTRY_INFO!J32>1,COUNTRY_INFO!J32<4), IF(V32/COUNTRY_INFO!F32*100<>0, IF(V32/COUNTRY_INFO!F32*100>100,100,V32/COUNTRY_INFO!F32*100), \"-\"),0)","v":67.233485938521909},1028,{"$f":"IF(AND(COUNTRY_INFO!J32>1,COUNTRY_INFO!J32<4), IF(S32/P32*100<>0, IF(X32/P32*100>100,100,X32/P32*100), \"-\"),0)","v":45.426425099425543},{"$f":"COUNTRY_INFO!P32","v":504.57000000000005},494,534,{"$f":"MAX('T1'!L32,'T2'!J32)+MAX('T1'!M32,'T2'!K32)+MAX('T1'!N32,'T2'!L32)","v":1028},{"$f":"IF(COUNTRY_INFO!K32=1,IF(COUNTRY_INFO!F32*0.33>MAX('T1'!M32,'T2'!K32),MAX('T1'!M32,'T2'!K32),COUNTRY_INFO!F32*0.33),IF(COUNTRY_INFO!K32=2,IF(COUNTRY_INFO!F32*0.5>MAX('T1'!M32,'T2'!K32),MAX('T1'!M32,'T2'!K32),COUNTRY_INFO!F32*0.5),IF(COUNTRY_INFO!K32=3,IF(COUNTRY_INFO!F32>MAX('T1'!M32,'T2'!K32),MAX('T1'!M32,'T2'!K32),COUNTRY_INFO!F32),0)))","v":504.57000000000005},{"$f":"IF(AND(COUNTRY_INFO!K32>0,COUNTRY_INFO!K32<4),IF(Z32>0,IF(COUNTRY_INFO!K32=1, AD32/(COUNTRY_INFO!F32*0.33)*100, IF(COUNTRY_INFO!K32=2, AD32/(COUNTRY_INFO!F32*0.5)*100, IF(COUNTRY_INFO!K32=3, AD32/COUNTRY_INFO!F32*100))),\"-\"),0)","v":100},{"$f":"IF(COUNTRY_INFO!K32=2,IF(COUNTRY_INFO!G32*0.2>MAX('T1'!N32,'T2'!L32),MAX('T1'!N32,'T2'!L32),COUNTRY_INFO!G32*0.2),IF(COUNTRY_INFO!K32=3,IF(COUNTRY_INFO!G32>MAX('T1'!N32,'T2'!L32),MAX('T1'!N32,'T2'!L32),COUNTRY_INFO!G32),0))","v":0},{"$f":"IF(AND(COUNTRY_INFO!K32>0,COUNTRY_INFO!K32<4),IF(Z32>0,IF(COUNTRY_INFO!K32=1, 0, IF(COUNTRY_INFO!K32=2, AF32/(COUNTRY_INFO!G32*0.2)*100, IF(COUNTRY_INFO!K32=3, AF32/COUNTRY_INFO!G32*100))),\"-\"),0)","v":0},504.57000000000005,{"$f":"IF(AND(COUNTRY_INFO!K32>0,COUNTRY_INFO!K32<4), IF(AC32/Z32*100<>0, IF(AH32/Z32*100>100,100,AH32/Z32*100), \"-\"),0)","v":100},null,{"$f":"IF(AND(D32<>0, D32<>\"Inconnu\",D32<>\"Interrompu\",D32<>\"Non requis\"),D32/COUNTRY_INFO!D32, 0)","v":1},{"$f":"IF(AND(J32<>0,J32<>\"Inconnu\",J32<>\"Interrompu\",J32<>\"Non requis\"),J32/COUNTRY_INFO!D32, 0)","v":0},{"$f":"IF(AND(P32<>0,P32<>\"Inconnu\",P32<>\"Non requis\"),P32/(COUNTRY_INFO!E32+COUNTRY_INFO!F32), 0)","v":1},{"$f":"IF(AND(Z32<>0,Z32<>\"Inconnu\",Z32<>\"Non requis\"),IF(COUNTRY_INFO!K32=1,1,IF(COUNTRY_INFO!K32=2,0.5*COUNTRY_INFO!F32/(0.5*COUNTRY_INFO!F32+0.2*COUNTRY_INFO!G32),IF(COUNTRY_INFO!K32=3,COUNTRY_INFO!F32/(COUNTRY_INFO!F32+COUNTRY_INFO!G32)))),0)","v":1},{"$f":"IF(AND(Z32<>0,Z32<>\"Inconnu\",Z32<>\"Non requis\"),IF(COUNTRY_INFO!K32=1,0,IF(COUNTRY_INFO!K32=2,0.2*COUNTRY_INFO!G32/(0.5*COUNTRY_INFO!F32+0.2*COUNTRY_INFO!G32),IF(COUNTRY_INFO!K32=3,COUNTRY_INFO!G32/(COUNTRY_INFO!F32+COUNTRY_INFO!G32)))),0)","v":0},{"$f":"MAX(COUNTRY_INFO!D32*AK32*PROFILE!$G$7,COUNTRY_INFO!D32*AL32*PROFILE!$G$7)","v":244.57987824942413},{"$f":"MAX(COUNTRY_INFO!D32*AK32*PROFILE!$G$8,COUNTRY_INFO!D32*AL32*PROFILE!$G$8,COUNTRY_INFO!D32*AM32*PROFILE!$G$8)","v":733.7958572866462},{"$f":"MAX(COUNTRY_INFO!D32*AK32*PROFILE!$G$9,COUNTRY_INFO!D32*AL32*PROFILE!$G$9,COUNTRY_INFO!D32*AM32*PROFILE!$G$9,IF(AND(DISTRICT!Z32<>\"Inconnu\",Z32<>\"Non requis\"),COUNTRY_INFO!P32*DISTRICT!AN32,0))","v":1528.767754485802},{"$f":"MAX(COUNTRY_INFO!D32*AK32*PROFILE!$G$10,COUNTRY_INFO!D32*AL32*PROFILE!$G$10,IF(AND(DISTRICT!Z32<>\"Inconnu\",Z32<>\"Non requis\"),COUNTRY_INFO!P32*DISTRICT!AO32,0))","v":3607.8565099781272},6115,0,{"$f":"MAX('MDA4'!R32,'T1'!L32,'T2'!J32,T3_R1!K32,T3_R2!K32)","v":0},{"$f":"MAX('MDA1'!K32,'MDA4'!S32,'MDA3'!I32,'MDA3'!L32,'T1'!M32,'T2'!K32,T3_R1!L32,T3_R2!L32)","v":1028},{"$f":"MAX('MDA1'!L32,'MDA4'!T32,'MDA3'!J32,'MDA3'!M32,'T1'!N32,'T2'!L32,T3_R1!M32,T3_R2!M32)","v":0},1028,{"$f":"MAX('MDA4'!R32,T32)","v":0},{"$f":"MAX('MDA1'!K32,'MDA4'!S32,'MDA3'!I32,'MDA3'!L32,V32,AD32)","v":1028},{"$f":"MAX('MDA1'!L32,'MDA4'!T32,'MDA3'!J32,'MDA3'!M32,AF32)","v":0},1028,16.811120196238758]
[{"$f":"IF(COUNTRY_INFO!A33=0,\" \",COUNTRY_INFO!A33)","v":"Gabon"},{"$f":"IF(COUNTRY_INFO!B33=0,\" \",COUNTRY_INFO!B33)","v":"Centre-Sud"},{"$f":"IF(COUNTRY_INFO!C33=0,\" \",COUNTRY_INFO!C33)","v":"Boumi-Louetsi"},{"$f":"COUNTRY_INFO!M33","v":21994},null,null,{"$f":"MAX('MDA1'!M33,'MDA4'!U33)","v":0},{"$f":"IF(AND(COUNTRY_INFO!H33>0,COUNTRY_INFO!H33<4),IF(D33>MAX('MDA1'!M33,'MDA4'!U33),MAX('MDA1'!M33,'MDA4'!U33),D33),0)","v":0},{"$f":"IF(AND(COUNTRY_INFO!H33>0,COUNTRY_INFO!H33<4), IF(G33/D33*100<>0, IF(G33/D33*100>100,100,G33/D33*100), \"-\"),0)","v":"-"},{"$f":"COUNTRY_INFO!N33","v":21994},null,null,{"$f":"MAX('MDA1'!M33,MAX('MDA3'!I33,'MDA3'!L33)+MAX('MDA3'!J33,'MDA3'!M33))","v":0},{"$f":"IF(AND(COUNTRY_INFO!I33>0,COUNTRY_INFO!I33<4),IF(J33>MAX('MDA1'!M33,MAX('MDA3'!I33,'MDA3'!L33)+MAX('MDA3'!J33,'MDA3'!M33)),MAX('MDA1'!M33,MAX('MDA3'!I33,'MDA3'!L33)+MAX('MDA3'!J33,'MDA3'!M33)),J33),0)","v":0},{"$f":"IF(AND(COUNTRY_INFO!I33>0,COUNTRY_INFO!I33<4), IF(M33/J33*100<>0, IF(M33/J33*100>100,100,M33/J33*100), \"-\"),0)","v":"-"},{"$f":"COUNTRY_INFO!O33","v":8138},895,943,{"$f":"SUM(MAX('MDA4'!N33, 'T1'!L33, MAX(T3_R1!K33, T3_R2!K33)), MAX('MDA1'!K33, 'MDA4'!O33, 'T1'!M33, MAX(T3_R1!L33, T3_R2!L33)), MAX('MDA1'!L33, 'MDA4'!P33, 'T1'!N33, MAX(T3_R1!M33, T3_R2!M33)))","v":1838},{"$f":"IF(AND(COUNTRY_INFO!J33>1,COUNTRY_INFO!J33<4),IF(COUNTRY_INFO!E33>MAX('MDA4'!N33,'T1'!L33,MAX(T3_R1!K33,T3_R2!K33)),MAX('MDA4'!N33,'T1'!L33,MAX(T3_R1!K33,T3_R2!K33)),COUNTRY_INFO!E33),0)","v":0},{"$f":"IF(AND(COUNTRY_INFO!J33>1,COUNTRY_INFO!J33<4), IF(T33/COUNTRY_INFO!E33*100<>0, IF(T33/COUNTRY_INFO!E33*100>100,100,T33/COUNTRY_INFO!E33*100), \"-\"),0)","v":"-"},{"$f":"IF(AND(COUNTRY_INFO!J33>1,COUNTRY_INFO!J33<4),IF(COUNTRY_INFO!F33>MAX('MDA1'!K33,'MDA4'!O33,'T1'!M33,MAX(T3_R1!L33,T3_R2!L33)),MAX('MDA1'!K33,'MDA4'!O33,'T1'!M33,MAX(T3_R1!L33,T3_R2!L33)),COUNTRY_INFO!F33),0)","v":1838},{"$f":"IF(AND(COUNTRY_INFO!J33>1,COUNTRY_INFO!J33<4), IF(V33/COUNTRY_INFO!F33*100<>0, IF(V33/COUNTRY_INFO!F33*100>100,100,V33/COUNTRY_INFO!F33*100), \"-\"),0)","v":33.424258956173851},1838,{"$f":"IF(AND(COUNTRY_INFO!J33>1,COUNTRY_INFO!J33<4), IF(S33/P33*100<>0, IF(X33/P33*100>100,100,X33/P33*100), \"-\"),0)","v":22.585401818628657},{"$f":"COUNTRY_INFO!P33","v":1814.67},895,943,{"$f":"MAX('T1'!L33,'T2'!J33)+MAX('T1'!M33,'T2'!K33)+MAX('T1'!N33,'T2'!L33)","v":1838},{"$f":"IF(COUNTRY_INFO!K33=1,IF(COUNTRY_INFO!F33*0.33>MAX('T1'!M33,'T2'!K33),MAX('T1'!M33,'T2'!K33),COUNTRY_INFO!F33*0.33),IF(COUNTRY_INFO!K33=2,IF(COUNTRY_INFO!F33*0.5>MAX('T1'!M33,'T2'!K33),MAX('T1'!M33,'T2'!K33),COUNTRY_INFO!F33*0.5),IF(COUNTRY_INFO!K33=3,IF(COUNTRY_INFO!F33>MAX('T1'!M33,'T2'!K33),MAX('T1'!M33,'T2'!K33),COUNTRY_INFO!F33),0)))","v":1814.67},{"$f":"IF(AND(COUNTRY_INFO!K33>0,COUNTRY_INFO!K33<4),IF(Z33>0,IF(COUNTRY_INFO!K33=1, AD33/(COUNTRY_INFO!F33*0.33)*100, IF(COUNTRY_INFO!K33=2, AD33/(COUNTRY_INFO!F33*0.5)*100, IF(COUNTRY_INFO!K33=3, AD33/COUNTRY_INFO!F33*100))),\"-\"),0)","v":100},{"$f":"IF(COUNTRY_INFO!K33=2,IF(COUNTRY_INFO!G33*0.2>MAX('T1'!N33,'T2'!L33),MAX('T1'!N33,'T2'!L33),COUNTRY_INFO!G33*0.2),IF(COUNTRY_INFO!K33=3,IF(COUNTRY_INFO!G33>MAX('T1'!N33,'T2'!L33),MAX('T1'!N33,'T2'!L33),COUNTRY_INFO!G33),0))","v":0},{"$f":"IF(AND(COUNTRY_INFO!K33>0,COUNTRY_INFO!K33<4),IF(Z33>0,IF(COUNTRY_INFO!K33=1, 0, IF(COUNTRY_INFO!K33=2, AF33/(COUNTRY_INFO!G33*0.2)*100, IF(COUNTRY_INFO!K33=3, AF33/COUNTRY_INFO!G33*100))),\"-\"),0)","v":0},1814.67,{"$f":"IF(AND(COUNTRY_INFO!K33>0,COUNTRY_INFO!K33<4), IF(AC33/Z33*100<>0, IF(AH33/Z33*100>100,100,AH33/Z33*100), \"-\"),0)","v":100},null,{"$f":"IF(AND(D33<>0, D33<>\"Inconnu\",D33<>\"Interrompu\",D33<>\"Non requis\"),D33/COUNTRY_INFO!D33, 0)","v":1},{"$f":"IF(AND(J33<>0,J33<>\"Inconnu\",J33<>\"Interrompu\",J33<>\"Non requis\"),J33/COUNTRY_INFO!D33, 0)","v":1},{"$f":"IF(AND(P33<>0,P33<>\"Inconnu\",P33<>\"Non requis\"),P33/(COUNTRY_INFO!E33+COUNTRY_INFO!F33), 0)","v":1},{"$f":"IF(AND(Z33<>0,Z33<>\"Inconnu\",Z33<>\"Non requis\"),IF(COUNTRY_INFO!K33=1,1,IF(COUNTRY_INFO!K33=2,0.5*COUNTRY_INFO!F33/(0.5*COUNTRY_INFO!F33+0.2*COUNTRY_INFO!G33),IF(COUNTRY_INFO!K33=3,COUNTRY_INFO!F33/(COUNTRY_INFO!F33+COUNTRY_INFO!G33)))),0)","v":1},{"$f":"IF(AND(Z33<>0,Z33<>\"Inconnu\",Z33<>\"Non requis\"),IF(COUNTRY_INFO!K33=1,0,IF(COUNTRY_INFO!K33=2,0.2*COUNTRY_INFO!G33/(0.5*COUNTRY_INFO!F33+0.2*COUNTRY_INFO!G33),IF(COUNTRY_INFO!K33=3,COUNTRY_INFO!G33/(COUNTRY_INFO!F33+COUNTRY_INFO!G33)))),0)","v":0},{"$f":"MAX(COUNTRY_INFO!D33*AK33*PROFILE!$G$7,COUNTRY_INFO!D33*AL33*PROFILE!$G$7)","v":879.68762750904898},{"$f":"MAX(COUNTRY_INFO!D33*AK33*PROFILE!$G$8,COUNTRY_INFO!D33*AL33*PROFILE!$G$8,COUNTRY_INFO!D33*AM33*PROFILE!$G$8)","v":2639.2650997812748},{"$f":"MAX(COUNTRY_INFO!D33*AK33*PROFILE!$G$9,COUNTRY_INFO!D33*AL33*PROFILE!$G$9,COUNTRY_INFO!D33*AM33*PROFILE!$G$9,IF(AND(DISTRICT!Z33<>\"Inconnu\",Z33<>\"Non requis\"),COUNTRY_INFO!P33*DISTRICT!AN33,0))","v":5498.5638580802506},{"$f":"MAX(COUNTRY_INFO!D33*AK33*PROFILE!$G$10,COUNTRY_INFO!D33*AL33*PROFILE!$G$10,IF(AND(DISTRICT!Z33<>\"Inconnu\",Z33<>\"Non requis\"),COUNTRY_INFO!P33*DISTRICT!AO33,0))","v":12976.483414629425},21994,0,{"$f":"MAX('MDA4'!R33,'T1'!L33,'T2'!J33,T3_R1!K33,T3_R2!K33)","v":0},{"$f":"MAX('MDA1'!K33,'MDA4'!S33,'MDA3'!I33,'MDA3'!L33,'T1'!M33,'T2'!K33,T3_R1!L33,T3_R2!L33)","v":1838},{"$f":"MAX('MDA1'!L33,'MDA4'!T33,'MDA3'!J33,'MDA3'!M33,'T1'!N33,'T2'!L33,T3_R1!M33,T3_R2!M33)","v":0},1838,{"$f":"MAX('MDA4'!R33,T33)","v":0},{"$f":"MAX('MDA1'!K33,'MDA4'!S33,'MDA3'!I33,'MDA3'!L33,V33,AD33)","v":1838},{"$f":"MAX('MDA1'!L33,'MDA4'!T33,'MDA3'!J33,'MDA3'!M33,AF33)","v":0},1838,8.3568245885241428]
[{"$f":"IF(COUNTRY_INFO!A34=0,\" \",COUNTRY_INFO!A34)","v":"Gabon"},{"$f":"IF(COUNTRY_INFO!B34=0,\" \",COUNTRY_INFO!B34)","v":"Centre-Sud"},{"$f":"IF(COUNTRY_INFO!C34=0,\" \",COUNTRY_INFO!C34)","v":"Ogoulou"},{"$f":"COUNTRY_INFO!M34","v":10025},null,null,{"$f":"MAX('MDA1'!M34,'MDA4'!U34)","v":0},{"$f":"IF(AND(COUNTRY_INFO!H34>0,COUNTRY_INFO!H34<4),IF(D34>MAX('MDA1'!M34,'MDA4'!U34),MAX('MDA1'!M34,'MDA4'!U34),D34),0)","v":0},{"$f":"IF(AND(COUNTRY_INFO!H34>0,COUNTRY_INFO!H34<4), IF(G34/D34*100<>0, IF(G34/D34*100>100,100,G34/D34*100), \"-\"),0)","v":"-"},{"$f":"COUNTRY_INFO!N34","v":10025},null,null,{"$f":"MAX('MDA1'!M34,MAX('MDA3'!I34,'MDA3'!L34)+MAX('MDA3'!J34,'MDA3'!M34))","v":0},{"$f":"IF(AND(COUNTRY_INFO!I34>0,COUNTRY_INFO!I34<4),IF(J34>MAX('MDA1'!M34,MAX('MDA3'!I34,'MDA3'!L34)+MAX('MDA3'!J34,'MDA3'!M34)),MAX('MDA1'!M34,MAX('MDA3'!I34,'MDA3'!L34)+MAX('MDA3'!J34,'MDA3'!M34)),J34),0)","v":0},{"$f":"IF(AND(COUNTRY_INFO!I34>0,COUNTRY_INFO!I34<4), IF(M34/J34*100<>0, IF(M34/J34*100>100,100,M34/J34*100), \"-\"),0)","v":"-"},{"$f":"COUNTRY_INFO!O34","v":3709},881,878,{"$f":"SUM(MAX('MDA4'!N34, 'T1'!L34, MAX(T3_R1!K34, T3_R2!K34)), MAX('MDA1'!K34, 'MDA4'!O34, 'T1'!M34, MAX(T3_R1!L34, T3_R2!L34)), MAX('MDA1'!L34, 'MDA4'!P34, 'T1'!N34, MAX(T3_R1!M34, T3_R2!M34)))","v":1759},{"$f":"IF(AND(COUNTRY_INFO!J34>1,COUNTRY_INFO!J34<4),IF(COUNTRY_INFO!E34>MAX('MDA4'!N34,'T1'!L34,MAX(T3_R1!K34,T3_R2!K34)),MAX('MDA4'!N34,'T1'!L34,MAX(T3_R1!K34,T3_R2!K34)),COUNTRY_INFO!E34),0)","v":0},{"$f":"IF(AND(COUNTRY_INFO!J34>1,COUNTRY_INFO!J34<4), IF(T34/COUNTRY_INFO!E34*100<>0, IF(T34/COUNTRY_INFO!E34*100>100,100,T34/COUNTRY_INFO!E34*100), \"-\"),0)","v":"-"},{"$f":"IF(AND(COUNTRY_INFO!J34>1,COUNTRY_INFO!J34<4),IF(COUNTRY_INFO!F34>MAX('MDA1'!K34,'MDA4'!O34,'T1'!M34,MAX(T3_R1!L34,T3_R2!L34)),MAX('MDA1'!K34,'MDA4'!O34,'T1'!M34,MAX(T3_R1!L34,T3_R2!L34)),COUNTRY_INFO!F34),0)","v":1759},{"$f":"IF(AND(COUNTRY_INFO!J34>1,COUNTRY_INFO!J34<4), IF(V34/COUNTRY_INFO!F34*100<>0, IF(V34/COUNTRY_INFO!F34*100>100,100,V34/COUNTRY_INFO!F34*100), \"-\"),0)","v":70.191540303272149},1759,{"$f":"IF(AND(COUNTRY_INFO!J34>1,COUNTRY_INFO!J34<4), IF(S34/P34*100<>0, IF(X34/P34*100>100,100,X34/P34*100), \"-\"),0)","v":47.425181989754648},{"$f":"COUNTRY_INFO!P34","v":826.98},881,878,{"$f":"MAX('T1'!L34,'T2'!J34)+MAX('T1'!M34,'T2'!K34)+MAX('T1'!N34,'T2'!L34)","v":1759},{"$f":"IF(COUNTRY_INFO!K34=1,IF(COUNTRY_INFO!F34*0.33>MAX('T1'!M34,'T2'!K34),MAX('T1'!M34,'T2'!K34),COUNTRY_INFO!F34*0.33),IF(COUNTRY_INFO!K34=2,IF(COUNTRY_INFO!F34*0.5>MAX('T1'!M34,'T2'!K34),MAX('T1'!M34,'T2'!K34),COUNTRY_INFO!F34*0.5),IF(COUNTRY_INFO!K34=3,IF(COUNTRY_INFO!F34>MAX('T1'!M34,'T2'!K34),MAX('T1'!M34,'T2'!K34),COUNTRY_INFO!F34),0)))","v":826.98},{"$f":"IF(AND(COUNTRY_INFO!K34>0,COUNTRY_INFO!K34<4),IF(Z34>0,IF(COUNTRY_INFO!K34=1, AD34/(COUNTRY_INFO!F34*0.33)*100, IF(COUNTRY_INFO!K34=2, AD34/(COUNTRY_INFO!F34*0.5)*100, IF(COUNTRY_INFO!K34=3, AD34/COUNTRY_INFO!F34*100))),\"-\"),0)","v":100},{"$f":"IF(COUNTRY_INFO!K34=2,IF(COUNTRY_INFO!G34*0.2>MAX('T1'!N34,'T2'!L34),MAX('T1'!N34,'T2'!L34),COUNTRY_INFO!G34*0.2),IF(COUNTRY_INFO!K34=3,IF(COUNTRY_INFO!G34>MAX('T1'!N34,'T2'!L34),MAX('T1'!N34,'T2'!L34),COUNTRY_INFO!G34),0))","v":0},{"$f":"IF(AND(COUNTRY_INFO!K34>0,COUNTRY_INFO!K34<4),IF(Z34>0,IF(COUNTRY_INFO!K34=1, 0, IF(COUNTRY_INFO!K34=2, AF34/(COUNTRY_INFO!G34*0.2)*100, IF(COUNTRY_INFO!K34=3, AF34/COUNTRY_INFO!G34*100))),\"-\"),0)","v":0},826.98,{"$f":"IF(AND(COUNTRY_INFO!K34>0,COUNTRY_INFO!K34<4), IF(AC34/Z34*100<>0, IF(AH34/Z34*100>100,100,AH34/Z34*100), \"-\"),0)","v":100},null,{"$f":"IF(AND(D34<>0, D34<>\"Inconnu\",D34<>\"Interrompu\",D34<>\"Non requis\"),D34/COUNTRY_INFO!D34, 0)","v":1},{"$f":"IF(AND(J34<>0,J34<>\"Inconnu\",J34<>\"Interrompu\",J34<>\"Non requis\"),J34/COUNTRY_INFO!D34, 0)","v":1},{"$f":"IF(AND(P34<>0,P34<>\"Inconnu\",P34<>\"Non requis\"),P34/(COUNTRY_INFO!E34+COUNTRY_INFO!F34), 0)","v":1},{"$f":"IF(AND(Z34<>0,Z34<>\"Inconnu\",Z34<>\"Non requis\"),IF(COUNTRY_INFO!K34=1,1,IF(COUNTRY_INFO!K34=2,0.5*COUNTRY_INFO!F34/(0.5*COUNTRY_INFO!F34+0.2*COUNTRY_INFO!G34),IF(COUNTRY_INFO!K34=3,COUNTRY_INFO!F34/(COUNTRY_INFO!F34+COUNTRY_INFO!G34)))),0)","v":1},{"$f":"IF(AND(Z34<>0,Z34<>\"Inconnu\",Z34<>\"Non requis\"),IF(COUNTRY_INFO!K34=1,0,IF(COUNTRY_INFO!K34=2,0.2*COUNTRY_INFO!G34/(0.5*COUNTRY_INFO!F34+0.2*COUNTRY_INFO!G34),IF(COUNTRY_INFO!K34=3,COUNTRY_INFO!G34/(COUNTRY_INFO!F34+COUNTRY_INFO!G34)))),0)","v":0},{"$f":"MAX(COUNTRY_INFO!D34*AK34*PROFILE!$G$7,COUNTRY_INFO!D34*AL34*PROFILE!$G$7)","v":400.96701217505756},{"$f":"MAX(COUNTRY_INFO!D34*AK34*PROFILE!$G$8,COUNTRY_INFO!D34*AL34*PROFILE!$G$8,COUNTRY_INFO!D34*AM34*PROFILE!$G$8)","v":1202.9932083889826},{"$f":"MAX(COUNTRY_INFO!D34*AK34*PROFILE!$G$9,COUNTRY_INFO!D34*AL34*PROFILE!$G$9,COUNTRY_INFO!D34*AM34*PROFILE!$G$9,IF(AND(DISTRICT!Z34<>\"Inconnu\",Z34<>\"Non requis\"),COUNTRY_INFO!P34*DISTRICT!AN34,0))","v":2506.279106904361},{"$f":"MAX(COUNTRY_INFO!D34*AK34*PROFILE!$G$10,COUNTRY_INFO!D34*AL34*PROFILE!$G$10,IF(AND(DISTRICT!Z34<>\"Inconnu\",Z34<>\"Non requis\"),COUNTRY_INFO!P34*DISTRICT!AO34,0))","v":5914.7606725315991},10025,0,{"$f":"MAX('MDA4'!R34,'T1'!L34,'T2'!J34,T3_R1!K34,T3_R2!K34)","v":0},{"$f":"MAX('MDA1'!K34,'MDA4'!S34,'MDA3'!I34,'MDA3'!L34,'T1'!M34,'T2'!K34,T3_R1!L34,T3_R2!L34)","v":1759},{"$f":"MAX('MDA1'!L34,'MDA4'!T34,'MDA3'!J34,'MDA3'!M34,'T1'!N34,'T2'!L34,T3_R1!M34,T3_R2!M34)","v":0},1759,{"$f":"MAX('MDA4'!R34,T34)","v":0},{"$f":"MAX('MDA1'!K34,'MDA4'!S34,'MDA3'!I34,'MDA3'!L34,V34,AD34)","v":1759},{"$f":"MAX('MDA1'!L34,'MDA4'!T34,'MDA3'!J34,'MDA3'!M34,AF34)","v":0},1759,17.546134663341643]
[{"$f":"IF(COUNTRY_INFO!A35=0,\" \",COUNTRY_INFO!A35)","v":"Gabon"},{"$f":"IF(COUNTRY_INFO!B35=0,\" \",COUNTRY_INFO!B35)","v":"Centre-Sud"},{"$f":"IF(COUNTRY_INFO!C35=0,\" \",COUNTRY_INFO!C35)","v":"Douya-Onoye"},{"$f":"COUNTRY_INFO!M35","v":36126},null,null,{"$f":"MAX('MDA1'!M35,'MDA4'!U35)","v":0},{"$f":"IF(AND(COUNTRY_INFO!H35>0,COUNTRY_INFO!H35<4),IF(D35>MAX('MDA1'!M35,'MDA4'!U35),MAX('MDA1'!M35,'MDA4'!U35),D35),0)","v":0},{"$f":"IF(AND(COUNTRY_INFO!H35>0,COUNTRY_INFO!H35<4), IF(G35/D35*100<>0, IF(G35/D35*100>100,100,G35/D35*100), \"-\"),0)","v":"-"},{"$f":"COUNTRY_INFO!N35","v":36126},null,null,{"$f":"MAX('MDA1'!M35,MAX('MDA3'!I35,'MDA3'!L35)+MAX('MDA3'!J35,'MDA3'!M35))","v":0},{"$f":"IF(AND(COUNTRY_INFO!I35>0,COUNTRY_INFO!I35<4),IF(J35>MAX('MDA1'!M35,MAX('MDA3'!I35,'MDA3'!L35)+MAX('MDA3'!J35,'MDA3'!M35)),MAX('MDA1'!M35,MAX('MDA3'!I35,'MDA3'!L35)+MAX('MDA3'!J35,'MDA3'!M35)),J35),0)","v":0},{"$f":"IF(AND(COUNTRY_INFO!I35>0,COUNTRY_INFO!I35<4), IF(M35/J35*100<>0, IF(M35/J35*100>100,100,M35/J35*100), \"-\"),0)","v":"-"},{"$f":"COUNTRY_INFO!O35","v":13367},2343,2483,{"$f":"SUM(MAX('MDA4'!N35, 'T1'!L35, MAX(T3_R1!K35, T3_R2!K35)), MAX('MDA1'!K35, 'MDA4'!O35, 'T1'!M35, MAX(T3_R1!L35, T3_R2!L35)), MAX('MDA1'!L35, 'MDA4'!P35, 'T1'!N35, MAX(T3_R1!M35, T3_R2!M35)))","v":4826},{"$f":"IF(AND(COUNTRY_INFO!J35>1,COUNTRY_INFO!J35<4),IF(COUNTRY_INFO!E35>MAX('MDA4'!N35,'T1'!L35,MAX(T3_R1!K35,T3_R2!K35)),MAX('MDA4'!N35,'T1'!L35,MAX(T3_R1!K35,T3_R2!K35)),COUNTRY_INFO!E35),0)","v":0},{"$f":"IF(AND(COUNTRY_INFO!J35>1,COUNTRY_INFO!J35<4), IF(T35/COUNTRY_INFO!E35*100<>0, IF(T35/COUNTRY_INFO!E35*100>100,100,T35/COUNTRY_INFO!E35*100), \"-\"),0)","v":"-"},{"$f":"IF(AND(COUNTRY_INFO!J35>1,COUNTRY_INFO!J35<4),IF(COUNTRY_INFO!F35>MAX('MDA1'!K35,'MDA4'!O35,'T1'!M35,MAX(T3_R1!L35,T3_R2!L35)),MAX('MDA1'!K35,'MDA4'!O35,'T1'!M35,MAX(T3_R1!L35,T3_R2!L35)),COUNTRY_INFO!F35),0)","v":4826},{"$f":"IF(AND(COUNTRY_INFO!J35>1,COUNTRY_INFO!J35<4), IF(V35/COUNTRY_INFO!F35*100<>0, IF(V35/COUNTRY_INFO!F35*100>100,100,V35/COUNTRY_INFO!F35*100), \"-\"),0)","v":53.432240921169175},4826,{"$f":"IF(AND(COUNTRY_INFO!J35>1,COUNTRY_INFO!J35<4), IF(S35/P35*100<>0, IF(X35/P35*100>100,100,X35/P35*100), \"-\"),0)","v":36.103837809530937},{"$f":"COUNTRY_INFO!P35","v":8778.7999999999993},2343,2483,{"$f":"MAX('T1'!L35,'T2'!J35)+MAX('T1'!M35,'T2'!K35)+MAX('T1'!N35,'T2'!L35)","v":4826},{"$f":"IF(COUNTRY_INFO!K35=1,IF(COUNTRY_INFO!F35*0.33>MAX('T1'!M35,'T2'!K35),MAX('T1'!M35,'T2'!K35),COUNTRY_INFO!F35*0.33),IF(COUNTRY_INFO!K35=2,IF(COUNTRY_INFO!F35*0.5>MAX('T1'!M35,'T2'!K35),MAX('T1'!M35,'T2'!K35),COUNTRY_INFO!F35*0.5),IF(COUNTRY_INFO!K35=3,IF(COUNTRY_INFO!F35>MAX('T1'!M35,'T2'!K35),MAX('T1'!M35,'T2'!K35),COUNTRY_INFO!F35),0)))","v":4516},{"$f":"IF(AND(COUNTRY_INFO!K35>0,COUNTRY_INFO!K35<4),IF(Z35>0,IF(COUNTRY_INFO!K35=1, AD35/(COUNTRY_INFO!F35*0.33)*100, IF(COUNTRY_INFO!K35=2, AD35/(COUNTRY_INFO!F35*0.5)*100, IF(COUNTRY_INFO!K35=3, AD35/COUNTRY_INFO!F35*100))),\"-\"),0)","v":100},{"$f":"IF(COUNTRY_INFO!K35=2,IF(COUNTRY_INFO!G35*0.2>MAX('T1'!N35,'T2'!L35),MAX('T1'!N35,'T2'!L35),COUNTRY_INFO!G35*0.2),IF(COUNTRY_INFO!K35=3,IF(COUNTRY_INFO!G35>MAX('T1'!N35,'T2'!L35),MAX('T1'!N35,'T2'!L35),COUNTRY_INFO!G35),0))","v":0},{"$f":"IF(AND(COUNTRY_INFO!K35>0,COUNTRY_INFO!K35<4),IF(Z35>0,IF(COUNTRY_INFO!K35=1, 0, IF(COUNTRY_INFO!K35=2, AF35/(COUNTRY_INFO!G35*0.2)*100, IF(COUNTRY_INFO!K35=3, AF35/COUNTRY_INFO!G35*100))),\"-\"),0)","v":0},4516,{"$f":"IF(AND(COUNTRY_INFO!K35>0,COUNTRY_INFO!K35<4), IF(AC35/Z35*100<>0, IF(AH35/Z35*100>100,100,AH35/Z35*100), \"-\"),0)","v":51.44211053902584},null,{"$f":"IF(AND(D35<>0, D35<>\"Inconnu\",D35<>\"Interrompu\",D35<>\"Non requis\"),D35/COUNTRY_INFO!D35, 0)","v":1},{"$f":"IF(AND(J35<>0,J35<>\"Inconnu\",J35<>\"Interrompu\",J35<>\"Non requis\"),J35/COUNTRY_INFO!D35, 0)","v":1},{"$f":"IF(AND(P35<>0,P35<>\"Inconnu\",P35<>\"Non requis\"),P35/(COUNTRY_INFO!E35+COUNTRY_INFO!F35), 0)","v":1},{"$f":"IF(AND(Z35<>0,Z35<>\"Inconnu\",Z35<>\"Non requis\"),IF(COUNTRY_INFO!K35=1,1,IF(COUNTRY_INFO!K35=2,0.5*COUNTRY_INFO!F35/(0.5*COUNTRY_INFO!F35+0.2*COUNTRY_INFO!G35),IF(COUNTRY_INFO!K35=3,COUNTRY_INFO!F35/(COUNTRY_INFO!F35+COUNTRY_INFO!G35)))),0)","v":0.51442110539025843},{"$f":"IF(AND(Z35<>0,Z35<>\"Inconnu\",Z35<>\"Non requis\"),IF(COUNTRY_INFO!K35=1,0,IF(COUNTRY_INFO!K35=2,0.2*COUNTRY_INFO!G35/(0.5*COUNTRY_INFO!F35+0.2*COUNTRY_INFO!G35),IF(COUNTRY_INFO!K35=3,COUNTRY_INFO!G35/(COUNTRY_INFO!F35+COUNTRY_INFO!G35)))),0)","v":0.48557889460974168},{"$f":"MAX(COUNTRY_INFO!D35*AK35*PROFILE!$G$7,COUNTRY_INFO!D35*AL35*PROFILE!$G$7)","v":1444.9211253701874},{"$f":"MAX(COUNTRY_INFO!D35*AK35*PROFILE!$G$8,COUNTRY_INFO!D35*AL35*PROFILE!$G$8,COUNTRY_INFO!D35*AM35*PROFILE!$G$8)","v":4335.0955258115091},{"$f":"MAX(COUNTRY_INFO!D35*AK35*PROFILE!$G$9,COUNTRY_INFO!D35*AL35*PROFILE!$G$9,COUNTRY_INFO!D35*AM35*PROFILE!$G$9,IF(AND(DISTRICT!Z35<>\"Inconnu\",Z35<>\"Non requis\"),COUNTRY_INFO!P35*DISTRICT!AN35,0))","v":9031.6048893792449},{"$f":"MAX(COUNTRY_INFO!D35*AK35*PROFILE!$G$10,COUNTRY_INFO!D35*AL35*PROFILE!$G$10,IF(AND(DISTRICT!Z35<>\"Inconnu\",Z35<>\"Non requis\"),COUNTRY_INFO!P35*DISTRICT!AO35,0))","v":21314.378459439056},36126,0,{"$f":"MAX('MDA4'!R35,'T1'!L35,'T2'!J35,T3_R1!K35,T3_R2!K35)","v":0},{"$f":"MAX('MDA1'!K35,'MDA4'!S35,'MDA3'!I35,'MDA3'!L35,'T1'!M35,'T2'!K35,T3_R1!L35,T3_R2!L35)","v":4826},{"$f":"MAX('MDA1'!L35,'MDA4'!T35,'MDA3'!J35,'MDA3'!M35,'T1'!N35,'T2'!L35,T3_R1!M35,T3_R2!M35)","v":0},4826,{"$f":"MAX('MDA4'!R35,T35)","v":0},{"$f":"MAX('MDA1'!K35,'MDA4'!S35,'MDA3'!I35,'MDA3'!L35,V35,AD35)","v":4826},{"$f":"MAX('MDA1'!L35,'MDA4'!T35,'MDA3'!J35,'MDA3'!M35,AF35)","v":0},4826,13.358799756408127]
[{"$f":"IF(COUNTRY_INFO!A36=0,\" \",COUNTRY_INFO!A36)","v":"Gabon"},{"$f":"IF(COUNTRY_INFO!B36=0,\" \",COUNTRY_INFO!B36)","v":"Centre-Sud"},{"$f":"IF(COUNTRY_INFO!C36=0,\" \",COUNTRY_INFO!C36)","v":"Dola"},{"$f":"COUNTRY_INFO!M36","v":0},null,null,{"$f":"MAX('MDA1'!M36,'MDA4'!U36)","v":0},{"$f":"IF(AND(COUNTRY_INFO!H36>0,COUNTRY_INFO!H36<4),IF(D36>MAX('MDA1'!M36,'MDA4'!U36),MAX('MDA1'!M36,'MDA4'!U36),D36),0)","v":0},{"$f":"IF(AND(COUNTRY_INFO!H36>0,COUNTRY_INFO!H36<4), IF(G36/D36*100<>0, IF(G36/D36*100>100,100,G36/D36*100), \"-\"),0)","v":0},{"$f":"COUNTRY_INFO!N36","v":9094},null,null,{"$f":"MAX('MDA1'!M36,MAX('MDA3'!I36,'MDA3'!L36)+MAX('MDA3'!J36,'MDA3'!M36))","v":0},{"$f":"IF(AND(COUNTRY_INFO!I36>0,COUNTRY_INFO!I36<4),IF(J36>MAX('MDA1'!M36,MAX('MDA3'!I36,'MDA3'!L36)+MAX('MDA3'!J36,'MDA3'!M36)),MAX('MDA1'!M36,MAX('MDA3'!I36,'MDA3'!L36)+MAX('MDA3'!J36,'MDA3'!M36)),J36),0)","v":0},{"$f":"IF(AND(COUNTRY_INFO!I36>0,COUNTRY_INFO!I36<4), IF(M36/J36*100<>0, IF(M36/J36*100>100,100,M36/J36*100), \"-\"),0)","v":"-"},{"$f":"COUNTRY_INFO!O36","v":3365},738,738,{"$f":"SUM(MAX('MDA4'!N36, 'T1'!L36, MAX(T3_R1!K36, T3_R2!K36)), MAX('MDA1'!K36, 'MDA4'!O36, 'T1'!M36, MAX(T3_R1!L36, T3_R2!L36)), MAX('MDA1'!L36, 'MDA4'!P36, 'T1'!N36, MAX(T3_R1!M36, T3_R2!M36)))","v":1476},{"$f":"IF(AND(COUNTRY_INFO!J36>1,COUNTRY_INFO!J36<4),IF(COUNTRY_INFO!E36>MAX('MDA4'!N36,'T1'!L36,MAX(T3_R1!K36,T3_R2!K36)),MAX('MDA4'!N36,'T1'!L36,MAX(T3_R1!K36,T3_R2!K36)),COUNTRY_INFO!E36),0)","v":0},{"$f":"IF(AND(COUNTRY_INFO!J36>1,COUNTRY_INFO!J36<4), IF(T36/COUNTRY_INFO!E36*100<>0, IF(T36/COUNTRY_INFO!E36*100>100,100,T36/COUNTRY_INFO!E36*100), \"-\"),0)","v":"-"},{"$f":"IF(AND(COUNTRY_INFO!J36>1,COUNTRY_INFO!J36<4),IF(COUNTRY_INFO!F36>MAX('MDA1'!K36,'MDA4'!O36,'T1'!M36,MAX(T3_R1!L36,T3_R2!L36)),MAX('MDA1'!K36,'MDA4'!O36,'T1'!M36,MAX(T3_R1!L36,T3_R2!L36)),COUNTRY_INFO!F36),0)","v":1476},{"$f":"IF(AND(COUNTRY_INFO!J36>1,COUNTRY_INFO!J36<4), IF(V36/COUNTRY_INFO!F36*100<>0, IF(V36/COUNTRY_INFO!F36*100>100,100,V36/COUNTRY_INFO!F36*100), \"-\"),0)","v":64.907651715039577},1476,{"$f":"IF(AND(COUNTRY_INFO!J36>1,COUNTRY_INFO!J36<4), IF(S36/P36*100<>0, IF(X36/P36*100>100,100,X36/P36*100), \"-\"),0)","v":43.86329866270431},{"$f":"COUNTRY_INFO!P36","v":750.42000000000007},738,738,{"$f":"MAX('T1'!L36,'T2'!J36)+MAX('T1'!M36,'T2'!K36)+MAX('T1'!N36,'T2'!L36)","v":1476},{"$f":"IF(COUNTRY_INFO!K36=1,IF(COUNTRY_INFO!F36*0.33>MAX('T1'!M36,'T2'!K36),MAX('T1'!M36,'T2'!K36),COUNTRY_INFO!F36*0.33),IF(COUNTRY_INFO!K36=2,IF(COUNTRY_INFO!F36*0.5>MAX('T1'!M36,'T2'!K36),MAX('T1'!M36,'T2'!K36),COUNTRY_INFO!F36*0.5),IF(COUNTRY_INFO!K36=3,IF(COUNTRY_INFO!F36>MAX('T1'!M36,'T2'!K36),MAX('T1'!M36,'T2'!K36),COUNTRY_INFO!F36),0)))","v":750.42000000000007},{"$f":"IF(AND(COUNTRY_INFO!K36>0,COUNTRY_INFO!K36<4),IF(Z36>0,IF(COUNTRY_INFO!K36=1, AD36/(COUNTRY_INFO!F36*0.33)*100, IF(COUNTRY_INFO!K36=2, AD36/(COUNTRY_INFO!F36*0.5)*100, IF(COUNTRY_INFO!K36=3, AD36/COUNTRY_INFO!F36*100))),\"-\"),0)","v":100},{"$f":"IF(COUNTRY_INFO!K36=2,IF(COUNTRY_INFO!G36*0.2>MAX('T1'!N36,'T2'!L36),MAX('T1'!N36,'T2'!L36),COUNTRY_INFO!G36*0.2),IF(COUNTRY_INFO!K36=3,IF(COUNTRY_INFO!G36>MAX('T1'!N36,'T2'!L36),MAX('T1'!N36,'T2'!L36),COUNTRY_INFO!G36),0))","v":0},{"$f":"IF(AND(COUNTRY_INFO!K36>0,COUNTRY_INFO!K36<4),IF(Z36>0,IF(COUNTRY_INFO!K36=1, 0, IF(COUNTRY_INFO!K36=2, AF36/(COUNTRY_INFO!G36*0.2)*100, IF(COUNTRY_INFO!K36=3, AF36/COUNTRY_INFO!G36*100))),\"-\"),0)","v":0},750.42000000000007,{"$f":"IF(AND(COUNTRY_INFO!K36>0,COUNTRY_INFO!K36<4), IF(AC36/Z36*100<>0, IF(AH36/Z36*100>100,100,AH36/Z36*100), \"-\"),0)","v":100},null,{"$f":"IF(AND(D36<>0, D36<>\"Inconnu\",D36<>\"Interrompu\",D36<>\"Non requis\"),D36/COUNTRY_INFO!D36, 0)","v":0},{"$f":"IF(AND(J36<>0,J36<>\"Inconnu\",J36<>\"Interrompu\",J36<>\"Non requis\"),J36/COUNTRY_INFO!D36, 0)","v":1},{"$f":"IF(AND(P36<>0,P36<>\"Inconnu\",P36<>\"Non requis\"),P36/(COUNTRY_INFO!E36+COUNTRY_INFO!F36), 0)","v":1},{"$f":"IF(AND(Z36<>0,Z36<>\"Inconnu\",Z36<>\"Non requis\"),IF(COUNTRY_INFO!K36=1,1,IF(COUNTRY_INFO!K36=2,0.5*COUNTRY_INFO!F36/(0.5*COUNTRY_INFO!F36+0.2*COUNTRY_INFO!G36),IF(COUNTRY_INFO!K36=3,COUNTRY_INFO!F36/(COUNTRY_INFO!F36+COUNTRY_INFO!G36)))),0)","v":1},{"$f":"IF(AND(Z36<>0,Z36<>\"Inconnu\",Z36<>\"Non requis\"),IF(COUNTRY_INFO!K36=1,0,IF(COUNTRY_INFO!K36=2,0.2*COUNTRY_INFO!G36/(0.5*COUNTRY_INFO!F36+0.2*COUNTRY_INFO!G36),IF(COUNTRY_INFO!K36=3,COUNTRY_INFO!G36/(COUNTRY_INFO!F36+COUNTRY_INFO!G36)))),0)","v":0},{"$f":"MAX(COUNTRY_INFO!D36*AK36*PROFILE!$G$7,COUNTRY_INFO!D36*AL36*PROFILE!$G$7)","v":363.73007568279036},{"$f":"MAX(COUNTRY_INFO!D36*AK36*PROFILE!$G$8,COUNTRY_INFO!D36*AL36*PROFILE!$G$8,COUNTRY_INFO!D36*AM36*PROFILE!$G$8)","v":1091.2738391111627},{"$f":"MAX(COUNTRY_INFO!D36*AK36*PROFILE!$G$9,COUNTRY_INFO!D36*AL36*PROFILE!$G$9,COUNTRY_INFO!D36*AM36*PROFILE!$G$9,IF(AND(DISTRICT!Z36<>\"Inconnu\",Z36<>\"Non requis\"),COUNTRY_INFO!P36*DISTRICT!AN36,0))","v":2273.5264038093023},{"$f":"MAX(COUNTRY_INFO!D36*AK36*PROFILE!$G$10,COUNTRY_INFO!D36*AL36*PROFILE!$G$10,IF(AND(DISTRICT!Z36<>\"Inconnu\",Z36<>\"Non requis\"),COUNTRY_INFO!P36*DISTRICT!AO36,0))","v":5365.4696813967439},9094,0,{"$f":"MAX('MDA4'!R36,'T1'!L36,'T2'!J36,T3_R1!K36,T3_R2!K36)","v":0},{"$f":"MAX('MDA1'!K36,'MDA4'!S36,'MDA3'!I36,'MDA3'!L36,'T1'!M36,'T2'!K36,T3_R1!L36,T3_R2!L36)","v":1476},{"$f":"MAX('MDA1'!L36,'MDA4'!T36,'MDA3'!J36,'MDA3'!M36,'T1'!N36,'T2'!L36,T3_R1!M36,T3_R2!M36)","v":0},1476,{"$f":"MAX('MDA4'!R36,T36)","v":0},{"$f":"MAX('MDA1'!K36,'MDA4'!S36,'MDA3'!I36,'MDA3'!L36,V36,AD36)","v":1476},{"$f":"MAX('MDA1'!L36,'MDA4'!T36,'MDA3'!J36,'MDA3'!M36,AF36)","v":0},1476,16.230481636243677]
[{"$f":"IF(COUNTRY_INFO!A37=0,\" \",COUNTRY_INFO!A37)","v":"Gabon"},{"$f":"IF(COUNTRY_INFO!B37=0,\" \",COUNTRY_INFO!B37)","v":"Centre-Sud"},{"$f":"IF(COUNTRY_INFO!C37=0,\" \",COUNTRY_INFO!C37)","v":"Mougalaba"},{"$f":"COUNTRY_INFO!M37","v":1442},null,null,{"$f":"MAX('MDA1'!M37,'MDA4'!U37)","v":0},{"$f":"IF(AND(COUNTRY_INFO!H37>0,COUNTRY_INFO!H37<4),IF(D37>MAX('MDA1'!M37,'MDA4'!U37),MAX('MDA1'!M37,'MDA4'!U37),D37),0)","v":0},{"$f":"IF(AND(COUNTRY_INFO!H37>0,COUNTRY_INFO!H37<4), IF(G37/D37*100<>0, IF(G37/D37*100>100,100,G37/D37*100), \"-\"),0)","v":"-"},{"$f":"COUNTRY_INFO!N37","v":0},null,null,{"$f":"MAX('MDA1'!M37,MAX('MDA3'!I37,'MDA3'!L37)+MAX('MDA3'!J37,'MDA3'!M37))","v":0},{"$f":"IF(AND(COUNTRY_INFO!I37>0,COUNTRY_INFO!I37<4),IF(J37>MAX('MDA1'!M37,MAX('MDA3'!I37,'MDA3'!L37)+MAX('MDA3'!J37,'MDA3'!M37)),MAX('MDA1'!M37,MAX('MDA3'!I37,'MDA3'!L37)+MAX('MDA3'!J37,'MDA3'!M37)),J37),0)","v":0},{"$f":"IF(AND(COUNTRY_INFO!I37>0,COUNTRY_INFO!I37<4), IF(M37/J37*100<>0, IF(M37/J37*100>100,100,M37/J37*100), \"-\"),0)","v":0},{"$f":"COUNTRY_INFO!O37","v":534},154,142,{"$f":"SUM(MAX('MDA4'!N37, 'T1'!L37, MAX(T3_R1!K37, T3_R2!K37)), MAX('MDA1'!K37, 'MDA4'!O37, 'T1'!M37, MAX(T3_R1!L37, T3_R2!L37)), MAX('MDA1'!L37, 'MDA4'!P37, 'T1'!N37, MAX(T3_R1!M37, T3_R2!M37)))","v":296},{"$f":"IF(AND(COUNTRY_INFO!J37>1,COUNTRY_INFO!J37<4),IF(COUNTRY_INFO!E37>MAX('MDA4'!N37,'T1'!L37,MAX(T3_R1!K37,T3_R2!K37)),MAX('MDA4'!N37,'T1'!L37,MAX(T3_R1!K37,T3_R2!K37)),COUNTRY_INFO!E37),0)","v":0},{"$f":"IF(AND(COUNTRY_INFO!J37>1,COUNTRY_INFO!J37<4), IF(T37/COUNTRY_INFO!E37*100<>0, IF(T37/COUNTRY_INFO!E37*100>100,100,T37/COUNTRY_INFO!E37*100), \"-\"),0)","v":"-"},{"$f":"IF(AND(COUNTRY_INFO!J37>1,COUNTRY_INFO!J37<4),IF(COUNTRY_INFO!F37>MAX('MDA1'!K37,'MDA4'!O37,'T1'!M37,MAX(T3_R1!L37,T3_R2!L37)),MAX('MDA1'!K37,'MDA4'!O37,'T1'!M37,MAX(T3_R1!L37,T3_R2!L37)),COUNTRY_INFO!F37),0)","v":296},{"$f":"IF(AND(COUNTRY_INFO!J37>1,COUNTRY_INFO!J37<4), IF(V37/COUNTRY_INFO!F37*100<>0, IF(V37/COUNTRY_INFO!F37*100>100,100,V37/COUNTRY_INFO!F37*100), \"-\"),0)","v":81.99445983379502},296,{"$f":"IF(AND(COUNTRY_INFO!J37>1,COUNTRY_INFO!J37<4), IF(S37/P37*100<>0, IF(X37/P37*100>100,100,X37/P37*100), \"-\"),0)","v":55.430711610486895},{"$f":"COUNTRY_INFO!P37","v":119.13000000000001},154,142,{"$f":"MAX('T1'!L37,'T2'!J37)+MAX('T1'!M37,'T2'!K37)+MAX('T1'!N37,'T2'!L37)","v":296},{"$f":"IF(COUNTRY_INFO!K37=1,IF(COUNTRY_INFO!F37*0.33>MAX('T1'!M37,'T2'!K37),MAX('T1'!M37,'T2'!K37),COUNTRY_INFO!F37*0.33),IF(COUNTRY_INFO!K37=2,IF(COUNTRY_INFO!F37*0.5>MAX('T1'!M37,'T2'!K37),MAX('T1'!M37,'T2'!K37),COUNTRY_INFO!F37*0.5),IF(COUNTRY_INFO!K37=3,IF(COUNTRY_INFO!F37>MAX('T1'!M37,'T2'!K37),MAX('T1'!M37,'T2'!K37),COUNTRY_INFO!F37),0)))","v":119.13000000000001},{"$f":"IF(AND(COUNTRY_INFO!K37>0,COUNTRY_INFO!K37<4),IF(Z37>0,IF(COUNTRY_INFO!K37=1, AD37/(COUNTRY_INFO!F37*0.33)*100, IF(COUNTRY_INFO!K37=2, AD37/(COUNTRY_INFO!F37*0.5)*100, IF(COUNTRY_INFO!K37=3, AD37/COUNTRY_INFO!F37*100))),\"-\"),0)","v":100},{"$f":"IF(COUNTRY_INFO!K37=2,IF(COUNTRY_INFO!G37*0.2>MAX('T1'!N37,'T2'!L37),MAX('T1'!N37,'T2'!L37),COUNTRY_INFO!G37*0.2),IF(COUNTRY_INFO!K37=3,IF(COUNTRY_INFO!G37>MAX('T1'!N37,'T2'!L37),MAX('T1'!N37,'T2'!L37),COUNTRY_INFO!G37),0))","v":0},{"$f":"IF(AND(COUNTRY_INFO!K37>0,COUNTRY_INFO!K37<4),IF(Z37>0,IF(COUNTRY_INFO!K37=1, 0, IF(COUNTRY_INFO!K37=2, AF37/(COUNTRY_INFO!G37*0.2)*100, IF(COUNTRY_INFO!K37=3, AF37/COUNTRY_INFO!G37*100))),\"-\"),0)","v":0},119.13000000000001,{"$f":"IF(AND(COUNTRY_INFO!K37>0,COUNTRY_INFO!K37<4), IF(AC37/Z37*100<>0, IF(AH37/Z37*100>100,100,AH37/Z37*100), \"-\"),0)","v":100},null,{"$f":"IF(AND(D37<>0, D37<>\"Inconnu\",D37<>\"Interrompu\",D37<>\"Non requis\"),D37/COUNTRY_INFO!D37, 0)","v":1},{"$f":"IF(AND(J37<>0,J37<>\"Inconnu\",J37<>\"Interrompu\",J37<>\"Non requis\"),J37/COUNTRY_INFO!D37, 0)","v":0},{"$f":"IF(AND(P37<>0,P37<>\"Inconnu\",P37<>\"Non requis\"),P37/(COUNTRY_INFO!E37+COUNTRY_INFO!F37), 0)","v":1},{"$f":"IF(AND(Z37<>0,Z37<>\"Inconnu\",Z37<>\"Non requis\"),IF(COUNTRY_INFO!K37=1,1,IF(COUNTRY_INFO!K37=2,0.5*COUNTRY_INFO!F37/(0.5*COUNTRY_INFO!F37+0.2*COUNTRY_INFO!G37),IF(COUNTRY_INFO!K37=3,COUNTRY_INFO!F37/(COUNTRY_INFO!F37+COUNTRY_INFO!G37)))),0)","v":1},{"$f":"IF(AND(Z37<>0,Z37<>\"Inconnu\",Z37<>\"Non requis\"),IF(COUNTRY_INFO!K37=1,0,IF(COUNTRY_INFO!K37=2,0.2*COUNTRY_INFO!G37/(0.5*COUNTRY_INFO!F37+0.2*COUNTRY_INFO!G37),IF(COUNTRY_INFO!K37=3,COUNTRY_INFO!G37/(COUNTRY_INFO!F37+COUNTRY_INFO!G37)))),0)","v":0},{"$f":"MAX(COUNTRY_INFO!D37*AK37*PROFILE!$G$7,COUNTRY_INFO!D37*AL37*PROFILE!$G$7)","v":57.675255018098056},{"$f":"MAX(COUNTRY_INFO!D37*AK37*PROFILE!$G$8,COUNTRY_INFO!D37*AL37*PROFILE!$G$8,COUNTRY_INFO!D37*AM37*PROFILE!$G$8)","v":173.03902309196135},{"$f":"MAX(COUNTRY_INFO!D37*AK37*PROFILE!$G$9,COUNTRY_INFO!D37*AL37*PROFILE!$G$9,COUNTRY_INFO!D37*AM37*PROFILE!$G$9,IF(AND(DISTRICT!Z37<>\"Inconnu\",Z37<>\"Non requis\"),COUNTRY_INFO!P37*DISTRICT!AN37,0))","v":360.50418674873697},{"$f":"MAX(COUNTRY_INFO!D37*AK37*PROFILE!$G$10,COUNTRY_INFO!D37*AL37*PROFILE!$G$10,IF(AND(DISTRICT!Z37<>\"Inconnu\",Z37<>\"Non requis\"),COUNTRY_INFO!P37*DISTRICT!AO37,0))","v":850.78153514120356},1442,0,{"$f":"MAX('MDA4'!R37,'T1'!L37,'T2'!J37,T3_R1!K37,T3_R2!K37)","v":0},{"$f":"MAX('MDA1'!K37,'MDA4'!S37,'MDA3'!I37,'MDA3'!L37,'T1'!M37,'T2'!K37,T3_R1!L37,T3_R2!L37)","v":296},{"$f":"MAX('MDA1'!L37,'MDA4'!T37,'MDA3'!J37,'MDA3'!M37,'T1'!N37,'T2'!L37,T3_R1!M37,T3_R2!M37)","v":0},296,{"$f":"MAX('MDA4'!R37,T37)","v":0},{"$f":"MAX('MDA1'!K37,'MDA4'!S37,'MDA3'!I37,'MDA3'!L37,V37,AD37)","v":296},{"$f":"MAX('MDA1'!L37,'MDA4'!T37,'MDA3'!J37,'MDA3'!M37,AF37)","v":0},296,20.527045769764214]
[{"$f":"IF(COUNTRY_INFO!A38=0,\" \",COUNTRY_INFO!A38)","v":"Gabon"},{"$f":"IF(COUNTRY_INFO!B38=0,\" \",COUNTRY_INFO!B38)","v":"Sud"},{"$f":"IF(COUNTRY_INFO!C38=0,\" \",COUNTRY_INFO!C38)","v":"Doutsila"},{"$f":"COUNTRY_INFO!M38","v":0},null,null,{"$f":"MAX('MDA1'!M38,'MDA4'!U38)","v":0},{"$f":"IF(AND(COUNTRY_INFO!H38>0,COUNTRY_INFO!H38<4),IF(D38>MAX('MDA1'!M38,'MDA4'!U38),MAX('MDA1'!M38,'MDA4'!U38),D38),0)","v":0},{"$f":"IF(AND(COUNTRY_INFO!H38>0,COUNTRY_INFO!H38<4), IF(G38/D38*100<>0, IF(G38/D38*100>100,100,G38/D38*100), \"-\"),0)","v":0},{"$f":"COUNTRY_INFO!N38","v":"Inconnu"},null,null,{"$f":"MAX('MDA1'!M38,MAX('MDA3'!I38,'MDA3'!L38)+MAX('MDA3'!J38,'MDA3'!M38))","v":0},{"$f":"IF(AND(COUNTRY_INFO!I38>0,COUNTRY_INFO!I38<4),IF(J38>MAX('MDA1'!M38,MAX('MDA3'!I38,'MDA3'!L38)+MAX('MDA3'!J38,'MDA3'!M38)),MAX('MDA1'!M38,MAX('MDA3'!I38,'MDA3'!L38)+MAX('MDA3'!J38,'MDA3'!M38)),J38),0)","v":0},{"$f":"IF(AND(COUNTRY_INFO!I38>0,COUNTRY_INFO!I38<4), IF(M38/J38*100<>0, IF(M38/J38*100>100,100,M38/J38*100), \"-\"),0)","v":0},{"$f":"COUNTRY_INFO!O38","v":1625},147,136,{"$f":"SUM(MAX('MDA4'!N38, 'T1'!L38, MAX(T3_R1!K38, T3_R2!K38)), MAX('MDA1'!K38, 'MDA4'!O38, 'T1'!M38, MAX(T3_R1!L38, T3_R2!L38)), MAX('MDA1'!L38, 'MDA4'!P38, 'T1'!N38, MAX(T3_R1!M38, T3_R2!M38)))","v":401},{"$f":"IF(AND(COUNTRY_INFO!J38>1,COUNTRY_INFO!J38<4),IF(COUNTRY_INFO!E38>MAX('MDA4'!N38,'T1'!L38,MAX(T3_R1!K38,T3_R2!K38)),MAX('MDA4'!N38,'T1'!L38,MAX(T3_R1!K38,T3_R2!K38)),COUNTRY_INFO!E38),0)","v":0},{"$f":"IF(AND(COUNTRY_INFO!J38>1,COUNTRY_INFO!J38<4), IF(T38/COUNTRY_INFO!E38*100<>0, IF(T38/COUNTRY_INFO!E38*100>100,100,T38/COUNTRY_INFO!E38*100), \"-\"),0)","v":"-"},{"$f":"IF(AND(COUNTRY_INFO!J38>1,COUNTRY_INFO!J38<4),IF(COUNTRY_INFO!F38>MAX('MDA1'!K38,'MDA4'!O38,'T1'!M38,MAX(T3_R1!L38,T3_R2!L38)),MAX('MDA1'!K38,'MDA4'!O38,'T1'!M38,MAX(T3_R1!L38,T3_R2!L38)),COUNTRY_INFO!F38),0)","v":401},{"$f":"IF(AND(COUNTRY_INFO!J38>1,COUNTRY_INFO!J38<4), IF(V38/COUNTRY_INFO!F38*100<>0, IF(V38/COUNTRY_INFO!F38*100>100,100,V38/COUNTRY_INFO!F38*100), \"-\"),0)","v":36.520947176684885},401,{"$f":"IF(AND(COUNTRY_INFO!J38>1,COUNTRY_INFO!J38<4), IF(S38/P38*100<>0, IF(X38/P38*100>100,100,X38/P38*100), \"-\"),0)","v":24.676923076923078},{"$f":"COUNTRY_INFO!P38","v":362.34000000000003},147,136,{"$f":"MAX('T1'!L38,'T2'!J38)+MAX('T1'!M38,'T2'!K38)+MAX('T1'!N38,'T2'!L38)","v":283},{"$f":"IF(COUNTRY_INFO!K38=1,IF(COUNTRY_INFO!F38*0.33>MAX('T1'!M38,'T2'!K38),MAX('T1'!M38,'T2'!K38),COUNTRY_INFO!F38*0.33),IF(COUNTRY_INFO!K38=2,IF(COUNTRY_INFO!F38*0.5>MAX('T1'!M38,'T2'!K38),MAX('T1'!M38,'T2'!K38),COUNTRY_INFO!F38*0.5),IF(COUNTRY_INFO!K38=3,IF(COUNTRY_INFO!F38>MAX('T1'!M38,'T2'!K38),MAX('T1'!M38,'T2'!K38),COUNTRY_INFO!F38),0)))","v":283},{"$f":"IF(AND(COUNTRY_INFO!K38>0,COUNTRY_INFO!K38<4),IF(Z38>0,IF(COUNTRY_INFO!K38=1, AD38/(COUNTRY_INFO!F38*0.33)*100, IF(COUNTRY_INFO!K38=2, AD38/(COUNTRY_INFO!F38*0.5)*100, IF(COUNTRY_INFO!K38=3, AD38/COUNTRY_INFO!F38*100))),\"-\"),0)","v":78.103438759176456},{"$f":"IF(COUNTRY_INFO!K38=2,IF(COUNTRY_INFO!G38*0.2>MAX('T1'!N38,'T2'!L38),MAX('T1'!N38,'T2'!L38),COUNTRY_INFO!G38*0.2),IF(COUNTRY_INFO!K38=3,IF(COUNTRY_INFO!G38>MAX('T1'!N38,'T2'!L38),MAX('T1'!N38,'T2'!L38),COUNTRY_INFO!G38),0))","v":0},{"$f":"IF(AND(COUNTRY_INFO!K38>0,COUNTRY_INFO!K38<4),IF(Z38>0,IF(COUNTRY_INFO!K38=1, 0, IF(COUNTRY_INFO!K38=2, AF38/(COUNTRY_INFO!G38*0.2)*100, IF(COUNTRY_INFO!K38=3, AF38/COUNTRY_INFO!G38*100))),\"-\"),0)","v":0},283,{"$f":"IF(AND(COUNTRY_INFO!K38>0,COUNTRY_INFO!K38<4), IF(AC38/Z38*100<>0, IF(AH38/Z38*100>100,100,AH38/Z38*100), \"-\"),0)","v":78.103438759176456},null,{"$f":"IF(AND(D38<>0, D38<>\"Inconnu\",D38<>\"Interrompu\",D38<>\"Non requis\"),D38/COUNTRY_INFO!D38, 0)","v":0},{"$f":"IF(AND(J38<>0,J38<>\"Inconnu\",J38<>\"Interrompu\",J38<>\"Non requis\"),J38/COUNTRY_INFO!D38, 0)","v":0},{"$f":"IF(AND(P38<>0,P38<>\"Inconnu\",P38<>\"Non requis\"),P38/(COUNTRY_INFO!E38+COUNTRY_INFO!F38), 0)","v":1},{"$f":"IF(AND(Z38<>0,Z38<>\"Inconnu\",Z38<>\"Non requis\"),IF(COUNTRY_INFO!K38=1,1,IF(COUNTRY_INFO!K38=2,0.5*COUNTRY_INFO!F38/(0.5*COUNTRY_INFO!F38+0.2*COUNTRY_INFO!G38),IF(COUNTRY_INFO!K38=3,COUNTRY_INFO!F38/(COUNTRY_INFO!F38+COUNTRY_INFO!G38)))),0)","v":1},{"$f":"IF(AND(Z38<>0,Z38<>\"Inconnu\",Z38<>\"Non requis\"),IF(COUNTRY_INFO!K38=1,0,IF(COUNTRY_INFO!K38=2,0.2*COUNTRY_INFO!G38/(0.5*COUNTRY_INFO!F38+0.2*COUNTRY_INFO!G38),IF(COUNTRY_INFO!K38=3,COUNTRY_INFO!G38/(COUNTRY_INFO!F38+COUNTRY_INFO!G38)))),0)","v":0},{"$f":"MAX(COUNTRY_INFO!D38*AK38*PROFILE!$G$7,COUNTRY_INFO!D38*AL38*PROFILE!$G$7)","v":0},{"$f":"MAX(COUNTRY_INFO!D38*AK38*PROFILE!$G$8,COUNTRY_INFO!D38*AL38*PROFILE!$G$8,COUNTRY_INFO!D38*AM38*PROFILE!$G$8)","v":526.91702524050095},{"$f":"MAX(COUNTRY_INFO!D38*AK38*PROFILE!$G$9,COUNTRY_INFO!D38*AL38*PROFILE!$G$9,COUNTRY_INFO!D38*AM38*PROFILE!$G$9,IF(AND(DISTRICT!Z38<>\"Inconnu\",Z38<>\"Non requis\"),COUNTRY_INFO!P38*DISTRICT!AN38,0))","v":1097.7627489692816},{"$f":"MAX(COUNTRY_INFO!D38*AK38*PROFILE!$G$10,COUNTRY_INFO!D38*AL38*PROFILE!$G$10,IF(AND(DISTRICT!Z38<>\"Inconnu\",Z38<>\"Non requis\"),COUNTRY_INFO!P38*DISTRICT!AO38,0))","v":0},1624.6797742097824,"Y",{"$f":"MAX('MDA4'!R38,'T1'!L38,'T2'!J38,T3_R1!K38,T3_R2!K38)","v":0},{"$f":"MAX('MDA1'!K38,'MDA4'!S38,'MDA3'!I38,'MDA3'!L38,'T1'!M38,'T2'!K38,T3_R1!L38,T3_R2!L38)","v":401},{"$f":"MAX('MDA1'!L38,'MDA4'!T38,'MDA3'!J38,'MDA3'!M38,'T1'!N38,'T2'!L38,T3_R1!M38,T3_R2!M38)","v":0},401,{"$f":"MAX('MDA4'!R38,T38)","v":0},{"$f":"MAX('MDA1'!K38,'MDA4'!S38,'MDA3'!I38,'MDA3'!L38,V38,AD38)","v":401},{"$f":"MAX('MDA1'!L38,'MDA4'!T38,'MDA3'!J38,'MDA3'!M38,AF38)","v":0},401,24.681786919827928]
[{"$f":"IF(COUNTRY_INFO!A39=0,\" \",COUNTRY_INFO!A39)","v":"Gabon"},{"$f":"IF(COUNTRY_INFO!B39=0,\" \",COUNTRY_INFO!B39)","v":"Sud"},{"$f":"IF(COUNTRY_INFO!C39=0,\" \",COUNTRY_INFO!C39)","v":"Basse-Banio"},{"$f":"COUNTRY_INFO!M39","v":7344},null,null,{"$f":"MAX('MDA1'!M39,'MDA4'!U39)","v":0},{"$f":"IF(AND(COUNTRY_INFO!H39>0,COUNTRY_INFO!H39<4),IF(D39>MAX('MDA1'!M39,'MDA4'!U39),MAX('MDA1'!M39,'MDA4'!U39),D39),0)","v":0},{"$f":"IF(AND(COUNTRY_INFO!H39>0,COUNTRY_INFO!H39<4), IF(G39/D39*100<>0, IF(G39/D39*100>100,100,G39/D39*100), \"-\"),0)","v":"-"},{"$f":"COUNTRY_INFO!N39","v":7344},null,null,{"$f":"MAX('MDA1'!M39,MAX('MDA3'!I39,'MDA3'!L39)+MAX('MDA3'!J39,'MDA3'!M39))","v":0},{"$f":"IF(AND(COUNTRY_INFO!I39>0,COUNTRY_INFO!I39<4),IF(J39>MAX('MDA1'!M39,MAX('MDA3'!I39,'MDA3'!L39)+MAX('MDA3'!J39,'MDA3'!M39)),MAX('MDA1'!M39,MAX('MDA3'!I39,'MDA3'!L39)+MAX('MDA3'!J39,'MDA3'!M39)),J39),0)","v":0},{"$f":"IF(AND(COUNTRY_INFO!I39>0,COUNTRY_INFO!I39<4), IF(M39/J39*100<>0, IF(M39/J39*100>100,100,M39/J39*100), \"-\"),0)","v":"-"},{"$f":"COUNTRY_INFO!O39","v":2717},365,407,{"$f":"SUM(MAX('MDA4'!N39, 'T1'!L39, MAX(T3_R1!K39, T3_R2!K39)), MAX('MDA1'!K39, 'MDA4'!O39, 'T1'!M39, MAX(T3_R1!L39, T3_R2!L39)), MAX('MDA1'!L39, 'MDA4'!P39, 'T1'!N39, MAX(T3_R1!M39, T3_R2!M39)))","v":772},{"$f":"IF(AND(COUNTRY_INFO!J39>1,COUNTRY_INFO!J39<4),IF(COUNTRY_INFO!E39>MAX('MDA4'!N39,'T1'!L39,MAX(T3_R1!K39,T3_R2!K39)),MAX('MDA4'!N39,'T1'!L39,MAX(T3_R1!K39,T3_R2!K39)),COUNTRY_INFO!E39),0)","v":0},{"$f":"IF(AND(COUNTRY_INFO!J39>1,COUNTRY_INFO!J39<4), IF(T39/COUNTRY_INFO!E39*100<>0, IF(T39/COUNTRY_INFO!E39*100>100,100,T39/COUNTRY_INFO!E39*100), \"-\"),0)","v":"-"},{"$f":"IF(AND(COUNTRY_INFO!J39>1,COUNTRY_INFO!J39<4),IF(COUNTRY_INFO!F39>MAX('MDA1'!K39,'MDA4'!O39,'T1'!M39,MAX(T3_R1!L39,T3_R2!L39)),MAX('MDA1'!K39,'MDA4'!O39,'T1'!M39,MAX(T3_R1!L39,T3_R2!L39)),COUNTRY_INFO!F39),0)","v":772},{"$f":"IF(AND(COUNTRY_INFO!J39>1,COUNTRY_INFO!J39<4), IF(V39/COUNTRY_INFO!F39*100<>0, IF(V39/COUNTRY_INFO!F39*100>100,100,V39/COUNTRY_INFO!F39*100), \"-\"),0)","v":42.047930283224403},772,{"$f":"IF(AND(COUNTRY_INFO!J39>1,COUNTRY_INFO!J39<4), IF(S39/P39*100<>0, IF(X39/P39*100>100,100,X39/P39*100), \"-\"),0)","v":28.413691571586309},{"$f":"COUNTRY_INFO!P39","v":605.88},365,407,{"$f":"MAX('T1'!L39,'T2'!J39)+MAX('T1'!M39,'T2'!K39)+MAX('T1'!N39,'T2'!L39)","v":772},{"$f":"IF(COUNTRY_INFO!K39=1,IF(COUNTRY_INFO!F39*0.33>MAX('T1'!M39,'T2'!K39),MAX('T1'!M39,'T2'!K39),COUNTRY_INFO!F39*0.33),IF(COUNTRY_INFO!K39=2,IF(COUNTRY_INFO!F39*0.5>MAX('T1'!M39,'T2'!K39),MAX('T1'!M39,'T2'!K39),COUNTRY_INFO!F39*0.5),IF(COUNTRY_INFO!K39=3,IF(COUNTRY_INFO!F39>MAX('T1'!M39,'T2'!K39),MAX('T1'!M39,'T2'!K39),COUNTRY_INFO!F39),0)))","v":605.88},{"$f":"IF(AND(COUNTRY_INFO!K39>0,COUNTRY_INFO!K39<4),IF(Z39>0,IF(COUNTRY_INFO!K39=1, AD39/(COUNTRY_INFO!F39*0.33)*100, IF(COUNTRY_INFO!K39=2, AD39/(COUNTRY_INFO!F39*0.5)*100, IF(COUNTRY_INFO!K39=3, AD39/COUNTRY_INFO!F39*100))),\"-\"),0)","v":100},{"$f":"IF(COUNTRY_INFO!K39=2,IF(COUNTRY_INFO!G39*0.2>MAX('T1'!N39,'T2'!L39),MAX('T1'!N39,'T2'!L39),COUNTRY_INFO!G39*0.2),IF(COUNTRY_INFO!K39=3,IF(COUNTRY_INFO!G39>MAX('T1'!N39,'T2'!L39),MAX('T1'!N39,'T2'!L39),COUNTRY_INFO!G39),0))","v":0},{"$f":"IF(AND(COUNTRY_INFO!K39>0,COUNTRY_INFO!K39<4),IF(Z39>0,IF(COUNTRY_INFO!K39=1, 0, IF(COUNTRY_INFO!K39=2, AF39/(COUNTRY_INFO!G39*0.2)*100, IF(COUNTRY_INFO!K39=3, AF39/COUNTRY_INFO!G39*100))),\"-\"),0)","v":0},605.88,{"$f":"IF(AND(COUNTRY_INFO!K39>0,COUNTRY_INFO!K39<4), IF(AC39/Z39*100<>0, IF(AH39/Z39*100>100,100,AH39/Z39*100), \"-\"),0)","v":100},null,{"$f":"IF(AND(D39<>0, D39<>\"Inconnu\",D39<>\"Interrompu\",D39<>\"Non requis\"),D39/COUNTRY_INFO!D39, 0)","v":1},{"$f":"IF(AND(J39<>0,J39<>\"Inconnu\",J39<>\"Interrompu\",J39<>\"Non requis\"),J39/COUNTRY_INFO!D39, 0)","v":1},{"$f":"IF(AND(P39<>0,P39<>\"Inconnu\",P39<>\"Non requis\"),P39/(COUNTRY_INFO!E39+COUNTRY_INFO!F39), 0)","v":1},{"$f":"IF(AND(Z39<>0,Z39<>\"Inconnu\",Z39<>\"Non requis\"),IF(COUNTRY_INFO!K39=1,1,IF(COUNTRY_INFO!K39=2,0.5*COUNTRY_INFO!F39/(0.5*COUNTRY_INFO!F39+0.2*COUNTRY_INFO!G39),IF(COUNTRY_INFO!K39=3,COUNTRY_INFO!F39/(COUNTRY_INFO!F39+COUNTRY_INFO!G39)))),0)","v":1},{"$f":"IF(AND(Z39<>0,Z39<>\"Inconnu\",Z39<>\"Non requis\"),IF(COUNTRY_INFO!K39=1,0,IF(COUNTRY_INFO!K39=2,0.2*COUNTRY_INFO!G39/(0.5*COUNTRY_INFO!F39+0.2*COUNTRY_INFO!G39),IF(COUNTRY_INFO!K39=3,COUNTRY_INFO!G39/(COUNTRY_INFO!F39+COUNTRY_INFO!G39)))),0)","v":0},{"$f":"MAX(COUNTRY_INFO!D39*AK39*PROFILE!$G$7,COUNTRY_INFO!D39*AL39*PROFILE!$G$7)","v":293.73583415597233},{"$f":"MAX(COUNTRY_INFO!D39*AK39*PROFILE!$G$8,COUNTRY_INFO!D39*AL39*PROFILE!$G$8,COUNTRY_INFO!D39*AM39*PROFILE!$G$8)","v":881.27502467917077},{"$f":"MAX(COUNTRY_INFO!D39*AK39*PROFILE!$G$9,COUNTRY_INFO!D39*AL39*PROFILE!$G$9,COUNTRY_INFO!D39*AM39*PROFILE!$G$9,IF(AND(DISTRICT!Z39<>\"Inconnu\",Z39<>\"Non requis\"),COUNTRY_INFO!P39*DISTRICT!AN39,0))","v":1836.0213228035536},{"$f":"MAX(COUNTRY_INFO!D39*AK39*PROFILE!$G$10,COUNTRY_INFO!D39*AL39*PROFILE!$G$10,IF(AND(DISTRICT!Z39<>\"Inconnu\",Z39<>\"Non requis\"),COUNTRY_INFO!P39*DISTRICT!AO39,0))","v":4332.9678183613032},7344,0,{"$f":"MAX('MDA4'!R39,'T1'!L39,'T2'!J39,T3_R1!K39,T3_R2!K39)","v":0},{"$f":"MAX('MDA1'!K39,'MDA4'!S39,'MDA3'!I39,'MDA3'!L39,'T1'!M39,'T2'!K39,T3_R1!L39,T3_R2!L39)","v":772},{"$f":"MAX('MDA1'!L39,'MDA4'!T39,'MDA3'!J39,'MDA3'!M39,'T1'!N39,'T2'!L39,T3_R1!M39,T3_R2!M39)","v":0},772,{"$f":"MAX('MDA4'!R39,T39)","v":0},{"$f":"MAX('MDA1'!K39,'MDA4'!S39,'MDA3'!I39,'MDA3'!L39,V39,AD39)","v":772},{"$f":"MAX('MDA1'!L39,'MDA4'!T39,'MDA3'!J39,'MDA3'!M39,AF39)","v":0},772,10.511982570806101]
[{"$f":"IF(COUNTRY_INFO!A40=0,\" \",COUNTRY_INFO!A40)","v":"Gabon"},{"$f":"IF(COUNTRY_INFO!B40=0,\" \",COUNTRY_INFO!B40)","v":"Sud"},{"$f":"IF(COUNTRY_INFO!C40=0,\" \",COUNTRY_INFO!C40)","v":"Douigny"},{"$f":"COUNTRY_INFO!M40","v":0},null,null,{"$f":"MAX('MDA1'!M40,'MDA4'!U40)","v":0},{"$f":"IF(AND(COUNTRY_INFO!H40>0,COUNTRY_INFO!H40<4),IF(D40>MAX('MDA1'!M40,'MDA4'!U40),MAX('MDA1'!M40,'MDA4'!U40),D40),0)","v":0},{"$f":"IF(AND(COUNTRY_INFO!H40>0,COUNTRY_INFO!H40<4), IF(G40/D40*100<>0, IF(G40/D40*100>100,100,G40/D40*100), \"-\"),0)","v":0},{"$f":"COUNTRY_INFO!N40","v":0},null,null,{"$f":"MAX('MDA1'!M40,MAX('MDA3'!I40,'MDA3'!L40)+MAX('MDA3'!J40,'MDA3'!M40))","v":0},{"$f":"IF(AND(COUNTRY_INFO!I40>0,COUNTRY_INFO!I40<4),IF(J40>MAX('MDA1'!M40,MAX('MDA3'!I40,'MDA3'!L40)+MAX('MDA3'!J40,'MDA3'!M40)),MAX('MDA1'!M40,MAX('MDA3'!I40,'MDA3'!L40)+MAX('MDA3'!J40,'MDA3'!M40)),J40),0)","v":0},{"$f":"IF(AND(COUNTRY_INFO!I40>0,COUNTRY_INFO!I40<4), IF(M40/J40*100<>0, IF(M40/J40*100>100,100,M40/J40*100), \"-\"),0)","v":0},{"$f":"COUNTRY_INFO!O40","v":2772},499,423,{"$f":"SUM(MAX('MDA4'!N40, 'T1'!L40, MAX(T3_R1!K40, T3_R2!K40)), MAX('MDA1'!K40, 'MDA4'!O40, 'T1'!M40, MAX(T3_R1!L40, T3_R2!L40)), MAX('MDA1'!L40, 'MDA4'!P40, 'T1'!N40, MAX(T3_R1!M40, T3_R2!M40)))","v":922},{"$f":"IF(AND(COUNTRY_INFO!J40>1,COUNTRY_INFO!J40<4),IF(COUNTRY_INFO!E40>MAX('MDA4'!N40,'T1'!L40,MAX(T3_R1!K40,T3_R2!K40)),MAX('MDA4'!N40,'T1'!L40,MAX(T3_R1!K40,T3_R2!K40)),COUNTRY_INFO!E40),0)","v":0},{"$f":"IF(AND(COUNTRY_INFO!J40>1,COUNTRY_INFO!J40<4), IF(T40/COUNTRY_INFO!E40*100<>0, IF(T40/COUNTRY_INFO!E40*100>100,100,T40/COUNTRY_INFO!E40*100), \"-\"),0)","v":"-"},{"$f":"IF(AND(COUNTRY_INFO!J40>1,COUNTRY_INFO!J40<4),IF(COUNTRY_INFO!F40>MAX('MDA1'!K40,'MDA4'!O40,'T1'!M40,MAX(T3_R1!L40,T3_R2!L40)),MAX('MDA1'!K40,'MDA4'!O40,'T1'!M40,MAX(T3_R1!L40,T3_R2!L40)),COUNTRY_INFO!F40),0)","v":922},{"$f":"IF(AND(COUNTRY_INFO!J40>1,COUNTRY_INFO!J40<4), IF(V40/COUNTRY_INFO!F40*100<>0, IF(V40/COUNTRY_INFO!F40*100>100,100,V40/COUNTRY_INFO!F40*100), \"-\"),0)","v":49.225840896956754},922,{"$f":"IF(AND(COUNTRY_INFO!J40>1,COUNTRY_INFO!J40<4), IF(S40/P40*100<>0, IF(X40/P40*100>100,100,X40/P40*100), \"-\"),0)","v":33.261183261183263},{"$f":"COUNTRY_INFO!P40","v":0},null,null,{"$f":"MAX('T1'!L40,'T2'!J40)+MAX('T1'!M40,'T2'!K40)+MAX('T1'!N40,'T2'!L40)","v":0},{"$f":"IF(COUNTRY_INFO!K40=1,IF(COUNTRY_INFO!F40*0.33>MAX('T1'!M40,'T2'!K40),MAX('T1'!M40,'T2'!K40),COUNTRY_INFO!F40*0.33),IF(COUNTRY_INFO!K40=2,IF(COUNTRY_INFO!F40*0.5>MAX('T1'!M40,'T2'!K40),MAX('T1'!M40,'T2'!K40),COUNTRY_INFO!F40*0.5),IF(COUNTRY_INFO!K40=3,IF(COUNTRY_INFO!F40>MAX('T1'!M40,'T2'!K40),MAX('T1'!M40,'T2'!K40),COUNTRY_INFO!F40),0)))","v":0},{"$f":"IF(AND(COUNTRY_INFO!K40>0,COUNTRY_INFO!K40<4),IF(Z40>0,IF(COUNTRY_INFO!K40=1, AD40/(COUNTRY_INFO!F40*0.33)*100, IF(COUNTRY_INFO!K40=2, AD40/(COUNTRY_INFO!F40*0.5)*100, IF(COUNTRY_INFO!K40=3, AD40/COUNTRY_INFO!F40*100))),\"-\"),0)","v":0},{"$f":"IF(COUNTRY_INFO!K40=2,IF(COUNTRY_INFO!G40*0.2>MAX('T1'!N40,'T2'!L40),MAX('T1'!N40,'T2'!L40),COUNTRY_INFO!G40*0.2),IF(COUNTRY_INFO!K40=3,IF(COUNTRY_INFO!G40>MAX('T1'!N40,'T2'!L40),MAX('T1'!N40,'T2'!L40),COUNTRY_INFO!G40),0))","v":0},{"$f":"IF(AND(COUNTRY_INFO!K40>0,COUNTRY_INFO!K40<4),IF(Z40>0,IF(COUNTRY_INFO!K40=1, 0, IF(COUNTRY_INFO!K40=2, AF40/(COUNTRY_INFO!G40*0.2)*100, IF(COUNTRY_INFO!K40=3, AF40/COUNTRY_INFO!G40*100))),\"-\"),0)","v":0},0,{"$f":"IF(AND(COUNTRY_INFO!K40>0,COUNTRY_INFO!K40<4), IF(AC40/Z40*100<>0, IF(AH40/Z40*100>100,100,AH40/Z40*100), \"-\"),0)","v":0},null,{"$f":"IF(AND(D40<>0, D40<>\"Inconnu\",D40<>\"Interrompu\",D40<>\"Non requis\"),D40/COUNTRY_INFO!D40, 0)","v":0},{"$f":"IF(AND(J40<>0,J40<>\"Inconnu\",J40<>\"Interrompu\",J40<>\"Non requis\"),J40/COUNTRY_INFO!D40, 0)","v":0},{"$f":"IF(AND(P40<>0,P40<>\"Inconnu\",P40<>\"Non requis\"),P40/(COUNTRY_INFO!E40+COUNTRY_INFO!F40), 0)","v":1},{"$f":"IF(AND(Z40<>0,Z40<>\"Inconnu\",Z40<>\"Non requis\"),IF(COUNTRY_INFO!K40=1,1,IF(COUNTRY_INFO!K40=2,0.5*COUNTRY_INFO!F40/(0.5*COUNTRY_INFO!F40+0.2*COUNTRY_INFO!G40),IF(COUNTRY_INFO!K40=3,COUNTRY_INFO!F40/(COUNTRY_INFO!F40+COUNTRY_INFO!G40)))),0)","v":0},{"$f":"IF(AND(Z40<>0,Z40<>\"Inconnu\",Z40<>\"Non requis\"),IF(COUNTRY_INFO!K40=1,0,IF(COUNTRY_INFO!K40=2,0.2*COUNTRY_INFO!G40/(0.5*COUNTRY_INFO!F40+0.2*COUNTRY_INFO!G40),IF(COUNTRY_INFO!K40=3,COUNTRY_INFO!G40/(COUNTRY_INFO!F40+COUNTRY_INFO!G40)))),0)","v":0},{"$f":"MAX(COUNTRY_INFO!D40*AK40*PROFILE!$G$7,COUNTRY_INFO!D40*AL40*PROFILE!$G$7)","v":0},{"$f":"MAX(COUNTRY_INFO!D40*AK40*PROFILE!$G$8,COUNTRY_INFO!D40*AL40*PROFILE!$G$8,COUNTRY_INFO!D40*AM40*PROFILE!$G$8)","v":898.91492509145814},{"$f":"MAX(COUNTRY_INFO!D40*AK40*PROFILE!$G$9,COUNTRY_INFO!D40*AL40*PROFILE!$G$9,COUNTRY_INFO!D40*AM40*PROFILE!$G$9,IF(AND(DISTRICT!Z40<>\"Inconnu\",Z40<>\"Non requis\"),COUNTRY_INFO!P40*DISTRICT!AN40,0))","v":1872.7717496080365},{"$f":"MAX(COUNTRY_INFO!D40*AK40*PROFILE!$G$10,COUNTRY_INFO!D40*AL40*PROFILE!$G$10,IF(AND(DISTRICT!Z40<>\"Inconnu\",Z40<>\"Non requis\"),COUNTRY_INFO!P40*DISTRICT!AO40,0))","v":0},2771.6866746994947,"Y",{"$f":"MAX('MDA4'!R40,'T1'!L40,'T2'!J40,T3_R1!K40,T3_R2!K40)","v":0},{"$f":"MAX('MDA1'!K40,'MDA4'!S40,'MDA3'!I40,'MDA3'!L40,'T1'!M40,'T2'!K40,T3_R1!L40,T3_R2!L40)","v":922},{"$f":"MAX('MDA1'!L40,'MDA4'!T40,'MDA3'!J40,'MDA3'!M40,'T1'!N40,'T2'!L40,T3_R1!M40,T3_R2!M40)","v":0},922,{"$f":"MAX('MDA4'!R40,T40)","v":0},{"$f":"MAX('MDA1'!K40,'MDA4'!S40,'MDA3'!I40,'MDA3'!L40,V40,AD40)","v":922},{"$f":"MAX('MDA1'!L40,'MDA4'!T40,'MDA3'!J40,'MDA3'!M40,AF40)","v":0},922,33.264943271409379]
[{"$f":"IF(COUNTRY_INFO!A41=0,\" \",COUNTRY_INFO!A41)","v":"Gabon"},{"$f":"IF(COUNTRY_INFO!B41=0,\" \",COUNTRY_INFO!B41)","v":"Sud"},{"$f":"IF(COUNTRY_INFO!C41=0,\" \",COUNTRY_INFO!C41)","v":"Mongo"},{"$f":"COUNTRY_INFO!M41","v":0},null,null,{"$f":"MAX('MDA1'!M41,'MDA4'!U41)","v":0},{"$f":"IF(AND(COUNTRY_INFO!H41>0,COUNTRY_INFO!H41<4),IF(D41>MAX('MDA1'!M41,'MDA4'!U41),MAX('MDA1'!M41,'MDA4'!U41),D41),0)","v":0},{"$f":"IF(AND(COUNTRY_INFO!H41>0,COUNTRY_INFO!H41<4), IF(G41/D41*100<>0, IF(G41/D41*100>100,100,G41/D41*100), \"-\"),0)","v":0},{"$f":"COUNTRY_INFO!N41","v":3743},null,null,{"$f":"MAX('MDA1'!M41,MAX('MDA3'!I41,'MDA3'!L41)+MAX('MDA3'!J41,'MDA3'!M41))","v":0},{"$f":"IF(AND(COUNTRY_INFO!I41>0,COUNTRY_INFO!I41<4),IF(J41>MAX('MDA1'!M41,MAX('MDA3'!I41,'MDA3'!L41)+MAX('MDA3'!J41,'MDA3'!M41)),MAX('MDA1'!M41,MAX('MDA3'!I41,'MDA3'!L41)+MAX('MDA3'!J41,'MDA3'!M41)),J41),0)","v":0},{"$f":"IF(AND(COUNTRY_INFO!I41>0,COUNTRY_INFO!I41<4), IF(M41/J41*100<>0, IF(M41/J41*100>100,100,M41/J41*100), \"-\"),0)","v":"-"},{"$f":"COUNTRY_INFO!O41","v":1385},225,215,{"$f":"SUM(MAX('MDA4'!N41, 'T1'!L41, MAX(T3_R1!K41, T3_R2!K41)), MAX('MDA1'!K41, 'MDA4'!O41, 'T1'!M41, MAX(T3_R1!L41, T3_R2!L41)), MAX('MDA1'!L41, 'MDA4'!P41, 'T1'!N41, MAX(T3_R1!M41, T3_R2!M41)))","v":440},{"$f":"IF(AND(COUNTRY_INFO!J41>1,COUNTRY_INFO!J41<4),IF(COUNTRY_INFO!E41>MAX('MDA4'!N41,'T1'!L41,MAX(T3_R1!K41,T3_R2!K41)),MAX('MDA4'!N41,'T1'!L41,MAX(T3_R1!K41,T3_R2!K41)),COUNTRY_INFO!E41),0)","v":0},{"$f":"IF(AND(COUNTRY_INFO!J41>1,COUNTRY_INFO!J41<4), IF(T41/COUNTRY_INFO!E41*100<>0, IF(T41/COUNTRY_INFO!E41*100>100,100,T41/COUNTRY_INFO!E41*100), \"-\"),0)","v":"-"},{"$f":"IF(AND(COUNTRY_INFO!J41>1,COUNTRY_INFO!J41<4),IF(COUNTRY_INFO!F41>MAX('MDA1'!K41,'MDA4'!O41,'T1'!M41,MAX(T3_R1!L41,T3_R2!L41)),MAX('MDA1'!K41,'MDA4'!O41,'T1'!M41,MAX(T3_R1!L41,T3_R2!L41)),COUNTRY_INFO!F41),0)","v":440},{"$f":"IF(AND(COUNTRY_INFO!J41>1,COUNTRY_INFO!J41<4), IF(V41/COUNTRY_INFO!F41*100<>0, IF(V41/COUNTRY_INFO!F41*100>100,100,V41/COUNTRY_INFO!F41*100), \"-\"),0)","v":47.008547008547005},440,{"$f":"IF(AND(COUNTRY_INFO!J41>1,COUNTRY_INFO!J41<4), IF(S41/P41*100<>0, IF(X41/P41*100>100,100,X41/P41*100), \"-\"),0)","v":31.768953068592058},{"$f":"COUNTRY_INFO!P41","v":308.88},225,215,{"$f":"MAX('T1'!L41,'T2'!J41)+MAX('T1'!M41,'T2'!K41)+MAX('T1'!N41,'T2'!L41)","v":440},{"$f":"IF(COUNTRY_INFO!K41=1,IF(COUNTRY_INFO!F41*0.33>MAX('T1'!M41,'T2'!K41),MAX('T1'!M41,'T2'!K41),COUNTRY_INFO!F41*0.33),IF(COUNTRY_INFO!K41=2,IF(COUNTRY_INFO!F41*0.5>MAX('T1'!M41,'T2'!K41),MAX('T1'!M41,'T2'!K41),COUNTRY_INFO!F41*0.5),IF(COUNTRY_INFO!K41=3,IF(COUNTRY_INFO!F41>MAX('T1'!M41,'T2'!K41),MAX('T1'!M41,'T2'!K41),COUNTRY_INFO!F41),0)))","v":308.88},{"$f":"IF(AND(COUNTRY_INFO!K41>0,COUNTRY_INFO!K41<4),IF(Z41>0,IF(COUNTRY_INFO!K41=1, AD41/(COUNTRY_INFO!F41*0.33)*100, IF(COUNTRY_INFO!K41=2, AD41/(COUNTRY_INFO!F41*0.5)*100, IF(COUNTRY_INFO!K41=3, AD41/COUNTRY_INFO!F41*100))),\"-\"),0)","v":100},{"$f":"IF(COUNTRY_INFO!K41=2,IF(COUNTRY_INFO!G41*0.2>MAX('T1'!N41,'T2'!L41),MAX('T1'!N41,'T2'!L41),COUNTRY_INFO!G41*0.2),IF(COUNTRY_INFO!K41=3,IF(COUNTRY_INFO!G41>MAX('T1'!N41,'T2'!L41),MAX('T1'!N41,'T2'!L41),COUNTRY_INFO!G41),0))","v":0},{"$f":"IF(AND(COUNTRY_INFO!K41>0,COUNTRY_INFO!K41<4),IF(Z41>0,IF(COUNTRY_INFO!K41=1, 0, IF(COUNTRY_INFO!K41=2, AF41/(COUNTRY_INFO!G41*0.2)*100, IF(COUNTRY_INFO!K41=3, AF41/COUNTRY_INFO!G41*100))),\"-\"),0)","v":0},308.88,{"$f":"IF(AND(COUNTRY_INFO!K41>0,COUNTRY_INFO!K41<4), IF(AC41/Z41*100<>0, IF(AH41/Z41*100>100,100,AH41/Z41*100), \"-\"),0)","v":100},null,{"$f":"IF(AND(D41<>0, D41<>\"Inconnu\",D41<>\"Interrompu\",D41<>\"Non requis\"),D41/COUNTRY_INFO!D41, 0)","v":0},{"$f":"IF(AND(J41<>0,J41<>\"Inconnu\",J41<>\"Interrompu\",J41<>\"Non requis\"),J41/COUNTRY_INFO!D41, 0)","v":1},{"$f":"IF(AND(P41<>0,P41<>\"Inconnu\",P41<>\"Non requis\"),P41/(COUNTRY_INFO!E41+COUNTRY_INFO!F41), 0)","v":1},{"$f":"IF(AND(Z41<>0,Z41<>\"Inconnu\",Z41<>\"Non requis\"),IF(COUNTRY_INFO!K41=1,1,IF(COUNTRY_INFO!K41=2,0.5*COUNTRY_INFO!F41/(0.5*COUNTRY_INFO!F41+0.2*COUNTRY_INFO!G41),IF(COUNTRY_INFO!K41=3,COUNTRY_INFO!F41/(COUNTRY_INFO!F41+COUNTRY_INFO!G41)))),0)","v":1},{"$f":"IF(AND(Z41<>0,Z41<>\"Inconnu\",Z41<>\"Non requis\"),IF(COUNTRY_INFO!K41=1,0,IF(COUNTRY_INFO!K41=2,0.2*COUNTRY_INFO!G41/(0.5*COUNTRY_INFO!F41+0.2*COUNTRY_INFO!G41),IF(COUNTRY_INFO!K41=3,COUNTRY_INFO!G41/(COUNTRY_INFO!F41+COUNTRY_INFO!G41)))),0)","v":0},{"$f":"MAX(COUNTRY_INFO!D41*AK41*PROFILE!$G$7,COUNTRY_INFO!D41*AL41*PROFILE!$G$7)","v":149.70768344850279},{"$f":"MAX(COUNTRY_INFO!D41*AK41*PROFILE!$G$8,COUNTRY_INFO!D41*AL41*PROFILE!$G$8,COUNTRY_INFO!D41*AM41*PROFILE!$G$8)","v":449.15746423939765},{"$f":"MAX(COUNTRY_INFO!D41*AK41*PROFILE!$G$9,COUNTRY_INFO!D41*AL41*PROFILE!$G$9,COUNTRY_INFO!D41*AM41*PROFILE!$G$9,IF(AND(DISTRICT!Z41<>\"Inconnu\",Z41<>\"Non requis\"),COUNTRY_INFO!P41*DISTRICT!AN41,0))","v":935.7608675454386},{"$f":"MAX(COUNTRY_INFO!D41*AK41*PROFILE!$G$10,COUNTRY_INFO!D41*AL41*PROFILE!$G$10,IF(AND(DISTRICT!Z41<>\"Inconnu\",Z41<>\"Non requis\"),COUNTRY_INFO!P41*DISTRICT!AO41,0))","v":2208.3739847666607},3742.9999999999995,{"$f":"IF(COUNTIFS(AK41:AN41,\">0\")=0,0, IF(COUNTIFS(AK41:AN41,\">0\")<=IF(AND(OR(D41>=0,D41=\"Non requis\",D41=\"Inconnu\",D41=\"Interrompu\"),D41>0,H41>0),1,0)+IF(AND(OR(J41>=0,J41=\"Non requis\",J41=\"Inconnu\",J41=\"Interrompu\"),J41>0,N41>0),1,0)+IF(AND(OR(P41>=0,P41=\"Non requis\",P41=\"Inconnu\"),P41>0,X41>0),1,0)+IF(AND(OR(Z41>=0,Z41=\"Non requis\",Z41=\"Inconnu\"),Z41>0,AH41>0),1,0),\"Y\",0))","v":0},{"$f":"MAX('MDA4'!R41,'T1'!L41,'T2'!J41,T3_R1!K41,T3_R2!K41)","v":0},{"$f":"MAX('MDA1'!K41,'MDA4'!S41,'MDA3'!I41,'MDA3'!L41,'T1'!M41,'T2'!K41,T3_R1!L41,T3_R2!L41)","v":440},{"$f":"MAX('MDA1'!L41,'MDA4'!T41,'MDA3'!J41,'MDA3'!M41,'T1'!N41,'T2'!L41,T3_R1!M41,T3_R2!M41)","v":0},440,{"$f":"MAX('MDA4'!R41,T41)","v":0},{"$f":"MAX('MDA1'!K41,'MDA4'!S41,'MDA3'!I41,'MDA3'!L41,V41,AD41)","v":440},{"$f":"MAX('MDA1'!L41,'MDA4'!T41,'MDA3'!J41,'MDA3'!M41,AF41)","v":0},{"$f":"IF(AT41<SUM(AZ41:BB41), AT41,SUM(AZ41:BB41))","v":440},{"$f":"IF(AT41<>0,BC41/AT41*100,0)","v":11.755276516163507}]
[{"$f":"IF(COUNTRY_INFO!A42=0,\" \",COUNTRY_INFO!A42)","v":"Gabon"},{"$f":"IF(COUNTRY_INFO!B42=0,\" \",COUNTRY_INFO!B42)","v":"Sud"},{"$f":"IF(COUNTRY_INFO!C42=0,\" \",COUNTRY_INFO!C42)","v":"Haute-Banio"},{"$f":"COUNTRY_INFO!M42","v":0},null,null,{"$f":"MAX('MDA1'!M42,'MDA4'!U42)","v":0},{"$f":"IF(AND(COUNTRY_INFO!H42>0,COUNTRY_INFO!H42<4),IF(D42>MAX('MDA1'!M42,'MDA4'!U42),MAX('MDA1'!M42,'MDA4'!U42),D42),0)","v":0},{"$f":"IF(AND(COUNTRY_INFO!H42>0,COUNTRY_INFO!H42<4), IF(G42/D42*100<>0, IF(G42/D42*100>100,100,G42/D42*100), \"-\"),0)","v":0},{"$f":"COUNTRY_INFO!N42","v":"Inconnu"},null,null,{"$f":"MAX('MDA1'!M42,MAX('MDA3'!I42,'MDA3'!L42)+MAX('MDA3'!J42,'MDA3'!M42))","v":0},{"$f":"IF(AND(COUNTRY_INFO!I42>0,COUNTRY_INFO!I42<4),IF(J42>MAX('MDA1'!M42,MAX('MDA3'!I42,'MDA3'!L42)+MAX('MDA3'!J42,'MDA3'!M42)),MAX('MDA1'!M42,MAX('MDA3'!I42,'MDA3'!L42)+MAX('MDA3'!J42,'MDA3'!M42)),J42),0)","v":0},{"$f":"IF(AND(COUNTRY_INFO!I42>0,COUNTRY_INFO!I42<4), IF(M42/J42*100<>0, IF(M42/J42*100>100,100,M42/J42*100), \"-\"),0)","v":0},{"$f":"COUNTRY_INFO!O42","v":697},159,135,{"$f":"SUM(MAX('MDA4'!N42, 'T1'!L42, MAX(T3_R1!K42, T3_R2!K42)), MAX('MDA1'!K42, 'MDA4'!O42, 'T1'!M42, MAX(T3_R1!L42, T3_R2!L42)), MAX('MDA1'!L42, 'MDA4'!P42, 'T1'!N42, MAX(T3_R1!M42, T3_R2!M42)))","v":294},{"$f":"IF(AND(COUNTRY_INFO!J42>1,COUNTRY_INFO!J42<4),IF(COUNTRY_INFO!E42>MAX('MDA4'!N42,'T1'!L42,MAX(T3_R1!K42,T3_R2!K42)),MAX('MDA4'!N42,'T1'!L42,MAX(T3_R1!K42,T3_R2!K42)),COUNTRY_INFO!E42),0)","v":0},{"$f":"IF(AND(COUNTRY_INFO!J42>1,COUNTRY_INFO!J42<4), IF(T42/COUNTRY_INFO!E42*100<>0, IF(T42/COUNTRY_INFO!E42*100>100,100,T42/COUNTRY_INFO!E42*100), \"-\"),0)","v":"-"},{"$f":"IF(AND(COUNTRY_INFO!J42>1,COUNTRY_INFO!J42<4),IF(COUNTRY_INFO!F42>MAX('MDA1'!K42,'MDA4'!O42,'T1'!M42,MAX(T3_R1!L42,T3_R2!L42)),MAX('MDA1'!K42,'MDA4'!O42,'T1'!M42,MAX(T3_R1!L42,T3_R2!L42)),COUNTRY_INFO!F42),0)","v":294},{"$f":"IF(AND(COUNTRY_INFO!J42>1,COUNTRY_INFO!J42<4), IF(V42/COUNTRY_INFO!F42*100<>0, IF(V42/COUNTRY_INFO!F42*100>100,100,V42/COUNTRY_INFO!F42*100), \"-\"),0)","v":62.420382165605091},294,{"$f":"IF(AND(COUNTRY_INFO!J42>1,COUNTRY_INFO!J42<4), IF(S42/P42*100<>0, IF(X42/P42*100>100,100,X42/P42*100), \"-\"),0)","v":42.180774748923959},{"$f":"COUNTRY_INFO!P42","v":0},null,null,{"$f":"MAX('T1'!L42,'T2'!J42)+MAX('T1'!M42,'T2'!K42)+MAX('T1'!N42,'T2'!L42)","v":0},{"$f":"IF(COUNTRY_INFO!K42=1,IF(COUNTRY_INFO!F42*0.33>MAX('T1'!M42,'T2'!K42),MAX('T1'!M42,'T2'!K42),COUNTRY_INFO!F42*0.33),IF(COUNTRY_INFO!K42=2,IF(COUNTRY_INFO!F42*0.5>MAX('T1'!M42,'T2'!K42),MAX('T1'!M42,'T2'!K42),COUNTRY_INFO!F42*0.5),IF(COUNTRY_INFO!K42=3,IF(COUNTRY_INFO!F42>MAX('T1'!M42,'T2'!K42),MAX('T1'!M42,'T2'!K42),COUNTRY_INFO!F42),0)))","v":0},{"$f":"IF(AND(COUNTRY_INFO!K42>0,COUNTRY_INFO!K42<4),IF(Z42>0,IF(COUNTRY_INFO!K42=1, AD42/(COUNTRY_INFO!F42*0.33)*100, IF(COUNTRY_INFO!K42=2, AD42/(COUNTRY_INFO!F42*0.5)*100, IF(COUNTRY_INFO!K42=3, AD42/COUNTRY_INFO!F42*100))),\"-\"),0)","v":0},{"$f":"IF(COUNTRY_INFO!K42=2,IF(COUNTRY_INFO!G42*0.2>MAX('T1'!N42,'T2'!L42),MAX('T1'!N42,'T2'!L42),COUNTRY_INFO!G42*0.2),IF(COUNTRY_INFO!K42=3,IF(COUNTRY_INFO!G42>MAX('T1'!N42,'T2'!L42),MAX('T1'!N42,'T2'!L42),COUNTRY_INFO!G42),0))","v":0},{"$f":"IF(AND(COUNTRY_INFO!K42>0,COUNTRY_INFO!K42<4),IF(Z42>0,IF(COUNTRY_INFO!K42=1, 0, IF(COUNTRY_INFO!K42=2, AF42/(COUNTRY_INFO!G42*0.2)*100, IF(COUNTRY_INFO!K42=3, AF42/COUNTRY_INFO!G42*100))),\"-\"),0)","v":0},0,{"$f":"IF(AND(COUNTRY_INFO!K42>0,COUNTRY_INFO!K42<4), IF(AC42/Z42*100<>0, IF(AH42/Z42*100>100,100,AH42/Z42*100), \"-\"),0)","v":0},null,{"$f":"IF(AND(D42<>0, D42<>\"Inconnu\",D42<>\"Interrompu\",D42<>\"Non requis\"),D42/COUNTRY_INFO!D42, 0)","v":0},{"$f":"IF(AND(J42<>0,J42<>\"Inconnu\",J42<>\"Interrompu\",J42<>\"Non requis\"),J42/COUNTRY_INFO!D42, 0)","v":0},{"$f":"IF(AND(P42<>0,P42<>\"Inconnu\",P42<>\"Non requis\"),P42/(COUNTRY_INFO!E42+COUNTRY_INFO!F42), 0)","v":1},{"$f":"IF(AND(Z42<>0,Z42<>\"Inconnu\",Z42<>\"Non requis\"),IF(COUNTRY_INFO!K42=1,1,IF(COUNTRY_INFO!K42=2,0.5*COUNTRY_INFO!F42/(0.5*COUNTRY_INFO!F42+0.2*COUNTRY_INFO!G42),IF(COUNTRY_INFO!K42=3,COUNTRY_INFO!F42/(COUNTRY_INFO!F42+COUNTRY_INFO!G42)))),0)","v":0},{"$f":"IF(AND(Z42<>0,Z42<>\"Inconnu\",Z42<>\"Non requis\"),IF(COUNTRY_INFO!K42=1,0,IF(COUNTRY_INFO!K42=2,0.2*COUNTRY_INFO!G42/(0.5*COUNTRY_INFO!F42+0.2*COUNTRY_INFO!G42),IF(COUNTRY_INFO!K42=3,COUNTRY_INFO!G42/(COUNTRY_INFO!F42+COUNTRY_INFO!G42)))),0)","v":0},{"$f":"MAX(COUNTRY_INFO!D42*AK42*PROFILE!$G$7,COUNTRY_INFO!D42*AL42*PROFILE!$G$7)","v":0},{"$f":"MAX(COUNTRY_INFO!D42*AK42*PROFILE!$G$8,COUNTRY_INFO!D42*AL42*PROFILE!$G$8,COUNTRY_INFO!D42*AM42*PROFILE!$G$8)","v":226.07872365135592},{"$f":"MAX(COUNTRY_INFO!D42*AK42*PROFILE!$G$9,COUNTRY_INFO!D42*AL42*PROFILE!$G$9,COUNTRY_INFO!D42*AM42*PROFILE!$G$9,IF(AND(DISTRICT!Z42<>\"Inconnu\",Z42<>\"Non requis\"),COUNTRY_INFO!P42*DISTRICT!AN42,0))","v":471.00547006561754},{"$f":"MAX(COUNTRY_INFO!D42*AK42*PROFILE!$G$10,COUNTRY_INFO!D42*AL42*PROFILE!$G$10,IF(AND(DISTRICT!Z42<>\"Inconnu\",Z42<>\"Non requis\"),COUNTRY_INFO!P42*DISTRICT!AO42,0))","v":0},697.08419371697346,"Y",{"$f":"MAX('MDA4'!R42,'T1'!L42,'T2'!J42,T3_R1!K42,T3_R2!K42)","v":0},{"$f":"MAX('MDA1'!K42,'MDA4'!S42,'MDA3'!I42,'MDA3'!L42,'T1'!M42,'T2'!K42,T3_R1!L42,T3_R2!L42)","v":294},{"$f":"MAX('MDA1'!L42,'MDA4'!T42,'MDA3'!J42,'MDA3'!M42,'T1'!N42,'T2'!L42,T3_R1!M42,T3_R2!M42)","v":0},294,{"$f":"MAX('MDA4'!R42,T42)","v":0},{"$f":"MAX('MDA1'!K42,'MDA4'!S42,'MDA3'!I42,'MDA3'!L42,V42,AD42)","v":294},{"$f":"MAX('MDA1'!L42,'MDA4'!T42,'MDA3'!J42,'MDA3'!M42,AF42)","v":0},294,42.175680161723527]
[{"$f":"IF(COUNTRY_INFO!A43=0,\" \",COUNTRY_INFO!A43)","v":"Gabon"},{"$f":"IF(COUNTRY_INFO!B43=0,\" \",COUNTRY_INFO!B43)","v":"Sud"},{"$f":"IF(COUNTRY_INFO!C43=0,\" \",COUNTRY_INFO!C43)","v":"Mougoutsi"},{"$f":"COUNTRY_INFO!M43","v":0},null,null,{"$f":"MAX('MDA1'!M43,'MDA4'!U43)","v":0},{"$f":"IF(AND(COUNTRY_INFO!H43>0,COUNTRY_INFO!H43<4),IF(D43>MAX('MDA1'!M43,'MDA4'!U43),MAX('MDA1'!M43,'MDA4'!U43),D43),0)","v":0},{"$f":"IF(AND(COUNTRY_INFO!H43>0,COUNTRY_INFO!H43<4), IF(G43/D43*100<>0, IF(G43/D43*100>100,100,G43/D43*100), \"-\"),0)","v":0},{"$f":"COUNTRY_INFO!N43","v":31732},null,null,{"$f":"MAX('MDA1'!M43,MAX('MDA3'!I43,'MDA3'!L43)+MAX('MDA3'!J43,'MDA3'!M43))","v":0},{"$f":"IF(AND(COUNTRY_INFO!I43>0,COUNTRY_INFO!I43<4),IF(J43>MAX('MDA1'!M43,MAX('MDA3'!I43,'MDA3'!L43)+MAX('MDA3'!J43,'MDA3'!M43)),MAX('MDA1'!M43,MAX('MDA3'!I43,'MDA3'!L43)+MAX('MDA3'!J43,'MDA3'!M43)),J43),0)","v":0},{"$f":"IF(AND(COUNTRY_INFO!I43>0,COUNTRY_INFO!I43<4), IF(M43/J43*100<>0, IF(M43/J43*100>100,100,M43/J43*100), \"-\"),0)","v":"-"},{"$f":"COUNTRY_INFO!O43","v":11741},1653,1712,{"$f":"SUM(MAX('MDA4'!N43, 'T1'!L43, MAX(T3_R1!K43, T3_R2!K43)), MAX('MDA1'!K43, 'MDA4'!O43, 'T1'!M43, MAX(T3_R1!L43, T3_R2!L43)), MAX('MDA1'!L43, 'MDA4'!P43, 'T1'!N43, MAX(T3_R1!M43, T3_R2!M43)))","v":3365},{"$f":"IF(AND(COUNTRY_INFO!J43>1,COUNTRY_INFO!J43<4),IF(COUNTRY_INFO!E43>MAX('MDA4'!N43,'T1'!L43,MAX(T3_R1!K43,T3_R2!K43)),MAX('MDA4'!N43,'T1'!L43,MAX(T3_R1!K43,T3_R2!K43)),COUNTRY_INFO!E43),0)","v":0},{"$f":"IF(AND(COUNTRY_INFO!J43>1,COUNTRY_INFO!J43<4), IF(T43/COUNTRY_INFO!E43*100<>0, IF(T43/COUNTRY_INFO!E43*100>100,100,T43/COUNTRY_INFO!E43*100), \"-\"),0)","v":"-"},{"$f":"IF(AND(COUNTRY_INFO!J43>1,COUNTRY_INFO!J43<4),IF(COUNTRY_INFO!F43>MAX('MDA1'!K43,'MDA4'!O43,'T1'!M43,MAX(T3_R1!L43,T3_R2!L43)),MAX('MDA1'!K43,'MDA4'!O43,'T1'!M43,MAX(T3_R1!L43,T3_R2!L43)),COUNTRY_INFO!F43),0)","v":3365},{"$f":"IF(AND(COUNTRY_INFO!J43>1,COUNTRY_INFO!J43<4), IF(V43/COUNTRY_INFO!F43*100<>0, IF(V43/COUNTRY_INFO!F43*100>100,100,V43/COUNTRY_INFO!F43*100), \"-\"),0)","v":42.417748644901046},3365,{"$f":"IF(AND(COUNTRY_INFO!J43>1,COUNTRY_INFO!J43<4), IF(S43/P43*100<>0, IF(X43/P43*100>100,100,X43/P43*100), \"-\"),0)","v":28.660250404565197},{"$f":"COUNTRY_INFO!P43","v":2617.8900000000003},1653,1712,{"$f":"MAX('T1'!L43,'T2'!J43)+MAX('T1'!M43,'T2'!K43)+MAX('T1'!N43,'T2'!L43)","v":3365},{"$f":"IF(COUNTRY_INFO!K43=1,IF(COUNTRY_INFO!F43*0.33>MAX('T1'!M43,'T2'!K43),MAX('T1'!M43,'T2'!K43),COUNTRY_INFO!F43*0.33),IF(COUNTRY_INFO!K43=2,IF(COUNTRY_INFO!F43*0.5>MAX('T1'!M43,'T2'!K43),MAX('T1'!M43,'T2'!K43),COUNTRY_INFO!F43*0.5),IF(COUNTRY_INFO!K43=3,IF(COUNTRY_INFO!F43>MAX('T1'!M43,'T2'!K43),MAX('T1'!M43,'T2'!K43),COUNTRY_INFO!F43),0)))","v":2617.8900000000003},{"$f":"IF(AND(COUNTRY_INFO!K43>0,COUNTRY_INFO!K43<4),IF(Z43>0,IF(COUNTRY_INFO!K43=1, AD43/(COUNTRY_INFO!F43*0.33)*100, IF(COUNTRY_INFO!K43=2, AD43/(COUNTRY_INFO!F43*0.5)*100, IF(COUNTRY_INFO!K43=3, AD43/COUNTRY_INFO!F43*100))),\"-\"),0)","v":100},{"$f":"IF(COUNTRY_INFO!K43=2,IF(COUNTRY_INFO!G43*0.2>MAX('T1'!N43,'T2'!L43),MAX('T1'!N43,'T2'!L43),COUNTRY_INFO!G43*0.2),IF(COUNTRY_INFO!K43=3,IF(COUNTRY_INFO!G43>MAX('T1'!N43,'T2'!L43),MAX('T1'!N43,'T2'!L43),COUNTRY_INFO!G43),0))","v":0},{"$f":"IF(AND(COUNTRY_INFO!K43>0,COUNTRY_INFO!K43<4),IF(Z43>0,IF(COUNTRY_INFO!K43=1, 0, IF(COUNTRY_INFO!K43=2, AF43/(COUNTRY_INFO!G43*0.2)*100, IF(COUNTRY_INFO!K43=3, AF43/COUNTRY_INFO!G43*100))),\"-\"),0)","v":0},2617.8900000000003,{"$f":"IF(AND(COUNTRY_INFO!K43>0,COUNTRY_INFO!K43<4), IF(AC43/Z43*100<>0, IF(AH43/Z43*100>100,100,AH43/Z43*100), \"-\"),0)","v":100},null,{"$f":"IF(AND(D43<>0, D43<>\"Inconnu\",D43<>\"Interrompu\",D43<>\"Non requis\"),D43/COUNTRY_INFO!D43, 0)","v":0},{"$f":"IF(AND(J43<>0,J43<>\"Inconnu\",J43<>\"Interrompu\",J43<>\"Non requis\"),J43/COUNTRY_INFO!D43, 0)","v":1},{"$f":"IF(AND(P43<>0,P43<>\"Inconnu\",P43<>\"Non requis\"),P43/(COUNTRY_INFO!E43+COUNTRY_INFO!F43), 0)","v":1},{"$f":"IF(AND(Z43<>0,Z43<>\"Inconnu\",Z43<>\"Non requis\"),IF(COUNTRY_INFO!K43=1,1,IF(COUNTRY_INFO!K43=2,0.5*COUNTRY_INFO!F43/(0.5*COUNTRY_INFO!F43+0.2*COUNTRY_INFO!G43),IF(COUNTRY_INFO!K43=3,COUNTRY_INFO!F43/(COUNTRY_INFO!F43+COUNTRY_INFO!G43)))),0)","v":1},{"$f":"IF(AND(Z43<>0,Z43<>\"Inconnu\",Z43<>\"Non requis\"),IF(COUNTRY_INFO!K43=1,0,IF(COUNTRY_INFO!K43=2,0.2*COUNTRY_INFO!G43/(0.5*COUNTRY_INFO!F43+0.2*COUNTRY_INFO!G43),IF(COUNTRY_INFO!K43=3,COUNTRY_INFO!G43/(COUNTRY_INFO!F43+COUNTRY_INFO!G43)))),0)","v":0},{"$f":"MAX(COUNTRY_INFO!D43*AK43*PROFILE!$G$7,COUNTRY_INFO!D43*AL43*PROFILE!$G$7)","v":1269.1755840737083},{"$f":"MAX(COUNTRY_INFO!D43*AK43*PROFILE!$G$8,COUNTRY_INFO!D43*AL43*PROFILE!$G$8,COUNTRY_INFO!D43*AM43*PROFILE!$G$8)","v":3807.8185026034107},{"$f":"MAX(COUNTRY_INFO!D43*AK43*PROFILE!$G$9,COUNTRY_INFO!D43*AL43*PROFILE!$G$9,COUNTRY_INFO!D43*AM43*PROFILE!$G$9,IF(AND(DISTRICT!Z43<>\"Inconnu\",Z43<>\"Non requis\"),COUNTRY_INFO!P43*DISTRICT!AN43,0))","v":7933.0921316996682},{"$f":"MAX(COUNTRY_INFO!D43*AK43*PROFILE!$G$10,COUNTRY_INFO!D43*AL43*PROFILE!$G$10,IF(AND(DISTRICT!Z43<>\"Inconnu\",Z43<>\"Non requis\"),COUNTRY_INFO!P43*DISTRICT!AO43,0))","v":18721.913781623211},31732,0,{"$f":"MAX('MDA4'!R43,'T1'!L43,'T2'!J43,T3_R1!K43,T3_R2!K43)","v":0},{"$f":"MAX('MDA1'!K43,'MDA4'!S43,'MDA3'!I43,'MDA3'!L43,'T1'!M43,'T2'!K43,T3_R1!L43,T3_R2!L43)","v":3365},{"$f":"MAX('MDA1'!L43,'MDA4'!T43,'MDA3'!J43,'MDA3'!M43,'T1'!N43,'T2'!L43,T3_R1!M43,T3_R2!M43)","v":0},3365,{"$f":"MAX('MDA4'!R43,T43)","v":0},{"$f":"MAX('MDA1'!K43,'MDA4'!S43,'MDA3'!I43,'MDA3'!L43,V43,AD43)","v":3365},{"$f":"MAX('MDA1'!L43,'MDA4'!T43,'MDA3'!J43,'MDA3'!M43,AF43)","v":0},3365,10.604437161225261]
[{"$f":"IF(COUNTRY_INFO!A44=0,\" \",COUNTRY_INFO!A44)","v":"Gabon"},{"$f":"IF(COUNTRY_INFO!B44=0,\" \",COUNTRY_INFO!B44)","v":"Est"},{"$f":"IF(COUNTRY_INFO!C44=0,\" \",COUNTRY_INFO!C44)","v":"Lopé"},{"$f":"COUNTRY_INFO!M44","v":15841},null,null,{"$f":"MAX('MDA1'!M44,'MDA4'!U44)","v":0},{"$f":"IF(AND(COUNTRY_INFO!H44>0,COUNTRY_INFO!H44<4),IF(D44>MAX('MDA1'!M44,'MDA4'!U44),MAX('MDA1'!M44,'MDA4'!U44),D44),0)","v":0},{"$f":"IF(AND(COUNTRY_INFO!H44>0,COUNTRY_INFO!H44<4), IF(G44/D44*100<>0, IF(G44/D44*100>100,100,G44/D44*100), \"-\"),0)","v":"-"},{"$f":"COUNTRY_INFO!N44","v":15841},null,null,{"$f":"MAX('MDA1'!M44,MAX('MDA3'!I44,'MDA3'!L44)+MAX('MDA3'!J44,'MDA3'!M44))","v":0},{"$f":"IF(AND(COUNTRY_INFO!I44>0,COUNTRY_INFO!I44<4),IF(J44>MAX('MDA1'!M44,MAX('MDA3'!I44,'MDA3'!L44)+MAX('MDA3'!J44,'MDA3'!M44)),MAX('MDA1'!M44,MAX('MDA3'!I44,'MDA3'!L44)+MAX('MDA3'!J44,'MDA3'!M44)),J44),0)","v":0},{"$f":"IF(AND(COUNTRY_INFO!I44>0,COUNTRY_INFO!I44<4), IF(M44/J44*100<>0, IF(M44/J44*100>100,100,M44/J44*100), \"-\"),0)","v":"-"},{"$f":"COUNTRY_INFO!O44","v":5861},642,589,{"$f":"SUM(MAX('MDA4'!N44, 'T1'!L44, MAX(T3_R1!K44, T3_R2!K44)), MAX('MDA1'!K44, 'MDA4'!O44, 'T1'!M44, MAX(T3_R1!L44, T3_R2!L44)), MAX('MDA1'!L44, 'MDA4'!P44, 'T1'!N44, MAX(T3_R1!M44, T3_R2!M44)))","v":1231},{"$f":"IF(AND(COUNTRY_INFO!J44>1,COUNTRY_INFO!J44<4),IF(COUNTRY_INFO!E44>MAX('MDA4'!N44,'T1'!L44,MAX(T3_R1!K44,T3_R2!K44)),MAX('MDA4'!N44,'T1'!L44,MAX(T3_R1!K44,T3_R2!K44)),COUNTRY_INFO!E44),0)","v":0},{"$f":"IF(AND(COUNTRY_INFO!J44>1,COUNTRY_INFO!J44<4), IF(T44/COUNTRY_INFO!E44*100<>0, IF(T44/COUNTRY_INFO!E44*100>100,100,T44/COUNTRY_INFO!E44*100), \"-\"),0)","v":"-"},{"$f":"IF(AND(COUNTRY_INFO!J44>1,COUNTRY_INFO!J44<4),IF(COUNTRY_INFO!F44>MAX('MDA1'!K44,'MDA4'!O44,'T1'!M44,MAX(T3_R1!L44,T3_R2!L44)),MAX('MDA1'!K44,'MDA4'!O44,'T1'!M44,MAX(T3_R1!L44,T3_R2!L44)),COUNTRY_INFO!F44),0)","v":1231},{"$f":"IF(AND(COUNTRY_INFO!J44>1,COUNTRY_INFO!J44<4), IF(V44/COUNTRY_INFO!F44*100<>0, IF(V44/COUNTRY_INFO!F44*100>100,100,V44/COUNTRY_INFO!F44*100), \"-\"),0)","v":31.085858585858585},1231,{"$f":"IF(AND(COUNTRY_INFO!J44>1,COUNTRY_INFO!J44<4), IF(S44/P44*100<>0, IF(X44/P44*100>100,100,X44/P44*100), \"-\"),0)","v":21.003241767616448},{"$f":"COUNTRY_INFO!P44","v":1306.8},642,589,{"$f":"MAX('T1'!L44,'T2'!J44)+MAX('T1'!M44,'T2'!K44)+MAX('T1'!N44,'T2'!L44)","v":1231},{"$f":"IF(COUNTRY_INFO!K44=1,IF(COUNTRY_INFO!F44*0.33>MAX('T1'!M44,'T2'!K44),MAX('T1'!M44,'T2'!K44),COUNTRY_INFO!F44*0.33),IF(COUNTRY_INFO!K44=2,IF(COUNTRY_INFO!F44*0.5>MAX('T1'!M44,'T2'!K44),MAX('T1'!M44,'T2'!K44),COUNTRY_INFO!F44*0.5),IF(COUNTRY_INFO!K44=3,IF(COUNTRY_INFO!F44>MAX('T1'!M44,'T2'!K44),MAX('T1'!M44,'T2'!K44),COUNTRY_INFO!F44),0)))","v":1231},{"$f":"IF(AND(COUNTRY_INFO!K44>0,COUNTRY_INFO!K44<4),IF(Z44>0,IF(COUNTRY_INFO!K44=1, AD44/(COUNTRY_INFO!F44*0.33)*100, IF(COUNTRY_INFO!K44=2, AD44/(COUNTRY_INFO!F44*0.5)*100, IF(COUNTRY_INFO!K44=3, AD44/COUNTRY_INFO!F44*100))),\"-\"),0)","v":94.199571472298743},{"$f":"IF(COUNTRY_INFO!K44=2,IF(COUNTRY_INFO!G44*0.2>MAX('T1'!N44,'T2'!L44),MAX('T1'!N44,'T2'!L44),COUNTRY_INFO!G44*0.2),IF(COUNTRY_INFO!K44=3,IF(COUNTRY_INFO!G44>MAX('T1'!N44,'T2'!L44),MAX('T1'!N44,'T2'!L44),COUNTRY_INFO!G44),0))","v":0},{"$f":"IF(AND(COUNTRY_INFO!K44>0,COUNTRY_INFO!K44<4),IF(Z44>0,IF(COUNTRY_INFO!K44=1, 0, IF(COUNTRY_INFO!K44=2, AF44/(COUNTRY_INFO!G44*0.2)*100, IF(COUNTRY_INFO!K44=3, AF44/COUNTRY_INFO!G44*100))),\"-\"),0)","v":0},1231,{"$f":"IF(AND(COUNTRY_INFO!K44>0,COUNTRY_INFO!K44<4), IF(AC44/Z44*100<>0, IF(AH44/Z44*100>100,100,AH44/Z44*100), \"-\"),0)","v":94.199571472298743},null,{"$f":"IF(AND(D44<>0, D44<>\"Inconnu\",D44<>\"Interrompu\",D44<>\"Non requis\"),D44/COUNTRY_INFO!D44, 0)","v":1},{"$f":"IF(AND(J44<>0,J44<>\"Inconnu\",J44<>\"Interrompu\",J44<>\"Non requis\"),J44/COUNTRY_INFO!D44, 0)","v":1},{"$f":"IF(AND(P44<>0,P44<>\"Inconnu\",P44<>\"Non requis\"),P44/(COUNTRY_INFO!E44+COUNTRY_INFO!F44), 0)","v":1},{"$f":"IF(AND(Z44<>0,Z44<>\"Inconnu\",Z44<>\"Non requis\"),IF(COUNTRY_INFO!K44=1,1,IF(COUNTRY_INFO!K44=2,0.5*COUNTRY_INFO!F44/(0.5*COUNTRY_INFO!F44+0.2*COUNTRY_INFO!G44),IF(COUNTRY_INFO!K44=3,COUNTRY_INFO!F44/(COUNTRY_INFO!F44+COUNTRY_INFO!G44)))),0)","v":1},{"$f":"IF(AND(Z44<>0,Z44<>\"Inconnu\",Z44<>\"Non requis\"),IF(COUNTRY_INFO!K44=1,0,IF(COUNTRY_INFO!K44=2,0.2*COUNTRY_INFO!G44/(0.5*COUNTRY_INFO!F44+0.2*COUNTRY_INFO!G44),IF(COUNTRY_INFO!K44=3,COUNTRY_INFO!G44/(COUNTRY_INFO!F44+COUNTRY_INFO!G44)))),0)","v":0},{"$f":"MAX(COUNTRY_INFO!D44*AK44*PROFILE!$G$7,COUNTRY_INFO!D44*AL44*PROFILE!$G$7)","v":633.58787430075677},{"$f":"MAX(COUNTRY_INFO!D44*AK44*PROFILE!$G$8,COUNTRY_INFO!D44*AL44*PROFILE!$G$8,COUNTRY_INFO!D44*AM44*PROFILE!$G$8)","v":1900.9092682383912},{"$f":"MAX(COUNTRY_INFO!D44*AK44*PROFILE!$G$9,COUNTRY_INFO!D44*AL44*PROFILE!$G$9,COUNTRY_INFO!D44*AM44*PROFILE!$G$9,IF(AND(DISTRICT!Z44<>\"Inconnu\",Z44<>\"Non requis\"),COUNTRY_INFO!P44*DISTRICT!AN44,0))","v":3960.2959932640379},{"$f":"MAX(COUNTRY_INFO!D44*AK44*PROFILE!$G$10,COUNTRY_INFO!D44*AL44*PROFILE!$G$10,IF(AND(DISTRICT!Z44<>\"Inconnu\",Z44<>\"Non requis\"),COUNTRY_INFO!P44*DISTRICT!AO44,0))","v":9346.2068641968126},15840.999999999998,0,{"$f":"MAX('MDA4'!R44,'T1'!L44,'T2'!J44,T3_R1!K44,T3_R2!K44)","v":0},{"$f":"MAX('MDA1'!K44,'MDA4'!S44,'MDA3'!I44,'MDA3'!L44,'T1'!M44,'T2'!K44,T3_R1!L44,T3_R2!L44)","v":1231},{"$f":"MAX('MDA1'!L44,'MDA4'!T44,'MDA3'!J44,'MDA3'!M44,'T1'!N44,'T2'!L44,T3_R1!M44,T3_R2!M44)","v":0},1231,{"$f":"MAX('MDA4'!R44,T44)","v":0},{"$f":"MAX('MDA1'!K44,'MDA4'!S44,'MDA3'!I44,'MDA3'!L44,V44,AD44)","v":1231},{"$f":"MAX('MDA1'!L44,'MDA4'!T44,'MDA3'!J44,'MDA3'!M44,AF44)","v":0},1231,7.7709740546682671]
[{"$f":"IF(COUNTRY_INFO!A45=0,\" \",COUNTRY_INFO!A45)","v":"Gabon"},{"$f":"IF(COUNTRY_INFO!B45=0,\" \",COUNTRY_INFO!B45)","v":"Est"},{"$f":"IF(COUNTRY_INFO!C45=0,\" \",COUNTRY_INFO!C45)","v":"Ivindo"},{"$f":"COUNTRY_INFO!M45","v":34879},null,null,{"$f":"MAX('MDA1'!M45,'MDA4'!U45)","v":0},{"$f":"IF(AND(COUNTRY_INFO!H45>0,COUNTRY_INFO!H45<4),IF(D45>MAX('MDA1'!M45,'MDA4'!U45),MAX('MDA1'!M45,'MDA4'!U45),D45),0)","v":0},{"$f":"IF(AND(COUNTRY_INFO!H45>0,COUNTRY_INFO!H45<4), IF(G45/D45*100<>0, IF(G45/D45*100>100,100,G45/D45*100), \"-\"),0)","v":"-"},{"$f":"COUNTRY_INFO!N45","v":34879},null,null,{"$f":"MAX('MDA1'!M45,MAX('MDA3'!I45,'MDA3'!L45)+MAX('MDA3'!J45,'MDA3'!M45))","v":0},{"$f":"IF(AND(COUNTRY_INFO!I45>0,COUNTRY_INFO!I45<4),IF(J45>MAX('MDA1'!M45,MAX('MDA3'!I45,'MDA3'!L45)+MAX('MDA3'!J45,'MDA3'!M45)),MAX('MDA1'!M45,MAX('MDA3'!I45,'MDA3'!L45)+MAX('MDA3'!J45,'MDA3'!M45)),J45),0)","v":0},{"$f":"IF(AND(COUNTRY_INFO!I45>0,COUNTRY_INFO!I45<4), IF(M45/J45*100<>0, IF(M45/J45*100>100,100,M45/J45*100), \"-\"),0)","v":"-"},{"$f":"COUNTRY_INFO!O45","v":12905},2010,1976,{"$f":"SUM(MAX('MDA4'!N45, 'T1'!L45, MAX(T3_R1!K45, T3_R2!K45)), MAX('MDA1'!K45, 'MDA4'!O45, 'T1'!M45, MAX(T3_R1!L45, T3_R2!L45)), MAX('MDA1'!L45, 'MDA4'!P45, 'T1'!N45, MAX(T3_R1!M45, T3_R2!M45)))","v":3986},{"$f":"IF(AND(COUNTRY_INFO!J45>1,COUNTRY_INFO!J45<4),IF(COUNTRY_INFO!E45>MAX('MDA4'!N45,'T1'!L45,MAX(T3_R1!K45,T3_R2!K45)),MAX('MDA4'!N45,'T1'!L45,MAX(T3_R1!K45,T3_R2!K45)),COUNTRY_INFO!E45),0)","v":0},{"$f":"IF(AND(COUNTRY_INFO!J45>1,COUNTRY_INFO!J45<4), IF(T45/COUNTRY_INFO!E45*100<>0, IF(T45/COUNTRY_INFO!E45*100>100,100,T45/COUNTRY_INFO!E45*100), \"-\"),0)","v":"-"},{"$f":"IF(AND(COUNTRY_INFO!J45>1,COUNTRY_INFO!J45<4),IF(COUNTRY_INFO!F45>MAX('MDA1'!K45,'MDA4'!O45,'T1'!M45,MAX(T3_R1!L45,T3_R2!L45)),MAX('MDA1'!K45,'MDA4'!O45,'T1'!M45,MAX(T3_R1!L45,T3_R2!L45)),COUNTRY_INFO!F45),0)","v":3986},{"$f":"IF(AND(COUNTRY_INFO!J45>1,COUNTRY_INFO!J45<4), IF(V45/COUNTRY_INFO!F45*100<>0, IF(V45/COUNTRY_INFO!F45*100>100,100,V45/COUNTRY_INFO!F45*100), \"-\"),0)","v":45.711009174311926},3986,{"$f":"IF(AND(COUNTRY_INFO!J45>1,COUNTRY_INFO!J45<4), IF(S45/P45*100<>0, IF(X45/P45*100>100,100,X45/P45*100), \"-\"),0)","v":30.887253002712129},{"$f":"COUNTRY_INFO!P45","v":2877.6},2010,1976,{"$f":"MAX('T1'!L45,'T2'!J45)+MAX('T1'!M45,'T2'!K45)+MAX('T1'!N45,'T2'!L45)","v":3986},{"$f":"IF(COUNTRY_INFO!K45=1,IF(COUNTRY_INFO!F45*0.33>MAX('T1'!M45,'T2'!K45),MAX('T1'!M45,'T2'!K45),COUNTRY_INFO!F45*0.33),IF(COUNTRY_INFO!K45=2,IF(COUNTRY_INFO!F45*0.5>MAX('T1'!M45,'T2'!K45),MAX('T1'!M45,'T2'!K45),COUNTRY_INFO!F45*0.5),IF(COUNTRY_INFO!K45=3,IF(COUNTRY_INFO!F45>MAX('T1'!M45,'T2'!K45),MAX('T1'!M45,'T2'!K45),COUNTRY_INFO!F45),0)))","v":2877.6},{"$f":"IF(AND(COUNTRY_INFO!K45>0,COUNTRY_INFO!K45<4),IF(Z45>0,IF(COUNTRY_INFO!K45=1, AD45/(COUNTRY_INFO!F45*0.33)*100, IF(COUNTRY_INFO!K45=2, AD45/(COUNTRY_INFO!F45*0.5)*100, IF(COUNTRY_INFO!K45=3, AD45/COUNTRY_INFO!F45*100))),\"-\"),0)","v":100},{"$f":"IF(COUNTRY_INFO!K45=2,IF(COUNTRY_INFO!G45*0.2>MAX('T1'!N45,'T2'!L45),MAX('T1'!N45,'T2'!L45),COUNTRY_INFO!G45*0.2),IF(COUNTRY_INFO!K45=3,IF(COUNTRY_INFO!G45>MAX('T1'!N45,'T2'!L45),MAX('T1'!N45,'T2'!L45),COUNTRY_INFO!G45),0))","v":0},{"$f":"IF(AND(COUNTRY_INFO!K45>0,COUNTRY_INFO!K45<4),IF(Z45>0,IF(COUNTRY_INFO!K45=1, 0, IF(COUNTRY_INFO!K45=2, AF45/(COUNTRY_INFO!G45*0.2)*100, IF(COUNTRY_INFO!K45=3, AF45/COUNTRY_INFO!G45*100))),\"-\"),0)","v":0},2877.6,{"$f":"IF(AND(COUNTRY_INFO!K45>0,COUNTRY_INFO!K45<4), IF(AC45/Z45*100<>0, IF(AH45/Z45*100>100,100,AH45/Z45*100), \"-\"),0)","v":100},null,{"$f":"IF(AND(D45<>0, D45<>\"Inconnu\",D45<>\"Interrompu\",D45<>\"Non requis\"),D45/COUNTRY_INFO!D45, 0)","v":1},{"$f":"IF(AND(J45<>0,J45<>\"Inconnu\",J45<>\"Interrompu\",J45<>\"Non requis\"),J45/COUNTRY_INFO!D45, 0)","v":1},{"$f":"IF(AND(P45<>0,P45<>\"Inconnu\",P45<>\"Non requis\"),P45/(COUNTRY_INFO!E45+COUNTRY_INFO!F45), 0)","v":1},{"$f":"IF(AND(Z45<>0,Z45<>\"Inconnu\",Z45<>\"Non requis\"),IF(COUNTRY_INFO!K45=1,1,IF(COUNTRY_INFO!K45=2,0.5*COUNTRY_INFO!F45/(0.5*COUNTRY_INFO!F45+0.2*COUNTRY_INFO!G45),IF(COUNTRY_INFO!K45=3,COUNTRY_INFO!F45/(COUNTRY_INFO!F45+COUNTRY_INFO!G45)))),0)","v":1},{"$f":"IF(AND(Z45<>0,Z45<>\"Inconnu\",Z45<>\"Non requis\"),IF(COUNTRY_INFO!K45=1,0,IF(COUNTRY_INFO!K45=2,0.2*COUNTRY_INFO!G45/(0.5*COUNTRY_INFO!F45+0.2*COUNTRY_INFO!G45),IF(COUNTRY_INFO!K45=3,COUNTRY_INFO!G45/(COUNTRY_INFO!F45+COUNTRY_INFO!G45)))),0)","v":0},{"$f":"MAX(COUNTRY_INFO!D45*AK45*PROFILE!$G$7,COUNTRY_INFO!D45*AL45*PROFILE!$G$7)","v":1395.0452286936491},{"$f":"MAX(COUNTRY_INFO!D45*AK45*PROFILE!$G$8,COUNTRY_INFO!D45*AL45*PROFILE!$G$8,COUNTRY_INFO!D45*AM45*PROFILE!$G$8)","v":4185.4563706133986},{"$f":"MAX(COUNTRY_INFO!D45*AK45*PROFILE!$G$9,COUNTRY_INFO!D45*AL45*PROFILE!$G$9,COUNTRY_INFO!D45*AM45*PROFILE!$G$9,IF(AND(DISTRICT!Z45<>\"Inconnu\",Z45<>\"Non requis\"),COUNTRY_INFO!P45*DISTRICT!AN45,0))","v":8719.8512687997209},{"$f":"MAX(COUNTRY_INFO!D45*AK45*PROFILE!$G$10,COUNTRY_INFO!D45*AL45*PROFILE!$G$10,IF(AND(DISTRICT!Z45<>\"Inconnu\",Z45<>\"Non requis\"),COUNTRY_INFO!P45*DISTRICT!AO45,0))","v":20578.647131893231},34879,0,{"$f":"MAX('MDA4'!R45,'T1'!L45,'T2'!J45,T3_R1!K45,T3_R2!K45)","v":0},{"$f":"MAX('MDA1'!K45,'MDA4'!S45,'MDA3'!I45,'MDA3'!L45,'T1'!M45,'T2'!K45,T3_R1!L45,T3_R2!L45)","v":3986},{"$f":"MAX('MDA1'!L45,'MDA4'!T45,'MDA3'!J45,'MDA3'!M45,'T1'!N45,'T2'!L45,T3_R1!M45,T3_R2!M45)","v":0},3986,{"$f":"MAX('MDA4'!R45,T45)","v":0},{"$f":"MAX('MDA1'!K45,'MDA4'!S45,'MDA3'!I45,'MDA3'!L45,V45,AD45)","v":3986},{"$f":"MAX('MDA1'!L45,'MDA4'!T45,'MDA3'!J45,'MDA3'!M45,AF45)","v":0},3986,11.428079933484332]
[{"$f":"IF(COUNTRY_INFO!A46=0,\" \",COUNTRY_INFO!A46)","v":"Gabon"},{"$f":"IF(COUNTRY_INFO!B46=0,\" \",COUNTRY_INFO!B46)","v":"Est"},{"$f":"IF(COUNTRY_INFO!C46=0,\" \",COUNTRY_INFO!C46)","v":"Zadié"},{"$f":"COUNTRY_INFO!M46","v":16488},null,null,{"$f":"MAX('MDA1'!M46,'MDA4'!U46)","v":0},{"$f":"IF(AND(COUNTRY_INFO!H46>0,COUNTRY_INFO!H46<4),IF(D46>MAX('MDA1'!M46,'MDA4'!U46),MAX('MDA1'!M46,'MDA4'!U46),D46),0)","v":0},{"$f":"IF(AND(COUNTRY_INFO!H46>0,COUNTRY_INFO!H46<4), IF(G46/D46*100<>0, IF(G46/D46*100>100,100,G46/D46*100), \"-\"),0)","v":"-"},{"$f":"COUNTRY_INFO!N46","v":16488},null,null,{"$f":"MAX('MDA1'!M46,MAX('MDA3'!I46,'MDA3'!L46)+MAX('MDA3'!J46,'MDA3'!M46))","v":0},{"$f":"IF(AND(COUNTRY_INFO!I46>0,COUNTRY_INFO!I46<4),IF(J46>MAX('MDA1'!M46,MAX('MDA3'!I46,'MDA3'!L46)+MAX('MDA3'!J46,'MDA3'!M46)),MAX('MDA1'!M46,MAX('MDA3'!I46,'MDA3'!L46)+MAX('MDA3'!J46,'MDA3'!M46)),J46),0)","v":0},{"$f":"IF(AND(COUNTRY_INFO!I46>0,COUNTRY_INFO!I46<4), IF(M46/J46*100<>0, IF(M46/J46*100>100,100,M46/J46*100), \"-\"),0)","v":"-"},{"$f":"COUNTRY_INFO!O46","v":6101},602,529,{"$f":"SUM(MAX('MDA4'!N46, 'T1'!L46, MAX(T3_R1!K46, T3_R2!K46)), MAX('MDA1'!K46, 'MDA4'!O46, 'T1'!M46, MAX(T3_R1!L46, T3_R2!L46)), MAX('MDA1'!L46, 'MDA4'!P46, 'T1'!N46, MAX(T3_R1!M46, T3_R2!M46)))","v":1827},{"$f":"IF(AND(COUNTRY_INFO!J46>1,COUNTRY_INFO!J46<4),IF(COUNTRY_INFO!E46>MAX('MDA4'!N46,'T1'!L46,MAX(T3_R1!K46,T3_R2!K46)),MAX('MDA4'!N46,'T1'!L46,MAX(T3_R1!K46,T3_R2!K46)),COUNTRY_INFO!E46),0)","v":0},{"$f":"IF(AND(COUNTRY_INFO!J46>1,COUNTRY_INFO!J46<4), IF(T46/COUNTRY_INFO!E46*100<>0, IF(T46/COUNTRY_INFO!E46*100>100,100,T46/COUNTRY_INFO!E46*100), \"-\"),0)","v":"-"},{"$f":"IF(AND(COUNTRY_INFO!J46>1,COUNTRY_INFO!J46<4),IF(COUNTRY_INFO!F46>MAX('MDA1'!K46,'MDA4'!O46,'T1'!M46,MAX(T3_R1!L46,T3_R2!L46)),MAX('MDA1'!K46,'MDA4'!O46,'T1'!M46,MAX(T3_R1!L46,T3_R2!L46)),COUNTRY_INFO!F46),0)","v":1827},{"$f":"IF(AND(COUNTRY_INFO!J46>1,COUNTRY_INFO!J46<4), IF(V46/COUNTRY_INFO!F46*100<>0, IF(V46/COUNTRY_INFO!F46*100>100,100,V46/COUNTRY_INFO!F46*100), \"-\"),0)","v":44.32314410480349},1827,{"$f":"IF(AND(COUNTRY_INFO!J46>1,COUNTRY_INFO!J46<4), IF(S46/P46*100<>0, IF(X46/P46*100>100,100,X46/P46*100), \"-\"),0)","v":29.945910506474348},{"$f":"COUNTRY_INFO!P46","v":0},null,null,{"$f":"MAX('T1'!L46,'T2'!J46)+MAX('T1'!M46,'T2'!K46)+MAX('T1'!N46,'T2'!L46)","v":0},{"$f":"IF(COUNTRY_INFO!K46=1,IF(COUNTRY_INFO!F46*0.33>MAX('T1'!M46,'T2'!K46),MAX('T1'!M46,'T2'!K46),COUNTRY_INFO!F46*0.33),IF(COUNTRY_INFO!K46=2,IF(COUNTRY_INFO!F46*0.5>MAX('T1'!M46,'T2'!K46),MAX('T1'!M46,'T2'!K46),COUNTRY_INFO!F46*0.5),IF(COUNTRY_INFO!K46=3,IF(COUNTRY_INFO!F46>MAX('T1'!M46,'T2'!K46),MAX('T1'!M46,'T2'!K46),COUNTRY_INFO!F46),0)))","v":0},{"$f":"IF(AND(COUNTRY_INFO!K46>0,COUNTRY_INFO!K46<4),IF(Z46>0,IF(COUNTRY_INFO!K46=1, AD46/(COUNTRY_INFO!F46*0.33)*100, IF(COUNTRY_INFO!K46=2, AD46/(COUNTRY_INFO!F46*0.5)*100, IF(COUNTRY_INFO!K46=3, AD46/COUNTRY_INFO!F46*100))),\"-\"),0)","v":0},{"$f":"IF(COUNTRY_INFO!K46=2,IF(COUNTRY_INFO!G46*0.2>MAX('T1'!N46,'T2'!L46),MAX('T1'!N46,'T2'!L46),COUNTRY_INFO!G46*0.2),IF(COUNTRY_INFO!K46=3,IF(COUNTRY_INFO!G46>MAX('T1'!N46,'T2'!L46),MAX('T1'!N46,'T2'!L46),COUNTRY_INFO!G46),0))","v":0},{"$f":"IF(AND(COUNTRY_INFO!K46>0,COUNTRY_INFO!K46<4),IF(Z46>0,IF(COUNTRY_INFO!K46=1, 0, IF(COUNTRY_INFO!K46=2, AF46/(COUNTRY_INFO!G46*0.2)*100, IF(COUNTRY_INFO!K46=3, AF46/COUNTRY_INFO!G46*100))),\"-\"),0)","v":0},0,{"$f":"IF(AND(COUNTRY_INFO!K46>0,COUNTRY_INFO!K46<4), IF(AC46/Z46*100<>0, IF(AH46/Z46*100>100,100,AH46/Z46*100), \"-\"),0)","v":0},null,{"$f":"IF(AND(D46<>0, D46<>\"Inconnu\",D46<>\"Interrompu\",D46<>\"Non requis\"),D46/COUNTRY_INFO!D46, 0)","v":1},{"$f":"IF(AND(J46<>0,J46<>\"Inconnu\",J46<>\"Interrompu\",J46<>\"Non requis\"),J46/COUNTRY_INFO!D46, 0)","v":1},{"$f":"IF(AND(P46<>0,P46<>\"Inconnu\",P46<>\"Non requis\"),P46/(COUNTRY_INFO!E46+COUNTRY_INFO!F46), 0)","v":1},{"$f":"IF(AND(Z46<>0,Z46<>\"Inconnu\",Z46<>\"Non requis\"),IF(COUNTRY_INFO!K46=1,1,IF(COUNTRY_INFO!K46=2,0.5*COUNTRY_INFO!F46/(0.5*COUNTRY_INFO!F46+0.2*COUNTRY_INFO!G46),IF(COUNTRY_INFO!K46=3,COUNTRY_INFO!F46/(COUNTRY_INFO!F46+COUNTRY_INFO!G46)))),0)","v":0},{"$f":"IF(AND(Z46<>0,Z46<>\"Inconnu\",Z46<>\"Non requis\"),IF(COUNTRY_INFO!K46=1,0,IF(COUNTRY_INFO!K46=2,0.2*COUNTRY_INFO!G46/(0.5*COUNTRY_INFO!F46+0.2*COUNTRY_INFO!G46),IF(COUNTRY_INFO!K46=3,COUNTRY_INFO!G46/(COUNTRY_INFO!F46+COUNTRY_INFO!G46)))),0)","v":0},{"$f":"MAX(COUNTRY_INFO!D46*AK46*PROFILE!$G$7,COUNTRY_INFO!D46*AL46*PROFILE!$G$7)","v":659.46574531095746},{"$f":"MAX(COUNTRY_INFO!D46*AK46*PROFILE!$G$8,COUNTRY_INFO!D46*AL46*PROFILE!$G$8,COUNTRY_INFO!D46*AM46*PROFILE!$G$8)","v":1978.5488299169619},{"$f":"MAX(COUNTRY_INFO!D46*AK46*PROFILE!$G$9,COUNTRY_INFO!D46*AL46*PROFILE!$G$9,COUNTRY_INFO!D46*AM46*PROFILE!$G$9,IF(AND(DISTRICT!Z46<>\"Inconnu\",Z46<>\"Non requis\"),COUNTRY_INFO!P46*DISTRICT!AN46,0))","v":4122.0478717844489},{"$f":"MAX(COUNTRY_INFO!D46*AK46*PROFILE!$G$10,COUNTRY_INFO!D46*AL46*PROFILE!$G$10,IF(AND(DISTRICT!Z46<>\"Inconnu\",Z46<>\"Non requis\"),COUNTRY_INFO!P46*DISTRICT!AO46,0))","v":9727.9375529876306},16488,0,{"$f":"MAX('MDA4'!R46,'T1'!L46,'T2'!J46,T3_R1!K46,T3_R2!K46)","v":0},{"$f":"MAX('MDA1'!K46,'MDA4'!S46,'MDA3'!I46,'MDA3'!L46,'T1'!M46,'T2'!K46,T3_R1!L46,T3_R2!L46)","v":1827},{"$f":"MAX('MDA1'!L46,'MDA4'!T46,'MDA3'!J46,'MDA3'!M46,'T1'!N46,'T2'!L46,T3_R1!M46,T3_R2!M46)","v":0},1827,{"$f":"MAX('MDA4'!R46,T46)","v":0},{"$f":"MAX('MDA1'!K46,'MDA4'!S46,'MDA3'!I46,'MDA3'!L46,V46,AD46)","v":1827},{"$f":"MAX('MDA1'!L46,'MDA4'!T46,'MDA3'!J46,'MDA3'!M46,AF46)","v":0},1827,11.080786026200872]
[{"$f":"IF(COUNTRY_INFO!A47=0,\" \",COUNTRY_INFO!A47)","v":"Gabon"},{"$f":"IF(COUNTRY_INFO!B47=0,\" \",COUNTRY_INFO!B47)","v":"Est"},{"$f":"IF(COUNTRY_INFO!C47=0,\" \",COUNTRY_INFO!C47)","v":"Mvoung"},{"$f":"COUNTRY_INFO!M47","v":5606},null,null,{"$f":"MAX('MDA1'!M47,'MDA4'!U47)","v":0},{"$f":"IF(AND(COUNTRY_INFO!H47>0,COUNTRY_INFO!H47<4),IF(D47>MAX('MDA1'!M47,'MDA4'!U47),MAX('MDA1'!M47,'MDA4'!U47),D47),0)","v":0},{"$f":"IF(AND(COUNTRY_INFO!H47>0,COUNTRY_INFO!H47<4), IF(G47/D47*100<>0, IF(G47/D47*100>100,100,G47/D47*100), \"-\"),0)","v":"-"},{"$f":"COUNTRY_INFO!N47","v":5606},null,null,{"$f":"MAX('MDA1'!M47,MAX('MDA3'!I47,'MDA3'!L47)+MAX('MDA3'!J47,'MDA3'!M47))","v":0},{"$f":"IF(AND(COUNTRY_INFO!I47>0,COUNTRY_INFO!I47<4),IF(J47>MAX('MDA1'!M47,MAX('MDA3'!I47,'MDA3'!L47)+MAX('MDA3'!J47,'MDA3'!M47)),MAX('MDA1'!M47,MAX('MDA3'!I47,'MDA3'!L47)+MAX('MDA3'!J47,'MDA3'!M47)),J47),0)","v":0},{"$f":"IF(AND(COUNTRY_INFO!I47>0,COUNTRY_INFO!I47<4), IF(M47/J47*100<>0, IF(M47/J47*100>100,100,M47/J47*100), \"-\"),0)","v":"-"},{"$f":"COUNTRY_INFO!O47","v":2075},361,317,{"$f":"SUM(MAX('MDA4'!N47, 'T1'!L47, MAX(T3_R1!K47, T3_R2!K47)), MAX('MDA1'!K47, 'MDA4'!O47, 'T1'!M47, MAX(T3_R1!L47, T3_R2!L47)), MAX('MDA1'!L47, 'MDA4'!P47, 'T1'!N47, MAX(T3_R1!M47, T3_R2!M47)))","v":799},{"$f":"IF(AND(COUNTRY_INFO!J47>1,COUNTRY_INFO!J47<4),IF(COUNTRY_INFO!E47>MAX('MDA4'!N47,'T1'!L47,MAX(T3_R1!K47,T3_R2!K47)),MAX('MDA4'!N47,'T1'!L47,MAX(T3_R1!K47,T3_R2!K47)),COUNTRY_INFO!E47),0)","v":0},{"$f":"IF(AND(COUNTRY_INFO!J47>1,COUNTRY_INFO!J47<4), IF(T47/COUNTRY_INFO!E47*100<>0, IF(T47/COUNTRY_INFO!E47*100>100,100,T47/COUNTRY_INFO!E47*100), \"-\"),0)","v":"-"},{"$f":"IF(AND(COUNTRY_INFO!J47>1,COUNTRY_INFO!J47<4),IF(COUNTRY_INFO!F47>MAX('MDA1'!K47,'MDA4'!O47,'T1'!M47,MAX(T3_R1!L47,T3_R2!L47)),MAX('MDA1'!K47,'MDA4'!O47,'T1'!M47,MAX(T3_R1!L47,T3_R2!L47)),COUNTRY_INFO!F47),0)","v":799},{"$f":"IF(AND(COUNTRY_INFO!J47>1,COUNTRY_INFO!J47<4), IF(V47/COUNTRY_INFO!F47*100<>0, IF(V47/COUNTRY_INFO!F47*100>100,100,V47/COUNTRY_INFO!F47*100), \"-\"),0)","v":56.990014265335233},799,{"$f":"IF(AND(COUNTRY_INFO!J47>1,COUNTRY_INFO!J47<4), IF(S47/P47*100<>0, IF(X47/P47*100>100,100,X47/P47*100), \"-\"),0)","v":38.506024096385545},{"$f":"COUNTRY_INFO!P47","v":462.66},361,317,{"$f":"MAX('T1'!L47,'T2'!J47)+MAX('T1'!M47,'T2'!K47)+MAX('T1'!N47,'T2'!L47)","v":678},{"$f":"IF(COUNTRY_INFO!K47=1,IF(COUNTRY_INFO!F47*0.33>MAX('T1'!M47,'T2'!K47),MAX('T1'!M47,'T2'!K47),COUNTRY_INFO!F47*0.33),IF(COUNTRY_INFO!K47=2,IF(COUNTRY_INFO!F47*0.5>MAX('T1'!M47,'T2'!K47),MAX('T1'!M47,'T2'!K47),COUNTRY_INFO!F47*0.5),IF(COUNTRY_INFO!K47=3,IF(COUNTRY_INFO!F47>MAX('T1'!M47,'T2'!K47),MAX('T1'!M47,'T2'!K47),COUNTRY_INFO!F47),0)))","v":462.66},{"$f":"IF(AND(COUNTRY_INFO!K47>0,COUNTRY_INFO!K47<4),IF(Z47>0,IF(COUNTRY_INFO!K47=1, AD47/(COUNTRY_INFO!F47*0.33)*100, IF(COUNTRY_INFO!K47=2, AD47/(COUNTRY_INFO!F47*0.5)*100, IF(COUNTRY_INFO!K47=3, AD47/COUNTRY_INFO!F47*100))),\"-\"),0)","v":100},{"$f":"IF(COUNTRY_INFO!K47=2,IF(COUNTRY_INFO!G47*0.2>MAX('T1'!N47,'T2'!L47),MAX('T1'!N47,'T2'!L47),COUNTRY_INFO!G47*0.2),IF(COUNTRY_INFO!K47=3,IF(COUNTRY_INFO!G47>MAX('T1'!N47,'T2'!L47),MAX('T1'!N47,'T2'!L47),COUNTRY_INFO!G47),0))","v":0},{"$f":"IF(AND(COUNTRY_INFO!K47>0,COUNTRY_INFO!K47<4),IF(Z47>0,IF(COUNTRY_INFO!K47=1, 0, IF(COUNTRY_INFO!K47=2, AF47/(COUNTRY_INFO!G47*0.2)*100, IF(COUNTRY_INFO!K47=3, AF47/COUNTRY_INFO!G47*100))),\"-\"),0)","v":0},462.66,{"$f":"IF(AND(COUNTRY_INFO!K47>0,COUNTRY_INFO!K47<4), IF(AC47/Z47*100<>0, IF(AH47/Z47*100>100,100,AH47/Z47*100), \"-\"),0)","v":100},null,{"$f":"IF(AND(D47<>0, D47<>\"Inconnu\",D47<>\"Interrompu\",D47<>\"Non requis\"),D47/COUNTRY_INFO!D47, 0)","v":1},{"$f":"IF(AND(J47<>0,J47<>\"Inconnu\",J47<>\"Interrompu\",J47<>\"Non requis\"),J47/COUNTRY_INFO!D47, 0)","v":1},{"$f":"IF(AND(P47<>0,P47<>\"Inconnu\",P47<>\"Non requis\"),P47/(COUNTRY_INFO!E47+COUNTRY_INFO!F47), 0)","v":1},{"$f":"IF(AND(Z47<>0,Z47<>\"Inconnu\",Z47<>\"Non requis\"),IF(COUNTRY_INFO!K47=1,1,IF(COUNTRY_INFO!K47=2,0.5*COUNTRY_INFO!F47/(0.5*COUNTRY_INFO!F47+0.2*COUNTRY_INFO!G47),IF(COUNTRY_INFO!K47=3,COUNTRY_INFO!F47/(COUNTRY_INFO!F47+COUNTRY_INFO!G47)))),0)","v":1},{"$f":"IF(AND(Z47<>0,Z47<>\"Inconnu\",Z47<>\"Non requis\"),IF(COUNTRY_INFO!K47=1,0,IF(COUNTRY_INFO!K47=2,0.2*COUNTRY_INFO!G47/(0.5*COUNTRY_INFO!F47+0.2*COUNTRY_INFO!G47),IF(COUNTRY_INFO!K47=3,COUNTRY_INFO!G47/(COUNTRY_INFO!F47+COUNTRY_INFO!G47)))),0)","v":0},{"$f":"MAX(COUNTRY_INFO!D47*AK47*PROFILE!$G$7,COUNTRY_INFO!D47*AL47*PROFILE!$G$7)","v":224.22155314248107},{"$f":"MAX(COUNTRY_INFO!D47*AK47*PROFILE!$G$8,COUNTRY_INFO!D47*AL47*PROFILE!$G$8,COUNTRY_INFO!D47*AM47*PROFILE!$G$8)","v":672.71620211756965},{"$f":"MAX(COUNTRY_INFO!D47*AK47*PROFILE!$G$9,COUNTRY_INFO!D47*AL47*PROFILE!$G$9,COUNTRY_INFO!D47*AM47*PROFILE!$G$9,IF(AND(DISTRICT!Z47<>\"Inconnu\",Z47<>\"Non requis\"),COUNTRY_INFO!P47*DISTRICT!AN47,0))","v":1401.5162766389872},{"$f":"MAX(COUNTRY_INFO!D47*AK47*PROFILE!$G$10,COUNTRY_INFO!D47*AL47*PROFILE!$G$10,IF(AND(DISTRICT!Z47<>\"Inconnu\",Z47<>\"Non requis\"),COUNTRY_INFO!P47*DISTRICT!AO47,0))","v":3307.545968100962},5606,0,{"$f":"MAX('MDA4'!R47,'T1'!L47,'T2'!J47,T3_R1!K47,T3_R2!K47)","v":0},{"$f":"MAX('MDA1'!K47,'MDA4'!S47,'MDA3'!I47,'MDA3'!L47,'T1'!M47,'T2'!K47,T3_R1!L47,T3_R2!L47)","v":799},{"$f":"MAX('MDA1'!L47,'MDA4'!T47,'MDA3'!J47,'MDA3'!M47,'T1'!N47,'T2'!L47,T3_R1!M47,T3_R2!M47)","v":0},799,{"$f":"MAX('MDA4'!R47,T47)","v":0},{"$f":"MAX('MDA1'!K47,'MDA4'!S47,'MDA3'!I47,'MDA3'!L47,V47,AD47)","v":799},{"$f":"MAX('MDA1'!L47,'MDA4'!T47,'MDA3'!J47,'MDA3'!M47,AF47)","v":0},799,14.252586514448806]
[{"$f":"IF(COUNTRY_INFO!A48=0,\" \",COUNTRY_INFO!A48)","v":"Gabon"},{"$f":"IF(COUNTRY_INFO!B48=0,\" \",COUNTRY_INFO!B48)","v":"Centre-Est"},{"$f":"IF(COUNTRY_INFO!C48=0,\" \",COUNTRY_INFO!C48)","v":"Offoué-Onoye"},{"$f":"COUNTRY_INFO!M48","v":3946},null,null,{"$f":"MAX('MDA1'!M48,'MDA4'!U48)","v":0},{"$f":"IF(AND(COUNTRY_INFO!H48>0,COUNTRY_INFO!H48<4),IF(D48>MAX('MDA1'!M48,'MDA4'!U48),MAX('MDA1'!M48,'MDA4'!U48),D48),0)","v":0},{"$f":"IF(AND(COUNTRY_INFO!H48>0,COUNTRY_INFO!H48<4), IF(G48/D48*100<>0, IF(G48/D48*100>100,100,G48/D48*100), \"-\"),0)","v":"-"},{"$f":"COUNTRY_INFO!N48","v":3946},null,null,{"$f":"MAX('MDA1'!M48,MAX('MDA3'!I48,'MDA3'!L48)+MAX('MDA3'!J48,'MDA3'!M48))","v":0},{"$f":"IF(AND(COUNTRY_INFO!I48>0,COUNTRY_INFO!I48<4),IF(J48>MAX('MDA1'!M48,MAX('MDA3'!I48,'MDA3'!L48)+MAX('MDA3'!J48,'MDA3'!M48)),MAX('MDA1'!M48,MAX('MDA3'!I48,'MDA3'!L48)+MAX('MDA3'!J48,'MDA3'!M48)),J48),0)","v":0},{"$f":"IF(AND(COUNTRY_INFO!I48>0,COUNTRY_INFO!I48<4), IF(M48/J48*100<>0, IF(M48/J48*100>100,100,M48/J48*100), \"-\"),0)","v":"-"},{"$f":"COUNTRY_INFO!O48","v":1461},233,257,{"$f":"SUM(MAX('MDA4'!N48, 'T1'!L48, MAX(T3_R1!K48, T3_R2!K48)), MAX('MDA1'!K48, 'MDA4'!O48, 'T1'!M48, MAX(T3_R1!L48, T3_R2!L48)), MAX('MDA1'!L48, 'MDA4'!P48, 'T1'!N48, MAX(T3_R1!M48, T3_R2!M48)))","v":577},{"$f":"IF(AND(COUNTRY_INFO!J48>1,COUNTRY_INFO!J48<4),IF(COUNTRY_INFO!E48>MAX('MDA4'!N48,'T1'!L48,MAX(T3_R1!K48,T3_R2!K48)),MAX('MDA4'!N48,'T1'!L48,MAX(T3_R1!K48,T3_R2!K48)),COUNTRY_INFO!E48),0)","v":0},{"$f":"IF(AND(COUNTRY_INFO!J48>1,COUNTRY_INFO!J48<4), IF(T48/COUNTRY_INFO!E48*100<>0, IF(T48/COUNTRY_INFO!E48*100>100,100,T48/COUNTRY_INFO!E48*100), \"-\"),0)","v":"-"},{"$f":"IF(AND(COUNTRY_INFO!J48>1,COUNTRY_INFO!J48<4),IF(COUNTRY_INFO!F48>MAX('MDA1'!K48,'MDA4'!O48,'T1'!M48,MAX(T3_R1!L48,T3_R2!L48)),MAX('MDA1'!K48,'MDA4'!O48,'T1'!M48,MAX(T3_R1!L48,T3_R2!L48)),COUNTRY_INFO!F48),0)","v":577},{"$f":"IF(AND(COUNTRY_INFO!J48>1,COUNTRY_INFO!J48<4), IF(V48/COUNTRY_INFO!F48*100<>0, IF(V48/COUNTRY_INFO!F48*100>100,100,V48/COUNTRY_INFO!F48*100), \"-\"),0)","v":58.459979736575484},577,{"$f":"IF(AND(COUNTRY_INFO!J48>1,COUNTRY_INFO!J48<4), IF(S48/P48*100<>0, IF(X48/P48*100>100,100,X48/P48*100), \"-\"),0)","v":39.493497604380565},{"$f":"COUNTRY_INFO!P48","v":325.71000000000004},233,257,{"$f":"MAX('T1'!L48,'T2'!J48)+MAX('T1'!M48,'T2'!K48)+MAX('T1'!N48,'T2'!L48)","v":490},{"$f":"IF(COUNTRY_INFO!K48=1,IF(COUNTRY_INFO!F48*0.33>MAX('T1'!M48,'T2'!K48),MAX('T1'!M48,'T2'!K48),COUNTRY_INFO!F48*0.33),IF(COUNTRY_INFO!K48=2,IF(COUNTRY_INFO!F48*0.5>MAX('T1'!M48,'T2'!K48),MAX('T1'!M48,'T2'!K48),COUNTRY_INFO!F48*0.5),IF(COUNTRY_INFO!K48=3,IF(COUNTRY_INFO!F48>MAX('T1'!M48,'T2'!K48),MAX('T1'!M48,'T2'!K48),COUNTRY_INFO!F48),0)))","v":325.71000000000004},{"$f":"IF(AND(COUNTRY_INFO!K48>0,COUNTRY_INFO!K48<4),IF(Z48>0,IF(COUNTRY_INFO!K48=1, AD48/(COUNTRY_INFO!F48*0.33)*100, IF(COUNTRY_INFO!K48=2, AD48/(COUNTRY_INFO!F48*0.5)*100, IF(COUNTRY_INFO!K48=3, AD48/COUNTRY_INFO!F48*100))),\"-\"),0)","v":100},{"$f":"IF(COUNTRY_INFO!K48=2,IF(COUNTRY_INFO!G48*0.2>MAX('T1'!N48,'T2'!L48),MAX('T1'!N48,'T2'!L48),COUNTRY_INFO!G48*0.2),IF(COUNTRY_INFO!K48=3,IF(COUNTRY_INFO!G48>MAX('T1'!N48,'T2'!L48),MAX('T1'!N48,'T2'!L48),COUNTRY_INFO!G48),0))","v":0},{"$f":"IF(AND(COUNTRY_INFO!K48>0,COUNTRY_INFO!K48<4),IF(Z48>0,IF(COUNTRY_INFO!K48=1, 0, IF(COUNTRY_INFO!K48=2, AF48/(COUNTRY_INFO!G48*0.2)*100, IF(COUNTRY_INFO!K48=3, AF48/COUNTRY_INFO!G48*100))),\"-\"),0)","v":0},325.71000000000004,{"$f":"IF(AND(COUNTRY_INFO!K48>0,COUNTRY_INFO!K48<4), IF(AC48/Z48*100<>0, IF(AH48/Z48*100>100,100,AH48/Z48*100), \"-\"),0)","v":100},null,{"$f":"IF(AND(D48<>0, D48<>\"Inconnu\",D48<>\"Interrompu\",D48<>\"Non requis\"),D48/COUNTRY_INFO!D48, 0)","v":1},{"$f":"IF(AND(J48<>0,J48<>\"Inconnu\",J48<>\"Interrompu\",J48<>\"Non requis\"),J48/COUNTRY_INFO!D48, 0)","v":1},{"$f":"IF(AND(P48<>0,P48<>\"Inconnu\",P48<>\"Non requis\"),P48/(COUNTRY_INFO!E48+COUNTRY_INFO!F48), 0)","v":1},{"$f":"IF(AND(Z48<>0,Z48<>\"Inconnu\",Z48<>\"Non requis\"),IF(COUNTRY_INFO!K48=1,1,IF(COUNTRY_INFO!K48=2,0.5*COUNTRY_INFO!F48/(0.5*COUNTRY_INFO!F48+0.2*COUNTRY_INFO!G48),IF(COUNTRY_INFO!K48=3,COUNTRY_INFO!F48/(COUNTRY_INFO!F48+COUNTRY_INFO!G48)))),0)","v":1},{"$f":"IF(AND(Z48<>0,Z48<>\"Inconnu\",Z48<>\"Non requis\"),IF(COUNTRY_INFO!K48=1,0,IF(COUNTRY_INFO!K48=2,0.2*COUNTRY_INFO!G48/(0.5*COUNTRY_INFO!F48+0.2*COUNTRY_INFO!G48),IF(COUNTRY_INFO!K48=3,COUNTRY_INFO!G48/(COUNTRY_INFO!F48+COUNTRY_INFO!G48)))),0)","v":0},{"$f":"MAX(COUNTRY_INFO!D48*AK48*PROFILE!$G$7,COUNTRY_INFO!D48*AL48*PROFILE!$G$7)","v":157.82701546561367},{"$f":"MAX(COUNTRY_INFO!D48*AK48*PROFILE!$G$8,COUNTRY_INFO!D48*AL48*PROFILE!$G$8,COUNTRY_INFO!D48*AM48*PROFILE!$G$8)","v":473.51732671350874},{"$f":"MAX(COUNTRY_INFO!D48*AK48*PROFILE!$G$9,COUNTRY_INFO!D48*AL48*PROFILE!$G$9,COUNTRY_INFO!D48*AM48*PROFILE!$G$9,IF(AND(DISTRICT!Z48<>\"Inconnu\",Z48<>\"Non requis\"),COUNTRY_INFO!P48*DISTRICT!AN48,0))","v":986.5114569421055},{"$f":"MAX(COUNTRY_INFO!D48*AK48*PROFILE!$G$10,COUNTRY_INFO!D48*AL48*PROFILE!$G$10,IF(AND(DISTRICT!Z48<>\"Inconnu\",Z48<>\"Non requis\"),COUNTRY_INFO!P48*DISTRICT!AO48,0))","v":2328.1442008787717},3945.9999999999995,0,{"$f":"MAX('MDA4'!R48,'T1'!L48,'T2'!J48,T3_R1!K48,T3_R2!K48)","v":0},{"$f":"MAX('MDA1'!K48,'MDA4'!S48,'MDA3'!I48,'MDA3'!L48,'T1'!M48,'T2'!K48,T3_R1!L48,T3_R2!L48)","v":577},{"$f":"MAX('MDA1'!L48,'MDA4'!T48,'MDA3'!J48,'MDA3'!M48,'T1'!N48,'T2'!L48,T3_R1!M48,T3_R2!M48)","v":0},577,{"$f":"MAX('MDA4'!R48,T48)","v":0},{"$f":"MAX('MDA1'!K48,'MDA4'!S48,'MDA3'!I48,'MDA3'!L48,V48,AD48)","v":577},{"$f":"MAX('MDA1'!L48,'MDA4'!T48,'MDA3'!J48,'MDA3'!M48,AF48)","v":0},577,14.622402432843387]
[{"$f":"IF(COUNTRY_INFO!A49=0,\" \",COUNTRY_INFO!A49)","v":"Gabon"},{"$f":"IF(COUNTRY_INFO!B49=0,\" \",COUNTRY_INFO!B49)","v":"Centre-Est"},{"$f":"IF(COUNTRY_INFO!C49=0,\" \",COUNTRY_INFO!C49)","v":"Lolo-Bouenguidi"},{"$f":"COUNTRY_INFO!M49","v":32984},null,null,{"$f":"MAX('MDA1'!M49,'MDA4'!U49)","v":0},{"$f":"IF(AND(COUNTRY_INFO!H49>0,COUNTRY_INFO!H49<4),IF(D49>MAX('MDA1'!M49,'MDA4'!U49),MAX('MDA1'!M49,'MDA4'!U49),D49),0)","v":0},{"$f":"IF(AND(COUNTRY_INFO!H49>0,COUNTRY_INFO!H49<4), IF(G49/D49*100<>0, IF(G49/D49*100>100,100,G49/D49*100), \"-\"),0)","v":"-"},{"$f":"COUNTRY_INFO!N49","v":32984},null,null,{"$f":"MAX('MDA1'!M49,MAX('MDA3'!I49,'MDA3'!L49)+MAX('MDA3'!J49,'MDA3'!M49))","v":0},{"$f":"IF(AND(COUNTRY_INFO!I49>0,COUNTRY_INFO!I49<4),IF(J49>MAX('MDA1'!M49,MAX('MDA3'!I49,'MDA3'!L49)+MAX('MDA3'!J49,'MDA3'!M49)),MAX('MDA1'!M49,MAX('MDA3'!I49,'MDA3'!L49)+MAX('MDA3'!J49,'MDA3'!M49)),J49),0)","v":0},{"$f":"IF(AND(COUNTRY_INFO!I49>0,COUNTRY_INFO!I49<4), IF(M49/J49*100<>0, IF(M49/J49*100>100,100,M49/J49*100), \"-\"),0)","v":"-"},{"$f":"COUNTRY_INFO!O49","v":12204},1600,1603,{"$f":"SUM(MAX('MDA4'!N49, 'T1'!L49, MAX(T3_R1!K49, T3_R2!K49)), MAX('MDA1'!K49, 'MDA4'!O49, 'T1'!M49, MAX(T3_R1!L49, T3_R2!L49)), MAX('MDA1'!L49, 'MDA4'!P49, 'T1'!N49, MAX(T3_R1!M49, T3_R2!M49)))","v":3203},{"$f":"IF(AND(COUNTRY_INFO!J49>1,COUNTRY_INFO!J49<4),IF(COUNTRY_INFO!E49>MAX('MDA4'!N49,'T1'!L49,MAX(T3_R1!K49,T3_R2!K49)),MAX('MDA4'!N49,'T1'!L49,MAX(T3_R1!K49,T3_R2!K49)),COUNTRY_INFO!E49),0)","v":0},{"$f":"IF(AND(COUNTRY_INFO!J49>1,COUNTRY_INFO!J49<4), IF(T49/COUNTRY_INFO!E49*100<>0, IF(T49/COUNTRY_INFO!E49*100>100,100,T49/COUNTRY_INFO!E49*100), \"-\"),0)","v":"-"},{"$f":"IF(AND(COUNTRY_INFO!J49>1,COUNTRY_INFO!J49<4),IF(COUNTRY_INFO!F49>MAX('MDA1'!K49,'MDA4'!O49,'T1'!M49,MAX(T3_R1!L49,T3_R2!L49)),MAX('MDA1'!K49,'MDA4'!O49,'T1'!M49,MAX(T3_R1!L49,T3_R2!L49)),COUNTRY_INFO!F49),0)","v":3203},{"$f":"IF(AND(COUNTRY_INFO!J49>1,COUNTRY_INFO!J49<4), IF(V49/COUNTRY_INFO!F49*100<>0, IF(V49/COUNTRY_INFO!F49*100>100,100,V49/COUNTRY_INFO!F49*100), \"-\"),0)","v":38.843075430511767},3203,{"$f":"IF(AND(COUNTRY_INFO!J49>1,COUNTRY_INFO!J49<4), IF(S49/P49*100<>0, IF(X49/P49*100>100,100,X49/P49*100), \"-\"),0)","v":26.245493280891512},{"$f":"COUNTRY_INFO!P49","v":8015.2000000000007},1600,1603,{"$f":"MAX('T1'!L49,'T2'!J49)+MAX('T1'!M49,'T2'!K49)+MAX('T1'!N49,'T2'!L49)","v":3203},{"$f":"IF(COUNTRY_INFO!K49=1,IF(COUNTRY_INFO!F49*0.33>MAX('T1'!M49,'T2'!K49),MAX('T1'!M49,'T2'!K49),COUNTRY_INFO!F49*0.33),IF(COUNTRY_INFO!K49=2,IF(COUNTRY_INFO!F49*0.5>MAX('T1'!M49,'T2'!K49),MAX('T1'!M49,'T2'!K49),COUNTRY_INFO!F49*0.5),IF(COUNTRY_INFO!K49=3,IF(COUNTRY_INFO!F49>MAX('T1'!M49,'T2'!K49),MAX('T1'!M49,'T2'!K49),COUNTRY_INFO!F49),0)))","v":3203},{"$f":"IF(AND(COUNTRY_INFO!K49>0,COUNTRY_INFO!K49<4),IF(Z49>0,IF(COUNTRY_INFO!K49=1, AD49/(COUNTRY_INFO!F49*0.33)*100, IF(COUNTRY_INFO!K49=2, AD49/(COUNTRY_INFO!F49*0.5)*100, IF(COUNTRY_INFO!K49=3, AD49/COUNTRY_INFO!F49*100))),\"-\"),0)","v":77.686150861023535},{"$f":"IF(COUNTRY_INFO!K49=2,IF(COUNTRY_INFO!G49*0.2>MAX('T1'!N49,'T2'!L49),MAX('T1'!N49,'T2'!L49),COUNTRY_INFO!G49*0.2),IF(COUNTRY_INFO!K49=3,IF(COUNTRY_INFO!G49>MAX('T1'!N49,'T2'!L49),MAX('T1'!N49,'T2'!L49),COUNTRY_INFO!G49),0))","v":0},{"$f":"IF(AND(COUNTRY_INFO!K49>0,COUNTRY_INFO!K49<4),IF(Z49>0,IF(COUNTRY_INFO!K49=1, 0, IF(COUNTRY_INFO!K49=2, AF49/(COUNTRY_INFO!G49*0.2)*100, IF(COUNTRY_INFO!K49=3, AF49/COUNTRY_INFO!G49*100))),\"-\"),0)","v":0},3203,{"$f":"IF(AND(COUNTRY_INFO!K49>0,COUNTRY_INFO!K49<4), IF(AC49/Z49*100<>0, IF(AH49/Z49*100>100,100,AH49/Z49*100), \"-\"),0)","v":39.961573011278567},null,{"$f":"IF(AND(D49<>0, D49<>\"Inconnu\",D49<>\"Interrompu\",D49<>\"Non requis\"),D49/COUNTRY_INFO!D49, 0)","v":1},{"$f":"IF(AND(J49<>0,J49<>\"Inconnu\",J49<>\"Interrompu\",J49<>\"Non requis\"),J49/COUNTRY_INFO!D49, 0)","v":1},{"$f":"IF(AND(P49<>0,P49<>\"Inconnu\",P49<>\"Non requis\"),P49/(COUNTRY_INFO!E49+COUNTRY_INFO!F49), 0)","v":1},{"$f":"IF(AND(Z49<>0,Z49<>\"Inconnu\",Z49<>\"Non requis\"),IF(COUNTRY_INFO!K49=1,1,IF(COUNTRY_INFO!K49=2,0.5*COUNTRY_INFO!F49/(0.5*COUNTRY_INFO!F49+0.2*COUNTRY_INFO!G49),IF(COUNTRY_INFO!K49=3,COUNTRY_INFO!F49/(COUNTRY_INFO!F49+COUNTRY_INFO!G49)))),0)","v":0.51439764447549652},{"$f":"IF(AND(Z49<>0,Z49<>\"Inconnu\",Z49<>\"Non requis\"),IF(COUNTRY_INFO!K49=1,0,IF(COUNTRY_INFO!K49=2,0.2*COUNTRY_INFO!G49/(0.5*COUNTRY_INFO!F49+0.2*COUNTRY_INFO!G49),IF(COUNTRY_INFO!K49=3,COUNTRY_INFO!G49/(COUNTRY_INFO!F49+COUNTRY_INFO!G49)))),0)","v":0.48560235552450343},{"$f":"MAX(COUNTRY_INFO!D49*AK49*PROFILE!$G$7,COUNTRY_INFO!D49*AL49*PROFILE!$G$7)","v":1319.2514642974661},{"$f":"MAX(COUNTRY_INFO!D49*AK49*PROFILE!$G$8,COUNTRY_INFO!D49*AL49*PROFILE!$G$8,COUNTRY_INFO!D49*AM49*PROFILE!$G$8)","v":3958.0576544141845},{"$f":"MAX(COUNTRY_INFO!D49*AK49*PROFILE!$G$9,COUNTRY_INFO!D49*AL49*PROFILE!$G$9,COUNTRY_INFO!D49*AM49*PROFILE!$G$9,IF(AND(DISTRICT!Z49<>\"Inconnu\",Z49<>\"Non requis\"),COUNTRY_INFO!P49*DISTRICT!AN49,0))","v":8246.0957667963521},{"$f":"MAX(COUNTRY_INFO!D49*AK49*PROFILE!$G$10,COUNTRY_INFO!D49*AL49*PROFILE!$G$10,IF(AND(DISTRICT!Z49<>\"Inconnu\",Z49<>\"Non requis\"),COUNTRY_INFO!P49*DISTRICT!AO49,0))","v":19460.595114491996},32984,0,{"$f":"MAX('MDA4'!R49,'T1'!L49,'T2'!J49,T3_R1!K49,T3_R2!K49)","v":0},{"$f":"MAX('MDA1'!K49,'MDA4'!S49,'MDA3'!I49,'MDA3'!L49,'T1'!M49,'T2'!K49,T3_R1!L49,T3_R2!L49)","v":3203},{"$f":"MAX('MDA1'!L49,'MDA4'!T49,'MDA3'!J49,'MDA3'!M49,'T1'!N49,'T2'!L49,T3_R1!M49,T3_R2!M49)","v":0},3203,{"$f":"MAX('MDA4'!R49,T49)","v":0},{"$f":"MAX('MDA1'!K49,'MDA4'!S49,'MDA3'!I49,'MDA3'!L49,V49,AD49)","v":3203},{"$f":"MAX('MDA1'!L49,'MDA4'!T49,'MDA3'!J49,'MDA3'!M49,AF49)","v":0},3203,9.7107688576279418]
[{"$f":"IF(COUNTRY_INFO!A50=0,\" \",COUNTRY_INFO!A50)","v":"Gabon"},{"$f":"IF(COUNTRY_INFO!B50=0,\" \",COUNTRY_INFO!B50)","v":"Centre-Est"},{"$f":"IF(COUNTRY_INFO!C50=0,\" \",COUNTRY_INFO!C50)","v":"Mulundu"},{"$f":"COUNTRY_INFO!M50","v":33296},null,null,{"$f":"MAX('MDA1'!M50,'MDA4'!U50)","v":0},{"$f":"IF(AND(COUNTRY_INFO!H50>0,COUNTRY_INFO!H50<4),IF(D50>MAX('MDA1'!M50,'MDA4'!U50),MAX('MDA1'!M50,'MDA4'!U50),D50),0)","v":0},{"$f":"IF(AND(COUNTRY_INFO!H50>0,COUNTRY_INFO!H50<4), IF(G50/D50*100<>0, IF(G50/D50*100>100,100,G50/D50*100), \"-\"),0)","v":"-"},{"$f":"COUNTRY_INFO!N50","v":33296},null,null,{"$f":"MAX('MDA1'!M50,MAX('MDA3'!I50,'MDA3'!L50)+MAX('MDA3'!J50,'MDA3'!M50))","v":0},{"$f":"IF(AND(COUNTRY_INFO!I50>0,COUNTRY_INFO!I50<4),IF(J50>MAX('MDA1'!M50,MAX('MDA3'!I50,'MDA3'!L50)+MAX('MDA3'!J50,'MDA3'!M50)),MAX('MDA1'!M50,MAX('MDA3'!I50,'MDA3'!L50)+MAX('MDA3'!J50,'MDA3'!M50)),J50),0)","v":0},{"$f":"IF(AND(COUNTRY_INFO!I50>0,COUNTRY_INFO!I50<4), IF(M50/J50*100<>0, IF(M50/J50*100>100,100,M50/J50*100), \"-\"),0)","v":"-"},{"$f":"COUNTRY_INFO!O50","v":12320},1720,1821,{"$f":"SUM(MAX('MDA4'!N50, 'T1'!L50, MAX(T3_R1!K50, T3_R2!K50)), MAX('MDA1'!K50, 'MDA4'!O50, 'T1'!M50, MAX(T3_R1!L50, T3_R2!L50)), MAX('MDA1'!L50, 'MDA4'!P50, 'T1'!N50, MAX(T3_R1!M50, T3_R2!M50)))","v":3541},{"$f":"IF(AND(COUNTRY_INFO!J50>1,COUNTRY_INFO!J50<4),IF(COUNTRY_INFO!E50>MAX('MDA4'!N50,'T1'!L50,MAX(T3_R1!K50,T3_R2!K50)),MAX('MDA4'!N50,'T1'!L50,MAX(T3_R1!K50,T3_R2!K50)),COUNTRY_INFO!E50),0)","v":0},{"$f":"IF(AND(COUNTRY_INFO!J50>1,COUNTRY_INFO!J50<4), IF(T50/COUNTRY_INFO!E50*100<>0, IF(T50/COUNTRY_INFO!E50*100>100,100,T50/COUNTRY_INFO!E50*100), \"-\"),0)","v":"-"},{"$f":"IF(AND(COUNTRY_INFO!J50>1,COUNTRY_INFO!J50<4),IF(COUNTRY_INFO!F50>MAX('MDA1'!K50,'MDA4'!O50,'T1'!M50,MAX(T3_R1!L50,T3_R2!L50)),MAX('MDA1'!K50,'MDA4'!O50,'T1'!M50,MAX(T3_R1!L50,T3_R2!L50)),COUNTRY_INFO!F50),0)","v":3541},{"$f":"IF(AND(COUNTRY_INFO!J50>1,COUNTRY_INFO!J50<4), IF(V50/COUNTRY_INFO!F50*100<>0, IF(V50/COUNTRY_INFO!F50*100>100,100,V50/COUNTRY_INFO!F50*100), \"-\"),0)","v":42.539644401729937},3541,{"$f":"IF(AND(COUNTRY_INFO!J50>1,COUNTRY_INFO!J50<4), IF(S50/P50*100<>0, IF(X50/P50*100>100,100,X50/P50*100), \"-\"),0)","v":28.741883116883116},{"$f":"COUNTRY_INFO!P50","v":2746.92},1720,1821,{"$f":"MAX('T1'!L50,'T2'!J50)+MAX('T1'!M50,'T2'!K50)+MAX('T1'!N50,'T2'!L50)","v":3541},{"$f":"IF(COUNTRY_INFO!K50=1,IF(COUNTRY_INFO!F50*0.33>MAX('T1'!M50,'T2'!K50),MAX('T1'!M50,'T2'!K50),COUNTRY_INFO!F50*0.33),IF(COUNTRY_INFO!K50=2,IF(COUNTRY_INFO!F50*0.5>MAX('T1'!M50,'T2'!K50),MAX('T1'!M50,'T2'!K50),COUNTRY_INFO!F50*0.5),IF(COUNTRY_INFO!K50=3,IF(COUNTRY_INFO!F50>MAX('T1'!M50,'T2'!K50),MAX('T1'!M50,'T2'!K50),COUNTRY_INFO!F50),0)))","v":2746.92},{"$f":"IF(AND(COUNTRY_INFO!K50>0,COUNTRY_INFO!K50<4),IF(Z50>0,IF(COUNTRY_INFO!K50=1, AD50/(COUNTRY_INFO!F50*0.33)*100, IF(COUNTRY_INFO!K50=2, AD50/(COUNTRY_INFO!F50*0.5)*100, IF(COUNTRY_INFO!K50=3, AD50/COUNTRY_INFO!F50*100))),\"-\"),0)","v":100},{"$f":"IF(COUNTRY_INFO!K50=2,IF(COUNTRY_INFO!G50*0.2>MAX('T1'!N50,'T2'!L50),MAX('T1'!N50,'T2'!L50),COUNTRY_INFO!G50*0.2),IF(COUNTRY_INFO!K50=3,IF(COUNTRY_INFO!G50>MAX('T1'!N50,'T2'!L50),MAX('T1'!N50,'T2'!L50),COUNTRY_INFO!G50),0))","v":0},{"$f":"IF(AND(COUNTRY_INFO!K50>0,COUNTRY_INFO!K50<4),IF(Z50>0,IF(COUNTRY_INFO!K50=1, 0, IF(COUNTRY_INFO!K50=2, AF50/(COUNTRY_INFO!G50*0.2)*100, IF(COUNTRY_INFO!K50=3, AF50/COUNTRY_INFO!G50*100))),\"-\"),0)","v":0},2746.92,{"$f":"IF(AND(COUNTRY_INFO!K50>0,COUNTRY_INFO!K50<4), IF(AC50/Z50*100<>0, IF(AH50/Z50*100>100,100,AH50/Z50*100), \"-\"),0)","v":100},null,{"$f":"IF(AND(D50<>0, D50<>\"Inconnu\",D50<>\"Interrompu\",D50<>\"Non requis\"),D50/COUNTRY_INFO!D50, 0)","v":1},{"$f":"IF(AND(J50<>0,J50<>\"Inconnu\",J50<>\"Interrompu\",J50<>\"Non requis\"),J50/COUNTRY_INFO!D50, 0)","v":1},{"$f":"IF(AND(P50<>0,P50<>\"Inconnu\",P50<>\"Non requis\"),P50/(COUNTRY_INFO!E50+COUNTRY_INFO!F50), 0)","v":1},{"$f":"IF(AND(Z50<>0,Z50<>\"Inconnu\",Z50<>\"Non requis\"),IF(COUNTRY_INFO!K50=1,1,IF(COUNTRY_INFO!K50=2,0.5*COUNTRY_INFO!F50/(0.5*COUNTRY_INFO!F50+0.2*COUNTRY_INFO!G50),IF(COUNTRY_INFO!K50=3,COUNTRY_INFO!F50/(COUNTRY_INFO!F50+COUNTRY_INFO!G50)))),0)","v":1},{"$f":"IF(AND(Z50<>0,Z50<>\"Inconnu\",Z50<>\"Non requis\"),IF(COUNTRY_INFO!K50=1,0,IF(COUNTRY_INFO!K50=2,0.2*COUNTRY_INFO!G50/(0.5*COUNTRY_INFO!F50+0.2*COUNTRY_INFO!G50),IF(COUNTRY_INFO!K50=3,COUNTRY_INFO!G50/(COUNTRY_INFO!F50+COUNTRY_INFO!G50)))),0)","v":0},{"$f":"MAX(COUNTRY_INFO!D50*AK50*PROFILE!$G$7,COUNTRY_INFO!D50*AL50*PROFILE!$G$7)","v":1331.7304376439617},{"$f":"MAX(COUNTRY_INFO!D50*AK50*PROFILE!$G$8,COUNTRY_INFO!D50*AL50*PROFILE!$G$8,COUNTRY_INFO!D50*AM50*PROFILE!$G$8)","v":3995.4974430443453},{"$f":"MAX(COUNTRY_INFO!D50*AK50*PROFILE!$G$9,COUNTRY_INFO!D50*AL50*PROFILE!$G$9,COUNTRY_INFO!D50*AM50*PROFILE!$G$9,IF(AND(DISTRICT!Z50<>\"Inconnu\",Z50<>\"Non requis\"),COUNTRY_INFO!P50*DISTRICT!AN50,0))","v":8324.0966726670922},{"$f":"MAX(COUNTRY_INFO!D50*AK50*PROFILE!$G$10,COUNTRY_INFO!D50*AL50*PROFILE!$G$10,IF(AND(DISTRICT!Z50<>\"Inconnu\",Z50<>\"Non requis\"),COUNTRY_INFO!P50*DISTRICT!AO50,0))","v":19644.6754466446},33296,0,{"$f":"MAX('MDA4'!R50,'T1'!L50,'T2'!J50,T3_R1!K50,T3_R2!K50)","v":0},{"$f":"MAX('MDA1'!K50,'MDA4'!S50,'MDA3'!I50,'MDA3'!L50,'T1'!M50,'T2'!K50,T3_R1!L50,T3_R2!L50)","v":3541},{"$f":"MAX('MDA1'!L50,'MDA4'!T50,'MDA3'!J50,'MDA3'!M50,'T1'!N50,'T2'!L50,T3_R1!M50,T3_R2!M50)","v":0},3541,{"$f":"MAX('MDA4'!R50,T50)","v":0},{"$f":"MAX('MDA1'!K50,'MDA4'!S50,'MDA3'!I50,'MDA3'!L50,V50,AD50)","v":3541},{"$f":"MAX('MDA1'!L50,'MDA4'!T50,'MDA3'!J50,'MDA3'!M50,AF50)","v":0},3541,10.634911100432484]
[{"$f":"IF(COUNTRY_INFO!A51=0,\" \",COUNTRY_INFO!A51)","v":"Gabon"},{"$f":"IF(COUNTRY_INFO!B51=0,\" \",COUNTRY_INFO!B51)","v":"Centre-Est"},{"$f":"IF(COUNTRY_INFO!C51=0,\" \",COUNTRY_INFO!C51)","v":"Lombo-Bouenguidi"},{"$f":"COUNTRY_INFO!M51","v":0},null,null,{"$f":"MAX('MDA1'!M51,'MDA4'!U51)","v":0},{"$f":"IF(AND(COUNTRY_INFO!H51>0,COUNTRY_INFO!H51<4),IF(D51>MAX('MDA1'!M51,'MDA4'!U51),MAX('MDA1'!M51,'MDA4'!U51),D51),0)","v":0},{"$f":"IF(AND(COUNTRY_INFO!H51>0,COUNTRY_INFO!H51<4), IF(G51/D51*100<>0, IF(G51/D51*100>100,100,G51/D51*100), \"-\"),0)","v":0},{"$f":"COUNTRY_INFO!N51","v":5498},null,null,{"$f":"MAX('MDA1'!M51,MAX('MDA3'!I51,'MDA3'!L51)+MAX('MDA3'!J51,'MDA3'!M51))","v":0},{"$f":"IF(AND(COUNTRY_INFO!I51>0,COUNTRY_INFO!I51<4),IF(J51>MAX('MDA1'!M51,MAX('MDA3'!I51,'MDA3'!L51)+MAX('MDA3'!J51,'MDA3'!M51)),MAX('MDA1'!M51,MAX('MDA3'!I51,'MDA3'!L51)+MAX('MDA3'!J51,'MDA3'!M51)),J51),0)","v":0},{"$f":"IF(AND(COUNTRY_INFO!I51>0,COUNTRY_INFO!I51<4), IF(M51/J51*100<>0, IF(M51/J51*100>100,100,M51/J51*100), \"-\"),0)","v":"-"},{"$f":"COUNTRY_INFO!O51","v":2035},406,366,{"$f":"SUM(MAX('MDA4'!N51, 'T1'!L51, MAX(T3_R1!K51, T3_R2!K51)), MAX('MDA1'!K51, 'MDA4'!O51, 'T1'!M51, MAX(T3_R1!L51, T3_R2!L51)), MAX('MDA1'!L51, 'MDA4'!P51, 'T1'!N51, MAX(T3_R1!M51, T3_R2!M51)))","v":775},{"$f":"IF(AND(COUNTRY_INFO!J51>1,COUNTRY_INFO!J51<4),IF(COUNTRY_INFO!E51>MAX('MDA4'!N51,'T1'!L51,MAX(T3_R1!K51,T3_R2!K51)),MAX('MDA4'!N51,'T1'!L51,MAX(T3_R1!K51,T3_R2!K51)),COUNTRY_INFO!E51),0)","v":0},{"$f":"IF(AND(COUNTRY_INFO!J51>1,COUNTRY_INFO!J51<4), IF(T51/COUNTRY_INFO!E51*100<>0, IF(T51/COUNTRY_INFO!E51*100>100,100,T51/COUNTRY_INFO!E51*100), \"-\"),0)","v":"-"},{"$f":"IF(AND(COUNTRY_INFO!J51>1,COUNTRY_INFO!J51<4),IF(COUNTRY_INFO!F51>MAX('MDA1'!K51,'MDA4'!O51,'T1'!M51,MAX(T3_R1!L51,T3_R2!L51)),MAX('MDA1'!K51,'MDA4'!O51,'T1'!M51,MAX(T3_R1!L51,T3_R2!L51)),COUNTRY_INFO!F51),0)","v":775},{"$f":"IF(AND(COUNTRY_INFO!J51>1,COUNTRY_INFO!J51<4), IF(V51/COUNTRY_INFO!F51*100<>0, IF(V51/COUNTRY_INFO!F51*100>100,100,V51/COUNTRY_INFO!F51*100), \"-\"),0)","v":56.36363636363636},775,{"$f":"IF(AND(COUNTRY_INFO!J51>1,COUNTRY_INFO!J51<4), IF(S51/P51*100<>0, IF(X51/P51*100>100,100,X51/P51*100), \"-\"),0)","v":38.08353808353808},{"$f":"COUNTRY_INFO!P51","v":453.75},406,366,{"$f":"MAX('T1'!L51,'T2'!J51)+MAX('T1'!M51,'T2'!K51)+MAX('T1'!N51,'T2'!L51)","v":772},{"$f":"IF(COUNTRY_INFO!K51=1,IF(COUNTRY_INFO!F51*0.33>MAX('T1'!M51,'T2'!K51),MAX('T1'!M51,'T2'!K51),COUNTRY_INFO!F51*0.33),IF(COUNTRY_INFO!K51=2,IF(COUNTRY_INFO!F51*0.5>MAX('T1'!M51,'T2'!K51),MAX('T1'!M51,'T2'!K51),COUNTRY_INFO!F51*0.5),IF(COUNTRY_INFO!K51=3,IF(COUNTRY_INFO!F51>MAX('T1'!M51,'T2'!K51),MAX('T1'!M51,'T2'!K51),COUNTRY_INFO!F51),0)))","v":453.75},{"$f":"IF(AND(COUNTRY_INFO!K51>0,COUNTRY_INFO!K51<4),IF(Z51>0,IF(COUNTRY_INFO!K51=1, AD51/(COUNTRY_INFO!F51*0.33)*100, IF(COUNTRY_INFO!K51=2, AD51/(COUNTRY_INFO!F51*0.5)*100, IF(COUNTRY_INFO!K51=3, AD51/COUNTRY_INFO!F51*100))),\"-\"),0)","v":100},{"$f":"IF(COUNTRY_INFO!K51=2,IF(COUNTRY_INFO!G51*0.2>MAX('T1'!N51,'T2'!L51),MAX('T1'!N51,'T2'!L51),COUNTRY_INFO!G51*0.2),IF(COUNTRY_INFO!K51=3,IF(COUNTRY_INFO!G51>MAX('T1'!N51,'T2'!L51),MAX('T1'!N51,'T2'!L51),COUNTRY_INFO!G51),0))","v":0},{"$f":"IF(AND(COUNTRY_INFO!K51>0,COUNTRY_INFO!K51<4),IF(Z51>0,IF(COUNTRY_INFO!K51=1, 0, IF(COUNTRY_INFO!K51=2, AF51/(COUNTRY_INFO!G51*0.2)*100, IF(COUNTRY_INFO!K51=3, AF51/COUNTRY_INFO!G51*100))),\"-\"),0)","v":0},453.75,{"$f":"IF(AND(COUNTRY_INFO!K51>0,COUNTRY_INFO!K51<4), IF(AC51/Z51*100<>0, IF(AH51/Z51*100>100,100,AH51/Z51*100), \"-\"),0)","v":100},null,{"$f":"IF(AND(D51<>0, D51<>\"Inconnu\",D51<>\"Interrompu\",D51<>\"Non requis\"),D51/COUNTRY_INFO!D51, 0)","v":0},{"$f":"IF(AND(J51<>0,J51<>\"Inconnu\",J51<>\"Interrompu\",J51<>\"Non requis\"),J51/COUNTRY_INFO!D51, 0)","v":1},{"$f":"IF(AND(P51<>0,P51<>\"Inconnu\",P51<>\"Non requis\"),P51/(COUNTRY_INFO!E51+COUNTRY_INFO!F51), 0)","v":1},{"$f":"IF(AND(Z51<>0,Z51<>\"Inconnu\",Z51<>\"Non requis\"),IF(COUNTRY_INFO!K51=1,1,IF(COUNTRY_INFO!K51=2,0.5*COUNTRY_INFO!F51/(0.5*COUNTRY_INFO!F51+0.2*COUNTRY_INFO!G51),IF(COUNTRY_INFO!K51=3,COUNTRY_INFO!F51/(COUNTRY_INFO!F51+COUNTRY_INFO!G51)))),0)","v":1},{"$f":"IF(AND(Z51<>0,Z51<>\"Inconnu\",Z51<>\"Non requis\"),IF(COUNTRY_INFO!K51=1,0,IF(COUNTRY_INFO!K51=2,0.2*COUNTRY_INFO!G51/(0.5*COUNTRY_INFO!F51+0.2*COUNTRY_INFO!G51),IF(COUNTRY_INFO!K51=3,COUNTRY_INFO!G51/(COUNTRY_INFO!F51+COUNTRY_INFO!G51)))),0)","v":0},{"$f":"MAX(COUNTRY_INFO!D51*AK51*PROFILE!$G$7,COUNTRY_INFO!D51*AL51*PROFILE!$G$7)","v":219.90190852254028},{"$f":"MAX(COUNTRY_INFO!D51*AK51*PROFILE!$G$8,COUNTRY_INFO!D51*AL51*PROFILE!$G$8,COUNTRY_INFO!D51*AM51*PROFILE!$G$8)","v":659.75627528405244},{"$f":"MAX(COUNTRY_INFO!D51*AK51*PROFILE!$G$9,COUNTRY_INFO!D51*AL51*PROFILE!$G$9,COUNTRY_INFO!D51*AM51*PROFILE!$G$9,IF(AND(DISTRICT!Z51<>\"Inconnu\",Z51<>\"Non requis\"),COUNTRY_INFO!P51*DISTRICT!AN51,0))","v":1374.5159630683468},{"$f":"MAX(COUNTRY_INFO!D51*AK51*PROFILE!$G$10,COUNTRY_INFO!D51*AL51*PROFILE!$G$10,IF(AND(DISTRICT!Z51<>\"Inconnu\",Z51<>\"Non requis\"),COUNTRY_INFO!P51*DISTRICT!AO51,0))","v":3243.8258531250603},5498,0,{"$f":"MAX('MDA4'!R51,'T1'!L51,'T2'!J51,T3_R1!K51,T3_R2!K51)","v":0},{"$f":"MAX('MDA1'!K51,'MDA4'!S51,'MDA3'!I51,'MDA3'!L51,'T1'!M51,'T2'!K51,T3_R1!L51,T3_R2!L51)","v":775},{"$f":"MAX('MDA1'!L51,'MDA4'!T51,'MDA3'!J51,'MDA3'!M51,'T1'!N51,'T2'!L51,T3_R1!M51,T3_R2!M51)","v":0},775,{"$f":"MAX('MDA4'!R51,T51)","v":0},{"$f":"MAX('MDA1'!K51,'MDA4'!S51,'MDA3'!I51,'MDA3'!L51,V51,AD51)","v":775},{"$f":"MAX('MDA1'!L51,'MDA4'!T51,'MDA3'!J51,'MDA3'!M51,AF51)","v":0},775,14.096034921789741]
[{"$f":"IF(COUNTRY_INFO!A52=0,\" \",COUNTRY_INFO!A52)","v":"Gabon"},{"$f":"IF(COUNTRY_INFO!B52=0,\" \",COUNTRY_INFO!B52)","v":"Maritime"},{"$f":"IF(COUNTRY_INFO!C52=0,\" \",COUNTRY_INFO!C52)","v":"Ndougou"},{"$f":"COUNTRY_INFO!M52","v":0},null,null,{"$f":"MAX('MDA1'!M52,'MDA4'!U52)","v":0},{"$f":"IF(AND(COUNTRY_INFO!H52>0,COUNTRY_INFO!H52<4),IF(D52>MAX('MDA1'!M52,'MDA4'!U52),MAX('MDA1'!M52,'MDA4'!U52),D52),0)","v":0},{"$f":"IF(AND(COUNTRY_INFO!H52>0,COUNTRY_INFO!H52<4), IF(G52/D52*100<>0, IF(G52/D52*100>100,100,G52/D52*100), \"-\"),0)","v":0},{"$f":"COUNTRY_INFO!N52","v":"Inconnu"},null,null,{"$f":"MAX('MDA1'!M52,MAX('MDA3'!I52,'MDA3'!L52)+MAX('MDA3'!J52,'MDA3'!M52))","v":0},{"$f":"IF(AND(COUNTRY_INFO!I52>0,COUNTRY_INFO!I52<4),IF(J52>MAX('MDA1'!M52,MAX('MDA3'!I52,'MDA3'!L52)+MAX('MDA3'!J52,'MDA3'!M52)),MAX('MDA1'!M52,MAX('MDA3'!I52,'MDA3'!L52)+MAX('MDA3'!J52,'MDA3'!M52)),J52),0)","v":0},{"$f":"IF(AND(COUNTRY_INFO!I52>0,COUNTRY_INFO!I52<4), IF(M52/J52*100<>0, IF(M52/J52*100>100,100,M52/J52*100), \"-\"),0)","v":0},{"$f":"COUNTRY_INFO!O52","v":4352},473,520,{"$f":"SUM(MAX('MDA4'!N52, 'T1'!L52, MAX(T3_R1!K52, T3_R2!K52)), MAX('MDA1'!K52, 'MDA4'!O52, 'T1'!M52, MAX(T3_R1!L52, T3_R2!L52)), MAX('MDA1'!L52, 'MDA4'!P52, 'T1'!N52, MAX(T3_R1!M52, T3_R2!M52)))","v":993},{"$f":"IF(AND(COUNTRY_INFO!J52>1,COUNTRY_INFO!J52<4),IF(COUNTRY_INFO!E52>MAX('MDA4'!N52,'T1'!L52,MAX(T3_R1!K52,T3_R2!K52)),MAX('MDA4'!N52,'T1'!L52,MAX(T3_R1!K52,T3_R2!K52)),COUNTRY_INFO!E52),0)","v":0},{"$f":"IF(AND(COUNTRY_INFO!J52>1,COUNTRY_INFO!J52<4), IF(T52/COUNTRY_INFO!E52*100<>0, IF(T52/COUNTRY_INFO!E52*100>100,100,T52/COUNTRY_INFO!E52*100), \"-\"),0)","v":"-"},{"$f":"IF(AND(COUNTRY_INFO!J52>1,COUNTRY_INFO!J52<4),IF(COUNTRY_INFO!F52>MAX('MDA1'!K52,'MDA4'!O52,'T1'!M52,MAX(T3_R1!L52,T3_R2!L52)),MAX('MDA1'!K52,'MDA4'!O52,'T1'!M52,MAX(T3_R1!L52,T3_R2!L52)),COUNTRY_INFO!F52),0)","v":993},{"$f":"IF(AND(COUNTRY_INFO!J52>1,COUNTRY_INFO!J52<4), IF(V52/COUNTRY_INFO!F52*100<>0, IF(V52/COUNTRY_INFO!F52*100>100,100,V52/COUNTRY_INFO!F52*100), \"-\"),0)","v":33.764025841550492},993,{"$f":"IF(AND(COUNTRY_INFO!J52>1,COUNTRY_INFO!J52<4), IF(S52/P52*100<>0, IF(X52/P52*100>100,100,X52/P52*100), \"-\"),0)","v":22.817095588235293},{"$f":"COUNTRY_INFO!P52","v":970.53000000000009},473,520,{"$f":"MAX('T1'!L52,'T2'!J52)+MAX('T1'!M52,'T2'!K52)+MAX('T1'!N52,'T2'!L52)","v":993},{"$f":"IF(COUNTRY_INFO!K52=1,IF(COUNTRY_INFO!F52*0.33>MAX('T1'!M52,'T2'!K52),MAX('T1'!M52,'T2'!K52),COUNTRY_INFO!F52*0.33),IF(COUNTRY_INFO!K52=2,IF(COUNTRY_INFO!F52*0.5>MAX('T1'!M52,'T2'!K52),MAX('T1'!M52,'T2'!K52),COUNTRY_INFO!F52*0.5),IF(COUNTRY_INFO!K52=3,IF(COUNTRY_INFO!F52>MAX('T1'!M52,'T2'!K52),MAX('T1'!M52,'T2'!K52),COUNTRY_INFO!F52),0)))","v":970.53000000000009},{"$f":"IF(AND(COUNTRY_INFO!K52>0,COUNTRY_INFO!K52<4),IF(Z52>0,IF(COUNTRY_INFO!K52=1, AD52/(COUNTRY_INFO!F52*0.33)*100, IF(COUNTRY_INFO!K52=2, AD52/(COUNTRY_INFO!F52*0.5)*100, IF(COUNTRY_INFO!K52=3, AD52/COUNTRY_INFO!F52*100))),\"-\"),0)","v":100},{"$f":"IF(COUNTRY_INFO!K52=2,IF(COUNTRY_INFO!G52*0.2>MAX('T1'!N52,'T2'!L52),MAX('T1'!N52,'T2'!L52),COUNTRY_INFO!G52*0.2),IF(COUNTRY_INFO!K52=3,IF(COUNTRY_INFO!G52>MAX('T1'!N52,'T2'!L52),MAX('T1'!N52,'T2'!L52),COUNTRY_INFO!G52),0))","v":0},{"$f":"IF(AND(COUNTRY_INFO!K52>0,COUNTRY_INFO!K52<4),IF(Z52>0,IF(COUNTRY_INFO!K52=1, 0, IF(COUNTRY_INFO!K52=2, AF52/(COUNTRY_INFO!G52*0.2)*100, IF(COUNTRY_INFO!K52=3, AF52/COUNTRY_INFO!G52*100))),\"-\"),0)","v":0},970.53000000000009,{"$f":"IF(AND(COUNTRY_INFO!K52>0,COUNTRY_INFO!K52<4), IF(AC52/Z52*100<>0, IF(AH52/Z52*100>100,100,AH52/Z52*100), \"-\"),0)","v":100},null,{"$f":"IF(AND(D52<>0, D52<>\"Inconnu\",D52<>\"Interrompu\",D52<>\"Non requis\"),D52/COUNTRY_INFO!D52, 0)","v":0},{"$f":"IF(AND(J52<>0,J52<>\"Inconnu\",J52<>\"Interrompu\",J52<>\"Non requis\"),J52/COUNTRY_INFO!D52, 0)","v":0},{"$f":"IF(AND(P52<>0,P52<>\"Inconnu\",P52<>\"Non requis\"),P52/(COUNTRY_INFO!E52+COUNTRY_INFO!F52), 0)","v":1},{"$f":"IF(AND(Z52<>0,Z52<>\"Inconnu\",Z52<>\"Non requis\"),IF(COUNTRY_INFO!K52=1,1,IF(COUNTRY_INFO!K52=2,0.5*COUNTRY_INFO!F52/(0.5*COUNTRY_INFO!F52+0.2*COUNTRY_INFO!G52),IF(COUNTRY_INFO!K52=3,COUNTRY_INFO!F52/(COUNTRY_INFO!F52+COUNTRY_INFO!G52)))),0)","v":1},{"$f":"IF(AND(Z52<>0,Z52<>\"Inconnu\",Z52<>\"Non requis\"),IF(COUNTRY_INFO!K52=1,0,IF(COUNTRY_INFO!K52=2,0.2*COUNTRY_INFO!G52/(0.5*COUNTRY_INFO!F52+0.2*COUNTRY_INFO!G52),IF(COUNTRY_INFO!K52=3,COUNTRY_INFO!G52/(COUNTRY_INFO!F52+COUNTRY_INFO!G52)))),0)","v":0},{"$f":"MAX(COUNTRY_INFO!D52*AK52*PROFILE!$G$7,COUNTRY_INFO!D52*AL52*PROFILE!$G$7)","v":0},{"$f":"MAX(COUNTRY_INFO!D52*AK52*PROFILE!$G$8,COUNTRY_INFO!D52*AL52*PROFILE!$G$8,COUNTRY_INFO!D52*AM52*PROFILE!$G$8)","v":1411.4320316280509},{"$f":"MAX(COUNTRY_INFO!D52*AK52*PROFILE!$G$9,COUNTRY_INFO!D52*AL52*PROFILE!$G$9,COUNTRY_INFO!D52*AM52*PROFILE!$G$9,IF(AND(DISTRICT!Z52<>\"Inconnu\",Z52<>\"Non requis\"),COUNTRY_INFO!P52*DISTRICT!AN52,0))","v":2940.5341501654952},{"$f":"MAX(COUNTRY_INFO!D52*AK52*PROFILE!$G$10,COUNTRY_INFO!D52*AL52*PROFILE!$G$10,IF(AND(DISTRICT!Z52<>\"Inconnu\",Z52<>\"Non requis\"),COUNTRY_INFO!P52*DISTRICT!AO52,0))","v":0},4351.9661817935466,"Y",{"$f":"MAX('MDA4'!R52,'T1'!L52,'T2'!J52,T3_R1!K52,T3_R2!K52)","v":0},{"$f":"MAX('MDA1'!K52,'MDA4'!S52,'MDA3'!I52,'MDA3'!L52,'T1'!M52,'T2'!K52,T3_R1!L52,T3_R2!L52)","v":993},{"$f":"MAX('MDA1'!L52,'MDA4'!T52,'MDA3'!J52,'MDA3'!M52,'T1'!N52,'T2'!L52,T3_R1!M52,T3_R2!M52)","v":0},993,{"$f":"MAX('MDA4'!R52,T52)","v":0},{"$f":"MAX('MDA1'!K52,'MDA4'!S52,'MDA3'!I52,'MDA3'!L52,V52,AD52)","v":993},{"$f":"MAX('MDA1'!L52,'MDA4'!T52,'MDA3'!J52,'MDA3'!M52,AF52)","v":0},993,22.817272895047211]
[{"$f":"IF(COUNTRY_INFO!A53=0,\" \",COUNTRY_INFO!A53)","v":"Gabon"},{"$f":"IF(COUNTRY_INFO!B53=0,\" \",COUNTRY_INFO!B53)","v":"Maritime"},{"$f":"IF(COUNTRY_INFO!C53=0,\" \",COUNTRY_INFO!C53)","v":"Etimboué"},{"$f":"COUNTRY_INFO!M53","v":0},null,null,{"$f":"MAX('MDA1'!M53,'MDA4'!U53)","v":0},{"$f":"IF(AND(COUNTRY_INFO!H53>0,COUNTRY_INFO!H53<4),IF(D53>MAX('MDA1'!M53,'MDA4'!U53),MAX('MDA1'!M53,'MDA4'!U53),D53),0)","v":0},{"$f":"IF(AND(COUNTRY_INFO!H53>0,COUNTRY_INFO!H53<4), IF(G53/D53*100<>0, IF(G53/D53*100>100,100,G53/D53*100), \"-\"),0)","v":0},{"$f":"COUNTRY_INFO!N53","v":0},null,null,{"$f":"MAX('MDA1'!M53,MAX('MDA3'!I53,'MDA3'!L53)+MAX('MDA3'!J53,'MDA3'!M53))","v":0},{"$f":"IF(AND(COUNTRY_INFO!I53>0,COUNTRY_INFO!I53<4),IF(J53>MAX('MDA1'!M53,MAX('MDA3'!I53,'MDA3'!L53)+MAX('MDA3'!J53,'MDA3'!M53)),MAX('MDA1'!M53,MAX('MDA3'!I53,'MDA3'!L53)+MAX('MDA3'!J53,'MDA3'!M53)),J53),0)","v":0},{"$f":"IF(AND(COUNTRY_INFO!I53>0,COUNTRY_INFO!I53<4), IF(M53/J53*100<>0, IF(M53/J53*100>100,100,M53/J53*100), \"-\"),0)","v":0},{"$f":"COUNTRY_INFO!O53","v":1943},403,391,{"$f":"SUM(MAX('MDA4'!N53, 'T1'!L53, MAX(T3_R1!K53, T3_R2!K53)), MAX('MDA1'!K53, 'MDA4'!O53, 'T1'!M53, MAX(T3_R1!L53, T3_R2!L53)), MAX('MDA1'!L53, 'MDA4'!P53, 'T1'!N53, MAX(T3_R1!M53, T3_R2!M53)))","v":794},{"$f":"IF(AND(COUNTRY_INFO!J53>1,COUNTRY_INFO!J53<4),IF(COUNTRY_INFO!E53>MAX('MDA4'!N53,'T1'!L53,MAX(T3_R1!K53,T3_R2!K53)),MAX('MDA4'!N53,'T1'!L53,MAX(T3_R1!K53,T3_R2!K53)),COUNTRY_INFO!E53),0)","v":0},{"$f":"IF(AND(COUNTRY_INFO!J53>1,COUNTRY_INFO!J53<4), IF(T53/COUNTRY_INFO!E53*100<>0, IF(T53/COUNTRY_INFO!E53*100>100,100,T53/COUNTRY_INFO!E53*100), \"-\"),0)","v":"-"},{"$f":"IF(AND(COUNTRY_INFO!J53>1,COUNTRY_INFO!J53<4),IF(COUNTRY_INFO!F53>MAX('MDA1'!K53,'MDA4'!O53,'T1'!M53,MAX(T3_R1!L53,T3_R2!L53)),MAX('MDA1'!K53,'MDA4'!O53,'T1'!M53,MAX(T3_R1!L53,T3_R2!L53)),COUNTRY_INFO!F53),0)","v":794},{"$f":"IF(AND(COUNTRY_INFO!J53>1,COUNTRY_INFO!J53<4), IF(V53/COUNTRY_INFO!F53*100<>0, IF(V53/COUNTRY_INFO!F53*100>100,100,V53/COUNTRY_INFO!F53*100), \"-\"),0)","v":60.472201066260467},794,{"$f":"IF(AND(COUNTRY_INFO!J53>1,COUNTRY_INFO!J53<4), IF(S53/P53*100<>0, IF(X53/P53*100>100,100,X53/P53*100), \"-\"),0)","v":40.86464230571282},{"$f":"COUNTRY_INFO!P53","v":433.29},403,391,{"$f":"MAX('T1'!L53,'T2'!J53)+MAX('T1'!M53,'T2'!K53)+MAX('T1'!N53,'T2'!L53)","v":794},{"$f":"IF(COUNTRY_INFO!K53=1,IF(COUNTRY_INFO!F53*0.33>MAX('T1'!M53,'T2'!K53),MAX('T1'!M53,'T2'!K53),COUNTRY_INFO!F53*0.33),IF(COUNTRY_INFO!K53=2,IF(COUNTRY_INFO!F53*0.5>MAX('T1'!M53,'T2'!K53),MAX('T1'!M53,'T2'!K53),COUNTRY_INFO!F53*0.5),IF(COUNTRY_INFO!K53=3,IF(COUNTRY_INFO!F53>MAX('T1'!M53,'T2'!K53),MAX('T1'!M53,'T2'!K53),COUNTRY_INFO!F53),0)))","v":433.29},{"$f":"IF(AND(COUNTRY_INFO!K53>0,COUNTRY_INFO!K53<4),IF(Z53>0,IF(COUNTRY_INFO!K53=1, AD53/(COUNTRY_INFO!F53*0.33)*100, IF(COUNTRY_INFO!K53=2, AD53/(COUNTRY_INFO!F53*0.5)*100, IF(COUNTRY_INFO!K53=3, AD53/COUNTRY_INFO!F53*100))),\"-\"),0)","v":100},{"$f":"IF(COUNTRY_INFO!K53=2,IF(COUNTRY_INFO!G53*0.2>MAX('T1'!N53,'T2'!L53),MAX('T1'!N53,'T2'!L53),COUNTRY_INFO!G53*0.2),IF(COUNTRY_INFO!K53=3,IF(COUNTRY_INFO!G53>MAX('T1'!N53,'T2'!L53),MAX('T1'!N53,'T2'!L53),COUNTRY_INFO!G53),0))","v":0},{"$f":"IF(AND(COUNTRY_INFO!K53>0,COUNTRY_INFO!K53<4),IF(Z53>0,IF(COUNTRY_INFO!K53=1, 0, IF(COUNTRY_INFO!K53=2, AF53/(COUNTRY_INFO!G53*0.2)*100, IF(COUNTRY_INFO!K53=3, AF53/COUNTRY_INFO!G53*100))),\"-\"),0)","v":0},433.29,{"$f":"IF(AND(COUNTRY_INFO!K53>0,COUNTRY_INFO!K53<4), IF(AC53/Z53*100<>0, IF(AH53/Z53*100>100,100,AH53/Z53*100), \"-\"),0)","v":100},null,{"$f":"IF(AND(D53<>0, D53<>\"Inconnu\",D53<>\"Interrompu\",D53<>\"Non requis\"),D53/COUNTRY_INFO!D53, 0)","v":0},{"$f":"IF(AND(J53<>0,J53<>\"Inconnu\",J53<>\"Interrompu\",J53<>\"Non requis\"),J53/COUNTRY_INFO!D53, 0)","v":0},{"$f":"IF(AND(P53<>0,P53<>\"Inconnu\",P53<>\"Non requis\"),P53/(COUNTRY_INFO!E53+COUNTRY_INFO!F53), 0)","v":1},{"$f":"IF(AND(Z53<>0,Z53<>\"Inconnu\",Z53<>\"Non requis\"),IF(COUNTRY_INFO!K53=1,1,IF(COUNTRY_INFO!K53=2,0.5*COUNTRY_INFO!F53/(0.5*COUNTRY_INFO!F53+0.2*COUNTRY_INFO!G53),IF(COUNTRY_INFO!K53=3,COUNTRY_INFO!F53/(COUNTRY_INFO!F53+COUNTRY_INFO!G53)))),0)","v":1},{"$f":"IF(AND(Z53<>0,Z53<>\"Inconnu\",Z53<>\"Non requis\"),IF(COUNTRY_INFO!K53=1,0,IF(COUNTRY_INFO!K53=2,0.2*COUNTRY_INFO!G53/(0.5*COUNTRY_INFO!F53+0.2*COUNTRY_INFO!G53),IF(COUNTRY_INFO!K53=3,COUNTRY_INFO!G53/(COUNTRY_INFO!F53+COUNTRY_INFO!G53)))),0)","v":0},{"$f":"MAX(COUNTRY_INFO!D53*AK53*PROFILE!$G$7,COUNTRY_INFO!D53*AL53*PROFILE!$G$7)","v":0},{"$f":"MAX(COUNTRY_INFO!D53*AK53*PROFILE!$G$8,COUNTRY_INFO!D53*AL53*PROFILE!$G$8,COUNTRY_INFO!D53*AM53*PROFILE!$G$8)","v":630.23644194104099},{"$f":"MAX(COUNTRY_INFO!D53*AK53*PROFILE!$G$9,COUNTRY_INFO!D53*AL53*PROFILE!$G$9,COUNTRY_INFO!D53*AM53*PROFILE!$G$9,IF(AND(DISTRICT!Z53<>\"Inconnu\",Z53<>\"Non requis\"),COUNTRY_INFO!P53*DISTRICT!AN53,0))","v":1313.0152488241099},{"$f":"MAX(COUNTRY_INFO!D53*AK53*PROFILE!$G$10,COUNTRY_INFO!D53*AL53*PROFILE!$G$10,IF(AND(DISTRICT!Z53<>\"Inconnu\",Z53<>\"Non requis\"),COUNTRY_INFO!P53*DISTRICT!AO53,0))","v":0},1943.2516907651509,"Y",{"$f":"MAX('MDA4'!R53,'T1'!L53,'T2'!J53,T3_R1!K53,T3_R2!K53)","v":0},{"$f":"MAX('MDA1'!K53,'MDA4'!S53,'MDA3'!I53,'MDA3'!L53,'T1'!M53,'T2'!K53,T3_R1!L53,T3_R2!L53)","v":794},{"$f":"MAX('MDA1'!L53,'MDA4'!T53,'MDA3'!J53,'MDA3'!M53,'T1'!N53,'T2'!L53,T3_R1!M53,T3_R2!M53)","v":0},794,{"$f":"MAX('MDA4'!R53,T53)","v":0},{"$f":"MAX('MDA1'!K53,'MDA4'!S53,'MDA3'!I53,'MDA3'!L53,V53,AD53)","v":794},{"$f":"MAX('MDA1'!L53,'MDA4'!T53,'MDA3'!J53,'MDA3'!M53,AF53)","v":0},794,40.85934950028858]
[{"$f":"IF(COUNTRY_INFO!A54=0,\" \",COUNTRY_INFO!A54)","v":"Gabon"},{"$f":"IF(COUNTRY_INFO!B54=0,\" \",COUNTRY_INFO!B54)","v":"Maritime"},{"$f":"IF(COUNTRY_INFO!C54=0,\" \",COUNTRY_INFO!C54)","v":"Bendjé"},{"$f":"COUNTRY_INFO!M54","v":0},null,null,{"$f":"MAX('MDA1'!M54,'MDA4'!U54)","v":0},{"$f":"IF(AND(COUNTRY_INFO!H54>0,COUNTRY_INFO!H54<4),IF(D54>MAX('MDA1'!M54,'MDA4'!U54),MAX('MDA1'!M54,'MDA4'!U54),D54),0)","v":0},{"$f":"IF(AND(COUNTRY_INFO!H54>0,COUNTRY_INFO!H54<4), IF(G54/D54*100<>0, IF(G54/D54*100>100,100,G54/D54*100), \"-\"),0)","v":0},{"$f":"COUNTRY_INFO!N54","v":"Inconnu"},null,null,{"$f":"MAX('MDA1'!M54,MAX('MDA3'!I54,'MDA3'!L54)+MAX('MDA3'!J54,'MDA3'!M54))","v":0},{"$f":"IF(AND(COUNTRY_INFO!I54>0,COUNTRY_INFO!I54<4),IF(J54>MAX('MDA1'!M54,MAX('MDA3'!I54,'MDA3'!L54)+MAX('MDA3'!J54,'MDA3'!M54)),MAX('MDA1'!M54,MAX('MDA3'!I54,'MDA3'!L54)+MAX('MDA3'!J54,'MDA3'!M54)),J54),0)","v":0},{"$f":"IF(AND(COUNTRY_INFO!I54>0,COUNTRY_INFO!I54<4), IF(M54/J54*100<>0, IF(M54/J54*100>100,100,M54/J54*100), \"-\"),0)","v":0},{"$f":"COUNTRY_INFO!O54","v":0},null,null,{"$f":"SUM(MAX('MDA4'!N54, 'T1'!L54, MAX(T3_R1!K54, T3_R2!K54)), MAX('MDA1'!K54, 'MDA4'!O54, 'T1'!M54, MAX(T3_R1!L54, T3_R2!L54)), MAX('MDA1'!L54, 'MDA4'!P54, 'T1'!N54, MAX(T3_R1!M54, T3_R2!M54)))","v":0},{"$f":"IF(AND(COUNTRY_INFO!J54>1,COUNTRY_INFO!J54<4),IF(COUNTRY_INFO!E54>MAX('MDA4'!N54,'T1'!L54,MAX(T3_R1!K54,T3_R2!K54)),MAX('MDA4'!N54,'T1'!L54,MAX(T3_R1!K54,T3_R2!K54)),COUNTRY_INFO!E54),0)","v":0},{"$f":"IF(AND(COUNTRY_INFO!J54>1,COUNTRY_INFO!J54<4), IF(T54/COUNTRY_INFO!E54*100<>0, IF(T54/COUNTRY_INFO!E54*100>100,100,T54/COUNTRY_INFO!E54*100), \"-\"),0)","v":0},{"$f":"IF(AND(COUNTRY_INFO!J54>1,COUNTRY_INFO!J54<4),IF(COUNTRY_INFO!F54>MAX('MDA1'!K54,'MDA4'!O54,'T1'!M54,MAX(T3_R1!L54,T3_R2!L54)),MAX('MDA1'!K54,'MDA4'!O54,'T1'!M54,MAX(T3_R1!L54,T3_R2!L54)),COUNTRY_INFO!F54),0)","v":0},{"$f":"IF(AND(COUNTRY_INFO!J54>1,COUNTRY_INFO!J54<4), IF(V54/COUNTRY_INFO!F54*100<>0, IF(V54/COUNTRY_INFO!F54*100>100,100,V54/COUNTRY_INFO!F54*100), \"-\"),0)","v":0},0,{"$f":"IF(AND(COUNTRY_INFO!J54>1,COUNTRY_INFO!J54<4), IF(S54/P54*100<>0, IF(X54/P54*100>100,100,X54/P54*100), \"-\"),0)","v":0},{"$f":"COUNTRY_INFO!P54","v":12323.52},5668,5567,{"$f":"MAX('T1'!L54,'T2'!J54)+MAX('T1'!M54,'T2'!K54)+MAX('T1'!N54,'T2'!L54)","v":37344},{"$f":"IF(COUNTRY_INFO!K54=1,IF(COUNTRY_INFO!F54*0.33>MAX('T1'!M54,'T2'!K54),MAX('T1'!M54,'T2'!K54),COUNTRY_INFO!F54*0.33),IF(COUNTRY_INFO!K54=2,IF(COUNTRY_INFO!F54*0.5>MAX('T1'!M54,'T2'!K54),MAX('T1'!M54,'T2'!K54),COUNTRY_INFO!F54*0.5),IF(COUNTRY_INFO!K54=3,IF(COUNTRY_INFO!F54>MAX('T1'!M54,'T2'!K54),MAX('T1'!M54,'T2'!K54),COUNTRY_INFO!F54),0)))","v":12323.52},{"$f":"IF(AND(COUNTRY_INFO!K54>0,COUNTRY_INFO!K54<4),IF(Z54>0,IF(COUNTRY_INFO!K54=1, AD54/(COUNTRY_INFO!F54*0.33)*100, IF(COUNTRY_INFO!K54=2, AD54/(COUNTRY_INFO!F54*0.5)*100, IF(COUNTRY_INFO!K54=3, AD54/COUNTRY_INFO!F54*100))),\"-\"),0)","v":100},{"$f":"IF(COUNTRY_INFO!K54=2,IF(COUNTRY_INFO!G54*0.2>MAX('T1'!N54,'T2'!L54),MAX('T1'!N54,'T2'!L54),COUNTRY_INFO!G54*0.2),IF(COUNTRY_INFO!K54=3,IF(COUNTRY_INFO!G54>MAX('T1'!N54,'T2'!L54),MAX('T1'!N54,'T2'!L54),COUNTRY_INFO!G54),0))","v":0},{"$f":"IF(AND(COUNTRY_INFO!K54>0,COUNTRY_INFO!K54<4),IF(Z54>0,IF(COUNTRY_INFO!K54=1, 0, IF(COUNTRY_INFO!K54=2, AF54/(COUNTRY_INFO!G54*0.2)*100, IF(COUNTRY_INFO!K54=3, AF54/COUNTRY_INFO!G54*100))),\"-\"),0)","v":0},12323.52,{"$f":"IF(AND(COUNTRY_INFO!K54>0,COUNTRY_INFO!K54<4), IF(AC54/Z54*100<>0, IF(AH54/Z54*100>100,100,AH54/Z54*100), \"-\"),0)","v":100},null,{"$f":"IF(AND(D54<>0, D54<>\"Inconnu\",D54<>\"Interrompu\",D54<>\"Non requis\"),D54/COUNTRY_INFO!D54, 0)","v":0},{"$f":"IF(AND(J54<>0,J54<>\"Inconnu\",J54<>\"Interrompu\",J54<>\"Non requis\"),J54/COUNTRY_INFO!D54, 0)","v":0},{"$f":"IF(AND(P54<>0,P54<>\"Inconnu\",P54<>\"Non requis\"),P54/(COUNTRY_INFO!E54+COUNTRY_INFO!F54), 0)","v":0},{"$f":"IF(AND(Z54<>0,Z54<>\"Inconnu\",Z54<>\"Non requis\"),IF(COUNTRY_INFO!K54=1,1,IF(COUNTRY_INFO!K54=2,0.5*COUNTRY_INFO!F54/(0.5*COUNTRY_INFO!F54+0.2*COUNTRY_INFO!G54),IF(COUNTRY_INFO!K54=3,COUNTRY_INFO!F54/(COUNTRY_INFO!F54+COUNTRY_INFO!G54)))),0)","v":1},{"$f":"IF(AND(Z54<>0,Z54<>\"Inconnu\",Z54<>\"Non requis\"),IF(COUNTRY_INFO!K54=1,0,IF(COUNTRY_INFO!K54=2,0.2*COUNTRY_INFO!G54/(0.5*COUNTRY_INFO!F54+0.2*COUNTRY_INFO!G54),IF(COUNTRY_INFO!K54=3,COUNTRY_INFO!G54/(COUNTRY_INFO!F54+COUNTRY_INFO!G54)))),0)","v":0},{"$f":"MAX(COUNTRY_INFO!D54*AK54*PROFILE!$G$7,COUNTRY_INFO!D54*AL54*PROFILE!$G$7)","v":0},{"$f":"MAX(COUNTRY_INFO!D54*AK54*PROFILE!$G$8,COUNTRY_INFO!D54*AL54*PROFILE!$G$8,COUNTRY_INFO!D54*AM54*PROFILE!$G$8)","v":0},{"$f":"MAX(COUNTRY_INFO!D54*AK54*PROFILE!$G$9,COUNTRY_INFO!D54*AL54*PROFILE!$G$9,COUNTRY_INFO!D54*AM54*PROFILE!$G$9,IF(AND(DISTRICT!Z54<>\"Inconnu\",Z54<>\"Non requis\"),COUNTRY_INFO!P54*DISTRICT!AN54,0))","v":12323.52},{"$f":"MAX(COUNTRY_INFO!D54*AK54*PROFILE!$G$10,COUNTRY_INFO!D54*AL54*PROFILE!$G$10,IF(AND(DISTRICT!Z54<>\"Inconnu\",Z54<>\"Non requis\"),COUNTRY_INFO!P54*DISTRICT!AO54,0))","v":0},12323.52,"Y",{"$f":"MAX('MDA4'!R54,'T1'!L54,'T2'!J54,T3_R1!K54,T3_R2!K54)","v":0},{"$f":"MAX('MDA1'!K54,'MDA4'!S54,'MDA3'!I54,'MDA3'!L54,'T1'!M54,'T2'!K54,T3_R1!L54,T3_R2!L54)","v":37344},{"$f":"MAX('MDA1'!L54,'MDA4'!T54,'MDA3'!J54,'MDA3'!M54,'T1'!N54,'T2'!L54,T3_R1!M54,T3_R2!M54)","v":0},37344,{"$f":"MAX('MDA4'!R54,T54)","v":0},{"$f":"MAX('MDA1'!K54,'MDA4'!S54,'MDA3'!I54,'MDA3'!L54,V54,AD54)","v":12323.52},{"$f":"MAX('MDA1'!L54,'MDA4'!T54,'MDA3'!J54,'MDA3'!M54,AF54)","v":0},12323.52,100]
[{"$f":"IF(COUNTRY_INFO!A55=0,\" \",COUNTRY_INFO!A55)","v":"Gabon"},{"$f":"IF(COUNTRY_INFO!B55=0,\" \",COUNTRY_INFO!B55)","v":"Nord"},{"$f":"IF(COUNTRY_INFO!C55=0,\" \",COUNTRY_INFO!C55)","v":"Ntem"},{"$f":"COUNTRY_INFO!M55","v":0},null,null,{"$f":"MAX('MDA1'!M55,'MDA4'!U55)","v":0},{"$f":"IF(AND(COUNTRY_INFO!H55>0,COUNTRY_INFO!H55<4),IF(D55>MAX('MDA1'!M55,'MDA4'!U55),MAX('MDA1'!M55,'MDA4'!U55),D55),0)","v":0},{"$f":"IF(AND(COUNTRY_INFO!H55>0,COUNTRY_INFO!H55<4), IF(G55/D55*100<>0, IF(G55/D55*100>100,100,G55/D55*100), \"-\"),0)","v":0},{"$f":"COUNTRY_INFO!N55","v":53420},null,null,{"$f":"MAX('MDA1'!M55,MAX('MDA3'!I55,'MDA3'!L55)+MAX('MDA3'!J55,'MDA3'!M55))","v":0},{"$f":"IF(AND(COUNTRY_INFO!I55>0,COUNTRY_INFO!I55<4),IF(J55>MAX('MDA1'!M55,MAX('MDA3'!I55,'MDA3'!L55)+MAX('MDA3'!J55,'MDA3'!M55)),MAX('MDA1'!M55,MAX('MDA3'!I55,'MDA3'!L55)+MAX('MDA3'!J55,'MDA3'!M55)),J55),0)","v":0},{"$f":"IF(AND(COUNTRY_INFO!I55>0,COUNTRY_INFO!I55<4), IF(M55/J55*100<>0, IF(M55/J55*100>100,100,M55/J55*100), \"-\"),0)","v":"-"},{"$f":"COUNTRY_INFO!O55","v":19765},1848,1727,{"$f":"SUM(MAX('MDA4'!N55, 'T1'!L55, MAX(T3_R1!K55, T3_R2!K55)), MAX('MDA1'!K55, 'MDA4'!O55, 'T1'!M55, MAX(T3_R1!L55, T3_R2!L55)), MAX('MDA1'!L55, 'MDA4'!P55, 'T1'!N55, MAX(T3_R1!M55, T3_R2!M55)))","v":5837},{"$f":"IF(AND(COUNTRY_INFO!J55>1,COUNTRY_INFO!J55<4),IF(COUNTRY_INFO!E55>MAX('MDA4'!N55,'T1'!L55,MAX(T3_R1!K55,T3_R2!K55)),MAX('MDA4'!N55,'T1'!L55,MAX(T3_R1!K55,T3_R2!K55)),COUNTRY_INFO!E55),0)","v":0},{"$f":"IF(AND(COUNTRY_INFO!J55>1,COUNTRY_INFO!J55<4), IF(T55/COUNTRY_INFO!E55*100<>0, IF(T55/COUNTRY_INFO!E55*100>100,100,T55/COUNTRY_INFO!E55*100), \"-\"),0)","v":"-"},{"$f":"IF(AND(COUNTRY_INFO!J55>1,COUNTRY_INFO!J55<4),IF(COUNTRY_INFO!F55>MAX('MDA1'!K55,'MDA4'!O55,'T1'!M55,MAX(T3_R1!L55,T3_R2!L55)),MAX('MDA1'!K55,'MDA4'!O55,'T1'!M55,MAX(T3_R1!L55,T3_R2!L55)),COUNTRY_INFO!F55),0)","v":5837},{"$f":"IF(AND(COUNTRY_INFO!J55>1,COUNTRY_INFO!J55<4), IF(V55/COUNTRY_INFO!F55*100<>0, IF(V55/COUNTRY_INFO!F55*100>100,100,V55/COUNTRY_INFO!F55*100), \"-\"),0)","v":43.706476974915766},5837,{"$f":"IF(AND(COUNTRY_INFO!J55>1,COUNTRY_INFO!J55<4), IF(S55/P55*100<>0, IF(X55/P55*100>100,100,X55/P55*100), \"-\"),0)","v":29.532001011889701},{"$f":"COUNTRY_INFO!P55","v":4407.1500000000005},1848,1727,{"$f":"MAX('T1'!L55,'T2'!J55)+MAX('T1'!M55,'T2'!K55)+MAX('T1'!N55,'T2'!L55)","v":3575},{"$f":"IF(COUNTRY_INFO!K55=1,IF(COUNTRY_INFO!F55*0.33>MAX('T1'!M55,'T2'!K55),MAX('T1'!M55,'T2'!K55),COUNTRY_INFO!F55*0.33),IF(COUNTRY_INFO!K55=2,IF(COUNTRY_INFO!F55*0.5>MAX('T1'!M55,'T2'!K55),MAX('T1'!M55,'T2'!K55),COUNTRY_INFO!F55*0.5),IF(COUNTRY_INFO!K55=3,IF(COUNTRY_INFO!F55>MAX('T1'!M55,'T2'!K55),MAX('T1'!M55,'T2'!K55),COUNTRY_INFO!F55),0)))","v":3575},{"$f":"IF(AND(COUNTRY_INFO!K55>0,COUNTRY_INFO!K55<4),IF(Z55>0,IF(COUNTRY_INFO!K55=1, AD55/(COUNTRY_INFO!F55*0.33)*100, IF(COUNTRY_INFO!K55=2, AD55/(COUNTRY_INFO!F55*0.5)*100, IF(COUNTRY_INFO!K55=3, AD55/COUNTRY_INFO!F55*100))),\"-\"),0)","v":81.118182952701844},{"$f":"IF(COUNTRY_INFO!K55=2,IF(COUNTRY_INFO!G55*0.2>MAX('T1'!N55,'T2'!L55),MAX('T1'!N55,'T2'!L55),COUNTRY_INFO!G55*0.2),IF(COUNTRY_INFO!K55=3,IF(COUNTRY_INFO!G55>MAX('T1'!N55,'T2'!L55),MAX('T1'!N55,'T2'!L55),COUNTRY_INFO!G55),0))","v":0},{"$f":"IF(AND(COUNTRY_INFO!K55>0,COUNTRY_INFO!K55<4),IF(Z55>0,IF(COUNTRY_INFO!K55=1, 0, IF(COUNTRY_INFO!K55=2, AF55/(COUNTRY_INFO!G55*0.2)*100, IF(COUNTRY_INFO!K55=3, AF55/COUNTRY_INFO!G55*100))),\"-\"),0)","v":0},3575,{"$f":"IF(AND(COUNTRY_INFO!K55>0,COUNTRY_INFO!K55<4), IF(AC55/Z55*100<>0, IF(AH55/Z55*100>100,100,AH55/Z55*100), \"-\"),0)","v":81.118182952701844},null,{"$f":"IF(AND(D55<>0, D55<>\"Inconnu\",D55<>\"Interrompu\",D55<>\"Non requis\"),D55/COUNTRY_INFO!D55, 0)","v":0},{"$f":"IF(AND(J55<>0,J55<>\"Inconnu\",J55<>\"Interrompu\",J55<>\"Non requis\"),J55/COUNTRY_INFO!D55, 0)","v":1},{"$f":"IF(AND(P55<>0,P55<>\"Inconnu\",P55<>\"Non requis\"),P55/(COUNTRY_INFO!E55+COUNTRY_INFO!F55), 0)","v":1},{"$f":"IF(AND(Z55<>0,Z55<>\"Inconnu\",Z55<>\"Non requis\"),IF(COUNTRY_INFO!K55=1,1,IF(COUNTRY_INFO!K55=2,0.5*COUNTRY_INFO!F55/(0.5*COUNTRY_INFO!F55+0.2*COUNTRY_INFO!G55),IF(COUNTRY_INFO!K55=3,COUNTRY_INFO!F55/(COUNTRY_INFO!F55+COUNTRY_INFO!G55)))),0)","v":1},{"$f":"IF(AND(Z55<>0,Z55<>\"Inconnu\",Z55<>\"Non requis\"),IF(COUNTRY_INFO!K55=1,0,IF(COUNTRY_INFO!K55=2,0.2*COUNTRY_INFO!G55/(0.5*COUNTRY_INFO!F55+0.2*COUNTRY_INFO!G55),IF(COUNTRY_INFO!K55=3,COUNTRY_INFO!G55/(COUNTRY_INFO!F55+COUNTRY_INFO!G55)))),0)","v":0},{"$f":"MAX(COUNTRY_INFO!D55*AK55*PROFILE!$G$7,COUNTRY_INFO!D55*AL55*PROFILE!$G$7)","v":2136.6242184929251},{"$f":"MAX(COUNTRY_INFO!D55*AK55*PROFILE!$G$8,COUNTRY_INFO!D55*AL55*PROFILE!$G$8,COUNTRY_INFO!D55*AM55*PROFILE!$G$8)","v":6410.3638096897203},{"$f":"MAX(COUNTRY_INFO!D55*AK55*PROFILE!$G$9,COUNTRY_INFO!D55*AL55*PROFILE!$G$9,COUNTRY_INFO!D55*AM55*PROFILE!$G$9,IF(AND(DISTRICT!Z55<>\"Inconnu\",Z55<>\"Non requis\"),COUNTRY_INFO!P55*DISTRICT!AN55,0))","v":13355.15510132977},{"$f":"MAX(COUNTRY_INFO!D55*AK55*PROFILE!$G$10,COUNTRY_INFO!D55*AL55*PROFILE!$G$10,IF(AND(DISTRICT!Z55<>\"Inconnu\",Z55<>\"Non requis\"),COUNTRY_INFO!P55*DISTRICT!AO55,0))","v":31517.85687048758},53419.999999999993,0,{"$f":"MAX('MDA4'!R55,'T1'!L55,'T2'!J55,T3_R1!K55,T3_R2!K55)","v":0},{"$f":"MAX('MDA1'!K55,'MDA4'!S55,'MDA3'!I55,'MDA3'!L55,'T1'!M55,'T2'!K55,T3_R1!L55,T3_R2!L55)","v":5837},{"$f":"MAX('MDA1'!L55,'MDA4'!T55,'MDA3'!J55,'MDA3'!M55,'T1'!N55,'T2'!L55,T3_R1!M55,T3_R2!M55)","v":0},5837,{"$f":"MAX('MDA4'!R55,T55)","v":0},{"$f":"MAX('MDA1'!K55,'MDA4'!S55,'MDA3'!I55,'MDA3'!L55,V55,AD55)","v":5837},{"$f":"MAX('MDA1'!L55,'MDA4'!T55,'MDA3'!J55,'MDA3'!M55,AF55)","v":0},5837,10.926619243728943]
[{"$f":"IF(COUNTRY_INFO!A56=0,\" \",COUNTRY_INFO!A56)","v":"Gabon"},{"$f":"IF(COUNTRY_INFO!B56=0,\" \",COUNTRY_INFO!B56)","v":"Nord"},{"$f":"IF(COUNTRY_INFO!C56=0,\" \",COUNTRY_INFO!C56)","v":"Haut - Komo"},{"$f":"COUNTRY_INFO!M56","v":0},null,null,{"$f":"MAX('MDA1'!M56,'MDA4'!U56)","v":0},{"$f":"IF(AND(COUNTRY_INFO!H56>0,COUNTRY_INFO!H56<4),IF(D56>MAX('MDA1'!M56,'MDA4'!U56),MAX('MDA1'!M56,'MDA4'!U56),D56),0)","v":0},{"$f":"IF(AND(COUNTRY_INFO!H56>0,COUNTRY_INFO!H56<4), IF(G56/D56*100<>0, IF(G56/D56*100>100,100,G56/D56*100), \"-\"),0)","v":0},{"$f":"COUNTRY_INFO!N56","v":5263},null,null,{"$f":"MAX('MDA1'!M56,MAX('MDA3'!I56,'MDA3'!L56)+MAX('MDA3'!J56,'MDA3'!M56))","v":0},{"$f":"IF(AND(COUNTRY_INFO!I56>0,COUNTRY_INFO!I56<4),IF(J56>MAX('MDA1'!M56,MAX('MDA3'!I56,'MDA3'!L56)+MAX('MDA3'!J56,'MDA3'!M56)),MAX('MDA1'!M56,MAX('MDA3'!I56,'MDA3'!L56)+MAX('MDA3'!J56,'MDA3'!M56)),J56),0)","v":0},{"$f":"IF(AND(COUNTRY_INFO!I56>0,COUNTRY_INFO!I56<4), IF(M56/J56*100<>0, IF(M56/J56*100>100,100,M56/J56*100), \"-\"),0)","v":"-"},{"$f":"COUNTRY_INFO!O56","v":1948},267,250,{"$f":"SUM(MAX('MDA4'!N56, 'T1'!L56, MAX(T3_R1!K56, T3_R2!K56)), MAX('MDA1'!K56, 'MDA4'!O56, 'T1'!M56, MAX(T3_R1!L56, T3_R2!L56)), MAX('MDA1'!L56, 'MDA4'!P56, 'T1'!N56, MAX(T3_R1!M56, T3_R2!M56)))","v":619},{"$f":"IF(AND(COUNTRY_INFO!J56>1,COUNTRY_INFO!J56<4),IF(COUNTRY_INFO!E56>MAX('MDA4'!N56,'T1'!L56,MAX(T3_R1!K56,T3_R2!K56)),MAX('MDA4'!N56,'T1'!L56,MAX(T3_R1!K56,T3_R2!K56)),COUNTRY_INFO!E56),0)","v":0},{"$f":"IF(AND(COUNTRY_INFO!J56>1,COUNTRY_INFO!J56<4), IF(T56/COUNTRY_INFO!E56*100<>0, IF(T56/COUNTRY_INFO!E56*100>100,100,T56/COUNTRY_INFO!E56*100), \"-\"),0)","v":"-"},{"$f":"IF(AND(COUNTRY_INFO!J56>1,COUNTRY_INFO!J56<4),IF(COUNTRY_INFO!F56>MAX('MDA1'!K56,'MDA4'!O56,'T1'!M56,MAX(T3_R1!L56,T3_R2!L56)),MAX('MDA1'!K56,'MDA4'!O56,'T1'!M56,MAX(T3_R1!L56,T3_R2!L56)),COUNTRY_INFO!F56),0)","v":619},{"$f":"IF(AND(COUNTRY_INFO!J56>1,COUNTRY_INFO!J56<4), IF(V56/COUNTRY_INFO!F56*100<>0, IF(V56/COUNTRY_INFO!F56*100>100,100,V56/COUNTRY_INFO!F56*100), \"-\"),0)","v":47.036474164133743},619,{"$f":"IF(AND(COUNTRY_INFO!J56>1,COUNTRY_INFO!J56<4), IF(S56/P56*100<>0, IF(X56/P56*100>100,100,X56/P56*100), \"-\"),0)","v":31.776180698151951},{"$f":"COUNTRY_INFO!P56","v":434.28000000000003},267,250,{"$f":"MAX('T1'!L56,'T2'!J56)+MAX('T1'!M56,'T2'!K56)+MAX('T1'!N56,'T2'!L56)","v":517},{"$f":"IF(COUNTRY_INFO!K56=1,IF(COUNTRY_INFO!F56*0.33>MAX('T1'!M56,'T2'!K56),MAX('T1'!M56,'T2'!K56),COUNTRY_INFO!F56*0.33),IF(COUNTRY_INFO!K56=2,IF(COUNTRY_INFO!F56*0.5>MAX('T1'!M56,'T2'!K56),MAX('T1'!M56,'T2'!K56),COUNTRY_INFO!F56*0.5),IF(COUNTRY_INFO!K56=3,IF(COUNTRY_INFO!F56>MAX('T1'!M56,'T2'!K56),MAX('T1'!M56,'T2'!K56),COUNTRY_INFO!F56),0)))","v":434.28000000000003},{"$f":"IF(AND(COUNTRY_INFO!K56>0,COUNTRY_INFO!K56<4),IF(Z56>0,IF(COUNTRY_INFO!K56=1, AD56/(COUNTRY_INFO!F56*0.33)*100, IF(COUNTRY_INFO!K56=2, AD56/(COUNTRY_INFO!F56*0.5)*100, IF(COUNTRY_INFO!K56=3, AD56/COUNTRY_INFO!F56*100))),\"-\"),0)","v":100},{"$f":"IF(COUNTRY_INFO!K56=2,IF(COUNTRY_INFO!G56*0.2>MAX('T1'!N56,'T2'!L56),MAX('T1'!N56,'T2'!L56),COUNTRY_INFO!G56*0.2),IF(COUNTRY_INFO!K56=3,IF(COUNTRY_INFO!G56>MAX('T1'!N56,'T2'!L56),MAX('T1'!N56,'T2'!L56),COUNTRY_INFO!G56),0))","v":0},{"$f":"IF(AND(COUNTRY_INFO!K56>0,COUNTRY_INFO!K56<4),IF(Z56>0,IF(COUNTRY_INFO!K56=1, 0, IF(COUNTRY_INFO!K56=2, AF56/(COUNTRY_INFO!G56*0.2)*100, IF(COUNTRY_INFO!K56=3, AF56/COUNTRY_INFO!G56*100))),\"-\"),0)","v":0},434.28000000000003,{"$f":"IF(AND(COUNTRY_INFO!K56>0,COUNTRY_INFO!K56<4), IF(AC56/Z56*100<>0, IF(AH56/Z56*100>100,100,AH56/Z56*100), \"-\"),0)","v":100},null,{"$f":"IF(AND(D56<>0, D56<>\"Inconnu\",D56<>\"Interrompu\",D56<>\"Non requis\"),D56/COUNTRY_INFO!D56, 0)","v":0},{"$f":"IF(AND(J56<>0,J56<>\"Inconnu\",J56<>\"Interrompu\",J56<>\"Non requis\"),J56/COUNTRY_INFO!D56, 0)","v":1},{"$f":"IF(AND(P56<>0,P56<>\"Inconnu\",P56<>\"Non requis\"),P56/(COUNTRY_INFO!E56+COUNTRY_INFO!F56), 0)","v":1},{"$f":"IF(AND(Z56<>0,Z56<>\"Inconnu\",Z56<>\"Non requis\"),IF(COUNTRY_INFO!K56=1,1,IF(COUNTRY_INFO!K56=2,0.5*COUNTRY_INFO!F56/(0.5*COUNTRY_INFO!F56+0.2*COUNTRY_INFO!G56),IF(COUNTRY_INFO!K56=3,COUNTRY_INFO!F56/(COUNTRY_INFO!F56+COUNTRY_INFO!G56)))),0)","v":1},{"$f":"IF(AND(Z56<>0,Z56<>\"Inconnu\",Z56<>\"Non requis\"),IF(COUNTRY_INFO!K56=1,0,IF(COUNTRY_INFO!K56=2,0.2*COUNTRY_INFO!G56/(0.5*COUNTRY_INFO!F56+0.2*COUNTRY_INFO!G56),IF(COUNTRY_INFO!K56=3,COUNTRY_INFO!G56/(COUNTRY_INFO!F56+COUNTRY_INFO!G56)))),0)","v":0},{"$f":"MAX(COUNTRY_INFO!D56*AK56*PROFILE!$G$7,COUNTRY_INFO!D56*AL56*PROFILE!$G$7)","v":210.50268180322473},{"$f":"MAX(COUNTRY_INFO!D56*AK56*PROFILE!$G$8,COUNTRY_INFO!D56*AL56*PROFILE!$G$8,COUNTRY_INFO!D56*AM56*PROFILE!$G$8)","v":631.55643448889919},{"$f":"MAX(COUNTRY_INFO!D56*AK56*PROFILE!$G$9,COUNTRY_INFO!D56*AL56*PROFILE!$G$9,COUNTRY_INFO!D56*AM56*PROFILE!$G$9,IF(AND(DISTRICT!Z56<>\"Inconnu\",Z56<>\"Non requis\"),COUNTRY_INFO!P56*DISTRICT!AN56,0))","v":1315.7652807618604},{"$f":"MAX(COUNTRY_INFO!D56*AK56*PROFILE!$G$10,COUNTRY_INFO!D56*AL56*PROFILE!$G$10,IF(AND(DISTRICT!Z56<>\"Inconnu\",Z56<>\"Non requis\"),COUNTRY_INFO!P56*DISTRICT!AO56,0))","v":3105.1756029460153},5263,0,{"$f":"MAX('MDA4'!R56,'T1'!L56,'T2'!J56,T3_R1!K56,T3_R2!K56)","v":0},{"$f":"MAX('MDA1'!K56,'MDA4'!S56,'MDA3'!I56,'MDA3'!L56,'T1'!M56,'T2'!K56,T3_R1!L56,T3_R2!L56)","v":619},{"$f":"MAX('MDA1'!L56,'MDA4'!T56,'MDA3'!J56,'MDA3'!M56,'T1'!N56,'T2'!L56,T3_R1!M56,T3_R2!M56)","v":0},619,{"$f":"MAX('MDA4'!R56,T56)","v":0},{"$f":"MAX('MDA1'!K56,'MDA4'!S56,'MDA3'!I56,'MDA3'!L56,V56,AD56)","v":619},{"$f":"MAX('MDA1'!L56,'MDA4'!T56,'MDA3'!J56,'MDA3'!M56,AF56)","v":0},619,11.761352840585218]
[{"$f":"IF(COUNTRY_INFO!A57=0,\" \",COUNTRY_INFO!A57)","v":"Gabon"},{"$f":"IF(COUNTRY_INFO!B57=0,\" \",COUNTRY_INFO!B57)","v":"Nord"},{"$f":"IF(COUNTRY_INFO!C57=0,\" \",COUNTRY_INFO!C57)","v":"Haut-Ntem"},{"$f":"COUNTRY_INFO!M57","v":0},null,null,{"$f":"MAX('MDA1'!M57,'MDA4'!U57)","v":0},{"$f":"IF(AND(COUNTRY_INFO!H57>0,COUNTRY_INFO!H57<4),IF(D57>MAX('MDA1'!M57,'MDA4'!U57),MAX('MDA1'!M57,'MDA4'!U57),D57),0)","v":0},{"$f":"IF(AND(COUNTRY_INFO!H57>0,COUNTRY_INFO!H57<4), IF(G57/D57*100<>0, IF(G57/D57*100>100,100,G57/D57*100), \"-\"),0)","v":0},{"$f":"COUNTRY_INFO!N57","v":17439},null,null,{"$f":"MAX('MDA1'!M57,MAX('MDA3'!I57,'MDA3'!L57)+MAX('MDA3'!J57,'MDA3'!M57))","v":0},{"$f":"IF(AND(COUNTRY_INFO!I57>0,COUNTRY_INFO!I57<4),IF(J57>MAX('MDA1'!M57,MAX('MDA3'!I57,'MDA3'!L57)+MAX('MDA3'!J57,'MDA3'!M57)),MAX('MDA1'!M57,MAX('MDA3'!I57,'MDA3'!L57)+MAX('MDA3'!J57,'MDA3'!M57)),J57),0)","v":0},{"$f":"IF(AND(COUNTRY_INFO!I57>0,COUNTRY_INFO!I57<4), IF(M57/J57*100<>0, IF(M57/J57*100>100,100,M57/J57*100), \"-\"),0)","v":"-"},{"$f":"COUNTRY_INFO!O57","v":6453},783,744,{"$f":"SUM(MAX('MDA4'!N57, 'T1'!L57, MAX(T3_R1!K57, T3_R2!K57)), MAX('MDA1'!K57, 'MDA4'!O57, 'T1'!M57, MAX(T3_R1!L57, T3_R2!L57)), MAX('MDA1'!L57, 'MDA4'!P57, 'T1'!N57, MAX(T3_R1!M57, T3_R2!M57)))","v":1684},{"$f":"IF(AND(COUNTRY_INFO!J57>1,COUNTRY_INFO!J57<4),IF(COUNTRY_INFO!E57>MAX('MDA4'!N57,'T1'!L57,MAX(T3_R1!K57,T3_R2!K57)),MAX('MDA4'!N57,'T1'!L57,MAX(T3_R1!K57,T3_R2!K57)),COUNTRY_INFO!E57),0)","v":0},{"$f":"IF(AND(COUNTRY_INFO!J57>1,COUNTRY_INFO!J57<4), IF(T57/COUNTRY_INFO!E57*100<>0, IF(T57/COUNTRY_INFO!E57*100>100,100,T57/COUNTRY_INFO!E57*100), \"-\"),0)","v":"-"},{"$f":"IF(AND(COUNTRY_INFO!J57>1,COUNTRY_INFO!J57<4),IF(COUNTRY_INFO!F57>MAX('MDA1'!K57,'MDA4'!O57,'T1'!M57,MAX(T3_R1!L57,T3_R2!L57)),MAX('MDA1'!K57,'MDA4'!O57,'T1'!M57,MAX(T3_R1!L57,T3_R2!L57)),COUNTRY_INFO!F57),0)","v":1684},{"$f":"IF(AND(COUNTRY_INFO!J57>1,COUNTRY_INFO!J57<4), IF(V57/COUNTRY_INFO!F57*100<>0, IF(V57/COUNTRY_INFO!F57*100>100,100,V57/COUNTRY_INFO!F57*100), \"-\"),0)","v":38.623853211009177},1684,{"$f":"IF(AND(COUNTRY_INFO!J57>1,COUNTRY_INFO!J57<4), IF(S57/P57*100<>0, IF(X57/P57*100>100,100,X57/P57*100), \"-\"),0)","v":26.096389276305594},{"$f":"COUNTRY_INFO!P57","v":1438.8},783,744,{"$f":"MAX('T1'!L57,'T2'!J57)+MAX('T1'!M57,'T2'!K57)+MAX('T1'!N57,'T2'!L57)","v":1527},{"$f":"IF(COUNTRY_INFO!K57=1,IF(COUNTRY_INFO!F57*0.33>MAX('T1'!M57,'T2'!K57),MAX('T1'!M57,'T2'!K57),COUNTRY_INFO!F57*0.33),IF(COUNTRY_INFO!K57=2,IF(COUNTRY_INFO!F57*0.5>MAX('T1'!M57,'T2'!K57),MAX('T1'!M57,'T2'!K57),COUNTRY_INFO!F57*0.5),IF(COUNTRY_INFO!K57=3,IF(COUNTRY_INFO!F57>MAX('T1'!M57,'T2'!K57),MAX('T1'!M57,'T2'!K57),COUNTRY_INFO!F57),0)))","v":1438.8},{"$f":"IF(AND(COUNTRY_INFO!K57>0,COUNTRY_INFO!K57<4),IF(Z57>0,IF(COUNTRY_INFO!K57=1, AD57/(COUNTRY_INFO!F57*0.33)*100, IF(COUNTRY_INFO!K57=2, AD57/(COUNTRY_INFO!F57*0.5)*100, IF(COUNTRY_INFO!K57=3, AD57/COUNTRY_INFO!F57*100))),\"-\"),0)","v":100},{"$f":"IF(COUNTRY_INFO!K57=2,IF(COUNTRY_INFO!G57*0.2>MAX('T1'!N57,'T2'!L57),MAX('T1'!N57,'T2'!L57),COUNTRY_INFO!G57*0.2),IF(COUNTRY_INFO!K57=3,IF(COUNTRY_INFO!G57>MAX('T1'!N57,'T2'!L57),MAX('T1'!N57,'T2'!L57),COUNTRY_INFO!G57),0))","v":0},{"$f":"IF(AND(COUNTRY_INFO!K57>0,COUNTRY_INFO!K57<4),IF(Z57>0,IF(COUNTRY_INFO!K57=1, 0, IF(COUNTRY_INFO!K57=2, AF57/(COUNTRY_INFO!G57*0.2)*100, IF(COUNTRY_INFO!K57=3, AF57/COUNTRY_INFO!G57*100))),\"-\"),0)","v":0},1438.8,{"$f":"IF(AND(COUNTRY_INFO!K57>0,COUNTRY_INFO!K57<4), IF(AC57/Z57*100<>0, IF(AH57/Z57*100>100,100,AH57/Z57*100), \"-\"),0)","v":100},null,{"$f":"IF(AND(D57<>0, D57<>\"Inconnu\",D57<>\"Interrompu\",D57<>\"Non requis\"),D57/COUNTRY_INFO!D57, 0)","v":0},{"$f":"IF(AND(J57<>0,J57<>\"Inconnu\",J57<>\"Interrompu\",J57<>\"Non requis\"),J57/COUNTRY_INFO!D57, 0)","v":1},{"$f":"IF(AND(P57<>0,P57<>\"Inconnu\",P57<>\"Non requis\"),P57/(COUNTRY_INFO!E57+COUNTRY_INFO!F57), 0)","v":1},{"$f":"IF(AND(Z57<>0,Z57<>\"Inconnu\",Z57<>\"Non requis\"),IF(COUNTRY_INFO!K57=1,1,IF(COUNTRY_INFO!K57=2,0.5*COUNTRY_INFO!F57/(0.5*COUNTRY_INFO!F57+0.2*COUNTRY_INFO!G57),IF(COUNTRY_INFO!K57=3,COUNTRY_INFO!F57/(COUNTRY_INFO!F57+COUNTRY_INFO!G57)))),0)","v":1},{"$f":"IF(AND(Z57<>0,Z57<>\"Inconnu\",Z57<>\"Non requis\"),IF(COUNTRY_INFO!K57=1,0,IF(COUNTRY_INFO!K57=2,0.2*COUNTRY_INFO!G57/(0.5*COUNTRY_INFO!F57+0.2*COUNTRY_INFO!G57),IF(COUNTRY_INFO!K57=3,COUNTRY_INFO!G57/(COUNTRY_INFO!F57+COUNTRY_INFO!G57)))),0)","v":0},{"$f":"MAX(COUNTRY_INFO!D57*AK57*PROFILE!$G$7,COUNTRY_INFO!D57*AL57*PROFILE!$G$7)","v":697.50261599210262},{"$f":"MAX(COUNTRY_INFO!D57*AK57*PROFILE!$G$8,COUNTRY_INFO!D57*AL57*PROFILE!$G$8,COUNTRY_INFO!D57*AM57*PROFILE!$G$8)","v":2092.6681856454329},{"$f":"MAX(COUNTRY_INFO!D57*AK57*PROFILE!$G$9,COUNTRY_INFO!D57*AL57*PROFILE!$G$9,COUNTRY_INFO!D57*AM57*PROFILE!$G$9,IF(AND(DISTRICT!Z57<>\"Inconnu\",Z57<>\"Non requis\"),COUNTRY_INFO!P57*DISTRICT!AN57,0))","v":4359.8006329481441},{"$f":"MAX(COUNTRY_INFO!D57*AK57*PROFILE!$G$10,COUNTRY_INFO!D57*AL57*PROFILE!$G$10,IF(AND(DISTRICT!Z57<>\"Inconnu\",Z57<>\"Non requis\"),COUNTRY_INFO!P57*DISTRICT!AO57,0))","v":10289.028565414319},17439,0,{"$f":"MAX('MDA4'!R57,'T1'!L57,'T2'!J57,T3_R1!K57,T3_R2!K57)","v":0},{"$f":"MAX('MDA1'!K57,'MDA4'!S57,'MDA3'!I57,'MDA3'!L57,'T1'!M57,'T2'!K57,T3_R1!L57,T3_R2!L57)","v":1684},{"$f":"MAX('MDA1'!L57,'MDA4'!T57,'MDA3'!J57,'MDA3'!M57,'T1'!N57,'T2'!L57,T3_R1!M57,T3_R2!M57)","v":0},1684,{"$f":"MAX('MDA4'!R57,T57)","v":0},{"$f":"MAX('MDA1'!K57,'MDA4'!S57,'MDA3'!I57,'MDA3'!L57,V57,AD57)","v":1684},{"$f":"MAX('MDA1'!L57,'MDA4'!T57,'MDA3'!J57,'MDA3'!M57,AF57)","v":0},1684,9.6565170021216815]
[{"$f":"IF(COUNTRY_INFO!A58=0,\" \",COUNTRY_INFO!A58)","v":"Gabon"},{"$f":"IF(COUNTRY_INFO!B58=0,\" \",COUNTRY_INFO!B58)","v":"Nord"},{"$f":"IF(COUNTRY_INFO!C58=0,\" \",COUNTRY_INFO!C58)","v":"Okano"},{"$f":"COUNTRY_INFO!M58","v":0},null,null,{"$f":"MAX('MDA1'!M58,'MDA4'!U58)","v":0},{"$f":"IF(AND(COUNTRY_INFO!H58>0,COUNTRY_INFO!H58<4),IF(D58>MAX('MDA1'!M58,'MDA4'!U58),MAX('MDA1'!M58,'MDA4'!U58),D58),0)","v":0},{"$f":"IF(AND(COUNTRY_INFO!H58>0,COUNTRY_INFO!H58<4), IF(G58/D58*100<>0, IF(G58/D58*100>100,100,G58/D58*100), \"-\"),0)","v":0},{"$f":"COUNTRY_INFO!N58","v":0},null,null,{"$f":"MAX('MDA1'!M58,MAX('MDA3'!I58,'MDA3'!L58)+MAX('MDA3'!J58,'MDA3'!M58))","v":0},{"$f":"IF(AND(COUNTRY_INFO!I58>0,COUNTRY_INFO!I58<4),IF(J58>MAX('MDA1'!M58,MAX('MDA3'!I58,'MDA3'!L58)+MAX('MDA3'!J58,'MDA3'!M58)),MAX('MDA1'!M58,MAX('MDA3'!I58,'MDA3'!L58)+MAX('MDA3'!J58,'MDA3'!M58)),J58),0)","v":0},{"$f":"IF(AND(COUNTRY_INFO!I58>0,COUNTRY_INFO!I58<4), IF(M58/J58*100<>0, IF(M58/J58*100>100,100,M58/J58*100), \"-\"),0)","v":0},{"$f":"COUNTRY_INFO!O58","v":7087},997,1055,{"$f":"SUM(MAX('MDA4'!N58, 'T1'!L58, MAX(T3_R1!K58, T3_R2!K58)), MAX('MDA1'!K58, 'MDA4'!O58, 'T1'!M58, MAX(T3_R1!L58, T3_R2!L58)), MAX('MDA1'!L58, 'MDA4'!P58, 'T1'!N58, MAX(T3_R1!M58, T3_R2!M58)))","v":3693},{"$f":"IF(AND(COUNTRY_INFO!J58>1,COUNTRY_INFO!J58<4),IF(COUNTRY_INFO!E58>MAX('MDA4'!N58,'T1'!L58,MAX(T3_R1!K58,T3_R2!K58)),MAX('MDA4'!N58,'T1'!L58,MAX(T3_R1!K58,T3_R2!K58)),COUNTRY_INFO!E58),0)","v":0},{"$f":"IF(AND(COUNTRY_INFO!J58>1,COUNTRY_INFO!J58<4), IF(T58/COUNTRY_INFO!E58*100<>0, IF(T58/COUNTRY_INFO!E58*100>100,100,T58/COUNTRY_INFO!E58*100), \"-\"),0)","v":"-"},{"$f":"IF(AND(COUNTRY_INFO!J58>1,COUNTRY_INFO!J58<4),IF(COUNTRY_INFO!F58>MAX('MDA1'!K58,'MDA4'!O58,'T1'!M58,MAX(T3_R1!L58,T3_R2!L58)),MAX('MDA1'!K58,'MDA4'!O58,'T1'!M58,MAX(T3_R1!L58,T3_R2!L58)),COUNTRY_INFO!F58),0)","v":3693},{"$f":"IF(AND(COUNTRY_INFO!J58>1,COUNTRY_INFO!J58<4), IF(V58/COUNTRY_INFO!F58*100<>0, IF(V58/COUNTRY_INFO!F58*100>100,100,V58/COUNTRY_INFO!F58*100), \"-\"),0)","v":77.114220087700986},3693,{"$f":"IF(AND(COUNTRY_INFO!J58>1,COUNTRY_INFO!J58<4), IF(S58/P58*100<>0, IF(X58/P58*100>100,100,X58/P58*100), \"-\"),0)","v":52.109496260759137},{"$f":"COUNTRY_INFO!P58","v":1580.3700000000001},997,1055,{"$f":"MAX('T1'!L58,'T2'!J58)+MAX('T1'!M58,'T2'!K58)+MAX('T1'!N58,'T2'!L58)","v":2052},{"$f":"IF(COUNTRY_INFO!K58=1,IF(COUNTRY_INFO!F58*0.33>MAX('T1'!M58,'T2'!K58),MAX('T1'!M58,'T2'!K58),COUNTRY_INFO!F58*0.33),IF(COUNTRY_INFO!K58=2,IF(COUNTRY_INFO!F58*0.5>MAX('T1'!M58,'T2'!K58),MAX('T1'!M58,'T2'!K58),COUNTRY_INFO!F58*0.5),IF(COUNTRY_INFO!K58=3,IF(COUNTRY_INFO!F58>MAX('T1'!M58,'T2'!K58),MAX('T1'!M58,'T2'!K58),COUNTRY_INFO!F58),0)))","v":1580.3700000000001},{"$f":"IF(AND(COUNTRY_INFO!K58>0,COUNTRY_INFO!K58<4),IF(Z58>0,IF(COUNTRY_INFO!K58=1, AD58/(COUNTRY_INFO!F58*0.33)*100, IF(COUNTRY_INFO!K58=2, AD58/(COUNTRY_INFO!F58*0.5)*100, IF(COUNTRY_INFO!K58=3, AD58/COUNTRY_INFO!F58*100))),\"-\"),0)","v":100},{"$f":"IF(COUNTRY_INFO!K58=2,IF(COUNTRY_INFO!G58*0.2>MAX('T1'!N58,'T2'!L58),MAX('T1'!N58,'T2'!L58),COUNTRY_INFO!G58*0.2),IF(COUNTRY_INFO!K58=3,IF(COUNTRY_INFO!G58>MAX('T1'!N58,'T2'!L58),MAX('T1'!N58,'T2'!L58),COUNTRY_INFO!G58),0))","v":0},{"$f":"IF(AND(COUNTRY_INFO!K58>0,COUNTRY_INFO!K58<4),IF(Z58>0,IF(COUNTRY_INFO!K58=1, 0, IF(COUNTRY_INFO!K58=2, AF58/(COUNTRY_INFO!G58*0.2)*100, IF(COUNTRY_INFO!K58=3, AF58/COUNTRY_INFO!G58*100))),\"-\"),0)","v":0},1580.3700000000001,{"$f":"IF(AND(COUNTRY_INFO!K58>0,COUNTRY_INFO!K58<4), IF(AC58/Z58*100<>0, IF(AH58/Z58*100>100,100,AH58/Z58*100), \"-\"),0)","v":100},null,{"$f":"IF(AND(D58<>0, D58<>\"Inconnu\",D58<>\"Interrompu\",D58<>\"Non requis\"),D58/COUNTRY_INFO!D58, 0)","v":0},{"$f":"IF(AND(J58<>0,J58<>\"Inconnu\",J58<>\"Interrompu\",J58<>\"Non requis\"),J58/COUNTRY_INFO!D58, 0)","v":0},{"$f":"IF(AND(P58<>0,P58<>\"Inconnu\",P58<>\"Non requis\"),P58/(COUNTRY_INFO!E58+COUNTRY_INFO!F58), 0)","v":1},{"$f":"IF(AND(Z58<>0,Z58<>\"Inconnu\",Z58<>\"Non requis\"),IF(COUNTRY_INFO!K58=1,1,IF(COUNTRY_INFO!K58=2,0.5*COUNTRY_INFO!F58/(0.5*COUNTRY_INFO!F58+0.2*COUNTRY_INFO!G58),IF(COUNTRY_INFO!K58=3,COUNTRY_INFO!F58/(COUNTRY_INFO!F58+COUNTRY_INFO!G58)))),0)","v":1},{"$f":"IF(AND(Z58<>0,Z58<>\"Inconnu\",Z58<>\"Non requis\"),IF(COUNTRY_INFO!K58=1,0,IF(COUNTRY_INFO!K58=2,0.2*COUNTRY_INFO!G58/(0.5*COUNTRY_INFO!F58+0.2*COUNTRY_INFO!G58),IF(COUNTRY_INFO!K58=3,COUNTRY_INFO!G58/(COUNTRY_INFO!F58+COUNTRY_INFO!G58)))),0)","v":0},{"$f":"MAX(COUNTRY_INFO!D58*AK58*PROFILE!$G$7,COUNTRY_INFO!D58*AL58*PROFILE!$G$7)","v":0},{"$f":"MAX(COUNTRY_INFO!D58*AK58*PROFILE!$G$8,COUNTRY_INFO!D58*AL58*PROFILE!$G$8,COUNTRY_INFO!D58*AM58*PROFILE!$G$8)","v":2298.4670237887849},{"$f":"MAX(COUNTRY_INFO!D58*AK58*PROFILE!$G$9,COUNTRY_INFO!D58*AL58*PROFILE!$G$9,COUNTRY_INFO!D58*AM58*PROFILE!$G$9,IF(AND(DISTRICT!Z58<>\"Inconnu\",Z58<>\"Non requis\"),COUNTRY_INFO!P58*DISTRICT!AN58,0))","v":4788.5556123337783},{"$f":"MAX(COUNTRY_INFO!D58*AK58*PROFILE!$G$10,COUNTRY_INFO!D58*AL58*PROFILE!$G$10,IF(AND(DISTRICT!Z58<>\"Inconnu\",Z58<>\"Non requis\"),COUNTRY_INFO!P58*DISTRICT!AO58,0))","v":0},7087.0226361225632,"Y",{"$f":"MAX('MDA4'!R58,'T1'!L58,'T2'!J58,T3_R1!K58,T3_R2!K58)","v":0},{"$f":"MAX('MDA1'!K58,'MDA4'!S58,'MDA3'!I58,'MDA3'!L58,'T1'!M58,'T2'!K58,T3_R1!L58,T3_R2!L58)","v":3693},{"$f":"MAX('MDA1'!L58,'MDA4'!T58,'MDA3'!J58,'MDA3'!M58,'T1'!N58,'T2'!L58,T3_R1!M58,T3_R2!M58)","v":0},3693,{"$f":"MAX('MDA4'!R58,T58)","v":0},{"$f":"MAX('MDA1'!K58,'MDA4'!S58,'MDA3'!I58,'MDA3'!L58,V58,AD58)","v":3693},{"$f":"MAX('MDA1'!L58,'MDA4'!T58,'MDA3'!J58,'MDA3'!M58,AF58)","v":0},3693,52.109329821761463]
[{"$f":"IF(COUNTRY_INFO!A59=0,\" \",COUNTRY_INFO!A59)","v":"Gabon"},{"$f":"IF(COUNTRY_INFO!B59=0,\" \",COUNTRY_INFO!B59)","v":"Nord"},{"$f":"IF(COUNTRY_INFO!C59=0,\" \",COUNTRY_INFO!C59)","v":"Woleu"},{"$f":"COUNTRY_INFO!M59","v":0},null,null,{"$f":"MAX('MDA1'!M59,'MDA4'!U59)","v":0},{"$f":"IF(AND(COUNTRY_INFO!H59>0,COUNTRY_INFO!H59<4),IF(D59>MAX('MDA1'!M59,'MDA4'!U59),MAX('MDA1'!M59,'MDA4'!U59),D59),0)","v":0},{"$f":"IF(AND(COUNTRY_INFO!H59>0,COUNTRY_INFO!H59<4), IF(G59/D59*100<>0, IF(G59/D59*100>100,100,G59/D59*100), \"-\"),0)","v":0},{"$f":"COUNTRY_INFO!N59","v":86333},null,null,{"$f":"MAX('MDA1'!M59,MAX('MDA3'!I59,'MDA3'!L59)+MAX('MDA3'!J59,'MDA3'!M59))","v":0},{"$f":"IF(AND(COUNTRY_INFO!I59>0,COUNTRY_INFO!I59<4),IF(J59>MAX('MDA1'!M59,MAX('MDA3'!I59,'MDA3'!L59)+MAX('MDA3'!J59,'MDA3'!M59)),MAX('MDA1'!M59,MAX('MDA3'!I59,'MDA3'!L59)+MAX('MDA3'!J59,'MDA3'!M59)),J59),0)","v":0},{"$f":"IF(AND(COUNTRY_INFO!I59>0,COUNTRY_INFO!I59<4), IF(M59/J59*100<>0, IF(M59/J59*100>100,100,M59/J59*100), \"-\"),0)","v":"-"},{"$f":"COUNTRY_INFO!O59","v":31943},3207,3172,{"$f":"SUM(MAX('MDA4'!N59, 'T1'!L59, MAX(T3_R1!K59, T3_R2!K59)), MAX('MDA1'!K59, 'MDA4'!O59, 'T1'!M59, MAX(T3_R1!L59, T3_R2!L59)), MAX('MDA1'!L59, 'MDA4'!P59, 'T1'!N59, MAX(T3_R1!M59, T3_R2!M59)))","v":6379},{"$f":"IF(AND(COUNTRY_INFO!J59>1,COUNTRY_INFO!J59<4),IF(COUNTRY_INFO!E59>MAX('MDA4'!N59,'T1'!L59,MAX(T3_R1!K59,T3_R2!K59)),MAX('MDA4'!N59,'T1'!L59,MAX(T3_R1!K59,T3_R2!K59)),COUNTRY_INFO!E59),0)","v":0},{"$f":"IF(AND(COUNTRY_INFO!J59>1,COUNTRY_INFO!J59<4), IF(T59/COUNTRY_INFO!E59*100<>0, IF(T59/COUNTRY_INFO!E59*100>100,100,T59/COUNTRY_INFO!E59*100), \"-\"),0)","v":"-"},{"$f":"IF(AND(COUNTRY_INFO!J59>1,COUNTRY_INFO!J59<4),IF(COUNTRY_INFO!F59>MAX('MDA1'!K59,'MDA4'!O59,'T1'!M59,MAX(T3_R1!L59,T3_R2!L59)),MAX('MDA1'!K59,'MDA4'!O59,'T1'!M59,MAX(T3_R1!L59,T3_R2!L59)),COUNTRY_INFO!F59),0)","v":6379},{"$f":"IF(AND(COUNTRY_INFO!J59>1,COUNTRY_INFO!J59<4), IF(V59/COUNTRY_INFO!F59*100<>0, IF(V59/COUNTRY_INFO!F59*100>100,100,V59/COUNTRY_INFO!F59*100), \"-\"),0)","v":29.555668813417967},6379,{"$f":"IF(AND(COUNTRY_INFO!J59>1,COUNTRY_INFO!J59<4), IF(S59/P59*100<>0, IF(X59/P59*100>100,100,X59/P59*100), \"-\"),0)","v":19.969946467144599},{"$f":"COUNTRY_INFO!P59","v":7122.39},3207,3172,{"$f":"MAX('T1'!L59,'T2'!J59)+MAX('T1'!M59,'T2'!K59)+MAX('T1'!N59,'T2'!L59)","v":6379},{"$f":"IF(COUNTRY_INFO!K59=1,IF(COUNTRY_INFO!F59*0.33>MAX('T1'!M59,'T2'!K59),MAX('T1'!M59,'T2'!K59),COUNTRY_INFO!F59*0.33),IF(COUNTRY_INFO!K59=2,IF(COUNTRY_INFO!F59*0.5>MAX('T1'!M59,'T2'!K59),MAX('T1'!M59,'T2'!K59),COUNTRY_INFO!F59*0.5),IF(COUNTRY_INFO!K59=3,IF(COUNTRY_INFO!F59>MAX('T1'!M59,'T2'!K59),MAX('T1'!M59,'T2'!K59),COUNTRY_INFO!F59),0)))","v":6379},{"$f":"IF(AND(COUNTRY_INFO!K59>0,COUNTRY_INFO!K59<4),IF(Z59>0,IF(COUNTRY_INFO!K59=1, AD59/(COUNTRY_INFO!F59*0.33)*100, IF(COUNTRY_INFO!K59=2, AD59/(COUNTRY_INFO!F59*0.5)*100, IF(COUNTRY_INFO!K59=3, AD59/COUNTRY_INFO!F59*100))),\"-\"),0)","v":89.562632767933238},{"$f":"IF(COUNTRY_INFO!K59=2,IF(COUNTRY_INFO!G59*0.2>MAX('T1'!N59,'T2'!L59),MAX('T1'!N59,'T2'!L59),COUNTRY_INFO!G59*0.2),IF(COUNTRY_INFO!K59=3,IF(COUNTRY_INFO!G59>MAX('T1'!N59,'T2'!L59),MAX('T1'!N59,'T2'!L59),COUNTRY_INFO!G59),0))","v":0},{"$f":"IF(AND(COUNTRY_INFO!K59>0,COUNTRY_INFO!K59<4),IF(Z59>0,IF(COUNTRY_INFO!K59=1, 0, IF(COUNTRY_INFO!K59=2, AF59/(COUNTRY_INFO!G59*0.2)*100, IF(COUNTRY_INFO!K59=3, AF59/COUNTRY_INFO!G59*100))),\"-\"),0)","v":0},6379,{"$f":"IF(AND(COUNTRY_INFO!K59>0,COUNTRY_INFO!K59<4), IF(AC59/Z59*100<>0, IF(AH59/Z59*100>100,100,AH59/Z59*100), \"-\"),0)","v":89.562632767933238},null,{"$f":"IF(AND(D59<>0, D59<>\"Inconnu\",D59<>\"Interrompu\",D59<>\"Non requis\"),D59/COUNTRY_INFO!D59, 0)","v":0},{"$f":"IF(AND(J59<>0,J59<>\"Inconnu\",J59<>\"Interrompu\",J59<>\"Non requis\"),J59/COUNTRY_INFO!D59, 0)","v":1},{"$f":"IF(AND(P59<>0,P59<>\"Inconnu\",P59<>\"Non requis\"),P59/(COUNTRY_INFO!E59+COUNTRY_INFO!F59), 0)","v":1},{"$f":"IF(AND(Z59<>0,Z59<>\"Inconnu\",Z59<>\"Non requis\"),IF(COUNTRY_INFO!K59=1,1,IF(COUNTRY_INFO!K59=2,0.5*COUNTRY_INFO!F59/(0.5*COUNTRY_INFO!F59+0.2*COUNTRY_INFO!G59),IF(COUNTRY_INFO!K59=3,COUNTRY_INFO!F59/(COUNTRY_INFO!F59+COUNTRY_INFO!G59)))),0)","v":1},{"$f":"IF(AND(Z59<>0,Z59<>\"Inconnu\",Z59<>\"Non requis\"),IF(COUNTRY_INFO!K59=1,0,IF(COUNTRY_INFO!K59=2,0.2*COUNTRY_INFO!G59/(0.5*COUNTRY_INFO!F59+0.2*COUNTRY_INFO!G59),IF(COUNTRY_INFO!K59=3,COUNTRY_INFO!G59/(COUNTRY_INFO!F59+COUNTRY_INFO!G59)))),0)","v":0},{"$f":"MAX(COUNTRY_INFO!D59*AK59*PROFILE!$G$7,COUNTRY_INFO!D59*AL59*PROFILE!$G$7)","v":3453.0359164198749},{"$f":"MAX(COUNTRY_INFO!D59*AK59*PROFILE!$G$8,COUNTRY_INFO!D59*AL59*PROFILE!$G$8,COUNTRY_INFO!D59*AM59*PROFILE!$G$8)","v":10359.901512204093},{"$f":"MAX(COUNTRY_INFO!D59*AK59*PROFILE!$G$9,COUNTRY_INFO!D59*AL59*PROFILE!$G$9,COUNTRY_INFO!D59*AM59*PROFILE!$G$9,IF(AND(DISTRICT!Z59<>\"Inconnu\",Z59<>\"Non requis\"),COUNTRY_INFO!P59*DISTRICT!AN59,0))","v":21583.500661982463},{"$f":"MAX(COUNTRY_INFO!D59*AK59*PROFILE!$G$10,COUNTRY_INFO!D59*AL59*PROFILE!$G$10,IF(AND(DISTRICT!Z59<>\"Inconnu\",Z59<>\"Non requis\"),COUNTRY_INFO!P59*DISTRICT!AO59,0))","v":50936.561909393567},86333,0,{"$f":"MAX('MDA4'!R59,'T1'!L59,'T2'!J59,T3_R1!K59,T3_R2!K59)","v":0},{"$f":"MAX('MDA1'!K59,'MDA4'!S59,'MDA3'!I59,'MDA3'!L59,'T1'!M59,'T2'!K59,T3_R1!L59,T3_R2!L59)","v":6379},{"$f":"MAX('MDA1'!L59,'MDA4'!T59,'MDA3'!J59,'MDA3'!M59,'T1'!N59,'T2'!L59,T3_R1!M59,T3_R2!M59)","v":0},6379,{"$f":"MAX('MDA4'!R59,T59)","v":0},{"$f":"MAX('MDA1'!K59,'MDA4'!S59,'MDA3'!I59,'MDA3'!L59,V59,AD59)","v":6379},{"$f":"MAX('MDA1'!L59,'MDA4'!T59,'MDA3'!J59,'MDA3'!M59,AF59)","v":0},6379,7.3888316171104904]

{"sheet":"SUMMARY","index":10,"n_rows":71,"n_cols":8,"rows_kept":71,"cut":false,"hidden":false,"merged":[[70,1,70,2],[36,1,36,2],[37,1,37,2],[38,1,38,2],[67,1,67,7],[54,1,60,7],[69,1,69,2],[49,1,49,7],[50,3,50,4],[63,1,63,3],[63,4,63,7],[64,4,65,7],[65,1,65,3],[62,1,62,7],[32,1,32,2],[33,1,33,2],[34,1,34,2],[35,1,35,2],[23,1,23,5],[31,1,31,2],[24,1,24,5],[25,1,25,5],[26,1,26,5],[27,1,27,5],[15,1,15,3],[1,1,1,7],[5,1,11,7],[3,3,3,5],[0,3,0,7]]}
[null,null,null,"Cette version sera utilisée par les pays endémiques à la Loase"]
[null,"Formulaire de Rapport Commun v.3.1 (L)"]
[]
[null,"Pays",null,{"$f":"IF(INTRO!$E$34<>0,INTRO!$E$34,\" \")","v":"Gabon"},null,null,"Année",{"$f":"IF(INTRO!$E$36<>0,INTRO!$E$36,\" \")","v":2018}]
[]
[null,"Les autorités nationales sont priées de compléter ce formulaire de rapport commun et de le soumettre à l'Organisation mondiale de la Santé avant le 15 août de l'année en cours pour rapporter les données des activités de chimioprévention mises en oeuvre l'année précédente. "]
[]
[]
[]
[]
[]
[]
[]
[null,"Nombre de personnes ayant reçu un traitement (au moins une fois) pour les maladies"]
[]
[null,null,null,null,"EAPréS","EAS","Adultes","Total"]
[null,"Filariose lymphatique",null,null,0,0,0,{"$f":"SUM(E17:G17)","v":0}]
[null,"Onchocercose",null,null,"Not eligible",0,0,{"$f":"SUM(E18:G18)","v":0}]
[null,"Géohelminthiases",null,null,0,128533,0,{"$f":"SUM(E19:G19)","v":128533}]
[null,"Schistosomiase",null,null,"Not targeted",189108,0,{"$f":"SUM(E20:G20)","v":189108}]
[]
[null,"Couverture des interventions de CP contre les maladies (%) "]
[]
[null,null,null,null,null,null,"Géographique","National"]
[null,"Filariose lymphatique",null,null,null,null,0,"-"]
[null,"Onchocercose",null,null,null,null,0,"-"]
[null,"Géohelminthiases",null,null,null,null,100,26.599987169060054]
[null,"Schistosomiase",null,null,null,null,100,73.106531973320827]
[]
[null,"Nombre de personnes traitées et couverture du programme en pourcentage, par intervention de CP"]
[]
[null,null,null,"EAPréS","EAS","Adultes","Total","Couverture"]
[null,"MDA 1 (IVM+ALB)",null,"Non admissible",{"$f":"'MDA1'!$K$4","v":0},{"$f":"'MDA1'!$L$4","v":0},{"$f":"'MDA1'!$M$4","v":0},{"$f":"'MDA1'!$Q$4","v":" "}]
[null,"MDA 4 (ALB/2*ALB)",null,{"$f":"'MDA4'!$R$4","v":0},{"$f":"'MDA4'!$S$4","v":0},{"$f":"'MDA4'!$T$4","v":0},{"$f":"'MDA4'!$U$4","v":0},{"$f":"'MDA4'!$Y$4","v":" "}]
[null,"MDA 3 (IVM)",null,"Non admissible",{"$f":"'MDA3'!$O$4","v":0},{"$f":"'MDA3'!$P$4","v":0},{"$f":"'MDA3'!$Q$4","v":0},{"$f":"'MDA3'!$T$4","v":" "}]
[null,"T 1 (PZQ+ALB/MBD)",null,{"$f":"IF('T1'!$L$4<>0,'T1'!$L$4,\"Non ciblé\")","v":"Non ciblé"},{"$f":"'T1'!$M$4","v":117555},{"$f":"IF('T1'!$N$4<>0,'T1'!$N$4,\"Non ciblé\")","v":"Non ciblé"},{"$f":"'T1'!$O$4","v":117555},{"$f":"'T1'!$S$4","v":42.804864727087356}]
[null,"T 2 (PZQ)",null,{"$f":"IF('T2'!$J$4<>0,'T2'!$J$4,\"Non ciblé\")","v":"Non ciblé"},{"$f":"'T2'!$K$4","v":71553},{"$f":"'T2'!$L$4","v":0},{"$f":"'T2'!$M$4","v":71553},{"$f":"'T2'!$Q$4","v":49.881836243856533}]
[null,"T 3 (ALB/MBD) - tournée 1",null,{"$f":"T3_R1!$K$4","v":0},{"$f":"T3_R1!$L$4","v":29226},{"$f":"IF(T3_R1!$M$4<>0,T3_R1!$M$4,\"Non ciblé\")","v":"Non ciblé"},{"$f":"T3_R1!$N$4","v":29226},{"$f":"T3_R1!$R$4","v":72.670761120919011}]
[null,"T 3 (ALB/MBD) - tournée 2",null,{"$f":"T3_R2!$K$4","v":0},{"$f":"T3_R2!$L$4","v":3853},{"$f":"IF(T3_R2!$M$4<>0,T3_R2!$M$4,\"Non ciblé\")","v":"Non ciblé"},{"$f":"T3_R2!$N$4","v":3853},{"$f":"T3_R2!$R$4","v":65.605312446790393}]
[]
[null,"Inventaire des médicaments pour la chimiothérapie préventive dans le pays"]
[]
[null,null,"IVM","DEC","ALB (FL)","ALB (STH)","MBD","PZQ"]
[null,"Disponible"]
[null,"Distribué"]
[null,"Gaspillé"]
[null,"Reçus"]
[null,"Restant",{"$f":"C44-C45-C46+C47","v":0},0,0,0,0,0]
[]
[null,"Veuillez indiquer le médicament qui a été utilisé pour traiter les EAPréS, et les mécanismes de distribution"]
[null,"Médicament",null,"Mécanismes de distribution",null,null,"Source"]
[]
[null,"Remarques supplémentaires évenuelles concernant le rapport"]
[]
[null,"sur les 385 500 comprimés de  mébendazole reçu en 2018 , 157225  comprimés ont expirés en septembre 2018 et 6646 perdus lors des deux phases de distribution.  En ce qui concerne le Praziquantel, 3 régions sur 10 n'ont pas acheminé leurs stock au niveau du Programme, soit 298113 comprimés non disponibles  avec une perte de 4530 comprimés pendant les phases de distribution.   Pour l'heure nous disposons 20698 comprimés de Mébendazole et 635444 comprimé de Praziquantel ( expirent en octobre 2019). "]
[]
[]
[]
[]
[]
[]
[]
[null,"         J’ai pris connaissance et accepté la politique de la communication de données de l’OMS"]
[null,"Nom et signature du Coordonnateur MTN \nou du Représentant du Ministère de la Santé :"]
[]
[null,"Date:"]
[]
[null,"Veuillez envoyer le rapport national (signé et sous format électronique) au représentant de l'OMS du pays en mettant en copie :"]
[]
[null,"Siège de l'OMS ",null,"PC_JointForms@who.int"]
[null,"Bureau régional de l'OMS",null,"Conseiller régional MTN"]

{"sheet":"PROFILE","index":11,"n_rows":124,"n_cols":8,"rows_kept":124,"cut":false,"hidden":true,"merged":[[123,1,124,7],[85,6,85,7],[87,6,87,7],[89,6,89,7],[86,6,86,7],[88,6,88,7],[81,1,81,3],[19,1,19,6],[43,1,43,3],[77,1,77,3],[80,1,80,3],[78,1,78,3],[23,1,23,3],[20,1,20,6],[79,1,79,3],[55,1,55,3],[65,1,65,3],[29,1,29,3],[21,1,21,6],[69,1,69,3],[73,1,73,3],[26,1,26,3],[28,1,28,3],[59,1,59,3],[30,1,30,3],[34,1,34,3],[42,1,42,3],[63,1,63,3],[25,1,25,3],[0,1,0,5],[1,1,1,7],[3,3,3,5],[5,3,5,5],[4,1,4,7],[5,1,5,2],[11,1,11,6],[6,1,6,3],[6,4,6,5],[12,1,12,6],[47,1,47,3],[51,1,51,3],[13,1,13,6],[27,1,27,3],[16,1,16,6],[18,1,18,6],[14,1,14,6],[15,1,15,6],[7,4,7,5],[8,4,8,5],[9,4,9,5],[7,1,7,3],[8,1,8,3],[9,1,9,3],[17,1,17,6]]}
[]
[null,"Formulaire de Rapport Commun v.3.1 - CP"]
[]
[null,"Pays",null,{"$f":"IF(INTRO!$E$34<>0,INTRO!$E$34,\" \")","v":"Gabon"},null,null,"Année",{"$f":"IF(INTRO!$E$36<>0,INTRO!$E$36,\" \")","v":2018}]
[null,"!!! ATTENTION !!!\nAvant d’analyser les données dans le profil du pays, merci de vous assurer que le rapport dans l’onglet SUMMARY est bien mis à jour"]
[null,"Population totale ",null,null,null,null,1,{"$f":"COUNTRY_INFO!D4","v":2066520}]
[null,"Population — autres groupes d’âge",null,null,null,null,{"$f":"IF($H$6<>0,H7/$H$6,0)","v":3.9996709443896016E-2},{"$f":"H6-SUM(H8:H10)","v":82654}]
[null,"Population — EAPréS",null,null,{"$f":"INTRO!B48","v":"1-4 ans"},null,{"$f":"IF($H$6<>0,H8/$H$6,0)","v":0.11999932253256683},{"$f":"COUNTRY_INFO!E4","v":247981}]
[null,"Population — EAS",null,null,{"$f":"INTRO!B49","v":"5-14 ans"},null,{"$f":"IF($H$6<>0,H9/$H$6,0)","v":0.25000290343185644},{"$f":"COUNTRY_INFO!F4","v":516636}]
[null,"Population — Adults",null,null,{"$f":"INTRO!B50","v":"15 ans et plus"},null,0.59000106459168067,{"$f":"COUNTRY_INFO!G4","v":1219249}]
[]
[null,"Nombre total d’individus nécessitant une CP pour au moins une des maladies (FL, Oncho, STH, SCH)",null,null,null,null,null,{"$f":"DISTRICT!AT6","v":1081164.6888610804}]
[null,"Proportion du nombre d’individus nécessitant un CP pour au moins une maladie parmi la population totale",null,null,null,null,null,{"$f":"IF(H6<>0,H12/H6,0)","v":0.52318133328546568}]
[null,"Nombre d’UMOs nécessitant une CP pour au moins une des maladies (FL, Oncho, STH, SCH)",null,null,null,null,null,{"$f":"COUNTIF(DISTRICT!AT9:AT1000,\">0\")","v":51}]
[null,"Nombre d’UMOs ayant reçu une CP pour au moins une des maladies (FL, Oncho, STH, SCH)",null,null,null,null,null,{"$f":"COUNTIF(DISTRICT!AY9:AY1000,\">0\")","v":51}]
[null,"Proportion d’UMOs nécessitant une CP pour au moins une maladie et l’ayant reçue",null,null,null,null,null,{"$f":"IF(H14<>0,H15/H14,0)","v":1}]
[null,"Nombre total d’individus ayant été traités pour au moins une maladie (FL, Oncho, STH, SCH)",null,null,null,null,null,{"$f":"DISTRICT!AY6","v":200086}]
[null,"Nombre total d’individus nécessitant un traitement ayant reçu une CP pour au moins une maladie (FL, Oncho, STH, SCH)",null,null,null,null,null,{"$f":"DISTRICT!BC6","v":175065.52}]
[null,"Couverture CP pour au moins une maladie (FL, Oncho, STH, SCH)",null,null,null,null,null,{"$f":"DISTRICT!BD6","v":0.16192308332268726}]
[null,"Nombre d’UMOs ayant été traitées pour toutes les maladies nécessitant une CP dans ces unités",null,null,null,null,null,{"$f":"DISTRICT!AU6","v":21}]
[null,"Population nécessitant une CP dans des UMOs qui ont été traitées pour toutes les maladies requérant une CP",null,null,null,null,null,{"$f":"SUMIF(DISTRICT!AU9:AU1000,\"Y\",DISTRICT!AT9:AT1000)","v":246407.68886108036}]
[null,"Population ayant reçu une CP dans des UMOs qui ont été traitées pour toutes les maladies nécessitant une CP",null,null,null,null,null,{"$f":"SUMIF(DISTRICT!AU9:AU1000,\"Y\",DISTRICT!AY9:AY1000)","v":110927}]
[]
[null,null,null,null,"FL","ONCHO","STH","SCH"]
[]
[null,"Maladies nécessitant une CP dans la pays",null,null,{"$f":"IF(INTRO!E38=\"Endémique\",\"Yes\",\"No\")","v":"Yes"},{"$f":"IF(INTRO!E40=\"Endémique\",\"Yes\",\"No\")","v":"Yes"},{"$f":"IF(INTRO!E42=\"Endémique\",\"Yes\",\"No\")","v":"Yes"},{"$f":"IF(INTRO!E44=\"Endémique\",\"Yes\",\"No\")","v":"Yes"}]
[null,"Nombre d’UMOs dans le pays",null,null,{"$f":"IF(E26=\"Yes\",INTRO!$E$46,\"-\")","v":51},{"$f":"IF(F26=\"Yes\",INTRO!$E$46,\"-\")","v":51},{"$f":"IF(G26=\"Yes\",INTRO!$E$46,\"-\")","v":51},{"$f":"IF(H26=\"Yes\",INTRO!$E$46,\"-\")","v":51}]
[null,"Nombre d’UMOs dont le statut d’endémicité est connu",null,null,{"$f":"IF(E26=\"Yes\",E27-E29,\"-\")","v":51},{"$f":"IF(F26=\"Yes\",F27-F29,\"-\")","v":36},{"$f":"IF(G26=\"Yes\",G27-G29,\"-\")","v":51},{"$f":"IF(H26=\"Yes\",H27-H29,\"-\")","v":51}]
[null,"Nombre d’UMOs dont le statut d’endémicité est inconnu",null,null,{"$f":"IF(E26=\"Yes\",E27-(992-COUNTIF(COUNTRY_INFO!H$9:H$1000,\"\"))+COUNTIF(COUNTRY_INFO!H$9:H$1000,\"=4\"),\"-\")","v":0},{"$f":"IF(F26=\"Yes\",F27-(992-COUNTIF(COUNTRY_INFO!I$9:I$1000,\"\"))+COUNTIF(COUNTRY_INFO!I$9:I$1000,\"=4\"),\"-\")","v":15},{"$f":"IF(G26=\"Yes\",G27-(992-COUNTIF(COUNTRY_INFO!J$9:J$1000,\"\"))+COUNTIF(COUNTRY_INFO!J$9:J$1000,\"=4\")+COUNTIF(COUNTRY_INFO!J$9:J$1000,\"=5\"),\"-\")","v":0},{"$f":"IF(H26=\"Yes\",H27-(992-COUNTIF(COUNTRY_INFO!K$9:K$1000,\"\"))+COUNTIF(COUNTRY_INFO!K$9:K$1000,\"=4\")+COUNTIF(COUNTRY_INFO!K$9:K$1000,\"=5\"),\"-\")","v":0}]
[null,"Nombre d’UMOs non-endémiques",null,null,{"$f":"IF(E26=\"Yes\",COUNTIF(COUNTRY_INFO!H$9:H$1000,\"=0\"),\"-\")","v":33},{"$f":"IF(F26=\"Yes\",COUNTIF(COUNTRY_INFO!I$9:I$1000,\"=0\"),\"-\")","v":11},{"$f":"IF(G26=\"Yes\",COUNTIF(COUNTRY_INFO!J$9:J$1000,\"=0\"),\"-\")","v":0},{"$f":"IF(H26=\"Yes\",COUNTIF(COUNTRY_INFO!K$9:K$1000,\"=0\"),\"-\")","v":7}]
[null,"Nombre d’UMOs nécessitant une CP (total)",null,null,{"$f":"COUNTIF(COUNTRY_INFO!H$9:H$1000,\"=1\")","v":18},{"$f":"COUNTIF(COUNTRY_INFO!I$9:I$1000,\"=1\")","v":25},{"$f":"SUM(G33:G34)","v":47},{"$f":"SUM(H32:H34)","v":44}]
[null,null,null,"prevalence basse",null,null,{"$f":"COUNTIF(COUNTRY_INFO!J$9:J$1000,\"=1\")","v":4},{"$f":"COUNTIF(COUNTRY_INFO!K$9:K$1000,\"=1\")","v":39}]
[null,null,null,"prevalence modérée",null,null,{"$f":"COUNTIF(COUNTRY_INFO!J$9:J$1000,\"=2\")","v":25},{"$f":"COUNTIF(COUNTRY_INFO!K$9:K$1000,\"=2\")","v":5}]
[null,null,null,"prevalence haute",null,null,{"$f":"COUNTIF(COUNTRY_INFO!J$9:J$1000,\"=3\")","v":22},{"$f":"COUNTIF(COUNTRY_INFO!K$9:K$1000,\"=3\")","v":0}]
[null,"Population nécessitant une CP dans le pays (total) ",null,null,{"$f":"COUNTRY_INFO!M4","v":361121},{"$f":"COUNTRY_INFO!N4","v":721771},{"$f":"COUNTRY_INFO!O4","v":483207},{"$f":"COUNTRY_INFO!P4","v":192878.62000000005}]
[null,null,"EAPréS","prevalence modérée",null,null,{"$f":"SUMIF(COUNTRY_INFO!J$9:J$1000,\"=2\",COUNTRY_INFO!E$9:E$1000)","v":128174}]
[null,null,null,"prevalence haute",null,null,{"$f":"SUMIF(COUNTRY_INFO!J$9:J$1000,\"=3\",COUNTRY_INFO!E$9:E$1000)","v":28539}]
[null,null,"EAS","prevalence basse",null,null,null,{"$f":"SUMIF(COUNTRY_INFO!K$9:K$1000,\"=1\",COUNTRY_INFO!F$9:F$1000)*0.33","v":153137.82}]
[null,null,null,"prevalence modérée",null,null,{"$f":"SUMIF(COUNTRY_INFO!J$9:J$1000,\"=2\",COUNTRY_INFO!F$9:F$1000)","v":267034},{"$f":"SUMIF(COUNTRY_INFO!K$9:K$1000,\"=2\",COUNTRY_INFO!F$9:F$1000)*0.5","v":20443}]
[null,null,null,"prevalence haute",null,null,{"$f":"SUMIF(COUNTRY_INFO!J$9:J$1000,\"=3\",COUNTRY_INFO!F$9:F$1000)","v":59460},{"$f":"SUMIF(COUNTRY_INFO!K$9:K$1000,\"=3\",COUNTRY_INFO!F$9:F$1000)","v":0}]
[null,null,"Adults","prevalence modérée",null,null,null,{"$f":"SUMIF(COUNTRY_INFO!K$9:K$1000,\"=2\",COUNTRY_INFO!G$9:G$1000)*0.2","v":19297.8}]
[null,null,null,"prevalence haute",null,null,null,{"$f":"SUMIF(COUNTRY_INFO!K$9:K$1000,\"=3\",COUNTRY_INFO!G$9:G$1000)","v":0}]
[null,"Nombre d’UMOs où une CP a été mise en oeuvre (total)",null,null,{"$f":"COUNTIF(DISTRICT!G$9:G$1000,\">0\")","v":0},{"$f":"COUNTIF(DISTRICT!M$9:M$1000,\">0\")","v":0},{"$f":"COUNTIF(DISTRICT!S$9:S$1000,\">0\")","v":47},{"$f":"COUNTIF(DISTRICT!AC$9:AC$1000,\">0\")","v":44}]
[null,"Nombre d’UMOs nécessitant une CP et  où elle a été mise en oeuvre",null,null,{"$f":"COUNTIF(DISTRICT!H$9:H$1000,\">0\")","v":0},{"$f":"COUNTIF(DISTRICT!N$9:N$1000,\">0\")","v":0},{"$f":"COUNTIF(DISTRICT!X$9:X$1000,\">0\")","v":47},{"$f":"COUNTIF(DISTRICT!AH$9:AH$1000,\">0\")","v":44}]
[null,null,"EAPréS",null,null,null,{"$f":"COUNTIF(DISTRICT!T$9:T$1000,\">0\")","v":0}]
[null,null,"EAS",null,null,null,{"$f":"COUNTIF(DISTRICT!V$9:V$1000,\">0\")","v":47},{"$f":"COUNTIF(DISTRICT!AD$9:AD$1000,\">0\")","v":44}]
[null,null,"Adults",null,null,null,null,{"$f":"COUNTIF(DISTRICT!AF$9:AF$1000,\">0\")","v":0}]
[null,"Nombre d’individus traités (total)",null,null,{"$f":"DISTRICT!G4","v":0},{"$f":"DISTRICT!M4","v":0},{"$f":"DISTRICT!S4","v":128533},{"$f":"DISTRICT!AC4","v":189108}]
[null,null,"EAPréS",null,{"$f":"SUMMARY!$E17","v":0},{"$f":"SUMMARY!$E18","v":"Not eligible"},{"$f":"SUMMARY!$E19","v":0},{"$f":"SUMMARY!$E20","v":"Not targeted"}]
[null,null,"EAS",null,{"$f":"SUMMARY!$F17","v":0},{"$f":"SUMMARY!$F18","v":0},{"$f":"SUMMARY!$F19","v":128533},{"$f":"SUMMARY!$F20","v":189108}]
[null,null,"Adults",null,{"$f":"SUMMARY!$G17","v":0},{"$f":"SUMMARY!$G18","v":0},{"$f":"SUMMARY!$G19","v":0},{"$f":"SUMMARY!$G20","v":0}]
[null,"Nombre d’individus nécessitant CP et traités (total)",null,null,{"$f":"DISTRICT!H4","v":0},{"$f":"DISTRICT!N4","v":0},{"$f":"DISTRICT!X4","v":128533},{"$f":"DISTRICT!AH4","v":141006.87000000002}]
[null,null,"EAPréS",null,null,null,{"$f":"DISTRICT!T4","v":0}]
[null,null,"EAS",null,null,null,{"$f":"DISTRICT!V4","v":128533},{"$f":"DISTRICT!AD4","v":141006.87000000002}]
[null,null,"Adults",null,null,null,null,{"$f":"DISTRICT!AF4","v":0}]
[null,"Couverture géographique (tous âges)",null,null,{"$f":"IF(E31<>0,E44/E31,0)","v":0},{"$f":"IF(F31<>0,F44/F31,0)","v":0},{"$f":"IF(G31<>0,G44/G31,0)","v":1},{"$f":"IF(H31<>0,H44/H31,0)","v":1}]
[null,null,"EAPréS",null,null,null,{"$f":"IF(G31<>0,G45/G31,0)","v":0}]
[null,null,"EAS",null,null,null,{"$f":"IF(G31<>0,G46/G31,0)","v":1},{"$f":"IF(H31<>0,H46/H31,0)","v":1}]
[null,null,"Adults",null,null,null,null,{"$f":"IF(SUM(H33:H34)<>0,H47/SUM(H33:H34),0)","v":0}]
[null,"Couverture nationale (total)",null,null,{"$f":"IF(E35<>0,E52/E35,0)","v":0},{"$f":"IF(F35<>0,F52/F35,0)","v":0},{"$f":"IF(G35<>0,G52/G35,0)","v":0.26599987169060052},{"$f":"IF(H35<>0,H52/H35,0)","v":0.73106531973320832}]
[null,null,"EAPréS",null,null,null,{"$f":"IF(SUM(G36:G37)<>0,G53/SUM(G36:G37),0)","v":0}]
[null,null,"EAS",null,null,null,{"$f":"IF(SUM(G39:G40)<>0,G54/SUM(G39:G40),0)","v":0.39367645347234559},{"$f":"IF(SUM(H38:H40)<>0,H54/SUM(H38:H40),0)","v":0.81234130591156339}]
[null,null,"Adults",null,null,null,null,{"$f":"IF(SUM(H41:H42)<>0,H55/SUM(H41:H42),0)","v":0}]
[null,null,null,null,"FL","ONCHO","STH","SCH"]
[]
[null,"Nombre d’UMOs ayant réalisé une couverture efficace (tous âges)",null,null,{"$f":"COUNTIF(DISTRICT!I$9:I$1000,\">=65\")","v":0},{"$f":"COUNTIF(DISTRICT!O$9:O$1000,\">=65\")","v":0},{"$f":"COUNTIF(DISTRICT!Y$9:Y$1000,\">=75\")","v":0},{"$f":"COUNTIF(DISTRICT!AI$9:AI$1000,\">=75\")","v":35}]
[null,null,"EAPréS",null,null,null,{"$f":"COUNTIF(DISTRICT!U$9:U$1000,\">=75\")","v":0}]
[null,null,"EAS",null,null,null,{"$f":"COUNTIF(DISTRICT!W$9:W$1000,\">=75\")","v":5},{"$f":"COUNTIF(DISTRICT!AE$9:AE$1000,\">=75\")","v":39}]
[null,null,"Adults",null,null,null,null,{"$f":"COUNTIF(DISTRICT!AG$9:AG$1000,\">=75\")","v":0}]
[null,"Nombre d’individus nécessitant un traitement dans des UMOs ayant réalisé une couverture efficace (total)",null,null,{"$f":"SUMIF(DISTRICT!I9:I1000,\">=65\",DISTRICT!H9:H1000)","v":0},{"$f":"SUMIF(DISTRICT!O9:O1000,\">=65\",DISTRICT!N9:N1000)","v":0},{"$f":"SUMIF(DISTRICT!Y9:Y1000,\">=75\",DISTRICT!X9:X1000)","v":0},{"$f":"SUMIF(DISTRICT!AI9:AI1000,\">=75\",DISTRICT!AH9:AH1000)","v":71971.87}]
[null,null,"EAPréS",null,null,null,{"$f":"SUMIF(DISTRICT!U9:U1000,\">=75\",DISTRICT!T9:T1000)","v":0}]
[null,null,"EAS",null,null,null,{"$f":"SUMIF(DISTRICT!W9:W1000,\">=75\",DISTRICT!V9:V1000)","v":24563},{"$f":"SUMIF(DISTRICT!AE9:AE1000,\">=75\",DISTRICT!AD9:AD1000)","v":89100.87}]
[null,null,"Adults",null,null,null,null,{"$f":"SUMIF(DISTRICT!AG9:AG1000,\">=75\",DISTRICT!AF9:AF1000)","v":0}]
[null,"Proportion d’UMOs nécessitant une CP and ayant réalisé une couverture efficace (total)",null,null,{"$f":"IF(E44<>0,E66/E44,0)","v":0},{"$f":"IF(F44<>0,F66/F44,0)","v":0},{"$f":"IF(G44<>0,G66/G44,0)","v":0},{"$f":"IF(H44<>0,H66/H44,0)","v":0.79545454545454541}]
[null,null,"EAPréS",null,null,null,{"$f":"IF(G45<>0,G67/G45,0)","v":0}]
[null,null,"EAS",null,null,null,{"$f":"IF(G46<>0,G68/G46,0)","v":0.10638297872340426},{"$f":"IF(H46<>0,H68/H46,0)","v":0.88636363636363635}]
[null,null,"Adults",null,null,null,null,{"$f":"IF(H47<>0,H69/H47,0)","v":0}]
[null,"Nombre d’UMOs où la CP a été stoppée (càd sous surveillance)",null,null,{"$f":"COUNTIF(COUNTRY_INFO!H$9:H$1000,\"=99\")","v":0},{"$f":"COUNTIF(COUNTRY_INFO!I$9:I$1000,\"=99\")","v":0}]
[null,"Nombre d’individus dans les UMOs ne nécessitant plus de CP (stoppée)",null,null,{"$f":"SUMIF(COUNTRY_INFO!H$9:H$1000,\"=99\",COUNTRY_INFO!D$9:D$1000)","v":0},{"$f":"SUMIF(COUNTRY_INFO!I$9:I$1000,\"=99\",COUNTRY_INFO!D$9:D$1000)","v":0}]
[null,"Nombre d’individus nécessitant une CP vivants dans des UMOs ciblées pour la CP",null,null,{"$f":"SUMIF(DISTRICT!H$9:H$1000,\">0\",DISTRICT!D$9:D$1000)","v":0},{"$f":"SUMIF(DISTRICT!N$9:N$1000,\">0\",DISTRICT!J$9:J$1000)","v":0},{"$f":"SUMIF(DISTRICT!X$9:X$1000,\">0\",DISTRICT!P$9:P$1000)","v":483207},{"$f":"SUMIF(DISTRICT!AH$9:AH$1000,\">0\",DISTRICT!Z$9:Z$1000)","v":192878.62000000005}]
[null,"Nombre d’individus nécessitant une CP vivant dans des UMOs non ciblées pour la CP",null,null,{"$f":"SUMIF(DISTRICT!H$9:H$1000,\"=0\",DISTRICT!D$9:D$1000)","v":361121},{"$f":"SUMIF(DISTRICT!N$9:N$1000,\"=0\",DISTRICT!J$9:J$1000)","v":721771},{"$f":"SUMIF(DISTRICT!X$9:X$1000,\"=0\",DISTRICT!P$9:P$1000)","v":0},{"$f":"SUMIF(DISTRICT!AH$9:AH$1000,\"=0\",DISTRICT!Z$9:Z$1000)","v":0}]
[null,null,null,null,{"$f":"E35-E52","v":361121},{"$f":"F35-F52","v":721771},354674,51871.750000000029]
[null,"Nombre d’UMOs nécessitant et recevant la CP",null,null,{"$f":"E31-E44","v":18},{"$f":"F31-F44","v":25},0,0]
[null,null,null,null,{"$f":"E27-E31-E29","v":33},11,4,{"$f":"H27-H31-H29","v":7}]
[]
[null,null,null,null,null,null,"Nécessitant et recevant une CP"]
[null,null,null,null,null,null,"Nécessitant mais ne recevant pas de CP"]
[null,null,null,null,null,null,"Ne nécessitant pas de CP"]
[null,null,null,null,null,null,"Statut inconnu"]
[]
[]
[]
[]
[]
[]
[]
[]
[]
[]
[]
[]
[]
[]
[]
[]
[]
[]
[]
[]
[]
[]
[]
[]
[]
[]
[]
[]
[]
[]
[]
[]
[]
[]
[null,"Cliquer ici pour accéder au portail des données de la CP"]

{"sheet":"DATA_POLICY","index":12,"n_rows":39,"n_cols":8,"rows_kept":39,"cut":false,"hidden":true,"merged":[[55,1,55,2],[0,1,0,5],[1,1,1,7],[3,3,3,5],[6,1,6,7],[8,1,12,7],[13,1,16,7],[17,1,21,7],[22,1,25,7],[26,2,36,7],[38,1,45,7]]}
[]
[null,"Formulaire de Rapport Commun v.3.1"]
[]
[null,"Pays",null,{"$f":"IF(INTRO!$E$34<>0,INTRO!$E$34,\" \")","v":"Gabon"},null,null,"Année",{"$f":"IF(INTRO!$E$36<>0,INTRO!$E$36,\" \")","v":2018}]
[]
[]
[null,"Déclaration de principe sur la communication de données par l’OMS"]
[]
[null,"Les données sont le fondement de toutes les mesures rationnelles de santé publique et les avantages de la communication de données, y compris pour la science et la santé publique, sont largement reconnus. L’OMS souhaite promouvoir autant que possible la communication de données sanitaires, y compris, mais pas uniquement, de données épidémiologiques et de surveillance."]
[]
[]
[]
[]
[null,{"$f":"\"À cet égard, et sans préjudice des instruments juridiquement contraignants régissant la communication et la publication d’informations, le Ministère de la santé de \" & D4 & \", en fournissant des données à l’OMS :\"","v":"À cet égard, et sans préjudice des instruments juridiquement contraignants régissant la communication et la publication d’informations, le Ministère de la santé de Gabon, en fournissant des données à l’OMS :"}]
[]
[]
[]
[null,"confirme que toutes les données à fournir à l’OMS, ont été collectées conformément à la législation nationale applicable, y compris aux lois de protection des données visant à préserver l’anonymat des personnes identifiables ;"]
[]
[]
[]
[]
[null,{"$f":"\"convient que l’OMS aura le droit, toujours sous réserve des mesures visant à garantir l’utilisation éthique et sécurisée des données et toujours sous réserve d’une reconnaissance appropriée de la part de \"&D4&\":\"","v":"convient que l’OMS aura le droit, toujours sous réserve des mesures visant à garantir l’utilisation éthique et sécurisée des données et toujours sous réserve d’une reconnaissance appropriée de la part de Gabon:"}]
[]
[]
[]
[null,null,"de publier les données, dépourvues de tout élément d’identification personnelle (ci-après dénommées « les données ») et de les mettre à la disposition de toute partie intéressée, sur demande (dans la mesure où elles n’ont pas, ou pas encore, été publiées par l’OMS), selon des modalités autorisant leur utilisation non commerciale et sans but lucratif à des fins de santé publique (pour autant que l’OMS garde la maîtrise de la publication des données) ;\nd’utiliser, de compiler, d’agréger, d’évaluer et d’analyser les données et de publier et de diffuser les résultats obtenus grâce à ces données en rapport avec des travaux de l’OMS et conformément aux politiques et pratiques de l’Organisation."]
[]
[]
[]
[]
[]
[]
[]
[]
[]
[]
[]
[null,{"$f":"CONCATENATE(\"Sauf lorsque des instruments juridiquement contraignants (RSI, Règlement de Nomenclature de l’OMS, de 1967, etc.) disposent que les données doivent être communiquées et publiées, le Ministère de la santé de \", D4,\" peut, pour certaines données, décider de ne pas appliquer (tout ou partie des) (les) dispositions qui précèdent,\" & \" en informant l’OMS par écrit à l’adresse suivante, à condition que cette notification précise clairement les données, \" & \"dont il s’agit et indique clairement lesquelles des dispositions qui précèdent ne seront pas appliquées, et pour quels motifs.\")","v":"Sauf lorsque des instruments juridiquement contraignants (RSI, Règlement de Nomenclature de l’OMS, de 1967, etc.) disposent que les données doivent être communiquées et publiées, le Ministère de la santé de Gabon peut, pour certaines données, décider de ne pas appliquer (tout ou partie des) (les) dispositions qui précèdent, en informant l’OMS par écrit à l’adresse suivante, à condition que cette notification précise clairement les données, dont il s’agit et indique clairement lesquelles des dispositions qui précèdent ne seront pas appliquées, et pour quels motifs."}]