{"text_format":"1","workbook":"xlsx","n_sheets":10,"sheets":["INTRO","COUNTRY_INFO","DEC","ALB_MBD","PZQ","IVM","IVM+","SUMMARY","SHIPMENT","DATA_POLICY"],"not_rendered":{"charts":0,"images":3,"macros":1,"external_links":0,"defined_names":10,"comments":9,"pivot_tables":0},"unopened":[],"bounds":{"document_bytes":16777216,"sheet_cells":100000,"rows_first":2000,"rows_last":500,"rows_between":2000,"halvings":0,"cell_chars":16384,"cell_head_chars":4096},"cells_cut":0,"cells_raw":0,"read":"whole","date_system":"1900"}

{"sheet":"INTRO","index":0,"n_rows":51,"n_cols":8,"rows_kept":51,"cut":false,"hidden":false,"merged":[[21,1,21,4],[46,1,46,4],[38,1,38,2],[40,1,40,2],[42,1,42,2],[44,1,44,2],[36,1,36,2],[22,2,23,4],[25,2,26,4],[27,1,27,4],[32,1,32,2],[29,1,29,4],[30,1,30,4],[28,2,28,4],[24,1,24,4],[34,1,34,2],[0,1,0,4],[2,1,2,4],[1,1,1,4],[5,1,5,4],[3,1,3,4],[7,2,7,4],[11,1,11,4],[4,1,4,4],[10,2,10,4],[20,2,20,4],[17,1,17,4],[13,1,13,4],[18,2,18,4],[8,2,8,4],[9,2,9,4],[19,1,19,4],[12,1,12,4],[16,1,16,4],[14,1,14,4],[15,1,15,4]]}
[]
[null,"Joint request for selected PC medicines v.4.1"]
[]
[null,"As part of global efforts to accelerate expansion of preventive chemotherapy (PC) for control and elimination of lymphatic filariasis, schistosomiasis and soil-transmitted helminthiases, the World Health Organization (WHO) facilitates the supply of albendazole 400 mg tablets (GSK) to national lymphatic filariasis elimination programmes and national soil-transmitted helminth control programmes; diethylcarbamazine citrate 100 mg tablets (Eisai) to national lymphatic filariasis elimination programmes; mebendazole 500 mg tablets (J&J) for national soil-transmitted helminth control programmes; and praziquantel 600 mg tablets (Merck KGaA)  for school-age children to national schistosomiasis control programmes. WHO also collaborates to supply ivermectin 3 mg tablets (Merck) for onchocerciasis and lymphatic filariasis donation programmes.  \nThis Excel-based tool is designed to assist countries in quantifying the number of tablets of relevant PC medicines required to reach the planned target population and districts for the year of request. Output of the tool is a joint request for PC medicines, which can be printed, signed and submitted to WHO to request these medicines."]
[]
[null,"Structure of the application (worksheets):"]
[]
[null,"INTRO","This worksheet includes guides on how to complete the joint request for selected PC medicines and information about the status of PC for endemic diseases in the country."]
[null,"COUNTRY_INFO","This worksheet includes information about administrative structure of the country, population by age group, status of endemicity for each disease, population requiring PC and planned interventions."]
[null,"DEC, ALB_MBD, PZQ and IVM","These worksheets include information about endemic districts targeted for treatment with specified PC medicines, treatment plan, and number of tablets required and requested. "]
[null,"SUMMARY","This worksheet includes summary of number of tablets requested, information about stock, and date for submission of requested medicines. Before generating the report (run macros) please select the medicine for which the report is needed. Follow the same rule to see the number of people to be treated for the specific disease. \nThis worksheet should be printed and submitted as a joint request for selected PC medicines (see the instruction for submission in the SUMMARY worksheet)."]
[]
[null,"Instruction for data entry"]
[]
[null,"Most of the cells in the above-mentioned worksheets include formula that are calculated automatically according to the treatment policy recommended by WHO for each disease.\nSee the link https://www.who.int/publications/i/item/9789241599993."]
[]
[null,"Please enter your data into the cells according to their colour code:"]
[]
[null,null,"White - cell is not protected. Please enter the value of the requested indicator."]
[]
[null,null,"Yellow - cell is protected and includes name of indicator. No data entry required."]
[]
[null,null,"Orange - cell is not protected and includes a drop-down menu. Please select the value from the drop-down list."]
[]
[]
[null,null,"Green - cell is not protected and includes formula. Please change the value only if your data are different from those that are calculated automatically."]
[]
[]
[null,null,"Blue - cell is protected and includes formula. No data entry required."]
[]
[null,"Country data"]
[]
[null,"COUNTRY",null,null,"Eswatini",null,"SZ","SWZ"]
[null,null,null,null,5]
[null,"Year for request of the medicine",null,null,2024]
[]
[null,"Is country endemic for lymphatic filariasis (LF)?",null,null,"Non-endemic"]
[]
[null,"Is country endemic for onchocerciasis (ONCHO)?",null,null,"Non-endemic"]
[]
[null,"Is country endemic for soil-transmitted helminthiases (STH)?",null,null,"Endemic"]
[]
[null,"Is country endemic for schistosomiasis (SCH)?",null,null,"Endemic"]
[]
[null,"How many administrative units in the country?",null,null,59]
[]
[null,"If demographical data at the second administrative level are not available by age group, please enter the proportion (%) of population by age group in the country. If data are available, please leave these cells blank."]
[null,"1-4 years age","Preschool-age children (PreSAC)",null,9.3899999999999997E-2]
[null,"5-14 years age","School-age children (SAC)",null,0.23280000000000001]
[null,"15 years +","Adults",null,0.64970000000000006]
[null,"15-49 years","Women of reproductive age (WRA)",null,0.25929999999999997]

{"sheet":"COUNTRY_INFO","index":1,"n_rows":68,"n_cols":47,"rows_kept":68,"cut":false,"hidden":false,"merged":[[3,0,3,2],[3,7,3,10],[3,21,3,24],[5,0,5,2],[3,26,3,29],[5,26,5,29],[5,3,5,6],[5,7,5,10],[5,11,5,20],[5,21,5,24],[6,3,7,3],[6,2,7,2],[6,1,7,1],[6,0,7,0],[6,21,7,21],[6,13,6,16],[6,11,7,11],[6,12,7,12],[6,7,7,7],[6,8,7,8],[6,9,7,9],[6,10,7,10],[6,6,7,6],[6,5,7,5],[6,4,7,4],[6,28,7,28],[6,29,7,29],[6,17,6,20],[6,25,7,25],[6,22,7,22],[6,23,7,23],[6,24,7,24],[6,26,7,26],[6,27,7,27]]}
["COUNTRY INFORMATION"]
["Administrative structure, population by age group, status of endemicity and planned interventions"]
[]
["TOTAL",null,null,{"$f":"SUBTOTAL(9,D$10:D$1010)","v":1248334},{"$f":"SUBTOTAL(9,E$10:E$1010)","v":117220},290612,811046,null,null,null,null,{"$f":"SUBTOTAL(9,L$10:L$1010)","v":0},0,7819,19383,21590,48792,64071,211782,591042,866895]
[]
["Country administrative structure",null,null,"Population",null,null,null,"Endemicity",null,null,null,"Population requiring PC",null,null,null,null,null,null,null,null,null,"Number of treatment rounds planned for the year",null,null,null,"Criteria to apply for \nIVM+DEC+ALB therapy","Epidemiological surveys planned for the year"]
["Country","Province/State","District","Total","PreSAC","SAC","Adults","LF","Oncho","STH","SCH","LF","ONCHO","STH",null,null,null,"SCH",null,null,null,"LF","Oncho","STH","SCH","LF","LF","Oncho","STH","SCH"]
[null,null,null,null,null,null,null,null,null,null,null,null,null,"PreSAC","SAC","WRA","TOTAL","PreSAC","SAC","Adults","TOTAL",null,null,null,null,null,null,null,null,null,null,null,null,"IU_ID","IU_NAME"]
[null,null,null,null,null,null,null,null,null,null,null,null,null,null,null,null,null,null,null,null,null,null,null,null,null,null,null,null,null,null,null,null,null,"x","x","x","x","x","x","x","x","x","x","x","x","x","x"]
[{"$f":"IF(INTRO!$E$33<>0,INTRO!$E$33, \" \")","v":"Eswatini"},"HHOHHO","Hhukwini",12736,{"$f":"IF(INTRO!$E$48=\"\",\"\",ROUND($D10*INTRO!$E$48,0))","v":1196},{"$f":"IF(INTRO!$E$49=\"\",\"\",ROUND($D10*INTRO!$E$49,0))","v":2965},{"$f":"IF(INTRO!$E$50=\"\",\"\",ROUND($D10*INTRO!$E$50,0))","v":8275},null,null,2,1,{"$f":"IF(INTRO!$E$37=\"Endemic\",IF($H10>0,IF($H10=4,\"Unknown\",IF($H10=99,\"Stopped\",$D10)),0),\"Not required\")","v":"Not required"},{"$f":"IF(INTRO!$E$39=\"Endemic\", IF($I10>0, IF($I10=4,\"Unknown\",IF($I10=99,\"Stopped\",$D10)), 0),\"Not required\")","v":"Not required"},{"$f":"IF(INTRO!$E$41=\"Endemic\", IF($J10>1, IF($J10=4, \"Unknown\", IF($J10=99, \"Surveillance\", E10)), 0),\"Not required\")","v":1196},{"$f":"IF(INTRO!$E$41=\"Endemic\", IF($J10>1, IF($J10=4, \"Unknown\", IF($J10=99, \"Surveillance\", F10)), 0),\"Not required\")","v":2965},{"$f":"IF(INTRO!$E$41=\"Endemic\", IF($J10>1, IF($J10=4, \"Unknown\", IF($J10=99, \"Surveillance\", ROUND(D10*INTRO!$E$51,0))), 0),\"Not required\")","v":3302},{"$f":"IF(INTRO!$E$41=\"Endemic\", IF($J10>1, IF($J10=4, \"Unknown\", IF($J10=99, \"Surveillance\", SUM($N10:$P10))), 0),\"Not required\")","v":7463},{"$f":"IF(INTRO!$E$43=\"Endemic\", IF($K10>1, IF($K10=4, \"Unknown\", IF($K10=99, \"Surveillance\", ROUND(E10*0.75,0))), 0),\"Not required\")","v":0},{"$f":"IF(INTRO!$E$43=\"Endemic\", IF($K10>1, IF($K10=4, \"Unknown\", IF($K10=99, \"Surveillance\", F10)), 0),\"Not required\")","v":0},{"$f":"IF(INTRO!$E$43=\"Endemic\", IF($K10>1, IF($K10=4, \"Unknown\", IF($K10=99, \"Surveillance\", G10)), 0),\"Not required\")","v":0},{"$f":"IF(INTRO!$E$43=\"Endemic\", IF($K10>1, IF($K10=4, \"Unknown\", IF($K10=99, \"Surveillance\", SUM($R10:$T10))), 0),\"Not required\")","v":0},null,null,1,0,null,null,null,null,null,null,null,null,45404,"Hhukwini",null,12626.337363799999]
[{"$f":"IF(INTRO!$E$33<>0,INTRO!$E$33, \" \")","v":"Eswatini"},"HHOHHO","Lobamba",34014,{"$f":"IF(INTRO!$E$48=\"\",\"\",ROUND($D11*INTRO!$E$48,0))","v":3194},{"$f":"IF(INTRO!$E$49=\"\",\"\",ROUND($D11*INTRO!$E$49,0))","v":7918},{"$f":"IF(INTRO!$E$50=\"\",\"\",ROUND($D11*INTRO!$E$50,0))","v":22099},null,null,1,1,{"$f":"IF(INTRO!$E$37=\"Endemic\",IF($H11>0,IF($H11=4,\"Unknown\",IF($H11=99,\"Stopped\",$D11)),0),\"Not required\")","v":"Not required"},{"$f":"IF(INTRO!$E$39=\"Endemic\", IF($I11>0, IF($I11=4,\"Unknown\",IF($I11=99,\"Stopped\",$D11)), 0),\"Not required\")","v":"Not required"},{"$f":"IF(INTRO!$E$41=\"Endemic\", IF($J11>1, IF($J11=4, \"Unknown\", IF($J11=99, \"Surveillance\", E11)), 0),\"Not required\")","v":0},{"$f":"IF(INTRO!$E$41=\"Endemic\", IF($J11>1, IF($J11=4, \"Unknown\", IF($J11=99, \"Surveillance\", F11)), 0),\"Not required\")","v":0},{"$f":"IF(INTRO!$E$41=\"Endemic\", IF($J11>1, IF($J11=4, \"Unknown\", IF($J11=99, \"Surveillance\", ROUND(D11*INTRO!$E$51,0))), 0),\"Not required\")","v":0},{"$f":"IF(INTRO!$E$41=\"Endemic\", IF($J11>1, IF($J11=4, \"Unknown\", IF($J11=99, \"Surveillance\", SUM($N11:$P11))), 0),\"Not required\")","v":0},{"$f":"IF(INTRO!$E$43=\"Endemic\", IF($K11>1, IF($K11=4, \"Unknown\", IF($K11=99, \"Surveillance\", ROUND(E11*0.75,0))), 0),\"Not required\")","v":0},{"$f":"IF(INTRO!$E$43=\"Endemic\", IF($K11>1, IF($K11=4, \"Unknown\", IF($K11=99, \"Surveillance\", F11)), 0),\"Not required\")","v":0},{"$f":"IF(INTRO!$E$43=\"Endemic\", IF($K11>1, IF($K11=4, \"Unknown\", IF($K11=99, \"Surveillance\", G11)), 0),\"Not required\")","v":0},{"$f":"IF(INTRO!$E$43=\"Endemic\", IF($K11>1, IF($K11=4, \"Unknown\", IF($K11=99, \"Surveillance\", SUM($R11:$T11))), 0),\"Not required\")","v":0},null,null,0,0,null,null,null,null,null,null,null,null,45405,"Lobamba",null,33720.887904629999]
[{"$f":"IF(INTRO!$E$33<>0,INTRO!$E$33, \" \")","v":"Eswatini"},"HHOHHO","Madlangempisi",24951,{"$f":"IF(INTRO!$E$48=\"\",\"\",ROUND($D12*INTRO!$E$48,0))","v":2343},{"$f":"IF(INTRO!$E$49=\"\",\"\",ROUND($D12*INTRO!$E$49,0))","v":5809},{"$f":"IF(INTRO!$E$50=\"\",\"\",ROUND($D12*INTRO!$E$50,0))","v":16211},null,null,1,2,{"$f":"IF(INTRO!$E$37=\"Endemic\",IF($H12>0,IF($H12=4,\"Unknown\",IF($H12=99,\"Stopped\",$D12)),0),\"Not required\")","v":"Not required"},{"$f":"IF(INTRO!$E$39=\"Endemic\", IF($I12>0, IF($I12=4,\"Unknown\",IF($I12=99,\"Stopped\",$D12)), 0),\"Not required\")","v":"Not required"},{"$f":"IF(INTRO!$E$41=\"Endemic\", IF($J12>1, IF($J12=4, \"Unknown\", IF($J12=99, \"Surveillance\", E12)), 0),\"Not required\")","v":0},{"$f":"IF(INTRO!$E$41=\"Endemic\", IF($J12>1, IF($J12=4, \"Unknown\", IF($J12=99, \"Surveillance\", F12)), 0),\"Not required\")","v":0},{"$f":"IF(INTRO!$E$41=\"Endemic\", IF($J12>1, IF($J12=4, \"Unknown\", IF($J12=99, \"Surveillance\", ROUND(D12*INTRO!$E$51,0))), 0),\"Not required\")","v":0},{"$f":"IF(INTRO!$E$41=\"Endemic\", IF($J12>1, IF($J12=4, \"Unknown\", IF($J12=99, \"Surveillance\", SUM($N12:$P12))), 0),\"Not required\")","v":0},{"$f":"IF(INTRO!$E$43=\"Endemic\", IF($K12>1, IF($K12=4, \"Unknown\", IF($K12=99, \"Surveillance\", ROUND(E12*0.75,0))), 0),\"Not required\")","v":1757},{"$f":"IF(INTRO!$E$43=\"Endemic\", IF($K12>1, IF($K12=4, \"Unknown\", IF($K12=99, \"Surveillance\", F12)), 0),\"Not required\")","v":5809},{"$f":"IF(INTRO!$E$43=\"Endemic\", IF($K12>1, IF($K12=4, \"Unknown\", IF($K12=99, \"Surveillance\", G12)), 0),\"Not required\")","v":16211},{"$f":"IF(INTRO!$E$43=\"Endemic\", IF($K12>1, IF($K12=4, \"Unknown\", IF($K12=99, \"Surveillance\", SUM($R12:$T12))), 0),\"Not required\")","v":23777},null,null,0,1,null,null,null,null,null,null,null,null,45406,"Mandlangempisi",null,24735.58643653]
[{"$f":"IF(INTRO!$E$33<>0,INTRO!$E$33, \" \")","v":"Eswatini"},"HHOHHO","Maphalaleni",20580,{"$f":"IF(INTRO!$E$48=\"\",\"\",ROUND($D13*INTRO!$E$48,0))","v":1932},{"$f":"IF(INTRO!$E$49=\"\",\"\",ROUND($D13*INTRO!$E$49,0))","v":4791},{"$f":"IF(INTRO!$E$50=\"\",\"\",ROUND($D13*INTRO!$E$50,0))","v":13371},null,null,1,3,{"$f":"IF(INTRO!$E$37=\"Endemic\",IF($H13>0,IF($H13=4,\"Unknown\",IF($H13=99,\"Stopped\",$D13)),0),\"Not required\")","v":"Not required"},{"$f":"IF(INTRO!$E$39=\"Endemic\", IF($I13>0, IF($I13=4,\"Unknown\",IF($I13=99,\"Stopped\",$D13)), 0),\"Not required\")","v":"Not required"},{"$f":"IF(INTRO!$E$41=\"Endemic\", IF($J13>1, IF($J13=4, \"Unknown\", IF($J13=99, \"Surveillance\", E13)), 0),\"Not required\")","v":0},{"$f":"IF(INTRO!$E$41=\"Endemic\", IF($J13>1, IF($J13=4, \"Unknown\", IF($J13=99, \"Surveillance\", F13)), 0),\"Not required\")","v":0},{"$f":"IF(INTRO!$E$41=\"Endemic\", IF($J13>1, IF($J13=4, \"Unknown\", IF($J13=99, \"Surveillance\", ROUND(D13*INTRO!$E$51,0))), 0),\"Not required\")","v":0},{"$f":"IF(INTRO!$E$41=\"Endemic\", IF($J13>1, IF($J13=4, \"Unknown\", IF($J13=99, \"Surveillance\", SUM($N13:$P13))), 0),\"Not required\")","v":0},{"$f":"IF(INTRO!$E$43=\"Endemic\", IF($K13>1, IF($K13=4, \"Unknown\", IF($K13=99, \"Surveillance\", ROUND(E13*0.75,0))), 0),\"Not required\")","v":1449},{"$f":"IF(INTRO!$E$43=\"Endemic\", IF($K13>1, IF($K13=4, \"Unknown\", IF($K13=99, \"Surveillance\", F13)), 0),\"Not required\")","v":4791},{"$f":"IF(INTRO!$E$43=\"Endemic\", IF($K13>1, IF($K13=4, \"Unknown\", IF($K13=99, \"Surveillance\", G13)), 0),\"Not required\")","v":13371},{"$f":"IF(INTRO!$E$43=\"Endemic\", IF($K13>1, IF($K13=4, \"Unknown\", IF($K13=99, \"Surveillance\", SUM($R13:$T13))), 0),\"Not required\")","v":19611},null,null,0,1,null,null,null,null,null,null,null,null,45412,"Maphalaleni",null,20402.039792039999]
[{"$f":"IF(INTRO!$E$33<>0,INTRO!$E$33, \" \")","v":"Eswatini"},"HHOHHO","Mayiwane",18067,{"$f":"IF(INTRO!$E$48=\"\",\"\",ROUND($D14*INTRO!$E$48,0))","v":1696},{"$f":"IF(INTRO!$E$49=\"\",\"\",ROUND($D14*INTRO!$E$49,0))","v":4206},{"$f":"IF(INTRO!$E$50=\"\",\"\",ROUND($D14*INTRO!$E$50,0))","v":11738},null,null,1,2,{"$f":"IF(INTRO!$E$37=\"Endemic\",IF($H14>0,IF($H14=4,\"Unknown\",IF($H14=99,\"Stopped\",$D14)),0),\"Not required\")","v":"Not required"},{"$f":"IF(INTRO!$E$39=\"Endemic\", IF($I14>0, IF($I14=4,\"Unknown\",IF($I14=99,\"Stopped\",$D14)), 0),\"Not required\")","v":"Not required"},{"$f":"IF(INTRO!$E$41=\"Endemic\", IF($J14>1, IF($J14=4, \"Unknown\", IF($J14=99, \"Surveillance\", E14)), 0),\"Not required\")","v":0},{"$f":"IF(INTRO!$E$41=\"Endemic\", IF($J14>1, IF($J14=4, \"Unknown\", IF($J14=99, \"Surveillance\", F14)), 0),\"Not required\")","v":0},{"$f":"IF(INTRO!$E$41=\"Endemic\", IF($J14>1, IF($J14=4, \"Unknown\", IF($J14=99, \"Surveillance\", ROUND(D14*INTRO!$E$51,0))), 0),\"Not required\")","v":0},{"$f":"IF(INTRO!$E$41=\"Endemic\", IF($J14>1, IF($J14=4, \"Unknown\", IF($J14=99, \"Surveillance\", SUM($N14:$P14))), 0),\"Not required\")","v":0},{"$f":"IF(INTRO!$E$43=\"Endemic\", IF($K14>1, IF($K14=4, \"Unknown\", IF($K14=99, \"Surveillance\", ROUND(E14*0.75,0))), 0),\"Not required\")","v":1272},{"$f":"IF(INTRO!$E$43=\"Endemic\", IF($K14>1, IF($K14=4, \"Unknown\", IF($K14=99, \"Surveillance\", F14)), 0),\"Not required\")","v":4206},{"$f":"IF(INTRO!$E$43=\"Endemic\", IF($K14>1, IF($K14=4, \"Unknown\", IF($K14=99, \"Surveillance\", G14)), 0),\"Not required\")","v":11738},{"$f":"IF(INTRO!$E$43=\"Endemic\", IF($K14>1, IF($K14=4, \"Unknown\", IF($K14=99, \"Surveillance\", SUM($R14:$T14))), 0),\"Not required\")","v":17216},null,null,0,1,null,null,null,null,null,null,null,null,45407,"Mayiwane",null,17911.44885162]
[{"$f":"IF(INTRO!$E$33<>0,INTRO!$E$33, \" \")","v":"Eswatini"},"HHOHHO","Mbabane East",38094,{"$f":"IF(INTRO!$E$48=\"\",\"\",ROUND($D15*INTRO!$E$48,0))","v":3577},{"$f":"IF(INTRO!$E$49=\"\",\"\",ROUND($D15*INTRO!$E$49,0))","v":8868},{"$f":"IF(INTRO!$E$50=\"\",\"\",ROUND($D15*INTRO!$E$50,0))","v":24750},null,null,1,2,{"$f":"IF(INTRO!$E$37=\"Endemic\",IF($H15>0,IF($H15=4,\"Unknown\",IF($H15=99,\"Stopped\",$D15)),0),\"Not required\")","v":"Not required"},{"$f":"IF(INTRO!$E$39=\"Endemic\", IF($I15>0, IF($I15=4,\"Unknown\",IF($I15=99,\"Stopped\",$D15)), 0),\"Not required\")","v":"Not required"},{"$f":"IF(INTRO!$E$41=\"Endemic\", IF($J15>1, IF($J15=4, \"Unknown\", IF($J15=99, \"Surveillance\", E15)), 0),\"Not required\")","v":0},{"$f":"IF(INTRO!$E$41=\"Endemic\", IF($J15>1, IF($J15=4, \"Unknown\", IF($J15=99, \"Surveillance\", F15)), 0),\"Not required\")","v":0},{"$f":"IF(INTRO!$E$41=\"Endemic\", IF($J15>1, IF($J15=4, \"Unknown\", IF($J15=99, \"Surveillance\", ROUND(D15*INTRO!$E$51,0))), 0),\"Not required\")","v":0},{"$f":"IF(INTRO!$E$41=\"Endemic\", IF($J15>1, IF($J15=4, \"Unknown\", IF($J15=99, \"Surveillance\", SUM($N15:$P15))), 0),\"Not required\")","v":0},{"$f":"IF(INTRO!$E$43=\"Endemic\", IF($K15>1, IF($K15=4, \"Unknown\", IF($K15=99, \"Surveillance\", ROUND(E15*0.75,0))), 0),\"Not required\")","v":2683},{"$f":"IF(INTRO!$E$43=\"Endemic\", IF($K15>1, IF($K15=4, \"Unknown\", IF($K15=99, \"Surveillance\", F15)), 0),\"Not required\")","v":8868},{"$f":"IF(INTRO!$E$43=\"Endemic\", IF($K15>1, IF($K15=4, \"Unknown\", IF($K15=99, \"Surveillance\", G15)), 0),\"Not required\")","v":24750},{"$f":"IF(INTRO!$E$43=\"Endemic\", IF($K15>1, IF($K15=4, \"Unknown\", IF($K15=99, \"Surveillance\", SUM($R15:$T15))), 0),\"Not required\")","v":36301},null,null,0,1,null,null,null,null,null,null,null,null,45408,"Mbabane East",null,37765.803412290006]
[{"$f":"IF(INTRO!$E$33<>0,INTRO!$E$33, \" \")","v":"Eswatini"},"HHOHHO","Mbabane West",27623,{"$f":"IF(INTRO!$E$48=\"\",\"\",ROUND($D16*INTRO!$E$48,0))","v":2594},{"$f":"IF(INTRO!$E$49=\"\",\"\",ROUND($D16*INTRO!$E$49,0))","v":6431},{"$f":"IF(INTRO!$E$50=\"\",\"\",ROUND($D16*INTRO!$E$50,0))","v":17947},null,null,1,1,{"$f":"IF(INTRO!$E$37=\"Endemic\",IF($H16>0,IF($H16=4,\"Unknown\",IF($H16=99,\"Stopped\",$D16)),0),\"Not required\")","v":"Not required"},{"$f":"IF(INTRO!$E$39=\"Endemic\", IF($I16>0, IF($I16=4,\"Unknown\",IF($I16=99,\"Stopped\",$D16)), 0),\"Not required\")","v":"Not required"},{"$f":"IF(INTRO!$E$41=\"Endemic\", IF($J16>1, IF($J16=4, \"Unknown\", IF($J16=99, \"Surveillance\", E16)), 0),\"Not required\")","v":0},{"$f":"IF(INTRO!$E$41=\"Endemic\", IF($J16>1, IF($J16=4, \"Unknown\", IF($J16=99, \"Surveillance\", F16)), 0),\"Not required\")","v":0},{"$f":"IF(INTRO!$E$41=\"Endemic\", IF($J16>1, IF($J16=4, \"Unknown\", IF($J16=99, \"Surveillance\", ROUND(D16*INTRO!$E$51,0))), 0),\"Not required\")","v":0},{"$f":"IF(INTRO!$E$41=\"Endemic\", IF($J16>1, IF($J16=4, \"Unknown\", IF($J16=99, \"Surveillance\", SUM($N16:$P16))), 0),\"Not required\")","v":0},{"$f":"IF(INTRO!$E$43=\"Endemic\", IF($K16>1, IF($K16=4, \"Unknown\", IF($K16=99, \"Surveillance\", ROUND(E16*0.75,0))), 0),\"Not required\")","v":0},{"$f":"IF(INTRO!$E$43=\"Endemic\", IF($K16>1, IF($K16=4, \"Unknown\", IF($K16=99, \"Surveillance\", F16)), 0),\"Not required\")","v":0},{"$f":"IF(INTRO!$E$43=\"Endemic\", IF($K16>1, IF($K16=4, \"Unknown\", IF($K16=99, \"Surveillance\", G16)), 0),\"Not required\")","v":0},{"$f":"IF(INTRO!$E$43=\"Endemic\", IF($K16>1, IF($K16=4, \"Unknown\", IF($K16=99, \"Surveillance\", SUM($R16:$T16))), 0),\"Not required\")","v":0},null,null,0,0,null,null,null,null,null,null,null,null,45409,"Mbabane West",null,27384.261568500002]
[{"$f":"IF(INTRO!$E$33<>0,INTRO!$E$33, \" \")","v":"Eswatini"},"HHOHHO","Mhlangatane",26903,{"$f":"IF(INTRO!$E$48=\"\",\"\",ROUND($D17*INTRO!$E$48,0))","v":2526},{"$f":"IF(INTRO!$E$49=\"\",\"\",ROUND($D17*INTRO!$E$49,0))","v":6263},{"$f":"IF(INTRO!$E$50=\"\",\"\",ROUND($D17*INTRO!$E$50,0))","v":17479},null,null,1,2,{"$f":"IF(INTRO!$E$37=\"Endemic\",IF($H17>0,IF($H17=4,\"Unknown\",IF($H17=99,\"Stopped\",$D17)),0),\"Not required\")","v":"Not required"},{"$f":"IF(INTRO!$E$39=\"Endemic\", IF($I17>0, IF($I17=4,\"Unknown\",IF($I17=99,\"Stopped\",$D17)), 0),\"Not required\")","v":"Not required"},{"$f":"IF(INTRO!$E$41=\"Endemic\", IF($J17>1, IF($J17=4, \"Unknown\", IF($J17=99, \"Surveillance\", E17)), 0),\"Not required\")","v":0},{"$f":"IF(INTRO!$E$41=\"Endemic\", IF($J17>1, IF($J17=4, \"Unknown\", IF($J17=99, \"Surveillance\", F17)), 0),\"Not required\")","v":0},{"$f":"IF(INTRO!$E$41=\"Endemic\", IF($J17>1, IF($J17=4, \"Unknown\", IF($J17=99, \"Surveillance\", ROUND(D17*INTRO!$E$51,0))), 0),\"Not required\")","v":0},{"$f":"IF(INTRO!$E$41=\"Endemic\", IF($J17>1, IF($J17=4, \"Unknown\", IF($J17=99, \"Surveillance\", SUM($N17:$P17))), 0),\"Not required\")","v":0},{"$f":"IF(INTRO!$E$43=\"Endemic\", IF($K17>1, IF($K17=4, \"Unknown\", IF($K17=99, \"Surveillance\", ROUND(E17*0.75,0))), 0),\"Not required\")","v":1895},{"$f":"IF(INTRO!$E$43=\"Endemic\", IF($K17>1, IF($K17=4, \"Unknown\", IF($K17=99, \"Surveillance\", F17)), 0),\"Not required\")","v":6263},{"$f":"IF(INTRO!$E$43=\"Endemic\", IF($K17>1, IF($K17=4, \"Unknown\", IF($K17=99, \"Surveillance\", G17)), 0),\"Not required\")","v":17479},{"$f":"IF(INTRO!$E$43=\"Endemic\", IF($K17>1, IF($K17=4, \"Unknown\", IF($K17=99, \"Surveillance\", SUM($R17:$T17))), 0),\"Not required\")","v":25637},null,null,0,1,null,null,null,null,null,null,null,null,45410,"Mhlangatane",null,26671.35285951]
[{"$f":"IF(INTRO!$E$33<>0,INTRO!$E$33, \" \")","v":"Eswatini"},"HHOHHO","Motshane",29349,{"$f":"IF(INTRO!$E$48=\"\",\"\",ROUND($D18*INTRO!$E$48,0))","v":2756},{"$f":"IF(INTRO!$E$49=\"\",\"\",ROUND($D18*INTRO!$E$49,0))","v":6832},{"$f":"IF(INTRO!$E$50=\"\",\"\",ROUND($D18*INTRO!$E$50,0))","v":19068},null,null,2,2,{"$f":"IF(INTRO!$E$37=\"Endemic\",IF($H18>0,IF($H18=4,\"Unknown\",IF($H18=99,\"Stopped\",$D18)),0),\"Not required\")","v":"Not required"},{"$f":"IF(INTRO!$E$39=\"Endemic\", IF($I18>0, IF($I18=4,\"Unknown\",IF($I18=99,\"Stopped\",$D18)), 0),\"Not required\")","v":"Not required"},{"$f":"IF(INTRO!$E$41=\"Endemic\", IF($J18>1, IF($J18=4, \"Unknown\", IF($J18=99, \"Surveillance\", E18)), 0),\"Not required\")","v":2756},{"$f":"IF(INTRO!$E$41=\"Endemic\", IF($J18>1, IF($J18=4, \"Unknown\", IF($J18=99, \"Surveillance\", F18)), 0),\"Not required\")","v":6832},{"$f":"IF(INTRO!$E$41=\"Endemic\", IF($J18>1, IF($J18=4, \"Unknown\", IF($J18=99, \"Surveillance\", ROUND(D18*INTRO!$E$51,0))), 0),\"Not required\")","v":7610},{"$f":"IF(INTRO!$E$41=\"Endemic\", IF($J18>1, IF($J18=4, \"Unknown\", IF($J18=99, \"Surveillance\", SUM($N18:$P18))), 0),\"Not required\")","v":17198},{"$f":"IF(INTRO!$E$43=\"Endemic\", IF($K18>1, IF($K18=4, \"Unknown\", IF($K18=99, \"Surveillance\", ROUND(E18*0.75,0))), 0),\"Not required\")","v":2067},{"$f":"IF(INTRO!$E$43=\"Endemic\", IF($K18>1, IF($K18=4, \"Unknown\", IF($K18=99, \"Surveillance\", F18)), 0),\"Not required\")","v":6832},{"$f":"IF(INTRO!$E$43=\"Endemic\", IF($K18>1, IF($K18=4, \"Unknown\", IF($K18=99, \"Surveillance\", G18)), 0),\"Not required\")","v":19068},{"$f":"IF(INTRO!$E$43=\"Endemic\", IF($K18>1, IF($K18=4, \"Unknown\", IF($K18=99, \"Surveillance\", SUM($R18:$T18))), 0),\"Not required\")","v":27967},null,null,1,1,null,null,null,null,null,null,null,null,45411,"Motjane",null,29095.650429280002]
[{"$f":"IF(INTRO!$E$33<>0,INTRO!$E$33, \" \")","v":"Eswatini"},"HHOHHO","Ndzingeni",20055,{"$f":"IF(INTRO!$E$48=\"\",\"\",ROUND($D19*INTRO!$E$48,0))","v":1883},{"$f":"IF(INTRO!$E$49=\"\",\"\",ROUND($D19*INTRO!$E$49,0))","v":4669},{"$f":"IF(INTRO!$E$50=\"\",\"\",ROUND($D19*INTRO!$E$50,0))","v":13030},null,null,1,1,{"$f":"IF(INTRO!$E$37=\"Endemic\",IF($H19>0,IF($H19=4,\"Unknown\",IF($H19=99,\"Stopped\",$D19)),0),\"Not required\")","v":"Not required"},{"$f":"IF(INTRO!$E$39=\"Endemic\", IF($I19>0, IF($I19=4,\"Unknown\",IF($I19=99,\"Stopped\",$D19)), 0),\"Not required\")","v":"Not required"},{"$f":"IF(INTRO!$E$41=\"Endemic\", IF($J19>1, IF($J19=4, \"Unknown\", IF($J19=99, \"Surveillance\", E19)), 0),\"Not required\")","v":0},{"$f":"IF(INTRO!$E$41=\"Endemic\", IF($J19>1, IF($J19=4, \"Unknown\", IF($J19=99, \"Surveillance\", F19)), 0),\"Not required\")","v":0},{"$f":"IF(INTRO!$E$41=\"Endemic\", IF($J19>1, IF($J19=4, \"Unknown\", IF($J19=99, \"Surveillance\", ROUND(D19*INTRO!$E$51,0))), 0),\"Not required\")","v":0},{"$f":"IF(INTRO!$E$41=\"Endemic\", IF($J19>1, IF($J19=4, \"Unknown\", IF($J19=99, \"Surveillance\", SUM($N19:$P19))), 0),\"Not required\")","v":0},{"$f":"IF(INTRO!$E$43=\"Endemic\", IF($K19>1, IF($K19=4, \"Unknown\", IF($K19=99, \"Surveillance\", ROUND(E19*0.75,0))), 0),\"Not required\")","v":0},{"$f":"IF(INTRO!$E$43=\"Endemic\", IF($K19>1, IF($K19=4, \"Unknown\", IF($K19=99, \"Surveillance\", F19)), 0),\"Not required\")","v":0},{"$f":"IF(INTRO!$E$43=\"Endemic\", IF($K19>1, IF($K19=4, \"Unknown\", IF($K19=99, \"Surveillance\", G19)), 0),\"Not required\")","v":0},{"$f":"IF(INTRO!$E$43=\"Endemic\", IF($K19>1, IF($K19=4, \"Unknown\", IF($K19=99, \"Surveillance\", SUM($R19:$T19))), 0),\"Not required\")","v":0},null,null,0,0,null,null,null,null,null,null,null,null,45413,"Ndzingeni",null,19881.891806940002]
[{"$f":"IF(INTRO!$E$33<>0,INTRO!$E$33, \" \")","v":"Eswatini"},"HHOHHO","Nkhaba",21641,{"$f":"IF(INTRO!$E$48=\"\",\"\",ROUND($D20*INTRO!$E$48,0))","v":2032},{"$f":"IF(INTRO!$E$49=\"\",\"\",ROUND($D20*INTRO!$E$49,0))","v":5038},{"$f":"IF(INTRO!$E$50=\"\",\"\",ROUND($D20*INTRO!$E$50,0))","v":14060},null,null,1,1,{"$f":"IF(INTRO!$E$37=\"Endemic\",IF($H20>0,IF($H20=4,\"Unknown\",IF($H20=99,\"Stopped\",$D20)),0),\"Not required\")","v":"Not required"},{"$f":"IF(INTRO!$E$39=\"Endemic\", IF($I20>0, IF($I20=4,\"Unknown\",IF($I20=99,\"Stopped\",$D20)), 0),\"Not required\")","v":"Not required"},{"$f":"IF(INTRO!$E$41=\"Endemic\", IF($J20>1, IF($J20=4, \"Unknown\", IF($J20=99, \"Surveillance\", E20)), 0),\"Not required\")","v":0},{"$f":"IF(INTRO!$E$41=\"Endemic\", IF($J20>1, IF($J20=4, \"Unknown\", IF($J20=99, \"Surveillance\", F20)), 0),\"Not required\")","v":0},{"$f":"IF(INTRO!$E$41=\"Endemic\", IF($J20>1, IF($J20=4, \"Unknown\", IF($J20=99, \"Surveillance\", ROUND(D20*INTRO!$E$51,0))), 0),\"Not required\")","v":0},{"$f":"IF(INTRO!$E$41=\"Endemic\", IF($J20>1, IF($J20=4, \"Unknown\", IF($J20=99, \"Surveillance\", SUM($N20:$P20))), 0),\"Not required\")","v":0},{"$f":"IF(INTRO!$E$43=\"Endemic\", IF($K20>1, IF($K20=4, \"Unknown\", IF($K20=99, \"Surveillance\", ROUND(E20*0.75,0))), 0),\"Not required\")","v":0},{"$f":"IF(INTRO!$E$43=\"Endemic\", IF($K20>1, IF($K20=4, \"Unknown\", IF($K20=99, \"Surveillance\", F20)), 0),\"Not required\")","v":0},{"$f":"IF(INTRO!$E$43=\"Endemic\", IF($K20>1, IF($K20=4, \"Unknown\", IF($K20=99, \"Surveillance\", G20)), 0),\"Not required\")","v":0},{"$f":"IF(INTRO!$E$43=\"Endemic\", IF($K20>1, IF($K20=4, \"Unknown\", IF($K20=99, \"Surveillance\", SUM($R20:$T20))), 0),\"Not required\")","v":0},null,null,0,0,null,null,null,null,null,null,null,null,45414,"Nkhaba",null,21454.574538360004]
[{"$f":"IF(INTRO!$E$33<>0,INTRO!$E$33, \" \")","v":"Eswatini"},"HHOHHO","Ntfonjeni",23491,{"$f":"IF(INTRO!$E$48=\"\",\"\",ROUND($D21*INTRO!$E$48,0))","v":2206},{"$f":"IF(INTRO!$E$49=\"\",\"\",ROUND($D21*INTRO!$E$49,0))","v":5469},{"$f":"IF(INTRO!$E$50=\"\",\"\",ROUND($D21*INTRO!$E$50,0))","v":15262},null,null,1,1,{"$f":"IF(INTRO!$E$37=\"Endemic\",IF($H21>0,IF($H21=4,\"Unknown\",IF($H21=99,\"Stopped\",$D21)),0),\"Not required\")","v":"Not required"},{"$f":"IF(INTRO!$E$39=\"Endemic\", IF($I21>0, IF($I21=4,\"Unknown\",IF($I21=99,\"Stopped\",$D21)), 0),\"Not required\")","v":"Not required"},{"$f":"IF(INTRO!$E$41=\"Endemic\", IF($J21>1, IF($J21=4, \"Unknown\", IF($J21=99, \"Surveillance\", E21)), 0),\"Not required\")","v":0},{"$f":"IF(INTRO!$E$41=\"Endemic\", IF($J21>1, IF($J21=4, \"Unknown\", IF($J21=99, \"Surveillance\", F21)), 0),\"Not required\")","v":0},{"$f":"IF(INTRO!$E$41=\"Endemic\", IF($J21>1, IF($J21=4, \"Unknown\", IF($J21=99, \"Surveillance\", ROUND(D21*INTRO!$E$51,0))), 0),\"Not required\")","v":0},{"$f":"IF(INTRO!$E$41=\"Endemic\", IF($J21>1, IF($J21=4, \"Unknown\", IF($J21=99, \"Surveillance\", SUM($N21:$P21))), 0),\"Not required\")","v":0},{"$f":"IF(INTRO!$E$43=\"Endemic\", IF($K21>1, IF($K21=4, \"Unknown\", IF($K21=99, \"Surveillance\", ROUND(E21*0.75,0))), 0),\"Not required\")","v":0},{"$f":"IF(INTRO!$E$43=\"Endemic\", IF($K21>1, IF($K21=4, \"Unknown\", IF($K21=99, \"Surveillance\", F21)), 0),\"Not required\")","v":0},{"$f":"IF(INTRO!$E$43=\"Endemic\", IF($K21>1, IF($K21=4, \"Unknown\", IF($K21=99, \"Surveillance\", G21)), 0),\"Not required\")","v":0},{"$f":"IF(INTRO!$E$43=\"Endemic\", IF($K21>1, IF($K21=4, \"Unknown\", IF($K21=99, \"Surveillance\", SUM($R21:$T21))), 0),\"Not required\")","v":0},null,null,0,0,null,null,null,null,null,null,null,null,45415,"Ntfonjeni",null,23288.35116034]
[{"$f":"IF(INTRO!$E$33<>0,INTRO!$E$33, \" \")","v":"Eswatini"},"HHOHHO","Pigg's Peak",20832,{"$f":"IF(INTRO!$E$48=\"\",\"\",ROUND($D22*INTRO!$E$48,0))","v":1956},{"$f":"IF(INTRO!$E$49=\"\",\"\",ROUND($D22*INTRO!$E$49,0))","v":4850},{"$f":"IF(INTRO!$E$50=\"\",\"\",ROUND($D22*INTRO!$E$50,0))","v":13535},null,null,1,2,{"$f":"IF(INTRO!$E$37=\"Endemic\",IF($H22>0,IF($H22=4,\"Unknown\",IF($H22=99,\"Stopped\",$D22)),0),\"Not required\")","v":"Not required"},{"$f":"IF(INTRO!$E$39=\"Endemic\", IF($I22>0, IF($I22=4,\"Unknown\",IF($I22=99,\"Stopped\",$D22)), 0),\"Not required\")","v":"Not required"},{"$f":"IF(INTRO!$E$41=\"Endemic\", IF($J22>1, IF($J22=4, \"Unknown\", IF($J22=99, \"Surveillance\", E22)), 0),\"Not required\")","v":0},{"$f":"IF(INTRO!$E$41=\"Endemic\", IF($J22>1, IF($J22=4, \"Unknown\", IF($J22=99, \"Surveillance\", F22)), 0),\"Not required\")","v":0},{"$f":"IF(INTRO!$E$41=\"Endemic\", IF($J22>1, IF($J22=4, \"Unknown\", IF($J22=99, \"Surveillance\", ROUND(D22*INTRO!$E$51,0))), 0),\"Not required\")","v":0},{"$f":"IF(INTRO!$E$41=\"Endemic\", IF($J22>1, IF($J22=4, \"Unknown\", IF($J22=99, \"Surveillance\", SUM($N22:$P22))), 0),\"Not required\")","v":0},{"$f":"IF(INTRO!$E$43=\"Endemic\", IF($K22>1, IF($K22=4, \"Unknown\", IF($K22=99, \"Surveillance\", ROUND(E22*0.75,0))), 0),\"Not required\")","v":1467},{"$f":"IF(INTRO!$E$43=\"Endemic\", IF($K22>1, IF($K22=4, \"Unknown\", IF($K22=99, \"Surveillance\", F22)), 0),\"Not required\")","v":4850},{"$f":"IF(INTRO!$E$43=\"Endemic\", IF($K22>1, IF($K22=4, \"Unknown\", IF($K22=99, \"Surveillance\", G22)), 0),\"Not required\")","v":13535},{"$f":"IF(INTRO!$E$43=\"Endemic\", IF($K22>1, IF($K22=4, \"Unknown\", IF($K22=99, \"Surveillance\", SUM($R22:$T22))), 0),\"Not required\")","v":19852},null,null,0,1,null,null,null,null,null,null,null,null,45416,"Pigg's Peak",null,20651.914804490003]
[{"$f":"IF(INTRO!$E$33<>0,INTRO!$E$33, \" \")","v":"Eswatini"},"HHOHHO","Siphocosini",27731,{"$f":"IF(INTRO!$E$48=\"\",\"\",ROUND($D23*INTRO!$E$48,0))","v":2604},{"$f":"IF(INTRO!$E$49=\"\",\"\",ROUND($D23*INTRO!$E$49,0))","v":6456},{"$f":"IF(INTRO!$E$50=\"\",\"\",ROUND($D23*INTRO!$E$50,0))","v":18017},null,null,2,2,{"$f":"IF(INTRO!$E$37=\"Endemic\",IF($H23>0,IF($H23=4,\"Unknown\",IF($H23=99,\"Stopped\",$D23)),0),\"Not required\")","v":"Not required"},{"$f":"IF(INTRO!$E$39=\"Endemic\", IF($I23>0, IF($I23=4,\"Unknown\",IF($I23=99,\"Stopped\",$D23)), 0),\"Not required\")","v":"Not required"},{"$f":"IF(INTRO!$E$41=\"Endemic\", IF($J23>1, IF($J23=4, \"Unknown\", IF($J23=99, \"Surveillance\", E23)), 0),\"Not required\")","v":2604},{"$f":"IF(INTRO!$E$41=\"Endemic\", IF($J23>1, IF($J23=4, \"Unknown\", IF($J23=99, \"Surveillance\", F23)), 0),\"Not required\")","v":6456},{"$f":"IF(INTRO!$E$41=\"Endemic\", IF($J23>1, IF($J23=4, \"Unknown\", IF($J23=99, \"Surveillance\", ROUND(D23*INTRO!$E$51,0))), 0),\"Not required\")","v":7191},{"$f":"IF(INTRO!$E$41=\"Endemic\", IF($J23>1, IF($J23=4, \"Unknown\", IF($J23=99, \"Surveillance\", SUM($N23:$P23))), 0),\"Not required\")","v":16251},{"$f":"IF(INTRO!$E$43=\"Endemic\", IF($K23>1, IF($K23=4, \"Unknown\", IF($K23=99, \"Surveillance\", ROUND(E23*0.75,0))), 0),\"Not required\")","v":1953},{"$f":"IF(INTRO!$E$43=\"Endemic\", IF($K23>1, IF($K23=4, \"Unknown\", IF($K23=99, \"Surveillance\", F23)), 0),\"Not required\")","v":6456},{"$f":"IF(INTRO!$E$43=\"Endemic\", IF($K23>1, IF($K23=4, \"Unknown\", IF($K23=99, \"Surveillance\", G23)), 0),\"Not required\")","v":18017},{"$f":"IF(INTRO!$E$43=\"Endemic\", IF($K23>1, IF($K23=4, \"Unknown\", IF($K23=99, \"Surveillance\", SUM($R23:$T23))), 0),\"Not required\")","v":26426},null,null,1,1,null,null,null,null,null,null,null,null,45460,"Siphocosin",null,27491.350859550002]
[{"$f":"IF(INTRO!$E$33<>0,INTRO!$E$33, \" \")","v":"Eswatini"},"HHOHHO","Timphisini",13447,{"$f":"IF(INTRO!$E$48=\"\",\"\",ROUND($D24*INTRO!$E$48,0))","v":1263},{"$f":"IF(INTRO!$E$49=\"\",\"\",ROUND($D24*INTRO!$E$49,0))","v":3130},{"$f":"IF(INTRO!$E$50=\"\",\"\",ROUND($D24*INTRO!$E$50,0))","v":8737},null,null,2,2,{"$f":"IF(INTRO!$E$37=\"Endemic\",IF($H24>0,IF($H24=4,\"Unknown\",IF($H24=99,\"Stopped\",$D24)),0),\"Not required\")","v":"Not required"},{"$f":"IF(INTRO!$E$39=\"Endemic\", IF($I24>0, IF($I24=4,\"Unknown\",IF($I24=99,\"Stopped\",$D24)), 0),\"Not required\")","v":"Not required"},{"$f":"IF(INTRO!$E$41=\"Endemic\", IF($J24>1, IF($J24=4, \"Unknown\", IF($J24=99, \"Surveillance\", E24)), 0),\"Not required\")","v":1263},{"$f":"IF(INTRO!$E$41=\"Endemic\", IF($J24>1, IF($J24=4, \"Unknown\", IF($J24=99, \"Surveillance\", F24)), 0),\"Not required\")","v":3130},{"$f":"IF(INTRO!$E$41=\"Endemic\", IF($J24>1, IF($J24=4, \"Unknown\", IF($J24=99, \"Surveillance\", ROUND(D24*INTRO!$E$51,0))), 0),\"Not required\")","v":3487},{"$f":"IF(INTRO!$E$41=\"Endemic\", IF($J24>1, IF($J24=4, \"Unknown\", IF($J24=99, \"Surveillance\", SUM($N24:$P24))), 0),\"Not required\")","v":7880},{"$f":"IF(INTRO!$E$43=\"Endemic\", IF($K24>1, IF($K24=4, \"Unknown\", IF($K24=99, \"Surveillance\", ROUND(E24*0.75,0))), 0),\"Not required\")","v":947},{"$f":"IF(INTRO!$E$43=\"Endemic\", IF($K24>1, IF($K24=4, \"Unknown\", IF($K24=99, \"Surveillance\", F24)), 0),\"Not required\")","v":3130},{"$f":"IF(INTRO!$E$43=\"Endemic\", IF($K24>1, IF($K24=4, \"Unknown\", IF($K24=99, \"Surveillance\", G24)), 0),\"Not required\")","v":8737},{"$f":"IF(INTRO!$E$43=\"Endemic\", IF($K24>1, IF($K24=4, \"Unknown\", IF($K24=99, \"Surveillance\", SUM($R24:$T24))), 0),\"Not required\")","v":12814},null,null,1,1,null,null,null,null,null,null,null,null,45417,"Timphisini",null,13331.08688871]
[{"$f":"IF(INTRO!$E$33<>0,INTRO!$E$33, \" \")","v":"Eswatini"},"LUBOMBO","Dvokodvweni",33056,{"$f":"IF(INTRO!$E$48=\"\",\"\",ROUND($D25*INTRO!$E$48,0))","v":3104},{"$f":"IF(INTRO!$E$49=\"\",\"\",ROUND($D25*INTRO!$E$49,0))","v":7695},{"$f":"IF(INTRO!$E$50=\"\",\"\",ROUND($D25*INTRO!$E$50,0))","v":21476},null,null,1,1,{"$f":"IF(INTRO!$E$37=\"Endemic\",IF($H25>0,IF($H25=4,\"Unknown\",IF($H25=99,\"Stopped\",$D25)),0),\"Not required\")","v":"Not required"},{"$f":"IF(INTRO!$E$39=\"Endemic\", IF($I25>0, IF($I25=4,\"Unknown\",IF($I25=99,\"Stopped\",$D25)), 0),\"Not required\")","v":"Not required"},{"$f":"IF(INTRO!$E$41=\"Endemic\", IF($J25>1, IF($J25=4, \"Unknown\", IF($J25=99, \"Surveillance\", E25)), 0),\"Not required\")","v":0},{"$f":"IF(INTRO!$E$41=\"Endemic\", IF($J25>1, IF($J25=4, \"Unknown\", IF($J25=99, \"Surveillance\", F25)), 0),\"Not required\")","v":0},{"$f":"IF(INTRO!$E$41=\"Endemic\", IF($J25>1, IF($J25=4, \"Unknown\", IF($J25=99, \"Surveillance\", ROUND(D25*INTRO!$E$51,0))), 0),\"Not required\")","v":0},{"$f":"IF(INTRO!$E$41=\"Endemic\", IF($J25>1, IF($J25=4, \"Unknown\", IF($J25=99, \"Surveillance\", SUM($N25:$P25))), 0),\"Not required\")","v":0},{"$f":"IF(INTRO!$E$43=\"Endemic\", IF($K25>1, IF($K25=4, \"Unknown\", IF($K25=99, \"Surveillance\", ROUND(E25*0.75,0))), 0),\"Not required\")","v":0},{"$f":"IF(INTRO!$E$43=\"Endemic\", IF($K25>1, IF($K25=4, \"Unknown\", IF($K25=99, \"Surveillance\", F25)), 0),\"Not required\")","v":0},{"$f":"IF(INTRO!$E$43=\"Endemic\", IF($K25>1, IF($K25=4, \"Unknown\", IF($K25=99, \"Surveillance\", G25)), 0),\"Not required\")","v":0},{"$f":"IF(INTRO!$E$43=\"Endemic\", IF($K25>1, IF($K25=4, \"Unknown\", IF($K25=99, \"Surveillance\", SUM($R25:$T25))), 0),\"Not required\")","v":0},null,null,0,0,null,null,null,null,null,null,null,null,45418,"Dvokodvweni",null,32771.362857320004]
[{"$f":"IF(INTRO!$E$33<>0,INTRO!$E$33, \" \")","v":"Eswatini"},"LUBOMBO","Gigal",11933,{"$f":"IF(INTRO!$E$48=\"\",\"\",ROUND($D26*INTRO!$E$48,0))","v":1121},{"$f":"IF(INTRO!$E$49=\"\",\"\",ROUND($D26*INTRO!$E$49,0))","v":2778},{"$f":"IF(INTRO!$E$50=\"\",\"\",ROUND($D26*INTRO!$E$50,0))","v":7753},null,null,1,2,{"$f":"IF(INTRO!$E$37=\"Endemic\",IF($H26>0,IF($H26=4,\"Unknown\",IF($H26=99,\"Stopped\",$D26)),0),\"Not required\")","v":"Not required"},{"$f":"IF(INTRO!$E$39=\"Endemic\", IF($I26>0, IF($I26=4,\"Unknown\",IF($I26=99,\"Stopped\",$D26)), 0),\"Not required\")","v":"Not required"},{"$f":"IF(INTRO!$E$41=\"Endemic\", IF($J26>1, IF($J26=4, \"Unknown\", IF($J26=99, \"Surveillance\", E26)), 0),\"Not required\")","v":0},{"$f":"IF(INTRO!$E$41=\"Endemic\", IF($J26>1, IF($J26=4, \"Unknown\", IF($J26=99, \"Surveillance\", F26)), 0),\"Not required\")","v":0},{"$f":"IF(INTRO!$E$41=\"Endemic\", IF($J26>1, IF($J26=4, \"Unknown\", IF($J26=99, \"Surveillance\", ROUND(D26*INTRO!$E$51,0))), 0),\"Not required\")","v":0},{"$f":"IF(INTRO!$E$41=\"Endemic\", IF($J26>1, IF($J26=4, \"Unknown\", IF($J26=99, \"Surveillance\", SUM($N26:$P26))), 0),\"Not required\")","v":0},{"$f":"IF(INTRO!$E$43=\"Endemic\", IF($K26>1, IF($K26=4, \"Unknown\", IF($K26=99, \"Surveillance\", ROUND(E26*0.75,0))), 0),\"Not required\")","v":841},{"$f":"IF(INTRO!$E$43=\"Endemic\", IF($K26>1, IF($K26=4, \"Unknown\", IF($K26=99, \"Surveillance\", F26)), 0),\"Not required\")","v":2778},{"$f":"IF(INTRO!$E$43=\"Endemic\", IF($K26>1, IF($K26=4, \"Unknown\", IF($K26=99, \"Surveillance\", G26)), 0),\"Not required\")","v":7753},{"$f":"IF(INTRO!$E$43=\"Endemic\", IF($K26>1, IF($K26=4, \"Unknown\", IF($K26=99, \"Surveillance\", SUM($R26:$T26))), 0),\"Not required\")","v":11372},null,null,0,1,null,null,null,null,null,null,null,null,45419,"Hlane",null,11829.797017990002]
[{"$f":"IF(INTRO!$E$33<>0,INTRO!$E$33, \" \")","v":"Eswatini"},"LUBOMBO","Lomahasha",23442,{"$f":"IF(INTRO!$E$48=\"\",\"\",ROUND($D27*INTRO!$E$48,0))","v":2201},{"$f":"IF(INTRO!$E$49=\"\",\"\",ROUND($D27*INTRO!$E$49,0))","v":5457},{"$f":"IF(INTRO!$E$50=\"\",\"\",ROUND($D27*INTRO!$E$50,0))","v":15230},null,null,1,2,{"$f":"IF(INTRO!$E$37=\"Endemic\",IF($H27>0,IF($H27=4,\"Unknown\",IF($H27=99,\"Stopped\",$D27)),0),\"Not required\")","v":"Not required"},{"$f":"IF(INTRO!$E$39=\"Endemic\", IF($I27>0, IF($I27=4,\"Unknown\",IF($I27=99,\"Stopped\",$D27)), 0),\"Not required\")","v":"Not required"},{"$f":"IF(INTRO!$E$41=\"Endemic\", IF($J27>1, IF($J27=4, \"Unknown\", IF($J27=99, \"Surveillance\", E27)), 0),\"Not required\")","v":0},{"$f":"IF(INTRO!$E$41=\"Endemic\", IF($J27>1, IF($J27=4, \"Unknown\", IF($J27=99, \"Surveillance\", F27)), 0),\"Not required\")","v":0},{"$f":"IF(INTRO!$E$41=\"Endemic\", IF($J27>1, IF($J27=4, \"Unknown\", IF($J27=99, \"Surveillance\", ROUND(D27*INTRO!$E$51,0))), 0),\"Not required\")","v":0},{"$f":"IF(INTRO!$E$41=\"Endemic\", IF($J27>1, IF($J27=4, \"Unknown\", IF($J27=99, \"Surveillance\", SUM($N27:$P27))), 0),\"Not required\")","v":0},{"$f":"IF(INTRO!$E$43=\"Endemic\", IF($K27>1, IF($K27=4, \"Unknown\", IF($K27=99, \"Surveillance\", ROUND(E27*0.75,0))), 0),\"Not required\")","v":1651},{"$f":"IF(INTRO!$E$43=\"Endemic\", IF($K27>1, IF($K27=4, \"Unknown\", IF($K27=99, \"Surveillance\", F27)), 0),\"Not required\")","v":5457},{"$f":"IF(INTRO!$E$43=\"Endemic\", IF($K27>1, IF($K27=4, \"Unknown\", IF($K27=99, \"Surveillance\", G27)), 0),\"Not required\")","v":15230},{"$f":"IF(INTRO!$E$43=\"Endemic\", IF($K27>1, IF($K27=4, \"Unknown\", IF($K27=99, \"Surveillance\", SUM($R27:$T27))), 0),\"Not required\")","v":22338},null,null,0,1,null,null,null,null,null,null,null,null,45420,"Lomahasha",null,23239.396055860001]
[{"$f":"IF(INTRO!$E$33<>0,INTRO!$E$33, \" \")","v":"Eswatini"},"LUBOMBO","Lubuli",15014,{"$f":"IF(INTRO!$E$48=\"\",\"\",ROUND($D28*INTRO!$E$48,0))","v":1410},{"$f":"IF(INTRO!$E$49=\"\",\"\",ROUND($D28*INTRO!$E$49,0))","v":3495},{"$f":"IF(INTRO!$E$50=\"\",\"\",ROUND($D28*INTRO!$E$50,0))","v":9755},null,null,1,1,{"$f":"IF(INTRO!$E$37=\"Endemic\",IF($H28>0,IF($H28=4,\"Unknown\",IF($H28=99,\"Stopped\",$D28)),0),\"Not required\")","v":"Not required"},{"$f":"IF(INTRO!$E$39=\"Endemic\", IF($I28>0, IF($I28=4,\"Unknown\",IF($I28=99,\"Stopped\",$D28)), 0),\"Not required\")","v":"Not required"},{"$f":"IF(INTRO!$E$41=\"Endemic\", IF($J28>1, IF($J28=4, \"Unknown\", IF($J28=99, \"Surveillance\", E28)), 0),\"Not required\")","v":0},{"$f":"IF(INTRO!$E$41=\"Endemic\", IF($J28>1, IF($J28=4, \"Unknown\", IF($J28=99, \"Surveillance\", F28)), 0),\"Not required\")","v":0},{"$f":"IF(INTRO!$E$41=\"Endemic\", IF($J28>1, IF($J28=4, \"Unknown\", IF($J28=99, \"Surveillance\", ROUND(D28*INTRO!$E$51,0))), 0),\"Not required\")","v":0},{"$f":"IF(INTRO!$E$41=\"Endemic\", IF($J28>1, IF($J28=4, \"Unknown\", IF($J28=99, \"Surveillance\", SUM($N28:$P28))), 0),\"Not required\")","v":0},{"$f":"IF(INTRO!$E$43=\"Endemic\", IF($K28>1, IF($K28=4, \"Unknown\", IF($K28=99, \"Surveillance\", ROUND(E28*0.75,0))), 0),\"Not required\")","v":0},{"$f":"IF(INTRO!$E$43=\"Endemic\", IF($K28>1, IF($K28=4, \"Unknown\", IF($K28=99, \"Surveillance\", F28)), 0),\"Not required\")","v":0},{"$f":"IF(INTRO!$E$43=\"Endemic\", IF($K28>1, IF($K28=4, \"Unknown\", IF($K28=99, \"Surveillance\", G28)), 0),\"Not required\")","v":0},{"$f":"IF(INTRO!$E$43=\"Endemic\", IF($K28>1, IF($K28=4, \"Unknown\", IF($K28=99, \"Surveillance\", SUM($R28:$T28))), 0),\"Not required\")","v":0},null,null,0,0,null,null,null,null,null,null,null,null,45421,"Lubuli",null,14884.391557940002]
[{"$f":"IF(INTRO!$E$33<>0,INTRO!$E$33, \" \")","v":"Eswatini"},"LUBOMBO","Lugongolweni",28983,{"$f":"IF(INTRO!$E$48=\"\",\"\",ROUND($D29*INTRO!$E$48,0))","v":2722},{"$f":"IF(INTRO!$E$49=\"\",\"\",ROUND($D29*INTRO!$E$49,0))","v":6747},{"$f":"IF(INTRO!$E$50=\"\",\"\",ROUND($D29*INTRO!$E$50,0))","v":18830},null,null,1,2,{"$f":"IF(INTRO!$E$37=\"Endemic\",IF($H29>0,IF($H29=4,\"Unknown\",IF($H29=99,\"Stopped\",$D29)),0),\"Not required\")","v":"Not required"},{"$f":"IF(INTRO!$E$39=\"Endemic\", IF($I29>0, IF($I29=4,\"Unknown\",IF($I29=99,\"Stopped\",$D29)), 0),\"Not required\")","v":"Not required"},{"$f":"IF(INTRO!$E$41=\"Endemic\", IF($J29>1, IF($J29=4, \"Unknown\", IF($J29=99, \"Surveillance\", E29)), 0),\"Not required\")","v":0},{"$f":"IF(INTRO!$E$41=\"Endemic\", IF($J29>1, IF($J29=4, \"Unknown\", IF($J29=99, \"Surveillance\", F29)), 0),\"Not required\")","v":0},{"$f":"IF(INTRO!$E$41=\"Endemic\", IF($J29>1, IF($J29=4, \"Unknown\", IF($J29=99, \"Surveillance\", ROUND(D29*INTRO!$E$51,0))), 0),\"Not required\")","v":0},{"$f":"IF(INTRO!$E$41=\"Endemic\", IF($J29>1, IF($J29=4, \"Unknown\", IF($J29=99, \"Surveillance\", SUM($N29:$P29))), 0),\"Not required\")","v":0},{"$f":"IF(INTRO!$E$43=\"Endemic\", IF($K29>1, IF($K29=4, \"Unknown\", IF($K29=99, \"Surveillance\", ROUND(E29*0.75,0))), 0),\"Not required\")","v":2042},{"$f":"IF(INTRO!$E$43=\"Endemic\", IF($K29>1, IF($K29=4, \"Unknown\", IF($K29=99, \"Surveillance\", F29)), 0),\"Not required\")","v":6747},{"$f":"IF(INTRO!$E$43=\"Endemic\", IF($K29>1, IF($K29=4, \"Unknown\", IF($K29=99, \"Surveillance\", G29)), 0),\"Not required\")","v":18830},{"$f":"IF(INTRO!$E$43=\"Endemic\", IF($K29>1, IF($K29=4, \"Unknown\", IF($K29=99, \"Surveillance\", SUM($R29:$T29))), 0),\"Not required\")","v":27619},null,null,0,1,null,null,null,null,null,null,null,null,45422,"Lugongolweni",null,28732.566737720001]
[{"$f":"IF(INTRO!$E$33<>0,INTRO!$E$33, \" \")","v":"Eswatini"},"LUBOMBO","Matsanjeni North",16446,{"$f":"IF(INTRO!$E$48=\"\",\"\",ROUND($D30*INTRO!$E$48,0))","v":1544},{"$f":"IF(INTRO!$E$49=\"\",\"\",ROUND($D30*INTRO!$E$49,0))","v":3829},{"$f":"IF(INTRO!$E$50=\"\",\"\",ROUND($D30*INTRO!$E$50,0))","v":10685},null,null,1,2,{"$f":"IF(INTRO!$E$37=\"Endemic\",IF($H30>0,IF($H30=4,\"Unknown\",IF($H30=99,\"Stopped\",$D30)),0),\"Not required\")","v":"Not required"},{"$f":"IF(INTRO!$E$39=\"Endemic\", IF($I30>0, IF($I30=4,\"Unknown\",IF($I30=99,\"Stopped\",$D30)), 0),\"Not required\")","v":"Not required"},{"$f":"IF(INTRO!$E$41=\"Endemic\", IF($J30>1, IF($J30=4, \"Unknown\", IF($J30=99, \"Surveillance\", E30)), 0),\"Not required\")","v":0},{"$f":"IF(INTRO!$E$41=\"Endemic\", IF($J30>1, IF($J30=4, \"Unknown\", IF($J30=99, \"Surveillance\", F30)), 0),\"Not required\")","v":0},{"$f":"IF(INTRO!$E$41=\"Endemic\", IF($J30>1, IF($J30=4, \"Unknown\", IF($J30=99, \"Surveillance\", ROUND(D30*INTRO!$E$51,0))), 0),\"Not required\")","v":0},{"$f":"IF(INTRO!$E$41=\"Endemic\", IF($J30>1, IF($J30=4, \"Unknown\", IF($J30=99, \"Surveillance\", SUM($N30:$P30))), 0),\"Not required\")","v":0},{"$f":"IF(INTRO!$E$43=\"Endemic\", IF($K30>1, IF($K30=4, \"Unknown\", IF($K30=99, \"Surveillance\", ROUND(E30*0.75,0))), 0),\"Not required\")","v":1158},{"$f":"IF(INTRO!$E$43=\"Endemic\", IF($K30>1, IF($K30=4, \"Unknown\", IF($K30=99, \"Surveillance\", F30)), 0),\"Not required\")","v":3829},{"$f":"IF(INTRO!$E$43=\"Endemic\", IF($K30>1, IF($K30=4, \"Unknown\", IF($K30=99, \"Surveillance\", G30)), 0),\"Not required\")","v":10685},{"$f":"IF(INTRO!$E$43=\"Endemic\", IF($K30>1, IF($K30=4, \"Unknown\", IF($K30=99, \"Surveillance\", SUM($R30:$T30))), 0),\"Not required\")","v":15672},null,null,0,1,null,null,null,null,null,null,null,null,45423,"Matsanjeni North",null,16304.08958786]
[{"$f":"IF(INTRO!$E$33<>0,INTRO!$E$33, \" \")","v":"Eswatini"},"LUBOMBO","Mhlume",17465,{"$f":"IF(INTRO!$E$48=\"\",\"\",ROUND($D31*INTRO!$E$48,0))","v":1640},{"$f":"IF(INTRO!$E$49=\"\",\"\",ROUND($D31*INTRO!$E$49,0))","v":4066},{"$f":"IF(INTRO!$E$50=\"\",\"\",ROUND($D31*INTRO!$E$50,0))","v":11347},null,null,1,2,{"$f":"IF(INTRO!$E$37=\"Endemic\",IF($H31>0,IF($H31=4,\"Unknown\",IF($H31=99,\"Stopped\",$D31)),0),\"Not required\")","v":"Not required"},{"$f":"IF(INTRO!$E$39=\"Endemic\", IF($I31>0, IF($I31=4,\"Unknown\",IF($I31=99,\"Stopped\",$D31)), 0),\"Not required\")","v":"Not required"},{"$f":"IF(INTRO!$E$41=\"Endemic\", IF($J31>1, IF($J31=4, \"Unknown\", IF($J31=99, \"Surveillance\", E31)), 0),\"Not required\")","v":0},{"$f":"IF(INTRO!$E$41=\"Endemic\", IF($J31>1, IF($J31=4, \"Unknown\", IF($J31=99, \"Surveillance\", F31)), 0),\"Not required\")","v":0},{"$f":"IF(INTRO!$E$41=\"Endemic\", IF($J31>1, IF($J31=4, \"Unknown\", IF($J31=99, \"Surveillance\", ROUND(D31*INTRO!$E$51,0))), 0),\"Not required\")","v":0},{"$f":"IF(INTRO!$E$41=\"Endemic\", IF($J31>1, IF($J31=4, \"Unknown\", IF($J31=99, \"Surveillance\", SUM($N31:$P31))), 0),\"Not required\")","v":0},{"$f":"IF(INTRO!$E$43=\"Endemic\", IF($K31>1, IF($K31=4, \"Unknown\", IF($K31=99, \"Surveillance\", ROUND(E31*0.75,0))), 0),\"Not required\")","v":1230},{"$f":"IF(INTRO!$E$43=\"Endemic\", IF($K31>1, IF($K31=4, \"Unknown\", IF($K31=99, \"Surveillance\", F31)), 0),\"Not required\")","v":4066},{"$f":"IF(INTRO!$E$43=\"Endemic\", IF($K31>1, IF($K31=4, \"Unknown\", IF($K31=99, \"Surveillance\", G31)), 0),\"Not required\")","v":11347},{"$f":"IF(INTRO!$E$43=\"Endemic\", IF($K31>1, IF($K31=4, \"Unknown\", IF($K31=99, \"Surveillance\", SUM($R31:$T31))), 0),\"Not required\")","v":16643},null,null,0,1,null,null,null,null,null,null,null,null,45424,"Mhlume",null,17314.808515770001]
[{"$f":"IF(INTRO!$E$33<>0,INTRO!$E$33, \" \")","v":"Eswatini"},"LUBOMBO","Mpolonjeni",14900,{"$f":"IF(INTRO!$E$48=\"\",\"\",ROUND($D32*INTRO!$E$48,0))","v":1399},{"$f":"IF(INTRO!$E$49=\"\",\"\",ROUND($D32*INTRO!$E$49,0))","v":3469},{"$f":"IF(INTRO!$E$50=\"\",\"\",ROUND($D32*INTRO!$E$50,0))","v":9681},null,null,1,2,{"$f":"IF(INTRO!$E$37=\"Endemic\",IF($H32>0,IF($H32=4,\"Unknown\",IF($H32=99,\"Stopped\",$D32)),0),\"Not required\")","v":"Not required"},{"$f":"IF(INTRO!$E$39=\"Endemic\", IF($I32>0, IF($I32=4,\"Unknown\",IF($I32=99,\"Stopped\",$D32)), 0),\"Not required\")","v":"Not required"},{"$f":"IF(INTRO!$E$41=\"Endemic\", IF($J32>1, IF($J32=4, \"Unknown\", IF($J32=99, \"Surveillance\", E32)), 0),\"Not required\")","v":0},{"$f":"IF(INTRO!$E$41=\"Endemic\", IF($J32>1, IF($J32=4, \"Unknown\", IF($J32=99, \"Surveillance\", F32)), 0),\"Not required\")","v":0},{"$f":"IF(INTRO!$E$41=\"Endemic\", IF($J32>1, IF($J32=4, \"Unknown\", IF($J32=99, \"Surveillance\", ROUND(D32*INTRO!$E$51,0))), 0),\"Not required\")","v":0},{"$f":"IF(INTRO!$E$41=\"Endemic\", IF($J32>1, IF($J32=4, \"Unknown\", IF($J32=99, \"Surveillance\", SUM($N32:$P32))), 0),\"Not required\")","v":0},{"$f":"IF(INTRO!$E$43=\"Endemic\", IF($K32>1, IF($K32=4, \"Unknown\", IF($K32=99, \"Surveillance\", ROUND(E32*0.75,0))), 0),\"Not required\")","v":1049},{"$f":"IF(INTRO!$E$43=\"Endemic\", IF($K32>1, IF($K32=4, \"Unknown\", IF($K32=99, \"Surveillance\", F32)), 0),\"Not required\")","v":3469},{"$f":"IF(INTRO!$E$43=\"Endemic\", IF($K32>1, IF($K32=4, \"Unknown\", IF($K32=99, \"Surveillance\", G32)), 0),\"Not required\")","v":9681},{"$f":"IF(INTRO!$E$43=\"Endemic\", IF($K32>1, IF($K32=4, \"Unknown\", IF($K32=99, \"Surveillance\", SUM($R32:$T32))), 0),\"Not required\")","v":14199},null,null,0,1,null,null,null,null,null,null,null,null,45425,"Mpolonjeni",null,14771.182878830001]
[{"$f":"IF(INTRO!$E$33<>0,INTRO!$E$33, \" \")","v":"Eswatini"},"LUBOMBO","Nkilongo",15619,{"$f":"IF(INTRO!$E$48=\"\",\"\",ROUND($D33*INTRO!$E$48,0))","v":1467},{"$f":"IF(INTRO!$E$49=\"\",\"\",ROUND($D33*INTRO!$E$49,0))","v":3636},{"$f":"IF(INTRO!$E$50=\"\",\"\",ROUND($D33*INTRO!$E$50,0))","v":10148},null,null,1,2,{"$f":"IF(INTRO!$E$37=\"Endemic\",IF($H33>0,IF($H33=4,\"Unknown\",IF($H33=99,\"Stopped\",$D33)),0),\"Not required\")","v":"Not required"},{"$f":"IF(INTRO!$E$39=\"Endemic\", IF($I33>0, IF($I33=4,\"Unknown\",IF($I33=99,\"Stopped\",$D33)), 0),\"Not required\")","v":"Not required"},{"$f":"IF(INTRO!$E$41=\"Endemic\", IF($J33>1, IF($J33=4, \"Unknown\", IF($J33=99, \"Surveillance\", E33)), 0),\"Not required\")","v":0},{"$f":"IF(INTRO!$E$41=\"Endemic\", IF($J33>1, IF($J33=4, \"Unknown\", IF($J33=99, \"Surveillance\", F33)), 0),\"Not required\")","v":0},{"$f":"IF(INTRO!$E$41=\"Endemic\", IF($J33>1, IF($J33=4, \"Unknown\", IF($J33=99, \"Surveillance\", ROUND(D33*INTRO!$E$51,0))), 0),\"Not required\")","v":0},{"$f":"IF(INTRO!$E$41=\"Endemic\", IF($J33>1, IF($J33=4, \"Unknown\", IF($J33=99, \"Surveillance\", SUM($N33:$P33))), 0),\"Not required\")","v":0},{"$f":"IF(INTRO!$E$43=\"Endemic\", IF($K33>1, IF($K33=4, \"Unknown\", IF($K33=99, \"Surveillance\", ROUND(E33*0.75,0))), 0),\"Not required\")","v":1100},{"$f":"IF(INTRO!$E$43=\"Endemic\", IF($K33>1, IF($K33=4, \"Unknown\", IF($K33=99, \"Surveillance\", F33)), 0),\"Not required\")","v":3636},{"$f":"IF(INTRO!$E$43=\"Endemic\", IF($K33>1, IF($K33=4, \"Unknown\", IF($K33=99, \"Surveillance\", G33)), 0),\"Not required\")","v":10148},{"$f":"IF(INTRO!$E$43=\"Endemic\", IF($K33>1, IF($K33=4, \"Unknown\", IF($K33=99, \"Surveillance\", SUM($R33:$T33))), 0),\"Not required\")","v":14884},null,null,0,1,null,null,null,null,null,null,null,null,45426,"Nkilongo",null,15484.091587820001]
[{"$f":"IF(INTRO!$E$33<>0,INTRO!$E$33, \" \")","v":"Eswatini"},"LUBOMBO","Siphofaneni",34426,{"$f":"IF(INTRO!$E$48=\"\",\"\",ROUND($D34*INTRO!$E$48,0))","v":3233},{"$f":"IF(INTRO!$E$49=\"\",\"\",ROUND($D34*INTRO!$E$49,0))","v":8014},{"$f":"IF(INTRO!$E$50=\"\",\"\",ROUND($D34*INTRO!$E$50,0))","v":22367},null,null,1,2,{"$f":"IF(INTRO!$E$37=\"Endemic\",IF($H34>0,IF($H34=4,\"Unknown\",IF($H34=99,\"Stopped\",$D34)),0),\"Not required\")","v":"Not required"},{"$f":"IF(INTRO!$E$39=\"Endemic\", IF($I34>0, IF($I34=4,\"Unknown\",IF($I34=99,\"Stopped\",$D34)), 0),\"Not required\")","v":"Not required"},{"$f":"IF(INTRO!$E$41=\"Endemic\", IF($J34>1, IF($J34=4, \"Unknown\", IF($J34=99, \"Surveillance\", E34)), 0),\"Not required\")","v":0},{"$f":"IF(INTRO!$E$41=\"Endemic\", IF($J34>1, IF($J34=4, \"Unknown\", IF($J34=99, \"Surveillance\", F34)), 0),\"Not required\")","v":0},{"$f":"IF(INTRO!$E$41=\"Endemic\", IF($J34>1, IF($J34=4, \"Unknown\", IF($J34=99, \"Surveillance\", ROUND(D34*INTRO!$E$51,0))), 0),\"Not required\")","v":0},{"$f":"IF(INTRO!$E$41=\"Endemic\", IF($J34>1, IF($J34=4, \"Unknown\", IF($J34=99, \"Surveillance\", SUM($N34:$P34))), 0),\"Not required\")","v":0},{"$f":"IF(INTRO!$E$43=\"Endemic\", IF($K34>1, IF($K34=4, \"Unknown\", IF($K34=99, \"Surveillance\", ROUND(E34*0.75,0))), 0),\"Not required\")","v":2425},{"$f":"IF(INTRO!$E$43=\"Endemic\", IF($K34>1, IF($K34=4, \"Unknown\", IF($K34=99, \"Surveillance\", F34)), 0),\"Not required\")","v":8014},{"$f":"IF(INTRO!$E$43=\"Endemic\", IF($K34>1, IF($K34=4, \"Unknown\", IF($K34=99, \"Surveillance\", G34)), 0),\"Not required\")","v":22367},{"$f":"IF(INTRO!$E$43=\"Endemic\", IF($K34>1, IF($K34=4, \"Unknown\", IF($K34=99, \"Surveillance\", SUM($R34:$T34))), 0),\"Not required\")","v":32806},null,null,0,1,null,null,null,null,null,null,null,null,45427,"Siphofaneni",null,34128.847108629998]
[{"$f":"IF(INTRO!$E$33<>0,INTRO!$E$33, \" \")","v":"Eswatini"},"LUBOMBO","Sithobela",29706,{"$f":"IF(INTRO!$E$48=\"\",\"\",ROUND($D35*INTRO!$E$48,0))","v":2789},{"$f":"IF(INTRO!$E$49=\"\",\"\",ROUND($D35*INTRO!$E$49,0))","v":6916},{"$f":"IF(INTRO!$E$50=\"\",\"\",ROUND($D35*INTRO!$E$50,0))","v":19300},null,null,1,2,{"$f":"IF(INTRO!$E$37=\"Endemic\",IF($H35>0,IF($H35=4,\"Unknown\",IF($H35=99,\"Stopped\",$D35)),0),\"Not required\")","v":"Not required"},{"$f":"IF(INTRO!$E$39=\"Endemic\", IF($I35>0, IF($I35=4,\"Unknown\",IF($I35=99,\"Stopped\",$D35)), 0),\"Not required\")","v":"Not required"},{"$f":"IF(INTRO!$E$41=\"Endemic\", IF($J35>1, IF($J35=4, \"Unknown\", IF($J35=99, \"Surveillance\", E35)), 0),\"Not required\")","v":0},{"$f":"IF(INTRO!$E$41=\"Endemic\", IF($J35>1, IF($J35=4, \"Unknown\", IF($J35=99, \"Surveillance\", F35)), 0),\"Not required\")","v":0},{"$f":"IF(INTRO!$E$41=\"Endemic\", IF($J35>1, IF($J35=4, \"Unknown\", IF($J35=99, \"Surveillance\", ROUND(D35*INTRO!$E$51,0))), 0),\"Not required\")","v":0},{"$f":"IF(INTRO!$E$41=\"Endemic\", IF($J35>1, IF($J35=4, \"Unknown\", IF($J35=99, \"Surveillance\", SUM($N35:$P35))), 0),\"Not required\")","v":0},{"$f":"IF(INTRO!$E$43=\"Endemic\", IF($K35>1, IF($K35=4, \"Unknown\", IF($K35=99, \"Surveillance\", ROUND(E35*0.75,0))), 0),\"Not required\")","v":2092},{"$f":"IF(INTRO!$E$43=\"Endemic\", IF($K35>1, IF($K35=4, \"Unknown\", IF($K35=99, \"Surveillance\", F35)), 0),\"Not required\")","v":6916},{"$f":"IF(INTRO!$E$43=\"Endemic\", IF($K35>1, IF($K35=4, \"Unknown\", IF($K35=99, \"Surveillance\", G35)), 0),\"Not required\")","v":19300},{"$f":"IF(INTRO!$E$43=\"Endemic\", IF($K35>1, IF($K35=4, \"Unknown\", IF($K35=99, \"Surveillance\", SUM($R35:$T35))), 0),\"Not required\")","v":28308},null,null,0,1,null,null,null,null,null,null,null,null,45429,"Sithobela",null,29449.555038750001]
[{"$f":"IF(INTRO!$E$33<>0,INTRO!$E$33, \" \")","v":"Eswatini"},"MANZINI","Kukhanyeni",20238,{"$f":"IF(INTRO!$E$48=\"\",\"\",ROUND($D36*INTRO!$E$48,0))","v":1900},{"$f":"IF(INTRO!$E$49=\"\",\"\",ROUND($D36*INTRO!$E$49,0))","v":4711},{"$f":"IF(INTRO!$E$50=\"\",\"\",ROUND($D36*INTRO!$E$50,0))","v":13149},null,null,1,2,{"$f":"IF(INTRO!$E$37=\"Endemic\",IF($H36>0,IF($H36=4,\"Unknown\",IF($H36=99,\"Stopped\",$D36)),0),\"Not required\")","v":"Not required"},{"$f":"IF(INTRO!$E$39=\"Endemic\", IF($I36>0, IF($I36=4,\"Unknown\",IF($I36=99,\"Stopped\",$D36)), 0),\"Not required\")","v":"Not required"},{"$f":"IF(INTRO!$E$41=\"Endemic\", IF($J36>1, IF($J36=4, \"Unknown\", IF($J36=99, \"Surveillance\", E36)), 0),\"Not required\")","v":0},{"$f":"IF(INTRO!$E$41=\"Endemic\", IF($J36>1, IF($J36=4, \"Unknown\", IF($J36=99, \"Surveillance\", F36)), 0),\"Not required\")","v":0},{"$f":"IF(INTRO!$E$41=\"Endemic\", IF($J36>1, IF($J36=4, \"Unknown\", IF($J36=99, \"Surveillance\", ROUND(D36*INTRO!$E$51,0))), 0),\"Not required\")","v":0},{"$f":"IF(INTRO!$E$41=\"Endemic\", IF($J36>1, IF($J36=4, \"Unknown\", IF($J36=99, \"Surveillance\", SUM($N36:$P36))), 0),\"Not required\")","v":0},{"$f":"IF(INTRO!$E$43=\"Endemic\", IF($K36>1, IF($K36=4, \"Unknown\", IF($K36=99, \"Surveillance\", ROUND(E36*0.75,0))), 0),\"Not required\")","v":1425},{"$f":"IF(INTRO!$E$43=\"Endemic\", IF($K36>1, IF($K36=4, \"Unknown\", IF($K36=99, \"Surveillance\", F36)), 0),\"Not required\")","v":4711},{"$f":"IF(INTRO!$E$43=\"Endemic\", IF($K36>1, IF($K36=4, \"Unknown\", IF($K36=99, \"Surveillance\", G36)), 0),\"Not required\")","v":13149},{"$f":"IF(INTRO!$E$43=\"Endemic\", IF($K36>1, IF($K36=4, \"Unknown\", IF($K36=99, \"Surveillance\", SUM($R36:$T36))), 0),\"Not required\")","v":19285},null,null,0,1,null,null,null,null,null,null,null,null,45430,"Kukhanyeni",null,20063.433652720003]
[{"$f":"IF(INTRO!$E$33<>0,INTRO!$E$33, \" \")","v":"Eswatini"},"MANZINI","Kwaluseni",63539,{"$f":"IF(INTRO!$E$48=\"\",\"\",ROUND($D37*INTRO!$E$48,0))","v":5966},{"$f":"IF(INTRO!$E$49=\"\",\"\",ROUND($D37*INTRO!$E$49,0))","v":14792},{"$f":"IF(INTRO!$E$50=\"\",\"\",ROUND($D37*INTRO!$E$50,0))","v":41281},null,null,0,1,{"$f":"IF(INTRO!$E$37=\"Endemic\",IF($H37>0,IF($H37=4,\"Unknown\",IF($H37=99,\"Stopped\",$D37)),0),\"Not required\")","v":"Not required"},{"$f":"IF(INTRO!$E$39=\"Endemic\", IF($I37>0, IF($I37=4,\"Unknown\",IF($I37=99,\"Stopped\",$D37)), 0),\"Not required\")","v":"Not required"},{"$f":"IF(INTRO!$E$41=\"Endemic\", IF($J37>1, IF($J37=4, \"Unknown\", IF($J37=99, \"Surveillance\", E37)), 0),\"Not required\")","v":0},{"$f":"IF(INTRO!$E$41=\"Endemic\", IF($J37>1, IF($J37=4, \"Unknown\", IF($J37=99, \"Surveillance\", F37)), 0),\"Not required\")","v":0},{"$f":"IF(INTRO!$E$41=\"Endemic\", IF($J37>1, IF($J37=4, \"Unknown\", IF($J37=99, \"Surveillance\", ROUND(D37*INTRO!$E$51,0))), 0),\"Not required\")","v":0},{"$f":"IF(INTRO!$E$41=\"Endemic\", IF($J37>1, IF($J37=4, \"Unknown\", IF($J37=99, \"Surveillance\", SUM($N37:$P37))), 0),\"Not required\")","v":0},{"$f":"IF(INTRO!$E$43=\"Endemic\", IF($K37>1, IF($K37=4, \"Unknown\", IF($K37=99, \"Surveillance\", ROUND(E37*0.75,0))), 0),\"Not required\")","v":0},{"$f":"IF(INTRO!$E$43=\"Endemic\", IF($K37>1, IF($K37=4, \"Unknown\", IF($K37=99, \"Surveillance\", F37)), 0),\"Not required\")","v":0},{"$f":"IF(INTRO!$E$43=\"Endemic\", IF($K37>1, IF($K37=4, \"Unknown\", IF($K37=99, \"Surveillance\", G37)), 0),\"Not required\")","v":0},{"$f":"IF(INTRO!$E$43=\"Endemic\", IF($K37>1, IF($K37=4, \"Unknown\", IF($K37=99, \"Surveillance\", SUM($R37:$T37))), 0),\"Not required\")","v":0},null,null,0,0,null,null,null,null,null,null,null,null,45431,"Kwaluseni",null,62990.940893620005]
[{"$f":"IF(INTRO!$E$33<>0,INTRO!$E$33, \" \")","v":"Eswatini"},"MANZINI","LaMgabhi",12035,{"$f":"IF(INTRO!$E$48=\"\",\"\",ROUND($D38*INTRO!$E$48,0))","v":1130},{"$f":"IF(INTRO!$E$49=\"\",\"\",ROUND($D38*INTRO!$E$49,0))","v":2802},{"$f":"IF(INTRO!$E$50=\"\",\"\",ROUND($D38*INTRO!$E$50,0))","v":7819},null,null,1,2,{"$f":"IF(INTRO!$E$37=\"Endemic\",IF($H38>0,IF($H38=4,\"Unknown\",IF($H38=99,\"Stopped\",$D38)),0),\"Not required\")","v":"Not required"},{"$f":"IF(INTRO!$E$39=\"Endemic\", IF($I38>0, IF($I38=4,\"Unknown\",IF($I38=99,\"Stopped\",$D38)), 0),\"Not required\")","v":"Not required"},{"$f":"IF(INTRO!$E$41=\"Endemic\", IF($J38>1, IF($J38=4, \"Unknown\", IF($J38=99, \"Surveillance\", E38)), 0),\"Not required\")","v":0},{"$f":"IF(INTRO!$E$41=\"Endemic\", IF($J38>1, IF($J38=4, \"Unknown\", IF($J38=99, \"Surveillance\", F38)), 0),\"Not required\")","v":0},{"$f":"IF(INTRO!$E$41=\"Endemic\", IF($J38>1, IF($J38=4, \"Unknown\", IF($J38=99, \"Surveillance\", ROUND(D38*INTRO!$E$51,0))), 0),\"Not required\")","v":0},{"$f":"IF(INTRO!$E$41=\"Endemic\", IF($J38>1, IF($J38=4, \"Unknown\", IF($J38=99, \"Surveillance\", SUM($N38:$P38))), 0),\"Not required\")","v":0},{"$f":"IF(INTRO!$E$43=\"Endemic\", IF($K38>1, IF($K38=4, \"Unknown\", IF($K38=99, \"Surveillance\", ROUND(E38*0.75,0))), 0),\"Not required\")","v":848},{"$f":"IF(INTRO!$E$43=\"Endemic\", IF($K38>1, IF($K38=4, \"Unknown\", IF($K38=99, \"Surveillance\", F38)), 0),\"Not required\")","v":2802},{"$f":"IF(INTRO!$E$43=\"Endemic\", IF($K38>1, IF($K38=4, \"Unknown\", IF($K38=99, \"Surveillance\", G38)), 0),\"Not required\")","v":7819},{"$f":"IF(INTRO!$E$43=\"Endemic\", IF($K38>1, IF($K38=4, \"Unknown\", IF($K38=99, \"Surveillance\", SUM($R38:$T38))), 0),\"Not required\")","v":11469},null,null,0,1,null,null,null,null,null,null,null,null,45432,"La-Mgabhi",null,11930.766920980001]
[{"$f":"IF(INTRO!$E$33<>0,INTRO!$E$33, \" \")","v":"Eswatini"},"MANZINI","Lobamba Lomdzala",23102,{"$f":"IF(INTRO!$E$48=\"\",\"\",ROUND($D39*INTRO!$E$48,0))","v":2169},{"$f":"IF(INTRO!$E$49=\"\",\"\",ROUND($D39*INTRO!$E$49,0))","v":5378},{"$f":"IF(INTRO!$E$50=\"\",\"\",ROUND($D39*INTRO!$E$50,0))","v":15009},null,null,1,2,{"$f":"IF(INTRO!$E$37=\"Endemic\",IF($H39>0,IF($H39=4,\"Unknown\",IF($H39=99,\"Stopped\",$D39)),0),\"Not required\")","v":"Not required"},{"$f":"IF(INTRO!$E$39=\"Endemic\", IF($I39>0, IF($I39=4,\"Unknown\",IF($I39=99,\"Stopped\",$D39)), 0),\"Not required\")","v":"Not required"},{"$f":"IF(INTRO!$E$41=\"Endemic\", IF($J39>1, IF($J39=4, \"Unknown\", IF($J39=99, \"Surveillance\", E39)), 0),\"Not required\")","v":0},{"$f":"IF(INTRO!$E$41=\"Endemic\", IF($J39>1, IF($J39=4, \"Unknown\", IF($J39=99, \"Surveillance\", F39)), 0),\"Not required\")","v":0},{"$f":"IF(INTRO!$E$41=\"Endemic\", IF($J39>1, IF($J39=4, \"Unknown\", IF($J39=99, \"Surveillance\", ROUND(D39*INTRO!$E$51,0))), 0),\"Not required\")","v":0},{"$f":"IF(INTRO!$E$41=\"Endemic\", IF($J39>1, IF($J39=4, \"Unknown\", IF($J39=99, \"Surveillance\", SUM($N39:$P39))), 0),\"Not required\")","v":0},{"$f":"IF(INTRO!$E$43=\"Endemic\", IF($K39>1, IF($K39=4, \"Unknown\", IF($K39=99, \"Surveillance\", ROUND(E39*0.75,0))), 0),\"Not required\")","v":1627},{"$f":"IF(INTRO!$E$43=\"Endemic\", IF($K39>1, IF($K39=4, \"Unknown\", IF($K39=99, \"Surveillance\", F39)), 0),\"Not required\")","v":5378},{"$f":"IF(INTRO!$E$43=\"Endemic\", IF($K39>1, IF($K39=4, \"Unknown\", IF($K39=99, \"Surveillance\", G39)), 0),\"Not required\")","v":15009},{"$f":"IF(INTRO!$E$43=\"Endemic\", IF($K39>1, IF($K39=4, \"Unknown\", IF($K39=99, \"Surveillance\", SUM($R39:$T39))), 0),\"Not required\")","v":22014},null,null,0,1,null,null,null,null,null,null,null,null,45459,"Lobamba Lomdzala",null,22902.82971256]
[{"$f":"IF(INTRO!$E$33<>0,INTRO!$E$33, \" \")","v":"Eswatini"},"MANZINI","Ludzeludze",24500,{"$f":"IF(INTRO!$E$48=\"\",\"\",ROUND($D40*INTRO!$E$48,0))","v":2301},{"$f":"IF(INTRO!$E$49=\"\",\"\",ROUND($D40*INTRO!$E$49,0))","v":5704},{"$f":"IF(INTRO!$E$50=\"\",\"\",ROUND($D40*INTRO!$E$50,0))","v":15918},null,null,1,2,{"$f":"IF(INTRO!$E$37=\"Endemic\",IF($H40>0,IF($H40=4,\"Unknown\",IF($H40=99,\"Stopped\",$D40)),0),\"Not required\")","v":"Not required"},{"$f":"IF(INTRO!$E$39=\"Endemic\", IF($I40>0, IF($I40=4,\"Unknown\",IF($I40=99,\"Stopped\",$D40)), 0),\"Not required\")","v":"Not required"},{"$f":"IF(INTRO!$E$41=\"Endemic\", IF($J40>1, IF($J40=4, \"Unknown\", IF($J40=99, \"Surveillance\", E40)), 0),\"Not required\")","v":0},{"$f":"IF(INTRO!$E$41=\"Endemic\", IF($J40>1, IF($J40=4, \"Unknown\", IF($J40=99, \"Surveillance\", F40)), 0),\"Not required\")","v":0},{"$f":"IF(INTRO!$E$41=\"Endemic\", IF($J40>1, IF($J40=4, \"Unknown\", IF($J40=99, \"Surveillance\", ROUND(D40*INTRO!$E$51,0))), 0),\"Not required\")","v":0},{"$f":"IF(INTRO!$E$41=\"Endemic\", IF($J40>1, IF($J40=4, \"Unknown\", IF($J40=99, \"Surveillance\", SUM($N40:$P40))), 0),\"Not required\")","v":0},{"$f":"IF(INTRO!$E$43=\"Endemic\", IF($K40>1, IF($K40=4, \"Unknown\", IF($K40=99, \"Surveillance\", ROUND(E40*0.75,0))), 0),\"Not required\")","v":1726},{"$f":"IF(INTRO!$E$43=\"Endemic\", IF($K40>1, IF($K40=4, \"Unknown\", IF($K40=99, \"Surveillance\", F40)), 0),\"Not required\")","v":5704},{"$f":"IF(INTRO!$E$43=\"Endemic\", IF($K40>1, IF($K40=4, \"Unknown\", IF($K40=99, \"Surveillance\", G40)), 0),\"Not required\")","v":15918},{"$f":"IF(INTRO!$E$43=\"Endemic\", IF($K40>1, IF($K40=4, \"Unknown\", IF($K40=99, \"Surveillance\", SUM($R40:$T40))), 0),\"Not required\")","v":23348},null,null,0,1,null,null,null,null,null,null,null,null,45433,"Ludzeludze",null,24288.871108150004]
[{"$f":"IF(INTRO!$E$33<>0,INTRO!$E$33, \" \")","v":"Eswatini"},"MANZINI","Mafutseni",23376,{"$f":"IF(INTRO!$E$48=\"\",\"\",ROUND($D41*INTRO!$E$48,0))","v":2195},{"$f":"IF(INTRO!$E$49=\"\",\"\",ROUND($D41*INTRO!$E$49,0))","v":5442},{"$f":"IF(INTRO!$E$50=\"\",\"\",ROUND($D41*INTRO!$E$50,0))","v":15187},null,null,1,2,{"$f":"IF(INTRO!$E$37=\"Endemic\",IF($H41>0,IF($H41=4,\"Unknown\",IF($H41=99,\"Stopped\",$D41)),0),\"Not required\")","v":"Not required"},{"$f":"IF(INTRO!$E$39=\"Endemic\", IF($I41>0, IF($I41=4,\"Unknown\",IF($I41=99,\"Stopped\",$D41)), 0),\"Not required\")","v":"Not required"},{"$f":"IF(INTRO!$E$41=\"Endemic\", IF($J41>1, IF($J41=4, \"Unknown\", IF($J41=99, \"Surveillance\", E41)), 0),\"Not required\")","v":0},{"$f":"IF(INTRO!$E$41=\"Endemic\", IF($J41>1, IF($J41=4, \"Unknown\", IF($J41=99, \"Surveillance\", F41)), 0),\"Not required\")","v":0},{"$f":"IF(INTRO!$E$41=\"Endemic\", IF($J41>1, IF($J41=4, \"Unknown\", IF($J41=99, \"Surveillance\", ROUND(D41*INTRO!$E$51,0))), 0),\"Not required\")","v":0},{"$f":"IF(INTRO!$E$41=\"Endemic\", IF($J41>1, IF($J41=4, \"Unknown\", IF($J41=99, \"Surveillance\", SUM($N41:$P41))), 0),\"Not required\")","v":0},{"$f":"IF(INTRO!$E$43=\"Endemic\", IF($K41>1, IF($K41=4, \"Unknown\", IF($K41=99, \"Surveillance\", ROUND(E41*0.75,0))), 0),\"Not required\")","v":1646},{"$f":"IF(INTRO!$E$43=\"Endemic\", IF($K41>1, IF($K41=4, \"Unknown\", IF($K41=99, \"Surveillance\", F41)), 0),\"Not required\")","v":5442},{"$f":"IF(INTRO!$E$43=\"Endemic\", IF($K41>1, IF($K41=4, \"Unknown\", IF($K41=99, \"Surveillance\", G41)), 0),\"Not required\")","v":15187},{"$f":"IF(INTRO!$E$43=\"Endemic\", IF($K41>1, IF($K41=4, \"Unknown\", IF($K41=99, \"Surveillance\", SUM($R41:$T41))), 0),\"Not required\")","v":22275},null,null,0,1,null,null,null,null,null,null,null,null,45434,"Mafutseni",null,23174.122583220003]
[{"$f":"IF(INTRO!$E$33<>0,INTRO!$E$33, \" \")","v":"Eswatini"},"MANZINI","Mahlangatsha",18912,{"$f":"IF(INTRO!$E$48=\"\",\"\",ROUND($D42*INTRO!$E$48,0))","v":1776},{"$f":"IF(INTRO!$E$49=\"\",\"\",ROUND($D42*INTRO!$E$49,0))","v":4403},{"$f":"IF(INTRO!$E$50=\"\",\"\",ROUND($D42*INTRO!$E$50,0))","v":12287},null,null,1,2,{"$f":"IF(INTRO!$E$37=\"Endemic\",IF($H42>0,IF($H42=4,\"Unknown\",IF($H42=99,\"Stopped\",$D42)),0),\"Not required\")","v":"Not required"},{"$f":"IF(INTRO!$E$39=\"Endemic\", IF($I42>0, IF($I42=4,\"Unknown\",IF($I42=99,\"Stopped\",$D42)), 0),\"Not required\")","v":"Not required"},{"$f":"IF(INTRO!$E$41=\"Endemic\", IF($J42>1, IF($J42=4, \"Unknown\", IF($J42=99, \"Surveillance\", E42)), 0),\"Not required\")","v":0},{"$f":"IF(INTRO!$E$41=\"Endemic\", IF($J42>1, IF($J42=4, \"Unknown\", IF($J42=99, \"Surveillance\", F42)), 0),\"Not required\")","v":0},{"$f":"IF(INTRO!$E$41=\"Endemic\", IF($J42>1, IF($J42=4, \"Unknown\", IF($J42=99, \"Surveillance\", ROUND(D42*INTRO!$E$51,0))), 0),\"Not required\")","v":0},{"$f":"IF(INTRO!$E$41=\"Endemic\", IF($J42>1, IF($J42=4, \"Unknown\", IF($J42=99, \"Surveillance\", SUM($N42:$P42))), 0),\"Not required\")","v":0},{"$f":"IF(INTRO!$E$43=\"Endemic\", IF($K42>1, IF($K42=4, \"Unknown\", IF($K42=99, \"Surveillance\", ROUND(E42*0.75,0))), 0),\"Not required\")","v":1332},{"$f":"IF(INTRO!$E$43=\"Endemic\", IF($K42>1, IF($K42=4, \"Unknown\", IF($K42=99, \"Surveillance\", F42)), 0),\"Not required\")","v":4403},{"$f":"IF(INTRO!$E$43=\"Endemic\", IF($K42>1, IF($K42=4, \"Unknown\", IF($K42=99, \"Surveillance\", G42)), 0),\"Not required\")","v":12287},{"$f":"IF(INTRO!$E$43=\"Endemic\", IF($K42>1, IF($K42=4, \"Unknown\", IF($K42=99, \"Surveillance\", SUM($R42:$T42))), 0),\"Not required\")","v":18022},null,null,0,1,null,null,null,null,null,null,null,null,45435,"Mahlangatsha",null,18748.785117830001]
[{"$f":"IF(INTRO!$E$33<>0,INTRO!$E$33, \" \")","v":"Eswatini"},"MANZINI","Mangcongco",21793,{"$f":"IF(INTRO!$E$48=\"\",\"\",ROUND($D43*INTRO!$E$48,0))","v":2046},{"$f":"IF(INTRO!$E$49=\"\",\"\",ROUND($D43*INTRO!$E$49,0))","v":5073},{"$f":"IF(INTRO!$E$50=\"\",\"\",ROUND($D43*INTRO!$E$50,0))","v":14159},null,null,0,1,{"$f":"IF(INTRO!$E$37=\"Endemic\",IF($H43>0,IF($H43=4,\"Unknown\",IF($H43=99,\"Stopped\",$D43)),0),\"Not required\")","v":"Not required"},{"$f":"IF(INTRO!$E$39=\"Endemic\", IF($I43>0, IF($I43=4,\"Unknown\",IF($I43=99,\"Stopped\",$D43)), 0),\"Not required\")","v":"Not required"},{"$f":"IF(INTRO!$E$41=\"Endemic\", IF($J43>1, IF($J43=4, \"Unknown\", IF($J43=99, \"Surveillance\", E43)), 0),\"Not required\")","v":0},{"$f":"IF(INTRO!$E$41=\"Endemic\", IF($J43>1, IF($J43=4, \"Unknown\", IF($J43=99, \"Surveillance\", F43)), 0),\"Not required\")","v":0},{"$f":"IF(INTRO!$E$41=\"Endemic\", IF($J43>1, IF($J43=4, \"Unknown\", IF($J43=99, \"Surveillance\", ROUND(D43*INTRO!$E$51,0))), 0),\"Not required\")","v":0},{"$f":"IF(INTRO!$E$41=\"Endemic\", IF($J43>1, IF($J43=4, \"Unknown\", IF($J43=99, \"Surveillance\", SUM($N43:$P43))), 0),\"Not required\")","v":0},{"$f":"IF(INTRO!$E$43=\"Endemic\", IF($K43>1, IF($K43=4, \"Unknown\", IF($K43=99, \"Surveillance\", ROUND(E43*0.75,0))), 0),\"Not required\")","v":0},{"$f":"IF(INTRO!$E$43=\"Endemic\", IF($K43>1, IF($K43=4, \"Unknown\", IF($K43=99, \"Surveillance\", F43)), 0),\"Not required\")","v":0},{"$f":"IF(INTRO!$E$43=\"Endemic\", IF($K43>1, IF($K43=4, \"Unknown\", IF($K43=99, \"Surveillance\", G43)), 0),\"Not required\")","v":0},{"$f":"IF(INTRO!$E$43=\"Endemic\", IF($K43>1, IF($K43=4, \"Unknown\", IF($K43=99, \"Surveillance\", SUM($R43:$T43))), 0),\"Not required\")","v":0},null,null,0,0,null,null,null,null,null,null,null,null,45436,"Mangcongco",null,21605.376658118603]
[{"$f":"IF(INTRO!$E$33<>0,INTRO!$E$33, \" \")","v":"Eswatini"},"MANZINI","Manzini North",36373,{"$f":"IF(INTRO!$E$48=\"\",\"\",ROUND($D44*INTRO!$E$48,0))","v":3415},{"$f":"IF(INTRO!$E$49=\"\",\"\",ROUND($D44*INTRO!$E$49,0))","v":8468},{"$f":"IF(INTRO!$E$50=\"\",\"\",ROUND($D44*INTRO!$E$50,0))","v":23632},null,null,1,2,{"$f":"IF(INTRO!$E$37=\"Endemic\",IF($H44>0,IF($H44=4,\"Unknown\",IF($H44=99,\"Stopped\",$D44)),0),\"Not required\")","v":"Not required"},{"$f":"IF(INTRO!$E$39=\"Endemic\", IF($I44>0, IF($I44=4,\"Unknown\",IF($I44=99,\"Stopped\",$D44)), 0),\"Not required\")","v":"Not required"},{"$f":"IF(INTRO!$E$41=\"Endemic\", IF($J44>1, IF($J44=4, \"Unknown\", IF($J44=99, \"Surveillance\", E44)), 0),\"Not required\")","v":0},{"$f":"IF(INTRO!$E$41=\"Endemic\", IF($J44>1, IF($J44=4, \"Unknown\", IF($J44=99, \"Surveillance\", F44)), 0),\"Not required\")","v":0},{"$f":"IF(INTRO!$E$41=\"Endemic\", IF($J44>1, IF($J44=4, \"Unknown\", IF($J44=99, \"Surveillance\", ROUND(D44*INTRO!$E$51,0))), 0),\"Not required\")","v":0},{"$f":"IF(INTRO!$E$41=\"Endemic\", IF($J44>1, IF($J44=4, \"Unknown\", IF($J44=99, \"Surveillance\", SUM($N44:$P44))), 0),\"Not required\")","v":0},{"$f":"IF(INTRO!$E$43=\"Endemic\", IF($K44>1, IF($K44=4, \"Unknown\", IF($K44=99, \"Surveillance\", ROUND(E44*0.75,0))), 0),\"Not required\")","v":2561},{"$f":"IF(INTRO!$E$43=\"Endemic\", IF($K44>1, IF($K44=4, \"Unknown\", IF($K44=99, \"Surveillance\", F44)), 0),\"Not required\")","v":8468},{"$f":"IF(INTRO!$E$43=\"Endemic\", IF($K44>1, IF($K44=4, \"Unknown\", IF($K44=99, \"Surveillance\", G44)), 0),\"Not required\")","v":23632},{"$f":"IF(INTRO!$E$43=\"Endemic\", IF($K44>1, IF($K44=4, \"Unknown\", IF($K44=99, \"Surveillance\", SUM($R44:$T44))), 0),\"Not required\")","v":34661},null,null,0,1,null,null,null,null,null,null,null,null,45437,"Manzini North",null,36059.514041560004]
[{"$f":"IF(INTRO!$E$33<>0,INTRO!$E$33, \" \")","v":"Eswatini"},"MANZINI","Manzini South",27684,{"$f":"IF(INTRO!$E$48=\"\",\"\",ROUND($D45*INTRO!$E$48,0))","v":2600},{"$f":"IF(INTRO!$E$49=\"\",\"\",ROUND($D45*INTRO!$E$49,0))","v":6445},{"$f":"IF(INTRO!$E$50=\"\",\"\",ROUND($D45*INTRO!$E$50,0))","v":17986},null,null,1,2,{"$f":"IF(INTRO!$E$37=\"Endemic\",IF($H45>0,IF($H45=4,\"Unknown\",IF($H45=99,\"Stopped\",$D45)),0),\"Not required\")","v":"Not required"},{"$f":"IF(INTRO!$E$39=\"Endemic\", IF($I45>0, IF($I45=4,\"Unknown\",IF($I45=99,\"Stopped\",$D45)), 0),\"Not required\")","v":"Not required"},{"$f":"IF(INTRO!$E$41=\"Endemic\", IF($J45>1, IF($J45=4, \"Unknown\", IF($J45=99, \"Surveillance\", E45)), 0),\"Not required\")","v":0},{"$f":"IF(INTRO!$E$41=\"Endemic\", IF($J45>1, IF($J45=4, \"Unknown\", IF($J45=99, \"Surveillance\", F45)), 0),\"Not required\")","v":0},{"$f":"IF(INTRO!$E$41=\"Endemic\", IF($J45>1, IF($J45=4, \"Unknown\", IF($J45=99, \"Surveillance\", ROUND(D45*INTRO!$E$51,0))), 0),\"Not required\")","v":0},{"$f":"IF(INTRO!$E$41=\"Endemic\", IF($J45>1, IF($J45=4, \"Unknown\", IF($J45=99, \"Surveillance\", SUM($N45:$P45))), 0),\"Not required\")","v":0},{"$f":"IF(INTRO!$E$43=\"Endemic\", IF($K45>1, IF($K45=4, \"Unknown\", IF($K45=99, \"Surveillance\", ROUND(E45*0.75,0))), 0),\"Not required\")","v":1950},{"$f":"IF(INTRO!$E$43=\"Endemic\", IF($K45>1, IF($K45=4, \"Unknown\", IF($K45=99, \"Surveillance\", F45)), 0),\"Not required\")","v":6445},{"$f":"IF(INTRO!$E$43=\"Endemic\", IF($K45>1, IF($K45=4, \"Unknown\", IF($K45=99, \"Surveillance\", G45)), 0),\"Not required\")","v":17986},{"$f":"IF(INTRO!$E$43=\"Endemic\", IF($K45>1, IF($K45=4, \"Unknown\", IF($K45=99, \"Surveillance\", SUM($R45:$T45))), 0),\"Not required\")","v":26381},null,null,0,1,null,null,null,null,null,null,null,null,45438,"Manzini South",null,27445.455449100002]
[{"$f":"IF(INTRO!$E$33<>0,INTRO!$E$33, \" \")","v":"Eswatini"},"MANZINI","Mhlambanyatsi",10512,{"$f":"IF(INTRO!$E$48=\"\",\"\",ROUND($D46*INTRO!$E$48,0))","v":987},{"$f":"IF(INTRO!$E$49=\"\",\"\",ROUND($D46*INTRO!$E$49,0))","v":2447},{"$f":"IF(INTRO!$E$50=\"\",\"\",ROUND($D46*INTRO!$E$50,0))","v":6830},null,null,0,1,{"$f":"IF(INTRO!$E$37=\"Endemic\",IF($H46>0,IF($H46=4,\"Unknown\",IF($H46=99,\"Stopped\",$D46)),0),\"Not required\")","v":"Not required"},{"$f":"IF(INTRO!$E$39=\"Endemic\", IF($I46>0, IF($I46=4,\"Unknown\",IF($I46=99,\"Stopped\",$D46)), 0),\"Not required\")","v":"Not required"},{"$f":"IF(INTRO!$E$41=\"Endemic\", IF($J46>1, IF($J46=4, \"Unknown\", IF($J46=99, \"Surveillance\", E46)), 0),\"Not required\")","v":0},{"$f":"IF(INTRO!$E$41=\"Endemic\", IF($J46>1, IF($J46=4, \"Unknown\", IF($J46=99, \"Surveillance\", F46)), 0),\"Not required\")","v":0},{"$f":"IF(INTRO!$E$41=\"Endemic\", IF($J46>1, IF($J46=4, \"Unknown\", IF($J46=99, \"Surveillance\", ROUND(D46*INTRO!$E$51,0))), 0),\"Not required\")","v":0},{"$f":"IF(INTRO!$E$41=\"Endemic\", IF($J46>1, IF($J46=4, \"Unknown\", IF($J46=99, \"Surveillance\", SUM($N46:$P46))), 0),\"Not required\")","v":0},{"$f":"IF(INTRO!$E$43=\"Endemic\", IF($K46>1, IF($K46=4, \"Unknown\", IF($K46=99, \"Surveillance\", ROUND(E46*0.75,0))), 0),\"Not required\")","v":0},{"$f":"IF(INTRO!$E$43=\"Endemic\", IF($K46>1, IF($K46=4, \"Unknown\", IF($K46=99, \"Surveillance\", F46)), 0),\"Not required\")","v":0},{"$f":"IF(INTRO!$E$43=\"Endemic\", IF($K46>1, IF($K46=4, \"Unknown\", IF($K46=99, \"Surveillance\", G46)), 0),\"Not required\")","v":0},{"$f":"IF(INTRO!$E$43=\"Endemic\", IF($K46>1, IF($K46=4, \"Unknown\", IF($K46=99, \"Surveillance\", SUM($R46:$T46))), 0),\"Not required\")","v":0},null,null,0,0,null,null,null,null,null,null,null,null,45439,"Mhlambanyatsi",null,10421.317866179999]
[{"$f":"IF(INTRO!$E$33<>0,INTRO!$E$33, \" \")","v":"Eswatini"},"MANZINI","Mkhiweni",25126,{"$f":"IF(INTRO!$E$48=\"\",\"\",ROUND($D47*INTRO!$E$48,0))","v":2359},{"$f":"IF(INTRO!$E$49=\"\",\"\",ROUND($D47*INTRO!$E$49,0))","v":5849},{"$f":"IF(INTRO!$E$50=\"\",\"\",ROUND($D47*INTRO!$E$50,0))","v":16324},null,null,1,2,{"$f":"IF(INTRO!$E$37=\"Endemic\",IF($H47>0,IF($H47=4,\"Unknown\",IF($H47=99,\"Stopped\",$D47)),0),\"Not required\")","v":"Not required"},{"$f":"IF(INTRO!$E$39=\"Endemic\", IF($I47>0, IF($I47=4,\"Unknown\",IF($I47=99,\"Stopped\",$D47)), 0),\"Not required\")","v":"Not required"},{"$f":"IF(INTRO!$E$41=\"Endemic\", IF($J47>1, IF($J47=4, \"Unknown\", IF($J47=99, \"Surveillance\", E47)), 0),\"Not required\")","v":0},{"$f":"IF(INTRO!$E$41=\"Endemic\", IF($J47>1, IF($J47=4, \"Unknown\", IF($J47=99, \"Surveillance\", F47)), 0),\"Not required\")","v":0},{"$f":"IF(INTRO!$E$41=\"Endemic\", IF($J47>1, IF($J47=4, \"Unknown\", IF($J47=99, \"Surveillance\", ROUND(D47*INTRO!$E$51,0))), 0),\"Not required\")","v":0},{"$f":"IF(INTRO!$E$41=\"Endemic\", IF($J47>1, IF($J47=4, \"Unknown\", IF($J47=99, \"Surveillance\", SUM($N47:$P47))), 0),\"Not required\")","v":0},{"$f":"IF(INTRO!$E$43=\"Endemic\", IF($K47>1, IF($K47=4, \"Unknown\", IF($K47=99, \"Surveillance\", ROUND(E47*0.75,0))), 0),\"Not required\")","v":1769},{"$f":"IF(INTRO!$E$43=\"Endemic\", IF($K47>1, IF($K47=4, \"Unknown\", IF($K47=99, \"Surveillance\", F47)), 0),\"Not required\")","v":5849},{"$f":"IF(INTRO!$E$43=\"Endemic\", IF($K47>1, IF($K47=4, \"Unknown\", IF($K47=99, \"Surveillance\", G47)), 0),\"Not required\")","v":16324},{"$f":"IF(INTRO!$E$43=\"Endemic\", IF($K47>1, IF($K47=4, \"Unknown\", IF($K47=99, \"Surveillance\", SUM($R47:$T47))), 0),\"Not required\")","v":23942},null,null,0,1,null,null,null,null,null,null,null,null,45440,"Mkhiweni",null,24908.969098230002]
[{"$f":"IF(INTRO!$E$33<>0,INTRO!$E$33, \" \")","v":"Eswatini"},"MANZINI","Mtfongwaneni",16449,{"$f":"IF(INTRO!$E$48=\"\",\"\",ROUND($D48*INTRO!$E$48,0))","v":1545},{"$f":"IF(INTRO!$E$49=\"\",\"\",ROUND($D48*INTRO!$E$49,0))","v":3829},{"$f":"IF(INTRO!$E$50=\"\",\"\",ROUND($D48*INTRO!$E$50,0))","v":10687},null,null,1,1,{"$f":"IF(INTRO!$E$37=\"Endemic\",IF($H48>0,IF($H48=4,\"Unknown\",IF($H48=99,\"Stopped\",$D48)),0),\"Not required\")","v":"Not required"},{"$f":"IF(INTRO!$E$39=\"Endemic\", IF($I48>0, IF($I48=4,\"Unknown\",IF($I48=99,\"Stopped\",$D48)), 0),\"Not required\")","v":"Not required"},{"$f":"IF(INTRO!$E$41=\"Endemic\", IF($J48>1, IF($J48=4, \"Unknown\", IF($J48=99, \"Surveillance\", E48)), 0),\"Not required\")","v":0},{"$f":"IF(INTRO!$E$41=\"Endemic\", IF($J48>1, IF($J48=4, \"Unknown\", IF($J48=99, \"Surveillance\", F48)), 0),\"Not required\")","v":0},{"$f":"IF(INTRO!$E$41=\"Endemic\", IF($J48>1, IF($J48=4, \"Unknown\", IF($J48=99, \"Surveillance\", ROUND(D48*INTRO!$E$51,0))), 0),\"Not required\")","v":0},{"$f":"IF(INTRO!$E$41=\"Endemic\", IF($J48>1, IF($J48=4, \"Unknown\", IF($J48=99, \"Surveillance\", SUM($N48:$P48))), 0),\"Not required\")","v":0},{"$f":"IF(INTRO!$E$43=\"Endemic\", IF($K48>1, IF($K48=4, \"Unknown\", IF($K48=99, \"Surveillance\", ROUND(E48*0.75,0))), 0),\"Not required\")","v":0},{"$f":"IF(INTRO!$E$43=\"Endemic\", IF($K48>1, IF($K48=4, \"Unknown\", IF($K48=99, \"Surveillance\", F48)), 0),\"Not required\")","v":0},{"$f":"IF(INTRO!$E$43=\"Endemic\", IF($K48>1, IF($K48=4, \"Unknown\", IF($K48=99, \"Surveillance\", G48)), 0),\"Not required\")","v":0},{"$f":"IF(INTRO!$E$43=\"Endemic\", IF($K48>1, IF($K48=4, \"Unknown\", IF($K48=99, \"Surveillance\", SUM($R48:$T48))), 0),\"Not required\")","v":0},null,null,0,0,null,null,null,null,null,null,null,null,45441,"Mtfongwaneni",null,16307.149281890001]
[{"$f":"IF(INTRO!$E$33<>0,INTRO!$E$33, \" \")","v":"Eswatini"},"MANZINI","Ngwemphisi",20914,{"$f":"IF(INTRO!$E$48=\"\",\"\",ROUND($D49*INTRO!$E$48,0))","v":1964},{"$f":"IF(INTRO!$E$49=\"\",\"\",ROUND($D49*INTRO!$E$49,0))","v":4869},{"$f":"IF(INTRO!$E$50=\"\",\"\",ROUND($D49*INTRO!$E$50,0))","v":13588},null,null,1,2,{"$f":"IF(INTRO!$E$37=\"Endemic\",IF($H49>0,IF($H49=4,\"Unknown\",IF($H49=99,\"Stopped\",$D49)),0),\"Not required\")","v":"Not required"},{"$f":"IF(INTRO!$E$39=\"Endemic\", IF($I49>0, IF($I49=4,\"Unknown\",IF($I49=99,\"Stopped\",$D49)), 0),\"Not required\")","v":"Not required"},{"$f":"IF(INTRO!$E$41=\"Endemic\", IF($J49>1, IF($J49=4, \"Unknown\", IF($J49=99, \"Surveillance\", E49)), 0),\"Not required\")","v":0},{"$f":"IF(INTRO!$E$41=\"Endemic\", IF($J49>1, IF($J49=4, \"Unknown\", IF($J49=99, \"Surveillance\", F49)), 0),\"Not required\")","v":0},{"$f":"IF(INTRO!$E$41=\"Endemic\", IF($J49>1, IF($J49=4, \"Unknown\", IF($J49=99, \"Surveillance\", ROUND(D49*INTRO!$E$51,0))), 0),\"Not required\")","v":0},{"$f":"IF(INTRO!$E$41=\"Endemic\", IF($J49>1, IF($J49=4, \"Unknown\", IF($J49=99, \"Surveillance\", SUM($N49:$P49))), 0),\"Not required\")","v":0},{"$f":"IF(INTRO!$E$43=\"Endemic\", IF($K49>1, IF($K49=4, \"Unknown\", IF($K49=99, \"Surveillance\", ROUND(E49*0.75,0))), 0),\"Not required\")","v":1473},{"$f":"IF(INTRO!$E$43=\"Endemic\", IF($K49>1, IF($K49=4, \"Unknown\", IF($K49=99, \"Surveillance\", F49)), 0),\"Not required\")","v":4869},{"$f":"IF(INTRO!$E$43=\"Endemic\", IF($K49>1, IF($K49=4, \"Unknown\", IF($K49=99, \"Surveillance\", G49)), 0),\"Not required\")","v":13588},{"$f":"IF(INTRO!$E$43=\"Endemic\", IF($K49>1, IF($K49=4, \"Unknown\", IF($K49=99, \"Surveillance\", SUM($R49:$T49))), 0),\"Not required\")","v":19930},null,null,0,1,null,null,null,null,null,null,null,null,45442,"Ngwempisi",null,20733.435252429303]
[{"$f":"IF(INTRO!$E$33<>0,INTRO!$E$33, \" \")","v":"Eswatini"},"MANZINI","Nhlambeni",13384,{"$f":"IF(INTRO!$E$48=\"\",\"\",ROUND($D50*INTRO!$E$48,0))","v":1257},{"$f":"IF(INTRO!$E$49=\"\",\"\",ROUND($D50*INTRO!$E$49,0))","v":3116},{"$f":"IF(INTRO!$E$50=\"\",\"\",ROUND($D50*INTRO!$E$50,0))","v":8696},null,null,0,2,{"$f":"IF(INTRO!$E$37=\"Endemic\",IF($H50>0,IF($H50=4,\"Unknown\",IF($H50=99,\"Stopped\",$D50)),0),\"Not required\")","v":"Not required"},{"$f":"IF(INTRO!$E$39=\"Endemic\", IF($I50>0, IF($I50=4,\"Unknown\",IF($I50=99,\"Stopped\",$D50)), 0),\"Not required\")","v":"Not required"},{"$f":"IF(INTRO!$E$41=\"Endemic\", IF($J50>1, IF($J50=4, \"Unknown\", IF($J50=99, \"Surveillance\", E50)), 0),\"Not required\")","v":0},{"$f":"IF(INTRO!$E$41=\"Endemic\", IF($J50>1, IF($J50=4, \"Unknown\", IF($J50=99, \"Surveillance\", F50)), 0),\"Not required\")","v":0},{"$f":"IF(INTRO!$E$41=\"Endemic\", IF($J50>1, IF($J50=4, \"Unknown\", IF($J50=99, \"Surveillance\", ROUND(D50*INTRO!$E$51,0))), 0),\"Not required\")","v":0},{"$f":"IF(INTRO!$E$41=\"Endemic\", IF($J50>1, IF($J50=4, \"Unknown\", IF($J50=99, \"Surveillance\", SUM($N50:$P50))), 0),\"Not required\")","v":0},{"$f":"IF(INTRO!$E$43=\"Endemic\", IF($K50>1, IF($K50=4, \"Unknown\", IF($K50=99, \"Surveillance\", ROUND(E50*0.75,0))), 0),\"Not required\")","v":943},{"$f":"IF(INTRO!$E$43=\"Endemic\", IF($K50>1, IF($K50=4, \"Unknown\", IF($K50=99, \"Surveillance\", F50)), 0),\"Not required\")","v":3116},{"$f":"IF(INTRO!$E$43=\"Endemic\", IF($K50>1, IF($K50=4, \"Unknown\", IF($K50=99, \"Surveillance\", G50)), 0),\"Not required\")","v":8696},{"$f":"IF(INTRO!$E$43=\"Endemic\", IF($K50>1, IF($K50=4, \"Unknown\", IF($K50=99, \"Surveillance\", SUM($R50:$T50))), 0),\"Not required\")","v":12755},null,null,0,1,null,null,null,null,null,null,null,null,45443,"Nhlambeni",null,13268.873110100001]
[{"$f":"IF(INTRO!$E$33<>0,INTRO!$E$33, \" \")","v":"Eswatini"},"MANZINI","Ntondozi",15667,{"$f":"IF(INTRO!$E$48=\"\",\"\",ROUND($D51*INTRO!$E$48,0))","v":1471},{"$f":"IF(INTRO!$E$49=\"\",\"\",ROUND($D51*INTRO!$E$49,0))","v":3647},{"$f":"IF(INTRO!$E$50=\"\",\"\",ROUND($D51*INTRO!$E$50,0))","v":10179},null,null,1,2,{"$f":"IF(INTRO!$E$37=\"Endemic\",IF($H51>0,IF($H51=4,\"Unknown\",IF($H51=99,\"Stopped\",$D51)),0),\"Not required\")","v":"Not required"},{"$f":"IF(INTRO!$E$39=\"Endemic\", IF($I51>0, IF($I51=4,\"Unknown\",IF($I51=99,\"Stopped\",$D51)), 0),\"Not required\")","v":"Not required"},{"$f":"IF(INTRO!$E$41=\"Endemic\", IF($J51>1, IF($J51=4, \"Unknown\", IF($J51=99, \"Surveillance\", E51)), 0),\"Not required\")","v":0},{"$f":"IF(INTRO!$E$41=\"Endemic\", IF($J51>1, IF($J51=4, \"Unknown\", IF($J51=99, \"Surveillance\", F51)), 0),\"Not required\")","v":0},{"$f":"IF(INTRO!$E$41=\"Endemic\", IF($J51>1, IF($J51=4, \"Unknown\", IF($J51=99, \"Surveillance\", ROUND(D51*INTRO!$E$51,0))), 0),\"Not required\")","v":0},{"$f":"IF(INTRO!$E$41=\"Endemic\", IF($J51>1, IF($J51=4, \"Unknown\", IF($J51=99, \"Surveillance\", SUM($N51:$P51))), 0),\"Not required\")","v":0},{"$f":"IF(INTRO!$E$43=\"Endemic\", IF($K51>1, IF($K51=4, \"Unknown\", IF($K51=99, \"Surveillance\", ROUND(E51*0.75,0))), 0),\"Not required\")","v":1103},{"$f":"IF(INTRO!$E$43=\"Endemic\", IF($K51>1, IF($K51=4, \"Unknown\", IF($K51=99, \"Surveillance\", F51)), 0),\"Not required\")","v":3647},{"$f":"IF(INTRO!$E$43=\"Endemic\", IF($K51>1, IF($K51=4, \"Unknown\", IF($K51=99, \"Surveillance\", G51)), 0),\"Not required\")","v":10179},{"$f":"IF(INTRO!$E$43=\"Endemic\", IF($K51>1, IF($K51=4, \"Unknown\", IF($K51=99, \"Surveillance\", SUM($R51:$T51))), 0),\"Not required\")","v":14929},null,null,0,1,null,null,null,null,null,null,null,null,45444,"Ntondozi",null,15532.026794290001]
[{"$f":"IF(INTRO!$E$33<>0,INTRO!$E$33, \" \")","v":"Eswatini"},"MANZINI","Nkomiyahlaba",14696,{"$f":"IF(INTRO!$E$48=\"\",\"\",ROUND($D52*INTRO!$E$48,0))","v":1380},{"$f":"IF(INTRO!$E$49=\"\",\"\",ROUND($D52*INTRO!$E$49,0))","v":3421},{"$f":"IF(INTRO!$E$50=\"\",\"\",ROUND($D52*INTRO!$E$50,0))","v":9548},null,null,1,2,{"$f":"IF(INTRO!$E$37=\"Endemic\",IF($H52>0,IF($H52=4,\"Unknown\",IF($H52=99,\"Stopped\",$D52)),0),\"Not required\")","v":"Not required"},{"$f":"IF(INTRO!$E$39=\"Endemic\", IF($I52>0, IF($I52=4,\"Unknown\",IF($I52=99,\"Stopped\",$D52)), 0),\"Not required\")","v":"Not required"},{"$f":"IF(INTRO!$E$41=\"Endemic\", IF($J52>1, IF($J52=4, \"Unknown\", IF($J52=99, \"Surveillance\", E52)), 0),\"Not required\")","v":0},{"$f":"IF(INTRO!$E$41=\"Endemic\", IF($J52>1, IF($J52=4, \"Unknown\", IF($J52=99, \"Surveillance\", F52)), 0),\"Not required\")","v":0},{"$f":"IF(INTRO!$E$41=\"Endemic\", IF($J52>1, IF($J52=4, \"Unknown\", IF($J52=99, \"Surveillance\", ROUND(D52*INTRO!$E$51,0))), 0),\"Not required\")","v":0},{"$f":"IF(INTRO!$E$41=\"Endemic\", IF($J52>1, IF($J52=4, \"Unknown\", IF($J52=99, \"Surveillance\", SUM($N52:$P52))), 0),\"Not required\")","v":0},{"$f":"IF(INTRO!$E$43=\"Endemic\", IF($K52>1, IF($K52=4, \"Unknown\", IF($K52=99, \"Surveillance\", ROUND(E52*0.75,0))), 0),\"Not required\")","v":1035},{"$f":"IF(INTRO!$E$43=\"Endemic\", IF($K52>1, IF($K52=4, \"Unknown\", IF($K52=99, \"Surveillance\", F52)), 0),\"Not required\")","v":3421},{"$f":"IF(INTRO!$E$43=\"Endemic\", IF($K52>1, IF($K52=4, \"Unknown\", IF($K52=99, \"Surveillance\", G52)), 0),\"Not required\")","v":9548},{"$f":"IF(INTRO!$E$43=\"Endemic\", IF($K52>1, IF($K52=4, \"Unknown\", IF($K52=99, \"Surveillance\", SUM($R52:$T52))), 0),\"Not required\")","v":14004},null,null,0,1,null,null,null,null,null,null,null,null,45461,"Nkomiyahlaba",null,14569.24307285]
[{"$f":"IF(INTRO!$E$33<>0,INTRO!$E$33, \" \")","v":"Eswatini"},"MANZINI","Phondo",24650,{"$f":"IF(INTRO!$E$48=\"\",\"\",ROUND($D53*INTRO!$E$48,0))","v":2315},{"$f":"IF(INTRO!$E$49=\"\",\"\",ROUND($D53*INTRO!$E$49,0))","v":5739},{"$f":"IF(INTRO!$E$50=\"\",\"\",ROUND($D53*INTRO!$E$50,0))","v":16015},null,null,1,2,{"$f":"IF(INTRO!$E$37=\"Endemic\",IF($H53>0,IF($H53=4,\"Unknown\",IF($H53=99,\"Stopped\",$D53)),0),\"Not required\")","v":"Not required"},{"$f":"IF(INTRO!$E$39=\"Endemic\", IF($I53>0, IF($I53=4,\"Unknown\",IF($I53=99,\"Stopped\",$D53)), 0),\"Not required\")","v":"Not required"},{"$f":"IF(INTRO!$E$41=\"Endemic\", IF($J53>1, IF($J53=4, \"Unknown\", IF($J53=99, \"Surveillance\", E53)), 0),\"Not required\")","v":0},{"$f":"IF(INTRO!$E$41=\"Endemic\", IF($J53>1, IF($J53=4, \"Unknown\", IF($J53=99, \"Surveillance\", F53)), 0),\"Not required\")","v":0},{"$f":"IF(INTRO!$E$41=\"Endemic\", IF($J53>1, IF($J53=4, \"Unknown\", IF($J53=99, \"Surveillance\", ROUND(D53*INTRO!$E$51,0))), 0),\"Not required\")","v":0},{"$f":"IF(INTRO!$E$41=\"Endemic\", IF($J53>1, IF($J53=4, \"Unknown\", IF($J53=99, \"Surveillance\", SUM($N53:$P53))), 0),\"Not required\")","v":0},{"$f":"IF(INTRO!$E$43=\"Endemic\", IF($K53>1, IF($K53=4, \"Unknown\", IF($K53=99, \"Surveillance\", ROUND(E53*0.75,0))), 0),\"Not required\")","v":1736},{"$f":"IF(INTRO!$E$43=\"Endemic\", IF($K53>1, IF($K53=4, \"Unknown\", IF($K53=99, \"Surveillance\", F53)), 0),\"Not required\")","v":5739},{"$f":"IF(INTRO!$E$43=\"Endemic\", IF($K53>1, IF($K53=4, \"Unknown\", IF($K53=99, \"Surveillance\", G53)), 0),\"Not required\")","v":16015},{"$f":"IF(INTRO!$E$43=\"Endemic\", IF($K53>1, IF($K53=4, \"Unknown\", IF($K53=99, \"Surveillance\", SUM($R53:$T53))), 0),\"Not required\")","v":23490},null,null,0,1,null,null,null,null,null,null,null,null,45462,"Phondo",null,24437.77621761]
[{"$f":"IF(INTRO!$E$33<>0,INTRO!$E$33, \" \")","v":"Eswatini"},"SHISELWENI","Gege",18734,{"$f":"IF(INTRO!$E$48=\"\",\"\",ROUND($D54*INTRO!$E$48,0))","v":1759},{"$f":"IF(INTRO!$E$49=\"\",\"\",ROUND($D54*INTRO!$E$49,0))","v":4361},{"$f":"IF(INTRO!$E$50=\"\",\"\",ROUND($D54*INTRO!$E$50,0))","v":12171},null,null,1,1,{"$f":"IF(INTRO!$E$37=\"Endemic\",IF($H54>0,IF($H54=4,\"Unknown\",IF($H54=99,\"Stopped\",$D54)),0),\"Not required\")","v":"Not required"},{"$f":"IF(INTRO!$E$39=\"Endemic\", IF($I54>0, IF($I54=4,\"Unknown\",IF($I54=99,\"Stopped\",$D54)), 0),\"Not required\")","v":"Not required"},{"$f":"IF(INTRO!$E$41=\"Endemic\", IF($J54>1, IF($J54=4, \"Unknown\", IF($J54=99, \"Surveillance\", E54)), 0),\"Not required\")","v":0},{"$f":"IF(INTRO!$E$41=\"Endemic\", IF($J54>1, IF($J54=4, \"Unknown\", IF($J54=99, \"Surveillance\", F54)), 0),\"Not required\")","v":0},{"$f":"IF(INTRO!$E$41=\"Endemic\", IF($J54>1, IF($J54=4, \"Unknown\", IF($J54=99, \"Surveillance\", ROUND(D54*INTRO!$E$51,0))), 0),\"Not required\")","v":0},{"$f":"IF(INTRO!$E$41=\"Endemic\", IF($J54>1, IF($J54=4, \"Unknown\", IF($J54=99, \"Surveillance\", SUM($N54:$P54))), 0),\"Not required\")","v":0},{"$f":"IF(INTRO!$E$43=\"Endemic\", IF($K54>1, IF($K54=4, \"Unknown\", IF($K54=99, \"Surveillance\", ROUND(E54*0.75,0))), 0),\"Not required\")","v":0},{"$f":"IF(INTRO!$E$43=\"Endemic\", IF($K54>1, IF($K54=4, \"Unknown\", IF($K54=99, \"Surveillance\", F54)), 0),\"Not required\")","v":0},{"$f":"IF(INTRO!$E$43=\"Endemic\", IF($K54>1, IF($K54=4, \"Unknown\", IF($K54=99, \"Surveillance\", G54)), 0),\"Not required\")","v":0},{"$f":"IF(INTRO!$E$43=\"Endemic\", IF($K54>1, IF($K54=4, \"Unknown\", IF($K54=99, \"Surveillance\", SUM($R54:$T54))), 0),\"Not required\")","v":0},null,null,0,0,null,null,null,null,null,null,null,null,45445,"Gege",null,18572.342762099997]
[{"$f":"IF(INTRO!$E$33<>0,INTRO!$E$33, \" \")","v":"Eswatini"},"SHISELWENI","Hosea",15586,{"$f":"IF(INTRO!$E$48=\"\",\"\",ROUND($D55*INTRO!$E$48,0))","v":1464},{"$f":"IF(INTRO!$E$49=\"\",\"\",ROUND($D55*INTRO!$E$49,0))","v":3628},{"$f":"IF(INTRO!$E$50=\"\",\"\",ROUND($D55*INTRO!$E$50,0))","v":10126},null,null,0,2,{"$f":"IF(INTRO!$E$37=\"Endemic\",IF($H55>0,IF($H55=4,\"Unknown\",IF($H55=99,\"Stopped\",$D55)),0),\"Not required\")","v":"Not required"},{"$f":"IF(INTRO!$E$39=\"Endemic\", IF($I55>0, IF($I55=4,\"Unknown\",IF($I55=99,\"Stopped\",$D55)), 0),\"Not required\")","v":"Not required"},{"$f":"IF(INTRO!$E$41=\"Endemic\", IF($J55>1, IF($J55=4, \"Unknown\", IF($J55=99, \"Surveillance\", E55)), 0),\"Not required\")","v":0},{"$f":"IF(INTRO!$E$41=\"Endemic\", IF($J55>1, IF($J55=4, \"Unknown\", IF($J55=99, \"Surveillance\", F55)), 0),\"Not required\")","v":0},{"$f":"IF(INTRO!$E$41=\"Endemic\", IF($J55>1, IF($J55=4, \"Unknown\", IF($J55=99, \"Surveillance\", ROUND(D55*INTRO!$E$51,0))), 0),\"Not required\")","v":0},{"$f":"IF(INTRO!$E$41=\"Endemic\", IF($J55>1, IF($J55=4, \"Unknown\", IF($J55=99, \"Surveillance\", SUM($N55:$P55))), 0),\"Not required\")","v":0},{"$f":"IF(INTRO!$E$43=\"Endemic\", IF($K55>1, IF($K55=4, \"Unknown\", IF($K55=99, \"Surveillance\", ROUND(E55*0.75,0))), 0),\"Not required\")","v":1098},{"$f":"IF(INTRO!$E$43=\"Endemic\", IF($K55>1, IF($K55=4, \"Unknown\", IF($K55=99, \"Surveillance\", F55)), 0),\"Not required\")","v":3628},{"$f":"IF(INTRO!$E$43=\"Endemic\", IF($K55>1, IF($K55=4, \"Unknown\", IF($K55=99, \"Surveillance\", G55)), 0),\"Not required\")","v":10126},{"$f":"IF(INTRO!$E$43=\"Endemic\", IF($K55>1, IF($K55=4, \"Unknown\", IF($K55=99, \"Surveillance\", SUM($R55:$T55))), 0),\"Not required\")","v":14852},null,null,0,1,null,null,null,null,null,null,null,null,45446,"Hosea",null,15451.454851500001]
[{"$f":"IF(INTRO!$E$33<>0,INTRO!$E$33, \" \")","v":"Eswatini"},"SHISELWENI","Khubutha",6190,{"$f":"IF(INTRO!$E$48=\"\",\"\",ROUND($D56*INTRO!$E$48,0))","v":581},{"$f":"IF(INTRO!$E$49=\"\",\"\",ROUND($D56*INTRO!$E$49,0))","v":1441},{"$f":"IF(INTRO!$E$50=\"\",\"\",ROUND($D56*INTRO!$E$50,0))","v":4022},null,null,1,2,{"$f":"IF(INTRO!$E$37=\"Endemic\",IF($H56>0,IF($H56=4,\"Unknown\",IF($H56=99,\"Stopped\",$D56)),0),\"Not required\")","v":"Not required"},{"$f":"IF(INTRO!$E$39=\"Endemic\", IF($I56>0, IF($I56=4,\"Unknown\",IF($I56=99,\"Stopped\",$D56)), 0),\"Not required\")","v":"Not required"},{"$f":"IF(INTRO!$E$41=\"Endemic\", IF($J56>1, IF($J56=4, \"Unknown\", IF($J56=99, \"Surveillance\", E56)), 0),\"Not required\")","v":0},{"$f":"IF(INTRO!$E$41=\"Endemic\", IF($J56>1, IF($J56=4, \"Unknown\", IF($J56=99, \"Surveillance\", F56)), 0),\"Not required\")","v":0},{"$f":"IF(INTRO!$E$41=\"Endemic\", IF($J56>1, IF($J56=4, \"Unknown\", IF($J56=99, \"Surveillance\", ROUND(D56*INTRO!$E$51,0))), 0),\"Not required\")","v":0},{"$f":"IF(INTRO!$E$41=\"Endemic\", IF($J56>1, IF($J56=4, \"Unknown\", IF($J56=99, \"Surveillance\", SUM($N56:$P56))), 0),\"Not required\")","v":0},{"$f":"IF(INTRO!$E$43=\"Endemic\", IF($K56>1, IF($K56=4, \"Unknown\", IF($K56=99, \"Surveillance\", ROUND(E56*0.75,0))), 0),\"Not required\")","v":436},{"$f":"IF(INTRO!$E$43=\"Endemic\", IF($K56>1, IF($K56=4, \"Unknown\", IF($K56=99, \"Surveillance\", F56)), 0),\"Not required\")","v":1441},{"$f":"IF(INTRO!$E$43=\"Endemic\", IF($K56>1, IF($K56=4, \"Unknown\", IF($K56=99, \"Surveillance\", G56)), 0),\"Not required\")","v":4022},{"$f":"IF(INTRO!$E$43=\"Endemic\", IF($K56>1, IF($K56=4, \"Unknown\", IF($K56=99, \"Surveillance\", SUM($R56:$T56))), 0),\"Not required\")","v":5899},null,null,0,1,null,null,null,null,null,null,null,null,45447,"Kubuta",null,6136.72632617]
[{"$f":"IF(INTRO!$E$33<>0,INTRO!$E$33, \" \")","v":"Eswatini"},"SHISELWENI","Maseyisini",31317,{"$f":"IF(INTRO!$E$48=\"\",\"\",ROUND($D57*INTRO!$E$48,0))","v":2941},{"$f":"IF(INTRO!$E$49=\"\",\"\",ROUND($D57*INTRO!$E$49,0))","v":7291},{"$f":"IF(INTRO!$E$50=\"\",\"\",ROUND($D57*INTRO!$E$50,0))","v":20347},null,null,1,2,{"$f":"IF(INTRO!$E$37=\"Endemic\",IF($H57>0,IF($H57=4,\"Unknown\",IF($H57=99,\"Stopped\",$D57)),0),\"Not required\")","v":"Not required"},{"$f":"IF(INTRO!$E$39=\"Endemic\", IF($I57>0, IF($I57=4,\"Unknown\",IF($I57=99,\"Stopped\",$D57)), 0),\"Not required\")","v":"Not required"},{"$f":"IF(INTRO!$E$41=\"Endemic\", IF($J57>1, IF($J57=4, \"Unknown\", IF($J57=99, \"Surveillance\", E57)), 0),\"Not required\")","v":0},{"$f":"IF(INTRO!$E$41=\"Endemic\", IF($J57>1, IF($J57=4, \"Unknown\", IF($J57=99, \"Surveillance\", F57)), 0),\"Not required\")","v":0},{"$f":"IF(INTRO!$E$41=\"Endemic\", IF($J57>1, IF($J57=4, \"Unknown\", IF($J57=99, \"Surveillance\", ROUND(D57*INTRO!$E$51,0))), 0),\"Not required\")","v":0},{"$f":"IF(INTRO!$E$41=\"Endemic\", IF($J57>1, IF($J57=4, \"Unknown\", IF($J57=99, \"Surveillance\", SUM($N57:$P57))), 0),\"Not required\")","v":0},{"$f":"IF(INTRO!$E$43=\"Endemic\", IF($K57>1, IF($K57=4, \"Unknown\", IF($K57=99, \"Surveillance\", ROUND(E57*0.75,0))), 0),\"Not required\")","v":2206},{"$f":"IF(INTRO!$E$43=\"Endemic\", IF($K57>1, IF($K57=4, \"Unknown\", IF($K57=99, \"Surveillance\", F57)), 0),\"Not required\")","v":7291},{"$f":"IF(INTRO!$E$43=\"Endemic\", IF($K57>1, IF($K57=4, \"Unknown\", IF($K57=99, \"Surveillance\", G57)), 0),\"Not required\")","v":20347},{"$f":"IF(INTRO!$E$43=\"Endemic\", IF($K57>1, IF($K57=4, \"Unknown\", IF($K57=99, \"Surveillance\", SUM($R57:$T57))), 0),\"Not required\")","v":29844},null,null,0,1,null,null,null,null,null,null,null,null,45449,"Maseyisini",null,31046.71532241]
[{"$f":"IF(INTRO!$E$33<>0,INTRO!$E$33, \" \")","v":"Eswatini"},"SHISELWENI","Matsanjeni South",11127,{"$f":"IF(INTRO!$E$48=\"\",\"\",ROUND($D58*INTRO!$E$48,0))","v":1045},{"$f":"IF(INTRO!$E$49=\"\",\"\",ROUND($D58*INTRO!$E$49,0))","v":2590},{"$f":"IF(INTRO!$E$50=\"\",\"\",ROUND($D58*INTRO!$E$50,0))","v":7229},null,null,1,1,{"$f":"IF(INTRO!$E$37=\"Endemic\",IF($H58>0,IF($H58=4,\"Unknown\",IF($H58=99,\"Stopped\",$D58)),0),\"Not required\")","v":"Not required"},{"$f":"IF(INTRO!$E$39=\"Endemic\", IF($I58>0, IF($I58=4,\"Unknown\",IF($I58=99,\"Stopped\",$D58)), 0),\"Not required\")","v":"Not required"},{"$f":"IF(INTRO!$E$41=\"Endemic\", IF($J58>1, IF($J58=4, \"Unknown\", IF($J58=99, \"Surveillance\", E58)), 0),\"Not required\")","v":0},{"$f":"IF(INTRO!$E$41=\"Endemic\", IF($J58>1, IF($J58=4, \"Unknown\", IF($J58=99, \"Surveillance\", F58)), 0),\"Not required\")","v":0},{"$f":"IF(INTRO!$E$41=\"Endemic\", IF($J58>1, IF($J58=4, \"Unknown\", IF($J58=99, \"Surveillance\", ROUND(D58*INTRO!$E$51,0))), 0),\"Not required\")","v":0},{"$f":"IF(INTRO!$E$41=\"Endemic\", IF($J58>1, IF($J58=4, \"Unknown\", IF($J58=99, \"Surveillance\", SUM($N58:$P58))), 0),\"Not required\")","v":0},{"$f":"IF(INTRO!$E$43=\"Endemic\", IF($K58>1, IF($K58=4, \"Unknown\", IF($K58=99, \"Surveillance\", ROUND(E58*0.75,0))), 0),\"Not required\")","v":0},{"$f":"IF(INTRO!$E$43=\"Endemic\", IF($K58>1, IF($K58=4, \"Unknown\", IF($K58=99, \"Surveillance\", F58)), 0),\"Not required\")","v":0},{"$f":"IF(INTRO!$E$43=\"Endemic\", IF($K58>1, IF($K58=4, \"Unknown\", IF($K58=99, \"Surveillance\", G58)), 0),\"Not required\")","v":0},{"$f":"IF(INTRO!$E$43=\"Endemic\", IF($K58>1, IF($K58=4, \"Unknown\", IF($K58=99, \"Surveillance\", SUM($R58:$T58))), 0),\"Not required\")","v":0},null,null,0,0,null,null,null,null,null,null,null,null,45450,"Matsanjeni South",null,11031.216876160001]
[{"$f":"IF(INTRO!$E$33<>0,INTRO!$E$33, \" \")","v":"Eswatini"},"SHISELWENI","Methula",18955,{"$f":"IF(INTRO!$E$48=\"\",\"\",ROUND($D59*INTRO!$E$48,0))","v":1780},{"$f":"IF(INTRO!$E$49=\"\",\"\",ROUND($D59*INTRO!$E$49,0))","v":4413},{"$f":"IF(INTRO!$E$50=\"\",\"\",ROUND($D59*INTRO!$E$50,0))","v":12315},null,null,1,2,{"$f":"IF(INTRO!$E$37=\"Endemic\",IF($H59>0,IF($H59=4,\"Unknown\",IF($H59=99,\"Stopped\",$D59)),0),\"Not required\")","v":"Not required"},{"$f":"IF(INTRO!$E$39=\"Endemic\", IF($I59>0, IF($I59=4,\"Unknown\",IF($I59=99,\"Stopped\",$D59)), 0),\"Not required\")","v":"Not required"},{"$f":"IF(INTRO!$E$41=\"Endemic\", IF($J59>1, IF($J59=4, \"Unknown\", IF($J59=99, \"Surveillance\", E59)), 0),\"Not required\")","v":0},{"$f":"IF(INTRO!$E$41=\"Endemic\", IF($J59>1, IF($J59=4, \"Unknown\", IF($J59=99, \"Surveillance\", F59)), 0),\"Not required\")","v":0},{"$f":"IF(INTRO!$E$41=\"Endemic\", IF($J59>1, IF($J59=4, \"Unknown\", IF($J59=99, \"Surveillance\", ROUND(D59*INTRO!$E$51,0))), 0),\"Not required\")","v":0},{"$f":"IF(INTRO!$E$41=\"Endemic\", IF($J59>1, IF($J59=4, \"Unknown\", IF($J59=99, \"Surveillance\", SUM($N59:$P59))), 0),\"Not required\")","v":0},{"$f":"IF(INTRO!$E$43=\"Endemic\", IF($K59>1, IF($K59=4, \"Unknown\", IF($K59=99, \"Surveillance\", ROUND(E59*0.75,0))), 0),\"Not required\")","v":1335},{"$f":"IF(INTRO!$E$43=\"Endemic\", IF($K59>1, IF($K59=4, \"Unknown\", IF($K59=99, \"Surveillance\", F59)), 0),\"Not required\")","v":4413},{"$f":"IF(INTRO!$E$43=\"Endemic\", IF($K59>1, IF($K59=4, \"Unknown\", IF($K59=99, \"Surveillance\", G59)), 0),\"Not required\")","v":12315},{"$f":"IF(INTRO!$E$43=\"Endemic\", IF($K59>1, IF($K59=4, \"Unknown\", IF($K59=99, \"Surveillance\", SUM($R59:$T59))), 0),\"Not required\")","v":18063},null,null,0,1,null,null,null,null,null,null,null,null,45463,"Methula",null,18791.620834250003]
[{"$f":"IF(INTRO!$E$33<>0,INTRO!$E$33, \" \")","v":"Eswatini"},"SHISELWENI","Mbangweni/Shiselweni 2",34188,{"$f":"IF(INTRO!$E$48=\"\",\"\",ROUND($D60*INTRO!$E$48,0))","v":3210},{"$f":"IF(INTRO!$E$49=\"\",\"\",ROUND($D60*INTRO!$E$49,0))","v":7959},{"$f":"IF(INTRO!$E$50=\"\",\"\",ROUND($D60*INTRO!$E$50,0))","v":22212},null,null,1,2,{"$f":"IF(INTRO!$E$37=\"Endemic\",IF($H60>0,IF($H60=4,\"Unknown\",IF($H60=99,\"Stopped\",$D60)),0),\"Not required\")","v":"Not required"},{"$f":"IF(INTRO!$E$39=\"Endemic\", IF($I60>0, IF($I60=4,\"Unknown\",IF($I60=99,\"Stopped\",$D60)), 0),\"Not required\")","v":"Not required"},{"$f":"IF(INTRO!$E$41=\"Endemic\", IF($J60>1, IF($J60=4, \"Unknown\", IF($J60=99, \"Surveillance\", E60)), 0),\"Not required\")","v":0},{"$f":"IF(INTRO!$E$41=\"Endemic\", IF($J60>1, IF($J60=4, \"Unknown\", IF($J60=99, \"Surveillance\", F60)), 0),\"Not required\")","v":0},{"$f":"IF(INTRO!$E$41=\"Endemic\", IF($J60>1, IF($J60=4, \"Unknown\", IF($J60=99, \"Surveillance\", ROUND(D60*INTRO!$E$51,0))), 0),\"Not required\")","v":0},{"$f":"IF(INTRO!$E$41=\"Endemic\", IF($J60>1, IF($J60=4, \"Unknown\", IF($J60=99, \"Surveillance\", SUM($N60:$P60))), 0),\"Not required\")","v":0},{"$f":"IF(INTRO!$E$43=\"Endemic\", IF($K60>1, IF($K60=4, \"Unknown\", IF($K60=99, \"Surveillance\", ROUND(E60*0.75,0))), 0),\"Not required\")","v":2408},{"$f":"IF(INTRO!$E$43=\"Endemic\", IF($K60>1, IF($K60=4, \"Unknown\", IF($K60=99, \"Surveillance\", F60)), 0),\"Not required\")","v":7959},{"$f":"IF(INTRO!$E$43=\"Endemic\", IF($K60>1, IF($K60=4, \"Unknown\", IF($K60=99, \"Surveillance\", G60)), 0),\"Not required\")","v":22212},{"$f":"IF(INTRO!$E$43=\"Endemic\", IF($K60>1, IF($K60=4, \"Unknown\", IF($K60=99, \"Surveillance\", SUM($R60:$T60))), 0),\"Not required\")","v":32579},null,null,0,1,null,null,null,null,null,null,null,null,45451,"Shiselweni 2",null,33893.250668320004]
[{"$f":"IF(INTRO!$E$33<>0,INTRO!$E$33, \" \")","v":"Eswatini"},"SHISELWENI","Mtsambama",19227,{"$f":"IF(INTRO!$E$48=\"\",\"\",ROUND($D61*INTRO!$E$48,0))","v":1805},{"$f":"IF(INTRO!$E$49=\"\",\"\",ROUND($D61*INTRO!$E$49,0))","v":4476},{"$f":"IF(INTRO!$E$50=\"\",\"\",ROUND($D61*INTRO!$E$50,0))","v":12492},null,null,1,2,{"$f":"IF(INTRO!$E$37=\"Endemic\",IF($H61>0,IF($H61=4,\"Unknown\",IF($H61=99,\"Stopped\",$D61)),0),\"Not required\")","v":"Not required"},{"$f":"IF(INTRO!$E$39=\"Endemic\", IF($I61>0, IF($I61=4,\"Unknown\",IF($I61=99,\"Stopped\",$D61)), 0),\"Not required\")","v":"Not required"},{"$f":"IF(INTRO!$E$41=\"Endemic\", IF($J61>1, IF($J61=4, \"Unknown\", IF($J61=99, \"Surveillance\", E61)), 0),\"Not required\")","v":0},{"$f":"IF(INTRO!$E$41=\"Endemic\", IF($J61>1, IF($J61=4, \"Unknown\", IF($J61=99, \"Surveillance\", F61)), 0),\"Not required\")","v":0},{"$f":"IF(INTRO!$E$41=\"Endemic\", IF($J61>1, IF($J61=4, \"Unknown\", IF($J61=99, \"Surveillance\", ROUND(D61*INTRO!$E$51,0))), 0),\"Not required\")","v":0},{"$f":"IF(INTRO!$E$41=\"Endemic\", IF($J61>1, IF($J61=4, \"Unknown\", IF($J61=99, \"Surveillance\", SUM($N61:$P61))), 0),\"Not required\")","v":0},{"$f":"IF(INTRO!$E$43=\"Endemic\", IF($K61>1, IF($K61=4, \"Unknown\", IF($K61=99, \"Surveillance\", ROUND(E61*0.75,0))), 0),\"Not required\")","v":1354},{"$f":"IF(INTRO!$E$43=\"Endemic\", IF($K61>1, IF($K61=4, \"Unknown\", IF($K61=99, \"Surveillance\", F61)), 0),\"Not required\")","v":4476},{"$f":"IF(INTRO!$E$43=\"Endemic\", IF($K61>1, IF($K61=4, \"Unknown\", IF($K61=99, \"Surveillance\", G61)), 0),\"Not required\")","v":12492},{"$f":"IF(INTRO!$E$43=\"Endemic\", IF($K61>1, IF($K61=4, \"Unknown\", IF($K61=99, \"Surveillance\", SUM($R61:$T61))), 0),\"Not required\")","v":18322},null,null,0,1,null,null,null,null,null,null,null,null,45452,"Mtsambama",null,19060.873908890004]
[{"$f":"IF(INTRO!$E$33<>0,INTRO!$E$33, \" \")","v":"Eswatini"},"SHISELWENI","Ngudzeni",9381,{"$f":"IF(INTRO!$E$48=\"\",\"\",ROUND($D62*INTRO!$E$48,0))","v":881},{"$f":"IF(INTRO!$E$49=\"\",\"\",ROUND($D62*INTRO!$E$49,0))","v":2184},{"$f":"IF(INTRO!$E$50=\"\",\"\",ROUND($D62*INTRO!$E$50,0))","v":6095},null,null,1,3,{"$f":"IF(INTRO!$E$37=\"Endemic\",IF($H62>0,IF($H62=4,\"Unknown\",IF($H62=99,\"Stopped\",$D62)),0),\"Not required\")","v":"Not required"},{"$f":"IF(INTRO!$E$39=\"Endemic\", IF($I62>0, IF($I62=4,\"Unknown\",IF($I62=99,\"Stopped\",$D62)), 0),\"Not required\")","v":"Not required"},{"$f":"IF(INTRO!$E$41=\"Endemic\", IF($J62>1, IF($J62=4, \"Unknown\", IF($J62=99, \"Surveillance\", E62)), 0),\"Not required\")","v":0},{"$f":"IF(INTRO!$E$41=\"Endemic\", IF($J62>1, IF($J62=4, \"Unknown\", IF($J62=99, \"Surveillance\", F62)), 0),\"Not required\")","v":0},{"$f":"IF(INTRO!$E$41=\"Endemic\", IF($J62>1, IF($J62=4, \"Unknown\", IF($J62=99, \"Surveillance\", ROUND(D62*INTRO!$E$51,0))), 0),\"Not required\")","v":0},{"$f":"IF(INTRO!$E$41=\"Endemic\", IF($J62>1, IF($J62=4, \"Unknown\", IF($J62=99, \"Surveillance\", SUM($N62:$P62))), 0),\"Not required\")","v":0},{"$f":"IF(INTRO!$E$43=\"Endemic\", IF($K62>1, IF($K62=4, \"Unknown\", IF($K62=99, \"Surveillance\", ROUND(E62*0.75,0))), 0),\"Not required\")","v":661},{"$f":"IF(INTRO!$E$43=\"Endemic\", IF($K62>1, IF($K62=4, \"Unknown\", IF($K62=99, \"Surveillance\", F62)), 0),\"Not required\")","v":2184},{"$f":"IF(INTRO!$E$43=\"Endemic\", IF($K62>1, IF($K62=4, \"Unknown\", IF($K62=99, \"Surveillance\", G62)), 0),\"Not required\")","v":6095},{"$f":"IF(INTRO!$E$43=\"Endemic\", IF($K62>1, IF($K62=4, \"Unknown\", IF($K62=99, \"Surveillance\", SUM($R62:$T62))), 0),\"Not required\")","v":8940},null,null,0,1,null,null,null,null,null,null,null,null,45453,"Ngudzeni",null,9300.4499531900001]
[{"$f":"IF(INTRO!$E$33<>0,INTRO!$E$33, \" \")","v":"Eswatini"},"SHISELWENI","Nkwene",7157,{"$f":"IF(INTRO!$E$48=\"\",\"\",ROUND($D63*INTRO!$E$48,0))","v":672},{"$f":"IF(INTRO!$E$49=\"\",\"\",ROUND($D63*INTRO!$E$49,0))","v":1666},{"$f":"IF(INTRO!$E$50=\"\",\"\",ROUND($D63*INTRO!$E$50,0))","v":4650},null,null,1,2,{"$f":"IF(INTRO!$E$37=\"Endemic\",IF($H63>0,IF($H63=4,\"Unknown\",IF($H63=99,\"Stopped\",$D63)),0),\"Not required\")","v":"Not required"},{"$f":"IF(INTRO!$E$39=\"Endemic\", IF($I63>0, IF($I63=4,\"Unknown\",IF($I63=99,\"Stopped\",$D63)), 0),\"Not required\")","v":"Not required"},{"$f":"IF(INTRO!$E$41=\"Endemic\", IF($J63>1, IF($J63=4, \"Unknown\", IF($J63=99, \"Surveillance\", E63)), 0),\"Not required\")","v":0},{"$f":"IF(INTRO!$E$41=\"Endemic\", IF($J63>1, IF($J63=4, \"Unknown\", IF($J63=99, \"Surveillance\", F63)), 0),\"Not required\")","v":0},{"$f":"IF(INTRO!$E$41=\"Endemic\", IF($J63>1, IF($J63=4, \"Unknown\", IF($J63=99, \"Surveillance\", ROUND(D63*INTRO!$E$51,0))), 0),\"Not required\")","v":0},{"$f":"IF(INTRO!$E$41=\"Endemic\", IF($J63>1, IF($J63=4, \"Unknown\", IF($J63=99, \"Surveillance\", SUM($N63:$P63))), 0),\"Not required\")","v":0},{"$f":"IF(INTRO!$E$43=\"Endemic\", IF($K63>1, IF($K63=4, \"Unknown\", IF($K63=99, \"Surveillance\", ROUND(E63*0.75,0))), 0),\"Not required\")","v":504},{"$f":"IF(INTRO!$E$43=\"Endemic\", IF($K63>1, IF($K63=4, \"Unknown\", IF($K63=99, \"Surveillance\", F63)), 0),\"Not required\")","v":1666},{"$f":"IF(INTRO!$E$43=\"Endemic\", IF($K63>1, IF($K63=4, \"Unknown\", IF($K63=99, \"Surveillance\", G63)), 0),\"Not required\")","v":4650},{"$f":"IF(INTRO!$E$43=\"Endemic\", IF($K63>1, IF($K63=4, \"Unknown\", IF($K63=99, \"Surveillance\", SUM($R63:$T63))), 0),\"Not required\")","v":6820},null,null,0,1,null,null,null,null,null,null,null,null,45454,"Nkwene",null,7095.430455570001]
[{"$f":"IF(INTRO!$E$33<>0,INTRO!$E$33, \" \")","v":"Eswatini"},"SHISELWENI","Sandleni",18910,{"$f":"IF(INTRO!$E$48=\"\",\"\",ROUND($D64*INTRO!$E$48,0))","v":1776},{"$f":"IF(INTRO!$E$49=\"\",\"\",ROUND($D64*INTRO!$E$49,0))","v":4402},{"$f":"IF(INTRO!$E$50=\"\",\"\",ROUND($D64*INTRO!$E$50,0))","v":12286},null,null,1,2,{"$f":"IF(INTRO!$E$37=\"Endemic\",IF($H64>0,IF($H64=4,\"Unknown\",IF($H64=99,\"Stopped\",$D64)),0),\"Not required\")","v":"Not required"},{"$f":"IF(INTRO!$E$39=\"Endemic\", IF($I64>0, IF($I64=4,\"Unknown\",IF($I64=99,\"Stopped\",$D64)), 0),\"Not required\")","v":"Not required"},{"$f":"IF(INTRO!$E$41=\"Endemic\", IF($J64>1, IF($J64=4, \"Unknown\", IF($J64=99, \"Surveillance\", E64)), 0),\"Not required\")","v":0},{"$f":"IF(INTRO!$E$41=\"Endemic\", IF($J64>1, IF($J64=4, \"Unknown\", IF($J64=99, \"Surveillance\", F64)), 0),\"Not required\")","v":0},{"$f":"IF(INTRO!$E$41=\"Endemic\", IF($J64>1, IF($J64=4, \"Unknown\", IF($J64=99, \"Surveillance\", ROUND(D64*INTRO!$E$51,0))), 0),\"Not required\")","v":0},{"$f":"IF(INTRO!$E$41=\"Endemic\", IF($J64>1, IF($J64=4, \"Unknown\", IF($J64=99, \"Surveillance\", SUM($N64:$P64))), 0),\"Not required\")","v":0},{"$f":"IF(INTRO!$E$43=\"Endemic\", IF($K64>1, IF($K64=4, \"Unknown\", IF($K64=99, \"Surveillance\", ROUND(E64*0.75,0))), 0),\"Not required\")","v":1332},{"$f":"IF(INTRO!$E$43=\"Endemic\", IF($K64>1, IF($K64=4, \"Unknown\", IF($K64=99, \"Surveillance\", F64)), 0),\"Not required\")","v":4402},{"$f":"IF(INTRO!$E$43=\"Endemic\", IF($K64>1, IF($K64=4, \"Unknown\", IF($K64=99, \"Surveillance\", G64)), 0),\"Not required\")","v":12286},{"$f":"IF(INTRO!$E$43=\"Endemic\", IF($K64>1, IF($K64=4, \"Unknown\", IF($K64=99, \"Surveillance\", SUM($R64:$T64))), 0),\"Not required\")","v":18020},null,null,0,1,null,null,null,null,null,null,null,null,45455,"Sandleni",null,18746.745321810002]
[{"$f":"IF(INTRO!$E$33<>0,INTRO!$E$33, \" \")","v":"Eswatini"},"SHISELWENI","Shiselweni 1",9805,{"$f":"IF(INTRO!$E$48=\"\",\"\",ROUND($D65*INTRO!$E$48,0))","v":921},{"$f":"IF(INTRO!$E$49=\"\",\"\",ROUND($D65*INTRO!$E$49,0))","v":2283},{"$f":"IF(INTRO!$E$50=\"\",\"\",ROUND($D65*INTRO!$E$50,0))","v":6370},null,null,1,2,{"$f":"IF(INTRO!$E$37=\"Endemic\",IF($H65>0,IF($H65=4,\"Unknown\",IF($H65=99,\"Stopped\",$D65)),0),\"Not required\")","v":"Not required"},{"$f":"IF(INTRO!$E$39=\"Endemic\", IF($I65>0, IF($I65=4,\"Unknown\",IF($I65=99,\"Stopped\",$D65)), 0),\"Not required\")","v":"Not required"},{"$f":"IF(INTRO!$E$41=\"Endemic\", IF($J65>1, IF($J65=4, \"Unknown\", IF($J65=99, \"Surveillance\", E65)), 0),\"Not required\")","v":0},{"$f":"IF(INTRO!$E$41=\"Endemic\", IF($J65>1, IF($J65=4, \"Unknown\", IF($J65=99, \"Surveillance\", F65)), 0),\"Not required\")","v":0},{"$f":"IF(INTRO!$E$41=\"Endemic\", IF($J65>1, IF($J65=4, \"Unknown\", IF($J65=99, \"Surveillance\", ROUND(D65*INTRO!$E$51,0))), 0),\"Not required\")","v":0},{"$f":"IF(INTRO!$E$41=\"Endemic\", IF($J65>1, IF($J65=4, \"Unknown\", IF($J65=99, \"Surveillance\", SUM($N65:$P65))), 0),\"Not required\")","v":0},{"$f":"IF(INTRO!$E$43=\"Endemic\", IF($K65>1, IF($K65=4, \"Unknown\", IF($K65=99, \"Surveillance\", ROUND(E65*0.75,0))), 0),\"Not required\")","v":691},{"$f":"IF(INTRO!$E$43=\"Endemic\", IF($K65>1, IF($K65=4, \"Unknown\", IF($K65=99, \"Surveillance\", F65)), 0),\"Not required\")","v":2283},{"$f":"IF(INTRO!$E$43=\"Endemic\", IF($K65>1, IF($K65=4, \"Unknown\", IF($K65=99, \"Surveillance\", G65)), 0),\"Not required\")","v":6370},{"$f":"IF(INTRO!$E$43=\"Endemic\", IF($K65>1, IF($K65=4, \"Unknown\", IF($K65=99, \"Surveillance\", SUM($R65:$T65))), 0),\"Not required\")","v":9344},null,null,0,1,null,null,null,null,null,null,null,null,45456,"Shiselweni 1",null,9720.6479333100015]
[{"$f":"IF(INTRO!$E$33<>0,INTRO!$E$33, \" \")","v":"Eswatini"},"SHISELWENI","Sigwe",10408,{"$f":"IF(INTRO!$E$48=\"\",\"\",ROUND($D66*INTRO!$E$48,0))","v":977},{"$f":"IF(INTRO!$E$49=\"\",\"\",ROUND($D66*INTRO!$E$49,0))","v":2423},{"$f":"IF(INTRO!$E$50=\"\",\"\",ROUND($D66*INTRO!$E$50,0))","v":6762},null,null,1,2,{"$f":"IF(INTRO!$E$37=\"Endemic\",IF($H66>0,IF($H66=4,\"Unknown\",IF($H66=99,\"Stopped\",$D66)),0),\"Not required\")","v":"Not required"},{"$f":"IF(INTRO!$E$39=\"Endemic\", IF($I66>0, IF($I66=4,\"Unknown\",IF($I66=99,\"Stopped\",$D66)), 0),\"Not required\")","v":"Not required"},{"$f":"IF(INTRO!$E$41=\"Endemic\", IF($J66>1, IF($J66=4, \"Unknown\", IF($J66=99, \"Surveillance\", E66)), 0),\"Not required\")","v":0},{"$f":"IF(INTRO!$E$41=\"Endemic\", IF($J66>1, IF($J66=4, \"Unknown\", IF($J66=99, \"Surveillance\", F66)), 0),\"Not required\")","v":0},{"$f":"IF(INTRO!$E$41=\"Endemic\", IF($J66>1, IF($J66=4, \"Unknown\", IF($J66=99, \"Surveillance\", ROUND(D66*INTRO!$E$51,0))), 0),\"Not required\")","v":0},{"$f":"IF(INTRO!$E$41=\"Endemic\", IF($J66>1, IF($J66=4, \"Unknown\", IF($J66=99, \"Surveillance\", SUM($N66:$P66))), 0),\"Not required\")","v":0},{"$f":"IF(INTRO!$E$43=\"Endemic\", IF($K66>1, IF($K66=4, \"Unknown\", IF($K66=99, \"Surveillance\", ROUND(E66*0.75,0))), 0),\"Not required\")","v":733},{"$f":"IF(INTRO!$E$43=\"Endemic\", IF($K66>1, IF($K66=4, \"Unknown\", IF($K66=99, \"Surveillance\", F66)), 0),\"Not required\")","v":2423},{"$f":"IF(INTRO!$E$43=\"Endemic\", IF($K66>1, IF($K66=4, \"Unknown\", IF($K66=99, \"Surveillance\", G66)), 0),\"Not required\")","v":6762},{"$f":"IF(INTRO!$E$43=\"Endemic\", IF($K66>1, IF($K66=4, \"Unknown\", IF($K66=99, \"Surveillance\", SUM($R66:$T66))), 0),\"Not required\")","v":9918},null,null,0,1,null,null,null,null,null,null,null,null,45457,"Sigwe",null,10318.308167170002]
[{"$f":"IF(INTRO!$E$33<>0,INTRO!$E$33, \" \")","v":"Eswatini"},"SHISELWENI","Somntongo",8840,{"$f":"IF(INTRO!$E$48=\"\",\"\",ROUND($D67*INTRO!$E$48,0))","v":830},{"$f":"IF(INTRO!$E$49=\"\",\"\",ROUND($D67*INTRO!$E$49,0))","v":2058},{"$f":"IF(INTRO!$E$50=\"\",\"\",ROUND($D67*INTRO!$E$50,0))","v":5743},null,null,1,0,{"$f":"IF(INTRO!$E$37=\"Endemic\",IF($H67>0,IF($H67=4,\"Unknown\",IF($H67=99,\"Stopped\",$D67)),0),\"Not required\")","v":"Not required"},{"$f":"IF(INTRO!$E$39=\"Endemic\", IF($I67>0, IF($I67=4,\"Unknown\",IF($I67=99,\"Stopped\",$D67)), 0),\"Not required\")","v":"Not required"},{"$f":"IF(INTRO!$E$41=\"Endemic\", IF($J67>1, IF($J67=4, \"Unknown\", IF($J67=99, \"Surveillance\", E67)), 0),\"Not required\")","v":0},{"$f":"IF(INTRO!$E$41=\"Endemic\", IF($J67>1, IF($J67=4, \"Unknown\", IF($J67=99, \"Surveillance\", F67)), 0),\"Not required\")","v":0},{"$f":"IF(INTRO!$E$41=\"Endemic\", IF($J67>1, IF($J67=4, \"Unknown\", IF($J67=99, \"Surveillance\", ROUND(D67*INTRO!$E$51,0))), 0),\"Not required\")","v":0},{"$f":"IF(INTRO!$E$41=\"Endemic\", IF($J67>1, IF($J67=4, \"Unknown\", IF($J67=99, \"Surveillance\", SUM($N67:$P67))), 0),\"Not required\")","v":0},{"$f":"IF(INTRO!$E$43=\"Endemic\", IF($K67>1, IF($K67=4, \"Unknown\", IF($K67=99, \"Surveillance\", ROUND(E67*0.75,0))), 0),\"Not required\")","v":0},{"$f":"IF(INTRO!$E$43=\"Endemic\", IF($K67>1, IF($K67=4, \"Unknown\", IF($K67=99, \"Surveillance\", F67)), 0),\"Not required\")","v":0},{"$f":"IF(INTRO!$E$43=\"Endemic\", IF($K67>1, IF($K67=4, \"Unknown\", IF($K67=99, \"Surveillance\", G67)), 0),\"Not required\")","v":0},{"$f":"IF(INTRO!$E$43=\"Endemic\", IF($K67>1, IF($K67=4, \"Unknown\", IF($K67=99, \"Surveillance\", SUM($R67:$T67))), 0),\"Not required\")","v":0},null,null,0,0,null,null,null,null,null,null,null,null,45448,"Somntongo",null,8763.9835999300012]
[{"$f":"IF(INTRO!$E$33<>0,INTRO!$E$33, \" \")","v":"Eswatini"},"SHISELWENI","Zombodze Emuva",15055,{"$f":"IF(INTRO!$E$48=\"\",\"\",ROUND($D68*INTRO!$E$48,0))","v":1414},{"$f":"IF(INTRO!$E$49=\"\",\"\",ROUND($D68*INTRO!$E$49,0))","v":3505},{"$f":"IF(INTRO!$E$50=\"\",\"\",ROUND($D68*INTRO!$E$50,0))","v":9781},null,null,1,2,{"$f":"IF(INTRO!$E$37=\"Endemic\",IF($H68>0,IF($H68=4,\"Unknown\",IF($H68=99,\"Stopped\",$D68)),0),\"Not required\")","v":"Not required"},{"$f":"IF(INTRO!$E$39=\"Endemic\", IF($I68>0, IF($I68=4,\"Unknown\",IF($I68=99,\"Stopped\",$D68)), 0),\"Not required\")","v":"Not required"},{"$f":"IF(INTRO!$E$41=\"Endemic\", IF($J68>1, IF($J68=4, \"Unknown\", IF($J68=99, \"Surveillance\", E68)), 0),\"Not required\")","v":0},{"$f":"IF(INTRO!$E$41=\"Endemic\", IF($J68>1, IF($J68=4, \"Unknown\", IF($J68=99, \"Surveillance\", F68)), 0),\"Not required\")","v":0},{"$f":"IF(INTRO!$E$41=\"Endemic\", IF($J68>1, IF($J68=4, \"Unknown\", IF($J68=99, \"Surveillance\", ROUND(D68*INTRO!$E$51,0))), 0),\"Not required\")","v":0},{"$f":"IF(INTRO!$E$41=\"Endemic\", IF($J68>1, IF($J68=4, \"Unknown\", IF($J68=99, \"Surveillance\", SUM($N68:$P68))), 0),\"Not required\")","v":0},{"$f":"IF(INTRO!$E$43=\"Endemic\", IF($K68>1, IF($K68=4, \"Unknown\", IF($K68=99, \"Surveillance\", ROUND(E68*0.75,0))), 0),\"Not required\")","v":1061},{"$f":"IF(INTRO!$E$43=\"Endemic\", IF($K68>1, IF($K68=4, \"Unknown\", IF($K68=99, \"Surveillance\", F68)), 0),\"Not required\")","v":3505},{"$f":"IF(INTRO!$E$43=\"Endemic\", IF($K68>1, IF($K68=4, \"Unknown\", IF($K68=99, \"Surveillance\", G68)), 0),\"Not required\")","v":9781},{"$f":"IF(INTRO!$E$43=\"Endemic\", IF($K68>1, IF($K68=4, \"Unknown\", IF($K68=99, \"Surveillance\", SUM($R68:$T68))), 0),\"Not required\")","v":14347},null,null,0,1,null,null,null,null,null,null,null,null,45458,"Zombodze Emuva",null,14925.18747834]

{"sheet":"DEC","index":2,"n_rows":68,"n_cols":12,"rows_kept":68,"cut":false,"hidden":true,"merged":[[3,0,3,2],[5,0,5,2],[6,5,7,5],[6,2,7,2],[6,1,7,1],[6,10,7,10],[6,0,7,0],[6,11,7,11],[5,3,5,6],[5,9,5,11],[6,4,7,4],[6,3,7,3],[6,8,7,8],[6,7,7,7],[6,6,7,6],[6,9,7,9]]}
["Diethylcarbamazine citrate (DEC)"]
["Administrative structure, eligible population by age group, treatment plan and information about tablets"]
[]
["TOTAL",null,null,{"$f":"SUBTOTAL(9,D$10:D$1010)","v":0},0,0,0,null,{"$f":"SUBTOTAL(9,I$10:I$1010)","v":0},0,0,0]
[]
["Country administrative structure",null,null,"Population requiring treatment with DEC",null,null,null,"Treatment plan","Target population","Diethylcarbamazine citrate (DEC)"]
["Country","Province/State","District","PreSAC","SAC","Adults","Total","LF","LF","Total required","Remaining in stock","Tablets to be procured"]
[]
[]
[{"$f":"IF(INTRO!$E$39<>\"Non-endemic\", \" \", IF(INTRO!$E$37=\"Non-endemic\",\" \", IF(COUNTRY_INFO!A10=0,\" \",COUNTRY_INFO!A10)))","v":" "},{"$f":"IF(INTRO!$E$39<>\"Non-endemic\", \" \", IF(INTRO!$E$37=\"Non-endemic\",\" \", IF(COUNTRY_INFO!B10=0,\" \",COUNTRY_INFO!B10)))","v":" "},{"$f":"IF(INTRO!$E$39<>\"Non-endemic\", \" \", IF(INTRO!$E$37=\"Non-endemic\",\" \", IF(COUNTRY_INFO!C10=0,\" \",COUNTRY_INFO!C10)))","v":" "},{"$f":"IF(INTRO!$E$39<>\"Non-endemic\", 0, IF(INTRO!$E$37=\"Non-endemic\",0,IF(COUNTRY_INFO!$H10=1,COUNTRY_INFO!E10,0)))","v":0},{"$f":"IF(INTRO!$E$39<>\"Non-endemic\", 0, IF(INTRO!$E$37=\"Non-endemic\",0,IF(COUNTRY_INFO!$H10=1,COUNTRY_INFO!F10,0)))","v":0},{"$f":"IF(INTRO!$E$39<>\"Non-endemic\", 0, IF(INTRO!$E$37=\"Non-endemic\",0,IF(COUNTRY_INFO!$H10=1,COUNTRY_INFO!G10,0)))","v":0},{"$f":"SUM(D10:F10)","v":0},{"$f":"IF(INTRO!$E$39=\"Non-endemic\",IF(INTRO!$E$37=\"Non-endemic\",\"Not required\",COUNTRY_INFO!V10),\"Treat with IVM\")","v":"Not required"},{"$f":"IF(H10=1,G10,0)","v":0},{"$f":"IF(I10>0,I10*2.5,0)","v":0},null,{"$f":"IF($J10>$K10,$J10-$K10,0)","v":0}]
[{"$f":"IF(INTRO!$E$39<>\"Non-endemic\", \" \", IF(INTRO!$E$37=\"Non-endemic\",\" \", IF(COUNTRY_INFO!A11=0,\" \",COUNTRY_INFO!A11)))","v":" "},{"$f":"IF(INTRO!$E$39<>\"Non-endemic\", \" \", IF(INTRO!$E$37=\"Non-endemic\",\" \", IF(COUNTRY_INFO!B11=0,\" \",COUNTRY_INFO!B11)))","v":" "},{"$f":"IF(INTRO!$E$39<>\"Non-endemic\", \" \", IF(INTRO!$E$37=\"Non-endemic\",\" \", IF(COUNTRY_INFO!C11=0,\" \",COUNTRY_INFO!C11)))","v":" "},{"$f":"IF(INTRO!$E$39<>\"Non-endemic\", 0, IF(INTRO!$E$37=\"Non-endemic\",0,IF(COUNTRY_INFO!$H11=1,COUNTRY_INFO!E11,0)))","v":0},{"$f":"IF(INTRO!$E$39<>\"Non-endemic\", 0, IF(INTRO!$E$37=\"Non-endemic\",0,IF(COUNTRY_INFO!$H11=1,COUNTRY_INFO!F11,0)))","v":0},{"$f":"IF(INTRO!$E$39<>\"Non-endemic\", 0, IF(INTRO!$E$37=\"Non-endemic\",0,IF(COUNTRY_INFO!$H11=1,COUNTRY_INFO!G11,0)))","v":0},{"$f":"SUM(D11:F11)","v":0},{"$f":"IF(INTRO!$E$39=\"Non-endemic\",IF(INTRO!$E$37=\"Non-endemic\",\"Not required\",COUNTRY_INFO!V11),\"Treat with IVM\")","v":"Not required"},{"$f":"IF(H11=1,G11,0)","v":0},{"$f":"IF(I11>0,I11*2.5,0)","v":0},null,0]
[{"$f":"IF(INTRO!$E$39<>\"Non-endemic\", \" \", IF(INTRO!$E$37=\"Non-endemic\",\" \", IF(COUNTRY_INFO!A12=0,\" \",COUNTRY_INFO!A12)))","v":" "},{"$f":"IF(INTRO!$E$39<>\"Non-endemic\", \" \", IF(INTRO!$E$37=\"Non-endemic\",\" \", IF(COUNTRY_INFO!B12=0,\" \",COUNTRY_INFO!B12)))","v":" "},{"$f":"IF(INTRO!$E$39<>\"Non-endemic\", \" \", IF(INTRO!$E$37=\"Non-endemic\",\" \", IF(COUNTRY_INFO!C12=0,\" \",COUNTRY_INFO!C12)))","v":" "},{"$f":"IF(INTRO!$E$39<>\"Non-endemic\", 0, IF(INTRO!$E$37=\"Non-endemic\",0,IF(COUNTRY_INFO!$H12=1,COUNTRY_INFO!E12,0)))","v":0},{"$f":"IF(INTRO!$E$39<>\"Non-endemic\", 0, IF(INTRO!$E$37=\"Non-endemic\",0,IF(COUNTRY_INFO!$H12=1,COUNTRY_INFO!F12,0)))","v":0},{"$f":"IF(INTRO!$E$39<>\"Non-endemic\", 0, IF(INTRO!$E$37=\"Non-endemic\",0,IF(COUNTRY_INFO!$H12=1,COUNTRY_INFO!G12,0)))","v":0},0,{"$f":"IF(INTRO!$E$39=\"Non-endemic\",IF(INTRO!$E$37=\"Non-endemic\",\"Not required\",COUNTRY_INFO!V12),\"Treat with IVM\")","v":"Not required"},0,0,null,0]
[{"$f":"IF(INTRO!$E$39<>\"Non-endemic\", \" \", IF(INTRO!$E$37=\"Non-endemic\",\" \", IF(COUNTRY_INFO!A13=0,\" \",COUNTRY_INFO!A13)))","v":" "},{"$f":"IF(INTRO!$E$39<>\"Non-endemic\", \" \", IF(INTRO!$E$37=\"Non-endemic\",\" \", IF(COUNTRY_INFO!B13=0,\" \",COUNTRY_INFO!B13)))","v":" "},{"$f":"IF(INTRO!$E$39<>\"Non-endemic\", \" \", IF(INTRO!$E$37=\"Non-endemic\",\" \", IF(COUNTRY_INFO!C13=0,\" \",COUNTRY_INFO!C13)))","v":" "},{"$f":"IF(INTRO!$E$39<>\"Non-endemic\", 0, IF(INTRO!$E$37=\"Non-endemic\",0,IF(COUNTRY_INFO!$H13=1,COUNTRY_INFO!E13,0)))","v":0},{"$f":"IF(INTRO!$E$39<>\"Non-endemic\", 0, IF(INTRO!$E$37=\"Non-endemic\",0,IF(COUNTRY_INFO!$H13=1,COUNTRY_INFO!F13,0)))","v":0},{"$f":"IF(INTRO!$E$39<>\"Non-endemic\", 0, IF(INTRO!$E$37=\"Non-endemic\",0,IF(COUNTRY_INFO!$H13=1,COUNTRY_INFO!G13,0)))","v":0},0,{"$f":"IF(INTRO!$E$39=\"Non-endemic\",IF(INTRO!$E$37=\"Non-endemic\",\"Not required\",COUNTRY_INFO!V13),\"Treat with IVM\")","v":"Not required"},0,0,null,0]
[{"$f":"IF(INTRO!$E$39<>\"Non-endemic\", \" \", IF(INTRO!$E$37=\"Non-endemic\",\" \", IF(COUNTRY_INFO!A14=0,\" \",COUNTRY_INFO!A14)))","v":" "},{"$f":"IF(INTRO!$E$39<>\"Non-endemic\", \" \", IF(INTRO!$E$37=\"Non-endemic\",\" \", IF(COUNTRY_INFO!B14=0,\" \",COUNTRY_INFO!B14)))","v":" "},{"$f":"IF(INTRO!$E$39<>\"Non-endemic\", \" \", IF(INTRO!$E$37=\"Non-endemic\",\" \", IF(COUNTRY_INFO!C14=0,\" \",COUNTRY_INFO!C14)))","v":" "},{"$f":"IF(INTRO!$E$39<>\"Non-endemic\", 0, IF(INTRO!$E$37=\"Non-endemic\",0,IF(COUNTRY_INFO!$H14=1,COUNTRY_INFO!E14,0)))","v":0},{"$f":"IF(INTRO!$E$39<>\"Non-endemic\", 0, IF(INTRO!$E$37=\"Non-endemic\",0,IF(COUNTRY_INFO!$H14=1,COUNTRY_INFO!F14,0)))","v":0},{"$f":"IF(INTRO!$E$39<>\"Non-endemic\", 0, IF(INTRO!$E$37=\"Non-endemic\",0,IF(COUNTRY_INFO!$H14=1,COUNTRY_INFO!G14,0)))","v":0},0,{"$f":"IF(INTRO!$E$39=\"Non-endemic\",IF(INTRO!$E$37=\"Non-endemic\",\"Not required\",COUNTRY_INFO!V14),\"Treat with IVM\")","v":"Not required"},0,0,null,0]
[{"$f":"IF(INTRO!$E$39<>\"Non-endemic\", \" \", IF(INTRO!$E$37=\"Non-endemic\",\" \", IF(COUNTRY_INFO!A15=0,\" \",COUNTRY_INFO!A15)))","v":" "},{"$f":"IF(INTRO!$E$39<>\"Non-endemic\", \" \", IF(INTRO!$E$37=\"Non-endemic\",\" \", IF(COUNTRY_INFO!B15=0,\" \",COUNTRY_INFO!B15)))","v":" "},{"$f":"IF(INTRO!$E$39<>\"Non-endemic\", \" \", IF(INTRO!$E$37=\"Non-endemic\",\" \", IF(COUNTRY_INFO!C15=0,\" \",COUNTRY_INFO!C15)))","v":" "},{"$f":"IF(INTRO!$E$39<>\"Non-endemic\", 0, IF(INTRO!$E$37=\"Non-endemic\",0,IF(COUNTRY_INFO!$H15=1,COUNTRY_INFO!E15,0)))","v":0},{"$f":"IF(INTRO!$E$39<>\"Non-endemic\", 0, IF(INTRO!$E$37=\"Non-endemic\",0,IF(COUNTRY_INFO!$H15=1,COUNTRY_INFO!F15,0)))","v":0},{"$f":"IF(INTRO!$E$39<>\"Non-endemic\", 0, IF(INTRO!$E$37=\"Non-endemic\",0,IF(COUNTRY_INFO!$H15=1,COUNTRY_INFO!G15,0)))","v":0},0,{"$f":"IF(INTRO!$E$39=\"Non-endemic\",IF(INTRO!$E$37=\"Non-endemic\",\"Not required\",COUNTRY_INFO!V15),\"Treat with IVM\")","v":"Not required"},0,0,null,0]
[{"$f":"IF(INTRO!$E$39<>\"Non-endemic\", \" \", IF(INTRO!$E$37=\"Non-endemic\",\" \", IF(COUNTRY_INFO!A16=0,\" \",COUNTRY_INFO!A16)))","v":" "},{"$f":"IF(INTRO!$E$39<>\"Non-endemic\", \" \", IF(INTRO!$E$37=\"Non-endemic\",\" \", IF(COUNTRY_INFO!B16=0,\" \",COUNTRY_INFO!B16)))","v":" "},{"$f":"IF(INTRO!$E$39<>\"Non-endemic\", \" \", IF(INTRO!$E$37=\"Non-endemic\",\" \", IF(COUNTRY_INFO!C16=0,\" \",COUNTRY_INFO!C16)))","v":" "},{"$f":"IF(INTRO!$E$39<>\"Non-endemic\", 0, IF(INTRO!$E$37=\"Non-endemic\",0,IF(COUNTRY_INFO!$H16=1,COUNTRY_INFO!E16,0)))","v":0},{"$f":"IF(INTRO!$E$39<>\"Non-endemic\", 0, IF(INTRO!$E$37=\"Non-endemic\",0,IF(COUNTRY_INFO!$H16=1,COUNTRY_INFO!F16,0)))","v":0},{"$f":"IF(INTRO!$E$39<>\"Non-endemic\", 0, IF(INTRO!$E$37=\"Non-endemic\",0,IF(COUNTRY_INFO!$H16=1,COUNTRY_INFO!G16,0)))","v":0},0,{"$f":"IF(INTRO!$E$39=\"Non-endemic\",IF(INTRO!$E$37=\"Non-endemic\",\"Not required\",COUNTRY_INFO!V16),\"Treat with IVM\")","v":"Not required"},0,0,null,0]
[{"$f":"IF(INTRO!$E$39<>\"Non-endemic\", \" \", IF(INTRO!$E$37=\"Non-endemic\",\" \", IF(COUNTRY_INFO!A17=0,\" \",COUNTRY_INFO!A17)))","v":" "},{"$f":"IF(INTRO!$E$39<>\"Non-endemic\", \" \", IF(INTRO!$E$37=\"Non-endemic\",\" \", IF(COUNTRY_INFO!B17=0,\" \",COUNTRY_INFO!B17)))","v":" "},{"$f":"IF(INTRO!$E$39<>\"Non-endemic\", \" \", IF(INTRO!$E$37=\"Non-endemic\",\" \", IF(COUNTRY_INFO!C17=0,\" \",COUNTRY_INFO!C17)))","v":" "},{"$f":"IF(INTRO!$E$39<>\"Non-endemic\", 0, IF(INTRO!$E$37=\"Non-endemic\",0,IF(COUNTRY_INFO!$H17=1,COUNTRY_INFO!E17,0)))","v":0},{"$f":"IF(INTRO!$E$39<>\"Non-endemic\", 0, IF(INTRO!$E$37=\"Non-endemic\",0,IF(COUNTRY_INFO!$H17=1,COUNTRY_INFO!F17,0)))","v":0},{"$f":"IF(INTRO!$E$39<>\"Non-endemic\", 0, IF(INTRO!$E$37=\"Non-endemic\",0,IF(COUNTRY_INFO!$H17=1,COUNTRY_INFO!G17,0)))","v":0},0,{"$f":"IF(INTRO!$E$39=\"Non-endemic\",IF(INTRO!$E$37=\"Non-endemic\",\"Not required\",COUNTRY_INFO!V17),\"Treat with IVM\")","v":"Not required"},0,0,null,0]
[{"$f":"IF(INTRO!$E$39<>\"Non-endemic\", \" \", IF(INTRO!$E$37=\"Non-endemic\",\" \", IF(COUNTRY_INFO!A18=0,\" \",COUNTRY_INFO!A18)))","v":" "},{"$f":"IF(INTRO!$E$39<>\"Non-endemic\", \" \", IF(INTRO!$E$37=\"Non-endemic\",\" \", IF(COUNTRY_INFO!B18=0,\" \",COUNTRY_INFO!B18)))","v":" "},{"$f":"IF(INTRO!$E$39<>\"Non-endemic\", \" \", IF(INTRO!$E$37=\"Non-endemic\",\" \", IF(COUNTRY_INFO!C18=0,\" \",COUNTRY_INFO!C18)))","v":" "},{"$f":"IF(INTRO!$E$39<>\"Non-endemic\", 0, IF(INTRO!$E$37=\"Non-endemic\",0,IF(COUNTRY_INFO!$H18=1,COUNTRY_INFO!E18,0)))","v":0},{"$f":"IF(INTRO!$E$39<>\"Non-endemic\", 0, IF(INTRO!$E$37=\"Non-endemic\",0,IF(COUNTRY_INFO!$H18=1,COUNTRY_INFO!F18,0)))","v":0},{"$f":"IF(INTRO!$E$39<>\"Non-endemic\", 0, IF(INTRO!$E$37=\"Non-endemic\",0,IF(COUNTRY_INFO!$H18=1,COUNTRY_INFO!G18,0)))","v":0},0,{"$f":"IF(INTRO!$E$39=\"Non-endemic\",IF(INTRO!$E$37=\"Non-endemic\",\"Not required\",COUNTRY_INFO!V18),\"Treat with IVM\")","v":"Not required"},0,0,null,0]
[{"$f":"IF(INTRO!$E$39<>\"Non-endemic\", \" \", IF(INTRO!$E$37=\"Non-endemic\",\" \", IF(COUNTRY_INFO!A19=0,\" \",COUNTRY_INFO!A19)))","v":" "},{"$f":"IF(INTRO!$E$39<>\"Non-endemic\", \" \", IF(INTRO!$E$37=\"Non-endemic\",\" \", IF(COUNTRY_INFO!B19=0,\" \",COUNTRY_INFO!B19)))","v":" "},{"$f":"IF(INTRO!$E$39<>\"Non-endemic\", \" \", IF(INTRO!$E$37=\"Non-endemic\",\" \", IF(COUNTRY_INFO!C19=0,\" \",COUNTRY_INFO!C19)))","v":" "},{"$f":"IF(INTRO!$E$39<>\"Non-endemic\", 0, IF(INTRO!$E$37=\"Non-endemic\",0,IF(COUNTRY_INFO!$H19=1,COUNTRY_INFO!E19,0)))","v":0},{"$f":"IF(INTRO!$E$39<>\"Non-endemic\", 0, IF(INTRO!$E$37=\"Non-endemic\",0,IF(COUNTRY_INFO!$H19=1,COUNTRY_INFO!F19,0)))","v":0},{"$f":"IF(INTRO!$E$39<>\"Non-endemic\", 0, IF(INTRO!$E$37=\"Non-endemic\",0,IF(COUNTRY_INFO!$H19=1,COUNTRY_INFO!G19,0)))","v":0},0,{"$f":"IF(INTRO!$E$39=\"Non-endemic\",IF(INTRO!$E$37=\"Non-endemic\",\"Not required\",COUNTRY_INFO!V19),\"Treat with IVM\")","v":"Not required"},0,0,null,0]
[{"$f":"IF(INTRO!$E$39<>\"Non-endemic\", \" \", IF(INTRO!$E$37=\"Non-endemic\",\" \", IF(COUNTRY_INFO!A20=0,\" \",COUNTRY_INFO!A20)))","v":" "},{"$f":"IF(INTRO!$E$39<>\"Non-endemic\", \" \", IF(INTRO!$E$37=\"Non-endemic\",\" \", IF(COUNTRY_INFO!B20=0,\" \",COUNTRY_INFO!B20)))","v":" "},{"$f":"IF(INTRO!$E$39<>\"Non-endemic\", \" \", IF(INTRO!$E$37=\"Non-endemic\",\" \", IF(COUNTRY_INFO!C20=0,\" \",COUNTRY_INFO!C20)))","v":" "},{"$f":"IF(INTRO!$E$39<>\"Non-endemic\", 0, IF(INTRO!$E$37=\"Non-endemic\",0,IF(COUNTRY_INFO!$H20=1,COUNTRY_INFO!E20,0)))","v":0},{"$f":"IF(INTRO!$E$39<>\"Non-endemic\", 0, IF(INTRO!$E$37=\"Non-endemic\",0,IF(COUNTRY_INFO!$H20=1,COUNTRY_INFO!F20,0)))","v":0},{"$f":"IF(INTRO!$E$39<>\"Non-endemic\", 0, IF(INTRO!$E$37=\"Non-endemic\",0,IF(COUNTRY_INFO!$H20=1,COUNTRY_INFO!G20,0)))","v":0},0,{"$f":"IF(INTRO!$E$39=\"Non-endemic\",IF(INTRO!$E$37=\"Non-endemic\",\"Not required\",COUNTRY_INFO!V20),\"Treat with IVM\")","v":"Not required"},0,0,null,0]
[{"$f":"IF(INTRO!$E$39<>\"Non-endemic\", \" \", IF(INTRO!$E$37=\"Non-endemic\",\" \", IF(COUNTRY_INFO!A21=0,\" \",COUNTRY_INFO!A21)))","v":" "},{"$f":"IF(INTRO!$E$39<>\"Non-endemic\", \" \", IF(INTRO!$E$37=\"Non-endemic\",\" \", IF(COUNTRY_INFO!B21=0,\" \",COUNTRY_INFO!B21)))","v":" "},{"$f":"IF(INTRO!$E$39<>\"Non-endemic\", \" \", IF(INTRO!$E$37=\"Non-endemic\",\" \", IF(COUNTRY_INFO!C21=0,\" \",COUNTRY_INFO!C21)))","v":" "},{"$f":"IF(INTRO!$E$39<>\"Non-endemic\", 0, IF(INTRO!$E$37=\"Non-endemic\",0,IF(COUNTRY_INFO!$H21=1,COUNTRY_INFO!E21,0)))","v":0},{"$f":"IF(INTRO!$E$39<>\"Non-endemic\", 0, IF(INTRO!$E$37=\"Non-endemic\",0,IF(COUNTRY_INFO!$H21=1,COUNTRY_INFO!F21,0)))","v":0},{"$f":"IF(INTRO!$E$39<>\"Non-endemic\", 0, IF(INTRO!$E$37=\"Non-endemic\",0,IF(COUNTRY_INFO!$H21=1,COUNTRY_INFO!G21,0)))","v":0},0,{"$f":"IF(INTRO!$E$39=\"Non-endemic\",IF(INTRO!$E$37=\"Non-endemic\",\"Not required\",COUNTRY_INFO!V21),\"Treat with IVM\")","v":"Not required"},0,0,null,0]
[{"$f":"IF(INTRO!$E$39<>\"Non-endemic\", \" \", IF(INTRO!$E$37=\"Non-endemic\",\" \", IF(COUNTRY_INFO!A22=0,\" \",COUNTRY_INFO!A22)))","v":" "},{"$f":"IF(INTRO!$E$39<>\"Non-endemic\", \" \", IF(INTRO!$E$37=\"Non-endemic\",\" \", IF(COUNTRY_INFO!B22=0,\" \",COUNTRY_INFO!B22)))","v":" "},{"$f":"IF(INTRO!$E$39<>\"Non-endemic\", \" \", IF(INTRO!$E$37=\"Non-endemic\",\" \", IF(COUNTRY_INFO!C22=0,\" \",COUNTRY_INFO!C22)))","v":" "},{"$f":"IF(INTRO!$E$39<>\"Non-endemic\", 0, IF(INTRO!$E$37=\"Non-endemic\",0,IF(COUNTRY_INFO!$H22=1,COUNTRY_INFO!E22,0)))","v":0},{"$f":"IF(INTRO!$E$39<>\"Non-endemic\", 0, IF(INTRO!$E$37=\"Non-endemic\",0,IF(COUNTRY_INFO!$H22=1,COUNTRY_INFO!F22,0)))","v":0},{"$f":"IF(INTRO!$E$39<>\"Non-endemic\", 0, IF(INTRO!$E$37=\"Non-endemic\",0,IF(COUNTRY_INFO!$H22=1,COUNTRY_INFO!G22,0)))","v":0},0,{"$f":"IF(INTRO!$E$39=\"Non-endemic\",IF(INTRO!$E$37=\"Non-endemic\",\"Not required\",COUNTRY_INFO!V22),\"Treat with IVM\")","v":"Not required"},0,0,null,0]
[{"$f":"IF(INTRO!$E$39<>\"Non-endemic\", \" \", IF(INTRO!$E$37=\"Non-endemic\",\" \", IF(COUNTRY_INFO!A23=0,\" \",COUNTRY_INFO!A23)))","v":" "},{"$f":"IF(INTRO!$E$39<>\"Non-endemic\", \" \", IF(INTRO!$E$37=\"Non-endemic\",\" \", IF(COUNTRY_INFO!B23=0,\" \",COUNTRY_INFO!B23)))","v":" "},{"$f":"IF(INTRO!$E$39<>\"Non-endemic\", \" \", IF(INTRO!$E$37=\"Non-endemic\",\" \", IF(COUNTRY_INFO!C23=0,\" \",COUNTRY_INFO!C23)))","v":" "},{"$f":"IF(INTRO!$E$39<>\"Non-endemic\", 0, IF(INTRO!$E$37=\"Non-endemic\",0,IF(COUNTRY_INFO!$H23=1,COUNTRY_INFO!E23,0)))","v":0},{"$f":"IF(INTRO!$E$39<>\"Non-endemic\", 0, IF(INTRO!$E$37=\"Non-endemic\",0,IF(COUNTRY_INFO!$H23=1,COUNTRY_INFO!F23,0)))","v":0},{"$f":"IF(INTRO!$E$39<>\"Non-endemic\", 0, IF(INTRO!$E$37=\"Non-endemic\",0,IF(COUNTRY_INFO!$H23=1,COUNTRY_INFO!G23,0)))","v":0},0,{"$f":"IF(INTRO!$E$39=\"Non-endemic\",IF(INTRO!$E$37=\"Non-endemic\",\"Not required\",COUNTRY_INFO!V23),\"Treat with IVM\")","v":"Not required"},0,0,null,0]
[{"$f":"IF(INTRO!$E$39<>\"Non-endemic\", \" \", IF(INTRO!$E$37=\"Non-endemic\",\" \", IF(COUNTRY_INFO!A24=0,\" \",COUNTRY_INFO!A24)))","v":" "},{"$f":"IF(INTRO!$E$39<>\"Non-endemic\", \" \", IF(INTRO!$E$37=\"Non-endemic\",\" \", IF(COUNTRY_INFO!B24=0,\" \",COUNTRY_INFO!B24)))","v":" "},{"$f":"IF(INTRO!$E$39<>\"Non-endemic\", \" \", IF(INTRO!$E$37=\"Non-endemic\",\" \", IF(COUNTRY_INFO!C24=0,\" \",COUNTRY_INFO!C24)))","v":" "},{"$f":"IF(INTRO!$E$39<>\"Non-endemic\", 0, IF(INTRO!$E$37=\"Non-endemic\",0,IF(COUNTRY_INFO!$H24=1,COUNTRY_INFO!E24,0)))","v":0},{"$f":"IF(INTRO!$E$39<>\"Non-endemic\", 0, IF(INTRO!$E$37=\"Non-endemic\",0,IF(COUNTRY_INFO!$H24=1,COUNTRY_INFO!F24,0)))","v":0},{"$f":"IF(INTRO!$E$39<>\"Non-endemic\", 0, IF(INTRO!$E$37=\"Non-endemic\",0,IF(COUNTRY_INFO!$H24=1,COUNTRY_INFO!G24,0)))","v":0},0,{"$f":"IF(INTRO!$E$39=\"Non-endemic\",IF(INTRO!$E$37=\"Non-endemic\",\"Not required\",COUNTRY_INFO!V24),\"Treat with IVM\")","v":"Not required"},0,0,null,0]
[{"$f":"IF(INTRO!$E$39<>\"Non-endemic\", \" \", IF(INTRO!$E$37=\"Non-endemic\",\" \", IF(COUNTRY_INFO!A25=0,\" \",COUNTRY_INFO!A25)))","v":" "},{"$f":"IF(INTRO!$E$39<>\"Non-endemic\", \" \", IF(INTRO!$E$37=\"Non-endemic\",\" \", IF(COUNTRY_INFO!B25=0,\" \",COUNTRY_INFO!B25)))","v":" "},{"$f":"IF(INTRO!$E$39<>\"Non-endemic\", \" \", IF(INTRO!$E$37=\"Non-endemic\",\" \", IF(COUNTRY_INFO!C25=0,\" \",COUNTRY_INFO!C25)))","v":" "},{"$f":"IF(INTRO!$E$39<>\"Non-endemic\", 0, IF(INTRO!$E$37=\"Non-endemic\",0,IF(COUNTRY_INFO!$H25=1,COUNTRY_INFO!E25,0)))","v":0},{"$f":"IF(INTRO!$E$39<>\"Non-endemic\", 0, IF(INTRO!$E$37=\"Non-endemic\",0,IF(COUNTRY_INFO!$H25=1,COUNTRY_INFO!F25,0)))","v":0},{"$f":"IF(INTRO!$E$39<>\"Non-endemic\", 0, IF(INTRO!$E$37=\"Non-endemic\",0,IF(COUNTRY_INFO!$H25=1,COUNTRY_INFO!G25,0)))","v":0},0,{"$f":"IF(INTRO!$E$39=\"Non-endemic\",IF(INTRO!$E$37=\"Non-endemic\",\"Not required\",COUNTRY_INFO!V25),\"Treat with IVM\")","v":"Not required"},0,0,null,0]
[{"$f":"IF(INTRO!$E$39<>\"Non-endemic\", \" \", IF(INTRO!$E$37=\"Non-endemic\",\" \", IF(COUNTRY_INFO!A26=0,\" \",COUNTRY_INFO!A26)))","v":" "},{"$f":"IF(INTRO!$E$39<>\"Non-endemic\", \" \", IF(INTRO!$E$37=\"Non-endemic\",\" \", IF(COUNTRY_INFO!B26=0,\" \",COUNTRY_INFO!B26)))","v":" "},{"$f":"IF(INTRO!$E$39<>\"Non-endemic\", \" \", IF(INTRO!$E$37=\"Non-endemic\",\" \", IF(COUNTRY_INFO!C26=0,\" \",COUNTRY_INFO!C26)))","v":" "},{"$f":"IF(INTRO!$E$39<>\"Non-endemic\", 0, IF(INTRO!$E$37=\"Non-endemic\",0,IF(COUNTRY_INFO!$H26=1,COUNTRY_INFO!E26,0)))","v":0},{"$f":"IF(INTRO!$E$39<>\"Non-endemic\", 0, IF(INTRO!$E$37=\"Non-endemic\",0,IF(COUNTRY_INFO!$H26=1,COUNTRY_INFO!F26,0)))","v":0},{"$f":"IF(INTRO!$E$39<>\"Non-endemic\", 0, IF(INTRO!$E$37=\"Non-endemic\",0,IF(COUNTRY_INFO!$H26=1,COUNTRY_INFO!G26,0)))","v":0},0,{"$f":"IF(INTRO!$E$39=\"Non-endemic\",IF(INTRO!$E$37=\"Non-endemic\",\"Not required\",COUNTRY_INFO!V26),\"Treat with IVM\")","v":"Not required"},0,0,null,0]
[{"$f":"IF(INTRO!$E$39<>\"Non-endemic\", \" \", IF(INTRO!$E$37=\"Non-endemic\",\" \", IF(COUNTRY_INFO!A27=0,\" \",COUNTRY_INFO!A27)))","v":" "},{"$f":"IF(INTRO!$E$39<>\"Non-endemic\", \" \", IF(INTRO!$E$37=\"Non-endemic\",\" \", IF(COUNTRY_INFO!B27=0,\" \",COUNTRY_INFO!B27)))","v":" "},{"$f":"IF(INTRO!$E$39<>\"Non-endemic\", \" \", IF(INTRO!$E$37=\"Non-endemic\",\" \", IF(COUNTRY_INFO!C27=0,\" \",COUNTRY_INFO!C27)))","v":" "},{"$f":"IF(INTRO!$E$39<>\"Non-endemic\", 0, IF(INTRO!$E$37=\"Non-endemic\",0,IF(COUNTRY_INFO!$H27=1,COUNTRY_INFO!E27,0)))","v":0},{"$f":"IF(INTRO!$E$39<>\"Non-endemic\", 0, IF(INTRO!$E$37=\"Non-endemic\",0,IF(COUNTRY_INFO!$H27=1,COUNTRY_INFO!F27,0)))","v":0},{"$f":"IF(INTRO!$E$39<>\"Non-endemic\", 0, IF(INTRO!$E$37=\"Non-endemic\",0,IF(COUNTRY_INFO!$H27=1,COUNTRY_INFO!G27,0)))","v":0},0,{"$f":"IF(INTRO!$E$39=\"Non-endemic\",IF(INTRO!$E$37=\"Non-endemic\",\"Not required\",COUNTRY_INFO!V27),\"Treat with IVM\")","v":"Not required"},0,0,null,0]
[{"$f":"IF(INTRO!$E$39<>\"Non-endemic\", \" \", IF(INTRO!$E$37=\"Non-endemic\",\" \", IF(COUNTRY_INFO!A28=0,\" \",COUNTRY_INFO!A28)))","v":" "},{"$f":"IF(INTRO!$E$39<>\"Non-endemic\", \" \", IF(INTRO!$E$37=\"Non-endemic\",\" \", IF(COUNTRY_INFO!B28=0,\" \",COUNTRY_INFO!B28)))","v":" "},{"$f":"IF(INTRO!$E$39<>\"Non-endemic\", \" \", IF(INTRO!$E$37=\"Non-endemic\",\" \", IF(COUNTRY_INFO!C28=0,\" \",COUNTRY_INFO!C28)))","v":" "},{"$f":"IF(INTRO!$E$39<>\"Non-endemic\", 0, IF(INTRO!$E$37=\"Non-endemic\",0,IF(COUNTRY_INFO!$H28=1,COUNTRY_INFO!E28,0)))","v":0},{"$f":"IF(INTRO!$E$39<>\"Non-endemic\", 0, IF(INTRO!$E$37=\"Non-endemic\",0,IF(COUNTRY_INFO!$H28=1,COUNTRY_INFO!F28,0)))","v":0},{"$f":"IF(INTRO!$E$39<>\"Non-endemic\", 0, IF(INTRO!$E$37=\"Non-endemic\",0,IF(COUNTRY_INFO!$H28=1,COUNTRY_INFO!G28,0)))","v":0},0,{"$f":"IF(INTRO!$E$39=\"Non-endemic\",IF(INTRO!$E$37=\"Non-endemic\",\"Not required\",COUNTRY_INFO!V28),\"Treat with IVM\")","v":"Not required"},0,0,null,0]
[{"$f":"IF(INTRO!$E$39<>\"Non-endemic\", \" \", IF(INTRO!$E$37=\"Non-endemic\",\" \", IF(COUNTRY_INFO!A29=0,\" \",COUNTRY_INFO!A29)))","v":" "},{"$f":"IF(INTRO!$E$39<>\"Non-endemic\", \" \", IF(INTRO!$E$37=\"Non-endemic\",\" \", IF(COUNTRY_INFO!B29=0,\" \",COUNTRY_INFO!B29)))","v":" "},{"$f":"IF(INTRO!$E$39<>\"Non-endemic\", \" \", IF(INTRO!$E$37=\"Non-endemic\",\" \", IF(COUNTRY_INFO!C29=0,\" \",COUNTRY_INFO!C29)))","v":" "},{"$f":"IF(INTRO!$E$39<>\"Non-endemic\", 0, IF(INTRO!$E$37=\"Non-endemic\",0,IF(COUNTRY_INFO!$H29=1,COUNTRY_INFO!E29,0)))","v":0},{"$f":"IF(INTRO!$E$39<>\"Non-endemic\", 0, IF(INTRO!$E$37=\"Non-endemic\",0,IF(COUNTRY_INFO!$H29=1,COUNTRY_INFO!F29,0)))","v":0},{"$f":"IF(INTRO!$E$39<>\"Non-endemic\", 0, IF(INTRO!$E$37=\"Non-endemic\",0,IF(COUNTRY_INFO!$H29=1,COUNTRY_INFO!G29,0)))","v":0},0,{"$f":"IF(INTRO!$E$39=\"Non-endemic\",IF(INTRO!$E$37=\"Non-endemic\",\"Not required\",COUNTRY_INFO!V29),\"Treat with IVM\")","v":"Not required"},0,0,null,0]
[{"$f":"IF(INTRO!$E$39<>\"Non-endemic\", \" \", IF(INTRO!$E$37=\"Non-endemic\",\" \", IF(COUNTRY_INFO!A30=0,\" \",COUNTRY_INFO!A30)))","v":" "},{"$f":"IF(INTRO!$E$39<>\"Non-endemic\", \" \", IF(INTRO!$E$37=\"Non-endemic\",\" \", IF(COUNTRY_INFO!B30=0,\" \",COUNTRY_INFO!B30)))","v":" "},{"$f":"IF(INTRO!$E$39<>\"Non-endemic\", \" \", IF(INTRO!$E$37=\"Non-endemic\",\" \", IF(COUNTRY_INFO!C30=0,\" \",COUNTRY_INFO!C30)))","v":" "},{"$f":"IF(INTRO!$E$39<>\"Non-endemic\", 0, IF(INTRO!$E$37=\"Non-endemic\",0,IF(COUNTRY_INFO!$H30=1,COUNTRY_INFO!E30,0)))","v":0},{"$f":"IF(INTRO!$E$39<>\"Non-endemic\", 0, IF(INTRO!$E$37=\"Non-endemic\",0,IF(COUNTRY_INFO!$H30=1,COUNTRY_INFO!F30,0)))","v":0},{"$f":"IF(INTRO!$E$39<>\"Non-endemic\", 0, IF(INTRO!$E$37=\"Non-endemic\",0,IF(COUNTRY_INFO!$H30=1,COUNTRY_INFO!G30,0)))","v":0},0,{"$f":"IF(INTRO!$E$39=\"Non-endemic\",IF(INTRO!$E$37=\"Non-endemic\",\"Not required\",COUNTRY_INFO!V30),\"Treat with IVM\")","v":"Not required"},0,0,null,0]
[{"$f":"IF(INTRO!$E$39<>\"Non-endemic\", \" \", IF(INTRO!$E$37=\"Non-endemic\",\" \", IF(COUNTRY_INFO!A31=0,\" \",COUNTRY_INFO!A31)))","v":" "},{"$f":"IF(INTRO!$E$39<>\"Non-endemic\", \" \", IF(INTRO!$E$37=\"Non-endemic\",\" \", IF(COUNTRY_INFO!B31=0,\" \",COUNTRY_INFO!B31)))","v":" "},{"$f":"IF(INTRO!$E$39<>\"Non-endemic\", \" \", IF(INTRO!$E$37=\"Non-endemic\",\" \", IF(COUNTRY_INFO!C31=0,\" \",COUNTRY_INFO!C31)))","v":" "},{"$f":"IF(INTRO!$E$39<>\"Non-endemic\", 0, IF(INTRO!$E$37=\"Non-endemic\",0,IF(COUNTRY_INFO!$H31=1,COUNTRY_INFO!E31,0)))","v":0},{"$f":"IF(INTRO!$E$39<>\"Non-endemic\", 0, IF(INTRO!$E$37=\"Non-endemic\",0,IF(COUNTRY_INFO!$H31=1,COUNTRY_INFO!F31,0)))","v":0},{"$f":"IF(INTRO!$E$39<>\"Non-endemic\", 0, IF(INTRO!$E$37=\"Non-endemic\",0,IF(COUNTRY_INFO!$H31=1,COUNTRY_INFO!G31,0)))","v":0},0,{"$f":"IF(INTRO!$E$39=\"Non-endemic\",IF(INTRO!$E$37=\"Non-endemic\",\"Not required\",COUNTRY_INFO!V31),\"Treat with IVM\")","v":"Not required"},0,0,null,0]
[{"$f":"IF(INTRO!$E$39<>\"Non-endemic\", \" \", IF(INTRO!$E$37=\"Non-endemic\",\" \", IF(COUNTRY_INFO!A32=0,\" \",COUNTRY_INFO!A32)))","v":" "},{"$f":"IF(INTRO!$E$39<>\"Non-endemic\", \" \", IF(INTRO!$E$37=\"Non-endemic\",\" \", IF(COUNTRY_INFO!B32=0,\" \",COUNTRY_INFO!B32)))","v":" "},{"$f":"IF(INTRO!$E$39<>\"Non-endemic\", \" \", IF(INTRO!$E$37=\"Non-endemic\",\" \", IF(COUNTRY_INFO!C32=0,\" \",COUNTRY_INFO!C32)))","v":" "},{"$f":"IF(INTRO!$E$39<>\"Non-endemic\", 0, IF(INTRO!$E$37=\"Non-endemic\",0,IF(COUNTRY_INFO!$H32=1,COUNTRY_INFO!E32,0)))","v":0},{"$f":"IF(INTRO!$E$39<>\"Non-endemic\", 0, IF(INTRO!$E$37=\"Non-endemic\",0,IF(COUNTRY_INFO!$H32=1,COUNTRY_INFO!F32,0)))","v":0},{"$f":"IF(INTRO!$E$39<>\"Non-endemic\", 0, IF(INTRO!$E$37=\"Non-endemic\",0,IF(COUNTRY_INFO!$H32=1,COUNTRY_INFO!G32,0)))","v":0},0,{"$f":"IF(INTRO!$E$39=\"Non-endemic\",IF(INTRO!$E$37=\"Non-endemic\",\"Not required\",COUNTRY_INFO!V32),\"Treat with IVM\")","v":"Not required"},0,0,null,0]
[{"$f":"IF(INTRO!$E$39<>\"Non-endemic\", \" \", IF(INTRO!$E$37=\"Non-endemic\",\" \", IF(COUNTRY_INFO!A33=0,\" \",COUNTRY_INFO!A33)))","v":" "},{"$f":"IF(INTRO!$E$39<>\"Non-endemic\", \" \", IF(INTRO!$E$37=\"Non-endemic\",\" \", IF(COUNTRY_INFO!B33=0,\" \",COUNTRY_INFO!B33)))","v":" "},{"$f":"IF(INTRO!$E$39<>\"Non-endemic\", \" \", IF(INTRO!$E$37=\"Non-endemic\",\" \", IF(COUNTRY_INFO!C33=0,\" \",COUNTRY_INFO!C33)))","v":" "},{"$f":"IF(INTRO!$E$39<>\"Non-endemic\", 0, IF(INTRO!$E$37=\"Non-endemic\",0,IF(COUNTRY_INFO!$H33=1,COUNTRY_INFO!E33,0)))","v":0},{"$f":"IF(INTRO!$E$39<>\"Non-endemic\", 0, IF(INTRO!$E$37=\"Non-endemic\",0,IF(COUNTRY_INFO!$H33=1,COUNTRY_INFO!F33,0)))","v":0},{"$f":"IF(INTRO!$E$39<>\"Non-endemic\", 0, IF(INTRO!$E$37=\"Non-endemic\",0,IF(COUNTRY_INFO!$H33=1,COUNTRY_INFO!G33,0)))","v":0},0,{"$f":"IF(INTRO!$E$39=\"Non-endemic\",IF(INTRO!$E$37=\"Non-endemic\",\"Not required\",COUNTRY_INFO!V33),\"Treat with IVM\")","v":"Not required"},0,0,null,0]
[{"$f":"IF(INTRO!$E$39<>\"Non-endemic\", \" \", IF(INTRO!$E$37=\"Non-endemic\",\" \", IF(COUNTRY_INFO!A34=0,\" \",COUNTRY_INFO!A34)))","v":" "},{"$f":"IF(INTRO!$E$39<>\"Non-endemic\", \" \", IF(INTRO!$E$37=\"Non-endemic\",\" \", IF(COUNTRY_INFO!B34=0,\" \",COUNTRY_INFO!B34)))","v":" "},{"$f":"IF(INTRO!$E$39<>\"Non-endemic\", \" \", IF(INTRO!$E$37=\"Non-endemic\",\" \", IF(COUNTRY_INFO!C34=0,\" \",COUNTRY_INFO!C34)))","v":" "},{"$f":"IF(INTRO!$E$39<>\"Non-endemic\", 0, IF(INTRO!$E$37=\"Non-endemic\",0,IF(COUNTRY_INFO!$H34=1,COUNTRY_INFO!E34,0)))","v":0},{"$f":"IF(INTRO!$E$39<>\"Non-endemic\", 0, IF(INTRO!$E$37=\"Non-endemic\",0,IF(COUNTRY_INFO!$H34=1,COUNTRY_INFO!F34,0)))","v":0},{"$f":"IF(INTRO!$E$39<>\"Non-endemic\", 0, IF(INTRO!$E$37=\"Non-endemic\",0,IF(COUNTRY_INFO!$H34=1,COUNTRY_INFO!G34,0)))","v":0},0,{"$f":"IF(INTRO!$E$39=\"Non-endemic\",IF(INTRO!$E$37=\"Non-endemic\",\"Not required\",COUNTRY_INFO!V34),\"Treat with IVM\")","v":"Not required"},0,0,null,0]
[{"$f":"IF(INTRO!$E$39<>\"Non-endemic\", \" \", IF(INTRO!$E$37=\"Non-endemic\",\" \", IF(COUNTRY_INFO!A35=0,\" \",COUNTRY_INFO!A35)))","v":" "},{"$f":"IF(INTRO!$E$39<>\"Non-endemic\", \" \", IF(INTRO!$E$37=\"Non-endemic\",\" \", IF(COUNTRY_INFO!B35=0,\" \",COUNTRY_INFO!B35)))","v":" "},{"$f":"IF(INTRO!$E$39<>\"Non-endemic\", \" \", IF(INTRO!$E$37=\"Non-endemic\",\" \", IF(COUNTRY_INFO!C35=0,\" \",COUNTRY_INFO!C35)))","v":" "},{"$f":"IF(INTRO!$E$39<>\"Non-endemic\", 0, IF(INTRO!$E$37=\"Non-endemic\",0,IF(COUNTRY_INFO!$H35=1,COUNTRY_INFO!E35,0)))","v":0},{"$f":"IF(INTRO!$E$39<>\"Non-endemic\", 0, IF(INTRO!$E$37=\"Non-endemic\",0,IF(COUNTRY_INFO!$H35=1,COUNTRY_INFO!F35,0)))","v":0},{"$f":"IF(INTRO!$E$39<>\"Non-endemic\", 0, IF(INTRO!$E$37=\"Non-endemic\",0,IF(COUNTRY_INFO!$H35=1,COUNTRY_INFO!G35,0)))","v":0},0,{"$f":"IF(INTRO!$E$39=\"Non-endemic\",IF(INTRO!$E$37=\"Non-endemic\",\"Not required\",COUNTRY_INFO!V35),\"Treat with IVM\")","v":"Not required"},0,0,null,0]
[{"$f":"IF(INTRO!$E$39<>\"Non-endemic\", \" \", IF(INTRO!$E$37=\"Non-endemic\",\" \", IF(COUNTRY_INFO!A36=0,\" \",COUNTRY_INFO!A36)))","v":" "},{"$f":"IF(INTRO!$E$39<>\"Non-endemic\", \" \", IF(INTRO!$E$37=\"Non-endemic\",\" \", IF(COUNTRY_INFO!B36=0,\" \",COUNTRY_INFO!B36)))","v":" "},{"$f":"IF(INTRO!$E$39<>\"Non-endemic\", \" \", IF(INTRO!$E$37=\"Non-endemic\",\" \", IF(COUNTRY_INFO!C36=0,\" \",COUNTRY_INFO!C36)))","v":" "},{"$f":"IF(INTRO!$E$39<>\"Non-endemic\", 0, IF(INTRO!$E$37=\"Non-endemic\",0,IF(COUNTRY_INFO!$H36=1,COUNTRY_INFO!E36,0)))","v":0},{"$f":"IF(INTRO!$E$39<>\"Non-endemic\", 0, IF(INTRO!$E$37=\"Non-endemic\",0,IF(COUNTRY_INFO!$H36=1,COUNTRY_INFO!F36,0)))","v":0},{"$f":"IF(INTRO!$E$39<>\"Non-endemic\", 0, IF(INTRO!$E$37=\"Non-endemic\",0,IF(COUNTRY_INFO!$H36=1,COUNTRY_INFO!G36,0)))","v":0},0,{"$f":"IF(INTRO!$E$39=\"Non-endemic\",IF(INTRO!$E$37=\"Non-endemic\",\"Not required\",COUNTRY_INFO!V36),\"Treat with IVM\")","v":"Not required"},0,0,null,0]
[{"$f":"IF(INTRO!$E$39<>\"Non-endemic\", \" \", IF(INTRO!$E$37=\"Non-endemic\",\" \", IF(COUNTRY_INFO!A37=0,\" \",COUNTRY_INFO!A37)))","v":" "},{"$f":"IF(INTRO!$E$39<>\"Non-endemic\", \" \", IF(INTRO!$E$37=\"Non-endemic\",\" \", IF(COUNTRY_INFO!B37=0,\" \",COUNTRY_INFO!B37)))","v":" "},{"$f":"IF(INTRO!$E$39<>\"Non-endemic\", \" \", IF(INTRO!$E$37=\"Non-endemic\",\" \", IF(COUNTRY_INFO!C37=0,\" \",COUNTRY_INFO!C37)))","v":" "},{"$f":"IF(INTRO!$E$39<>\"Non-endemic\", 0, IF(INTRO!$E$37=\"Non-endemic\",0,IF(COUNTRY_INFO!$H37=1,COUNTRY_INFO!E37,0)))","v":0},{"$f":"IF(INTRO!$E$39<>\"Non-endemic\", 0, IF(INTRO!$E$37=\"Non-endemic\",0,IF(COUNTRY_INFO!$H37=1,COUNTRY_INFO!F37,0)))","v":0},{"$f":"IF(INTRO!$E$39<>\"Non-endemic\", 0, IF(INTRO!$E$37=\"Non-endemic\",0,IF(COUNTRY_INFO!$H37=1,COUNTRY_INFO!G37,0)))","v":0},0,{"$f":"IF(INTRO!$E$39=\"Non-endemic\",IF(INTRO!$E$37=\"Non-endemic\",\"Not required\",COUNTRY_INFO!V37),\"Treat with IVM\")","v":"Not required"},0,0,null,0]
[{"$f":"IF(INTRO!$E$39<>\"Non-endemic\", \" \", IF(INTRO!$E$37=\"Non-endemic\",\" \", IF(COUNTRY_INFO!A38=0,\" \",COUNTRY_INFO!A38)))","v":" "},{"$f":"IF(INTRO!$E$39<>\"Non-endemic\", \" \", IF(INTRO!$E$37=\"Non-endemic\",\" \", IF(COUNTRY_INFO!B38=0,\" \",COUNTRY_INFO!B38)))","v":" "},{"$f":"IF(INTRO!$E$39<>\"Non-endemic\", \" \", IF(INTRO!$E$37=\"Non-endemic\",\" \", IF(COUNTRY_INFO!C38=0,\" \",COUNTRY_INFO!C38)))","v":" "},{"$f":"IF(INTRO!$E$39<>\"Non-endemic\", 0, IF(INTRO!$E$37=\"Non-endemic\",0,IF(COUNTRY_INFO!$H38=1,COUNTRY_INFO!E38,0)))","v":0},{"$f":"IF(INTRO!$E$39<>\"Non-endemic\", 0, IF(INTRO!$E$37=\"Non-endemic\",0,IF(COUNTRY_INFO!$H38=1,COUNTRY_INFO!F38,0)))","v":0},{"$f":"IF(INTRO!$E$39<>\"Non-endemic\", 0, IF(INTRO!$E$37=\"Non-endemic\",0,IF(COUNTRY_INFO!$H38=1,COUNTRY_INFO!G38,0)))","v":0},0,{"$f":"IF(INTRO!$E$39=\"Non-endemic\",IF(INTRO!$E$37=\"Non-endemic\",\"Not required\",COUNTRY_INFO!V38),\"Treat with IVM\")","v":"Not required"},0,0,null,0]
[{"$f":"IF(INTRO!$E$39<>\"Non-endemic\", \" \", IF(INTRO!$E$37=\"Non-endemic\",\" \", IF(COUNTRY_INFO!A39=0,\" \",COUNTRY_INFO!A39)))","v":" "},{"$f":"IF(INTRO!$E$39<>\"Non-endemic\", \" \", IF(INTRO!$E$37=\"Non-endemic\",\" \", IF(COUNTRY_INFO!B39=0,\" \",COUNTRY_INFO!B39)))","v":" "},{"$f":"IF(INTRO!$E$39<>\"Non-endemic\", \" \", IF(INTRO!$E$37=\"Non-endemic\",\" \", IF(COUNTRY_INFO!C39=0,\" \",COUNTRY_INFO!C39)))","v":" "},{"$f":"IF(INTRO!$E$39<>\"Non-endemic\", 0, IF(INTRO!$E$37=\"Non-endemic\",0,IF(COUNTRY_INFO!$H39=1,COUNTRY_INFO!E39,0)))","v":0},{"$f":"IF(INTRO!$E$39<>\"Non-endemic\", 0, IF(INTRO!$E$37=\"Non-endemic\",0,IF(COUNTRY_INFO!$H39=1,COUNTRY_INFO!F39,0)))","v":0},{"$f":"IF(INTRO!$E$39<>\"Non-endemic\", 0, IF(INTRO!$E$37=\"Non-endemic\",0,IF(COUNTRY_INFO!$H39=1,COUNTRY_INFO!G39,0)))","v":0},0,{"$f":"IF(INTRO!$E$39=\"Non-endemic\",IF(INTRO!$E$37=\"Non-endemic\",\"Not required\",COUNTRY_INFO!V39),\"Treat with IVM\")","v":"Not required"},0,0,null,0]
[{"$f":"IF(INTRO!$E$39<>\"Non-endemic\", \" \", IF(INTRO!$E$37=\"Non-endemic\",\" \", IF(COUNTRY_INFO!A40=0,\" \",COUNTRY_INFO!A40)))","v":" "},{"$f":"IF(INTRO!$E$39<>\"Non-endemic\", \" \", IF(INTRO!$E$37=\"Non-endemic\",\" \", IF(COUNTRY_INFO!B40=0,\" \",COUNTRY_INFO!B40)))","v":" "},{"$f":"IF(INTRO!$E$39<>\"Non-endemic\", \" \", IF(INTRO!$E$37=\"Non-endemic\",\" \", IF(COUNTRY_INFO!C40=0,\" \",COUNTRY_INFO!C40)))","v":" "},{"$f":"IF(INTRO!$E$39<>\"Non-endemic\", 0, IF(INTRO!$E$37=\"Non-endemic\",0,IF(COUNTRY_INFO!$H40=1,COUNTRY_INFO!E40,0)))","v":0},{"$f":"IF(INTRO!$E$39<>\"Non-endemic\", 0, IF(INTRO!$E$37=\"Non-endemic\",0,IF(COUNTRY_INFO!$H40=1,COUNTRY_INFO!F40,0)))","v":0},{"$f":"IF(INTRO!$E$39<>\"Non-endemic\", 0, IF(INTRO!$E$37=\"Non-endemic\",0,IF(COUNTRY_INFO!$H40=1,COUNTRY_INFO!G40,0)))","v":0},0,{"$f":"IF(INTRO!$E$39=\"Non-endemic\",IF(INTRO!$E$37=\"Non-endemic\",\"Not required\",COUNTRY_INFO!V40),\"Treat with IVM\")","v":"Not required"},0,0,null,0]
[{"$f":"IF(INTRO!$E$39<>\"Non-endemic\", \" \", IF(INTRO!$E$37=\"Non-endemic\",\" \", IF(COUNTRY_INFO!A41=0,\" \",COUNTRY_INFO!A41)))","v":" "},{"$f":"IF(INTRO!$E$39<>\"Non-endemic\", \" \", IF(INTRO!$E$37=\"Non-endemic\",\" \", IF(COUNTRY_INFO!B41=0,\" \",COUNTRY_INFO!B41)))","v":" "},{"$f":"IF(INTRO!$E$39<>\"Non-endemic\", \" \", IF(INTRO!$E$37=\"Non-endemic\",\" \", IF(COUNTRY_INFO!C41=0,\" \",COUNTRY_INFO!C41)))","v":" "},{"$f":"IF(INTRO!$E$39<>\"Non-endemic\", 0, IF(INTRO!$E$37=\"Non-endemic\",0,IF(COUNTRY_INFO!$H41=1,COUNTRY_INFO!E41,0)))","v":0},{"$f":"IF(INTRO!$E$39<>\"Non-endemic\", 0, IF(INTRO!$E$37=\"Non-endemic\",0,IF(COUNTRY_INFO!$H41=1,COUNTRY_INFO!F41,0)))","v":0},{"$f":"IF(INTRO!$E$39<>\"Non-endemic\", 0, IF(INTRO!$E$37=\"Non-endemic\",0,IF(COUNTRY_INFO!$H41=1,COUNTRY_INFO!G41,0)))","v":0},0,{"$f":"IF(INTRO!$E$39=\"Non-endemic\",IF(INTRO!$E$37=\"Non-endemic\",\"Not required\",COUNTRY_INFO!V41),\"Treat with IVM\")","v":"Not required"},0,0,null,0]
[{"$f":"IF(INTRO!$E$39<>\"Non-endemic\", \" \", IF(INTRO!$E$37=\"Non-endemic\",\" \", IF(COUNTRY_INFO!A42=0,\" \",COUNTRY_INFO!A42)))","v":" "},{"$f":"IF(INTRO!$E$39<>\"Non-endemic\", \" \", IF(INTRO!$E$37=\"Non-endemic\",\" \", IF(COUNTRY_INFO!B42=0,\" \",COUNTRY_INFO!B42)))","v":" "},{"$f":"IF(INTRO!$E$39<>\"Non-endemic\", \" \", IF(INTRO!$E$37=\"Non-endemic\",\" \", IF(COUNTRY_INFO!C42=0,\" \",COUNTRY_INFO!C42)))","v":" "},{"$f":"IF(INTRO!$E$39<>\"Non-endemic\", 0, IF(INTRO!$E$37=\"Non-endemic\",0,IF(COUNTRY_INFO!$H42=1,COUNTRY_INFO!E42,0)))","v":0},{"$f":"IF(INTRO!$E$39<>\"Non-endemic\", 0, IF(INTRO!$E$37=\"Non-endemic\",0,IF(COUNTRY_INFO!$H42=1,COUNTRY_INFO!F42,0)))","v":0},{"$f":"IF(INTRO!$E$39<>\"Non-endemic\", 0, IF(INTRO!$E$37=\"Non-endemic\",0,IF(COUNTRY_INFO!$H42=1,COUNTRY_INFO!G42,0)))","v":0},0,{"$f":"IF(INTRO!$E$39=\"Non-endemic\",IF(INTRO!$E$37=\"Non-endemic\",\"Not required\",COUNTRY_INFO!V42),\"Treat with IVM\")","v":"Not required"},0,0,null,0]
[{"$f":"IF(INTRO!$E$39<>\"Non-endemic\", \" \", IF(INTRO!$E$37=\"Non-endemic\",\" \", IF(COUNTRY_INFO!A43=0,\" \",COUNTRY_INFO!A43)))","v":" "},{"$f":"IF(INTRO!$E$39<>\"Non-endemic\", \" \", IF(INTRO!$E$37=\"Non-endemic\",\" \", IF(COUNTRY_INFO!B43=0,\" \",COUNTRY_INFO!B43)))","v":" "},{"$f":"IF(INTRO!$E$39<>\"Non-endemic\", \" \", IF(INTRO!$E$37=\"Non-endemic\",\" \", IF(COUNTRY_INFO!C43=0,\" \",COUNTRY_INFO!C43)))","v":" "},{"$f":"IF(INTRO!$E$39<>\"Non-endemic\", 0, IF(INTRO!$E$37=\"Non-endemic\",0,IF(COUNTRY_INFO!$H43=1,COUNTRY_INFO!E43,0)))","v":0},{"$f":"IF(INTRO!$E$39<>\"Non-endemic\", 0, IF(INTRO!$E$37=\"Non-endemic\",0,IF(COUNTRY_INFO!$H43=1,COUNTRY_INFO!F43,0)))","v":0},{"$f":"IF(INTRO!$E$39<>\"Non-endemic\", 0, IF(INTRO!$E$37=\"Non-endemic\",0,IF(COUNTRY_INFO!$H43=1,COUNTRY_INFO!G43,0)))","v":0},0,{"$f":"IF(INTRO!$E$39=\"Non-endemic\",IF(INTRO!$E$37=\"Non-endemic\",\"Not required\",COUNTRY_INFO!V43),\"Treat with IVM\")","v":"Not required"},0,0,null,0]
[{"$f":"IF(INTRO!$E$39<>\"Non-endemic\", \" \", IF(INTRO!$E$37=\"Non-endemic\",\" \", IF(COUNTRY_INFO!A44=0,\" \",COUNTRY_INFO!A44)))","v":" "},{"$f":"IF(INTRO!$E$39<>\"Non-endemic\", \" \", IF(INTRO!$E$37=\"Non-endemic\",\" \", IF(COUNTRY_INFO!B44=0,\" \",COUNTRY_INFO!B44)))","v":" "},{"$f":"IF(INTRO!$E$39<>\"Non-endemic\", \" \", IF(INTRO!$E$37=\"Non-endemic\",\" \", IF(COUNTRY_INFO!C44=0,\" \",COUNTRY_INFO!C44)))","v":" "},{"$f":"IF(INTRO!$E$39<>\"Non-endemic\", 0, IF(INTRO!$E$37=\"Non-endemic\",0,IF(COUNTRY_INFO!$H44=1,COUNTRY_INFO!E44,0)))","v":0},{"$f":"IF(INTRO!$E$39<>\"Non-endemic\", 0, IF(INTRO!$E$37=\"Non-endemic\",0,IF(COUNTRY_INFO!$H44=1,COUNTRY_INFO!F44,0)))","v":0},{"$f":"IF(INTRO!$E$39<>\"Non-endemic\", 0, IF(INTRO!$E$37=\"Non-endemic\",0,IF(COUNTRY_INFO!$H44=1,COUNTRY_INFO!G44,0)))","v":0},0,{"$f":"IF(INTRO!$E$39=\"Non-endemic\",IF(INTRO!$E$37=\"Non-endemic\",\"Not required\",COUNTRY_INFO!V44),\"Treat with IVM\")","v":"Not required"},0,0,null,0]
[{"$f":"IF(INTRO!$E$39<>\"Non-endemic\", \" \", IF(INTRO!$E$37=\"Non-endemic\",\" \", IF(COUNTRY_INFO!A45=0,\" \",COUNTRY_INFO!A45)))","v":" "},{"$f":"IF(INTRO!$E$39<>\"Non-endemic\", \" \", IF(INTRO!$E$37=\"Non-endemic\",\" \", IF(COUNTRY_INFO!B45=0,\" \",COUNTRY_INFO!B45)))","v":" "},{"$f":"IF(INTRO!$E$39<>\"Non-endemic\", \" \", IF(INTRO!$E$37=\"Non-endemic\",\" \", IF(COUNTRY_INFO!C45=0,\" \",COUNTRY_INFO!C45)))","v":" "},{"$f":"IF(INTRO!$E$39<>\"Non-endemic\", 0, IF(INTRO!$E$37=\"Non-endemic\",0,IF(COUNTRY_INFO!$H45=1,COUNTRY_INFO!E45,0)))","v":0},{"$f":"IF(INTRO!$E$39<>\"Non-endemic\", 0, IF(INTRO!$E$37=\"Non-endemic\",0,IF(COUNTRY_INFO!$H45=1,COUNTRY_INFO!F45,0)))","v":0},{"$f":"IF(INTRO!$E$39<>\"Non-endemic\", 0, IF(INTRO!$E$37=\"Non-endemic\",0,IF(COUNTRY_INFO!$H45=1,COUNTRY_INFO!G45,0)))","v":0},0,{"$f":"IF(INTRO!$E$39=\"Non-endemic\",IF(INTRO!$E$37=\"Non-endemic\",\"Not required\",COUNTRY_INFO!V45),\"Treat with IVM\")","v":"Not required"},0,0,null,0]
[{"$f":"IF(INTRO!$E$39<>\"Non-endemic\", \" \", IF(INTRO!$E$37=\"Non-endemic\",\" \", IF(COUNTRY_INFO!A46=0,\" \",COUNTRY_INFO!A46)))","v":" "},{"$f":"IF(INTRO!$E$39<>\"Non-endemic\", \" \", IF(INTRO!$E$37=\"Non-endemic\",\" \", IF(COUNTRY_INFO!B46=0,\" \",COUNTRY_INFO!B46)))","v":" "},{"$f":"IF(INTRO!$E$39<>\"Non-endemic\", \" \", IF(INTRO!$E$37=\"Non-endemic\",\" \", IF(COUNTRY_INFO!C46=0,\" \",COUNTRY_INFO!C46)))","v":" "},{"$f":"IF(INTRO!$E$39<>\"Non-endemic\", 0, IF(INTRO!$E$37=\"Non-endemic\",0,IF(COUNTRY_INFO!$H46=1,COUNTRY_INFO!E46,0)))","v":0},{"$f":"IF(INTRO!$E$39<>\"Non-endemic\", 0, IF(INTRO!$E$37=\"Non-endemic\",0,IF(COUNTRY_INFO!$H46=1,COUNTRY_INFO!F46,0)))","v":0},{"$f":"IF(INTRO!$E$39<>\"Non-endemic\", 0, IF(INTRO!$E$37=\"Non-endemic\",0,IF(COUNTRY_INFO!$H46=1,COUNTRY_INFO!G46,0)))","v":0},0,{"$f":"IF(INTRO!$E$39=\"Non-endemic\",IF(INTRO!$E$37=\"Non-endemic\",\"Not required\",COUNTRY_INFO!V46),\"Treat with IVM\")","v":"Not required"},0,0,null,0]
[{"$f":"IF(INTRO!$E$39<>\"Non-endemic\", \" \", IF(INTRO!$E$37=\"Non-endemic\",\" \", IF(COUNTRY_INFO!A47=0,\" \",COUNTRY_INFO!A47)))","v":" "},{"$f":"IF(INTRO!$E$39<>\"Non-endemic\", \" \", IF(INTRO!$E$37=\"Non-endemic\",\" \", IF(COUNTRY_INFO!B47=0,\" \",COUNTRY_INFO!B47)))","v":" "},{"$f":"IF(INTRO!$E$39<>\"Non-endemic\", \" \", IF(INTRO!$E$37=\"Non-endemic\",\" \", IF(COUNTRY_INFO!C47=0,\" \",COUNTRY_INFO!C47)))","v":" "},{"$f":"IF(INTRO!$E$39<>\"Non-endemic\", 0, IF(INTRO!$E$37=\"Non-endemic\",0,IF(COUNTRY_INFO!$H47=1,COUNTRY_INFO!E47,0)))","v":0},{"$f":"IF(INTRO!$E$39<>\"Non-endemic\", 0, IF(INTRO!$E$37=\"Non-endemic\",0,IF(COUNTRY_INFO!$H47=1,COUNTRY_INFO!F47,0)))","v":0},{"$f":"IF(INTRO!$E$39<>\"Non-endemic\", 0, IF(INTRO!$E$37=\"Non-endemic\",0,IF(COUNTRY_INFO!$H47=1,COUNTRY_INFO!G47,0)))","v":0},0,{"$f":"IF(INTRO!$E$39=\"Non-endemic\",IF(INTRO!$E$37=\"Non-endemic\",\"Not required\",COUNTRY_INFO!V47),\"Treat with IVM\")","v":"Not required"},0,0,null,0]
[{"$f":"IF(INTRO!$E$39<>\"Non-endemic\", \" \", IF(INTRO!$E$37=\"Non-endemic\",\" \", IF(COUNTRY_INFO!A48=0,\" \",COUNTRY_INFO!A48)))","v":" "},{"$f":"IF(INTRO!$E$39<>\"Non-endemic\", \" \", IF(INTRO!$E$37=\"Non-endemic\",\" \", IF(COUNTRY_INFO!B48=0,\" \",COUNTRY_INFO!B48)))","v":" "},{"$f":"IF(INTRO!$E$39<>\"Non-endemic\", \" \", IF(INTRO!$E$37=\"Non-endemic\",\" \", IF(COUNTRY_INFO!C48=0,\" \",COUNTRY_INFO!C48)))","v":" "},{"$f":"IF(INTRO!$E$39<>\"Non-endemic\", 0, IF(INTRO!$E$37=\"Non-endemic\",0,IF(COUNTRY_INFO!$H48=1,COUNTRY_INFO!E48,0)))","v":0},{"$f":"IF(INTRO!$E$39<>\"Non-endemic\", 0, IF(INTRO!$E$37=\"Non-endemic\",0,IF(COUNTRY_INFO!$H48=1,COUNTRY_INFO!F48,0)))","v":0},{"$f":"IF(INTRO!$E$39<>\"Non-endemic\", 0, IF(INTRO!$E$37=\"Non-endemic\",0,IF(COUNTRY_INFO!$H48=1,COUNTRY_INFO!G48,0)))","v":0},0,{"$f":"IF(INTRO!$E$39=\"Non-endemic\",IF(INTRO!$E$37=\"Non-endemic\",\"Not required\",COUNTRY_INFO!V48),\"Treat with IVM\")","v":"Not required"},0,0,null,0]
[{"$f":"IF(INTRO!$E$39<>\"Non-endemic\", \" \", IF(INTRO!$E$37=\"Non-endemic\",\" \", IF(COUNTRY_INFO!A49=0,\" \",COUNTRY_INFO!A49)))","v":" "},{"$f":"IF(INTRO!$E$39<>\"Non-endemic\", \" \", IF(INTRO!$E$37=\"Non-endemic\",\" \", IF(COUNTRY_INFO!B49=0,\" \",COUNTRY_INFO!B49)))","v":" "},{"$f":"IF(INTRO!$E$39<>\"Non-endemic\", \" \", IF(INTRO!$E$37=\"Non-endemic\",\" \", IF(COUNTRY_INFO!C49=0,\" \",COUNTRY_INFO!C49)))","v":" "},{"$f":"IF(INTRO!$E$39<>\"Non-endemic\", 0, IF(INTRO!$E$37=\"Non-endemic\",0,IF(COUNTRY_INFO!$H49=1,COUNTRY_INFO!E49,0)))","v":0},{"$f":"IF(INTRO!$E$39<>\"Non-endemic\", 0, IF(INTRO!$E$37=\"Non-endemic\",0,IF(COUNTRY_INFO!$H49=1,COUNTRY_INFO!F49,0)))","v":0},{"$f":"IF(INTRO!$E$39<>\"Non-endemic\", 0, IF(INTRO!$E$37=\"Non-endemic\",0,IF(COUNTRY_INFO!$H49=1,COUNTRY_INFO!G49,0)))","v":0},0,{"$f":"IF(INTRO!$E$39=\"Non-endemic\",IF(INTRO!$E$37=\"Non-endemic\",\"Not required\",COUNTRY_INFO!V49),\"Treat with IVM\")","v":"Not required"},0,0,null,0]
[{"$f":"IF(INTRO!$E$39<>\"Non-endemic\", \" \", IF(INTRO!$E$37=\"Non-endemic\",\" \", IF(COUNTRY_INFO!A50=0,\" \",COUNTRY_INFO!A50)))","v":" "},{"$f":"IF(INTRO!$E$39<>\"Non-endemic\", \" \", IF(INTRO!$E$37=\"Non-endemic\",\" \", IF(COUNTRY_INFO!B50=0,\" \",COUNTRY_INFO!B50)))","v":" "},{"$f":"IF(INTRO!$E$39<>\"Non-endemic\", \" \", IF(INTRO!$E$37=\"Non-endemic\",\" \", IF(COUNTRY_INFO!C50=0,\" \",COUNTRY_INFO!C50)))","v":" "},{"$f":"IF(INTRO!$E$39<>\"Non-endemic\", 0, IF(INTRO!$E$37=\"Non-endemic\",0,IF(COUNTRY_INFO!$H50=1,COUNTRY_INFO!E50,0)))","v":0},{"$f":"IF(INTRO!$E$39<>\"Non-endemic\", 0, IF(INTRO!$E$37=\"Non-endemic\",0,IF(COUNTRY_INFO!$H50=1,COUNTRY_INFO!F50,0)))","v":0},{"$f":"IF(INTRO!$E$39<>\"Non-endemic\", 0, IF(INTRO!$E$37=\"Non-endemic\",0,IF(COUNTRY_INFO!$H50=1,COUNTRY_INFO!G50,0)))","v":0},0,{"$f":"IF(INTRO!$E$39=\"Non-endemic\",IF(INTRO!$E$37=\"Non-endemic\",\"Not required\",COUNTRY_INFO!V50),\"Treat with IVM\")","v":"Not required"},0,0,null,0]
[{"$f":"IF(INTRO!$E$39<>\"Non-endemic\", \" \", IF(INTRO!$E$37=\"Non-endemic\",\" \", IF(COUNTRY_INFO!A51=0,\" \",COUNTRY_INFO!A51)))","v":" "},{"$f":"IF(INTRO!$E$39<>\"Non-endemic\", \" \", IF(INTRO!$E$37=\"Non-endemic\",\" \", IF(COUNTRY_INFO!B51=0,\" \",COUNTRY_INFO!B51)))","v":" "},{"$f":"IF(INTRO!$E$39<>\"Non-endemic\", \" \", IF(INTRO!$E$37=\"Non-endemic\",\" \", IF(COUNTRY_INFO!C51=0,\" \",COUNTRY_INFO!C51)))","v":" "},{"$f":"IF(INTRO!$E$39<>\"Non-endemic\", 0, IF(INTRO!$E$37=\"Non-endemic\",0,IF(COUNTRY_INFO!$H51=1,COUNTRY_INFO!E51,0)))","v":0},{"$f":"IF(INTRO!$E$39<>\"Non-endemic\", 0, IF(INTRO!$E$37=\"Non-endemic\",0,IF(COUNTRY_INFO!$H51=1,COUNTRY_INFO!F51,0)))","v":0},{"$f":"IF(INTRO!$E$39<>\"Non-endemic\", 0, IF(INTRO!$E$37=\"Non-endemic\",0,IF(COUNTRY_INFO!$H51=1,COUNTRY_INFO!G51,0)))","v":0},0,{"$f":"IF(INTRO!$E$39=\"Non-endemic\",IF(INTRO!$E$37=\"Non-endemic\",\"Not required\",COUNTRY_INFO!V51),\"Treat with IVM\")","v":"Not required"},0,0,null,0]
[{"$f":"IF(INTRO!$E$39<>\"Non-endemic\", \" \", IF(INTRO!$E$37=\"Non-endemic\",\" \", IF(COUNTRY_INFO!A52=0,\" \",COUNTRY_INFO!A52)))","v":" "},{"$f":"IF(INTRO!$E$39<>\"Non-endemic\", \" \", IF(INTRO!$E$37=\"Non-endemic\",\" \", IF(COUNTRY_INFO!B52=0,\" \",COUNTRY_INFO!B52)))","v":" "},{"$f":"IF(INTRO!$E$39<>\"Non-endemic\", \" \", IF(INTRO!$E$37=\"Non-endemic\",\" \", IF(COUNTRY_INFO!C52=0,\" \",COUNTRY_INFO!C52)))","v":" "},{"$f":"IF(INTRO!$E$39<>\"Non-endemic\", 0, IF(INTRO!$E$37=\"Non-endemic\",0,IF(COUNTRY_INFO!$H52=1,COUNTRY_INFO!E52,0)))","v":0},{"$f":"IF(INTRO!$E$39<>\"Non-endemic\", 0, IF(INTRO!$E$37=\"Non-endemic\",0,IF(COUNTRY_INFO!$H52=1,COUNTRY_INFO!F52,0)))","v":0},{"$f":"IF(INTRO!$E$39<>\"Non-endemic\", 0, IF(INTRO!$E$37=\"Non-endemic\",0,IF(COUNTRY_INFO!$H52=1,COUNTRY_INFO!G52,0)))","v":0},0,{"$f":"IF(INTRO!$E$39=\"Non-endemic\",IF(INTRO!$E$37=\"Non-endemic\",\"Not required\",COUNTRY_INFO!V52),\"Treat with IVM\")","v":"Not required"},0,0,null,0]
[{"$f":"IF(INTRO!$E$39<>\"Non-endemic\", \" \", IF(INTRO!$E$37=\"Non-endemic\",\" \", IF(COUNTRY_INFO!A53=0,\" \",COUNTRY_INFO!A53)))","v":" "},{"$f":"IF(INTRO!$E$39<>\"Non-endemic\", \" \", IF(INTRO!$E$37=\"Non-endemic\",\" \", IF(COUNTRY_INFO!B53=0,\" \",COUNTRY_INFO!B53)))","v":" "},{"$f":"IF(INTRO!$E$39<>\"Non-endemic\", \" \", IF(INTRO!$E$37=\"Non-endemic\",\" \", IF(COUNTRY_INFO!C53=0,\" \",COUNTRY_INFO!C53)))","v":" "},{"$f":"IF(INTRO!$E$39<>\"Non-endemic\", 0, IF(INTRO!$E$37=\"Non-endemic\",0,IF(COUNTRY_INFO!$H53=1,COUNTRY_INFO!E53,0)))","v":0},{"$f":"IF(INTRO!$E$39<>\"Non-endemic\", 0, IF(INTRO!$E$37=\"Non-endemic\",0,IF(COUNTRY_INFO!$H53=1,COUNTRY_INFO!F53,0)))","v":0},{"$f":"IF(INTRO!$E$39<>\"Non-endemic\", 0, IF(INTRO!$E$37=\"Non-endemic\",0,IF(COUNTRY_INFO!$H53=1,COUNTRY_INFO!G53,0)))","v":0},0,{"$f":"IF(INTRO!$E$39=\"Non-endemic\",IF(INTRO!$E$37=\"Non-endemic\",\"Not required\",COUNTRY_INFO!V53),\"Treat with IVM\")","v":"Not required"},0,0,null,0]
[{"$f":"IF(INTRO!$E$39<>\"Non-endemic\", \" \", IF(INTRO!$E$37=\"Non-endemic\",\" \", IF(COUNTRY_INFO!A54=0,\" \",COUNTRY_INFO!A54)))","v":" "},{"$f":"IF(INTRO!$E$39<>\"Non-endemic\", \" \", IF(INTRO!$E$37=\"Non-endemic\",\" \", IF(COUNTRY_INFO!B54=0,\" \",COUNTRY_INFO!B54)))","v":" "},{"$f":"IF(INTRO!$E$39<>\"Non-endemic\", \" \", IF(INTRO!$E$37=\"Non-endemic\",\" \", IF(COUNTRY_INFO!C54=0,\" \",COUNTRY_INFO!C54)))","v":" "},{"$f":"IF(INTRO!$E$39<>\"Non-endemic\", 0, IF(INTRO!$E$37=\"Non-endemic\",0,IF(COUNTRY_INFO!$H54=1,COUNTRY_INFO!E54,0)))","v":0},{"$f":"IF(INTRO!$E$39<>\"Non-endemic\", 0, IF(INTRO!$E$37=\"Non-endemic\",0,IF(COUNTRY_INFO!$H54=1,COUNTRY_INFO!F54,0)))","v":0},{"$f":"IF(INTRO!$E$39<>\"Non-endemic\", 0, IF(INTRO!$E$37=\"Non-endemic\",0,IF(COUNTRY_INFO!$H54=1,COUNTRY_INFO!G54,0)))","v":0},0,{"$f":"IF(INTRO!$E$39=\"Non-endemic\",IF(INTRO!$E$37=\"Non-endemic\",\"Not required\",COUNTRY_INFO!V54),\"Treat with IVM\")","v":"Not required"},0,0,null,0]
[{"$f":"IF(INTRO!$E$39<>\"Non-endemic\", \" \", IF(INTRO!$E$37=\"Non-endemic\",\" \", IF(COUNTRY_INFO!A55=0,\" \",COUNTRY_INFO!A55)))","v":" "},{"$f":"IF(INTRO!$E$39<>\"Non-endemic\", \" \", IF(INTRO!$E$37=\"Non-endemic\",\" \", IF(COUNTRY_INFO!B55=0,\" \",COUNTRY_INFO!B55)))","v":" "},{"$f":"IF(INTRO!$E$39<>\"Non-endemic\", \" \", IF(INTRO!$E$37=\"Non-endemic\",\" \", IF(COUNTRY_INFO!C55=0,\" \",COUNTRY_INFO!C55)))","v":" "},{"$f":"IF(INTRO!$E$39<>\"Non-endemic\", 0, IF(INTRO!$E$37=\"Non-endemic\",0,IF(COUNTRY_INFO!$H55=1,COUNTRY_INFO!E55,0)))","v":0},{"$f":"IF(INTRO!$E$39<>\"Non-endemic\", 0, IF(INTRO!$E$37=\"Non-endemic\",0,IF(COUNTRY_INFO!$H55=1,COUNTRY_INFO!F55,0)))","v":0},{"$f":"IF(INTRO!$E$39<>\"Non-endemic\", 0, IF(INTRO!$E$37=\"Non-endemic\",0,IF(COUNTRY_INFO!$H55=1,COUNTRY_INFO!G55,0)))","v":0},0,{"$f":"IF(INTRO!$E$39=\"Non-endemic\",IF(INTRO!$E$37=\"Non-endemic\",\"Not required\",COUNTRY_INFO!V55),\"Treat with IVM\")","v":"Not required"},0,0,null,0]
[{"$f":"IF(INTRO!$E$39<>\"Non-endemic\", \" \", IF(INTRO!$E$37=\"Non-endemic\",\" \", IF(COUNTRY_INFO!A56=0,\" \",COUNTRY_INFO!A56)))","v":" "},{"$f":"IF(INTRO!$E$39<>\"Non-endemic\", \" \", IF(INTRO!$E$37=\"Non-endemic\",\" \", IF(COUNTRY_INFO!B56=0,\" \",COUNTRY_INFO!B56)))","v":" "},{"$f":"IF(INTRO!$E$39<>\"Non-endemic\", \" \", IF(INTRO!$E$37=\"Non-endemic\",\" \", IF(COUNTRY_INFO!C56=0,\" \",COUNTRY_INFO!C56)))","v":" "},{"$f":"IF(INTRO!$E$39<>\"Non-endemic\", 0, IF(INTRO!$E$37=\"Non-endemic\",0,IF(COUNTRY_INFO!$H56=1,COUNTRY_INFO!E56,0)))","v":0},{"$f":"IF(INTRO!$E$39<>\"Non-endemic\", 0, IF(INTRO!$E$37=\"Non-endemic\",0,IF(COUNTRY_INFO!$H56=1,COUNTRY_INFO!F56,0)))","v":0},{"$f":"IF(INTRO!$E$39<>\"Non-endemic\", 0, IF(INTRO!$E$37=\"Non-endemic\",0,IF(COUNTRY_INFO!$H56=1,COUNTRY_INFO!G56,0)))","v":0},0,{"$f":"IF(INTRO!$E$39=\"Non-endemic\",IF(INTRO!$E$37=\"Non-endemic\",\"Not required\",COUNTRY_INFO!V56),\"Treat with IVM\")","v":"Not required"},0,0,null,0]
[{"$f":"IF(INTRO!$E$39<>\"Non-endemic\", \" \", IF(INTRO!$E$37=\"Non-endemic\",\" \", IF(COUNTRY_INFO!A57=0,\" \",COUNTRY_INFO!A57)))","v":" "},{"$f":"IF(INTRO!$E$39<>\"Non-endemic\", \" \", IF(INTRO!$E$37=\"Non-endemic\",\" \", IF(COUNTRY_INFO!B57=0,\" \",COUNTRY_INFO!B57)))","v":" "},{"$f":"IF(INTRO!$E$39<>\"Non-endemic\", \" \", IF(INTRO!$E$37=\"Non-endemic\",\" \", IF(COUNTRY_INFO!C57=0,\" \",COUNTRY_INFO!C57)))","v":" "},{"$f":"IF(INTRO!$E$39<>\"Non-endemic\", 0, IF(INTRO!$E$37=\"Non-endemic\",0,IF(COUNTRY_INFO!$H57=1,COUNTRY_INFO!E57,0)))","v":0},{"$f":"IF(INTRO!$E$39<>\"Non-endemic\", 0, IF(INTRO!$E$37=\"Non-endemic\",0,IF(COUNTRY_INFO!$H57=1,COUNTRY_INFO!F57,0)))","v":0},{"$f":"IF(INTRO!$E$39<>\"Non-endemic\", 0, IF(INTRO!$E$37=\"Non-endemic\",0,IF(COUNTRY_INFO!$H57=1,COUNTRY_INFO!G57,0)))","v":0},0,{"$f":"IF(INTRO!$E$39=\"Non-endemic\",IF(INTRO!$E$37=\"Non-endemic\",\"Not required\",COUNTRY_INFO!V57),\"Treat with IVM\")","v":"Not required"},0,0,null,0]
[{"$f":"IF(INTRO!$E$39<>\"Non-endemic\", \" \", IF(INTRO!$E$37=\"Non-endemic\",\" \", IF(COUNTRY_INFO!A58=0,\" \",COUNTRY_INFO!A58)))","v":" "},{"$f":"IF(INTRO!$E$39<>\"Non-endemic\", \" \", IF(INTRO!$E$37=\"Non-endemic\",\" \", IF(COUNTRY_INFO!B58=0,\" \",COUNTRY_INFO!B58)))","v":" "},{"$f":"IF(INTRO!$E$39<>\"Non-endemic\", \" \", IF(INTRO!$E$37=\"Non-endemic\",\" \", IF(COUNTRY_INFO!C58=0,\" \",COUNTRY_INFO!C58)))","v":" "},{"$f":"IF(INTRO!$E$39<>\"Non-endemic\", 0, IF(INTRO!$E$37=\"Non-endemic\",0,IF(COUNTRY_INFO!$H58=1,COUNTRY_INFO!E58,0)))","v":0},{"$f":"IF(INTRO!$E$39<>\"Non-endemic\", 0, IF(INTRO!$E$37=\"Non-endemic\",0,IF(COUNTRY_INFO!$H58=1,COUNTRY_INFO!F58,0)))","v":0},{"$f":"IF(INTRO!$E$39<>\"Non-endemic\", 0, IF(INTRO!$E$37=\"Non-endemic\",0,IF(COUNTRY_INFO!$H58=1,COUNTRY_INFO!G58,0)))","v":0},0,{"$f":"IF(INTRO!$E$39=\"Non-endemic\",IF(INTRO!$E$37=\"Non-endemic\",\"Not required\",COUNTRY_INFO!V58),\"Treat with IVM\")","v":"Not required"},0,0,null,0]
[{"$f":"IF(INTRO!$E$39<>\"Non-endemic\", \" \", IF(INTRO!$E$37=\"Non-endemic\",\" \", IF(COUNTRY_INFO!A59=0,\" \",COUNTRY_INFO!A59)))","v":" "},{"$f":"IF(INTRO!$E$39<>\"Non-endemic\", \" \", IF(INTRO!$E$37=\"Non-endemic\",\" \", IF(COUNTRY_INFO!B59=0,\" \",COUNTRY_INFO!B59)))","v":" "},{"$f":"IF(INTRO!$E$39<>\"Non-endemic\", \" \", IF(INTRO!$E$37=\"Non-endemic\",\" \", IF(COUNTRY_INFO!C59=0,\" \",COUNTRY_INFO!C59)))","v":" "},{"$f":"IF(INTRO!$E$39<>\"Non-endemic\", 0, IF(INTRO!$E$37=\"Non-endemic\",0,IF(COUNTRY_INFO!$H59=1,COUNTRY_INFO!E59,0)))","v":0},{"$f":"IF(INTRO!$E$39<>\"Non-endemic\", 0, IF(INTRO!$E$37=\"Non-endemic\",0,IF(COUNTRY_INFO!$H59=1,COUNTRY_INFO!F59,0)))","v":0},{"$f":"IF(INTRO!$E$39<>\"Non-endemic\", 0, IF(INTRO!$E$37=\"Non-endemic\",0,IF(COUNTRY_INFO!$H59=1,COUNTRY_INFO!G59,0)))","v":0},0,{"$f":"IF(INTRO!$E$39=\"Non-endemic\",IF(INTRO!$E$37=\"Non-endemic\",\"Not required\",COUNTRY_INFO!V59),\"Treat with IVM\")","v":"Not required"},0,0,null,0]
[{"$f":"IF(INTRO!$E$39<>\"Non-endemic\", \" \", IF(INTRO!$E$37=\"Non-endemic\",\" \", IF(COUNTRY_INFO!A60=0,\" \",COUNTRY_INFO!A60)))","v":" "},{"$f":"IF(INTRO!$E$39<>\"Non-endemic\", \" \", IF(INTRO!$E$37=\"Non-endemic\",\" \", IF(COUNTRY_INFO!B60=0,\" \",COUNTRY_INFO!B60)))","v":" "},{"$f":"IF(INTRO!$E$39<>\"Non-endemic\", \" \", IF(INTRO!$E$37=\"Non-endemic\",\" \", IF(COUNTRY_INFO!C60=0,\" \",COUNTRY_INFO!C60)))","v":" "},{"$f":"IF(INTRO!$E$39<>\"Non-endemic\", 0, IF(INTRO!$E$37=\"Non-endemic\",0,IF(COUNTRY_INFO!$H60=1,COUNTRY_INFO!E60,0)))","v":0},{"$f":"IF(INTRO!$E$39<>\"Non-endemic\", 0, IF(INTRO!$E$37=\"Non-endemic\",0,IF(COUNTRY_INFO!$H60=1,COUNTRY_INFO!F60,0)))","v":0},{"$f":"IF(INTRO!$E$39<>\"Non-endemic\", 0, IF(INTRO!$E$37=\"Non-endemic\",0,IF(COUNTRY_INFO!$H60=1,COUNTRY_INFO!G60,0)))","v":0},0,{"$f":"IF(INTRO!$E$39=\"Non-endemic\",IF(INTRO!$E$37=\"Non-endemic\",\"Not required\",COUNTRY_INFO!V60),\"Treat with IVM\")","v":"Not required"},0,0,null,0]
[{"$f":"IF(INTRO!$E$39<>\"Non-endemic\", \" \", IF(INTRO!$E$37=\"Non-endemic\",\" \", IF(COUNTRY_INFO!A61=0,\" \",COUNTRY_INFO!A61)))","v":" "},{"$f":"IF(INTRO!$E$39<>\"Non-endemic\", \" \", IF(INTRO!$E$37=\"Non-endemic\",\" \", IF(COUNTRY_INFO!B61=0,\" \",COUNTRY_INFO!B61)))","v":" "},{"$f":"IF(INTRO!$E$39<>\"Non-endemic\", \" \", IF(INTRO!$E$37=\"Non-endemic\",\" \", IF(COUNTRY_INFO!C61=0,\" \",COUNTRY_INFO!C61)))","v":" "},{"$f":"IF(INTRO!$E$39<>\"Non-endemic\", 0, IF(INTRO!$E$37=\"Non-endemic\",0,IF(COUNTRY_INFO!$H61=1,COUNTRY_INFO!E61,0)))","v":0},{"$f":"IF(INTRO!$E$39<>\"Non-endemic\", 0, IF(INTRO!$E$37=\"Non-endemic\",0,IF(COUNTRY_INFO!$H61=1,COUNTRY_INFO!F61,0)))","v":0},{"$f":"IF(INTRO!$E$39<>\"Non-endemic\", 0, IF(INTRO!$E$37=\"Non-endemic\",0,IF(COUNTRY_INFO!$H61=1,COUNTRY_INFO!G61,0)))","v":0},0,{"$f":"IF(INTRO!$E$39=\"Non-endemic\",IF(INTRO!$E$37=\"Non-endemic\",\"Not required\",COUNTRY_INFO!V61),\"Treat with IVM\")","v":"Not required"},0,0,null,0]
[{"$f":"IF(INTRO!$E$39<>\"Non-endemic\", \" \", IF(INTRO!$E$37=\"Non-endemic\",\" \", IF(COUNTRY_INFO!A62=0,\" \",COUNTRY_INFO!A62)))","v":" "},{"$f":"IF(INTRO!$E$39<>\"Non-endemic\", \" \", IF(INTRO!$E$37=\"Non-endemic\",\" \", IF(COUNTRY_INFO!B62=0,\" \",COUNTRY_INFO!B62)))","v":" "},{"$f":"IF(INTRO!$E$39<>\"Non-endemic\", \" \", IF(INTRO!$E$37=\"Non-endemic\",\" \", IF(COUNTRY_INFO!C62=0,\" \",COUNTRY_INFO!C62)))","v":" "},{"$f":"IF(INTRO!$E$39<>\"Non-endemic\", 0, IF(INTRO!$E$37=\"Non-endemic\",0,IF(COUNTRY_INFO!$H62=1,COUNTRY_INFO!E62,0)))","v":0},{"$f":"IF(INTRO!$E$39<>\"Non-endemic\", 0, IF(INTRO!$E$37=\"Non-endemic\",0,IF(COUNTRY_INFO!$H62=1,COUNTRY_INFO!F62,0)))","v":0},{"$f":"IF(INTRO!$E$39<>\"Non-endemic\", 0, IF(INTRO!$E$37=\"Non-endemic\",0,IF(COUNTRY_INFO!$H62=1,COUNTRY_INFO!G62,0)))","v":0},0,{"$f":"IF(INTRO!$E$39=\"Non-endemic\",IF(INTRO!$E$37=\"Non-endemic\",\"Not required\",COUNTRY_INFO!V62),\"Treat with IVM\")","v":"Not required"},0,0,null,0]
[{"$f":"IF(INTRO!$E$39<>\"Non-endemic\", \" \", IF(INTRO!$E$37=\"Non-endemic\",\" \", IF(COUNTRY_INFO!A63=0,\" \",COUNTRY_INFO!A63)))","v":" "},{"$f":"IF(INTRO!$E$39<>\"Non-endemic\", \" \", IF(INTRO!$E$37=\"Non-endemic\",\" \", IF(COUNTRY_INFO!B63=0,\" \",COUNTRY_INFO!B63)))","v":" "},{"$f":"IF(INTRO!$E$39<>\"Non-endemic\", \" \", IF(INTRO!$E$37=\"Non-endemic\",\" \", IF(COUNTRY_INFO!C63=0,\" \",COUNTRY_INFO!C63)))","v":" "},{"$f":"IF(INTRO!$E$39<>\"Non-endemic\", 0, IF(INTRO!$E$37=\"Non-endemic\",0,IF(COUNTRY_INFO!$H63=1,COUNTRY_INFO!E63,0)))","v":0},{"$f":"IF(INTRO!$E$39<>\"Non-endemic\", 0, IF(INTRO!$E$37=\"Non-endemic\",0,IF(COUNTRY_INFO!$H63=1,COUNTRY_INFO!F63,0)))","v":0},{"$f":"IF(INTRO!$E$39<>\"Non-endemic\", 0, IF(INTRO!$E$37=\"Non-endemic\",0,IF(COUNTRY_INFO!$H63=1,COUNTRY_INFO!G63,0)))","v":0},0,{"$f":"IF(INTRO!$E$39=\"Non-endemic\",IF(INTRO!$E$37=\"Non-endemic\",\"Not required\",COUNTRY_INFO!V63),\"Treat with IVM\")","v":"Not required"},0,0,null,0]
[{"$f":"IF(INTRO!$E$39<>\"Non-endemic\", \" \", IF(INTRO!$E$37=\"Non-endemic\",\" \", IF(COUNTRY_INFO!A64=0,\" \",COUNTRY_INFO!A64)))","v":" "},{"$f":"IF(INTRO!$E$39<>\"Non-endemic\", \" \", IF(INTRO!$E$37=\"Non-endemic\",\" \", IF(COUNTRY_INFO!B64=0,\" \",COUNTRY_INFO!B64)))","v":" "},{"$f":"IF(INTRO!$E$39<>\"Non-endemic\", \" \", IF(INTRO!$E$37=\"Non-endemic\",\" \", IF(COUNTRY_INFO!C64=0,\" \",COUNTRY_INFO!C64)))","v":" "},{"$f":"IF(INTRO!$E$39<>\"Non-endemic\", 0, IF(INTRO!$E$37=\"Non-endemic\",0,IF(COUNTRY_INFO!$H64=1,COUNTRY_INFO!E64,0)))","v":0},{"$f":"IF(INTRO!$E$39<>\"Non-endemic\", 0, IF(INTRO!$E$37=\"Non-endemic\",0,IF(COUNTRY_INFO!$H64=1,COUNTRY_INFO!F64,0)))","v":0},{"$f":"IF(INTRO!$E$39<>\"Non-endemic\", 0, IF(INTRO!$E$37=\"Non-endemic\",0,IF(COUNTRY_INFO!$H64=1,COUNTRY_INFO!G64,0)))","v":0},0,{"$f":"IF(INTRO!$E$39=\"Non-endemic\",IF(INTRO!$E$37=\"Non-endemic\",\"Not required\",COUNTRY_INFO!V64),\"Treat with IVM\")","v":"Not required"},0,0,null,0]
[{"$f":"IF(INTRO!$E$39<>\"Non-endemic\", \" \", IF(INTRO!$E$37=\"Non-endemic\",\" \", IF(COUNTRY_INFO!A65=0,\" \",COUNTRY_INFO!A65)))","v":" "},{"$f":"IF(INTRO!$E$39<>\"Non-endemic\", \" \", IF(INTRO!$E$37=\"Non-endemic\",\" \", IF(COUNTRY_INFO!B65=0,\" \",COUNTRY_INFO!B65)))","v":" "},{"$f":"IF(INTRO!$E$39<>\"Non-endemic\", \" \", IF(INTRO!$E$37=\"Non-endemic\",\" \", IF(COUNTRY_INFO!C65=0,\" \",COUNTRY_INFO!C65)))","v":" "},{"$f":"IF(INTRO!$E$39<>\"Non-endemic\", 0, IF(INTRO!$E$37=\"Non-endemic\",0,IF(COUNTRY_INFO!$H65=1,COUNTRY_INFO!E65,0)))","v":0},{"$f":"IF(INTRO!$E$39<>\"Non-endemic\", 0, IF(INTRO!$E$37=\"Non-endemic\",0,IF(COUNTRY_INFO!$H65=1,COUNTRY_INFO!F65,0)))","v":0},{"$f":"IF(INTRO!$E$39<>\"Non-endemic\", 0, IF(INTRO!$E$37=\"Non-endemic\",0,IF(COUNTRY_INFO!$H65=1,COUNTRY_INFO!G65,0)))","v":0},0,{"$f":"IF(INTRO!$E$39=\"Non-endemic\",IF(INTRO!$E$37=\"Non-endemic\",\"Not required\",COUNTRY_INFO!V65),\"Treat with IVM\")","v":"Not required"},0,0,null,0]
[{"$f":"IF(INTRO!$E$39<>\"Non-endemic\", \" \", IF(INTRO!$E$37=\"Non-endemic\",\" \", IF(COUNTRY_INFO!A66=0,\" \",COUNTRY_INFO!A66)))","v":" "},{"$f":"IF(INTRO!$E$39<>\"Non-endemic\", \" \", IF(INTRO!$E$37=\"Non-endemic\",\" \", IF(COUNTRY_INFO!B66=0,\" \",COUNTRY_INFO!B66)))","v":" "},{"$f":"IF(INTRO!$E$39<>\"Non-endemic\", \" \", IF(INTRO!$E$37=\"Non-endemic\",\" \", IF(COUNTRY_INFO!C66=0,\" \",COUNTRY_INFO!C66)))","v":" "},{"$f":"IF(INTRO!$E$39<>\"Non-endemic\", 0, IF(INTRO!$E$37=\"Non-endemic\",0,IF(COUNTRY_INFO!$H66=1,COUNTRY_INFO!E66,0)))","v":0},{"$f":"IF(INTRO!$E$39<>\"Non-endemic\", 0, IF(INTRO!$E$37=\"Non-endemic\",0,IF(COUNTRY_INFO!$H66=1,COUNTRY_INFO!F66,0)))","v":0},{"$f":"IF(INTRO!$E$39<>\"Non-endemic\", 0, IF(INTRO!$E$37=\"Non-endemic\",0,IF(COUNTRY_INFO!$H66=1,COUNTRY_INFO!G66,0)))","v":0},0,{"$f":"IF(INTRO!$E$39=\"Non-endemic\",IF(INTRO!$E$37=\"Non-endemic\",\"Not required\",COUNTRY_INFO!V66),\"Treat with IVM\")","v":"Not required"},0,0,null,0]
[{"$f":"IF(INTRO!$E$39<>\"Non-endemic\", \" \", IF(INTRO!$E$37=\"Non-endemic\",\" \", IF(COUNTRY_INFO!A67=0,\" \",COUNTRY_INFO!A67)))","v":" "},{"$f":"IF(INTRO!$E$39<>\"Non-endemic\", \" \", IF(INTRO!$E$37=\"Non-endemic\",\" \", IF(COUNTRY_INFO!B67=0,\" \",COUNTRY_INFO!B67)))","v":" "},{"$f":"IF(INTRO!$E$39<>\"Non-endemic\", \" \", IF(INTRO!$E$37=\"Non-endemic\",\" \", IF(COUNTRY_INFO!C67=0,\" \",COUNTRY_INFO!C67)))","v":" "},{"$f":"IF(INTRO!$E$39<>\"Non-endemic\", 0, IF(INTRO!$E$37=\"Non-endemic\",0,IF(COUNTRY_INFO!$H67=1,COUNTRY_INFO!E67,0)))","v":0},{"$f":"IF(INTRO!$E$39<>\"Non-endemic\", 0, IF(INTRO!$E$37=\"Non-endemic\",0,IF(COUNTRY_INFO!$H67=1,COUNTRY_INFO!F67,0)))","v":0},{"$f":"IF(INTRO!$E$39<>\"Non-endemic\", 0, IF(INTRO!$E$37=\"Non-endemic\",0,IF(COUNTRY_INFO!$H67=1,COUNTRY_INFO!G67,0)))","v":0},0,{"$f":"IF(INTRO!$E$39=\"Non-endemic\",IF(INTRO!$E$37=\"Non-endemic\",\"Not required\",COUNTRY_INFO!V67),\"Treat with IVM\")","v":"Not required"},0,0,null,0]
[{"$f":"IF(INTRO!$E$39<>\"Non-endemic\", \" \", IF(INTRO!$E$37=\"Non-endemic\",\" \", IF(COUNTRY_INFO!A68=0,\" \",COUNTRY_INFO!A68)))","v":" "},{"$f":"IF(INTRO!$E$39<>\"Non-endemic\", \" \", IF(INTRO!$E$37=\"Non-endemic\",\" \", IF(COUNTRY_INFO!B68=0,\" \",COUNTRY_INFO!B68)))","v":" "},{"$f":"IF(INTRO!$E$39<>\"Non-endemic\", \" \", IF(INTRO!$E$37=\"Non-endemic\",\" \", IF(COUNTRY_INFO!C68=0,\" \",COUNTRY_INFO!C68)))","v":" "},{"$f":"IF(INTRO!$E$39<>\"Non-endemic\", 0, IF(INTRO!$E$37=\"Non-endemic\",0,IF(COUNTRY_INFO!$H68=1,COUNTRY_INFO!E68,0)))","v":0},{"$f":"IF(INTRO!$E$39<>\"Non-endemic\", 0, IF(INTRO!$E$37=\"Non-endemic\",0,IF(COUNTRY_INFO!$H68=1,COUNTRY_INFO!F68,0)))","v":0},{"$f":"IF(INTRO!$E$39<>\"Non-endemic\", 0, IF(INTRO!$E$37=\"Non-endemic\",0,IF(COUNTRY_INFO!$H68=1,COUNTRY_INFO!G68,0)))","v":0},0,{"$f":"IF(INTRO!$E$39=\"Non-endemic\",IF(INTRO!$E$37=\"Non-endemic\",\"Not required\",COUNTRY_INFO!V68),\"Treat with IVM\")","v":"Not required"},0,0,null,0]

{"sheet":"ALB_MBD","index":3,"n_rows":68,"n_cols":21,"rows_kept":68,"cut":false,"hidden":false,"merged":[[6,9,6,10],[6,11,7,11],[0,6,0,10],[1,6,1,7],[1,9,1,10],[5,6,5,11],[6,6,6,7],[3,0,3,2],[3,3,3,4],[5,0,5,2],[5,3,5,4],[5,5,7,5],[6,0,7,0],[6,1,7,1],[6,2,7,2],[6,3,7,3],[6,4,7,4],[5,12,5,17],[6,20,7,20],[5,18,5,20],[6,18,7,18],[6,19,7,19],[6,16,7,16],[6,17,7,17],[6,15,7,15],[6,12,7,12],[6,13,7,13],[6,14,7,14]]}
["Albendazole (ALB) and Mebendazole (MBD)",null,null,null,null,null,"Select medicine for treatment of STH for each age group"]
["Administrative structure, eligible population by age group, treatment plan and information about tablets",null,null,null,null,null,null,null,"ALB"]
[]
["TOTAL",null,null,null,null,{"$f":"SUBTOTAL(9,F$10:F$1010)","v":0},null,{"$f":"SUBTOTAL(9,H$10:H$1010)","v":7819},19383,null,21590,48792,0,0,0,19383,0,19383,0,0,0]
[]
["Country administrative structure",null,null,"Treatment plan",null,"People targeted by PELF with ALB","Target population for STH",null,null,null,null,null,"Albendazole (ALB)",null,null,null,null,null,"Mebendazole (MBD)"]
["Country","Province/State","District","LF","STH",null,"PreSAC",null,"SAC","WRA",null,"Total","Total required","Remaining in stock (LF)","Tablets to be procured (LF)","Total required","Remaining in stock (STH)","Tablets to be procured (STH)","Total required","Remaining in stock","Tablets to be procured"]
[null,null,null,null,null,null,"Rounds","People","People","Rounds","People"]
[]
[{"$f":"IF(AND(INTRO!$E$37=\"Non-endemic\",INTRO!$E$41=\"Non-endemic\"),\" \",IF(COUNTRY_INFO!A10=0,\" \",COUNTRY_INFO!A10))","v":"Eswatini"},{"$f":"IF(AND(INTRO!$E$37=\"Non-endemic\",INTRO!$E$41=\"Non-endemic\"),\" \",IF(COUNTRY_INFO!B10=0,\" \",COUNTRY_INFO!B10))","v":"HHOHHO"},{"$f":"IF(AND(INTRO!$E$37=\"Non-endemic\",INTRO!$E$41=\"Non-endemic\"),\" \",IF(COUNTRY_INFO!C10=0,\" \",COUNTRY_INFO!C10))","v":"Hhukwini"},{"$f":"IF(AND(INTRO!$E$37=\"Non-endemic\",INTRO!$E$41=\"Non-endemic\"),0,COUNTRY_INFO!V10)","v":0},{"$f":"IF(AND(INTRO!$E$37=\"Non-endemic\",INTRO!$E$41=\"Non-endemic\"),0,COUNTRY_INFO!X10)","v":1},{"$f":"IF(INTRO!$E$39=\"Non-endemic\",IF($D10=1,DEC!I10,0),IF($D10=1,IVM!G10,0))","v":0},null,{"$f":"IF(OR(COUNTRY_INFO!N10=\"Unknown\",COUNTRY_INFO!N10=\"Surveillance\",COUNTRY_INFO!N10=\"Not required\",COUNTRY_INFO!N10=0),0,IF(INTRO!$E$39=\"Non-endemic\",IF(AND($E10<>0,$G10=\"\"),IF($F10=0,COUNTRY_INFO!N10*$E10,COUNTRY_INFO!N10*($E10-$D10)),IF(AND($E10<>0,$G10<>0),IF($F10=0,COUNTRY_INFO!N10*$G10,COUNTRY_INFO!N10*($G10-$D10)),0)),IF($G10=\"\",COUNTRY_INFO!N10*$E10,COUNTRY_INFO!N10*$G10)))","v":1196},{"$f":"IF(OR(COUNTRY_INFO!O10=\"Unknown\",COUNTRY_INFO!O10=\"Surveillance\",COUNTRY_INFO!O10=\"Not required\",COUNTRY_INFO!O10=0),0,IF($E10<>0, IF($F10=0,COUNTRY_INFO!O10*$E10,COUNTRY_INFO!O10*($E10-$D10)),COUNTRY_INFO!O10*$E10))","v":2965},null,{"$f":"IF(OR(COUNTRY_INFO!P10=\"Unknown\",COUNTRY_INFO!P10=\"Surveillance\",COUNTRY_INFO!P10=\"Not required\",COUNTRY_INFO!P10=0),0,IF(AND($E10<>0,$J10=\"\"),IF($F10=0,COUNTRY_INFO!P10*$E10,COUNTRY_INFO!P10*($E10-$D10)), IF(AND($E10<>0,$J10<>0),IF($F10=0,COUNTRY_INFO!P10*$J10,COUNTRY_INFO!P10*($J10-$D10)), COUNTRY_INFO!P10*$J10)))","v":3302},{"$f":"ROUND($H10,0)+ROUND($I10,0)+ROUND($K10,0)","v":7463},{"$f":"$F10","v":0},null,{"$f":"IF($M10>$N10, $M10-$N10,0)","v":0},{"$f":"ROUND((IF($G$2=\"ALB\",$H10,0)+IF($I$2=\"ALB\",$I10,0)+IF($J$2=\"ALB\",$K10,0)),0)","v":2965},null,{"$f":"IF($P10>$Q10,$P10-$Q10,0)","v":2965},{"$f":"ROUND((IF($G$2=\"MBD\",$H10,0)+IF($I$2=\"MBD\",$I10,0)+IF($J$2=\"MBD\",$K10,0)),0)","v":0},null,{"$f":"IF($S10>$T10,$S10-$T10,0)","v":0}]
[{"$f":"IF(AND(INTRO!$E$37=\"Non-endemic\",INTRO!$E$41=\"Non-endemic\"),\" \",IF(COUNTRY_INFO!A11=0,\" \",COUNTRY_INFO!A11))","v":"Eswatini"},{"$f":"IF(AND(INTRO!$E$37=\"Non-endemic\",INTRO!$E$41=\"Non-endemic\"),\" \",IF(COUNTRY_INFO!B11=0,\" \",COUNTRY_INFO!B11))","v":"HHOHHO"},{"$f":"IF(AND(INTRO!$E$37=\"Non-endemic\",INTRO!$E$41=\"Non-endemic\"),\" \",IF(COUNTRY_INFO!C11=0,\" \",COUNTRY_INFO!C11))","v":"Lobamba"},{"$f":"IF(AND(INTRO!$E$37=\"Non-endemic\",INTRO!$E$41=\"Non-endemic\"),0,COUNTRY_INFO!V11)","v":0},{"$f":"IF(AND(INTRO!$E$37=\"Non-endemic\",INTRO!$E$41=\"Non-endemic\"),0,COUNTRY_INFO!X11)","v":0},{"$f":"IF(INTRO!$E$39=\"Non-endemic\",IF($D11=1,DEC!I11,0),IF($D11=1,IVM!G11,0))","v":0},null,{"$f":"IF(OR(COUNTRY_INFO!N11=\"Unknown\",COUNTRY_INFO!N11=\"Surveillance\",COUNTRY_INFO!N11=\"Not required\",COUNTRY_INFO!N11=0),0,IF(INTRO!$E$39=\"Non-endemic\",IF(AND($E11<>0,$G11=\"\"),IF($F11=0,COUNTRY_INFO!N11*$E11,COUNTRY_INFO!N11*($E11-$D11)),IF(AND($E11<>0,$G11<>0),IF($F11=0,COUNTRY_INFO!N11*$G11,COUNTRY_INFO!N11*($G11-$D11)),0)),IF($G11=\"\",COUNTRY_INFO!N11*$E11,COUNTRY_INFO!N11*$G11)))","v":0},{"$f":"IF(OR(COUNTRY_INFO!O11=\"Unknown\",COUNTRY_INFO!O11=\"Surveillance\",COUNTRY_INFO!O11=\"Not required\",COUNTRY_INFO!O11=0),0,IF($E11<>0, IF($F11=0,COUNTRY_INFO!O11*$E11,COUNTRY_INFO!O11*($E11-$D11)),COUNTRY_INFO!O11*$E11))","v":0},null,{"$f":"IF(OR(COUNTRY_INFO!P11=\"Unknown\",COUNTRY_INFO!P11=\"Surveillance\",COUNTRY_INFO!P11=\"Not required\",COUNTRY_INFO!P11=0),0,IF(AND($E11<>0,$J11=\"\"),IF($F11=0,COUNTRY_INFO!P11*$E11,COUNTRY_INFO!P11*($E11-$D11)), IF(AND($E11<>0,$J11<>0),IF($F11=0,COUNTRY_INFO!P11*$J11,COUNTRY_INFO!P11*($J11-$D11)), COUNTRY_INFO!P11*$J11)))","v":0},0,0,null,0,0,null,0,0,null,0]
[{"$f":"IF(AND(INTRO!$E$37=\"Non-endemic\",INTRO!$E$41=\"Non-endemic\"),\" \",IF(COUNTRY_INFO!A12=0,\" \",COUNTRY_INFO!A12))","v":"Eswatini"},{"$f":"IF(AND(INTRO!$E$37=\"Non-endemic\",INTRO!$E$41=\"Non-endemic\"),\" \",IF(COUNTRY_INFO!B12=0,\" \",COUNTRY_INFO!B12))","v":"HHOHHO"},{"$f":"IF(AND(INTRO!$E$37=\"Non-endemic\",INTRO!$E$41=\"Non-endemic\"),\" \",IF(COUNTRY_INFO!C12=0,\" \",COUNTRY_INFO!C12))","v":"Madlangempisi"},{"$f":"IF(AND(INTRO!$E$37=\"Non-endemic\",INTRO!$E$41=\"Non-endemic\"),0,COUNTRY_INFO!V12)","v":0},{"$f":"IF(AND(INTRO!$E$37=\"Non-endemic\",INTRO!$E$41=\"Non-endemic\"),0,COUNTRY_INFO!X12)","v":0},{"$f":"IF(INTRO!$E$39=\"Non-endemic\",IF($D12=1,DEC!I12,0),IF($D12=1,IVM!G12,0))","v":0},null,{"$f":"IF(OR(COUNTRY_INFO!N12=\"Unknown\",COUNTRY_INFO!N12=\"Surveillance\",COUNTRY_INFO!N12=\"Not required\",COUNTRY_INFO!N12=0),0,IF(INTRO!$E$39=\"Non-endemic\",IF(AND($E12<>0,$G12=\"\"),IF($F12=0,COUNTRY_INFO!N12*$E12,COUNTRY_INFO!N12*($E12-$D12)),IF(AND($E12<>0,$G12<>0),IF($F12=0,COUNTRY_INFO!N12*$G12,COUNTRY_INFO!N12*($G12-$D12)),0)),IF($G12=\"\",COUNTRY_INFO!N12*$E12,COUNTRY_INFO!N12*$G12)))","v":0},{"$f":"IF(OR(COUNTRY_INFO!O12=\"Unknown\",COUNTRY_INFO!O12=\"Surveillance\",COUNTRY_INFO!O12=\"Not required\",COUNTRY_INFO!O12=0),0,IF($E12<>0, IF($F12=0,COUNTRY_INFO!O12*$E12,COUNTRY_INFO!O12*($E12-$D12)),COUNTRY_INFO!O12*$E12))","v":0},null,{"$f":"IF(OR(COUNTRY_INFO!P12=\"Unknown\",COUNTRY_INFO!P12=\"Surveillance\",COUNTRY_INFO!P12=\"Not required\",COUNTRY_INFO!P12=0),0,IF(AND($E12<>0,$J12=\"\"),IF($F12=0,COUNTRY_INFO!P12*$E12,COUNTRY_INFO!P12*($E12-$D12)), IF(AND($E12<>0,$J12<>0),IF($F12=0,COUNTRY_INFO!P12*$J12,COUNTRY_INFO!P12*($J12-$D12)), COUNTRY_INFO!P12*$J12)))","v":0},0,0,null,0,0,null,0,0,null,0]
[{"$f":"IF(AND(INTRO!$E$37=\"Non-endemic\",INTRO!$E$41=\"Non-endemic\"),\" \",IF(COUNTRY_INFO!A13=0,\" \",COUNTRY_INFO!A13))","v":"Eswatini"},{"$f":"IF(AND(INTRO!$E$37=\"Non-endemic\",INTRO!$E$41=\"Non-endemic\"),\" \",IF(COUNTRY_INFO!B13=0,\" \",COUNTRY_INFO!B13))","v":"HHOHHO"},{"$f":"IF(AND(INTRO!$E$37=\"Non-endemic\",INTRO!$E$41=\"Non-endemic\"),\" \",IF(COUNTRY_INFO!C13=0,\" \",COUNTRY_INFO!C13))","v":"Maphalaleni"},{"$f":"IF(AND(INTRO!$E$37=\"Non-endemic\",INTRO!$E$41=\"Non-endemic\"),0,COUNTRY_INFO!V13)","v":0},{"$f":"IF(AND(INTRO!$E$37=\"Non-endemic\",INTRO!$E$41=\"Non-endemic\"),0,COUNTRY_INFO!X13)","v":0},{"$f":"IF(INTRO!$E$39=\"Non-endemic\",IF($D13=1,DEC!I13,0),IF($D13=1,IVM!G13,0))","v":0},null,{"$f":"IF(OR(COUNTRY_INFO!N13=\"Unknown\",COUNTRY_INFO!N13=\"Surveillance\",COUNTRY_INFO!N13=\"Not required\",COUNTRY_INFO!N13=0),0,IF(INTRO!$E$39=\"Non-endemic\",IF(AND($E13<>0,$G13=\"\"),IF($F13=0,COUNTRY_INFO!N13*$E13,COUNTRY_INFO!N13*($E13-$D13)),IF(AND($E13<>0,$G13<>0),IF($F13=0,COUNTRY_INFO!N13*$G13,COUNTRY_INFO!N13*($G13-$D13)),0)),IF($G13=\"\",COUNTRY_INFO!N13*$E13,COUNTRY_INFO!N13*$G13)))","v":0},{"$f":"IF(OR(COUNTRY_INFO!O13=\"Unknown\",COUNTRY_INFO!O13=\"Surveillance\",COUNTRY_INFO!O13=\"Not required\",COUNTRY_INFO!O13=0),0,IF($E13<>0, IF($F13=0,COUNTRY_INFO!O13*$E13,COUNTRY_INFO!O13*($E13-$D13)),COUNTRY_INFO!O13*$E13))","v":0},null,{"$f":"IF(OR(COUNTRY_INFO!P13=\"Unknown\",COUNTRY_INFO!P13=\"Surveillance\",COUNTRY_INFO!P13=\"Not required\",COUNTRY_INFO!P13=0),0,IF(AND($E13<>0,$J13=\"\"),IF($F13=0,COUNTRY_INFO!P13*$E13,COUNTRY_INFO!P13*($E13-$D13)), IF(AND($E13<>0,$J13<>0),IF($F13=0,COUNTRY_INFO!P13*$J13,COUNTRY_INFO!P13*($J13-$D13)), COUNTRY_INFO!P13*$J13)))","v":0},0,0,null,0,0,null,0,0,null,0]
[{"$f":"IF(AND(INTRO!$E$37=\"Non-endemic\",INTRO!$E$41=\"Non-endemic\"),\" \",IF(COUNTRY_INFO!A14=0,\" \",COUNTRY_INFO!A14))","v":"Eswatini"},{"$f":"IF(AND(INTRO!$E$37=\"Non-endemic\",INTRO!$E$41=\"Non-endemic\"),\" \",IF(COUNTRY_INFO!B14=0,\" \",COUNTRY_INFO!B14))","v":"HHOHHO"},{"$f":"IF(AND(INTRO!$E$37=\"Non-endemic\",INTRO!$E$41=\"Non-endemic\"),\" \",IF(COUNTRY_INFO!C14=0,\" \",COUNTRY_INFO!C14))","v":"Mayiwane"},{"$f":"IF(AND(INTRO!$E$37=\"Non-endemic\",INTRO!$E$41=\"Non-endemic\"),0,COUNTRY_INFO!V14)","v":0},{"$f":"IF(AND(INTRO!$E$37=\"Non-endemic\",INTRO!$E$41=\"Non-endemic\"),0,COUNTRY_INFO!X14)","v":0},{"$f":"IF(INTRO!$E$39=\"Non-endemic\",IF($D14=1,DEC!I14,0),IF($D14=1,IVM!G14,0))","v":0},null,{"$f":"IF(OR(COUNTRY_INFO!N14=\"Unknown\",COUNTRY_INFO!N14=\"Surveillance\",COUNTRY_INFO!N14=\"Not required\",COUNTRY_INFO!N14=0),0,IF(INTRO!$E$39=\"Non-endemic\",IF(AND($E14<>0,$G14=\"\"),IF($F14=0,COUNTRY_INFO!N14*$E14,COUNTRY_INFO!N14*($E14-$D14)),IF(AND($E14<>0,$G14<>0),IF($F14=0,COUNTRY_INFO!N14*$G14,COUNTRY_INFO!N14*($G14-$D14)),0)),IF($G14=\"\",COUNTRY_INFO!N14*$E14,COUNTRY_INFO!N14*$G14)))","v":0},{"$f":"IF(OR(COUNTRY_INFO!O14=\"Unknown\",COUNTRY_INFO!O14=\"Surveillance\",COUNTRY_INFO!O14=\"Not required\",COUNTRY_INFO!O14=0),0,IF($E14<>0, IF($F14=0,COUNTRY_INFO!O14*$E14,COUNTRY_INFO!O14*($E14-$D14)),COUNTRY_INFO!O14*$E14))","v":0},null,{"$f":"IF(OR(COUNTRY_INFO!P14=\"Unknown\",COUNTRY_INFO!P14=\"Surveillance\",COUNTRY_INFO!P14=\"Not required\",COUNTRY_INFO!P14=0),0,IF(AND($E14<>0,$J14=\"\"),IF($F14=0,COUNTRY_INFO!P14*$E14,COUNTRY_INFO!P14*($E14-$D14)), IF(AND($E14<>0,$J14<>0),IF($F14=0,COUNTRY_INFO!P14*$J14,COUNTRY_INFO!P14*($J14-$D14)), COUNTRY_INFO!P14*$J14)))","v":0},0,0,null,0,0,null,0,0,null,0]
[{"$f":"IF(AND(INTRO!$E$37=\"Non-endemic\",INTRO!$E$41=\"Non-endemic\"),\" \",IF(COUNTRY_INFO!A15=0,\" \",COUNTRY_INFO!A15))","v":"Eswatini"},{"$f":"IF(AND(INTRO!$E$37=\"Non-endemic\",INTRO!$E$41=\"Non-endemic\"),\" \",IF(COUNTRY_INFO!B15=0,\" \",COUNTRY_INFO!B15))","v":"HHOHHO"},{"$f":"IF(AND(INTRO!$E$37=\"Non-endemic\",INTRO!$E$41=\"Non-endemic\"),\" \",IF(COUNTRY_INFO!C15=0,\" \",COUNTRY_INFO!C15))","v":"Mbabane East"},{"$f":"IF(AND(INTRO!$E$37=\"Non-endemic\",INTRO!$E$41=\"Non-endemic\"),0,COUNTRY_INFO!V15)","v":0},{"$f":"IF(AND(INTRO!$E$37=\"Non-endemic\",INTRO!$E$41=\"Non-endemic\"),0,COUNTRY_INFO!X15)","v":0},{"$f":"IF(INTRO!$E$39=\"Non-endemic\",IF($D15=1,DEC!I15,0),IF($D15=1,IVM!G15,0))","v":0},null,{"$f":"IF(OR(COUNTRY_INFO!N15=\"Unknown\",COUNTRY_INFO!N15=\"Surveillance\",COUNTRY_INFO!N15=\"Not required\",COUNTRY_INFO!N15=0),0,IF(INTRO!$E$39=\"Non-endemic\",IF(AND($E15<>0,$G15=\"\"),IF($F15=0,COUNTRY_INFO!N15*$E15,COUNTRY_INFO!N15*($E15-$D15)),IF(AND($E15<>0,$G15<>0),IF($F15=0,COUNTRY_INFO!N15*$G15,COUNTRY_INFO!N15*($G15-$D15)),0)),IF($G15=\"\",COUNTRY_INFO!N15*$E15,COUNTRY_INFO!N15*$G15)))","v":0},{"$f":"IF(OR(COUNTRY_INFO!O15=\"Unknown\",COUNTRY_INFO!O15=\"Surveillance\",COUNTRY_INFO!O15=\"Not required\",COUNTRY_INFO!O15=0),0,IF($E15<>0, IF($F15=0,COUNTRY_INFO!O15*$E15,COUNTRY_INFO!O15*($E15-$D15)),COUNTRY_INFO!O15*$E15))","v":0},null,{"$f":"IF(OR(COUNTRY_INFO!P15=\"Unknown\",COUNTRY_INFO!P15=\"Surveillance\",COUNTRY_INFO!P15=\"Not required\",COUNTRY_INFO!P15=0),0,IF(AND($E15<>0,$J15=\"\"),IF($F15=0,COUNTRY_INFO!P15*$E15,COUNTRY_INFO!P15*($E15-$D15)), IF(AND($E15<>0,$J15<>0),IF($F15=0,COUNTRY_INFO!P15*$J15,COUNTRY_INFO!P15*($J15-$D15)), COUNTRY_INFO!P15*$J15)))","v":0},0,0,null,0,0,null,0,0,null,0]
[{"$f":"IF(AND(INTRO!$E$37=\"Non-endemic\",INTRO!$E$41=\"Non-endemic\"),\" \",IF(COUNTRY_INFO!A16=0,\" \",COUNTRY_INFO!A16))","v":"Eswatini"},{"$f":"IF(AND(INTRO!$E$37=\"Non-endemic\",INTRO!$E$41=\"Non-endemic\"),\" \",IF(COUNTRY_INFO!B16=0,\" \",COUNTRY_INFO!B16))","v":"HHOHHO"},{"$f":"IF(AND(INTRO!$E$37=\"Non-endemic\",INTRO!$E$41=\"Non-endemic\"),\" \",IF(COUNTRY_INFO!C16=0,\" \",COUNTRY_INFO!C16))","v":"Mbabane West"},{"$f":"IF(AND(INTRO!$E$37=\"Non-endemic\",INTRO!$E$41=\"Non-endemic\"),0,COUNTRY_INFO!V16)","v":0},{"$f":"IF(AND(INTRO!$E$37=\"Non-endemic\",INTRO!$E$41=\"Non-endemic\"),0,COUNTRY_INFO!X16)","v":0},{"$f":"IF(INTRO!$E$39=\"Non-endemic\",IF($D16=1,DEC!I16,0),IF($D16=1,IVM!G16,0))","v":0},null,{"$f":"IF(OR(COUNTRY_INFO!N16=\"Unknown\",COUNTRY_INFO!N16=\"Surveillance\",COUNTRY_INFO!N16=\"Not required\",COUNTRY_INFO!N16=0),0,IF(INTRO!$E$39=\"Non-endemic\",IF(AND($E16<>0,$G16=\"\"),IF($F16=0,COUNTRY_INFO!N16*$E16,COUNTRY_INFO!N16*($E16-$D16)),IF(AND($E16<>0,$G16<>0),IF($F16=0,COUNTRY_INFO!N16*$G16,COUNTRY_INFO!N16*($G16-$D16)),0)),IF($G16=\"\",COUNTRY_INFO!N16*$E16,COUNTRY_INFO!N16*$G16)))","v":0},{"$f":"IF(OR(COUNTRY_INFO!O16=\"Unknown\",COUNTRY_INFO!O16=\"Surveillance\",COUNTRY_INFO!O16=\"Not required\",COUNTRY_INFO!O16=0),0,IF($E16<>0, IF($F16=0,COUNTRY_INFO!O16*$E16,COUNTRY_INFO!O16*($E16-$D16)),COUNTRY_INFO!O16*$E16))","v":0},null,{"$f":"IF(OR(COUNTRY_INFO!P16=\"Unknown\",COUNTRY_INFO!P16=\"Surveillance\",COUNTRY_INFO!P16=\"Not required\",COUNTRY_INFO!P16=0),0,IF(AND($E16<>0,$J16=\"\"),IF($F16=0,COUNTRY_INFO!P16*$E16,COUNTRY_INFO!P16*($E16-$D16)), IF(AND($E16<>0,$J16<>0),IF($F16=0,COUNTRY_INFO!P16*$J16,COUNTRY_INFO!P16*($J16-$D16)), COUNTRY_INFO!P16*$J16)))","v":0},0,0,null,0,0,null,0,0,null,0]
[{"$f":"IF(AND(INTRO!$E$37=\"Non-endemic\",INTRO!$E$41=\"Non-endemic\"),\" \",IF(COUNTRY_INFO!A17=0,\" \",COUNTRY_INFO!A17))","v":"Eswatini"},{"$f":"IF(AND(INTRO!$E$37=\"Non-endemic\",INTRO!$E$41=\"Non-endemic\"),\" \",IF(COUNTRY_INFO!B17=0,\" \",COUNTRY_INFO!B17))","v":"HHOHHO"},{"$f":"IF(AND(INTRO!$E$37=\"Non-endemic\",INTRO!$E$41=\"Non-endemic\"),\" \",IF(COUNTRY_INFO!C17=0,\" \",COUNTRY_INFO!C17))","v":"Mhlangatane"},{"$f":"IF(AND(INTRO!$E$37=\"Non-endemic\",INTRO!$E$41=\"Non-endemic\"),0,COUNTRY_INFO!V17)","v":0},{"$f":"IF(AND(INTRO!$E$37=\"Non-endemic\",INTRO!$E$41=\"Non-endemic\"),0,COUNTRY_INFO!X17)","v":0},{"$f":"IF(INTRO!$E$39=\"Non-endemic\",IF($D17=1,DEC!I17,0),IF($D17=1,IVM!G17,0))","v":0},null,{"$f":"IF(OR(COUNTRY_INFO!N17=\"Unknown\",COUNTRY_INFO!N17=\"Surveillance\",COUNTRY_INFO!N17=\"Not required\",COUNTRY_INFO!N17=0),0,IF(INTRO!$E$39=\"Non-endemic\",IF(AND($E17<>0,$G17=\"\"),IF($F17=0,COUNTRY_INFO!N17*$E17,COUNTRY_INFO!N17*($E17-$D17)),IF(AND($E17<>0,$G17<>0),IF($F17=0,COUNTRY_INFO!N17*$G17,COUNTRY_INFO!N17*($G17-$D17)),0)),IF($G17=\"\",COUNTRY_INFO!N17*$E17,COUNTRY_INFO!N17*$G17)))","v":0},{"$f":"IF(OR(COUNTRY_INFO!O17=\"Unknown\",COUNTRY_INFO!O17=\"Surveillance\",COUNTRY_INFO!O17=\"Not required\",COUNTRY_INFO!O17=0),0,IF($E17<>0, IF($F17=0,COUNTRY_INFO!O17*$E17,COUNTRY_INFO!O17*($E17-$D17)),COUNTRY_INFO!O17*$E17))","v":0},null,{"$f":"IF(OR(COUNTRY_INFO!P17=\"Unknown\",COUNTRY_INFO!P17=\"Surveillance\",COUNTRY_INFO!P17=\"Not required\",COUNTRY_INFO!P17=0),0,IF(AND($E17<>0,$J17=\"\"),IF($F17=0,COUNTRY_INFO!P17*$E17,COUNTRY_INFO!P17*($E17-$D17)), IF(AND($E17<>0,$J17<>0),IF($F17=0,COUNTRY_INFO!P17*$J17,COUNTRY_INFO!P17*($J17-$D17)), COUNTRY_INFO!P17*$J17)))","v":0},0,0,null,0,0,null,0,0,null,0]
[{"$f":"IF(AND(INTRO!$E$37=\"Non-endemic\",INTRO!$E$41=\"Non-endemic\"),\" \",IF(COUNTRY_INFO!A18=0,\" \",COUNTRY_INFO!A18))","v":"Eswatini"},{"$f":"IF(AND(INTRO!$E$37=\"Non-endemic\",INTRO!$E$41=\"Non-endemic\"),\" \",IF(COUNTRY_INFO!B18=0,\" \",COUNTRY_INFO!B18))","v":"HHOHHO"},{"$f":"IF(AND(INTRO!$E$37=\"Non-endemic\",INTRO!$E$41=\"Non-endemic\"),\" \",IF(COUNTRY_INFO!C18=0,\" \",COUNTRY_INFO!C18))","v":"Motshane"},{"$f":"IF(AND(INTRO!$E$37=\"Non-endemic\",INTRO!$E$41=\"Non-endemic\"),0,COUNTRY_INFO!V18)","v":0},{"$f":"IF(AND(INTRO!$E$37=\"Non-endemic\",INTRO!$E$41=\"Non-endemic\"),0,COUNTRY_INFO!X18)","v":1},{"$f":"IF(INTRO!$E$39=\"Non-endemic\",IF($D18=1,DEC!I18,0),IF($D18=1,IVM!G18,0))","v":0},null,{"$f":"IF(OR(COUNTRY_INFO!N18=\"Unknown\",COUNTRY_INFO!N18=\"Surveillance\",COUNTRY_INFO!N18=\"Not required\",COUNTRY_INFO!N18=0),0,IF(INTRO!$E$39=\"Non-endemic\",IF(AND($E18<>0,$G18=\"\"),IF($F18=0,COUNTRY_INFO!N18*$E18,COUNTRY_INFO!N18*($E18-$D18)),IF(AND($E18<>0,$G18<>0),IF($F18=0,COUNTRY_INFO!N18*$G18,COUNTRY_INFO!N18*($G18-$D18)),0)),IF($G18=\"\",COUNTRY_INFO!N18*$E18,COUNTRY_INFO!N18*$G18)))","v":2756},{"$f":"IF(OR(COUNTRY_INFO!O18=\"Unknown\",COUNTRY_INFO!O18=\"Surveillance\",COUNTRY_INFO!O18=\"Not required\",COUNTRY_INFO!O18=0),0,IF($E18<>0, IF($F18=0,COUNTRY_INFO!O18*$E18,COUNTRY_INFO!O18*($E18-$D18)),COUNTRY_INFO!O18*$E18))","v":6832},null,{"$f":"IF(OR(COUNTRY_INFO!P18=\"Unknown\",COUNTRY_INFO!P18=\"Surveillance\",COUNTRY_INFO!P18=\"Not required\",COUNTRY_INFO!P18=0),0,IF(AND($E18<>0,$J18=\"\"),IF($F18=0,COUNTRY_INFO!P18*$E18,COUNTRY_INFO!P18*($E18-$D18)), IF(AND($E18<>0,$J18<>0),IF($F18=0,COUNTRY_INFO!P18*$J18,COUNTRY_INFO!P18*($J18-$D18)), COUNTRY_INFO!P18*$J18)))","v":7610},17198,0,null,0,6832,null,6832,0,null,0]
[{"$f":"IF(AND(INTRO!$E$37=\"Non-endemic\",INTRO!$E$41=\"Non-endemic\"),\" \",IF(COUNTRY_INFO!A19=0,\" \",COUNTRY_INFO!A19))","v":"Eswatini"},{"$f":"IF(AND(INTRO!$E$37=\"Non-endemic\",INTRO!$E$41=\"Non-endemic\"),\" \",IF(COUNTRY_INFO!B19=0,\" \",COUNTRY_INFO!B19))","v":"HHOHHO"},{"$f":"IF(AND(INTRO!$E$37=\"Non-endemic\",INTRO!$E$41=\"Non-endemic\"),\" \",IF(COUNTRY_INFO!C19=0,\" \",COUNTRY_INFO!C19))","v":"Ndzingeni"},{"$f":"IF(AND(INTRO!$E$37=\"Non-endemic\",INTRO!$E$41=\"Non-endemic\"),0,COUNTRY_INFO!V19)","v":0},{"$f":"IF(AND(INTRO!$E$37=\"Non-endemic\",INTRO!$E$41=\"Non-endemic\"),0,COUNTRY_INFO!X19)","v":0},{"$f":"IF(INTRO!$E$39=\"Non-endemic\",IF($D19=1,DEC!I19,0),IF($D19=1,IVM!G19,0))","v":0},null,{"$f":"IF(OR(COUNTRY_INFO!N19=\"Unknown\",COUNTRY_INFO!N19=\"Surveillance\",COUNTRY_INFO!N19=\"Not required\",COUNTRY_INFO!N19=0),0,IF(INTRO!$E$39=\"Non-endemic\",IF(AND($E19<>0,$G19=\"\"),IF($F19=0,COUNTRY_INFO!N19*$E19,COUNTRY_INFO!N19*($E19-$D19)),IF(AND($E19<>0,$G19<>0),IF($F19=0,COUNTRY_INFO!N19*$G19,COUNTRY_INFO!N19*($G19-$D19)),0)),IF($G19=\"\",COUNTRY_INFO!N19*$E19,COUNTRY_INFO!N19*$G19)))","v":0},{"$f":"IF(OR(COUNTRY_INFO!O19=\"Unknown\",COUNTRY_INFO!O19=\"Surveillance\",COUNTRY_INFO!O19=\"Not required\",COUNTRY_INFO!O19=0),0,IF($E19<>0, IF($F19=0,COUNTRY_INFO!O19*$E19,COUNTRY_INFO!O19*($E19-$D19)),COUNTRY_INFO!O19*$E19))","v":0},null,{"$f":"IF(OR(COUNTRY_INFO!P19=\"Unknown\",COUNTRY_INFO!P19=\"Surveillance\",COUNTRY_INFO!P19=\"Not required\",COUNTRY_INFO!P19=0),0,IF(AND($E19<>0,$J19=\"\"),IF($F19=0,COUNTRY_INFO!P19*$E19,COUNTRY_INFO!P19*($E19-$D19)), IF(AND($E19<>0,$J19<>0),IF($F19=0,COUNTRY_INFO!P19*$J19,COUNTRY_INFO!P19*($J19-$D19)), COUNTRY_INFO!P19*$J19)))","v":0},0,0,null,0,0,null,0,0,null,0]
[{"$f":"IF(AND(INTRO!$E$37=\"Non-endemic\",INTRO!$E$41=\"Non-endemic\"),\" \",IF(COUNTRY_INFO!A20=0,\" \",COUNTRY_INFO!A20))","v":"Eswatini"},{"$f":"IF(AND(INTRO!$E$37=\"Non-endemic\",INTRO!$E$41=\"Non-endemic\"),\" \",IF(COUNTRY_INFO!B20=0,\" \",COUNTRY_INFO!B20))","v":"HHOHHO"},{"$f":"IF(AND(INTRO!$E$37=\"Non-endemic\",INTRO!$E$41=\"Non-endemic\"),\" \",IF(COUNTRY_INFO!C20=0,\" \",COUNTRY_INFO!C20))","v":"Nkhaba"},{"$f":"IF(AND(INTRO!$E$37=\"Non-endemic\",INTRO!$E$41=\"Non-endemic\"),0,COUNTRY_INFO!V20)","v":0},{"$f":"IF(AND(INTRO!$E$37=\"Non-endemic\",INTRO!$E$41=\"Non-endemic\"),0,COUNTRY_INFO!X20)","v":0},{"$f":"IF(INTRO!$E$39=\"Non-endemic\",IF($D20=1,DEC!I20,0),IF($D20=1,IVM!G20,0))","v":0},null,{"$f":"IF(OR(COUNTRY_INFO!N20=\"Unknown\",COUNTRY_INFO!N20=\"Surveillance\",COUNTRY_INFO!N20=\"Not required\",COUNTRY_INFO!N20=0),0,IF(INTRO!$E$39=\"Non-endemic\",IF(AND($E20<>0,$G20=\"\"),IF($F20=0,COUNTRY_INFO!N20*$E20,COUNTRY_INFO!N20*($E20-$D20)),IF(AND($E20<>0,$G20<>0),IF($F20=0,COUNTRY_INFO!N20*$G20,COUNTRY_INFO!N20*($G20-$D20)),0)),IF($G20=\"\",COUNTRY_INFO!N20*$E20,COUNTRY_INFO!N20*$G20)))","v":0},{"$f":"IF(OR(COUNTRY_INFO!O20=\"Unknown\",COUNTRY_INFO!O20=\"Surveillance\",COUNTRY_INFO!O20=\"Not required\",COUNTRY_INFO!O20=0),0,IF($E20<>0, IF($F20=0,COUNTRY_INFO!O20*$E20,COUNTRY_INFO!O20*($E20-$D20)),COUNTRY_INFO!O20*$E20))","v":0},null,{"$f":"IF(OR(COUNTRY_INFO!P20=\"Unknown\",COUNTRY_INFO!P20=\"Surveillance\",COUNTRY_INFO!P20=\"Not required\",COUNTRY_INFO!P20=0),0,IF(AND($E20<>0,$J20=\"\"),IF($F20=0,COUNTRY_INFO!P20*$E20,COUNTRY_INFO!P20*($E20-$D20)), IF(AND($E20<>0,$J20<>0),IF($F20=0,COUNTRY_INFO!P20*$J20,COUNTRY_INFO!P20*($J20-$D20)), COUNTRY_INFO!P20*$J20)))","v":0},0,0,null,0,0,null,0,0,null,0]
[{"$f":"IF(AND(INTRO!$E$37=\"Non-endemic\",INTRO!$E$41=\"Non-endemic\"),\" \",IF(COUNTRY_INFO!A21=0,\" \",COUNTRY_INFO!A21))","v":"Eswatini"},{"$f":"IF(AND(INTRO!$E$37=\"Non-endemic\",INTRO!$E$41=\"Non-endemic\"),\" \",IF(COUNTRY_INFO!B21=0,\" \",COUNTRY_INFO!B21))","v":"HHOHHO"},{"$f":"IF(AND(INTRO!$E$37=\"Non-endemic\",INTRO!$E$41=\"Non-endemic\"),\" \",IF(COUNTRY_INFO!C21=0,\" \",COUNTRY_INFO!C21))","v":"Ntfonjeni"},{"$f":"IF(AND(INTRO!$E$37=\"Non-endemic\",INTRO!$E$41=\"Non-endemic\"),0,COUNTRY_INFO!V21)","v":0},{"$f":"IF(AND(INTRO!$E$37=\"Non-endemic\",INTRO!$E$41=\"Non-endemic\"),0,COUNTRY_INFO!X21)","v":0},{"$f":"IF(INTRO!$E$39=\"Non-endemic\",IF($D21=1,DEC!I21,0),IF($D21=1,IVM!G21,0))","v":0},null,{"$f":"IF(OR(COUNTRY_INFO!N21=\"Unknown\",COUNTRY_INFO!N21=\"Surveillance\",COUNTRY_INFO!N21=\"Not required\",COUNTRY_INFO!N21=0),0,IF(INTRO!$E$39=\"Non-endemic\",IF(AND($E21<>0,$G21=\"\"),IF($F21=0,COUNTRY_INFO!N21*$E21,COUNTRY_INFO!N21*($E21-$D21)),IF(AND($E21<>0,$G21<>0),IF($F21=0,COUNTRY_INFO!N21*$G21,COUNTRY_INFO!N21*($G21-$D21)),0)),IF($G21=\"\",COUNTRY_INFO!N21*$E21,COUNTRY_INFO!N21*$G21)))","v":0},{"$f":"IF(OR(COUNTRY_INFO!O21=\"Unknown\",COUNTRY_INFO!O21=\"Surveillance\",COUNTRY_INFO!O21=\"Not required\",COUNTRY_INFO!O21=0),0,IF($E21<>0, IF($F21=0,COUNTRY_INFO!O21*$E21,COUNTRY_INFO!O21*($E21-$D21)),COUNTRY_INFO!O21*$E21))","v":0},null,{"$f":"IF(OR(COUNTRY_INFO!P21=\"Unknown\",COUNTRY_INFO!P21=\"Surveillance\",COUNTRY_INFO!P21=\"Not required\",COUNTRY_INFO!P21=0),0,IF(AND($E21<>0,$J21=\"\"),IF($F21=0,COUNTRY_INFO!P21*$E21,COUNTRY_INFO!P21*($E21-$D21)), IF(AND($E21<>0,$J21<>0),IF($F21=0,COUNTRY_INFO!P21*$J21,COUNTRY_INFO!P21*($J21-$D21)), COUNTRY_INFO!P21*$J21)))","v":0},0,0,null,0,0,null,0,0,null,0]
[{"$f":"IF(AND(INTRO!$E$37=\"Non-endemic\",INTRO!$E$41=\"Non-endemic\"),\" \",IF(COUNTRY_INFO!A22=0,\" \",COUNTRY_INFO!A22))","v":"Eswatini"},{"$f":"IF(AND(INTRO!$E$37=\"Non-endemic\",INTRO!$E$41=\"Non-endemic\"),\" \",IF(COUNTRY_INFO!B22=0,\" \",COUNTRY_INFO!B22))","v":"HHOHHO"},{"$f":"IF(AND(INTRO!$E$37=\"Non-endemic\",INTRO!$E$41=\"Non-endemic\"),\" \",IF(COUNTRY_INFO!C22=0,\" \",COUNTRY_INFO!C22))","v":"Pigg's Peak"},{"$f":"IF(AND(INTRO!$E$37=\"Non-endemic\",INTRO!$E$41=\"Non-endemic\"),0,COUNTRY_INFO!V22)","v":0},{"$f":"IF(AND(INTRO!$E$37=\"Non-endemic\",INTRO!$E$41=\"Non-endemic\"),0,COUNTRY_INFO!X22)","v":0},{"$f":"IF(INTRO!$E$39=\"Non-endemic\",IF($D22=1,DEC!I22,0),IF($D22=1,IVM!G22,0))","v":0},null,{"$f":"IF(OR(COUNTRY_INFO!N22=\"Unknown\",COUNTRY_INFO!N22=\"Surveillance\",COUNTRY_INFO!N22=\"Not required\",COUNTRY_INFO!N22=0),0,IF(INTRO!$E$39=\"Non-endemic\",IF(AND($E22<>0,$G22=\"\"),IF($F22=0,COUNTRY_INFO!N22*$E22,COUNTRY_INFO!N22*($E22-$D22)),IF(AND($E22<>0,$G22<>0),IF($F22=0,COUNTRY_INFO!N22*$G22,COUNTRY_INFO!N22*($G22-$D22)),0)),IF($G22=\"\",COUNTRY_INFO!N22*$E22,COUNTRY_INFO!N22*$G22)))","v":0},{"$f":"IF(OR(COUNTRY_INFO!O22=\"Unknown\",COUNTRY_INFO!O22=\"Surveillance\",COUNTRY_INFO!O22=\"Not required\",COUNTRY_INFO!O22=0),0,IF($E22<>0, IF($F22=0,COUNTRY_INFO!O22*$E22,COUNTRY_INFO!O22*($E22-$D22)),COUNTRY_INFO!O22*$E22))","v":0},null,{"$f":"IF(OR(COUNTRY_INFO!P22=\"Unknown\",COUNTRY_INFO!P22=\"Surveillance\",COUNTRY_INFO!P22=\"Not required\",COUNTRY_INFO!P22=0),0,IF(AND($E22<>0,$J22=\"\"),IF($F22=0,COUNTRY_INFO!P22*$E22,COUNTRY_INFO!P22*($E22-$D22)), IF(AND($E22<>0,$J22<>0),IF($F22=0,COUNTRY_INFO!P22*$J22,COUNTRY_INFO!P22*($J22-$D22)), COUNTRY_INFO!P22*$J22)))","v":0},0,0,null,0,0,null,0,0,null,0]
[{"$f":"IF(AND(INTRO!$E$37=\"Non-endemic\",INTRO!$E$41=\"Non-endemic\"),\" \",IF(COUNTRY_INFO!A23=0,\" \",COUNTRY_INFO!A23))","v":"Eswatini"},{"$f":"IF(AND(INTRO!$E$37=\"Non-endemic\",INTRO!$E$41=\"Non-endemic\"),\" \",IF(COUNTRY_INFO!B23=0,\" \",COUNTRY_INFO!B23))","v":"HHOHHO"},{"$f":"IF(AND(INTRO!$E$37=\"Non-endemic\",INTRO!$E$41=\"Non-endemic\"),\" \",IF(COUNTRY_INFO!C23=0,\" \",COUNTRY_INFO!C23))","v":"Siphocosini"},{"$f":"IF(AND(INTRO!$E$37=\"Non-endemic\",INTRO!$E$41=\"Non-endemic\"),0,COUNTRY_INFO!V23)","v":0},{"$f":"IF(AND(INTRO!$E$37=\"Non-endemic\",INTRO!$E$41=\"Non-endemic\"),0,COUNTRY_INFO!X23)","v":1},{"$f":"IF(INTRO!$E$39=\"Non-endemic\",IF($D23=1,DEC!I23,0),IF($D23=1,IVM!G23,0))","v":0},null,{"$f":"IF(OR(COUNTRY_INFO!N23=\"Unknown\",COUNTRY_INFO!N23=\"Surveillance\",COUNTRY_INFO!N23=\"Not required\",COUNTRY_INFO!N23=0),0,IF(INTRO!$E$39=\"Non-endemic\",IF(AND($E23<>0,$G23=\"\"),IF($F23=0,COUNTRY_INFO!N23*$E23,COUNTRY_INFO!N23*($E23-$D23)),IF(AND($E23<>0,$G23<>0),IF($F23=0,COUNTRY_INFO!N23*$G23,COUNTRY_INFO!N23*($G23-$D23)),0)),IF($G23=\"\",COUNTRY_INFO!N23*$E23,COUNTRY_INFO!N23*$G23)))","v":2604},{"$f":"IF(OR(COUNTRY_INFO!O23=\"Unknown\",COUNTRY_INFO!O23=\"Surveillance\",COUNTRY_INFO!O23=\"Not required\",COUNTRY_INFO!O23=0),0,IF($E23<>0, IF($F23=0,COUNTRY_INFO!O23*$E23,COUNTRY_INFO!O23*($E23-$D23)),COUNTRY_INFO!O23*$E23))","v":6456},null,{"$f":"IF(OR(COUNTRY_INFO!P23=\"Unknown\",COUNTRY_INFO!P23=\"Surveillance\",COUNTRY_INFO!P23=\"Not required\",COUNTRY_INFO!P23=0),0,IF(AND($E23<>0,$J23=\"\"),IF($F23=0,COUNTRY_INFO!P23*$E23,COUNTRY_INFO!P23*($E23-$D23)), IF(AND($E23<>0,$J23<>0),IF($F23=0,COUNTRY_INFO!P23*$J23,COUNTRY_INFO!P23*($J23-$D23)), COUNTRY_INFO!P23*$J23)))","v":7191},16251,0,null,0,6456,null,6456,0,null,0]
[{"$f":"IF(AND(INTRO!$E$37=\"Non-endemic\",INTRO!$E$41=\"Non-endemic\"),\" \",IF(COUNTRY_INFO!A24=0,\" \",COUNTRY_INFO!A24))","v":"Eswatini"},{"$f":"IF(AND(INTRO!$E$37=\"Non-endemic\",INTRO!$E$41=\"Non-endemic\"),\" \",IF(COUNTRY_INFO!B24=0,\" \",COUNTRY_INFO!B24))","v":"HHOHHO"},{"$f":"IF(AND(INTRO!$E$37=\"Non-endemic\",INTRO!$E$41=\"Non-endemic\"),\" \",IF(COUNTRY_INFO!C24=0,\" \",COUNTRY_INFO!C24))","v":"Timphisini"},{"$f":"IF(AND(INTRO!$E$37=\"Non-endemic\",INTRO!$E$41=\"Non-endemic\"),0,COUNTRY_INFO!V24)","v":0},{"$f":"IF(AND(INTRO!$E$37=\"Non-endemic\",INTRO!$E$41=\"Non-endemic\"),0,COUNTRY_INFO!X24)","v":1},{"$f":"IF(INTRO!$E$39=\"Non-endemic\",IF($D24=1,DEC!I24,0),IF($D24=1,IVM!G24,0))","v":0},null,{"$f":"IF(OR(COUNTRY_INFO!N24=\"Unknown\",COUNTRY_INFO!N24=\"Surveillance\",COUNTRY_INFO!N24=\"Not required\",COUNTRY_INFO!N24=0),0,IF(INTRO!$E$39=\"Non-endemic\",IF(AND($E24<>0,$G24=\"\"),IF($F24=0,COUNTRY_INFO!N24*$E24,COUNTRY_INFO!N24*($E24-$D24)),IF(AND($E24<>0,$G24<>0),IF($F24=0,COUNTRY_INFO!N24*$G24,COUNTRY_INFO!N24*($G24-$D24)),0)),IF($G24=\"\",COUNTRY_INFO!N24*$E24,COUNTRY_INFO!N24*$G24)))","v":1263},{"$f":"IF(OR(COUNTRY_INFO!O24=\"Unknown\",COUNTRY_INFO!O24=\"Surveillance\",COUNTRY_INFO!O24=\"Not required\",COUNTRY_INFO!O24=0),0,IF($E24<>0, IF($F24=0,COUNTRY_INFO!O24*$E24,COUNTRY_INFO!O24*($E24-$D24)),COUNTRY_INFO!O24*$E24))","v":3130},null,{"$f":"IF(OR(COUNTRY_INFO!P24=\"Unknown\",COUNTRY_INFO!P24=\"Surveillance\",COUNTRY_INFO!P24=\"Not required\",COUNTRY_INFO!P24=0),0,IF(AND($E24<>0,$J24=\"\"),IF($F24=0,COUNTRY_INFO!P24*$E24,COUNTRY_INFO!P24*($E24-$D24)), IF(AND($E24<>0,$J24<>0),IF($F24=0,COUNTRY_INFO!P24*$J24,COUNTRY_INFO!P24*($J24-$D24)), COUNTRY_INFO!P24*$J24)))","v":3487},7880,0,null,0,3130,null,3130,0,null,0]
[{"$f":"IF(AND(INTRO!$E$37=\"Non-endemic\",INTRO!$E$41=\"Non-endemic\"),\" \",IF(COUNTRY_INFO!A25=0,\" \",COUNTRY_INFO!A25))","v":"Eswatini"},{"$f":"IF(AND(INTRO!$E$37=\"Non-endemic\",INTRO!$E$41=\"Non-endemic\"),\" \",IF(COUNTRY_INFO!B25=0,\" \",COUNTRY_INFO!B25))","v":"LUBOMBO"},{"$f":"IF(AND(INTRO!$E$37=\"Non-endemic\",INTRO!$E$41=\"Non-endemic\"),\" \",IF(COUNTRY_INFO!C25=0,\" \",COUNTRY_INFO!C25))","v":"Dvokodvweni"},{"$f":"IF(AND(INTRO!$E$37=\"Non-endemic\",INTRO!$E$41=\"Non-endemic\"),0,COUNTRY_INFO!V25)","v":0},{"$f":"IF(AND(INTRO!$E$37=\"Non-endemic\",INTRO!$E$41=\"Non-endemic\"),0,COUNTRY_INFO!X25)","v":0},{"$f":"IF(INTRO!$E$39=\"Non-endemic\",IF($D25=1,DEC!I25,0),IF($D25=1,IVM!G25,0))","v":0},null,{"$f":"IF(OR(COUNTRY_INFO!N25=\"Unknown\",COUNTRY_INFO!N25=\"Surveillance\",COUNTRY_INFO!N25=\"Not required\",COUNTRY_INFO!N25=0),0,IF(INTRO!$E$39=\"Non-endemic\",IF(AND($E25<>0,$G25=\"\"),IF($F25=0,COUNTRY_INFO!N25*$E25,COUNTRY_INFO!N25*($E25-$D25)),IF(AND($E25<>0,$G25<>0),IF($F25=0,COUNTRY_INFO!N25*$G25,COUNTRY_INFO!N25*($G25-$D25)),0)),IF($G25=\"\",COUNTRY_INFO!N25*$E25,COUNTRY_INFO!N25*$G25)))","v":0},{"$f":"IF(OR(COUNTRY_INFO!O25=\"Unknown\",COUNTRY_INFO!O25=\"Surveillance\",COUNTRY_INFO!O25=\"Not required\",COUNTRY_INFO!O25=0),0,IF($E25<>0, IF($F25=0,COUNTRY_INFO!O25*$E25,COUNTRY_INFO!O25*($E25-$D25)),COUNTRY_INFO!O25*$E25))","v":0},null,{"$f":"IF(OR(COUNTRY_INFO!P25=\"Unknown\",COUNTRY_INFO!P25=\"Surveillance\",COUNTRY_INFO!P25=\"Not required\",COUNTRY_INFO!P25=0),0,IF(AND($E25<>0,$J25=\"\"),IF($F25=0,COUNTRY_INFO!P25*$E25,COUNTRY_INFO!P25*($E25-$D25)), IF(AND($E25<>0,$J25<>0),IF($F25=0,COUNTRY_INFO!P25*$J25,COUNTRY_INFO!P25*($J25-$D25)), COUNTRY_INFO!P25*$J25)))","v":0},0,0,null,0,0,null,0,0,null,0]
[{"$f":"IF(AND(INTRO!$E$37=\"Non-endemic\",INTRO!$E$41=\"Non-endemic\"),\" \",IF(COUNTRY_INFO!A26=0,\" \",COUNTRY_INFO!A26))","v":"Eswatini"},{"$f":"IF(AND(INTRO!$E$37=\"Non-endemic\",INTRO!$E$41=\"Non-endemic\"),\" \",IF(COUNTRY_INFO!B26=0,\" \",COUNTRY_INFO!B26))","v":"LUBOMBO"},{"$f":"IF(AND(INTRO!$E$37=\"Non-endemic\",INTRO!$E$41=\"Non-endemic\"),\" \",IF(COUNTRY_INFO!C26=0,\" \",COUNTRY_INFO!C26))","v":"Gigal"},{"$f":"IF(AND(INTRO!$E$37=\"Non-endemic\",INTRO!$E$41=\"Non-endemic\"),0,COUNTRY_INFO!V26)","v":0},{"$f":"IF(AND(INTRO!$E$37=\"Non-endemic\",INTRO!$E$41=\"Non-endemic\"),0,COUNTRY_INFO!X26)","v":0},{"$f":"IF(INTRO!$E$39=\"Non-endemic\",IF($D26=1,DEC!I26,0),IF($D26=1,IVM!G26,0))","v":0},null,{"$f":"IF(OR(COUNTRY_INFO!N26=\"Unknown\",COUNTRY_INFO!N26=\"Surveillance\",COUNTRY_INFO!N26=\"Not required\",COUNTRY_INFO!N26=0),0,IF(INTRO!$E$39=\"Non-endemic\",IF(AND($E26<>0,$G26=\"\"),IF($F26=0,COUNTRY_INFO!N26*$E26,COUNTRY_INFO!N26*($E26-$D26)),IF(AND($E26<>0,$G26<>0),IF($F26=0,COUNTRY_INFO!N26*$G26,COUNTRY_INFO!N26*($G26-$D26)),0)),IF($G26=\"\",COUNTRY_INFO!N26*$E26,COUNTRY_INFO!N26*$G26)))","v":0},{"$f":"IF(OR(COUNTRY_INFO!O26=\"Unknown\",COUNTRY_INFO!O26=\"Surveillance\",COUNTRY_INFO!O26=\"Not required\",COUNTRY_INFO!O26=0),0,IF($E26<>0, IF($F26=0,COUNTRY_INFO!O26*$E26,COUNTRY_INFO!O26*($E26-$D26)),COUNTRY_INFO!O26*$E26))","v":0},null,{"$f":"IF(OR(COUNTRY_INFO!P26=\"Unknown\",COUNTRY_INFO!P26=\"Surveillance\",COUNTRY_INFO!P26=\"Not required\",COUNTRY_INFO!P26=0),0,IF(AND($E26<>0,$J26=\"\"),IF($F26=0,COUNTRY_INFO!P26*$E26,COUNTRY_INFO!P26*($E26-$D26)), IF(AND($E26<>0,$J26<>0),IF($F26=0,COUNTRY_INFO!P26*$J26,COUNTRY_INFO!P26*($J26-$D26)), COUNTRY_INFO!P26*$J26)))","v":0},0,0,null,0,0,null,0,0,null,0]
[{"$f":"IF(AND(INTRO!$E$37=\"Non-endemic\",INTRO!$E$41=\"Non-endemic\"),\" \",IF(COUNTRY_INFO!A27=0,\" \",COUNTRY_INFO!A27))","v":"Eswatini"},{"$f":"IF(AND(INTRO!$E$37=\"Non-endemic\",INTRO!$E$41=\"Non-endemic\"),\" \",IF(COUNTRY_INFO!B27=0,\" \",COUNTRY_INFO!B27))","v":"LUBOMBO"},{"$f":"IF(AND(INTRO!$E$37=\"Non-endemic\",INTRO!$E$41=\"Non-endemic\"),\" \",IF(COUNTRY_INFO!C27=0,\" \",COUNTRY_INFO!C27))","v":"Lomahasha"},{"$f":"IF(AND(INTRO!$E$37=\"Non-endemic\",INTRO!$E$41=\"Non-endemic\"),0,COUNTRY_INFO!V27)","v":0},{"$f":"IF(AND(INTRO!$E$37=\"Non-endemic\",INTRO!$E$41=\"Non-endemic\"),0,COUNTRY_INFO!X27)","v":0},{"$f":"IF(INTRO!$E$39=\"Non-endemic\",IF($D27=1,DEC!I27,0),IF($D27=1,IVM!G27,0))","v":0},null,{"$f":"IF(OR(COUNTRY_INFO!N27=\"Unknown\",COUNTRY_INFO!N27=\"Surveillance\",COUNTRY_INFO!N27=\"Not required\",COUNTRY_INFO!N27=0),0,IF(INTRO!$E$39=\"Non-endemic\",IF(AND($E27<>0,$G27=\"\"),IF($F27=0,COUNTRY_INFO!N27*$E27,COUNTRY_INFO!N27*($E27-$D27)),IF(AND($E27<>0,$G27<>0),IF($F27=0,COUNTRY_INFO!N27*$G27,COUNTRY_INFO!N27*($G27-$D27)),0)),IF($G27=\"\",COUNTRY_INFO!N27*$E27,COUNTRY_INFO!N27*$G27)))","v":0},{"$f":"IF(OR(COUNTRY_INFO!O27=\"Unknown\",COUNTRY_INFO!O27=\"Surveillance\",COUNTRY_INFO!O27=\"Not required\",COUNTRY_INFO!O27=0),0,IF($E27<>0, IF($F27=0,COUNTRY_INFO!O27*$E27,COUNTRY_INFO!O27*($E27-$D27)),COUNTRY_INFO!O27*$E27))","v":0},null,{"$f":"IF(OR(COUNTRY_INFO!P27=\"Unknown\",COUNTRY_INFO!P27=\"Surveillance\",COUNTRY_INFO!P27=\"Not required\",COUNTRY_INFO!P27=0),0,IF(AND($E27<>0,$J27=\"\"),IF($F27=0,COUNTRY_INFO!P27*$E27,COUNTRY_INFO!P27*($E27-$D27)), IF(AND($E27<>0,$J27<>0),IF($F27=0,COUNTRY_INFO!P27*$J27,COUNTRY_INFO!P27*($J27-$D27)), COUNTRY_INFO!P27*$J27)))","v":0},0,0,null,0,0,null,0,0,null,0]
[{"$f":"IF(AND(INTRO!$E$37=\"Non-endemic\",INTRO!$E$41=\"Non-endemic\"),\" \",IF(COUNTRY_INFO!A28=0,\" \",COUNTRY_INFO!A28))","v":"Eswatini"},{"$f":"IF(AND(INTRO!$E$37=\"Non-endemic\",INTRO!$E$41=\"Non-endemic\"),\" \",IF(COUNTRY_INFO!B28=0,\" \",COUNTRY_INFO!B28))","v":"LUBOMBO"},{"$f":"IF(AND(INTRO!$E$37=\"Non-endemic\",INTRO!$E$41=\"Non-endemic\"),\" \",IF(COUNTRY_INFO!C28=0,\" \",COUNTRY_INFO!C28))","v":"Lubuli"},{"$f":"IF(AND(INTRO!$E$37=\"Non-endemic\",INTRO!$E$41=\"Non-endemic\"),0,COUNTRY_INFO!V28)","v":0},{"$f":"IF(AND(INTRO!$E$37=\"Non-endemic\",INTRO!$E$41=\"Non-endemic\"),0,COUNTRY_INFO!X28)","v":0},{"$f":"IF(INTRO!$E$39=\"Non-endemic\",IF($D28=1,DEC!I28,0),IF($D28=1,IVM!G28,0))","v":0},null,{"$f":"IF(OR(COUNTRY_INFO!N28=\"Unknown\",COUNTRY_INFO!N28=\"Surveillance\",COUNTRY_INFO!N28=\"Not required\",COUNTRY_INFO!N28=0),0,IF(INTRO!$E$39=\"Non-endemic\",IF(AND($E28<>0,$G28=\"\"),IF($F28=0,COUNTRY_INFO!N28*$E28,COUNTRY_INFO!N28*($E28-$D28)),IF(AND($E28<>0,$G28<>0),IF($F28=0,COUNTRY_INFO!N28*$G28,COUNTRY_INFO!N28*($G28-$D28)),0)),IF($G28=\"\",COUNTRY_INFO!N28*$E28,COUNTRY_INFO!N28*$G28)))","v":0},{"$f":"IF(OR(COUNTRY_INFO!O28=\"Unknown\",COUNTRY_INFO!O28=\"Surveillance\",COUNTRY_INFO!O28=\"Not required\",COUNTRY_INFO!O28=0),0,IF($E28<>0, IF($F28=0,COUNTRY_INFO!O28*$E28,COUNTRY_INFO!O28*($E28-$D28)),COUNTRY_INFO!O28*$E28))","v":0},null,{"$f":"IF(OR(COUNTRY_INFO!P28=\"Unknown\",COUNTRY_INFO!P28=\"Surveillance\",COUNTRY_INFO!P28=\"Not required\",COUNTRY_INFO!P28=0),0,IF(AND($E28<>0,$J28=\"\"),IF($F28=0,COUNTRY_INFO!P28*$E28,COUNTRY_INFO!P28*($E28-$D28)), IF(AND($E28<>0,$J28<>0),IF($F28=0,COUNTRY_INFO!P28*$J28,COUNTRY_INFO!P28*($J28-$D28)), COUNTRY_INFO!P28*$J28)))","v":0},0,0,null,0,0,null,0,0,null,0]
[{"$f":"IF(AND(INTRO!$E$37=\"Non-endemic\",INTRO!$E$41=\"Non-endemic\"),\" \",IF(COUNTRY_INFO!A29=0,\" \",COUNTRY_INFO!A29))","v":"Eswatini"},{"$f":"IF(AND(INTRO!$E$37=\"Non-endemic\",INTRO!$E$41=\"Non-endemic\"),\" \",IF(COUNTRY_INFO!B29=0,\" \",COUNTRY_INFO!B29))","v":"LUBOMBO"},{"$f":"IF(AND(INTRO!$E$37=\"Non-endemic\",INTRO!$E$41=\"Non-endemic\"),\" \",IF(COUNTRY_INFO!C29=0,\" \",COUNTRY_INFO!C29))","v":"Lugongolweni"},{"$f":"IF(AND(INTRO!$E$37=\"Non-endemic\",INTRO!$E$41=\"Non-endemic\"),0,COUNTRY_INFO!V29)","v":0},{"$f":"IF(AND(INTRO!$E$37=\"Non-endemic\",INTRO!$E$41=\"Non-endemic\"),0,COUNTRY_INFO!X29)","v":0},{"$f":"IF(INTRO!$E$39=\"Non-endemic\",IF($D29=1,DEC!I29,0),IF($D29=1,IVM!G29,0))","v":0},null,{"$f":"IF(OR(COUNTRY_INFO!N29=\"Unknown\",COUNTRY_INFO!N29=\"Surveillance\",COUNTRY_INFO!N29=\"Not required\",COUNTRY_INFO!N29=0),0,IF(INTRO!$E$39=\"Non-endemic\",IF(AND($E29<>0,$G29=\"\"),IF($F29=0,COUNTRY_INFO!N29*$E29,COUNTRY_INFO!N29*($E29-$D29)),IF(AND($E29<>0,$G29<>0),IF($F29=0,COUNTRY_INFO!N29*$G29,COUNTRY_INFO!N29*($G29-$D29)),0)),IF($G29=\"\",COUNTRY_INFO!N29*$E29,COUNTRY_INFO!N29*$G29)))","v":0},{"$f":"IF(OR(COUNTRY_INFO!O29=\"Unknown\",COUNTRY_INFO!O29=\"Surveillance\",COUNTRY_INFO!O29=\"Not required\",COUNTRY_INFO!O29=0),0,IF($E29<>0, IF($F29=0,COUNTRY_INFO!O29*$E29,COUNTRY_INFO!O29*($E29-$D29)),COUNTRY_INFO!O29*$E29))","v":0},null,{"$f":"IF(OR(COUNTRY_INFO!P29=\"Unknown\",COUNTRY_INFO!P29=\"Surveillance\",COUNTRY_INFO!P29=\"Not required\",COUNTRY_INFO!P29=0),0,IF(AND($E29<>0,$J29=\"\"),IF($F29=0,COUNTRY_INFO!P29*$E29,COUNTRY_INFO!P29*($E29-$D29)), IF(AND($E29<>0,$J29<>0),IF($F29=0,COUNTRY_INFO!P29*$J29,COUNTRY_INFO!P29*($J29-$D29)), COUNTRY_INFO!P29*$J29)))","v":0},0,0,null,0,0,null,0,0,null,0]
[{"$f":"IF(AND(INTRO!$E$37=\"Non-endemic\",INTRO!$E$41=\"Non-endemic\"),\" \",IF(COUNTRY_INFO!A30=0,\" \",COUNTRY_INFO!A30))","v":"Eswatini"},{"$f":"IF(AND(INTRO!$E$37=\"Non-endemic\",INTRO!$E$41=\"Non-endemic\"),\" \",IF(COUNTRY_INFO!B30=0,\" \",COUNTRY_INFO!B30))","v":"LUBOMBO"},{"$f":"IF(AND(INTRO!$E$37=\"Non-endemic\",INTRO!$E$41=\"Non-endemic\"),\" \",IF(COUNTRY_INFO!C30=0,\" \",COUNTRY_INFO!C30))","v":"Matsanjeni North"},{"$f":"IF(AND(INTRO!$E$37=\"Non-endemic\",INTRO!$E$41=\"Non-endemic\"),0,COUNTRY_INFO!V30)","v":0},{"$f":"IF(AND(INTRO!$E$37=\"Non-endemic\",INTRO!$E$41=\"Non-endemic\"),0,COUNTRY_INFO!X30)","v":0},{"$f":"IF(INTRO!$E$39=\"Non-endemic\",IF($D30=1,DEC!I30,0),IF($D30=1,IVM!G30,0))","v":0},null,{"$f":"IF(OR(COUNTRY_INFO!N30=\"Unknown\",COUNTRY_INFO!N30=\"Surveillance\",COUNTRY_INFO!N30=\"Not required\",COUNTRY_INFO!N30=0),0,IF(INTRO!$E$39=\"Non-endemic\",IF(AND($E30<>0,$G30=\"\"),IF($F30=0,COUNTRY_INFO!N30*$E30,COUNTRY_INFO!N30*($E30-$D30)),IF(AND($E30<>0,$G30<>0),IF($F30=0,COUNTRY_INFO!N30*$G30,COUNTRY_INFO!N30*($G30-$D30)),0)),IF($G30=\"\",COUNTRY_INFO!N30*$E30,COUNTRY_INFO!N30*$G30)))","v":0},{"$f":"IF(OR(COUNTRY_INFO!O30=\"Unknown\",COUNTRY_INFO!O30=\"Surveillance\",COUNTRY_INFO!O30=\"Not required\",COUNTRY_INFO!O30=0),0,IF($E30<>0, IF($F30=0,COUNTRY_INFO!O30*$E30,COUNTRY_INFO!O30*($E30-$D30)),COUNTRY_INFO!O30*$E30))","v":0},null,{"$f":"IF(OR(COUNTRY_INFO!P30=\"Unknown\",COUNTRY_INFO!P30=\"Surveillance\",COUNTRY_INFO!P30=\"Not required\",COUNTRY_INFO!P30=0),0,IF(AND($E30<>0,$J30=\"\"),IF($F30=0,COUNTRY_INFO!P30*$E30,COUNTRY_INFO!P30*($E30-$D30)), IF(AND($E30<>0,$J30<>0),IF($F30=0,COUNTRY_INFO!P30*$J30,COUNTRY_INFO!P30*($J30-$D30)), COUNTRY_INFO!P30*$J30)))","v":0},0,0,null,0,0,null,0,0,null,0]
[{"$f":"IF(AND(INTRO!$E$37=\"Non-endemic\",INTRO!$E$41=\"Non-endemic\"),\" \",IF(COUNTRY_INFO!A31=0,\" \",COUNTRY_INFO!A31))","v":"Eswatini"},{"$f":"IF(AND(INTRO!$E$37=\"Non-endemic\",INTRO!$E$41=\"Non-endemic\"),\" \",IF(COUNTRY_INFO!B31=0,\" \",COUNTRY_INFO!B31))","v":"LUBOMBO"},{"$f":"IF(AND(INTRO!$E$37=\"Non-endemic\",INTRO!$E$41=\"Non-endemic\"),\" \",IF(COUNTRY_INFO!C31=0,\" \",COUNTRY_INFO!C31))","v":"Mhlume"},{"$f":"IF(AND(INTRO!$E$37=\"Non-endemic\",INTRO!$E$41=\"Non-endemic\"),0,COUNTRY_INFO!V31)","v":0},{"$f":"IF(AND(INTRO!$E$37=\"Non-endemic\",INTRO!$E$41=\"Non-endemic\"),0,COUNTRY_INFO!X31)","v":0},{"$f":"IF(INTRO!$E$39=\"Non-endemic\",IF($D31=1,DEC!I31,0),IF($D31=1,IVM!G31,0))","v":0},null,{"$f":"IF(OR(COUNTRY_INFO!N31=\"Unknown\",COUNTRY_INFO!N31=\"Surveillance\",COUNTRY_INFO!N31=\"Not required\",COUNTRY_INFO!N31=0),0,IF(INTRO!$E$39=\"Non-endemic\",IF(AND($E31<>0,$G31=\"\"),IF($F31=0,COUNTRY_INFO!N31*$E31,COUNTRY_INFO!N31*($E31-$D31)),IF(AND($E31<>0,$G31<>0),IF($F31=0,COUNTRY_INFO!N31*$G31,COUNTRY_INFO!N31*($G31-$D31)),0)),IF($G31=\"\",COUNTRY_INFO!N31*$E31,COUNTRY_INFO!N31*$G31)))","v":0},{"$f":"IF(OR(COUNTRY_INFO!O31=\"Unknown\",COUNTRY_INFO!O31=\"Surveillance\",COUNTRY_INFO!O31=\"Not required\",COUNTRY_INFO!O31=0),0,IF($E31<>0, IF($F31=0,COUNTRY_INFO!O31*$E31,COUNTRY_INFO!O31*($E31-$D31)),COUNTRY_INFO!O31*$E31))","v":0},null,{"$f":"IF(OR(COUNTRY_INFO!P31=\"Unknown\",COUNTRY_INFO!P31=\"Surveillance\",COUNTRY_INFO!P31=\"Not required\",COUNTRY_INFO!P31=0),0,IF(AND($E31<>0,$J31=\"\"),IF($F31=0,COUNTRY_INFO!P31*$E31,COUNTRY_INFO!P31*($E31-$D31)), IF(AND($E31<>0,$J31<>0),IF($F31=0,COUNTRY_INFO!P31*$J31,COUNTRY_INFO!P31*($J31-$D31)), COUNTRY_INFO!P31*$J31)))","v":0},0,0,null,0,0,null,0,0,null,0]
[{"$f":"IF(AND(INTRO!$E$37=\"Non-endemic\",INTRO!$E$41=\"Non-endemic\"),\" \",IF(COUNTRY_INFO!A32=0,\" \",COUNTRY_INFO!A32))","v":"Eswatini"},{"$f":"IF(AND(INTRO!$E$37=\"Non-endemic\",INTRO!$E$41=\"Non-endemic\"),\" \",IF(COUNTRY_INFO!B32=0,\" \",COUNTRY_INFO!B32))","v":"LUBOMBO"},{"$f":"IF(AND(INTRO!$E$37=\"Non-endemic\",INTRO!$E$41=\"Non-endemic\"),\" \",IF(COUNTRY_INFO!C32=0,\" \",COUNTRY_INFO!C32))","v":"Mpolonjeni"},{"$f":"IF(AND(INTRO!$E$37=\"Non-endemic\",INTRO!$E$41=\"Non-endemic\"),0,COUNTRY_INFO!V32)","v":0},{"$f":"IF(AND(INTRO!$E$37=\"Non-endemic\",INTRO!$E$41=\"Non-endemic\"),0,COUNTRY_INFO!X32)","v":0},{"$f":"IF(INTRO!$E$39=\"Non-endemic\",IF($D32=1,DEC!I32,0),IF($D32=1,IVM!G32,0))","v":0},null,{"$f":"IF(OR(COUNTRY_INFO!N32=\"Unknown\",COUNTRY_INFO!N32=\"Surveillance\",COUNTRY_INFO!N32=\"Not required\",COUNTRY_INFO!N32=0),0,IF(INTRO!$E$39=\"Non-endemic\",IF(AND($E32<>0,$G32=\"\"),IF($F32=0,COUNTRY_INFO!N32*$E32,COUNTRY_INFO!N32*($E32-$D32)),IF(AND($E32<>0,$G32<>0),IF($F32=0,COUNTRY_INFO!N32*$G32,COUNTRY_INFO!N32*($G32-$D32)),0)),IF($G32=\"\",COUNTRY_INFO!N32*$E32,COUNTRY_INFO!N32*$G32)))","v":0},{"$f":"IF(OR(COUNTRY_INFO!O32=\"Unknown\",COUNTRY_INFO!O32=\"Surveillance\",COUNTRY_INFO!O32=\"Not required\",COUNTRY_INFO!O32=0),0,IF($E32<>0, IF($F32=0,COUNTRY_INFO!O32*$E32,COUNTRY_INFO!O32*($E32-$D32)),COUNTRY_INFO!O32*$E32))","v":0},null,{"$f":"IF(OR(COUNTRY_INFO!P32=\"Unknown\",COUNTRY_INFO!P32=\"Surveillance\",COUNTRY_INFO!P32=\"Not required\",COUNTRY_INFO!P32=0),0,IF(AND($E32<>0,$J32=\"\"),IF($F32=0,COUNTRY_INFO!P32*$E32,COUNTRY_INFO!P32*($E32-$D32)), IF(AND($E32<>0,$J32<>0),IF($F32=0,COUNTRY_INFO!P32*$J32,COUNTRY_INFO!P32*($J32-$D32)), COUNTRY_INFO!P32*$J32)))","v":0},0,0,null,0,0,null,0,0,null,0]
[{"$f":"IF(AND(INTRO!$E$37=\"Non-endemic\",INTRO!$E$41=\"Non-endemic\"),\" \",IF(COUNTRY_INFO!A33=0,\" \",COUNTRY_INFO!A33))","v":"Eswatini"},{"$f":"IF(AND(INTRO!$E$37=\"Non-endemic\",INTRO!$E$41=\"Non-endemic\"),\" \",IF(COUNTRY_INFO!B33=0,\" \",COUNTRY_INFO!B33))","v":"LUBOMBO"},{"$f":"IF(AND(INTRO!$E$37=\"Non-endemic\",INTRO!$E$41=\"Non-endemic\"),\" \",IF(COUNTRY_INFO!C33=0,\" \",COUNTRY_INFO!C33))","v":"Nkilongo"},{"$f":"IF(AND(INTRO!$E$37=\"Non-endemic\",INTRO!$E$41=\"Non-endemic\"),0,COUNTRY_INFO!V33)","v":0},{"$f":"IF(AND(INTRO!$E$37=\"Non-endemic\",INTRO!$E$41=\"Non-endemic\"),0,COUNTRY_INFO!X33)","v":0},{"$f":"IF(INTRO!$E$39=\"Non-endemic\",IF($D33=1,DEC!I33,0),IF($D33=1,IVM!G33,0))","v":0},null,{"$f":"IF(OR(COUNTRY_INFO!N33=\"Unknown\",COUNTRY_INFO!N33=\"Surveillance\",COUNTRY_INFO!N33=\"Not required\",COUNTRY_INFO!N33=0),0,IF(INTRO!$E$39=\"Non-endemic\",IF(AND($E33<>0,$G33=\"\"),IF($F33=0,COUNTRY_INFO!N33*$E33,COUNTRY_INFO!N33*($E33-$D33)),IF(AND($E33<>0,$G33<>0),IF($F33=0,COUNTRY_INFO!N33*$G33,COUNTRY_INFO!N33*($G33-$D33)),0)),IF($G33=\"\",COUNTRY_INFO!N33*$E33,COUNTRY_INFO!N33*$G33)))","v":0},{"$f":"IF(OR(COUNTRY_INFO!O33=\"Unknown\",COUNTRY_INFO!O33=\"Surveillance\",COUNTRY_INFO!O33=\"Not required\",COUNTRY_INFO!O33=0),0,IF($E33<>0, IF($F33=0,COUNTRY_INFO!O33*$E33,COUNTRY_INFO!O33*($E33-$D33)),COUNTRY_INFO!O33*$E33))","v":0},null,{"$f":"IF(OR(COUNTRY_INFO!P33=\"Unknown\",COUNTRY_INFO!P33=\"Surveillance\",COUNTRY_INFO!P33=\"Not required\",COUNTRY_INFO!P33=0),0,IF(AND($E33<>0,$J33=\"\"),IF($F33=0,COUNTRY_INFO!P33*$E33,COUNTRY_INFO!P33*($E33-$D33)), IF(AND($E33<>0,$J33<>0),IF($F33=0,COUNTRY_INFO!P33*$J33,COUNTRY_INFO!P33*($J33-$D33)), COUNTRY_INFO!P33*$J33)))","v":0},0,0,null,0,0,null,0,0,null,0]
[{"$f":"IF(AND(INTRO!$E$37=\"Non-endemic\",INTRO!$E$41=\"Non-endemic\"),\" \",IF(COUNTRY_INFO!A34=0,\" \",COUNTRY_INFO!A34))","v":"Eswatini"},{"$f":"IF(AND(INTRO!$E$37=\"Non-endemic\",INTRO!$E$41=\"Non-endemic\"),\" \",IF(COUNTRY_INFO!B34=0,\" \",COUNTRY_INFO!B34))","v":"LUBOMBO"},{"$f":"IF(AND(INTRO!$E$37=\"Non-endemic\",INTRO!$E$41=\"Non-endemic\"),\" \",IF(COUNTRY_INFO!C34=0,\" \",COUNTRY_INFO!C34))","v":"Siphofaneni"},{"$f":"IF(AND(INTRO!$E$37=\"Non-endemic\",INTRO!$E$41=\"Non-endemic\"),0,COUNTRY_INFO!V34)","v":0},{"$f":"IF(AND(INTRO!$E$37=\"Non-endemic\",INTRO!$E$41=\"Non-endemic\"),0,COUNTRY_INFO!X34)","v":0},{"$f":"IF(INTRO!$E$39=\"Non-endemic\",IF($D34=1,DEC!I34,0),IF($D34=1,IVM!G34,0))","v":0},null,{"$f":"IF(OR(COUNTRY_INFO!N34=\"Unknown\",COUNTRY_INFO!N34=\"Surveillance\",COUNTRY_INFO!N34=\"Not required\",COUNTRY_INFO!N34=0),0,IF(INTRO!$E$39=\"Non-endemic\",IF(AND($E34<>0,$G34=\"\"),IF($F34=0,COUNTRY_INFO!N34*$E34,COUNTRY_INFO!N34*($E34-$D34)),IF(AND($E34<>0,$G34<>0),IF($F34=0,COUNTRY_INFO!N34*$G34,COUNTRY_INFO!N34*($G34-$D34)),0)),IF($G34=\"\",COUNTRY_INFO!N34*$E34,COUNTRY_INFO!N34*$G34)))","v":0},{"$f":"IF(OR(COUNTRY_INFO!O34=\"Unknown\",COUNTRY_INFO!O34=\"Surveillance\",COUNTRY_INFO!O34=\"Not required\",COUNTRY_INFO!O34=0),0,IF($E34<>0, IF($F34=0,COUNTRY_INFO!O34*$E34,COUNTRY_INFO!O34*($E34-$D34)),COUNTRY_INFO!O34*$E34))","v":0},null,{"$f":"IF(OR(COUNTRY_INFO!P34=\"Unknown\",COUNTRY_INFO!P34=\"Surveillance\",COUNTRY_INFO!P34=\"Not required\",COUNTRY_INFO!P34=0),0,IF(AND($E34<>0,$J34=\"\"),IF($F34=0,COUNTRY_INFO!P34*$E34,COUNTRY_INFO!P34*($E34-$D34)), IF(AND($E34<>0,$J34<>0),IF($F34=0,COUNTRY_INFO!P34*$J34,COUNTRY_INFO!P34*($J34-$D34)), COUNTRY_INFO!P34*$J34)))","v":0},0,0,null,0,0,null,0,0,null,0]
[{"$f":"IF(AND(INTRO!$E$37=\"Non-endemic\",INTRO!$E$41=\"Non-endemic\"),\" \",IF(COUNTRY_INFO!A35=0,\" \",COUNTRY_INFO!A35))","v":"Eswatini"},{"$f":"IF(AND(INTRO!$E$37=\"Non-endemic\",INTRO!$E$41=\"Non-endemic\"),\" \",IF(COUNTRY_INFO!B35=0,\" \",COUNTRY_INFO!B35))","v":"LUBOMBO"},{"$f":"IF(AND(INTRO!$E$37=\"Non-endemic\",INTRO!$E$41=\"Non-endemic\"),\" \",IF(COUNTRY_INFO!C35=0,\" \",COUNTRY_INFO!C35))","v":"Sithobela"},{"$f":"IF(AND(INTRO!$E$37=\"Non-endemic\",INTRO!$E$41=\"Non-endemic\"),0,COUNTRY_INFO!V35)","v":0},{"$f":"IF(AND(INTRO!$E$37=\"Non-endemic\",INTRO!$E$41=\"Non-endemic\"),0,COUNTRY_INFO!X35)","v":0},{"$f":"IF(INTRO!$E$39=\"Non-endemic\",IF($D35=1,DEC!I35,0),IF($D35=1,IVM!G35,0))","v":0},null,{"$f":"IF(OR(COUNTRY_INFO!N35=\"Unknown\",COUNTRY_INFO!N35=\"Surveillance\",COUNTRY_INFO!N35=\"Not required\",COUNTRY_INFO!N35=0),0,IF(INTRO!$E$39=\"Non-endemic\",IF(AND($E35<>0,$G35=\"\"),IF($F35=0,COUNTRY_INFO!N35*$E35,COUNTRY_INFO!N35*($E35-$D35)),IF(AND($E35<>0,$G35<>0),IF($F35=0,COUNTRY_INFO!N35*$G35,COUNTRY_INFO!N35*($G35-$D35)),0)),IF($G35=\"\",COUNTRY_INFO!N35*$E35,COUNTRY_INFO!N35*$G35)))","v":0},{"$f":"IF(OR(COUNTRY_INFO!O35=\"Unknown\",COUNTRY_INFO!O35=\"Surveillance\",COUNTRY_INFO!O35=\"Not required\",COUNTRY_INFO!O35=0),0,IF($E35<>0, IF($F35=0,COUNTRY_INFO!O35*$E35,COUNTRY_INFO!O35*($E35-$D35)),COUNTRY_INFO!O35*$E35))","v":0},null,{"$f":"IF(OR(COUNTRY_INFO!P35=\"Unknown\",COUNTRY_INFO!P35=\"Surveillance\",COUNTRY_INFO!P35=\"Not required\",COUNTRY_INFO!P35=0),0,IF(AND($E35<>0,$J35=\"\"),IF($F35=0,COUNTRY_INFO!P35*$E35,COUNTRY_INFO!P35*($E35-$D35)), IF(AND($E35<>0,$J35<>0),IF($F35=0,COUNTRY_INFO!P35*$J35,COUNTRY_INFO!P35*($J35-$D35)), COUNTRY_INFO!P35*$J35)))","v":0},0,0,null,0,0,null,0,0,null,0]
[{"$f":"IF(AND(INTRO!$E$37=\"Non-endemic\",INTRO!$E$41=\"Non-endemic\"),\" \",IF(COUNTRY_INFO!A36=0,\" \",COUNTRY_INFO!A36))","v":"Eswatini"},{"$f":"IF(AND(INTRO!$E$37=\"Non-endemic\",INTRO!$E$41=\"Non-endemic\"),\" \",IF(COUNTRY_INFO!B36=0,\" \",COUNTRY_INFO!B36))","v":"MANZINI"},{"$f":"IF(AND(INTRO!$E$37=\"Non-endemic\",INTRO!$E$41=\"Non-endemic\"),\" \",IF(COUNTRY_INFO!C36=0,\" \",COUNTRY_INFO!C36))","v":"Kukhanyeni"},{"$f":"IF(AND(INTRO!$E$37=\"Non-endemic\",INTRO!$E$41=\"Non-endemic\"),0,COUNTRY_INFO!V36)","v":0},{"$f":"IF(AND(INTRO!$E$37=\"Non-endemic\",INTRO!$E$41=\"Non-endemic\"),0,COUNTRY_INFO!X36)","v":0},{"$f":"IF(INTRO!$E$39=\"Non-endemic\",IF($D36=1,DEC!I36,0),IF($D36=1,IVM!G36,0))","v":0},null,{"$f":"IF(OR(COUNTRY_INFO!N36=\"Unknown\",COUNTRY_INFO!N36=\"Surveillance\",COUNTRY_INFO!N36=\"Not required\",COUNTRY_INFO!N36=0),0,IF(INTRO!$E$39=\"Non-endemic\",IF(AND($E36<>0,$G36=\"\"),IF($F36=0,COUNTRY_INFO!N36*$E36,COUNTRY_INFO!N36*($E36-$D36)),IF(AND($E36<>0,$G36<>0),IF($F36=0,COUNTRY_INFO!N36*$G36,COUNTRY_INFO!N36*($G36-$D36)),0)),IF($G36=\"\",COUNTRY_INFO!N36*$E36,COUNTRY_INFO!N36*$G36)))","v":0},{"$f":"IF(OR(COUNTRY_INFO!O36=\"Unknown\",COUNTRY_INFO!O36=\"Surveillance\",COUNTRY_INFO!O36=\"Not required\",COUNTRY_INFO!O36=0),0,IF($E36<>0, IF($F36=0,COUNTRY_INFO!O36*$E36,COUNTRY_INFO!O36*($E36-$D36)),COUNTRY_INFO!O36*$E36))","v":0},null,{"$f":"IF(OR(COUNTRY_INFO!P36=\"Unknown\",COUNTRY_INFO!P36=\"Surveillance\",COUNTRY_INFO!P36=\"Not required\",COUNTRY_INFO!P36=0),0,IF(AND($E36<>0,$J36=\"\"),IF($F36=0,COUNTRY_INFO!P36*$E36,COUNTRY_INFO!P36*($E36-$D36)), IF(AND($E36<>0,$J36<>0),IF($F36=0,COUNTRY_INFO!P36*$J36,COUNTRY_INFO!P36*($J36-$D36)), COUNTRY_INFO!P36*$J36)))","v":0},0,0,null,0,0,null,0,0,null,0]
[{"$f":"IF(AND(INTRO!$E$37=\"Non-endemic\",INTRO!$E$41=\"Non-endemic\"),\" \",IF(COUNTRY_INFO!A37=0,\" \",COUNTRY_INFO!A37))","v":"Eswatini"},{"$f":"IF(AND(INTRO!$E$37=\"Non-endemic\",INTRO!$E$41=\"Non-endemic\"),\" \",IF(COUNTRY_INFO!B37=0,\" \",COUNTRY_INFO!B37))","v":"MANZINI"},{"$f":"IF(AND(INTRO!$E$37=\"Non-endemic\",INTRO!$E$41=\"Non-endemic\"),\" \",IF(COUNTRY_INFO!C37=0,\" \",COUNTRY_INFO!C37))","v":"Kwaluseni"},{"$f":"IF(AND(INTRO!$E$37=\"Non-endemic\",INTRO!$E$41=\"Non-endemic\"),0,COUNTRY_INFO!V37)","v":0},{"$f":"IF(AND(INTRO!$E$37=\"Non-endemic\",INTRO!$E$41=\"Non-endemic\"),0,COUNTRY_INFO!X37)","v":0},{"$f":"IF(INTRO!$E$39=\"Non-endemic\",IF($D37=1,DEC!I37,0),IF($D37=1,IVM!G37,0))","v":0},null,{"$f":"IF(OR(COUNTRY_INFO!N37=\"Unknown\",COUNTRY_INFO!N37=\"Surveillance\",COUNTRY_INFO!N37=\"Not required\",COUNTRY_INFO!N37=0),0,IF(INTRO!$E$39=\"Non-endemic\",IF(AND($E37<>0,$G37=\"\"),IF($F37=0,COUNTRY_INFO!N37*$E37,COUNTRY_INFO!N37*($E37-$D37)),IF(AND($E37<>0,$G37<>0),IF($F37=0,COUNTRY_INFO!N37*$G37,COUNTRY_INFO!N37*($G37-$D37)),0)),IF($G37=\"\",COUNTRY_INFO!N37*$E37,COUNTRY_INFO!N37*$G37)))","v":0},{"$f":"IF(OR(COUNTRY_INFO!O37=\"Unknown\",COUNTRY_INFO!O37=\"Surveillance\",COUNTRY_INFO!O37=\"Not required\",COUNTRY_INFO!O37=0),0,IF($E37<>0, IF($F37=0,COUNTRY_INFO!O37*$E37,COUNTRY_INFO!O37*($E37-$D37)),COUNTRY_INFO!O37*$E37))","v":0},null,{"$f":"IF(OR(COUNTRY_INFO!P37=\"Unknown\",COUNTRY_INFO!P37=\"Surveillance\",COUNTRY_INFO!P37=\"Not required\",COUNTRY_INFO!P37=0),0,IF(AND($E37<>0,$J37=\"\"),IF($F37=0,COUNTRY_INFO!P37*$E37,COUNTRY_INFO!P37*($E37-$D37)), IF(AND($E37<>0,$J37<>0),IF($F37=0,COUNTRY_INFO!P37*$J37,COUNTRY_INFO!P37*($J37-$D37)), COUNTRY_INFO!P37*$J37)))","v":0},0,0,null,0,0,null,0,0,null,0]
[{"$f":"IF(AND(INTRO!$E$37=\"Non-endemic\",INTRO!$E$41=\"Non-endemic\"),\" \",IF(COUNTRY_INFO!A38=0,\" \",COUNTRY_INFO!A38))","v":"Eswatini"},{"$f":"IF(AND(INTRO!$E$37=\"Non-endemic\",INTRO!$E$41=\"Non-endemic\"),\" \",IF(COUNTRY_INFO!B38=0,\" \",COUNTRY_INFO!B38))","v":"MANZINI"},{"$f":"IF(AND(INTRO!$E$37=\"Non-endemic\",INTRO!$E$41=\"Non-endemic\"),\" \",IF(COUNTRY_INFO!C38=0,\" \",COUNTRY_INFO!C38))","v":"LaMgabhi"},{"$f":"IF(AND(INTRO!$E$37=\"Non-endemic\",INTRO!$E$41=\"Non-endemic\"),0,COUNTRY_INFO!V38)","v":0},{"$f":"IF(AND(INTRO!$E$37=\"Non-endemic\",INTRO!$E$41=\"Non-endemic\"),0,COUNTRY_INFO!X38)","v":0},{"$f":"IF(INTRO!$E$39=\"Non-endemic\",IF($D38=1,DEC!I38,0),IF($D38=1,IVM!G38,0))","v":0},null,{"$f":"IF(OR(COUNTRY_INFO!N38=\"Unknown\",COUNTRY_INFO!N38=\"Surveillance\",COUNTRY_INFO!N38=\"Not required\",COUNTRY_INFO!N38=0),0,IF(INTRO!$E$39=\"Non-endemic\",IF(AND($E38<>0,$G38=\"\"),IF($F38=0,COUNTRY_INFO!N38*$E38,COUNTRY_INFO!N38*($E38-$D38)),IF(AND($E38<>0,$G38<>0),IF($F38=0,COUNTRY_INFO!N38*$G38,COUNTRY_INFO!N38*($G38-$D38)),0)),IF($G38=\"\",COUNTRY_INFO!N38*$E38,COUNTRY_INFO!N38*$G38)))","v":0},{"$f":"IF(OR(COUNTRY_INFO!O38=\"Unknown\",COUNTRY_INFO!O38=\"Surveillance\",COUNTRY_INFO!O38=\"Not required\",COUNTRY_INFO!O38=0),0,IF($E38<>0, IF($F38=0,COUNTRY_INFO!O38*$E38,COUNTRY_INFO!O38*($E38-$D38)),COUNTRY_INFO!O38*$E38))","v":0},null,{"$f":"IF(OR(COUNTRY_INFO!P38=\"Unknown\",COUNTRY_INFO!P38=\"Surveillance\",COUNTRY_INFO!P38=\"Not required\",COUNTRY_INFO!P38=0),0,IF(AND($E38<>0,$J38=\"\"),IF($F38=0,COUNTRY_INFO!P38*$E38,COUNTRY_INFO!P38*($E38-$D38)), IF(AND($E38<>0,$J38<>0),IF($F38=0,COUNTRY_INFO!P38*$J38,COUNTRY_INFO!P38*($J38-$D38)), COUNTRY_INFO!P38*$J38)))","v":0},0,0,null,0,0,null,0,0,null,0]
[{"$f":"IF(AND(INTRO!$E$37=\"Non-endemic\",INTRO!$E$41=\"Non-endemic\"),\" \",IF(COUNTRY_INFO!A39=0,\" \",COUNTRY_INFO!A39))","v":"Eswatini"},{"$f":"IF(AND(INTRO!$E$37=\"Non-endemic\",INTRO!$E$41=\"Non-endemic\"),\" \",IF(COUNTRY_INFO!B39=0,\" \",COUNTRY_INFO!B39))","v":"MANZINI"},{"$f":"IF(AND(INTRO!$E$37=\"Non-endemic\",INTRO!$E$41=\"Non-endemic\"),\" \",IF(COUNTRY_INFO!C39=0,\" \",COUNTRY_INFO!C39))","v":"Lobamba Lomdzala"},{"$f":"IF(AND(INTRO!$E$37=\"Non-endemic\",INTRO!$E$41=\"Non-endemic\"),0,COUNTRY_INFO!V39)","v":0},{"$f":"IF(AND(INTRO!$E$37=\"Non-endemic\",INTRO!$E$41=\"Non-endemic\"),0,COUNTRY_INFO!X39)","v":0},{"$f":"IF(INTRO!$E$39=\"Non-endemic\",IF($D39=1,DEC!I39,0),IF($D39=1,IVM!G39,0))","v":0},null,{"$f":"IF(OR(COUNTRY_INFO!N39=\"Unknown\",COUNTRY_INFO!N39=\"Surveillance\",COUNTRY_INFO!N39=\"Not required\",COUNTRY_INFO!N39=0),0,IF(INTRO!$E$39=\"Non-endemic\",IF(AND($E39<>0,$G39=\"\"),IF($F39=0,COUNTRY_INFO!N39*$E39,COUNTRY_INFO!N39*($E39-$D39)),IF(AND($E39<>0,$G39<>0),IF($F39=0,COUNTRY_INFO!N39*$G39,COUNTRY_INFO!N39*($G39-$D39)),0)),IF($G39=\"\",COUNTRY_INFO!N39*$E39,COUNTRY_INFO!N39*$G39)))","v":0},{"$f":"IF(OR(COUNTRY_INFO!O39=\"Unknown\",COUNTRY_INFO!O39=\"Surveillance\",COUNTRY_INFO!O39=\"Not required\",COUNTRY_INFO!O39=0),0,IF($E39<>0, IF($F39=0,COUNTRY_INFO!O39*$E39,COUNTRY_INFO!O39*($E39-$D39)),COUNTRY_INFO!O39*$E39))","v":0},null,{"$f":"IF(OR(COUNTRY_INFO!P39=\"Unknown\",COUNTRY_INFO!P39=\"Surveillance\",COUNTRY_INFO!P39=\"Not required\",COUNTRY_INFO!P39=0),0,IF(AND($E39<>0,$J39=\"\"),IF($F39=0,COUNTRY_INFO!P39*$E39,COUNTRY_INFO!P39*($E39-$D39)), IF(AND($E39<>0,$J39<>0),IF($F39=0,COUNTRY_INFO!P39*$J39,COUNTRY_INFO!P39*($J39-$D39)), COUNTRY_INFO!P39*$J39)))","v":0},0,0,null,0,0,null,0,0,null,0]
[{"$f":"IF(AND(INTRO!$E$37=\"Non-endemic\",INTRO!$E$41=\"Non-endemic\"),\" \",IF(COUNTRY_INFO!A40=0,\" \",COUNTRY_INFO!A40))","v":"Eswatini"},{"$f":"IF(AND(INTRO!$E$37=\"Non-endemic\",INTRO!$E$41=\"Non-endemic\"),\" \",IF(COUNTRY_INFO!B40=0,\" \",COUNTRY_INFO!B40))","v":"MANZINI"},{"$f":"IF(AND(INTRO!$E$37=\"Non-endemic\",INTRO!$E$41=\"Non-endemic\"),\" \",IF(COUNTRY_INFO!C40=0,\" \",COUNTRY_INFO!C40))","v":"Ludzeludze"},{"$f":"IF(AND(INTRO!$E$37=\"Non-endemic\",INTRO!$E$41=\"Non-endemic\"),0,COUNTRY_INFO!V40)","v":0},{"$f":"IF(AND(INTRO!$E$37=\"Non-endemic\",INTRO!$E$41=\"Non-endemic\"),0,COUNTRY_INFO!X40)","v":0},{"$f":"IF(INTRO!$E$39=\"Non-endemic\",IF($D40=1,DEC!I40,0),IF($D40=1,IVM!G40,0))","v":0},null,{"$f":"IF(OR(COUNTRY_INFO!N40=\"Unknown\",COUNTRY_INFO!N40=\"Surveillance\",COUNTRY_INFO!N40=\"Not required\",COUNTRY_INFO!N40=0),0,IF(INTRO!$E$39=\"Non-endemic\",IF(AND($E40<>0,$G40=\"\"),IF($F40=0,COUNTRY_INFO!N40*$E40,COUNTRY_INFO!N40*($E40-$D40)),IF(AND($E40<>0,$G40<>0),IF($F40=0,COUNTRY_INFO!N40*$G40,COUNTRY_INFO!N40*($G40-$D40)),0)),IF($G40=\"\",COUNTRY_INFO!N40*$E40,COUNTRY_INFO!N40*$G40)))","v":0},{"$f":"IF(OR(COUNTRY_INFO!O40=\"Unknown\",COUNTRY_INFO!O40=\"Surveillance\",COUNTRY_INFO!O40=\"Not required\",COUNTRY_INFO!O40=0),0,IF($E40<>0, IF($F40=0,COUNTRY_INFO!O40*$E40,COUNTRY_INFO!O40*($E40-$D40)),COUNTRY_INFO!O40*$E40))","v":0},null,{"$f":"IF(OR(COUNTRY_INFO!P40=\"Unknown\",COUNTRY_INFO!P40=\"Surveillance\",COUNTRY_INFO!P40=\"Not required\",COUNTRY_INFO!P40=0),0,IF(AND($E40<>0,$J40=\"\"),IF($F40=0,COUNTRY_INFO!P40*$E40,COUNTRY_INFO!P40*($E40-$D40)), IF(AND($E40<>0,$J40<>0),IF($F40=0,COUNTRY_INFO!P40*$J40,COUNTRY_INFO!P40*($J40-$D40)), COUNTRY_INFO!P40*$J40)))","v":0},0,0,null,0,0,null,0,0,null,0]
[{"$f":"IF(AND(INTRO!$E$37=\"Non-endemic\",INTRO!$E$41=\"Non-endemic\"),\" \",IF(COUNTRY_INFO!A41=0,\" \",COUNTRY_INFO!A41))","v":"Eswatini"},{"$f":"IF(AND(INTRO!$E$37=\"Non-endemic\",INTRO!$E$41=\"Non-endemic\"),\" \",IF(COUNTRY_INFO!B41=0,\" \",COUNTRY_INFO!B41))","v":"MANZINI"},{"$f":"IF(AND(INTRO!$E$37=\"Non-endemic\",INTRO!$E$41=\"Non-endemic\"),\" \",IF(COUNTRY_INFO!C41=0,\" \",COUNTRY_INFO!C41))","v":"Mafutseni"},{"$f":"IF(AND(INTRO!$E$37=\"Non-endemic\",INTRO!$E$41=\"Non-endemic\"),0,COUNTRY_INFO!V41)","v":0},{"$f":"IF(AND(INTRO!$E$37=\"Non-endemic\",INTRO!$E$41=\"Non-endemic\"),0,COUNTRY_INFO!X41)","v":0},{"$f":"IF(INTRO!$E$39=\"Non-endemic\",IF($D41=1,DEC!I41,0),IF($D41=1,IVM!G41,0))","v":0},null,{"$f":"IF(OR(COUNTRY_INFO!N41=\"Unknown\",COUNTRY_INFO!N41=\"Surveillance\",COUNTRY_INFO!N41=\"Not required\",COUNTRY_INFO!N41=0),0,IF(INTRO!$E$39=\"Non-endemic\",IF(AND($E41<>0,$G41=\"\"),IF($F41=0,COUNTRY_INFO!N41*$E41,COUNTRY_INFO!N41*($E41-$D41)),IF(AND($E41<>0,$G41<>0),IF($F41=0,COUNTRY_INFO!N41*$G41,COUNTRY_INFO!N41*($G41-$D41)),0)),IF($G41=\"\",COUNTRY_INFO!N41*$E41,COUNTRY_INFO!N41*$G41)))","v":0},{"$f":"IF(OR(COUNTRY_INFO!O41=\"Unknown\",COUNTRY_INFO!O41=\"Surveillance\",COUNTRY_INFO!O41=\"Not required\",COUNTRY_INFO!O41=0),0,IF($E41<>0, IF($F41=0,COUNTRY_INFO!O41*$E41,COUNTRY_INFO!O41*($E41-$D41)),COUNTRY_INFO!O41*$E41))","v":0},null,{"$f":"IF(OR(COUNTRY_INFO!P41=\"Unknown\",COUNTRY_INFO!P41=\"Surveillance\",COUNTRY_INFO!P41=\"Not required\",COUNTRY_INFO!P41=0),0,IF(AND($E41<>0,$J41=\"\"),IF($F41=0,COUNTRY_INFO!P41*$E41,COUNTRY_INFO!P41*($E41-$D41)), IF(AND($E41<>0,$J41<>0),IF($F41=0,COUNTRY_INFO!P41*$J41,COUNTRY_INFO!P41*($J41-$D41)), COUNTRY_INFO!P41*$J41)))","v":0},0,0,null,0,0,null,0,0,null,0]
[{"$f":"IF(AND(INTRO!$E$37=\"Non-endemic\",INTRO!$E$41=\"Non-endemic\"),\" \",IF(COUNTRY_INFO!A42=0,\" \",COUNTRY_INFO!A42))","v":"Eswatini"},{"$f":"IF(AND(INTRO!$E$37=\"Non-endemic\",INTRO!$E$41=\"Non-endemic\"),\" \",IF(COUNTRY_INFO!B42=0,\" \",COUNTRY_INFO!B42))","v":"MANZINI"},{"$f":"IF(AND(INTRO!$E$37=\"Non-endemic\",INTRO!$E$41=\"Non-endemic\"),\" \",IF(COUNTRY_INFO!C42=0,\" \",COUNTRY_INFO!C42))","v":"Mahlangatsha"},{"$f":"IF(AND(INTRO!$E$37=\"Non-endemic\",INTRO!$E$41=\"Non-endemic\"),0,COUNTRY_INFO!V42)","v":0},{"$f":"IF(AND(INTRO!$E$37=\"Non-endemic\",INTRO!$E$41=\"Non-endemic\"),0,COUNTRY_INFO!X42)","v":0},{"$f":"IF(INTRO!$E$39=\"Non-endemic\",IF($D42=1,DEC!I42,0),IF($D42=1,IVM!G42,0))","v":0},null,{"$f":"IF(OR(COUNTRY_INFO!N42=\"Unknown\",COUNTRY_INFO!N42=\"Surveillance\",COUNTRY_INFO!N42=\"Not required\",COUNTRY_INFO!N42=0),0,IF(INTRO!$E$39=\"Non-endemic\",IF(AND($E42<>0,$G42=\"\"),IF($F42=0,COUNTRY_INFO!N42*$E42,COUNTRY_INFO!N42*($E42-$D42)),IF(AND($E42<>0,$G42<>0),IF($F42=0,COUNTRY_INFO!N42*$G42,COUNTRY_INFO!N42*($G42-$D42)),0)),IF($G42=\"\",COUNTRY_INFO!N42*$E42,COUNTRY_INFO!N42*$G42)))","v":0},{"$f":"IF(OR(COUNTRY_INFO!O42=\"Unknown\",COUNTRY_INFO!O42=\"Surveillance\",COUNTRY_INFO!O42=\"Not required\",COUNTRY_INFO!O42=0),0,IF($E42<>0, IF($F42=0,COUNTRY_INFO!O42*$E42,COUNTRY_INFO!O42*($E42-$D42)),COUNTRY_INFO!O42*$E42))","v":0},null,{"$f":"IF(OR(COUNTRY_INFO!P42=\"Unknown\",COUNTRY_INFO!P42=\"Surveillance\",COUNTRY_INFO!P42=\"Not required\",COUNTRY_INFO!P42=0),0,IF(AND($E42<>0,$J42=\"\"),IF($F42=0,COUNTRY_INFO!P42*$E42,COUNTRY_INFO!P42*($E42-$D42)), IF(AND($E42<>0,$J42<>0),IF($F42=0,COUNTRY_INFO!P42*$J42,COUNTRY_INFO!P42*($J42-$D42)), COUNTRY_INFO!P42*$J42)))","v":0},0,0,null,0,0,null,0,0,null,0]
[{"$f":"IF(AND(INTRO!$E$37=\"Non-endemic\",INTRO!$E$41=\"Non-endemic\"),\" \",IF(COUNTRY_INFO!A43=0,\" \",COUNTRY_INFO!A43))","v":"Eswatini"},{"$f":"IF(AND(INTRO!$E$37=\"Non-endemic\",INTRO!$E$41=\"Non-endemic\"),\" \",IF(COUNTRY_INFO!B43=0,\" \",COUNTRY_INFO!B43))","v":"MANZINI"},{"$f":"IF(AND(INTRO!$E$37=\"Non-endemic\",INTRO!$E$41=\"Non-endemic\"),\" \",IF(COUNTRY_INFO!C43=0,\" \",COUNTRY_INFO!C43))","v":"Mangcongco"},{"$f":"IF(AND(INTRO!$E$37=\"Non-endemic\",INTRO!$E$41=\"Non-endemic\"),0,COUNTRY_INFO!V43)","v":0},{"$f":"IF(AND(INTRO!$E$37=\"Non-endemic\",INTRO!$E$41=\"Non-endemic\"),0,COUNTRY_INFO!X43)","v":0},{"$f":"IF(INTRO!$E$39=\"Non-endemic\",IF($D43=1,DEC!I43,0),IF($D43=1,IVM!G43,0))","v":0},null,{"$f":"IF(OR(COUNTRY_INFO!N43=\"Unknown\",COUNTRY_INFO!N43=\"Surveillance\",COUNTRY_INFO!N43=\"Not required\",COUNTRY_INFO!N43=0),0,IF(INTRO!$E$39=\"Non-endemic\",IF(AND($E43<>0,$G43=\"\"),IF($F43=0,COUNTRY_INFO!N43*$E43,COUNTRY_INFO!N43*($E43-$D43)),IF(AND($E43<>0,$G43<>0),IF($F43=0,COUNTRY_INFO!N43*$G43,COUNTRY_INFO!N43*($G43-$D43)),0)),IF($G43=\"\",COUNTRY_INFO!N43*$E43,COUNTRY_INFO!N43*$G43)))","v":0},{"$f":"IF(OR(COUNTRY_INFO!O43=\"Unknown\",COUNTRY_INFO!O43=\"Surveillance\",COUNTRY_INFO!O43=\"Not required\",COUNTRY_INFO!O43=0),0,IF($E43<>0, IF($F43=0,COUNTRY_INFO!O43*$E43,COUNTRY_INFO!O43*($E43-$D43)),COUNTRY_INFO!O43*$E43))","v":0},null,{"$f":"IF(OR(COUNTRY_INFO!P43=\"Unknown\",COUNTRY_INFO!P43=\"Surveillance\",COUNTRY_INFO!P43=\"Not required\",COUNTRY_INFO!P43=0),0,IF(AND($E43<>0,$J43=\"\"),IF($F43=0,COUNTRY_INFO!P43*$E43,COUNTRY_INFO!P43*($E43-$D43)), IF(AND($E43<>0,$J43<>0),IF($F43=0,COUNTRY_INFO!P43*$J43,COUNTRY_INFO!P43*($J43-$D43)), COUNTRY_INFO!P43*$J43)))","v":0},0,0,null,0,0,null,0,0,null,0]
[{"$f":"IF(AND(INTRO!$E$37=\"Non-endemic\",INTRO!$E$41=\"Non-endemic\"),\" \",IF(COUNTRY_INFO!A44=0,\" \",COUNTRY_INFO!A44))","v":"Eswatini"},{"$f":"IF(AND(INTRO!$E$37=\"Non-endemic\",INTRO!$E$41=\"Non-endemic\"),\" \",IF(COUNTRY_INFO!B44=0,\" \",COUNTRY_INFO!B44))","v":"MANZINI"},{"$f":"IF(AND(INTRO!$E$37=\"Non-endemic\",INTRO!$E$41=\"Non-endemic\"),\" \",IF(COUNTRY_INFO!C44=0,\" \",COUNTRY_INFO!C44))","v":"Manzini North"},{"$f":"IF(AND(INTRO!$E$37=\"Non-endemic\",INTRO!$E$41=\"Non-endemic\"),0,COUNTRY_INFO!V44)","v":0},{"$f":"IF(AND(INTRO!$E$37=\"Non-endemic\",INTRO!$E$41=\"Non-endemic\"),0,COUNTRY_INFO!X44)","v":0},{"$f":"IF(INTRO!$E$39=\"Non-endemic\",IF($D44=1,DEC!I44,0),IF($D44=1,IVM!G44,0))","v":0},null,{"$f":"IF(OR(COUNTRY_INFO!N44=\"Unknown\",COUNTRY_INFO!N44=\"Surveillance\",COUNTRY_INFO!N44=\"Not required\",COUNTRY_INFO!N44=0),0,IF(INTRO!$E$39=\"Non-endemic\",IF(AND($E44<>0,$G44=\"\"),IF($F44=0,COUNTRY_INFO!N44*$E44,COUNTRY_INFO!N44*($E44-$D44)),IF(AND($E44<>0,$G44<>0),IF($F44=0,COUNTRY_INFO!N44*$G44,COUNTRY_INFO!N44*($G44-$D44)),0)),IF($G44=\"\",COUNTRY_INFO!N44*$E44,COUNTRY_INFO!N44*$G44)))","v":0},{"$f":"IF(OR(COUNTRY_INFO!O44=\"Unknown\",COUNTRY_INFO!O44=\"Surveillance\",COUNTRY_INFO!O44=\"Not required\",COUNTRY_INFO!O44=0),0,IF($E44<>0, IF($F44=0,COUNTRY_INFO!O44*$E44,COUNTRY_INFO!O44*($E44-$D44)),COUNTRY_INFO!O44*$E44))","v":0},null,{"$f":"IF(OR(COUNTRY_INFO!P44=\"Unknown\",COUNTRY_INFO!P44=\"Surveillance\",COUNTRY_INFO!P44=\"Not required\",COUNTRY_INFO!P44=0),0,IF(AND($E44<>0,$J44=\"\"),IF($F44=0,COUNTRY_INFO!P44*$E44,COUNTRY_INFO!P44*($E44-$D44)), IF(AND($E44<>0,$J44<>0),IF($F44=0,COUNTRY_INFO!P44*$J44,COUNTRY_INFO!P44*($J44-$D44)), COUNTRY_INFO!P44*$J44)))","v":0},0,0,null,0,0,null,0,0,null,0]
[{"$f":"IF(AND(INTRO!$E$37=\"Non-endemic\",INTRO!$E$41=\"Non-endemic\"),\" \",IF(COUNTRY_INFO!A45=0,\" \",COUNTRY_INFO!A45))","v":"Eswatini"},{"$f":"IF(AND(INTRO!$E$37=\"Non-endemic\",INTRO!$E$41=\"Non-endemic\"),\" \",IF(COUNTRY_INFO!B45=0,\" \",COUNTRY_INFO!B45))","v":"MANZINI"},{"$f":"IF(AND(INTRO!$E$37=\"Non-endemic\",INTRO!$E$41=\"Non-endemic\"),\" \",IF(COUNTRY_INFO!C45=0,\" \",COUNTRY_INFO!C45))","v":"Manzini South"},{"$f":"IF(AND(INTRO!$E$37=\"Non-endemic\",INTRO!$E$41=\"Non-endemic\"),0,COUNTRY_INFO!V45)","v":0},{"$f":"IF(AND(INTRO!$E$37=\"Non-endemic\",INTRO!$E$41=\"Non-endemic\"),0,COUNTRY_INFO!X45)","v":0},{"$f":"IF(INTRO!$E$39=\"Non-endemic\",IF($D45=1,DEC!I45,0),IF($D45=1,IVM!G45,0))","v":0},null,{"$f":"IF(OR(COUNTRY_INFO!N45=\"Unknown\",COUNTRY_INFO!N45=\"Surveillance\",COUNTRY_INFO!N45=\"Not required\",COUNTRY_INFO!N45=0),0,IF(INTRO!$E$39=\"Non-endemic\",IF(AND($E45<>0,$G45=\"\"),IF($F45=0,COUNTRY_INFO!N45*$E45,COUNTRY_INFO!N45*($E45-$D45)),IF(AND($E45<>0,$G45<>0),IF($F45=0,COUNTRY_INFO!N45*$G45,COUNTRY_INFO!N45*($G45-$D45)),0)),IF($G45=\"\",COUNTRY_INFO!N45*$E45,COUNTRY_INFO!N45*$G45)))","v":0},{"$f":"IF(OR(COUNTRY_INFO!O45=\"Unknown\",COUNTRY_INFO!O45=\"Surveillance\",COUNTRY_INFO!O45=\"Not required\",COUNTRY_INFO!O45=0),0,IF($E45<>0, IF($F45=0,COUNTRY_INFO!O45*$E45,COUNTRY_INFO!O45*($E45-$D45)),COUNTRY_INFO!O45*$E45))","v":0},null,{"$f":"IF(OR(COUNTRY_INFO!P45=\"Unknown\",COUNTRY_INFO!P45=\"Surveillance\",COUNTRY_INFO!P45=\"Not required\",COUNTRY_INFO!P45=0),0,IF(AND($E45<>0,$J45=\"\"),IF($F45=0,COUNTRY_INFO!P45*$E45,COUNTRY_INFO!P45*($E45-$D45)), IF(AND($E45<>0,$J45<>0),IF($F45=0,COUNTRY_INFO!P45*$J45,COUNTRY_INFO!P45*($J45-$D45)), COUNTRY_INFO!P45*$J45)))","v":0},0,0,null,0,0,null,0,0,null,0]
[{"$f":"IF(AND(INTRO!$E$37=\"Non-endemic\",INTRO!$E$41=\"Non-endemic\"),\" \",IF(COUNTRY_INFO!A46=0,\" \",COUNTRY_INFO!A46))","v":"Eswatini"},{"$f":"IF(AND(INTRO!$E$37=\"Non-endemic\",INTRO!$E$41=\"Non-endemic\"),\" \",IF(COUNTRY_INFO!B46=0,\" \",COUNTRY_INFO!B46))","v":"MANZINI"},{"$f":"IF(AND(INTRO!$E$37=\"Non-endemic\",INTRO!$E$41=\"Non-endemic\"),\" \",IF(COUNTRY_INFO!C46=0,\" \",COUNTRY_INFO!C46))","v":"Mhlambanyatsi"},{"$f":"IF(AND(INTRO!$E$37=\"Non-endemic\",INTRO!$E$41=\"Non-endemic\"),0,COUNTRY_INFO!V46)","v":0},{"$f":"IF(AND(INTRO!$E$37=\"Non-endemic\",INTRO!$E$41=\"Non-endemic\"),0,COUNTRY_INFO!X46)","v":0},{"$f":"IF(INTRO!$E$39=\"Non-endemic\",IF($D46=1,DEC!I46,0),IF($D46=1,IVM!G46,0))","v":0},null,{"$f":"IF(OR(COUNTRY_INFO!N46=\"Unknown\",COUNTRY_INFO!N46=\"Surveillance\",COUNTRY_INFO!N46=\"Not required\",COUNTRY_INFO!N46=0),0,IF(INTRO!$E$39=\"Non-endemic\",IF(AND($E46<>0,$G46=\"\"),IF($F46=0,COUNTRY_INFO!N46*$E46,COUNTRY_INFO!N46*($E46-$D46)),IF(AND($E46<>0,$G46<>0),IF($F46=0,COUNTRY_INFO!N46*$G46,COUNTRY_INFO!N46*($G46-$D46)),0)),IF($G46=\"\",COUNTRY_INFO!N46*$E46,COUNTRY_INFO!N46*$G46)))","v":0},{"$f":"IF(OR(COUNTRY_INFO!O46=\"Unknown\",COUNTRY_INFO!O46=\"Surveillance\",COUNTRY_INFO!O46=\"Not required\",COUNTRY_INFO!O46=0),0,IF($E46<>0, IF($F46=0,COUNTRY_INFO!O46*$E46,COUNTRY_INFO!O46*($E46-$D46)),COUNTRY_INFO!O46*$E46))","v":0},null,{"$f":"IF(OR(COUNTRY_INFO!P46=\"Unknown\",COUNTRY_INFO!P46=\"Surveillance\",COUNTRY_INFO!P46=\"Not required\",COUNTRY_INFO!P46=0),0,IF(AND($E46<>0,$J46=\"\"),IF($F46=0,COUNTRY_INFO!P46*$E46,COUNTRY_INFO!P46*($E46-$D46)), IF(AND($E46<>0,$J46<>0),IF($F46=0,COUNTRY_INFO!P46*$J46,COUNTRY_INFO!P46*($J46-$D46)), COUNTRY_INFO!P46*$J46)))","v":0},0,0,null,0,0,null,0,0,null,0]
[{"$f":"IF(AND(INTRO!$E$37=\"Non-endemic\",INTRO!$E$41=\"Non-endemic\"),\" \",IF(COUNTRY_INFO!A47=0,\" \",COUNTRY_INFO!A47))","v":"Eswatini"},{"$f":"IF(AND(INTRO!$E$37=\"Non-endemic\",INTRO!$E$41=\"Non-endemic\"),\" \",IF(COUNTRY_INFO!B47=0,\" \",COUNTRY_INFO!B47))","v":"MANZINI"},{"$f":"IF(AND(INTRO!$E$37=\"Non-endemic\",INTRO!$E$41=\"Non-endemic\"),\" \",IF(COUNTRY_INFO!C47=0,\" \",COUNTRY_INFO!C47))","v":"Mkhiweni"},{"$f":"IF(AND(INTRO!$E$37=\"Non-endemic\",INTRO!$E$41=\"Non-endemic\"),0,COUNTRY_INFO!V47)","v":0},{"$f":"IF(AND(INTRO!$E$37=\"Non-endemic\",INTRO!$E$41=\"Non-endemic\"),0,COUNTRY_INFO!X47)","v":0},{"$f":"IF(INTRO!$E$39=\"Non-endemic\",IF($D47=1,DEC!I47,0),IF($D47=1,IVM!G47,0))","v":0},null,{"$f":"IF(OR(COUNTRY_INFO!N47=\"Unknown\",COUNTRY_INFO!N47=\"Surveillance\",COUNTRY_INFO!N47=\"Not required\",COUNTRY_INFO!N47=0),0,IF(INTRO!$E$39=\"Non-endemic\",IF(AND($E47<>0,$G47=\"\"),IF($F47=0,COUNTRY_INFO!N47*$E47,COUNTRY_INFO!N47*($E47-$D47)),IF(AND($E47<>0,$G47<>0),IF($F47=0,COUNTRY_INFO!N47*$G47,COUNTRY_INFO!N47*($G47-$D47)),0)),IF($G47=\"\",COUNTRY_INFO!N47*$E47,COUNTRY_INFO!N47*$G47)))","v":0},{"$f":"IF(OR(COUNTRY_INFO!O47=\"Unknown\",COUNTRY_INFO!O47=\"Surveillance\",COUNTRY_INFO!O47=\"Not required\",COUNTRY_INFO!O47=0),0,IF($E47<>0, IF($F47=0,COUNTRY_INFO!O47*$E47,COUNTRY_INFO!O47*($E47-$D47)),COUNTRY_INFO!O47*$E47))","v":0},null,{"$f":"IF(OR(COUNTRY_INFO!P47=\"Unknown\",COUNTRY_INFO!P47=\"Surveillance\",COUNTRY_INFO!P47=\"Not required\",COUNTRY_INFO!P47=0),0,IF(AND($E47<>0,$J47=\"\"),IF($F47=0,COUNTRY_INFO!P47*$E47,COUNTRY_INFO!P47*($E47-$D47)), IF(AND($E47<>0,$J47<>0),IF($F47=0,COUNTRY_INFO!P47*$J47,COUNTRY_INFO!P47*($J47-$D47)), COUNTRY_INFO!P47*$J47)))","v":0},0,0,null,0,0,null,0,0,null,0]
[{"$f":"IF(AND(INTRO!$E$37=\"Non-endemic\",INTRO!$E$41=\"Non-endemic\"),\" \",IF(COUNTRY_INFO!A48=0,\" \",COUNTRY_INFO!A48))","v":"Eswatini"},{"$f":"IF(AND(INTRO!$E$37=\"Non-endemic\",INTRO!$E$41=\"Non-endemic\"),\" \",IF(COUNTRY_INFO!B48=0,\" \",COUNTRY_INFO!B48))","v":"MANZINI"},{"$f":"IF(AND(INTRO!$E$37=\"Non-endemic\",INTRO!$E$41=\"Non-endemic\"),\" \",IF(COUNTRY_INFO!C48=0,\" \",COUNTRY_INFO!C48))","v":"Mtfongwaneni"},{"$f":"IF(AND(INTRO!$E$37=\"Non-endemic\",INTRO!$E$41=\"Non-endemic\"),0,COUNTRY_INFO!V48)","v":0},{"$f":"IF(AND(INTRO!$E$37=\"Non-endemic\",INTRO!$E$41=\"Non-endemic\"),0,COUNTRY_INFO!X48)","v":0},{"$f":"IF(INTRO!$E$39=\"Non-endemic\",IF($D48=1,DEC!I48,0),IF($D48=1,IVM!G48,0))","v":0},null,{"$f":"IF(OR(COUNTRY_INFO!N48=\"Unknown\",COUNTRY_INFO!N48=\"Surveillance\",COUNTRY_INFO!N48=\"Not required\",COUNTRY_INFO!N48=0),0,IF(INTRO!$E$39=\"Non-endemic\",IF(AND($E48<>0,$G48=\"\"),IF($F48=0,COUNTRY_INFO!N48*$E48,COUNTRY_INFO!N48*($E48-$D48)),IF(AND($E48<>0,$G48<>0),IF($F48=0,COUNTRY_INFO!N48*$G48,COUNTRY_INFO!N48*($G48-$D48)),0)),IF($G48=\"\",COUNTRY_INFO!N48*$E48,COUNTRY_INFO!N48*$G48)))","v":0},{"$f":"IF(OR(COUNTRY_INFO!O48=\"Unknown\",COUNTRY_INFO!O48=\"Surveillance\",COUNTRY_INFO!O48=\"Not required\",COUNTRY_INFO!O48=0),0,IF($E48<>0, IF($F48=0,COUNTRY_INFO!O48*$E48,COUNTRY_INFO!O48*($E48-$D48)),COUNTRY_INFO!O48*$E48))","v":0},null,{"$f":"IF(OR(COUNTRY_INFO!P48=\"Unknown\",COUNTRY_INFO!P48=\"Surveillance\",COUNTRY_INFO!P48=\"Not required\",COUNTRY_INFO!P48=0),0,IF(AND($E48<>0,$J48=\"\"),IF($F48=0,COUNTRY_INFO!P48*$E48,COUNTRY_INFO!P48*($E48-$D48)), IF(AND($E48<>0,$J48<>0),IF($F48=0,COUNTRY_INFO!P48*$J48,COUNTRY_INFO!P48*($J48-$D48)), COUNTRY_INFO!P48*$J48)))","v":0},0,0,null,0,0,null,0,0,null,0]
[{"$f":"IF(AND(INTRO!$E$37=\"Non-endemic\",INTRO!$E$41=\"Non-endemic\"),\" \",IF(COUNTRY_INFO!A49=0,\" \",COUNTRY_INFO!A49))","v":"Eswatini"},{"$f":"IF(AND(INTRO!$E$37=\"Non-endemic\",INTRO!$E$41=\"Non-endemic\"),\" \",IF(COUNTRY_INFO!B49=0,\" \",COUNTRY_INFO!B49))","v":"MANZINI"},{"$f":"IF(AND(INTRO!$E$37=\"Non-endemic\",INTRO!$E$41=\"Non-endemic\"),\" \",IF(COUNTRY_INFO!C49=0,\" \",COUNTRY_INFO!C49))","v":"Ngwemphisi"},{"$f":"IF(AND(INTRO!$E$37=\"Non-endemic\",INTRO!$E$41=\"Non-endemic\"),0,COUNTRY_INFO!V49)","v":0},{"$f":"IF(AND(INTRO!$E$37=\"Non-endemic\",INTRO!$E$41=\"Non-endemic\"),0,COUNTRY_INFO!X49)","v":0},{"$f":"IF(INTRO!$E$39=\"Non-endemic\",IF($D49=1,DEC!I49,0),IF($D49=1,IVM!G49,0))","v":0},null,{"$f":"IF(OR(COUNTRY_INFO!N49=\"Unknown\",COUNTRY_INFO!N49=\"Surveillance\",COUNTRY_INFO!N49=\"Not required\",COUNTRY_INFO!N49=0),0,IF(INTRO!$E$39=\"Non-endemic\",IF(AND($E49<>0,$G49=\"\"),IF($F49=0,COUNTRY_INFO!N49*$E49,COUNTRY_INFO!N49*($E49-$D49)),IF(AND($E49<>0,$G49<>0),IF($F49=0,COUNTRY_INFO!N49*$G49,COUNTRY_INFO!N49*($G49-$D49)),0)),IF($G49=\"\",COUNTRY_INFO!N49*$E49,COUNTRY_INFO!N49*$G49)))","v":0},{"$f":"IF(OR(COUNTRY_INFO!O49=\"Unknown\",COUNTRY_INFO!O49=\"Surveillance\",COUNTRY_INFO!O49=\"Not required\",COUNTRY_INFO!O49=0),0,IF($E49<>0, IF($F49=0,COUNTRY_INFO!O49*$E49,COUNTRY_INFO!O49*($E49-$D49)),COUNTRY_INFO!O49*$E49))","v":0},null,{"$f":"IF(OR(COUNTRY_INFO!P49=\"Unknown\",COUNTRY_INFO!P49=\"Surveillance\",COUNTRY_INFO!P49=\"Not required\",COUNTRY_INFO!P49=0),0,IF(AND($E49<>0,$J49=\"\"),IF($F49=0,COUNTRY_INFO!P49*$E49,COUNTRY_INFO!P49*($E49-$D49)), IF(AND($E49<>0,$J49<>0),IF($F49=0,COUNTRY_INFO!P49*$J49,COUNTRY_INFO!P49*($J49-$D49)), COUNTRY_INFO!P49*$J49)))","v":0},0,0,null,0,0,null,0,0,null,0]
[{"$f":"IF(AND(INTRO!$E$37=\"Non-endemic\",INTRO!$E$41=\"Non-endemic\"),\" \",IF(COUNTRY_INFO!A50=0,\" \",COUNTRY_INFO!A50))","v":"Eswatini"},{"$f":"IF(AND(INTRO!$E$37=\"Non-endemic\",INTRO!$E$41=\"Non-endemic\"),\" \",IF(COUNTRY_INFO!B50=0,\" \",COUNTRY_INFO!B50))","v":"MANZINI"},{"$f":"IF(AND(INTRO!$E$37=\"Non-endemic\",INTRO!$E$41=\"Non-endemic\"),\" \",IF(COUNTRY_INFO!C50=0,\" \",COUNTRY_INFO!C50))","v":"Nhlambeni"},{"$f":"IF(AND(INTRO!$E$37=\"Non-endemic\",INTRO!$E$41=\"Non-endemic\"),0,COUNTRY_INFO!V50)","v":0},{"$f":"IF(AND(INTRO!$E$37=\"Non-endemic\",INTRO!$E$41=\"Non-endemic\"),0,COUNTRY_INFO!X50)","v":0},{"$f":"IF(INTRO!$E$39=\"Non-endemic\",IF($D50=1,DEC!I50,0),IF($D50=1,IVM!G50,0))","v":0},null,{"$f":"IF(OR(COUNTRY_INFO!N50=\"Unknown\",COUNTRY_INFO!N50=\"Surveillance\",COUNTRY_INFO!N50=\"Not required\",COUNTRY_INFO!N50=0),0,IF(INTRO!$E$39=\"Non-endemic\",IF(AND($E50<>0,$G50=\"\"),IF($F50=0,COUNTRY_INFO!N50*$E50,COUNTRY_INFO!N50*($E50-$D50)),IF(AND($E50<>0,$G50<>0),IF($F50=0,COUNTRY_INFO!N50*$G50,COUNTRY_INFO!N50*($G50-$D50)),0)),IF($G50=\"\",COUNTRY_INFO!N50*$E50,COUNTRY_INFO!N50*$G50)))","v":0},{"$f":"IF(OR(COUNTRY_INFO!O50=\"Unknown\",COUNTRY_INFO!O50=\"Surveillance\",COUNTRY_INFO!O50=\"Not required\",COUNTRY_INFO!O50=0),0,IF($E50<>0, IF($F50=0,COUNTRY_INFO!O50*$E50,COUNTRY_INFO!O50*($E50-$D50)),COUNTRY_INFO!O50*$E50))","v":0},null,{"$f":"IF(OR(COUNTRY_INFO!P50=\"Unknown\",COUNTRY_INFO!P50=\"Surveillance\",COUNTRY_INFO!P50=\"Not required\",COUNTRY_INFO!P50=0),0,IF(AND($E50<>0,$J50=\"\"),IF($F50=0,COUNTRY_INFO!P50*$E50,COUNTRY_INFO!P50*($E50-$D50)), IF(AND($E50<>0,$J50<>0),IF($F50=0,COUNTRY_INFO!P50*$J50,COUNTRY_INFO!P50*($J50-$D50)), COUNTRY_INFO!P50*$J50)))","v":0},0,0,null,0,0,null,0,0,null,0]
[{"$f":"IF(AND(INTRO!$E$37=\"Non-endemic\",INTRO!$E$41=\"Non-endemic\"),\" \",IF(COUNTRY_INFO!A51=0,\" \",COUNTRY_INFO!A51))","v":"Eswatini"},{"$f":"IF(AND(INTRO!$E$37=\"Non-endemic\",INTRO!$E$41=\"Non-endemic\"),\" \",IF(COUNTRY_INFO!B51=0,\" \",COUNTRY_INFO!B51))","v":"MANZINI"},{"$f":"IF(AND(INTRO!$E$37=\"Non-endemic\",INTRO!$E$41=\"Non-endemic\"),\" \",IF(COUNTRY_INFO!C51=0,\" \",COUNTRY_INFO!C51))","v":"Ntondozi"},{"$f":"IF(AND(INTRO!$E$37=\"Non-endemic\",INTRO!$E$41=\"Non-endemic\"),0,COUNTRY_INFO!V51)","v":0},{"$f":"IF(AND(INTRO!$E$37=\"Non-endemic\",INTRO!$E$41=\"Non-endemic\"),0,COUNTRY_INFO!X51)","v":0},{"$f":"IF(INTRO!$E$39=\"Non-endemic\",IF($D51=1,DEC!I51,0),IF($D51=1,IVM!G51,0))","v":0},null,{"$f":"IF(OR(COUNTRY_INFO!N51=\"Unknown\",COUNTRY_INFO!N51=\"Surveillance\",COUNTRY_INFO!N51=\"Not required\",COUNTRY_INFO!N51=0),0,IF(INTRO!$E$39=\"Non-endemic\",IF(AND($E51<>0,$G51=\"\"),IF($F51=0,COUNTRY_INFO!N51*$E51,COUNTRY_INFO!N51*($E51-$D51)),IF(AND($E51<>0,$G51<>0),IF($F51=0,COUNTRY_INFO!N51*$G51,COUNTRY_INFO!N51*($G51-$D51)),0)),IF($G51=\"\",COUNTRY_INFO!N51*$E51,COUNTRY_INFO!N51*$G51)))","v":0},{"$f":"IF(OR(COUNTRY_INFO!O51=\"Unknown\",COUNTRY_INFO!O51=\"Surveillance\",COUNTRY_INFO!O51=\"Not required\",COUNTRY_INFO!O51=0),0,IF($E51<>0, IF($F51=0,COUNTRY_INFO!O51*$E51,COUNTRY_INFO!O51*($E51-$D51)),COUNTRY_INFO!O51*$E51))","v":0},null,{"$f":"IF(OR(COUNTRY_INFO!P51=\"Unknown\",COUNTRY_INFO!P51=\"Surveillance\",COUNTRY_INFO!P51=\"Not required\",COUNTRY_INFO!P51=0),0,IF(AND($E51<>0,$J51=\"\"),IF($F51=0,COUNTRY_INFO!P51*$E51,COUNTRY_INFO!P51*($E51-$D51)), IF(AND($E51<>0,$J51<>0),IF($F51=0,COUNTRY_INFO!P51*$J51,COUNTRY_INFO!P51*($J51-$D51)), COUNTRY_INFO!P51*$J51)))","v":0},0,0,null,0,0,null,0,0,null,0]
[{"$f":"IF(AND(INTRO!$E$37=\"Non-endemic\",INTRO!$E$41=\"Non-endemic\"),\" \",IF(COUNTRY_INFO!A52=0,\" \",COUNTRY_INFO!A52))","v":"Eswatini"},{"$f":"IF(AND(INTRO!$E$37=\"Non-endemic\",INTRO!$E$41=\"Non-endemic\"),\" \",IF(COUNTRY_INFO!B52=0,\" \",COUNTRY_INFO!B52))","v":"MANZINI"},{"$f":"IF(AND(INTRO!$E$37=\"Non-endemic\",INTRO!$E$41=\"Non-endemic\"),\" \",IF(COUNTRY_INFO!C52=0,\" \",COUNTRY_INFO!C52))","v":"Nkomiyahlaba"},{"$f":"IF(AND(INTRO!$E$37=\"Non-endemic\",INTRO!$E$41=\"Non-endemic\"),0,COUNTRY_INFO!V52)","v":0},{"$f":"IF(AND(INTRO!$E$37=\"Non-endemic\",INTRO!$E$41=\"Non-endemic\"),0,COUNTRY_INFO!X52)","v":0},{"$f":"IF(INTRO!$E$39=\"Non-endemic\",IF($D52=1,DEC!I52,0),IF($D52=1,IVM!G52,0))","v":0},null,{"$f":"IF(OR(COUNTRY_INFO!N52=\"Unknown\",COUNTRY_INFO!N52=\"Surveillance\",COUNTRY_INFO!N52=\"Not required\",COUNTRY_INFO!N52=0),0,IF(INTRO!$E$39=\"Non-endemic\",IF(AND($E52<>0,$G52=\"\"),IF($F52=0,COUNTRY_INFO!N52*$E52,COUNTRY_INFO!N52*($E52-$D52)),IF(AND($E52<>0,$G52<>0),IF($F52=0,COUNTRY_INFO!N52*$G52,COUNTRY_INFO!N52*($G52-$D52)),0)),IF($G52=\"\",COUNTRY_INFO!N52*$E52,COUNTRY_INFO!N52*$G52)))","v":0},{"$f":"IF(OR(COUNTRY_INFO!O52=\"Unknown\",COUNTRY_INFO!O52=\"Surveillance\",COUNTRY_INFO!O52=\"Not required\",COUNTRY_INFO!O52=0),0,IF($E52<>0, IF($F52=0,COUNTRY_INFO!O52*$E52,COUNTRY_INFO!O52*($E52-$D52)),COUNTRY_INFO!O52*$E52))","v":0},null,{"$f":"IF(OR(COUNTRY_INFO!P52=\"Unknown\",COUNTRY_INFO!P52=\"Surveillance\",COUNTRY_INFO!P52=\"Not required\",COUNTRY_INFO!P52=0),0,IF(AND($E52<>0,$J52=\"\"),IF($F52=0,COUNTRY_INFO!P52*$E52,COUNTRY_INFO!P52*($E52-$D52)), IF(AND($E52<>0,$J52<>0),IF($F52=0,COUNTRY_INFO!P52*$J52,COUNTRY_INFO!P52*($J52-$D52)), COUNTRY_INFO!P52*$J52)))","v":0},0,0,null,0,0,null,0,0,null,0]
[{"$f":"IF(AND(INTRO!$E$37=\"Non-endemic\",INTRO!$E$41=\"Non-endemic\"),\" \",IF(COUNTRY_INFO!A53=0,\" \",COUNTRY_INFO!A53))","v":"Eswatini"},{"$f":"IF(AND(INTRO!$E$37=\"Non-endemic\",INTRO!$E$41=\"Non-endemic\"),\" \",IF(COUNTRY_INFO!B53=0,\" \",COUNTRY_INFO!B53))","v":"MANZINI"},{"$f":"IF(AND(INTRO!$E$37=\"Non-endemic\",INTRO!$E$41=\"Non-endemic\"),\" \",IF(COUNTRY_INFO!C53=0,\" \",COUNTRY_INFO!C53))","v":"Phondo"},{"$f":"IF(AND(INTRO!$E$37=\"Non-endemic\",INTRO!$E$41=\"Non-endemic\"),0,COUNTRY_INFO!V53)","v":0},{"$f":"IF(AND(INTRO!$E$37=\"Non-endemic\",INTRO!$E$41=\"Non-endemic\"),0,COUNTRY_INFO!X53)","v":0},{"$f":"IF(INTRO!$E$39=\"Non-endemic\",IF($D53=1,DEC!I53,0),IF($D53=1,IVM!G53,0))","v":0},null,{"$f":"IF(OR(COUNTRY_INFO!N53=\"Unknown\",COUNTRY_INFO!N53=\"Surveillance\",COUNTRY_INFO!N53=\"Not required\",COUNTRY_INFO!N53=0),0,IF(INTRO!$E$39=\"Non-endemic\",IF(AND($E53<>0,$G53=\"\"),IF($F53=0,COUNTRY_INFO!N53*$E53,COUNTRY_INFO!N53*($E53-$D53)),IF(AND($E53<>0,$G53<>0),IF($F53=0,COUNTRY_INFO!N53*$G53,COUNTRY_INFO!N53*($G53-$D53)),0)),IF($G53=\"\",COUNTRY_INFO!N53*$E53,COUNTRY_INFO!N53*$G53)))","v":0},{"$f":"IF(OR(COUNTRY_INFO!O53=\"Unknown\",COUNTRY_INFO!O53=\"Surveillance\",COUNTRY_INFO!O53=\"Not required\",COUNTRY_INFO!O53=0),0,IF($E53<>0, IF($F53=0,COUNTRY_INFO!O53*$E53,COUNTRY_INFO!O53*($E53-$D53)),COUNTRY_INFO!O53*$E53))","v":0},null,{"$f":"IF(OR(COUNTRY_INFO!P53=\"Unknown\",COUNTRY_INFO!P53=\"Surveillance\",COUNTRY_INFO!P53=\"Not required\",COUNTRY_INFO!P53=0),0,IF(AND($E53<>0,$J53=\"\"),IF($F53=0,COUNTRY_INFO!P53*$E53,COUNTRY_INFO!P53*($E53-$D53)), IF(AND($E53<>0,$J53<>0),IF($F53=0,COUNTRY_INFO!P53*$J53,COUNTRY_INFO!P53*($J53-$D53)), COUNTRY_INFO!P53*$J53)))","v":0},0,0,null,0,0,null,0,0,null,0]
[{"$f":"IF(AND(INTRO!$E$37=\"Non-endemic\",INTRO!$E$41=\"Non-endemic\"),\" \",IF(COUNTRY_INFO!A54=0,\" \",COUNTRY_INFO!A54))","v":"Eswatini"},{"$f":"IF(AND(INTRO!$E$37=\"Non-endemic\",INTRO!$E$41=\"Non-endemic\"),\" \",IF(COUNTRY_INFO!B54=0,\" \",COUNTRY_INFO!B54))","v":"SHISELWENI"},{"$f":"IF(AND(INTRO!$E$37=\"Non-endemic\",INTRO!$E$41=\"Non-endemic\"),\" \",IF(COUNTRY_INFO!C54=0,\" \",COUNTRY_INFO!C54))","v":"Gege"},{"$f":"IF(AND(INTRO!$E$37=\"Non-endemic\",INTRO!$E$41=\"Non-endemic\"),0,COUNTRY_INFO!V54)","v":0},{"$f":"IF(AND(INTRO!$E$37=\"Non-endemic\",INTRO!$E$41=\"Non-endemic\"),0,COUNTRY_INFO!X54)","v":0},{"$f":"IF(INTRO!$E$39=\"Non-endemic\",IF($D54=1,DEC!I54,0),IF($D54=1,IVM!G54,0))","v":0},null,{"$f":"IF(OR(COUNTRY_INFO!N54=\"Unknown\",COUNTRY_INFO!N54=\"Surveillance\",COUNTRY_INFO!N54=\"Not required\",COUNTRY_INFO!N54=0),0,IF(INTRO!$E$39=\"Non-endemic\",IF(AND($E54<>0,$G54=\"\"),IF($F54=0,COUNTRY_INFO!N54*$E54,COUNTRY_INFO!N54*($E54-$D54)),IF(AND($E54<>0,$G54<>0),IF($F54=0,COUNTRY_INFO!N54*$G54,COUNTRY_INFO!N54*($G54-$D54)),0)),IF($G54=\"\",COUNTRY_INFO!N54*$E54,COUNTRY_INFO!N54*$G54)))","v":0},{"$f":"IF(OR(COUNTRY_INFO!O54=\"Unknown\",COUNTRY_INFO!O54=\"Surveillance\",COUNTRY_INFO!O54=\"Not required\",COUNTRY_INFO!O54=0),0,IF($E54<>0, IF($F54=0,COUNTRY_INFO!O54*$E54,COUNTRY_INFO!O54*($E54-$D54)),COUNTRY_INFO!O54*$E54))","v":0},null,{"$f":"IF(OR(COUNTRY_INFO!P54=\"Unknown\",COUNTRY_INFO!P54=\"Surveillance\",COUNTRY_INFO!P54=\"Not required\",COUNTRY_INFO!P54=0),0,IF(AND($E54<>0,$J54=\"\"),IF($F54=0,COUNTRY_INFO!P54*$E54,COUNTRY_INFO!P54*($E54-$D54)), IF(AND($E54<>0,$J54<>0),IF($F54=0,COUNTRY_INFO!P54*$J54,COUNTRY_INFO!P54*($J54-$D54)), COUNTRY_INFO!P54*$J54)))","v":0},0,0,null,0,0,null,0,0,null,0]
[{"$f":"IF(AND(INTRO!$E$37=\"Non-endemic\",INTRO!$E$41=\"Non-endemic\"),\" \",IF(COUNTRY_INFO!A55=0,\" \",COUNTRY_INFO!A55))","v":"Eswatini"},{"$f":"IF(AND(INTRO!$E$37=\"Non-endemic\",INTRO!$E$41=\"Non-endemic\"),\" \",IF(COUNTRY_INFO!B55=0,\" \",COUNTRY_INFO!B55))","v":"SHISELWENI"},{"$f":"IF(AND(INTRO!$E$37=\"Non-endemic\",INTRO!$E$41=\"Non-endemic\"),\" \",IF(COUNTRY_INFO!C55=0,\" \",COUNTRY_INFO!C55))","v":"Hosea"},{"$f":"IF(AND(INTRO!$E$37=\"Non-endemic\",INTRO!$E$41=\"Non-endemic\"),0,COUNTRY_INFO!V55)","v":0},{"$f":"IF(AND(INTRO!$E$37=\"Non-endemic\",INTRO!$E$41=\"Non-endemic\"),0,COUNTRY_INFO!X55)","v":0},{"$f":"IF(INTRO!$E$39=\"Non-endemic\",IF($D55=1,DEC!I55,0),IF($D55=1,IVM!G55,0))","v":0},null,{"$f":"IF(OR(COUNTRY_INFO!N55=\"Unknown\",COUNTRY_INFO!N55=\"Surveillance\",COUNTRY_INFO!N55=\"Not required\",COUNTRY_INFO!N55=0),0,IF(INTRO!$E$39=\"Non-endemic\",IF(AND($E55<>0,$G55=\"\"),IF($F55=0,COUNTRY_INFO!N55*$E55,COUNTRY_INFO!N55*($E55-$D55)),IF(AND($E55<>0,$G55<>0),IF($F55=0,COUNTRY_INFO!N55*$G55,COUNTRY_INFO!N55*($G55-$D55)),0)),IF($G55=\"\",COUNTRY_INFO!N55*$E55,COUNTRY_INFO!N55*$G55)))","v":0},{"$f":"IF(OR(COUNTRY_INFO!O55=\"Unknown\",COUNTRY_INFO!O55=\"Surveillance\",COUNTRY_INFO!O55=\"Not required\",COUNTRY_INFO!O55=0),0,IF($E55<>0, IF($F55=0,COUNTRY_INFO!O55*$E55,COUNTRY_INFO!O55*($E55-$D55)),COUNTRY_INFO!O55*$E55))","v":0},null,{"$f":"IF(OR(COUNTRY_INFO!P55=\"Unknown\",COUNTRY_INFO!P55=\"Surveillance\",COUNTRY_INFO!P55=\"Not required\",COUNTRY_INFO!P55=0),0,IF(AND($E55<>0,$J55=\"\"),IF($F55=0,COUNTRY_INFO!P55*$E55,COUNTRY_INFO!P55*($E55-$D55)), IF(AND($E55<>0,$J55<>0),IF($F55=0,COUNTRY_INFO!P55*$J55,COUNTRY_INFO!P55*($J55-$D55)), COUNTRY_INFO!P55*$J55)))","v":0},0,0,null,0,0,null,0,0,null,0]
[{"$f":"IF(AND(INTRO!$E$37=\"Non-endemic\",INTRO!$E$41=\"Non-endemic\"),\" \",IF(COUNTRY_INFO!A56=0,\" \",COUNTRY_INFO!A56))","v":"Eswatini"},{"$f":"IF(AND(INTRO!$E$37=\"Non-endemic\",INTRO!$E$41=\"Non-endemic\"),\" \",IF(COUNTRY_INFO!B56=0,\" \",COUNTRY_INFO!B56))","v":"SHISELWENI"},{"$f":"IF(AND(INTRO!$E$37=\"Non-endemic\",INTRO!$E$41=\"Non-endemic\"),\" \",IF(COUNTRY_INFO!C56=0,\" \",COUNTRY_INFO!C56))","v":"Khubutha"},{"$f":"IF(AND(INTRO!$E$37=\"Non-endemic\",INTRO!$E$41=\"Non-endemic\"),0,COUNTRY_INFO!V56)","v":0},{"$f":"IF(AND(INTRO!$E$37=\"Non-endemic\",INTRO!$E$41=\"Non-endemic\"),0,COUNTRY_INFO!X56)","v":0},{"$f":"IF(INTRO!$E$39=\"Non-endemic\",IF($D56=1,DEC!I56,0),IF($D56=1,IVM!G56,0))","v":0},null,{"$f":"IF(OR(COUNTRY_INFO!N56=\"Unknown\",COUNTRY_INFO!N56=\"Surveillance\",COUNTRY_INFO!N56=\"Not required\",COUNTRY_INFO!N56=0),0,IF(INTRO!$E$39=\"Non-endemic\",IF(AND($E56<>0,$G56=\"\"),IF($F56=0,COUNTRY_INFO!N56*$E56,COUNTRY_INFO!N56*($E56-$D56)),IF(AND($E56<>0,$G56<>0),IF($F56=0,COUNTRY_INFO!N56*$G56,COUNTRY_INFO!N56*($G56-$D56)),0)),IF($G56=\"\",COUNTRY_INFO!N56*$E56,COUNTRY_INFO!N56*$G56)))","v":0},{"$f":"IF(OR(COUNTRY_INFO!O56=\"Unknown\",COUNTRY_INFO!O56=\"Surveillance\",COUNTRY_INFO!O56=\"Not required\",COUNTRY_INFO!O56=0),0,IF($E56<>0, IF($F56=0,COUNTRY_INFO!O56*$E56,COUNTRY_INFO!O56*($E56-$D56)),COUNTRY_INFO!O56*$E56))","v":0},null,{"$f":"IF(OR(COUNTRY_INFO!P56=\"Unknown\",COUNTRY_INFO!P56=\"Surveillance\",COUNTRY_INFO!P56=\"Not required\",COUNTRY_INFO!P56=0),0,IF(AND($E56<>0,$J56=\"\"),IF($F56=0,COUNTRY_INFO!P56*$E56,COUNTRY_INFO!P56*($E56-$D56)), IF(AND($E56<>0,$J56<>0),IF($F56=0,COUNTRY_INFO!P56*$J56,COUNTRY_INFO!P56*($J56-$D56)), COUNTRY_INFO!P56*$J56)))","v":0},0,0,null,0,0,null,0,0,null,0]
[{"$f":"IF(AND(INTRO!$E$37=\"Non-endemic\",INTRO!$E$41=\"Non-endemic\"),\" \",IF(COUNTRY_INFO!A57=0,\" \",COUNTRY_INFO!A57))","v":"Eswatini"},{"$f":"IF(AND(INTRO!$E$37=\"Non-endemic\",INTRO!$E$41=\"Non-endemic\"),\" \",IF(COUNTRY_INFO!B57=0,\" \",COUNTRY_INFO!B57))","v":"SHISELWENI"},{"$f":"IF(AND(INTRO!$E$37=\"Non-endemic\",INTRO!$E$41=\"Non-endemic\"),\" \",IF(COUNTRY_INFO!C57=0,\" \",COUNTRY_INFO!C57))","v":"Maseyisini"},{"$f":"IF(AND(INTRO!$E$37=\"Non-endemic\",INTRO!$E$41=\"Non-endemic\"),0,COUNTRY_INFO!V57)","v":0},{"$f":"IF(AND(INTRO!$E$37=\"Non-endemic\",INTRO!$E$41=\"Non-endemic\"),0,COUNTRY_INFO!X57)","v":0},{"$f":"IF(INTRO!$E$39=\"Non-endemic\",IF($D57=1,DEC!I57,0),IF($D57=1,IVM!G57,0))","v":0},null,{"$f":"IF(OR(COUNTRY_INFO!N57=\"Unknown\",COUNTRY_INFO!N57=\"Surveillance\",COUNTRY_INFO!N57=\"Not required\",COUNTRY_INFO!N57=0),0,IF(INTRO!$E$39=\"Non-endemic\",IF(AND($E57<>0,$G57=\"\"),IF($F57=0,COUNTRY_INFO!N57*$E57,COUNTRY_INFO!N57*($E57-$D57)),IF(AND($E57<>0,$G57<>0),IF($F57=0,COUNTRY_INFO!N57*$G57,COUNTRY_INFO!N57*($G57-$D57)),0)),IF($G57=\"\",COUNTRY_INFO!N57*$E57,COUNTRY_INFO!N57*$G57)))","v":0},{"$f":"IF(OR(COUNTRY_INFO!O57=\"Unknown\",COUNTRY_INFO!O57=\"Surveillance\",COUNTRY_INFO!O57=\"Not required\",COUNTRY_INFO!O57=0),0,IF($E57<>0, IF($F57=0,COUNTRY_INFO!O57*$E57,COUNTRY_INFO!O57*($E57-$D57)),COUNTRY_INFO!O57*$E57))","v":0},null,{"$f":"IF(OR(COUNTRY_INFO!P57=\"Unknown\",COUNTRY_INFO!P57=\"Surveillance\",COUNTRY_INFO!P57=\"Not required\",COUNTRY_INFO!P57=0),0,IF(AND($E57<>0,$J57=\"\"),IF($F57=0,COUNTRY_INFO!P57*$E57,COUNTRY_INFO!P57*($E57-$D57)), IF(AND($E57<>0,$J57<>0),IF($F57=0,COUNTRY_INFO!P57*$J57,COUNTRY_INFO!P57*($J57-$D57)), COUNTRY_INFO!P57*$J57)))","v":0},0,0,null,0,0,null,0,0,null,0]
[{"$f":"IF(AND(INTRO!$E$37=\"Non-endemic\",INTRO!$E$41=\"Non-endemic\"),\" \",IF(COUNTRY_INFO!A58=0,\" \",COUNTRY_INFO!A58))","v":"Eswatini"},{"$f":"IF(AND(INTRO!$E$37=\"Non-endemic\",INTRO!$E$41=\"Non-endemic\"),\" \",IF(COUNTRY_INFO!B58=0,\" \",COUNTRY_INFO!B58))","v":"SHISELWENI"},{"$f":"IF(AND(INTRO!$E$37=\"Non-endemic\",INTRO!$E$41=\"Non-endemic\"),\" \",IF(COUNTRY_INFO!C58=0,\" \",COUNTRY_INFO!C58))","v":"Matsanjeni South"},{"$f":"IF(AND(INTRO!$E$37=\"Non-endemic\",INTRO!$E$41=\"Non-endemic\"),0,COUNTRY_INFO!V58)","v":0},{"$f":"IF(AND(INTRO!$E$37=\"Non-endemic\",INTRO!$E$41=\"Non-endemic\"),0,COUNTRY_INFO!X58)","v":0},{"$f":"IF(INTRO!$E$39=\"Non-endemic\",IF($D58=1,DEC!I58,0),IF($D58=1,IVM!G58,0))","v":0},null,{"$f":"IF(OR(COUNTRY_INFO!N58=\"Unknown\",COUNTRY_INFO!N58=\"Surveillance\",COUNTRY_INFO!N58=\"Not required\",COUNTRY_INFO!N58=0),0,IF(INTRO!$E$39=\"Non-endemic\",IF(AND($E58<>0,$G58=\"\"),IF($F58=0,COUNTRY_INFO!N58*$E58,COUNTRY_INFO!N58*($E58-$D58)),IF(AND($E58<>0,$G58<>0),IF($F58=0,COUNTRY_INFO!N58*$G58,COUNTRY_INFO!N58*($G58-$D58)),0)),IF($G58=\"\",COUNTRY_INFO!N58*$E58,COUNTRY_INFO!N58*$G58)))","v":0},{"$f":"IF(OR(COUNTRY_INFO!O58=\"Unknown\",COUNTRY_INFO!O58=\"Surveillance\",COUNTRY_INFO!O58=\"Not required\",COUNTRY_INFO!O58=0),0,IF($E58<>0, IF($F58=0,COUNTRY_INFO!O58*$E58,COUNTRY_INFO!O58*($E58-$D58)),COUNTRY_INFO!O58*$E58))","v":0},null,{"$f":"IF(OR(COUNTRY_INFO!P58=\"Unknown\",COUNTRY_INFO!P58=\"Surveillance\",COUNTRY_INFO!P58=\"Not required\",COUNTRY_INFO!P58=0),0,IF(AND($E58<>0,$J58=\"\"),IF($F58=0,COUNTRY_INFO!P58*$E58,COUNTRY_INFO!P58*($E58-$D58)), IF(AND($E58<>0,$J58<>0),IF($F58=0,COUNTRY_INFO!P58*$J58,COUNTRY_INFO!P58*($J58-$D58)), COUNTRY_INFO!P58*$J58)))","v":0},0,0,null,0,0,null,0,0,null,0]
[{"$f":"IF(AND(INTRO!$E$37=\"Non-endemic\",INTRO!$E$41=\"Non-endemic\"),\" \",IF(COUNTRY_INFO!A59=0,\" \",COUNTRY_INFO!A59))","v":"Eswatini"},{"$f":"IF(AND(INTRO!$E$37=\"Non-endemic\",INTRO!$E$41=\"Non-endemic\"),\" \",IF(COUNTRY_INFO!B59=0,\" \",COUNTRY_INFO!B59))","v":"SHISELWENI"},{"$f":"IF(AND(INTRO!$E$37=\"Non-endemic\",INTRO!$E$41=\"Non-endemic\"),\" \",IF(COUNTRY_INFO!C59=0,\" \",COUNTRY_INFO!C59))","v":"Methula"},{"$f":"IF(AND(INTRO!$E$37=\"Non-endemic\",INTRO!$E$41=\"Non-endemic\"),0,COUNTRY_INFO!V59)","v":0},{"$f":"IF(AND(INTRO!$E$37=\"Non-endemic\",INTRO!$E$41=\"Non-endemic\"),0,COUNTRY_INFO!X59)","v":0},{"$f":"IF(INTRO!$E$39=\"Non-endemic\",IF($D59=1,DEC!I59,0),IF($D59=1,IVM!G59,0))","v":0},null,{"$f":"IF(OR(COUNTRY_INFO!N59=\"Unknown\",COUNTRY_INFO!N59=\"Surveillance\",COUNTRY_INFO!N59=\"Not required\",COUNTRY_INFO!N59=0),0,IF(INTRO!$E$39=\"Non-endemic\",IF(AND($E59<>0,$G59=\"\"),IF($F59=0,COUNTRY_INFO!N59*$E59,COUNTRY_INFO!N59*($E59-$D59)),IF(AND($E59<>0,$G59<>0),IF($F59=0,COUNTRY_INFO!N59*$G59,COUNTRY_INFO!N59*($G59-$D59)),0)),IF($G59=\"\",COUNTRY_INFO!N59*$E59,COUNTRY_INFO!N59*$G59)))","v":0},{"$f":"IF(OR(COUNTRY_INFO!O59=\"Unknown\",COUNTRY_INFO!O59=\"Surveillance\",COUNTRY_INFO!O59=\"Not required\",COUNTRY_INFO!O59=0),0,IF($E59<>0, IF($F59=0,COUNTRY_INFO!O59*$E59,COUNTRY_INFO!O59*($E59-$D59)),COUNTRY_INFO!O59*$E59))","v":0},null,{"$f":"IF(OR(COUNTRY_INFO!P59=\"Unknown\",COUNTRY_INFO!P59=\"Surveillance\",COUNTRY_INFO!P59=\"Not required\",COUNTRY_INFO!P59=0),0,IF(AND($E59<>0,$J59=\"\"),IF($F59=0,COUNTRY_INFO!P59*$E59,COUNTRY_INFO!P59*($E59-$D59)), IF(AND($E59<>0,$J59<>0),IF($F59=0,COUNTRY_INFO!P59*$J59,COUNTRY_INFO!P59*($J59-$D59)), COUNTRY_INFO!P59*$J59)))","v":0},0,0,null,0,0,null,0,0,null,0]
[{"$f":"IF(AND(INTRO!$E$37=\"Non-endemic\",INTRO!$E$41=\"Non-endemic\"),\" \",IF(COUNTRY_INFO!A60=0,\" \",COUNTRY_INFO!A60))","v":"Eswatini"},{"$f":"IF(AND(INTRO!$E$37=\"Non-endemic\",INTRO!$E$41=\"Non-endemic\"),\" \",IF(COUNTRY_INFO!B60=0,\" \",COUNTRY_INFO!B60))","v":"SHISELWENI"},{"$f":"IF(AND(INTRO!$E$37=\"Non-endemic\",INTRO!$E$41=\"Non-endemic\"),\" \",IF(COUNTRY_INFO!C60=0,\" \",COUNTRY_INFO!C60))","v":"Mbangweni/Shiselweni 2"},{"$f":"IF(AND(INTRO!$E$37=\"Non-endemic\",INTRO!$E$41=\"Non-endemic\"),0,COUNTRY_INFO!V60)","v":0},{"$f":"IF(AND(INTRO!$E$37=\"Non-endemic\",INTRO!$E$41=\"Non-endemic\"),0,COUNTRY_INFO!X60)","v":0},{"$f":"IF(INTRO!$E$39=\"Non-endemic\",IF($D60=1,DEC!I60,0),IF($D60=1,IVM!G60,0))","v":0},null,{"$f":"IF(OR(COUNTRY_INFO!N60=\"Unknown\",COUNTRY_INFO!N60=\"Surveillance\",COUNTRY_INFO!N60=\"Not required\",COUNTRY_INFO!N60=0),0,IF(INTRO!$E$39=\"Non-endemic\",IF(AND($E60<>0,$G60=\"\"),IF($F60=0,COUNTRY_INFO!N60*$E60,COUNTRY_INFO!N60*($E60-$D60)),IF(AND($E60<>0,$G60<>0),IF($F60=0,COUNTRY_INFO!N60*$G60,COUNTRY_INFO!N60*($G60-$D60)),0)),IF($G60=\"\",COUNTRY_INFO!N60*$E60,COUNTRY_INFO!N60*$G60)))","v":0},{"$f":"IF(OR(COUNTRY_INFO!O60=\"Unknown\",COUNTRY_INFO!O60=\"Surveillance\",COUNTRY_INFO!O60=\"Not required\",COUNTRY_INFO!O60=0),0,IF($E60<>0, IF($F60=0,COUNTRY_INFO!O60*$E60,COUNTRY_INFO!O60*($E60-$D60)),COUNTRY_INFO!O60*$E60))","v":0},null,{"$f":"IF(OR(COUNTRY_INFO!P60=\"Unknown\",COUNTRY_INFO!P60=\"Surveillance\",COUNTRY_INFO!P60=\"Not required\",COUNTRY_INFO!P60=0),0,IF(AND($E60<>0,$J60=\"\"),IF($F60=0,COUNTRY_INFO!P60*$E60,COUNTRY_INFO!P60*($E60-$D60)), IF(AND($E60<>0,$J60<>0),IF($F60=0,COUNTRY_INFO!P60*$J60,COUNTRY_INFO!P60*($J60-$D60)), COUNTRY_INFO!P60*$J60)))","v":0},0,0,null,0,0,null,0,0,null,0]
[{"$f":"IF(AND(INTRO!$E$37=\"Non-endemic\",INTRO!$E$41=\"Non-endemic\"),\" \",IF(COUNTRY_INFO!A61=0,\" \",COUNTRY_INFO!A61))","v":"Eswatini"},{"$f":"IF(AND(INTRO!$E$37=\"Non-endemic\",INTRO!$E$41=\"Non-endemic\"),\" \",IF(COUNTRY_INFO!B61=0,\" \",COUNTRY_INFO!B61))","v":"SHISELWENI"},{"$f":"IF(AND(INTRO!$E$37=\"Non-endemic\",INTRO!$E$41=\"Non-endemic\"),\" \",IF(COUNTRY_INFO!C61=0,\" \",COUNTRY_INFO!C61))","v":"Mtsambama"},{"$f":"IF(AND(INTRO!$E$37=\"Non-endemic\",INTRO!$E$41=\"Non-endemic\"),0,COUNTRY_INFO!V61)","v":0},{"$f":"IF(AND(INTRO!$E$37=\"Non-endemic\",INTRO!$E$41=\"Non-endemic\"),0,COUNTRY_INFO!X61)","v":0},{"$f":"IF(INTRO!$E$39=\"Non-endemic\",IF($D61=1,DEC!I61,0),IF($D61=1,IVM!G61,0))","v":0},null,{"$f":"IF(OR(COUNTRY_INFO!N61=\"Unknown\",COUNTRY_INFO!N61=\"Surveillance\",COUNTRY_INFO!N61=\"Not required\",COUNTRY_INFO!N61=0),0,IF(INTRO!$E$39=\"Non-endemic\",IF(AND($E61<>0,$G61=\"\"),IF($F61=0,COUNTRY_INFO!N61*$E61,COUNTRY_INFO!N61*($E61-$D61)),IF(AND($E61<>0,$G61<>0),IF($F61=0,COUNTRY_INFO!N61*$G61,COUNTRY_INFO!N61*($G61-$D61)),0)),IF($G61=\"\",COUNTRY_INFO!N61*$E61,COUNTRY_INFO!N61*$G61)))","v":0},{"$f":"IF(OR(COUNTRY_INFO!O61=\"Unknown\",COUNTRY_INFO!O61=\"Surveillance\",COUNTRY_INFO!O61=\"Not required\",COUNTRY_INFO!O61=0),0,IF($E61<>0, IF($F61=0,COUNTRY_INFO!O61*$E61,COUNTRY_INFO!O61*($E61-$D61)),COUNTRY_INFO!O61*$E61))","v":0},null,{"$f":"IF(OR(COUNTRY_INFO!P61=\"Unknown\",COUNTRY_INFO!P61=\"Surveillance\",COUNTRY_INFO!P61=\"Not required\",COUNTRY_INFO!P61=0),0,IF(AND($E61<>0,$J61=\"\"),IF($F61=0,COUNTRY_INFO!P61*$E61,COUNTRY_INFO!P61*($E61-$D61)), IF(AND($E61<>0,$J61<>0),IF($F61=0,COUNTRY_INFO!P61*$J61,COUNTRY_INFO!P61*($J61-$D61)), COUNTRY_INFO!P61*$J61)))","v":0},0,0,null,0,0,null,0,0,null,0]
[{"$f":"IF(AND(INTRO!$E$37=\"Non-endemic\",INTRO!$E$41=\"Non-endemic\"),\" \",IF(COUNTRY_INFO!A62=0,\" \",COUNTRY_INFO!A62))","v":"Eswatini"},{"$f":"IF(AND(INTRO!$E$37=\"Non-endemic\",INTRO!$E$41=\"Non-endemic\"),\" \",IF(COUNTRY_INFO!B62=0,\" \",COUNTRY_INFO!B62))","v":"SHISELWENI"},{"$f":"IF(AND(INTRO!$E$37=\"Non-endemic\",INTRO!$E$41=\"Non-endemic\"),\" \",IF(COUNTRY_INFO!C62=0,\" \",COUNTRY_INFO!C62))","v":"Ngudzeni"},{"$f":"IF(AND(INTRO!$E$37=\"Non-endemic\",INTRO!$E$41=\"Non-endemic\"),0,COUNTRY_INFO!V62)","v":0},{"$f":"IF(AND(INTRO!$E$37=\"Non-endemic\",INTRO!$E$41=\"Non-endemic\"),0,COUNTRY_INFO!X62)","v":0},{"$f":"IF(INTRO!$E$39=\"Non-endemic\",IF($D62=1,DEC!I62,0),IF($D62=1,IVM!G62,0))","v":0},null,{"$f":"IF(OR(COUNTRY_INFO!N62=\"Unknown\",COUNTRY_INFO!N62=\"Surveillance\",COUNTRY_INFO!N62=\"Not required\",COUNTRY_INFO!N62=0),0,IF(INTRO!$E$39=\"Non-endemic\",IF(AND($E62<>0,$G62=\"\"),IF($F62=0,COUNTRY_INFO!N62*$E62,COUNTRY_INFO!N62*($E62-$D62)),IF(AND($E62<>0,$G62<>0),IF($F62=0,COUNTRY_INFO!N62*$G62,COUNTRY_INFO!N62*($G62-$D62)),0)),IF($G62=\"\",COUNTRY_INFO!N62*$E62,COUNTRY_INFO!N62*$G62)))","v":0},{"$f":"IF(OR(COUNTRY_INFO!O62=\"Unknown\",COUNTRY_INFO!O62=\"Surveillance\",COUNTRY_INFO!O62=\"Not required\",COUNTRY_INFO!O62=0),0,IF($E62<>0, IF($F62=0,COUNTRY_INFO!O62*$E62,COUNTRY_INFO!O62*($E62-$D62)),COUNTRY_INFO!O62*$E62))","v":0},null,{"$f":"IF(OR(COUNTRY_INFO!P62=\"Unknown\",COUNTRY_INFO!P62=\"Surveillance\",COUNTRY_INFO!P62=\"Not required\",COUNTRY_INFO!P62=0),0,IF(AND($E62<>0,$J62=\"\"),IF($F62=0,COUNTRY_INFO!P62*$E62,COUNTRY_INFO!P62*($E62-$D62)), IF(AND($E62<>0,$J62<>0),IF($F62=0,COUNTRY_INFO!P62*$J62,COUNTRY_INFO!P62*($J62-$D62)), COUNTRY_INFO!P62*$J62)))","v":0},0,0,null,0,0,null,0,0,null,0]
[{"$f":"IF(AND(INTRO!$E$37=\"Non-endemic\",INTRO!$E$41=\"Non-endemic\"),\" \",IF(COUNTRY_INFO!A63=0,\" \",COUNTRY_INFO!A63))","v":"Eswatini"},{"$f":"IF(AND(INTRO!$E$37=\"Non-endemic\",INTRO!$E$41=\"Non-endemic\"),\" \",IF(COUNTRY_INFO!B63=0,\" \",COUNTRY_INFO!B63))","v":"SHISELWENI"},{"$f":"IF(AND(INTRO!$E$37=\"Non-endemic\",INTRO!$E$41=\"Non-endemic\"),\" \",IF(COUNTRY_INFO!C63=0,\" \",COUNTRY_INFO!C63))","v":"Nkwene"},{"$f":"IF(AND(INTRO!$E$37=\"Non-endemic\",INTRO!$E$41=\"Non-endemic\"),0,COUNTRY_INFO!V63)","v":0},{"$f":"IF(AND(INTRO!$E$37=\"Non-endemic\",INTRO!$E$41=\"Non-endemic\"),0,COUNTRY_INFO!X63)","v":0},{"$f":"IF(INTRO!$E$39=\"Non-endemic\",IF($D63=1,DEC!I63,0),IF($D63=1,IVM!G63,0))","v":0},null,{"$f":"IF(OR(COUNTRY_INFO!N63=\"Unknown\",COUNTRY_INFO!N63=\"Surveillance\",COUNTRY_INFO!N63=\"Not required\",COUNTRY_INFO!N63=0),0,IF(INTRO!$E$39=\"Non-endemic\",IF(AND($E63<>0,$G63=\"\"),IF($F63=0,COUNTRY_INFO!N63*$E63,COUNTRY_INFO!N63*($E63-$D63)),IF(AND($E63<>0,$G63<>0),IF($F63=0,COUNTRY_INFO!N63*$G63,COUNTRY_INFO!N63*($G63-$D63)),0)),IF($G63=\"\",COUNTRY_INFO!N63*$E63,COUNTRY_INFO!N63*$G63)))","v":0},{"$f":"IF(OR(COUNTRY_INFO!O63=\"Unknown\",COUNTRY_INFO!O63=\"Surveillance\",COUNTRY_INFO!O63=\"Not required\",COUNTRY_INFO!O63=0),0,IF($E63<>0, IF($F63=0,COUNTRY_INFO!O63*$E63,COUNTRY_INFO!O63*($E63-$D63)),COUNTRY_INFO!O63*$E63))","v":0},null,{"$f":"IF(OR(COUNTRY_INFO!P63=\"Unknown\",COUNTRY_INFO!P63=\"Surveillance\",COUNTRY_INFO!P63=\"Not required\",COUNTRY_INFO!P63=0),0,IF(AND($E63<>0,$J63=\"\"),IF($F63=0,COUNTRY_INFO!P63*$E63,COUNTRY_INFO!P63*($E63-$D63)), IF(AND($E63<>0,$J63<>0),IF($F63=0,COUNTRY_INFO!P63*$J63,COUNTRY_INFO!P63*($J63-$D63)), COUNTRY_INFO!P63*$J63)))","v":0},0,0,null,0,0,null,0,0,null,0]
[{"$f":"IF(AND(INTRO!$E$37=\"Non-endemic\",INTRO!$E$41=\"Non-endemic\"),\" \",IF(COUNTRY_INFO!A64=0,\" \",COUNTRY_INFO!A64))","v":"Eswatini"},{"$f":"IF(AND(INTRO!$E$37=\"Non-endemic\",INTRO!$E$41=\"Non-endemic\"),\" \",IF(COUNTRY_INFO!B64=0,\" \",COUNTRY_INFO!B64))","v":"SHISELWENI"},{"$f":"IF(AND(INTRO!$E$37=\"Non-endemic\",INTRO!$E$41=\"Non-endemic\"),\" \",IF(COUNTRY_INFO!C64=0,\" \",COUNTRY_INFO!C64))","v":"Sandleni"},{"$f":"IF(AND(INTRO!$E$37=\"Non-endemic\",INTRO!$E$41=\"Non-endemic\"),0,COUNTRY_INFO!V64)","v":0},{"$f":"IF(AND(INTRO!$E$37=\"Non-endemic\",INTRO!$E$41=\"Non-endemic\"),0,COUNTRY_INFO!X64)","v":0},{"$f":"IF(INTRO!$E$39=\"Non-endemic\",IF($D64=1,DEC!I64,0),IF($D64=1,IVM!G64,0))","v":0},null,{"$f":"IF(OR(COUNTRY_INFO!N64=\"Unknown\",COUNTRY_INFO!N64=\"Surveillance\",COUNTRY_INFO!N64=\"Not required\",COUNTRY_INFO!N64=0),0,IF(INTRO!$E$39=\"Non-endemic\",IF(AND($E64<>0,$G64=\"\"),IF($F64=0,COUNTRY_INFO!N64*$E64,COUNTRY_INFO!N64*($E64-$D64)),IF(AND($E64<>0,$G64<>0),IF($F64=0,COUNTRY_INFO!N64*$G64,COUNTRY_INFO!N64*($G64-$D64)),0)),IF($G64=\"\",COUNTRY_INFO!N64*$E64,COUNTRY_INFO!N64*$G64)))","v":0},{"$f":"IF(OR(COUNTRY_INFO!O64=\"Unknown\",COUNTRY_INFO!O64=\"Surveillance\",COUNTRY_INFO!O64=\"Not required\",COUNTRY_INFO!O64=0),0,IF($E64<>0, IF($F64=0,COUNTRY_INFO!O64*$E64,COUNTRY_INFO!O64*($E64-$D64)),COUNTRY_INFO!O64*$E64))","v":0},null,{"$f":"IF(OR(COUNTRY_INFO!P64=\"Unknown\",COUNTRY_INFO!P64=\"Surveillance\",COUNTRY_INFO!P64=\"Not required\",COUNTRY_INFO!P64=0),0,IF(AND($E64<>0,$J64=\"\"),IF($F64=0,COUNTRY_INFO!P64*$E64,COUNTRY_INFO!P64*($E64-$D64)), IF(AND($E64<>0,$J64<>0),IF($F64=0,COUNTRY_INFO!P64*$J64,COUNTRY_INFO!P64*($J64-$D64)), COUNTRY_INFO!P64*$J64)))","v":0},0,0,null,0,0,null,0,0,null,0]
[{"$f":"IF(AND(INTRO!$E$37=\"Non-endemic\",INTRO!$E$41=\"Non-endemic\"),\" \",IF(COUNTRY_INFO!A65=0,\" \",COUNTRY_INFO!A65))","v":"Eswatini"},{"$f":"IF(AND(INTRO!$E$37=\"Non-endemic\",INTRO!$E$41=\"Non-endemic\"),\" \",IF(COUNTRY_INFO!B65=0,\" \",COUNTRY_INFO!B65))","v":"SHISELWENI"},{"$f":"IF(AND(INTRO!$E$37=\"Non-endemic\",INTRO!$E$41=\"Non-endemic\"),\" \",IF(COUNTRY_INFO!C65=0,\" \",COUNTRY_INFO!C65))","v":"Shiselweni 1"},{"$f":"IF(AND(INTRO!$E$37=\"Non-endemic\",INTRO!$E$41=\"Non-endemic\"),0,COUNTRY_INFO!V65)","v":0},{"$f":"IF(AND(INTRO!$E$37=\"Non-endemic\",INTRO!$E$41=\"Non-endemic\"),0,COUNTRY_INFO!X65)","v":0},{"$f":"IF(INTRO!$E$39=\"Non-endemic\",IF($D65=1,DEC!I65,0),IF($D65=1,IVM!G65,0))","v":0},null,{"$f":"IF(OR(COUNTRY_INFO!N65=\"Unknown\",COUNTRY_INFO!N65=\"Surveillance\",COUNTRY_INFO!N65=\"Not required\",COUNTRY_INFO!N65=0),0,IF(INTRO!$E$39=\"Non-endemic\",IF(AND($E65<>0,$G65=\"\"),IF($F65=0,COUNTRY_INFO!N65*$E65,COUNTRY_INFO!N65*($E65-$D65)),IF(AND($E65<>0,$G65<>0),IF($F65=0,COUNTRY_INFO!N65*$G65,COUNTRY_INFO!N65*($G65-$D65)),0)),IF($G65=\"\",COUNTRY_INFO!N65*$E65,COUNTRY_INFO!N65*$G65)))","v":0},{"$f":"IF(OR(COUNTRY_INFO!O65=\"Unknown\",COUNTRY_INFO!O65=\"Surveillance\",COUNTRY_INFO!O65=\"Not required\",COUNTRY_INFO!O65=0),0,IF($E65<>0, IF($F65=0,COUNTRY_INFO!O65*$E65,COUNTRY_INFO!O65*($E65-$D65)),COUNTRY_INFO!O65*$E65))","v":0},null,{"$f":"IF(OR(COUNTRY_INFO!P65=\"Unknown\",COUNTRY_INFO!P65=\"Surveillance\",COUNTRY_INFO!P65=\"Not required\",COUNTRY_INFO!P65=0),0,IF(AND($E65<>0,$J65=\"\"),IF($F65=0,COUNTRY_INFO!P65*$E65,COUNTRY_INFO!P65*($E65-$D65)), IF(AND($E65<>0,$J65<>0),IF($F65=0,COUNTRY_INFO!P65*$J65,COUNTRY_INFO!P65*($J65-$D65)), COUNTRY_INFO!P65*$J65)))","v":0},0,0,null,0,0,null,0,0,null,0]
[{"$f":"IF(AND(INTRO!$E$37=\"Non-endemic\",INTRO!$E$41=\"Non-endemic\"),\" \",IF(COUNTRY_INFO!A66=0,\" \",COUNTRY_INFO!A66))","v":"Eswatini"},{"$f":"IF(AND(INTRO!$E$37=\"Non-endemic\",INTRO!$E$41=\"Non-endemic\"),\" \",IF(COUNTRY_INFO!B66=0,\" \",COUNTRY_INFO!B66))","v":"SHISELWENI"},{"$f":"IF(AND(INTRO!$E$37=\"Non-endemic\",INTRO!$E$41=\"Non-endemic\"),\" \",IF(COUNTRY_INFO!C66=0,\" \",COUNTRY_INFO!C66))","v":"Sigwe"},{"$f":"IF(AND(INTRO!$E$37=\"Non-endemic\",INTRO!$E$41=\"Non-endemic\"),0,COUNTRY_INFO!V66)","v":0},{"$f":"IF(AND(INTRO!$E$37=\"Non-endemic\",INTRO!$E$41=\"Non-endemic\"),0,COUNTRY_INFO!X66)","v":0},{"$f":"IF(INTRO!$E$39=\"Non-endemic\",IF($D66=1,DEC!I66,0),IF($D66=1,IVM!G66,0))","v":0},null,{"$f":"IF(OR(COUNTRY_INFO!N66=\"Unknown\",COUNTRY_INFO!N66=\"Surveillance\",COUNTRY_INFO!N66=\"Not required\",COUNTRY_INFO!N66=0),0,IF(INTRO!$E$39=\"Non-endemic\",IF(AND($E66<>0,$G66=\"\"),IF($F66=0,COUNTRY_INFO!N66*$E66,COUNTRY_INFO!N66*($E66-$D66)),IF(AND($E66<>0,$G66<>0),IF($F66=0,COUNTRY_INFO!N66*$G66,COUNTRY_INFO!N66*($G66-$D66)),0)),IF($G66=\"\",COUNTRY_INFO!N66*$E66,COUNTRY_INFO!N66*$G66)))","v":0},{"$f":"IF(OR(COUNTRY_INFO!O66=\"Unknown\",COUNTRY_INFO!O66=\"Surveillance\",COUNTRY_INFO!O66=\"Not required\",COUNTRY_INFO!O66=0),0,IF($E66<>0, IF($F66=0,COUNTRY_INFO!O66*$E66,COUNTRY_INFO!O66*($E66-$D66)),COUNTRY_INFO!O66*$E66))","v":0},null,{"$f":"IF(OR(COUNTRY_INFO!P66=\"Unknown\",COUNTRY_INFO!P66=\"Surveillance\",COUNTRY_INFO!P66=\"Not required\",COUNTRY_INFO!P66=0),0,IF(AND($E66<>0,$J66=\"\"),IF($F66=0,COUNTRY_INFO!P66*$E66,COUNTRY_INFO!P66*($E66-$D66)), IF(AND($E66<>0,$J66<>0),IF($F66=0,COUNTRY_INFO!P66*$J66,COUNTRY_INFO!P66*($J66-$D66)), COUNTRY_INFO!P66*$J66)))","v":0},0,0,null,0,0,null,0,0,null,0]
[{"$f":"IF(AND(INTRO!$E$37=\"Non-endemic\",INTRO!$E$41=\"Non-endemic\"),\" \",IF(COUNTRY_INFO!A67=0,\" \",COUNTRY_INFO!A67))","v":"Eswatini"},{"$f":"IF(AND(INTRO!$E$37=\"Non-endemic\",INTRO!$E$41=\"Non-endemic\"),\" \",IF(COUNTRY_INFO!B67=0,\" \",COUNTRY_INFO!B67))","v":"SHISELWENI"},{"$f":"IF(AND(INTRO!$E$37=\"Non-endemic\",INTRO!$E$41=\"Non-endemic\"),\" \",IF(COUNTRY_INFO!C67=0,\" \",COUNTRY_INFO!C67))","v":"Somntongo"},{"$f":"IF(AND(INTRO!$E$37=\"Non-endemic\",INTRO!$E$41=\"Non-endemic\"),0,COUNTRY_INFO!V67)","v":0},{"$f":"IF(AND(INTRO!$E$37=\"Non-endemic\",INTRO!$E$41=\"Non-endemic\"),0,COUNTRY_INFO!X67)","v":0},{"$f":"IF(INTRO!$E$39=\"Non-endemic\",IF($D67=1,DEC!I67,0),IF($D67=1,IVM!G67,0))","v":0},null,{"$f":"IF(OR(COUNTRY_INFO!N67=\"Unknown\",COUNTRY_INFO!N67=\"Surveillance\",COUNTRY_INFO!N67=\"Not required\",COUNTRY_INFO!N67=0),0,IF(INTRO!$E$39=\"Non-endemic\",IF(AND($E67<>0,$G67=\"\"),IF($F67=0,COUNTRY_INFO!N67*$E67,COUNTRY_INFO!N67*($E67-$D67)),IF(AND($E67<>0,$G67<>0),IF($F67=0,COUNTRY_INFO!N67*$G67,COUNTRY_INFO!N67*($G67-$D67)),0)),IF($G67=\"\",COUNTRY_INFO!N67*$E67,COUNTRY_INFO!N67*$G67)))","v":0},{"$f":"IF(OR(COUNTRY_INFO!O67=\"Unknown\",COUNTRY_INFO!O67=\"Surveillance\",COUNTRY_INFO!O67=\"Not required\",COUNTRY_INFO!O67=0),0,IF($E67<>0, IF($F67=0,COUNTRY_INFO!O67*$E67,COUNTRY_INFO!O67*($E67-$D67)),COUNTRY_INFO!O67*$E67))","v":0},null,{"$f":"IF(OR(COUNTRY_INFO!P67=\"Unknown\",COUNTRY_INFO!P67=\"Surveillance\",COUNTRY_INFO!P67=\"Not required\",COUNTRY_INFO!P67=0),0,IF(AND($E67<>0,$J67=\"\"),IF($F67=0,COUNTRY_INFO!P67*$E67,COUNTRY_INFO!P67*($E67-$D67)), IF(AND($E67<>0,$J67<>0),IF($F67=0,COUNTRY_INFO!P67*$J67,COUNTRY_INFO!P67*($J67-$D67)), COUNTRY_INFO!P67*$J67)))","v":0},0,0,null,0,0,null,0,0,null,0]
[{"$f":"IF(AND(INTRO!$E$37=\"Non-endemic\",INTRO!$E$41=\"Non-endemic\"),\" \",IF(COUNTRY_INFO!A68=0,\" \",COUNTRY_INFO!A68))","v":"Eswatini"},{"$f":"IF(AND(INTRO!$E$37=\"Non-endemic\",INTRO!$E$41=\"Non-endemic\"),\" \",IF(COUNTRY_INFO!B68=0,\" \",COUNTRY_INFO!B68))","v":"SHISELWENI"},{"$f":"IF(AND(INTRO!$E$37=\"Non-endemic\",INTRO!$E$41=\"Non-endemic\"),\" \",IF(COUNTRY_INFO!C68=0,\" \",COUNTRY_INFO!C68))","v":"Zombodze Emuva"},{"$f":"IF(AND(INTRO!$E$37=\"Non-endemic\",INTRO!$E$41=\"Non-endemic\"),0,COUNTRY_INFO!V68)","v":0},{"$f":"IF(AND(INTRO!$E$37=\"Non-endemic\",INTRO!$E$41=\"Non-endemic\"),0,COUNTRY_INFO!X68)","v":0},{"$f":"IF(INTRO!$E$39=\"Non-endemic\",IF($D68=1,DEC!I68,0),IF($D68=1,IVM!G68,0))","v":0},null,{"$f":"IF(OR(COUNTRY_INFO!N68=\"Unknown\",COUNTRY_INFO!N68=\"Surveillance\",COUNTRY_INFO!N68=\"Not required\",COUNTRY_INFO!N68=0),0,IF(INTRO!$E$39=\"Non-endemic\",IF(AND($E68<>0,$G68=\"\"),IF($F68=0,COUNTRY_INFO!N68*$E68,COUNTRY_INFO!N68*($E68-$D68)),IF(AND($E68<>0,$G68<>0),IF($F68=0,COUNTRY_INFO!N68*$G68,COUNTRY_INFO!N68*($G68-$D68)),0)),IF($G68=\"\",COUNTRY_INFO!N68*$E68,COUNTRY_INFO!N68*$G68)))","v":0},{"$f":"IF(OR(COUNTRY_INFO!O68=\"Unknown\",COUNTRY_INFO!O68=\"Surveillance\",COUNTRY_INFO!O68=\"Not required\",COUNTRY_INFO!O68=0),0,IF($E68<>0, IF($F68=0,COUNTRY_INFO!O68*$E68,COUNTRY_INFO!O68*($E68-$D68)),COUNTRY_INFO!O68*$E68))","v":0},null,{"$f":"IF(OR(COUNTRY_INFO!P68=\"Unknown\",COUNTRY_INFO!P68=\"Surveillance\",COUNTRY_INFO!P68=\"Not required\",COUNTRY_INFO!P68=0),0,IF(AND($E68<>0,$J68=\"\"),IF($F68=0,COUNTRY_INFO!P68*$E68,COUNTRY_INFO!P68*($E68-$D68)), IF(AND($E68<>0,$J68<>0),IF($F68=0,COUNTRY_INFO!P68*$J68,COUNTRY_INFO!P68*($J68-$D68)), COUNTRY_INFO!P68*$J68)))","v":0},0,0,null,0,0,null,0,0,null,0]

{"sheet":"PZQ","index":4,"n_rows":68,"n_cols":18,"rows_kept":68,"cut":false,"hidden":false,"merged":[[3,0,3,2],[5,0,5,2],[5,4,5,7],[5,8,5,9],[6,17,7,17],[6,6,7,6],[6,7,7,7],[6,9,7,9],[6,0,7,0],[6,1,7,1],[6,2,7,2],[6,4,7,4],[5,3,7,3],[6,5,7,5],[6,8,7,8],[6,12,7,12],[5,12,5,17],[5,10,5,11],[6,10,7,10],[6,14,7,14],[6,15,7,15],[6,16,7,16],[6,13,7,13],[6,11,7,11]]}
["Praziquantel (PZQ)"]
["Administrative structure, eligible population by age group, treatment plan and information about tablets"]
[]
["TOTAL",null,null,null,{"$f":"SUBTOTAL(9,E$10:E$1010)","v":64071},211782,591042,866895,null,0,null,null,{"$f":"SUBTOTAL(9,M$10:M$1010)","v":0},423564,1773126,2196690,0,2196690]
[]
["Country administrative structure",null,null,"Treatment plan\nSCH","Target population for SCH",null,null,null,"Hot spots",null,"Previous year MDA",null,"Praziquantel (PZQ)"]
["Country","Province/State","District",null,"PreSAC","SAC","Adults","Total","Planned","Population","Rounds","Age groups","PreSAC","SAC","Adults","Total required","Remaining in stock","Tablets to be procured"]
[]
[]
[{"$f":"IF(INTRO!$E$43=\"Non-endemic\",\" \", IF(COUNTRY_INFO!A10=0,\" \",COUNTRY_INFO!A10))","v":"Eswatini"},{"$f":"IF(INTRO!$E$43=\"Non-endemic\",\" \", IF(COUNTRY_INFO!B10=0,\" \",COUNTRY_INFO!B10))","v":"HHOHHO"},{"$f":"IF(INTRO!$E$43=\"Non-endemic\",\" \", IF(COUNTRY_INFO!C10=0,\" \",COUNTRY_INFO!C10))","v":"Hhukwini"},{"$f":"IF(INTRO!$E$43=\"Non-endemic\", \"Not required\", COUNTRY_INFO!Y10)","v":0},{"$f":"IF(OR(COUNTRY_INFO!R10=\"Unknown\",COUNTRY_INFO!R10=\"Surveillance\",COUNTRY_INFO!R10=\"Not required\",COUNTRY_INFO!R10=0),0,IF($D10<>0, COUNTRY_INFO!R10,0))","v":0},{"$f":"IF(OR(COUNTRY_INFO!S10=\"Unknown\",COUNTRY_INFO!S10=\"Surveillance\",COUNTRY_INFO!S10=\"Not required\",COUNTRY_INFO!S10=0),0,IF($D10<>0, COUNTRY_INFO!S10,0))","v":0},{"$f":"IF(OR(COUNTRY_INFO!T10=\"Unknown\",COUNTRY_INFO!T10=\"Surveillance\",COUNTRY_INFO!T10=\"Not required\",COUNTRY_INFO!T10=0),0,IF($D10<>0, COUNTRY_INFO!T10,0))","v":0},{"$f":"SUM(E10:G10)","v":0},null,null,null,null,null,{"$f":"IF($I10<>\"Yes\",$F10*2,($F10+ROUND(J10*$F10/SUM(COUNTRY_INFO!$E10:$G10),0))*2)","v":0},{"$f":"IF($I10<>\"Yes\",$G10*3,($G10+ROUND(J10*$G10/SUM(COUNTRY_INFO!$E10:$G10),0))*3)","v":0},{"$f":"SUM(M10:O10)","v":0},null,{"$f":"IF($P10>$Q10,P10-Q10,0)","v":0}]
[{"$f":"IF(INTRO!$E$43=\"Non-endemic\",\" \", IF(COUNTRY_INFO!A11=0,\" \",COUNTRY_INFO!A11))","v":"Eswatini"},{"$f":"IF(INTRO!$E$43=\"Non-endemic\",\" \", IF(COUNTRY_INFO!B11=0,\" \",COUNTRY_INFO!B11))","v":"HHOHHO"},{"$f":"IF(INTRO!$E$43=\"Non-endemic\",\" \", IF(COUNTRY_INFO!C11=0,\" \",COUNTRY_INFO!C11))","v":"Lobamba"},{"$f":"IF(INTRO!$E$43=\"Non-endemic\", \"Not required\", COUNTRY_INFO!Y11)","v":0},{"$f":"IF(OR(COUNTRY_INFO!R11=\"Unknown\",COUNTRY_INFO!R11=\"Surveillance\",COUNTRY_INFO!R11=\"Not required\",COUNTRY_INFO!R11=0),0,IF($D11<>0, COUNTRY_INFO!R11,0))","v":0},{"$f":"IF(OR(COUNTRY_INFO!S11=\"Unknown\",COUNTRY_INFO!S11=\"Surveillance\",COUNTRY_INFO!S11=\"Not required\",COUNTRY_INFO!S11=0),0,IF($D11<>0, COUNTRY_INFO!S11,0))","v":0},{"$f":"IF(OR(COUNTRY_INFO!T11=\"Unknown\",COUNTRY_INFO!T11=\"Surveillance\",COUNTRY_INFO!T11=\"Not required\",COUNTRY_INFO!T11=0),0,IF($D11<>0, COUNTRY_INFO!T11,0))","v":0},{"$f":"SUM(E11:G11)","v":0},null,null,null,null,null,{"$f":"IF($I11<>\"Yes\",$F11*2,($F11+ROUND(J11*$F11/SUM(COUNTRY_INFO!$E11:$G11),0))*2)","v":0},{"$f":"IF($I11<>\"Yes\",$G11*3,($G11+ROUND(J11*$G11/SUM(COUNTRY_INFO!$E11:$G11),0))*3)","v":0},{"$f":"SUM(M11:O11)","v":0},null,{"$f":"IF($P11>$Q11,P11-Q11,0)","v":0}]
[{"$f":"IF(INTRO!$E$43=\"Non-endemic\",\" \", IF(COUNTRY_INFO!A12=0,\" \",COUNTRY_INFO!A12))","v":"Eswatini"},{"$f":"IF(INTRO!$E$43=\"Non-endemic\",\" \", IF(COUNTRY_INFO!B12=0,\" \",COUNTRY_INFO!B12))","v":"HHOHHO"},{"$f":"IF(INTRO!$E$43=\"Non-endemic\",\" \", IF(COUNTRY_INFO!C12=0,\" \",COUNTRY_INFO!C12))","v":"Madlangempisi"},{"$f":"IF(INTRO!$E$43=\"Non-endemic\", \"Not required\", COUNTRY_INFO!Y12)","v":1},{"$f":"IF(OR(COUNTRY_INFO!R12=\"Unknown\",COUNTRY_INFO!R12=\"Surveillance\",COUNTRY_INFO!R12=\"Not required\",COUNTRY_INFO!R12=0),0,IF($D12<>0, COUNTRY_INFO!R12,0))","v":1757},{"$f":"IF(OR(COUNTRY_INFO!S12=\"Unknown\",COUNTRY_INFO!S12=\"Surveillance\",COUNTRY_INFO!S12=\"Not required\",COUNTRY_INFO!S12=0),0,IF($D12<>0, COUNTRY_INFO!S12,0))","v":5809},{"$f":"IF(OR(COUNTRY_INFO!T12=\"Unknown\",COUNTRY_INFO!T12=\"Surveillance\",COUNTRY_INFO!T12=\"Not required\",COUNTRY_INFO!T12=0),0,IF($D12<>0, COUNTRY_INFO!T12,0))","v":16211},23777,null,null,null,null,null,{"$f":"IF($I12<>\"Yes\",$F12*2,($F12+ROUND(J12*$F12/SUM(COUNTRY_INFO!$E12:$G12),0))*2)","v":11618},{"$f":"IF($I12<>\"Yes\",$G12*3,($G12+ROUND(J12*$G12/SUM(COUNTRY_INFO!$E12:$G12),0))*3)","v":48633},60251,null,60251]
[{"$f":"IF(INTRO!$E$43=\"Non-endemic\",\" \", IF(COUNTRY_INFO!A13=0,\" \",COUNTRY_INFO!A13))","v":"Eswatini"},{"$f":"IF(INTRO!$E$43=\"Non-endemic\",\" \", IF(COUNTRY_INFO!B13=0,\" \",COUNTRY_INFO!B13))","v":"HHOHHO"},{"$f":"IF(INTRO!$E$43=\"Non-endemic\",\" \", IF(COUNTRY_INFO!C13=0,\" \",COUNTRY_INFO!C13))","v":"Maphalaleni"},{"$f":"IF(INTRO!$E$43=\"Non-endemic\", \"Not required\", COUNTRY_INFO!Y13)","v":1},{"$f":"IF(OR(COUNTRY_INFO!R13=\"Unknown\",COUNTRY_INFO!R13=\"Surveillance\",COUNTRY_INFO!R13=\"Not required\",COUNTRY_INFO!R13=0),0,IF($D13<>0, COUNTRY_INFO!R13,0))","v":1449},{"$f":"IF(OR(COUNTRY_INFO!S13=\"Unknown\",COUNTRY_INFO!S13=\"Surveillance\",COUNTRY_INFO!S13=\"Not required\",COUNTRY_INFO!S13=0),0,IF($D13<>0, COUNTRY_INFO!S13,0))","v":4791},{"$f":"IF(OR(COUNTRY_INFO!T13=\"Unknown\",COUNTRY_INFO!T13=\"Surveillance\",COUNTRY_INFO!T13=\"Not required\",COUNTRY_INFO!T13=0),0,IF($D13<>0, COUNTRY_INFO!T13,0))","v":13371},19611,"Yes",null,null,null,null,{"$f":"IF($I13<>\"Yes\",$F13*2,($F13+ROUND(J13*$F13/SUM(COUNTRY_INFO!$E13:$G13),0))*2)","v":9582},{"$f":"IF($I13<>\"Yes\",$G13*3,($G13+ROUND(J13*$G13/SUM(COUNTRY_INFO!$E13:$G13),0))*3)","v":40113},49695,null,49695]
[{"$f":"IF(INTRO!$E$43=\"Non-endemic\",\" \", IF(COUNTRY_INFO!A14=0,\" \",COUNTRY_INFO!A14))","v":"Eswatini"},{"$f":"IF(INTRO!$E$43=\"Non-endemic\",\" \", IF(COUNTRY_INFO!B14=0,\" \",COUNTRY_INFO!B14))","v":"HHOHHO"},{"$f":"IF(INTRO!$E$43=\"Non-endemic\",\" \", IF(COUNTRY_INFO!C14=0,\" \",COUNTRY_INFO!C14))","v":"Mayiwane"},{"$f":"IF(INTRO!$E$43=\"Non-endemic\", \"Not required\", COUNTRY_INFO!Y14)","v":1},{"$f":"IF(OR(COUNTRY_INFO!R14=\"Unknown\",COUNTRY_INFO!R14=\"Surveillance\",COUNTRY_INFO!R14=\"Not required\",COUNTRY_INFO!R14=0),0,IF($D14<>0, COUNTRY_INFO!R14,0))","v":1272},{"$f":"IF(OR(COUNTRY_INFO!S14=\"Unknown\",COUNTRY_INFO!S14=\"Surveillance\",COUNTRY_INFO!S14=\"Not required\",COUNTRY_INFO!S14=0),0,IF($D14<>0, COUNTRY_INFO!S14,0))","v":4206},{"$f":"IF(OR(COUNTRY_INFO!T14=\"Unknown\",COUNTRY_INFO!T14=\"Surveillance\",COUNTRY_INFO!T14=\"Not required\",COUNTRY_INFO!T14=0),0,IF($D14<>0, COUNTRY_INFO!T14,0))","v":11738},17216,null,null,null,null,null,{"$f":"IF($I14<>\"Yes\",$F14*2,($F14+ROUND(J14*$F14/SUM(COUNTRY_INFO!$E14:$G14),0))*2)","v":8412},{"$f":"IF($I14<>\"Yes\",$G14*3,($G14+ROUND(J14*$G14/SUM(COUNTRY_INFO!$E14:$G14),0))*3)","v":35214},43626,null,43626]
[{"$f":"IF(INTRO!$E$43=\"Non-endemic\",\" \", IF(COUNTRY_INFO!A15=0,\" \",COUNTRY_INFO!A15))","v":"Eswatini"},{"$f":"IF(INTRO!$E$43=\"Non-endemic\",\" \", IF(COUNTRY_INFO!B15=0,\" \",COUNTRY_INFO!B15))","v":"HHOHHO"},{"$f":"IF(INTRO!$E$43=\"Non-endemic\",\" \", IF(COUNTRY_INFO!C15=0,\" \",COUNTRY_INFO!C15))","v":"Mbabane East"},{"$f":"IF(INTRO!$E$43=\"Non-endemic\", \"Not required\", COUNTRY_INFO!Y15)","v":1},{"$f":"IF(OR(COUNTRY_INFO!R15=\"Unknown\",COUNTRY_INFO!R15=\"Surveillance\",COUNTRY_INFO!R15=\"Not required\",COUNTRY_INFO!R15=0),0,IF($D15<>0, COUNTRY_INFO!R15,0))","v":2683},{"$f":"IF(OR(COUNTRY_INFO!S15=\"Unknown\",COUNTRY_INFO!S15=\"Surveillance\",COUNTRY_INFO!S15=\"Not required\",COUNTRY_INFO!S15=0),0,IF($D15<>0, COUNTRY_INFO!S15,0))","v":8868},{"$f":"IF(OR(COUNTRY_INFO!T15=\"Unknown\",COUNTRY_INFO!T15=\"Surveillance\",COUNTRY_INFO!T15=\"Not required\",COUNTRY_INFO!T15=0),0,IF($D15<>0, COUNTRY_INFO!T15,0))","v":24750},36301,null,null,null,null,null,{"$f":"IF($I15<>\"Yes\",$F15*2,($F15+ROUND(J15*$F15/SUM(COUNTRY_INFO!$E15:$G15),0))*2)","v":17736},{"$f":"IF($I15<>\"Yes\",$G15*3,($G15+ROUND(J15*$G15/SUM(COUNTRY_INFO!$E15:$G15),0))*3)","v":74250},91986,null,91986]
[{"$f":"IF(INTRO!$E$43=\"Non-endemic\",\" \", IF(COUNTRY_INFO!A16=0,\" \",COUNTRY_INFO!A16))","v":"Eswatini"},{"$f":"IF(INTRO!$E$43=\"Non-endemic\",\" \", IF(COUNTRY_INFO!B16=0,\" \",COUNTRY_INFO!B16))","v":"HHOHHO"},{"$f":"IF(INTRO!$E$43=\"Non-endemic\",\" \", IF(COUNTRY_INFO!C16=0,\" \",COUNTRY_INFO!C16))","v":"Mbabane West"},{"$f":"IF(INTRO!$E$43=\"Non-endemic\", \"Not required\", COUNTRY_INFO!Y16)","v":0},{"$f":"IF(OR(COUNTRY_INFO!R16=\"Unknown\",COUNTRY_INFO!R16=\"Surveillance\",COUNTRY_INFO!R16=\"Not required\",COUNTRY_INFO!R16=0),0,IF($D16<>0, COUNTRY_INFO!R16,0))","v":0},{"$f":"IF(OR(COUNTRY_INFO!S16=\"Unknown\",COUNTRY_INFO!S16=\"Surveillance\",COUNTRY_INFO!S16=\"Not required\",COUNTRY_INFO!S16=0),0,IF($D16<>0, COUNTRY_INFO!S16,0))","v":0},{"$f":"IF(OR(COUNTRY_INFO!T16=\"Unknown\",COUNTRY_INFO!T16=\"Surveillance\",COUNTRY_INFO!T16=\"Not required\",COUNTRY_INFO!T16=0),0,IF($D16<>0, COUNTRY_INFO!T16,0))","v":0},0,null,null,null,null,null,{"$f":"IF($I16<>\"Yes\",$F16*2,($F16+ROUND(J16*$F16/SUM(COUNTRY_INFO!$E16:$G16),0))*2)","v":0},{"$f":"IF($I16<>\"Yes\",$G16*3,($G16+ROUND(J16*$G16/SUM(COUNTRY_INFO!$E16:$G16),0))*3)","v":0},0,null,0]
[{"$f":"IF(INTRO!$E$43=\"Non-endemic\",\" \", IF(COUNTRY_INFO!A17=0,\" \",COUNTRY_INFO!A17))","v":"Eswatini"},{"$f":"IF(INTRO!$E$43=\"Non-endemic\",\" \", IF(COUNTRY_INFO!B17=0,\" \",COUNTRY_INFO!B17))","v":"HHOHHO"},{"$f":"IF(INTRO!$E$43=\"Non-endemic\",\" \", IF(COUNTRY_INFO!C17=0,\" \",COUNTRY_INFO!C17))","v":"Mhlangatane"},{"$f":"IF(INTRO!$E$43=\"Non-endemic\", \"Not required\", COUNTRY_INFO!Y17)","v":1},{"$f":"IF(OR(COUNTRY_INFO!R17=\"Unknown\",COUNTRY_INFO!R17=\"Surveillance\",COUNTRY_INFO!R17=\"Not required\",COUNTRY_INFO!R17=0),0,IF($D17<>0, COUNTRY_INFO!R17,0))","v":1895},{"$f":"IF(OR(COUNTRY_INFO!S17=\"Unknown\",COUNTRY_INFO!S17=\"Surveillance\",COUNTRY_INFO!S17=\"Not required\",COUNTRY_INFO!S17=0),0,IF($D17<>0, COUNTRY_INFO!S17,0))","v":6263},{"$f":"IF(OR(COUNTRY_INFO!T17=\"Unknown\",COUNTRY_INFO!T17=\"Surveillance\",COUNTRY_INFO!T17=\"Not required\",COUNTRY_INFO!T17=0),0,IF($D17<>0, COUNTRY_INFO!T17,0))","v":17479},25637,null,null,null,null,null,{"$f":"IF($I17<>\"Yes\",$F17*2,($F17+ROUND(J17*$F17/SUM(COUNTRY_INFO!$E17:$G17),0))*2)","v":12526},{"$f":"IF($I17<>\"Yes\",$G17*3,($G17+ROUND(J17*$G17/SUM(COUNTRY_INFO!$E17:$G17),0))*3)","v":52437},64963,null,64963]
[{"$f":"IF(INTRO!$E$43=\"Non-endemic\",\" \", IF(COUNTRY_INFO!A18=0,\" \",COUNTRY_INFO!A18))","v":"Eswatini"},{"$f":"IF(INTRO!$E$43=\"Non-endemic\",\" \", IF(COUNTRY_INFO!B18=0,\" \",COUNTRY_INFO!B18))","v":"HHOHHO"},{"$f":"IF(INTRO!$E$43=\"Non-endemic\",\" \", IF(COUNTRY_INFO!C18=0,\" \",COUNTRY_INFO!C18))","v":"Motshane"},{"$f":"IF(INTRO!$E$43=\"Non-endemic\", \"Not required\", COUNTRY_INFO!Y18)","v":1},{"$f":"IF(OR(COUNTRY_INFO!R18=\"Unknown\",COUNTRY_INFO!R18=\"Surveillance\",COUNTRY_INFO!R18=\"Not required\",COUNTRY_INFO!R18=0),0,IF($D18<>0, COUNTRY_INFO!R18,0))","v":2067},{"$f":"IF(OR(COUNTRY_INFO!S18=\"Unknown\",COUNTRY_INFO!S18=\"Surveillance\",COUNTRY_INFO!S18=\"Not required\",COUNTRY_INFO!S18=0),0,IF($D18<>0, COUNTRY_INFO!S18,0))","v":6832},{"$f":"IF(OR(COUNTRY_INFO!T18=\"Unknown\",COUNTRY_INFO!T18=\"Surveillance\",COUNTRY_INFO!T18=\"Not required\",COUNTRY_INFO!T18=0),0,IF($D18<>0, COUNTRY_INFO!T18,0))","v":19068},27967,null,null,null,null,null,{"$f":"IF($I18<>\"Yes\",$F18*2,($F18+ROUND(J18*$F18/SUM(COUNTRY_INFO!$E18:$G18),0))*2)","v":13664},{"$f":"IF($I18<>\"Yes\",$G18*3,($G18+ROUND(J18*$G18/SUM(COUNTRY_INFO!$E18:$G18),0))*3)","v":57204},70868,null,70868]
[{"$f":"IF(INTRO!$E$43=\"Non-endemic\",\" \", IF(COUNTRY_INFO!A19=0,\" \",COUNTRY_INFO!A19))","v":"Eswatini"},{"$f":"IF(INTRO!$E$43=\"Non-endemic\",\" \", IF(COUNTRY_INFO!B19=0,\" \",COUNTRY_INFO!B19))","v":"HHOHHO"},{"$f":"IF(INTRO!$E$43=\"Non-endemic\",\" \", IF(COUNTRY_INFO!C19=0,\" \",COUNTRY_INFO!C19))","v":"Ndzingeni"},{"$f":"IF(INTRO!$E$43=\"Non-endemic\", \"Not required\", COUNTRY_INFO!Y19)","v":0},{"$f":"IF(OR(COUNTRY_INFO!R19=\"Unknown\",COUNTRY_INFO!R19=\"Surveillance\",COUNTRY_INFO!R19=\"Not required\",COUNTRY_INFO!R19=0),0,IF($D19<>0, COUNTRY_INFO!R19,0))","v":0},{"$f":"IF(OR(COUNTRY_INFO!S19=\"Unknown\",COUNTRY_INFO!S19=\"Surveillance\",COUNTRY_INFO!S19=\"Not required\",COUNTRY_INFO!S19=0),0,IF($D19<>0, COUNTRY_INFO!S19,0))","v":0},{"$f":"IF(OR(COUNTRY_INFO!T19=\"Unknown\",COUNTRY_INFO!T19=\"Surveillance\",COUNTRY_INFO!T19=\"Not required\",COUNTRY_INFO!T19=0),0,IF($D19<>0, COUNTRY_INFO!T19,0))","v":0},0,null,null,null,null,null,{"$f":"IF($I19<>\"Yes\",$F19*2,($F19+ROUND(J19*$F19/SUM(COUNTRY_INFO!$E19:$G19),0))*2)","v":0},{"$f":"IF($I19<>\"Yes\",$G19*3,($G19+ROUND(J19*$G19/SUM(COUNTRY_INFO!$E19:$G19),0))*3)","v":0},0,null,0]
[{"$f":"IF(INTRO!$E$43=\"Non-endemic\",\" \", IF(COUNTRY_INFO!A20=0,\" \",COUNTRY_INFO!A20))","v":"Eswatini"},{"$f":"IF(INTRO!$E$43=\"Non-endemic\",\" \", IF(COUNTRY_INFO!B20=0,\" \",COUNTRY_INFO!B20))","v":"HHOHHO"},{"$f":"IF(INTRO!$E$43=\"Non-endemic\",\" \", IF(COUNTRY_INFO!C20=0,\" \",COUNTRY_INFO!C20))","v":"Nkhaba"},{"$f":"IF(INTRO!$E$43=\"Non-endemic\", \"Not required\", COUNTRY_INFO!Y20)","v":0},{"$f":"IF(OR(COUNTRY_INFO!R20=\"Unknown\",COUNTRY_INFO!R20=\"Surveillance\",COUNTRY_INFO!R20=\"Not required\",COUNTRY_INFO!R20=0),0,IF($D20<>0, COUNTRY_INFO!R20,0))","v":0},{"$f":"IF(OR(COUNTRY_INFO!S20=\"Unknown\",COUNTRY_INFO!S20=\"Surveillance\",COUNTRY_INFO!S20=\"Not required\",COUNTRY_INFO!S20=0),0,IF($D20<>0, COUNTRY_INFO!S20,0))","v":0},{"$f":"IF(OR(COUNTRY_INFO!T20=\"Unknown\",COUNTRY_INFO!T20=\"Surveillance\",COUNTRY_INFO!T20=\"Not required\",COUNTRY_INFO!T20=0),0,IF($D20<>0, COUNTRY_INFO!T20,0))","v":0},0,null,null,null,null,null,{"$f":"IF($I20<>\"Yes\",$F20*2,($F20+ROUND(J20*$F20/SUM(COUNTRY_INFO!$E20:$G20),0))*2)","v":0},{"$f":"IF($I20<>\"Yes\",$G20*3,($G20+ROUND(J20*$G20/SUM(COUNTRY_INFO!$E20:$G20),0))*3)","v":0},0,null,0]
[{"$f":"IF(INTRO!$E$43=\"Non-endemic\",\" \", IF(COUNTRY_INFO!A21=0,\" \",COUNTRY_INFO!A21))","v":"Eswatini"},{"$f":"IF(INTRO!$E$43=\"Non-endemic\",\" \", IF(COUNTRY_INFO!B21=0,\" \",COUNTRY_INFO!B21))","v":"HHOHHO"},{"$f":"IF(INTRO!$E$43=\"Non-endemic\",\" \", IF(COUNTRY_INFO!C21=0,\" \",COUNTRY_INFO!C21))","v":"Ntfonjeni"},{"$f":"IF(INTRO!$E$43=\"Non-endemic\", \"Not required\", COUNTRY_INFO!Y21)","v":0},{"$f":"IF(OR(COUNTRY_INFO!R21=\"Unknown\",COUNTRY_INFO!R21=\"Surveillance\",COUNTRY_INFO!R21=\"Not required\",COUNTRY_INFO!R21=0),0,IF($D21<>0, COUNTRY_INFO!R21,0))","v":0},{"$f":"IF(OR(COUNTRY_INFO!S21=\"Unknown\",COUNTRY_INFO!S21=\"Surveillance\",COUNTRY_INFO!S21=\"Not required\",COUNTRY_INFO!S21=0),0,IF($D21<>0, COUNTRY_INFO!S21,0))","v":0},{"$f":"IF(OR(COUNTRY_INFO!T21=\"Unknown\",COUNTRY_INFO!T21=\"Surveillance\",COUNTRY_INFO!T21=\"Not required\",COUNTRY_INFO!T21=0),0,IF($D21<>0, COUNTRY_INFO!T21,0))","v":0},0,null,null,null,null,null,{"$f":"IF($I21<>\"Yes\",$F21*2,($F21+ROUND(J21*$F21/SUM(COUNTRY_INFO!$E21:$G21),0))*2)","v":0},{"$f":"IF($I21<>\"Yes\",$G21*3,($G21+ROUND(J21*$G21/SUM(COUNTRY_INFO!$E21:$G21),0))*3)","v":0},0,null,0]
[{"$f":"IF(INTRO!$E$43=\"Non-endemic\",\" \", IF(COUNTRY_INFO!A22=0,\" \",COUNTRY_INFO!A22))","v":"Eswatini"},{"$f":"IF(INTRO!$E$43=\"Non-endemic\",\" \", IF(COUNTRY_INFO!B22=0,\" \",COUNTRY_INFO!B22))","v":"HHOHHO"},{"$f":"IF(INTRO!$E$43=\"Non-endemic\",\" \", IF(COUNTRY_INFO!C22=0,\" \",COUNTRY_INFO!C22))","v":"Pigg's Peak"},{"$f":"IF(INTRO!$E$43=\"Non-endemic\", \"Not required\", COUNTRY_INFO!Y22)","v":1},{"$f":"IF(OR(COUNTRY_INFO!R22=\"Unknown\",COUNTRY_INFO!R22=\"Surveillance\",COUNTRY_INFO!R22=\"Not required\",COUNTRY_INFO!R22=0),0,IF($D22<>0, COUNTRY_INFO!R22,0))","v":1467},{"$f":"IF(OR(COUNTRY_INFO!S22=\"Unknown\",COUNTRY_INFO!S22=\"Surveillance\",COUNTRY_INFO!S22=\"Not required\",COUNTRY_INFO!S22=0),0,IF($D22<>0, COUNTRY_INFO!S22,0))","v":4850},{"$f":"IF(OR(COUNTRY_INFO!T22=\"Unknown\",COUNTRY_INFO!T22=\"Surveillance\",COUNTRY_INFO!T22=\"Not required\",COUNTRY_INFO!T22=0),0,IF($D22<>0, COUNTRY_INFO!T22,0))","v":13535},19852,null,null,null,null,null,{"$f":"IF($I22<>\"Yes\",$F22*2,($F22+ROUND(J22*$F22/SUM(COUNTRY_INFO!$E22:$G22),0))*2)","v":9700},{"$f":"IF($I22<>\"Yes\",$G22*3,($G22+ROUND(J22*$G22/SUM(COUNTRY_INFO!$E22:$G22),0))*3)","v":40605},50305,null,50305]
[{"$f":"IF(INTRO!$E$43=\"Non-endemic\",\" \", IF(COUNTRY_INFO!A23=0,\" \",COUNTRY_INFO!A23))","v":"Eswatini"},{"$f":"IF(INTRO!$E$43=\"Non-endemic\",\" \", IF(COUNTRY_INFO!B23=0,\" \",COUNTRY_INFO!B23))","v":"HHOHHO"},{"$f":"IF(INTRO!$E$43=\"Non-endemic\",\" \", IF(COUNTRY_INFO!C23=0,\" \",COUNTRY_INFO!C23))","v":"Siphocosini"},{"$f":"IF(INTRO!$E$43=\"Non-endemic\", \"Not required\", COUNTRY_INFO!Y23)","v":1},{"$f":"IF(OR(COUNTRY_INFO!R23=\"Unknown\",COUNTRY_INFO!R23=\"Surveillance\",COUNTRY_INFO!R23=\"Not required\",COUNTRY_INFO!R23=0),0,IF($D23<>0, COUNTRY_INFO!R23,0))","v":1953},{"$f":"IF(OR(COUNTRY_INFO!S23=\"Unknown\",COUNTRY_INFO!S23=\"Surveillance\",COUNTRY_INFO!S23=\"Not required\",COUNTRY_INFO!S23=0),0,IF($D23<>0, COUNTRY_INFO!S23,0))","v":6456},{"$f":"IF(OR(COUNTRY_INFO!T23=\"Unknown\",COUNTRY_INFO!T23=\"Surveillance\",COUNTRY_INFO!T23=\"Not required\",COUNTRY_INFO!T23=0),0,IF($D23<>0, COUNTRY_INFO!T23,0))","v":18017},26426,null,null,null,null,null,{"$f":"IF($I23<>\"Yes\",$F23*2,($F23+ROUND(J23*$F23/SUM(COUNTRY_INFO!$E23:$G23),0))*2)","v":12912},{"$f":"IF($I23<>\"Yes\",$G23*3,($G23+ROUND(J23*$G23/SUM(COUNTRY_INFO!$E23:$G23),0))*3)","v":54051},66963,null,66963]
[{"$f":"IF(INTRO!$E$43=\"Non-endemic\",\" \", IF(COUNTRY_INFO!A24=0,\" \",COUNTRY_INFO!A24))","v":"Eswatini"},{"$f":"IF(INTRO!$E$43=\"Non-endemic\",\" \", IF(COUNTRY_INFO!B24=0,\" \",COUNTRY_INFO!B24))","v":"HHOHHO"},{"$f":"IF(INTRO!$E$43=\"Non-endemic\",\" \", IF(COUNTRY_INFO!C24=0,\" \",COUNTRY_INFO!C24))","v":"Timphisini"},{"$f":"IF(INTRO!$E$43=\"Non-endemic\", \"Not required\", COUNTRY_INFO!Y24)","v":1},{"$f":"IF(OR(COUNTRY_INFO!R24=\"Unknown\",COUNTRY_INFO!R24=\"Surveillance\",COUNTRY_INFO!R24=\"Not required\",COUNTRY_INFO!R24=0),0,IF($D24<>0, COUNTRY_INFO!R24,0))","v":947},{"$f":"IF(OR(COUNTRY_INFO!S24=\"Unknown\",COUNTRY_INFO!S24=\"Surveillance\",COUNTRY_INFO!S24=\"Not required\",COUNTRY_INFO!S24=0),0,IF($D24<>0, COUNTRY_INFO!S24,0))","v":3130},{"$f":"IF(OR(COUNTRY_INFO!T24=\"Unknown\",COUNTRY_INFO!T24=\"Surveillance\",COUNTRY_INFO!T24=\"Not required\",COUNTRY_INFO!T24=0),0,IF($D24<>0, COUNTRY_INFO!T24,0))","v":8737},12814,null,null,null,null,null,{"$f":"IF($I24<>\"Yes\",$F24*2,($F24+ROUND(J24*$F24/SUM(COUNTRY_INFO!$E24:$G24),0))*2)","v":6260},{"$f":"IF($I24<>\"Yes\",$G24*3,($G24+ROUND(J24*$G24/SUM(COUNTRY_INFO!$E24:$G24),0))*3)","v":26211},32471,null,32471]
[{"$f":"IF(INTRO!$E$43=\"Non-endemic\",\" \", IF(COUNTRY_INFO!A25=0,\" \",COUNTRY_INFO!A25))","v":"Eswatini"},{"$f":"IF(INTRO!$E$43=\"Non-endemic\",\" \", IF(COUNTRY_INFO!B25=0,\" \",COUNTRY_INFO!B25))","v":"LUBOMBO"},{"$f":"IF(INTRO!$E$43=\"Non-endemic\",\" \", IF(COUNTRY_INFO!C25=0,\" \",COUNTRY_INFO!C25))","v":"Dvokodvweni"},{"$f":"IF(INTRO!$E$43=\"Non-endemic\", \"Not required\", COUNTRY_INFO!Y25)","v":0},{"$f":"IF(OR(COUNTRY_INFO!R25=\"Unknown\",COUNTRY_INFO!R25=\"Surveillance\",COUNTRY_INFO!R25=\"Not required\",COUNTRY_INFO!R25=0),0,IF($D25<>0, COUNTRY_INFO!R25,0))","v":0},{"$f":"IF(OR(COUNTRY_INFO!S25=\"Unknown\",COUNTRY_INFO!S25=\"Surveillance\",COUNTRY_INFO!S25=\"Not required\",COUNTRY_INFO!S25=0),0,IF($D25<>0, COUNTRY_INFO!S25,0))","v":0},{"$f":"IF(OR(COUNTRY_INFO!T25=\"Unknown\",COUNTRY_INFO!T25=\"Surveillance\",COUNTRY_INFO!T25=\"Not required\",COUNTRY_INFO!T25=0),0,IF($D25<>0, COUNTRY_INFO!T25,0))","v":0},0,null,null,null,null,null,{"$f":"IF($I25<>\"Yes\",$F25*2,($F25+ROUND(J25*$F25/SUM(COUNTRY_INFO!$E25:$G25),0))*2)","v":0},{"$f":"IF($I25<>\"Yes\",$G25*3,($G25+ROUND(J25*$G25/SUM(COUNTRY_INFO!$E25:$G25),0))*3)","v":0},0,null,0]
[{"$f":"IF(INTRO!$E$43=\"Non-endemic\",\" \", IF(COUNTRY_INFO!A26=0,\" \",COUNTRY_INFO!A26))","v":"Eswatini"},{"$f":"IF(INTRO!$E$43=\"Non-endemic\",\" \", IF(COUNTRY_INFO!B26=0,\" \",COUNTRY_INFO!B26))","v":"LUBOMBO"},{"$f":"IF(INTRO!$E$43=\"Non-endemic\",\" \", IF(COUNTRY_INFO!C26=0,\" \",COUNTRY_INFO!C26))","v":"Gigal"},{"$f":"IF(INTRO!$E$43=\"Non-endemic\", \"Not required\", COUNTRY_INFO!Y26)","v":1},{"$f":"IF(OR(COUNTRY_INFO!R26=\"Unknown\",COUNTRY_INFO!R26=\"Surveillance\",COUNTRY_INFO!R26=\"Not required\",COUNTRY_INFO!R26=0),0,IF($D26<>0, COUNTRY_INFO!R26,0))","v":841},{"$f":"IF(OR(COUNTRY_INFO!S26=\"Unknown\",COUNTRY_INFO!S26=\"Surveillance\",COUNTRY_INFO!S26=\"Not required\",COUNTRY_INFO!S26=0),0,IF($D26<>0, COUNTRY_INFO!S26,0))","v":2778},{"$f":"IF(OR(COUNTRY_INFO!T26=\"Unknown\",COUNTRY_INFO!T26=\"Surveillance\",COUNTRY_INFO!T26=\"Not required\",COUNTRY_INFO!T26=0),0,IF($D26<>0, COUNTRY_INFO!T26,0))","v":7753},11372,null,null,null,null,null,{"$f":"IF($I26<>\"Yes\",$F26*2,($F26+ROUND(J26*$F26/SUM(COUNTRY_INFO!$E26:$G26),0))*2)","v":5556},{"$f":"IF($I26<>\"Yes\",$G26*3,($G26+ROUND(J26*$G26/SUM(COUNTRY_INFO!$E26:$G26),0))*3)","v":23259},28815,null,28815]
[{"$f":"IF(INTRO!$E$43=\"Non-endemic\",\" \", IF(COUNTRY_INFO!A27=0,\" \",COUNTRY_INFO!A27))","v":"Eswatini"},{"$f":"IF(INTRO!$E$43=\"Non-endemic\",\" \", IF(COUNTRY_INFO!B27=0,\" \",COUNTRY_INFO!B27))","v":"LUBOMBO"},{"$f":"IF(INTRO!$E$43=\"Non-endemic\",\" \", IF(COUNTRY_INFO!C27=0,\" \",COUNTRY_INFO!C27))","v":"Lomahasha"},{"$f":"IF(INTRO!$E$43=\"Non-endemic\", \"Not required\", COUNTRY_INFO!Y27)","v":1},{"$f":"IF(OR(COUNTRY_INFO!R27=\"Unknown\",COUNTRY_INFO!R27=\"Surveillance\",COUNTRY_INFO!R27=\"Not required\",COUNTRY_INFO!R27=0),0,IF($D27<>0, COUNTRY_INFO!R27,0))","v":1651},{"$f":"IF(OR(COUNTRY_INFO!S27=\"Unknown\",COUNTRY_INFO!S27=\"Surveillance\",COUNTRY_INFO!S27=\"Not required\",COUNTRY_INFO!S27=0),0,IF($D27<>0, COUNTRY_INFO!S27,0))","v":5457},{"$f":"IF(OR(COUNTRY_INFO!T27=\"Unknown\",COUNTRY_INFO!T27=\"Surveillance\",COUNTRY_INFO!T27=\"Not required\",COUNTRY_INFO!T27=0),0,IF($D27<>0, COUNTRY_INFO!T27,0))","v":15230},22338,null,null,null,null,null,{"$f":"IF($I27<>\"Yes\",$F27*2,($F27+ROUND(J27*$F27/SUM(COUNTRY_INFO!$E27:$G27),0))*2)","v":10914},{"$f":"IF($I27<>\"Yes\",$G27*3,($G27+ROUND(J27*$G27/SUM(COUNTRY_INFO!$E27:$G27),0))*3)","v":45690},56604,null,56604]
[{"$f":"IF(INTRO!$E$43=\"Non-endemic\",\" \", IF(COUNTRY_INFO!A28=0,\" \",COUNTRY_INFO!A28))","v":"Eswatini"},{"$f":"IF(INTRO!$E$43=\"Non-endemic\",\" \", IF(COUNTRY_INFO!B28=0,\" \",COUNTRY_INFO!B28))","v":"LUBOMBO"},{"$f":"IF(INTRO!$E$43=\"Non-endemic\",\" \", IF(COUNTRY_INFO!C28=0,\" \",COUNTRY_INFO!C28))","v":"Lubuli"},{"$f":"IF(INTRO!$E$43=\"Non-endemic\", \"Not required\", COUNTRY_INFO!Y28)","v":0},{"$f":"IF(OR(COUNTRY_INFO!R28=\"Unknown\",COUNTRY_INFO!R28=\"Surveillance\",COUNTRY_INFO!R28=\"Not required\",COUNTRY_INFO!R28=0),0,IF($D28<>0, COUNTRY_INFO!R28,0))","v":0},{"$f":"IF(OR(COUNTRY_INFO!S28=\"Unknown\",COUNTRY_INFO!S28=\"Surveillance\",COUNTRY_INFO!S28=\"Not required\",COUNTRY_INFO!S28=0),0,IF($D28<>0, COUNTRY_INFO!S28,0))","v":0},{"$f":"IF(OR(COUNTRY_INFO!T28=\"Unknown\",COUNTRY_INFO!T28=\"Surveillance\",COUNTRY_INFO!T28=\"Not required\",COUNTRY_INFO!T28=0),0,IF($D28<>0, COUNTRY_INFO!T28,0))","v":0},0,null,null,null,null,null,{"$f":"IF($I28<>\"Yes\",$F28*2,($F28+ROUND(J28*$F28/SUM(COUNTRY_INFO!$E28:$G28),0))*2)","v":0},{"$f":"IF($I28<>\"Yes\",$G28*3,($G28+ROUND(J28*$G28/SUM(COUNTRY_INFO!$E28:$G28),0))*3)","v":0},0,null,0]
[{"$f":"IF(INTRO!$E$43=\"Non-endemic\",\" \", IF(COUNTRY_INFO!A29=0,\" \",COUNTRY_INFO!A29))","v":"Eswatini"},{"$f":"IF(INTRO!$E$43=\"Non-endemic\",\" \", IF(COUNTRY_INFO!B29=0,\" \",COUNTRY_INFO!B29))","v":"LUBOMBO"},{"$f":"IF(INTRO!$E$43=\"Non-endemic\",\" \", IF(COUNTRY_INFO!C29=0,\" \",COUNTRY_INFO!C29))","v":"Lugongolweni"},{"$f":"IF(INTRO!$E$43=\"Non-endemic\", \"Not required\", COUNTRY_INFO!Y29)","v":1},{"$f":"IF(OR(COUNTRY_INFO!R29=\"Unknown\",COUNTRY_INFO!R29=\"Surveillance\",COUNTRY_INFO!R29=\"Not required\",COUNTRY_INFO!R29=0),0,IF($D29<>0, COUNTRY_INFO!R29,0))","v":2042},{"$f":"IF(OR(COUNTRY_INFO!S29=\"Unknown\",COUNTRY_INFO!S29=\"Surveillance\",COUNTRY_INFO!S29=\"Not required\",COUNTRY_INFO!S29=0),0,IF($D29<>0, COUNTRY_INFO!S29,0))","v":6747},{"$f":"IF(OR(COUNTRY_INFO!T29=\"Unknown\",COUNTRY_INFO!T29=\"Surveillance\",COUNTRY_INFO!T29=\"Not required\",COUNTRY_INFO!T29=0),0,IF($D29<>0, COUNTRY_INFO!T29,0))","v":18830},27619,null,null,null,null,null,{"$f":"IF($I29<>\"Yes\",$F29*2,($F29+ROUND(J29*$F29/SUM(COUNTRY_INFO!$E29:$G29),0))*2)","v":13494},{"$f":"IF($I29<>\"Yes\",$G29*3,($G29+ROUND(J29*$G29/SUM(COUNTRY_INFO!$E29:$G29),0))*3)","v":56490},69984,null,69984]
[{"$f":"IF(INTRO!$E$43=\"Non-endemic\",\" \", IF(COUNTRY_INFO!A30=0,\" \",COUNTRY_INFO!A30))","v":"Eswatini"},{"$f":"IF(INTRO!$E$43=\"Non-endemic\",\" \", IF(COUNTRY_INFO!B30=0,\" \",COUNTRY_INFO!B30))","v":"LUBOMBO"},{"$f":"IF(INTRO!$E$43=\"Non-endemic\",\" \", IF(COUNTRY_INFO!C30=0,\" \",COUNTRY_INFO!C30))","v":"Matsanjeni North"},{"$f":"IF(INTRO!$E$43=\"Non-endemic\", \"Not required\", COUNTRY_INFO!Y30)","v":1},{"$f":"IF(OR(COUNTRY_INFO!R30=\"Unknown\",COUNTRY_INFO!R30=\"Surveillance\",COUNTRY_INFO!R30=\"Not required\",COUNTRY_INFO!R30=0),0,IF($D30<>0, COUNTRY_INFO!R30,0))","v":1158},{"$f":"IF(OR(COUNTRY_INFO!S30=\"Unknown\",COUNTRY_INFO!S30=\"Surveillance\",COUNTRY_INFO!S30=\"Not required\",COUNTRY_INFO!S30=0),0,IF($D30<>0, COUNTRY_INFO!S30,0))","v":3829},{"$f":"IF(OR(COUNTRY_INFO!T30=\"Unknown\",COUNTRY_INFO!T30=\"Surveillance\",COUNTRY_INFO!T30=\"Not required\",COUNTRY_INFO!T30=0),0,IF($D30<>0, COUNTRY_INFO!T30,0))","v":10685},15672,null,null,null,null,null,{"$f":"IF($I30<>\"Yes\",$F30*2,($F30+ROUND(J30*$F30/SUM(COUNTRY_INFO!$E30:$G30),0))*2)","v":7658},{"$f":"IF($I30<>\"Yes\",$G30*3,($G30+ROUND(J30*$G30/SUM(COUNTRY_INFO!$E30:$G30),0))*3)","v":32055},39713,null,39713]
[{"$f":"IF(INTRO!$E$43=\"Non-endemic\",\" \", IF(COUNTRY_INFO!A31=0,\" \",COUNTRY_INFO!A31))","v":"Eswatini"},{"$f":"IF(INTRO!$E$43=\"Non-endemic\",\" \", IF(COUNTRY_INFO!B31=0,\" \",COUNTRY_INFO!B31))","v":"LUBOMBO"},{"$f":"IF(INTRO!$E$43=\"Non-endemic\",\" \", IF(COUNTRY_INFO!C31=0,\" \",COUNTRY_INFO!C31))","v":"Mhlume"},{"$f":"IF(INTRO!$E$43=\"Non-endemic\", \"Not required\", COUNTRY_INFO!Y31)","v":1},{"$f":"IF(OR(COUNTRY_INFO!R31=\"Unknown\",COUNTRY_INFO!R31=\"Surveillance\",COUNTRY_INFO!R31=\"Not required\",COUNTRY_INFO!R31=0),0,IF($D31<>0, COUNTRY_INFO!R31,0))","v":1230},{"$f":"IF(OR(COUNTRY_INFO!S31=\"Unknown\",COUNTRY_INFO!S31=\"Surveillance\",COUNTRY_INFO!S31=\"Not required\",COUNTRY_INFO!S31=0),0,IF($D31<>0, COUNTRY_INFO!S31,0))","v":4066},{"$f":"IF(OR(COUNTRY_INFO!T31=\"Unknown\",COUNTRY_INFO!T31=\"Surveillance\",COUNTRY_INFO!T31=\"Not required\",COUNTRY_INFO!T31=0),0,IF($D31<>0, COUNTRY_INFO!T31,0))","v":11347},16643,null,null,null,null,null,{"$f":"IF($I31<>\"Yes\",$F31*2,($F31+ROUND(J31*$F31/SUM(COUNTRY_INFO!$E31:$G31),0))*2)","v":8132},{"$f":"IF($I31<>\"Yes\",$G31*3,($G31+ROUND(J31*$G31/SUM(COUNTRY_INFO!$E31:$G31),0))*3)","v":34041},42173,null,42173]
[{"$f":"IF(INTRO!$E$43=\"Non-endemic\",\" \", IF(COUNTRY_INFO!A32=0,\" \",COUNTRY_INFO!A32))","v":"Eswatini"},{"$f":"IF(INTRO!$E$43=\"Non-endemic\",\" \", IF(COUNTRY_INFO!B32=0,\" \",COUNTRY_INFO!B32))","v":"LUBOMBO"},{"$f":"IF(INTRO!$E$43=\"Non-endemic\",\" \", IF(COUNTRY_INFO!C32=0,\" \",COUNTRY_INFO!C32))","v":"Mpolonjeni"},{"$f":"IF(INTRO!$E$43=\"Non-endemic\", \"Not required\", COUNTRY_INFO!Y32)","v":1},{"$f":"IF(OR(COUNTRY_INFO!R32=\"Unknown\",COUNTRY_INFO!R32=\"Surveillance\",COUNTRY_INFO!R32=\"Not required\",COUNTRY_INFO!R32=0),0,IF($D32<>0, COUNTRY_INFO!R32,0))","v":1049},{"$f":"IF(OR(COUNTRY_INFO!S32=\"Unknown\",COUNTRY_INFO!S32=\"Surveillance\",COUNTRY_INFO!S32=\"Not required\",COUNTRY_INFO!S32=0),0,IF($D32<>0, COUNTRY_INFO!S32,0))","v":3469},{"$f":"IF(OR(COUNTRY_INFO!T32=\"Unknown\",COUNTRY_INFO!T32=\"Surveillance\",COUNTRY_INFO!T32=\"Not required\",COUNTRY_INFO!T32=0),0,IF($D32<>0, COUNTRY_INFO!T32,0))","v":9681},14199,null,null,null,null,null,{"$f":"IF($I32<>\"Yes\",$F32*2,($F32+ROUND(J32*$F32/SUM(COUNTRY_INFO!$E32:$G32),0))*2)","v":6938},{"$f":"IF($I32<>\"Yes\",$G32*3,($G32+ROUND(J32*$G32/SUM(COUNTRY_INFO!$E32:$G32),0))*3)","v":29043},35981,null,35981]
[{"$f":"IF(INTRO!$E$43=\"Non-endemic\",\" \", IF(COUNTRY_INFO!A33=0,\" \",COUNTRY_INFO!A33))","v":"Eswatini"},{"$f":"IF(INTRO!$E$43=\"Non-endemic\",\" \", IF(COUNTRY_INFO!B33=0,\" \",COUNTRY_INFO!B33))","v":"LUBOMBO"},{"$f":"IF(INTRO!$E$43=\"Non-endemic\",\" \", IF(COUNTRY_INFO!C33=0,\" \",COUNTRY_INFO!C33))","v":"Nkilongo"},{"$f":"IF(INTRO!$E$43=\"Non-endemic\", \"Not required\", COUNTRY_INFO!Y33)","v":1},{"$f":"IF(OR(COUNTRY_INFO!R33=\"Unknown\",COUNTRY_INFO!R33=\"Surveillance\",COUNTRY_INFO!R33=\"Not required\",COUNTRY_INFO!R33=0),0,IF($D33<>0, COUNTRY_INFO!R33,0))","v":1100},{"$f":"IF(OR(COUNTRY_INFO!S33=\"Unknown\",COUNTRY_INFO!S33=\"Surveillance\",COUNTRY_INFO!S33=\"Not required\",COUNTRY_INFO!S33=0),0,IF($D33<>0, COUNTRY_INFO!S33,0))","v":3636},{"$f":"IF(OR(COUNTRY_INFO!T33=\"Unknown\",COUNTRY_INFO!T33=\"Surveillance\",COUNTRY_INFO!T33=\"Not required\",COUNTRY_INFO!T33=0),0,IF($D33<>0, COUNTRY_INFO!T33,0))","v":10148},14884,null,null,null,null,null,{"$f":"IF($I33<>\"Yes\",$F33*2,($F33+ROUND(J33*$F33/SUM(COUNTRY_INFO!$E33:$G33),0))*2)","v":7272},{"$f":"IF($I33<>\"Yes\",$G33*3,($G33+ROUND(J33*$G33/SUM(COUNTRY_INFO!$E33:$G33),0))*3)","v":30444},37716,null,37716]
[{"$f":"IF(INTRO!$E$43=\"Non-endemic\",\" \", IF(COUNTRY_INFO!A34=0,\" \",COUNTRY_INFO!A34))","v":"Eswatini"},{"$f":"IF(INTRO!$E$43=\"Non-endemic\",\" \", IF(COUNTRY_INFO!B34=0,\" \",COUNTRY_INFO!B34))","v":"LUBOMBO"},{"$f":"IF(INTRO!$E$43=\"Non-endemic\",\" \", IF(COUNTRY_INFO!C34=0,\" \",COUNTRY_INFO!C34))","v":"Siphofaneni"},{"$f":"IF(INTRO!$E$43=\"Non-endemic\", \"Not required\", COUNTRY_INFO!Y34)","v":1},{"$f":"IF(OR(COUNTRY_INFO!R34=\"Unknown\",COUNTRY_INFO!R34=\"Surveillance\",COUNTRY_INFO!R34=\"Not required\",COUNTRY_INFO!R34=0),0,IF($D34<>0, COUNTRY_INFO!R34,0))","v":2425},{"$f":"IF(OR(COUNTRY_INFO!S34=\"Unknown\",COUNTRY_INFO!S34=\"Surveillance\",COUNTRY_INFO!S34=\"Not required\",COUNTRY_INFO!S34=0),0,IF($D34<>0, COUNTRY_INFO!S34,0))","v":8014},{"$f":"IF(OR(COUNTRY_INFO!T34=\"Unknown\",COUNTRY_INFO!T34=\"Surveillance\",COUNTRY_INFO!T34=\"Not required\",COUNTRY_INFO!T34=0),0,IF($D34<>0, COUNTRY_INFO!T34,0))","v":22367},32806,null,null,null,null,null,{"$f":"IF($I34<>\"Yes\",$F34*2,($F34+ROUND(J34*$F34/SUM(COUNTRY_INFO!$E34:$G34),0))*2)","v":16028},{"$f":"IF($I34<>\"Yes\",$G34*3,($G34+ROUND(J34*$G34/SUM(COUNTRY_INFO!$E34:$G34),0))*3)","v":67101},83129,null,83129]
[{"$f":"IF(INTRO!$E$43=\"Non-endemic\",\" \", IF(COUNTRY_INFO!A35=0,\" \",COUNTRY_INFO!A35))","v":"Eswatini"},{"$f":"IF(INTRO!$E$43=\"Non-endemic\",\" \", IF(COUNTRY_INFO!B35=0,\" \",COUNTRY_INFO!B35))","v":"LUBOMBO"},{"$f":"IF(INTRO!$E$43=\"Non-endemic\",\" \", IF(COUNTRY_INFO!C35=0,\" \",COUNTRY_INFO!C35))","v":"Sithobela"},{"$f":"IF(INTRO!$E$43=\"Non-endemic\", \"Not required\", COUNTRY_INFO!Y35)","v":1},{"$f":"IF(OR(COUNTRY_INFO!R35=\"Unknown\",COUNTRY_INFO!R35=\"Surveillance\",COUNTRY_INFO!R35=\"Not required\",COUNTRY_INFO!R35=0),0,IF($D35<>0, COUNTRY_INFO!R35,0))","v":2092},{"$f":"IF(OR(COUNTRY_INFO!S35=\"Unknown\",COUNTRY_INFO!S35=\"Surveillance\",COUNTRY_INFO!S35=\"Not required\",COUNTRY_INFO!S35=0),0,IF($D35<>0, COUNTRY_INFO!S35,0))","v":6916},{"$f":"IF(OR(COUNTRY_INFO!T35=\"Unknown\",COUNTRY_INFO!T35=\"Surveillance\",COUNTRY_INFO!T35=\"Not required\",COUNTRY_INFO!T35=0),0,IF($D35<>0, COUNTRY_INFO!T35,0))","v":19300},28308,null,null,null,null,null,{"$f":"IF($I35<>\"Yes\",$F35*2,($F35+ROUND(J35*$F35/SUM(COUNTRY_INFO!$E35:$G35),0))*2)","v":13832},{"$f":"IF($I35<>\"Yes\",$G35*3,($G35+ROUND(J35*$G35/SUM(COUNTRY_INFO!$E35:$G35),0))*3)","v":57900},71732,null,71732]
[{"$f":"IF(INTRO!$E$43=\"Non-endemic\",\" \", IF(COUNTRY_INFO!A36=0,\" \",COUNTRY_INFO!A36))","v":"Eswatini"},{"$f":"IF(INTRO!$E$43=\"Non-endemic\",\" \", IF(COUNTRY_INFO!B36=0,\" \",COUNTRY_INFO!B36))","v":"MANZINI"},{"$f":"IF(INTRO!$E$43=\"Non-endemic\",\" \", IF(COUNTRY_INFO!C36=0,\" \",COUNTRY_INFO!C36))","v":"Kukhanyeni"},{"$f":"IF(INTRO!$E$43=\"Non-endemic\", \"Not required\", COUNTRY_INFO!Y36)","v":1},{"$f":"IF(OR(COUNTRY_INFO!R36=\"Unknown\",COUNTRY_INFO!R36=\"Surveillance\",COUNTRY_INFO!R36=\"Not required\",COUNTRY_INFO!R36=0),0,IF($D36<>0, COUNTRY_INFO!R36,0))","v":1425},{"$f":"IF(OR(COUNTRY_INFO!S36=\"Unknown\",COUNTRY_INFO!S36=\"Surveillance\",COUNTRY_INFO!S36=\"Not required\",COUNTRY_INFO!S36=0),0,IF($D36<>0, COUNTRY_INFO!S36,0))","v":4711},{"$f":"IF(OR(COUNTRY_INFO!T36=\"Unknown\",COUNTRY_INFO!T36=\"Surveillance\",COUNTRY_INFO!T36=\"Not required\",COUNTRY_INFO!T36=0),0,IF($D36<>0, COUNTRY_INFO!T36,0))","v":13149},19285,null,null,null,null,null,{"$f":"IF($I36<>\"Yes\",$F36*2,($F36+ROUND(J36*$F36/SUM(COUNTRY_INFO!$E36:$G36),0))*2)","v":9422},{"$f":"IF($I36<>\"Yes\",$G36*3,($G36+ROUND(J36*$G36/SUM(COUNTRY_INFO!$E36:$G36),0))*3)","v":39447},48869,null,48869]
[{"$f":"IF(INTRO!$E$43=\"Non-endemic\",\" \", IF(COUNTRY_INFO!A37=0,\" \",COUNTRY_INFO!A37))","v":"Eswatini"},{"$f":"IF(INTRO!$E$43=\"Non-endemic\",\" \", IF(COUNTRY_INFO!B37=0,\" \",COUNTRY_INFO!B37))","v":"MANZINI"},{"$f":"IF(INTRO!$E$43=\"Non-endemic\",\" \", IF(COUNTRY_INFO!C37=0,\" \",COUNTRY_INFO!C37))","v":"Kwaluseni"},{"$f":"IF(INTRO!$E$43=\"Non-endemic\", \"Not required\", COUNTRY_INFO!Y37)","v":0},{"$f":"IF(OR(COUNTRY_INFO!R37=\"Unknown\",COUNTRY_INFO!R37=\"Surveillance\",COUNTRY_INFO!R37=\"Not required\",COUNTRY_INFO!R37=0),0,IF($D37<>0, COUNTRY_INFO!R37,0))","v":0},{"$f":"IF(OR(COUNTRY_INFO!S37=\"Unknown\",COUNTRY_INFO!S37=\"Surveillance\",COUNTRY_INFO!S37=\"Not required\",COUNTRY_INFO!S37=0),0,IF($D37<>0, COUNTRY_INFO!S37,0))","v":0},{"$f":"IF(OR(COUNTRY_INFO!T37=\"Unknown\",COUNTRY_INFO!T37=\"Surveillance\",COUNTRY_INFO!T37=\"Not required\",COUNTRY_INFO!T37=0),0,IF($D37<>0, COUNTRY_INFO!T37,0))","v":0},0,null,null,null,null,null,{"$f":"IF($I37<>\"Yes\",$F37*2,($F37+ROUND(J37*$F37/SUM(COUNTRY_INFO!$E37:$G37),0))*2)","v":0},{"$f":"IF($I37<>\"Yes\",$G37*3,($G37+ROUND(J37*$G37/SUM(COUNTRY_INFO!$E37:$G37),0))*3)","v":0},0,null,0]
[{"$f":"IF(INTRO!$E$43=\"Non-endemic\",\" \", IF(COUNTRY_INFO!A38=0,\" \",COUNTRY_INFO!A38))","v":"Eswatini"},{"$f":"IF(INTRO!$E$43=\"Non-endemic\",\" \", IF(COUNTRY_INFO!B38=0,\" \",COUNTRY_INFO!B38))","v":"MANZINI"},{"$f":"IF(INTRO!$E$43=\"Non-endemic\",\" \", IF(COUNTRY_INFO!C38=0,\" \",COUNTRY_INFO!C38))","v":"LaMgabhi"},{"$f":"IF(INTRO!$E$43=\"Non-endemic\", \"Not required\", COUNTRY_INFO!Y38)","v":1},{"$f":"IF(OR(COUNTRY_INFO!R38=\"Unknown\",COUNTRY_INFO!R38=\"Surveillance\",COUNTRY_INFO!R38=\"Not required\",COUNTRY_INFO!R38=0),0,IF($D38<>0, COUNTRY_INFO!R38,0))","v":848},{"$f":"IF(OR(COUNTRY_INFO!S38=\"Unknown\",COUNTRY_INFO!S38=\"Surveillance\",COUNTRY_INFO!S38=\"Not required\",COUNTRY_INFO!S38=0),0,IF($D38<>0, COUNTRY_INFO!S38,0))","v":2802},{"$f":"IF(OR(COUNTRY_INFO!T38=\"Unknown\",COUNTRY_INFO!T38=\"Surveillance\",COUNTRY_INFO!T38=\"Not required\",COUNTRY_INFO!T38=0),0,IF($D38<>0, COUNTRY_INFO!T38,0))","v":7819},11469,null,null,null,null,null,{"$f":"IF($I38<>\"Yes\",$F38*2,($F38+ROUND(J38*$F38/SUM(COUNTRY_INFO!$E38:$G38),0))*2)","v":5604},{"$f":"IF($I38<>\"Yes\",$G38*3,($G38+ROUND(J38*$G38/SUM(COUNTRY_INFO!$E38:$G38),0))*3)","v":23457},29061,null,29061]
[{"$f":"IF(INTRO!$E$43=\"Non-endemic\",\" \", IF(COUNTRY_INFO!A39=0,\" \",COUNTRY_INFO!A39))","v":"Eswatini"},{"$f":"IF(INTRO!$E$43=\"Non-endemic\",\" \", IF(COUNTRY_INFO!B39=0,\" \",COUNTRY_INFO!B39))","v":"MANZINI"},{"$f":"IF(INTRO!$E$43=\"Non-endemic\",\" \", IF(COUNTRY_INFO!C39=0,\" \",COUNTRY_INFO!C39))","v":"Lobamba Lomdzala"},{"$f":"IF(INTRO!$E$43=\"Non-endemic\", \"Not required\", COUNTRY_INFO!Y39)","v":1},{"$f":"IF(OR(COUNTRY_INFO!R39=\"Unknown\",COUNTRY_INFO!R39=\"Surveillance\",COUNTRY_INFO!R39=\"Not required\",COUNTRY_INFO!R39=0),0,IF($D39<>0, COUNTRY_INFO!R39,0))","v":1627},{"$f":"IF(OR(COUNTRY_INFO!S39=\"Unknown\",COUNTRY_INFO!S39=\"Surveillance\",COUNTRY_INFO!S39=\"Not required\",COUNTRY_INFO!S39=0),0,IF($D39<>0, COUNTRY_INFO!S39,0))","v":5378},{"$f":"IF(OR(COUNTRY_INFO!T39=\"Unknown\",COUNTRY_INFO!T39=\"Surveillance\",COUNTRY_INFO!T39=\"Not required\",COUNTRY_INFO!T39=0),0,IF($D39<>0, COUNTRY_INFO!T39,0))","v":15009},22014,null,null,null,null,null,{"$f":"IF($I39<>\"Yes\",$F39*2,($F39+ROUND(J39*$F39/SUM(COUNTRY_INFO!$E39:$G39),0))*2)","v":10756},{"$f":"IF($I39<>\"Yes\",$G39*3,($G39+ROUND(J39*$G39/SUM(COUNTRY_INFO!$E39:$G39),0))*3)","v":45027},55783,null,55783]
[{"$f":"IF(INTRO!$E$43=\"Non-endemic\",\" \", IF(COUNTRY_INFO!A40=0,\" \",COUNTRY_INFO!A40))","v":"Eswatini"},{"$f":"IF(INTRO!$E$43=\"Non-endemic\",\" \", IF(COUNTRY_INFO!B40=0,\" \",COUNTRY_INFO!B40))","v":"MANZINI"},{"$f":"IF(INTRO!$E$43=\"Non-endemic\",\" \", IF(COUNTRY_INFO!C40=0,\" \",COUNTRY_INFO!C40))","v":"Ludzeludze"},{"$f":"IF(INTRO!$E$43=\"Non-endemic\", \"Not required\", COUNTRY_INFO!Y40)","v":1},{"$f":"IF(OR(COUNTRY_INFO!R40=\"Unknown\",COUNTRY_INFO!R40=\"Surveillance\",COUNTRY_INFO!R40=\"Not required\",COUNTRY_INFO!R40=0),0,IF($D40<>0, COUNTRY_INFO!R40,0))","v":1726},{"$f":"IF(OR(COUNTRY_INFO!S40=\"Unknown\",COUNTRY_INFO!S40=\"Surveillance\",COUNTRY_INFO!S40=\"Not required\",COUNTRY_INFO!S40=0),0,IF($D40<>0, COUNTRY_INFO!S40,0))","v":5704},{"$f":"IF(OR(COUNTRY_INFO!T40=\"Unknown\",COUNTRY_INFO!T40=\"Surveillance\",COUNTRY_INFO!T40=\"Not required\",COUNTRY_INFO!T40=0),0,IF($D40<>0, COUNTRY_INFO!T40,0))","v":15918},23348,null,null,null,null,null,{"$f":"IF($I40<>\"Yes\",$F40*2,($F40+ROUND(J40*$F40/SUM(COUNTRY_INFO!$E40:$G40),0))*2)","v":11408},{"$f":"IF($I40<>\"Yes\",$G40*3,($G40+ROUND(J40*$G40/SUM(COUNTRY_INFO!$E40:$G40),0))*3)","v":47754},59162,null,59162]
[{"$f":"IF(INTRO!$E$43=\"Non-endemic\",\" \", IF(COUNTRY_INFO!A41=0,\" \",COUNTRY_INFO!A41))","v":"Eswatini"},{"$f":"IF(INTRO!$E$43=\"Non-endemic\",\" \", IF(COUNTRY_INFO!B41=0,\" \",COUNTRY_INFO!B41))","v":"MANZINI"},{"$f":"IF(INTRO!$E$43=\"Non-endemic\",\" \", IF(COUNTRY_INFO!C41=0,\" \",COUNTRY_INFO!C41))","v":"Mafutseni"},{"$f":"IF(INTRO!$E$43=\"Non-endemic\", \"Not required\", COUNTRY_INFO!Y41)","v":1},{"$f":"IF(OR(COUNTRY_INFO!R41=\"Unknown\",COUNTRY_INFO!R41=\"Surveillance\",COUNTRY_INFO!R41=\"Not required\",COUNTRY_INFO!R41=0),0,IF($D41<>0, COUNTRY_INFO!R41,0))","v":1646},{"$f":"IF(OR(COUNTRY_INFO!S41=\"Unknown\",COUNTRY_INFO!S41=\"Surveillance\",COUNTRY_INFO!S41=\"Not required\",COUNTRY_INFO!S41=0),0,IF($D41<>0, COUNTRY_INFO!S41,0))","v":5442},{"$f":"IF(OR(COUNTRY_INFO!T41=\"Unknown\",COUNTRY_INFO!T41=\"Surveillance\",COUNTRY_INFO!T41=\"Not required\",COUNTRY_INFO!T41=0),0,IF($D41<>0, COUNTRY_INFO!T41,0))","v":15187},22275,null,null,null,null,null,{"$f":"IF($I41<>\"Yes\",$F41*2,($F41+ROUND(J41*$F41/SUM(COUNTRY_INFO!$E41:$G41),0))*2)","v":10884},{"$f":"IF($I41<>\"Yes\",$G41*3,($G41+ROUND(J41*$G41/SUM(COUNTRY_INFO!$E41:$G41),0))*3)","v":45561},56445,null,56445]
[{"$f":"IF(INTRO!$E$43=\"Non-endemic\",\" \", IF(COUNTRY_INFO!A42=0,\" \",COUNTRY_INFO!A42))","v":"Eswatini"},{"$f":"IF(INTRO!$E$43=\"Non-endemic\",\" \", IF(COUNTRY_INFO!B42=0,\" \",COUNTRY_INFO!B42))","v":"MANZINI"},{"$f":"IF(INTRO!$E$43=\"Non-endemic\",\" \", IF(COUNTRY_INFO!C42=0,\" \",COUNTRY_INFO!C42))","v":"Mahlangatsha"},{"$f":"IF(INTRO!$E$43=\"Non-endemic\", \"Not required\", COUNTRY_INFO!Y42)","v":1},{"$f":"IF(OR(COUNTRY_INFO!R42=\"Unknown\",COUNTRY_INFO!R42=\"Surveillance\",COUNTRY_INFO!R42=\"Not required\",COUNTRY_INFO!R42=0),0,IF($D42<>0, COUNTRY_INFO!R42,0))","v":1332},{"$f":"IF(OR(COUNTRY_INFO!S42=\"Unknown\",COUNTRY_INFO!S42=\"Surveillance\",COUNTRY_INFO!S42=\"Not required\",COUNTRY_INFO!S42=0),0,IF($D42<>0, COUNTRY_INFO!S42,0))","v":4403},{"$f":"IF(OR(COUNTRY_INFO!T42=\"Unknown\",COUNTRY_INFO!T42=\"Surveillance\",COUNTRY_INFO!T42=\"Not required\",COUNTRY_INFO!T42=0),0,IF($D42<>0, COUNTRY_INFO!T42,0))","v":12287},18022,null,null,null,null,null,{"$f":"IF($I42<>\"Yes\",$F42*2,($F42+ROUND(J42*$F42/SUM(COUNTRY_INFO!$E42:$G42),0))*2)","v":8806},{"$f":"IF($I42<>\"Yes\",$G42*3,($G42+ROUND(J42*$G42/SUM(COUNTRY_INFO!$E42:$G42),0))*3)","v":36861},45667,null,45667]
[{"$f":"IF(INTRO!$E$43=\"Non-endemic\",\" \", IF(COUNTRY_INFO!A43=0,\" \",COUNTRY_INFO!A43))","v":"Eswatini"},{"$f":"IF(INTRO!$E$43=\"Non-endemic\",\" \", IF(COUNTRY_INFO!B43=0,\" \",COUNTRY_INFO!B43))","v":"MANZINI"},{"$f":"IF(INTRO!$E$43=\"Non-endemic\",\" \", IF(COUNTRY_INFO!C43=0,\" \",COUNTRY_INFO!C43))","v":"Mangcongco"},{"$f":"IF(INTRO!$E$43=\"Non-endemic\", \"Not required\", COUNTRY_INFO!Y43)","v":0},{"$f":"IF(OR(COUNTRY_INFO!R43=\"Unknown\",COUNTRY_INFO!R43=\"Surveillance\",COUNTRY_INFO!R43=\"Not required\",COUNTRY_INFO!R43=0),0,IF($D43<>0, COUNTRY_INFO!R43,0))","v":0},{"$f":"IF(OR(COUNTRY_INFO!S43=\"Unknown\",COUNTRY_INFO!S43=\"Surveillance\",COUNTRY_INFO!S43=\"Not required\",COUNTRY_INFO!S43=0),0,IF($D43<>0, COUNTRY_INFO!S43,0))","v":0},{"$f":"IF(OR(COUNTRY_INFO!T43=\"Unknown\",COUNTRY_INFO!T43=\"Surveillance\",COUNTRY_INFO!T43=\"Not required\",COUNTRY_INFO!T43=0),0,IF($D43<>0, COUNTRY_INFO!T43,0))","v":0},0,null,null,null,null,null,{"$f":"IF($I43<>\"Yes\",$F43*2,($F43+ROUND(J43*$F43/SUM(COUNTRY_INFO!$E43:$G43),0))*2)","v":0},{"$f":"IF($I43<>\"Yes\",$G43*3,($G43+ROUND(J43*$G43/SUM(COUNTRY_INFO!$E43:$G43),0))*3)","v":0},0,null,0]
[{"$f":"IF(INTRO!$E$43=\"Non-endemic\",\" \", IF(COUNTRY_INFO!A44=0,\" \",COUNTRY_INFO!A44))","v":"Eswatini"},{"$f":"IF(INTRO!$E$43=\"Non-endemic\",\" \", IF(COUNTRY_INFO!B44=0,\" \",COUNTRY_INFO!B44))","v":"MANZINI"},{"$f":"IF(INTRO!$E$43=\"Non-endemic\",\" \", IF(COUNTRY_INFO!C44=0,\" \",COUNTRY_INFO!C44))","v":"Manzini North"},{"$f":"IF(INTRO!$E$43=\"Non-endemic\", \"Not required\", COUNTRY_INFO!Y44)","v":1},{"$f":"IF(OR(COUNTRY_INFO!R44=\"Unknown\",COUNTRY_INFO!R44=\"Surveillance\",COUNTRY_INFO!R44=\"Not required\",COUNTRY_INFO!R44=0),0,IF($D44<>0, COUNTRY_INFO!R44,0))","v":2561},{"$f":"IF(OR(COUNTRY_INFO!S44=\"Unknown\",COUNTRY_INFO!S44=\"Surveillance\",COUNTRY_INFO!S44=\"Not required\",COUNTRY_INFO!S44=0),0,IF($D44<>0, COUNTRY_INFO!S44,0))","v":8468},{"$f":"IF(OR(COUNTRY_INFO!T44=\"Unknown\",COUNTRY_INFO!T44=\"Surveillance\",COUNTRY_INFO!T44=\"Not required\",COUNTRY_INFO!T44=0),0,IF($D44<>0, COUNTRY_INFO!T44,0))","v":23632},34661,null,null,null,null,null,{"$f":"IF($I44<>\"Yes\",$F44*2,($F44+ROUND(J44*$F44/SUM(COUNTRY_INFO!$E44:$G44),0))*2)","v":16936},{"$f":"IF($I44<>\"Yes\",$G44*3,($G44+ROUND(J44*$G44/SUM(COUNTRY_INFO!$E44:$G44),0))*3)","v":70896},87832,null,87832]
[{"$f":"IF(INTRO!$E$43=\"Non-endemic\",\" \", IF(COUNTRY_INFO!A45=0,\" \",COUNTRY_INFO!A45))","v":"Eswatini"},{"$f":"IF(INTRO!$E$43=\"Non-endemic\",\" \", IF(COUNTRY_INFO!B45=0,\" \",COUNTRY_INFO!B45))","v":"MANZINI"},{"$f":"IF(INTRO!$E$43=\"Non-endemic\",\" \", IF(COUNTRY_INFO!C45=0,\" \",COUNTRY_INFO!C45))","v":"Manzini South"},{"$f":"IF(INTRO!$E$43=\"Non-endemic\", \"Not required\", COUNTRY_INFO!Y45)","v":1},{"$f":"IF(OR(COUNTRY_INFO!R45=\"Unknown\",COUNTRY_INFO!R45=\"Surveillance\",COUNTRY_INFO!R45=\"Not required\",COUNTRY_INFO!R45=0),0,IF($D45<>0, COUNTRY_INFO!R45,0))","v":1950},{"$f":"IF(OR(COUNTRY_INFO!S45=\"Unknown\",COUNTRY_INFO!S45=\"Surveillance\",COUNTRY_INFO!S45=\"Not required\",COUNTRY_INFO!S45=0),0,IF($D45<>0, COUNTRY_INFO!S45,0))","v":6445},{"$f":"IF(OR(COUNTRY_INFO!T45=\"Unknown\",COUNTRY_INFO!T45=\"Surveillance\",COUNTRY_INFO!T45=\"Not required\",COUNTRY_INFO!T45=0),0,IF($D45<>0, COUNTRY_INFO!T45,0))","v":17986},26381,null,null,null,null,null,{"$f":"IF($I45<>\"Yes\",$F45*2,($F45+ROUND(J45*$F45/SUM(COUNTRY_INFO!$E45:$G45),0))*2)","v":12890},{"$f":"IF($I45<>\"Yes\",$G45*3,($G45+ROUND(J45*$G45/SUM(COUNTRY_INFO!$E45:$G45),0))*3)","v":53958},66848,null,66848]
[{"$f":"IF(INTRO!$E$43=\"Non-endemic\",\" \", IF(COUNTRY_INFO!A46=0,\" \",COUNTRY_INFO!A46))","v":"Eswatini"},{"$f":"IF(INTRO!$E$43=\"Non-endemic\",\" \", IF(COUNTRY_INFO!B46=0,\" \",COUNTRY_INFO!B46))","v":"MANZINI"},{"$f":"IF(INTRO!$E$43=\"Non-endemic\",\" \", IF(COUNTRY_INFO!C46=0,\" \",COUNTRY_INFO!C46))","v":"Mhlambanyatsi"},{"$f":"IF(INTRO!$E$43=\"Non-endemic\", \"Not required\", COUNTRY_INFO!Y46)","v":0},{"$f":"IF(OR(COUNTRY_INFO!R46=\"Unknown\",COUNTRY_INFO!R46=\"Surveillance\",COUNTRY_INFO!R46=\"Not required\",COUNTRY_INFO!R46=0),0,IF($D46<>0, COUNTRY_INFO!R46,0))","v":0},{"$f":"IF(OR(COUNTRY_INFO!S46=\"Unknown\",COUNTRY_INFO!S46=\"Surveillance\",COUNTRY_INFO!S46=\"Not required\",COUNTRY_INFO!S46=0),0,IF($D46<>0, COUNTRY_INFO!S46,0))","v":0},{"$f":"IF(OR(COUNTRY_INFO!T46=\"Unknown\",COUNTRY_INFO!T46=\"Surveillance\",COUNTRY_INFO!T46=\"Not required\",COUNTRY_INFO!T46=0),0,IF($D46<>0, COUNTRY_INFO!T46,0))","v":0},0,null,null,null,null,null,{"$f":"IF($I46<>\"Yes\",$F46*2,($F46+ROUND(J46*$F46/SUM(COUNTRY_INFO!$E46:$G46),0))*2)","v":0},{"$f":"IF($I46<>\"Yes\",$G46*3,($G46+ROUND(J46*$G46/SUM(COUNTRY_INFO!$E46:$G46),0))*3)","v":0},0,null,0]
[{"$f":"IF(INTRO!$E$43=\"Non-endemic\",\" \", IF(COUNTRY_INFO!A47=0,\" \",COUNTRY_INFO!A47))","v":"Eswatini"},{"$f":"IF(INTRO!$E$43=\"Non-endemic\",\" \", IF(COUNTRY_INFO!B47=0,\" \",COUNTRY_INFO!B47))","v":"MANZINI"},{"$f":"IF(INTRO!$E$43=\"Non-endemic\",\" \", IF(COUNTRY_INFO!C47=0,\" \",COUNTRY_INFO!C47))","v":"Mkhiweni"},{"$f":"IF(INTRO!$E$43=\"Non-endemic\", \"Not required\", COUNTRY_INFO!Y47)","v":1},{"$f":"IF(OR(COUNTRY_INFO!R47=\"Unknown\",COUNTRY_INFO!R47=\"Surveillance\",COUNTRY_INFO!R47=\"Not required\",COUNTRY_INFO!R47=0),0,IF($D47<>0, COUNTRY_INFO!R47,0))","v":1769},{"$f":"IF(OR(COUNTRY_INFO!S47=\"Unknown\",COUNTRY_INFO!S47=\"Surveillance\",COUNTRY_INFO!S47=\"Not required\",COUNTRY_INFO!S47=0),0,IF($D47<>0, COUNTRY_INFO!S47,0))","v":5849},{"$f":"IF(OR(COUNTRY_INFO!T47=\"Unknown\",COUNTRY_INFO!T47=\"Surveillance\",COUNTRY_INFO!T47=\"Not required\",COUNTRY_INFO!T47=0),0,IF($D47<>0, COUNTRY_INFO!T47,0))","v":16324},23942,null,null,null,null,null,{"$f":"IF($I47<>\"Yes\",$F47*2,($F47+ROUND(J47*$F47/SUM(COUNTRY_INFO!$E47:$G47),0))*2)","v":11698},{"$f":"IF($I47<>\"Yes\",$G47*3,($G47+ROUND(J47*$G47/SUM(COUNTRY_INFO!$E47:$G47),0))*3)","v":48972},60670,null,60670]
[{"$f":"IF(INTRO!$E$43=\"Non-endemic\",\" \", IF(COUNTRY_INFO!A48=0,\" \",COUNTRY_INFO!A48))","v":"Eswatini"},{"$f":"IF(INTRO!$E$43=\"Non-endemic\",\" \", IF(COUNTRY_INFO!B48=0,\" \",COUNTRY_INFO!B48))","v":"MANZINI"},{"$f":"IF(INTRO!$E$43=\"Non-endemic\",\" \", IF(COUNTRY_INFO!C48=0,\" \",COUNTRY_INFO!C48))","v":"Mtfongwaneni"},{"$f":"IF(INTRO!$E$43=\"Non-endemic\", \"Not required\", COUNTRY_INFO!Y48)","v":0},{"$f":"IF(OR(COUNTRY_INFO!R48=\"Unknown\",COUNTRY_INFO!R48=\"Surveillance\",COUNTRY_INFO!R48=\"Not required\",COUNTRY_INFO!R48=0),0,IF($D48<>0, COUNTRY_INFO!R48,0))","v":0},{"$f":"IF(OR(COUNTRY_INFO!S48=\"Unknown\",COUNTRY_INFO!S48=\"Surveillance\",COUNTRY_INFO!S48=\"Not required\",COUNTRY_INFO!S48=0),0,IF($D48<>0, COUNTRY_INFO!S48,0))","v":0},{"$f":"IF(OR(COUNTRY_INFO!T48=\"Unknown\",COUNTRY_INFO!T48=\"Surveillance\",COUNTRY_INFO!T48=\"Not required\",COUNTRY_INFO!T48=0),0,IF($D48<>0, COUNTRY_INFO!T48,0))","v":0},0,null,null,null,null,null,{"$f":"IF($I48<>\"Yes\",$F48*2,($F48+ROUND(J48*$F48/SUM(COUNTRY_INFO!$E48:$G48),0))*2)","v":0},{"$f":"IF($I48<>\"Yes\",$G48*3,($G48+ROUND(J48*$G48/SUM(COUNTRY_INFO!$E48:$G48),0))*3)","v":0},0,null,0]
[{"$f":"IF(INTRO!$E$43=\"Non-endemic\",\" \", IF(COUNTRY_INFO!A49=0,\" \",COUNTRY_INFO!A49))","v":"Eswatini"},{"$f":"IF(INTRO!$E$43=\"Non-endemic\",\" \", IF(COUNTRY_INFO!B49=0,\" \",COUNTRY_INFO!B49))","v":"MANZINI"},{"$f":"IF(INTRO!$E$43=\"Non-endemic\",\" \", IF(COUNTRY_INFO!C49=0,\" \",COUNTRY_INFO!C49))","v":"Ngwemphisi"},{"$f":"IF(INTRO!$E$43=\"Non-endemic\", \"Not required\", COUNTRY_INFO!Y49)","v":1},{"$f":"IF(OR(COUNTRY_INFO!R49=\"Unknown\",COUNTRY_INFO!R49=\"Surveillance\",COUNTRY_INFO!R49=\"Not required\",COUNTRY_INFO!R49=0),0,IF($D49<>0, COUNTRY_INFO!R49,0))","v":1473},{"$f":"IF(OR(COUNTRY_INFO!S49=\"Unknown\",COUNTRY_INFO!S49=\"Surveillance\",COUNTRY_INFO!S49=\"Not required\",COUNTRY_INFO!S49=0),0,IF($D49<>0, COUNTRY_INFO!S49,0))","v":4869},{"$f":"IF(OR(COUNTRY_INFO!T49=\"Unknown\",COUNTRY_INFO!T49=\"Surveillance\",COUNTRY_INFO!T49=\"Not required\",COUNTRY_INFO!T49=0),0,IF($D49<>0, COUNTRY_INFO!T49,0))","v":13588},19930,null,null,null,null,null,{"$f":"IF($I49<>\"Yes\",$F49*2,($F49+ROUND(J49*$F49/SUM(COUNTRY_INFO!$E49:$G49),0))*2)","v":9738},{"$f":"IF($I49<>\"Yes\",$G49*3,($G49+ROUND(J49*$G49/SUM(COUNTRY_INFO!$E49:$G49),0))*3)","v":40764},50502,null,50502]
[{"$f":"IF(INTRO!$E$43=\"Non-endemic\",\" \", IF(COUNTRY_INFO!A50=0,\" \",COUNTRY_INFO!A50))","v":"Eswatini"},{"$f":"IF(INTRO!$E$43=\"Non-endemic\",\" \", IF(COUNTRY_INFO!B50=0,\" \",COUNTRY_INFO!B50))","v":"MANZINI"},{"$f":"IF(INTRO!$E$43=\"Non-endemic\",\" \", IF(COUNTRY_INFO!C50=0,\" \",COUNTRY_INFO!C50))","v":"Nhlambeni"},{"$f":"IF(INTRO!$E$43=\"Non-endemic\", \"Not required\", COUNTRY_INFO!Y50)","v":1},{"$f":"IF(OR(COUNTRY_INFO!R50=\"Unknown\",COUNTRY_INFO!R50=\"Surveillance\",COUNTRY_INFO!R50=\"Not required\",COUNTRY_INFO!R50=0),0,IF($D50<>0, COUNTRY_INFO!R50,0))","v":943},{"$f":"IF(OR(COUNTRY_INFO!S50=\"Unknown\",COUNTRY_INFO!S50=\"Surveillance\",COUNTRY_INFO!S50=\"Not required\",COUNTRY_INFO!S50=0),0,IF($D50<>0, COUNTRY_INFO!S50,0))","v":3116},{"$f":"IF(OR(COUNTRY_INFO!T50=\"Unknown\",COUNTRY_INFO!T50=\"Surveillance\",COUNTRY_INFO!T50=\"Not required\",COUNTRY_INFO!T50=0),0,IF($D50<>0, COUNTRY_INFO!T50,0))","v":8696},12755,null,null,null,null,null,{"$f":"IF($I50<>\"Yes\",$F50*2,($F50+ROUND(J50*$F50/SUM(COUNTRY_INFO!$E50:$G50),0))*2)","v":6232},{"$f":"IF($I50<>\"Yes\",$G50*3,($G50+ROUND(J50*$G50/SUM(COUNTRY_INFO!$E50:$G50),0))*3)","v":26088},32320,null,32320]
[{"$f":"IF(INTRO!$E$43=\"Non-endemic\",\" \", IF(COUNTRY_INFO!A51=0,\" \",COUNTRY_INFO!A51))","v":"Eswatini"},{"$f":"IF(INTRO!$E$43=\"Non-endemic\",\" \", IF(COUNTRY_INFO!B51=0,\" \",COUNTRY_INFO!B51))","v":"MANZINI"},{"$f":"IF(INTRO!$E$43=\"Non-endemic\",\" \", IF(COUNTRY_INFO!C51=0,\" \",COUNTRY_INFO!C51))","v":"Ntondozi"},{"$f":"IF(INTRO!$E$43=\"Non-endemic\", \"Not required\", COUNTRY_INFO!Y51)","v":1},{"$f":"IF(OR(COUNTRY_INFO!R51=\"Unknown\",COUNTRY_INFO!R51=\"Surveillance\",COUNTRY_INFO!R51=\"Not required\",COUNTRY_INFO!R51=0),0,IF($D51<>0, COUNTRY_INFO!R51,0))","v":1103},{"$f":"IF(OR(COUNTRY_INFO!S51=\"Unknown\",COUNTRY_INFO!S51=\"Surveillance\",COUNTRY_INFO!S51=\"Not required\",COUNTRY_INFO!S51=0),0,IF($D51<>0, COUNTRY_INFO!S51,0))","v":3647},{"$f":"IF(OR(COUNTRY_INFO!T51=\"Unknown\",COUNTRY_INFO!T51=\"Surveillance\",COUNTRY_INFO!T51=\"Not required\",COUNTRY_INFO!T51=0),0,IF($D51<>0, COUNTRY_INFO!T51,0))","v":10179},14929,null,null,null,null,null,{"$f":"IF($I51<>\"Yes\",$F51*2,($F51+ROUND(J51*$F51/SUM(COUNTRY_INFO!$E51:$G51),0))*2)","v":7294},{"$f":"IF($I51<>\"Yes\",$G51*3,($G51+ROUND(J51*$G51/SUM(COUNTRY_INFO!$E51:$G51),0))*3)","v":30537},37831,null,37831]
[{"$f":"IF(INTRO!$E$43=\"Non-endemic\",\" \", IF(COUNTRY_INFO!A52=0,\" \",COUNTRY_INFO!A52))","v":"Eswatini"},{"$f":"IF(INTRO!$E$43=\"Non-endemic\",\" \", IF(COUNTRY_INFO!B52=0,\" \",COUNTRY_INFO!B52))","v":"MANZINI"},{"$f":"IF(INTRO!$E$43=\"Non-endemic\",\" \", IF(COUNTRY_INFO!C52=0,\" \",COUNTRY_INFO!C52))","v":"Nkomiyahlaba"},{"$f":"IF(INTRO!$E$43=\"Non-endemic\", \"Not required\", COUNTRY_INFO!Y52)","v":1},{"$f":"IF(OR(COUNTRY_INFO!R52=\"Unknown\",COUNTRY_INFO!R52=\"Surveillance\",COUNTRY_INFO!R52=\"Not required\",COUNTRY_INFO!R52=0),0,IF($D52<>0, COUNTRY_INFO!R52,0))","v":1035},{"$f":"IF(OR(COUNTRY_INFO!S52=\"Unknown\",COUNTRY_INFO!S52=\"Surveillance\",COUNTRY_INFO!S52=\"Not required\",COUNTRY_INFO!S52=0),0,IF($D52<>0, COUNTRY_INFO!S52,0))","v":3421},{"$f":"IF(OR(COUNTRY_INFO!T52=\"Unknown\",COUNTRY_INFO!T52=\"Surveillance\",COUNTRY_INFO!T52=\"Not required\",COUNTRY_INFO!T52=0),0,IF($D52<>0, COUNTRY_INFO!T52,0))","v":9548},14004,null,null,null,null,null,{"$f":"IF($I52<>\"Yes\",$F52*2,($F52+ROUND(J52*$F52/SUM(COUNTRY_INFO!$E52:$G52),0))*2)","v":6842},{"$f":"IF($I52<>\"Yes\",$G52*3,($G52+ROUND(J52*$G52/SUM(COUNTRY_INFO!$E52:$G52),0))*3)","v":28644},35486,null,35486]
[{"$f":"IF(INTRO!$E$43=\"Non-endemic\",\" \", IF(COUNTRY_INFO!A53=0,\" \",COUNTRY_INFO!A53))","v":"Eswatini"},{"$f":"IF(INTRO!$E$43=\"Non-endemic\",\" \", IF(COUNTRY_INFO!B53=0,\" \",COUNTRY_INFO!B53))","v":"MANZINI"},{"$f":"IF(INTRO!$E$43=\"Non-endemic\",\" \", IF(COUNTRY_INFO!C53=0,\" \",COUNTRY_INFO!C53))","v":"Phondo"},{"$f":"IF(INTRO!$E$43=\"Non-endemic\", \"Not required\", COUNTRY_INFO!Y53)","v":1},{"$f":"IF(OR(COUNTRY_INFO!R53=\"Unknown\",COUNTRY_INFO!R53=\"Surveillance\",COUNTRY_INFO!R53=\"Not required\",COUNTRY_INFO!R53=0),0,IF($D53<>0, COUNTRY_INFO!R53,0))","v":1736},{"$f":"IF(OR(COUNTRY_INFO!S53=\"Unknown\",COUNTRY_INFO!S53=\"Surveillance\",COUNTRY_INFO!S53=\"Not required\",COUNTRY_INFO!S53=0),0,IF($D53<>0, COUNTRY_INFO!S53,0))","v":5739},{"$f":"IF(OR(COUNTRY_INFO!T53=\"Unknown\",COUNTRY_INFO!T53=\"Surveillance\",COUNTRY_INFO!T53=\"Not required\",COUNTRY_INFO!T53=0),0,IF($D53<>0, COUNTRY_INFO!T53,0))","v":16015},23490,null,null,null,null,null,{"$f":"IF($I53<>\"Yes\",$F53*2,($F53+ROUND(J53*$F53/SUM(COUNTRY_INFO!$E53:$G53),0))*2)","v":11478},{"$f":"IF($I53<>\"Yes\",$G53*3,($G53+ROUND(J53*$G53/SUM(COUNTRY_INFO!$E53:$G53),0))*3)","v":48045},59523,null,59523]
[{"$f":"IF(INTRO!$E$43=\"Non-endemic\",\" \", IF(COUNTRY_INFO!A54=0,\" \",COUNTRY_INFO!A54))","v":"Eswatini"},{"$f":"IF(INTRO!$E$43=\"Non-endemic\",\" \", IF(COUNTRY_INFO!B54=0,\" \",COUNTRY_INFO!B54))","v":"SHISELWENI"},{"$f":"IF(INTRO!$E$43=\"Non-endemic\",\" \", IF(COUNTRY_INFO!C54=0,\" \",COUNTRY_INFO!C54))","v":"Gege"},{"$f":"IF(INTRO!$E$43=\"Non-endemic\", \"Not required\", COUNTRY_INFO!Y54)","v":0},{"$f":"IF(OR(COUNTRY_INFO!R54=\"Unknown\",COUNTRY_INFO!R54=\"Surveillance\",COUNTRY_INFO!R54=\"Not required\",COUNTRY_INFO!R54=0),0,IF($D54<>0, COUNTRY_INFO!R54,0))","v":0},{"$f":"IF(OR(COUNTRY_INFO!S54=\"Unknown\",COUNTRY_INFO!S54=\"Surveillance\",COUNTRY_INFO!S54=\"Not required\",COUNTRY_INFO!S54=0),0,IF($D54<>0, COUNTRY_INFO!S54,0))","v":0},{"$f":"IF(OR(COUNTRY_INFO!T54=\"Unknown\",COUNTRY_INFO!T54=\"Surveillance\",COUNTRY_INFO!T54=\"Not required\",COUNTRY_INFO!T54=0),0,IF($D54<>0, COUNTRY_INFO!T54,0))","v":0},0,null,null,null,null,null,{"$f":"IF($I54<>\"Yes\",$F54*2,($F54+ROUND(J54*$F54/SUM(COUNTRY_INFO!$E54:$G54),0))*2)","v":0},{"$f":"IF($I54<>\"Yes\",$G54*3,($G54+ROUND(J54*$G54/SUM(COUNTRY_INFO!$E54:$G54),0))*3)","v":0},0,null,0]
[{"$f":"IF(INTRO!$E$43=\"Non-endemic\",\" \", IF(COUNTRY_INFO!A55=0,\" \",COUNTRY_INFO!A55))","v":"Eswatini"},{"$f":"IF(INTRO!$E$43=\"Non-endemic\",\" \", IF(COUNTRY_INFO!B55=0,\" \",COUNTRY_INFO!B55))","v":"SHISELWENI"},{"$f":"IF(INTRO!$E$43=\"Non-endemic\",\" \", IF(COUNTRY_INFO!C55=0,\" \",COUNTRY_INFO!C55))","v":"Hosea"},{"$f":"IF(INTRO!$E$43=\"Non-endemic\", \"Not required\", COUNTRY_INFO!Y55)","v":1},{"$f":"IF(OR(COUNTRY_INFO!R55=\"Unknown\",COUNTRY_INFO!R55=\"Surveillance\",COUNTRY_INFO!R55=\"Not required\",COUNTRY_INFO!R55=0),0,IF($D55<>0, COUNTRY_INFO!R55,0))","v":1098},{"$f":"IF(OR(COUNTRY_INFO!S55=\"Unknown\",COUNTRY_INFO!S55=\"Surveillance\",COUNTRY_INFO!S55=\"Not required\",COUNTRY_INFO!S55=0),0,IF($D55<>0, COUNTRY_INFO!S55,0))","v":3628},{"$f":"IF(OR(COUNTRY_INFO!T55=\"Unknown\",COUNTRY_INFO!T55=\"Surveillance\",COUNTRY_INFO!T55=\"Not required\",COUNTRY_INFO!T55=0),0,IF($D55<>0, COUNTRY_INFO!T55,0))","v":10126},14852,null,null,null,null,null,{"$f":"IF($I55<>\"Yes\",$F55*2,($F55+ROUND(J55*$F55/SUM(COUNTRY_INFO!$E55:$G55),0))*2)","v":7256},{"$f":"IF($I55<>\"Yes\",$G55*3,($G55+ROUND(J55*$G55/SUM(COUNTRY_INFO!$E55:$G55),0))*3)","v":30378},37634,null,37634]
[{"$f":"IF(INTRO!$E$43=\"Non-endemic\",\" \", IF(COUNTRY_INFO!A56=0,\" \",COUNTRY_INFO!A56))","v":"Eswatini"},{"$f":"IF(INTRO!$E$43=\"Non-endemic\",\" \", IF(COUNTRY_INFO!B56=0,\" \",COUNTRY_INFO!B56))","v":"SHISELWENI"},{"$f":"IF(INTRO!$E$43=\"Non-endemic\",\" \", IF(COUNTRY_INFO!C56=0,\" \",COUNTRY_INFO!C56))","v":"Khubutha"},{"$f":"IF(INTRO!$E$43=\"Non-endemic\", \"Not required\", COUNTRY_INFO!Y56)","v":1},{"$f":"IF(OR(COUNTRY_INFO!R56=\"Unknown\",COUNTRY_INFO!R56=\"Surveillance\",COUNTRY_INFO!R56=\"Not required\",COUNTRY_INFO!R56=0),0,IF($D56<>0, COUNTRY_INFO!R56,0))","v":436},{"$f":"IF(OR(COUNTRY_INFO!S56=\"Unknown\",COUNTRY_INFO!S56=\"Surveillance\",COUNTRY_INFO!S56=\"Not required\",COUNTRY_INFO!S56=0),0,IF($D56<>0, COUNTRY_INFO!S56,0))","v":1441},{"$f":"IF(OR(COUNTRY_INFO!T56=\"Unknown\",COUNTRY_INFO!T56=\"Surveillance\",COUNTRY_INFO!T56=\"Not required\",COUNTRY_INFO!T56=0),0,IF($D56<>0, COUNTRY_INFO!T56,0))","v":4022},5899,null,null,null,null,null,{"$f":"IF($I56<>\"Yes\",$F56*2,($F56+ROUND(J56*$F56/SUM(COUNTRY_INFO!$E56:$G56),0))*2)","v":2882},{"$f":"IF($I56<>\"Yes\",$G56*3,($G56+ROUND(J56*$G56/SUM(COUNTRY_INFO!$E56:$G56),0))*3)","v":12066},14948,null,14948]
[{"$f":"IF(INTRO!$E$43=\"Non-endemic\",\" \", IF(COUNTRY_INFO!A57=0,\" \",COUNTRY_INFO!A57))","v":"Eswatini"},{"$f":"IF(INTRO!$E$43=\"Non-endemic\",\" \", IF(COUNTRY_INFO!B57=0,\" \",COUNTRY_INFO!B57))","v":"SHISELWENI"},{"$f":"IF(INTRO!$E$43=\"Non-endemic\",\" \", IF(COUNTRY_INFO!C57=0,\" \",COUNTRY_INFO!C57))","v":"Maseyisini"},{"$f":"IF(INTRO!$E$43=\"Non-endemic\", \"Not required\", COUNTRY_INFO!Y57)","v":1},{"$f":"IF(OR(COUNTRY_INFO!R57=\"Unknown\",COUNTRY_INFO!R57=\"Surveillance\",COUNTRY_INFO!R57=\"Not required\",COUNTRY_INFO!R57=0),0,IF($D57<>0, COUNTRY_INFO!R57,0))","v":2206},{"$f":"IF(OR(COUNTRY_INFO!S57=\"Unknown\",COUNTRY_INFO!S57=\"Surveillance\",COUNTRY_INFO!S57=\"Not required\",COUNTRY_INFO!S57=0),0,IF($D57<>0, COUNTRY_INFO!S57,0))","v":7291},{"$f":"IF(OR(COUNTRY_INFO!T57=\"Unknown\",COUNTRY_INFO!T57=\"Surveillance\",COUNTRY_INFO!T57=\"Not required\",COUNTRY_INFO!T57=0),0,IF($D57<>0, COUNTRY_INFO!T57,0))","v":20347},29844,null,null,null,null,null,{"$f":"IF($I57<>\"Yes\",$F57*2,($F57+ROUND(J57*$F57/SUM(COUNTRY_INFO!$E57:$G57),0))*2)","v":14582},{"$f":"IF($I57<>\"Yes\",$G57*3,($G57+ROUND(J57*$G57/SUM(COUNTRY_INFO!$E57:$G57),0))*3)","v":61041},75623,null,75623]
[{"$f":"IF(INTRO!$E$43=\"Non-endemic\",\" \", IF(COUNTRY_INFO!A58=0,\" \",COUNTRY_INFO!A58))","v":"Eswatini"},{"$f":"IF(INTRO!$E$43=\"Non-endemic\",\" \", IF(COUNTRY_INFO!B58=0,\" \",COUNTRY_INFO!B58))","v":"SHISELWENI"},{"$f":"IF(INTRO!$E$43=\"Non-endemic\",\" \", IF(COUNTRY_INFO!C58=0,\" \",COUNTRY_INFO!C58))","v":"Matsanjeni South"},{"$f":"IF(INTRO!$E$43=\"Non-endemic\", \"Not required\", COUNTRY_INFO!Y58)","v":0},{"$f":"IF(OR(COUNTRY_INFO!R58=\"Unknown\",COUNTRY_INFO!R58=\"Surveillance\",COUNTRY_INFO!R58=\"Not required\",COUNTRY_INFO!R58=0),0,IF($D58<>0, COUNTRY_INFO!R58,0))","v":0},{"$f":"IF(OR(COUNTRY_INFO!S58=\"Unknown\",COUNTRY_INFO!S58=\"Surveillance\",COUNTRY_INFO!S58=\"Not required\",COUNTRY_INFO!S58=0),0,IF($D58<>0, COUNTRY_INFO!S58,0))","v":0},{"$f":"IF(OR(COUNTRY_INFO!T58=\"Unknown\",COUNTRY_INFO!T58=\"Surveillance\",COUNTRY_INFO!T58=\"Not required\",COUNTRY_INFO!T58=0),0,IF($D58<>0, COUNTRY_INFO!T58,0))","v":0},0,null,null,null,null,null,{"$f":"IF($I58<>\"Yes\",$F58*2,($F58+ROUND(J58*$F58/SUM(COUNTRY_INFO!$E58:$G58),0))*2)","v":0},{"$f":"IF($I58<>\"Yes\",$G58*3,($G58+ROUND(J58*$G58/SUM(COUNTRY_INFO!$E58:$G58),0))*3)","v":0},0,null,0]
[{"$f":"IF(INTRO!$E$43=\"Non-endemic\",\" \", IF(COUNTRY_INFO!A59=0,\" \",COUNTRY_INFO!A59))","v":"Eswatini"},{"$f":"IF(INTRO!$E$43=\"Non-endemic\",\" \", IF(COUNTRY_INFO!B59=0,\" \",COUNTRY_INFO!B59))","v":"SHISELWENI"},{"$f":"IF(INTRO!$E$43=\"Non-endemic\",\" \", IF(COUNTRY_INFO!C59=0,\" \",COUNTRY_INFO!C59))","v":"Methula"},{"$f":"IF(INTRO!$E$43=\"Non-endemic\", \"Not required\", COUNTRY_INFO!Y59)","v":1},{"$f":"IF(OR(COUNTRY_INFO!R59=\"Unknown\",COUNTRY_INFO!R59=\"Surveillance\",COUNTRY_INFO!R59=\"Not required\",COUNTRY_INFO!R59=0),0,IF($D59<>0, COUNTRY_INFO!R59,0))","v":1335},{"$f":"IF(OR(COUNTRY_INFO!S59=\"Unknown\",COUNTRY_INFO!S59=\"Surveillance\",COUNTRY_INFO!S59=\"Not required\",COUNTRY_INFO!S59=0),0,IF($D59<>0, COUNTRY_INFO!S59,0))","v":4413},{"$f":"IF(OR(COUNTRY_INFO!T59=\"Unknown\",COUNTRY_INFO!T59=\"Surveillance\",COUNTRY_INFO!T59=\"Not required\",COUNTRY_INFO!T59=0),0,IF($D59<>0, COUNTRY_INFO!T59,0))","v":12315},18063,null,null,null,null,null,{"$f":"IF($I59<>\"Yes\",$F59*2,($F59+ROUND(J59*$F59/SUM(COUNTRY_INFO!$E59:$G59),0))*2)","v":8826},{"$f":"IF($I59<>\"Yes\",$G59*3,($G59+ROUND(J59*$G59/SUM(COUNTRY_INFO!$E59:$G59),0))*3)","v":36945},45771,null,45771]
[{"$f":"IF(INTRO!$E$43=\"Non-endemic\",\" \", IF(COUNTRY_INFO!A60=0,\" \",COUNTRY_INFO!A60))","v":"Eswatini"},{"$f":"IF(INTRO!$E$43=\"Non-endemic\",\" \", IF(COUNTRY_INFO!B60=0,\" \",COUNTRY_INFO!B60))","v":"SHISELWENI"},{"$f":"IF(INTRO!$E$43=\"Non-endemic\",\" \", IF(COUNTRY_INFO!C60=0,\" \",COUNTRY_INFO!C60))","v":"Mbangweni/Shiselweni 2"},{"$f":"IF(INTRO!$E$43=\"Non-endemic\", \"Not required\", COUNTRY_INFO!Y60)","v":1},{"$f":"IF(OR(COUNTRY_INFO!R60=\"Unknown\",COUNTRY_INFO!R60=\"Surveillance\",COUNTRY_INFO!R60=\"Not required\",COUNTRY_INFO!R60=0),0,IF($D60<>0, COUNTRY_INFO!R60,0))","v":2408},{"$f":"IF(OR(COUNTRY_INFO!S60=\"Unknown\",COUNTRY_INFO!S60=\"Surveillance\",COUNTRY_INFO!S60=\"Not required\",COUNTRY_INFO!S60=0),0,IF($D60<>0, COUNTRY_INFO!S60,0))","v":7959},{"$f":"IF(OR(COUNTRY_INFO!T60=\"Unknown\",COUNTRY_INFO!T60=\"Surveillance\",COUNTRY_INFO!T60=\"Not required\",COUNTRY_INFO!T60=0),0,IF($D60<>0, COUNTRY_INFO!T60,0))","v":22212},32579,null,null,null,null,null,{"$f":"IF($I60<>\"Yes\",$F60*2,($F60+ROUND(J60*$F60/SUM(COUNTRY_INFO!$E60:$G60),0))*2)","v":15918},{"$f":"IF($I60<>\"Yes\",$G60*3,($G60+ROUND(J60*$G60/SUM(COUNTRY_INFO!$E60:$G60),0))*3)","v":66636},82554,null,82554]
[{"$f":"IF(INTRO!$E$43=\"Non-endemic\",\" \", IF(COUNTRY_INFO!A61=0,\" \",COUNTRY_INFO!A61))","v":"Eswatini"},{"$f":"IF(INTRO!$E$43=\"Non-endemic\",\" \", IF(COUNTRY_INFO!B61=0,\" \",COUNTRY_INFO!B61))","v":"SHISELWENI"},{"$f":"IF(INTRO!$E$43=\"Non-endemic\",\" \", IF(COUNTRY_INFO!C61=0,\" \",COUNTRY_INFO!C61))","v":"Mtsambama"},{"$f":"IF(INTRO!$E$43=\"Non-endemic\", \"Not required\", COUNTRY_INFO!Y61)","v":1},{"$f":"IF(OR(COUNTRY_INFO!R61=\"Unknown\",COUNTRY_INFO!R61=\"Surveillance\",COUNTRY_INFO!R61=\"Not required\",COUNTRY_INFO!R61=0),0,IF($D61<>0, COUNTRY_INFO!R61,0))","v":1354},{"$f":"IF(OR(COUNTRY_INFO!S61=\"Unknown\",COUNTRY_INFO!S61=\"Surveillance\",COUNTRY_INFO!S61=\"Not required\",COUNTRY_INFO!S61=0),0,IF($D61<>0, COUNTRY_INFO!S61,0))","v":4476},{"$f":"IF(OR(COUNTRY_INFO!T61=\"Unknown\",COUNTRY_INFO!T61=\"Surveillance\",COUNTRY_INFO!T61=\"Not required\",COUNTRY_INFO!T61=0),0,IF($D61<>0, COUNTRY_INFO!T61,0))","v":12492},18322,null,null,null,null,null,{"$f":"IF($I61<>\"Yes\",$F61*2,($F61+ROUND(J61*$F61/SUM(COUNTRY_INFO!$E61:$G61),0))*2)","v":8952},{"$f":"IF($I61<>\"Yes\",$G61*3,($G61+ROUND(J61*$G61/SUM(COUNTRY_INFO!$E61:$G61),0))*3)","v":37476},46428,null,46428]
[{"$f":"IF(INTRO!$E$43=\"Non-endemic\",\" \", IF(COUNTRY_INFO!A62=0,\" \",COUNTRY_INFO!A62))","v":"Eswatini"},{"$f":"IF(INTRO!$E$43=\"Non-endemic\",\" \", IF(COUNTRY_INFO!B62=0,\" \",COUNTRY_INFO!B62))","v":"SHISELWENI"},{"$f":"IF(INTRO!$E$43=\"Non-endemic\",\" \", IF(COUNTRY_INFO!C62=0,\" \",COUNTRY_INFO!C62))","v":"Ngudzeni"},{"$f":"IF(INTRO!$E$43=\"Non-endemic\", \"Not required\", COUNTRY_INFO!Y62)","v":1},{"$f":"IF(OR(COUNTRY_INFO!R62=\"Unknown\",COUNTRY_INFO!R62=\"Surveillance\",COUNTRY_INFO!R62=\"Not required\",COUNTRY_INFO!R62=0),0,IF($D62<>0, COUNTRY_INFO!R62,0))","v":661},{"$f":"IF(OR(COUNTRY_INFO!S62=\"Unknown\",COUNTRY_INFO!S62=\"Surveillance\",COUNTRY_INFO!S62=\"Not required\",COUNTRY_INFO!S62=0),0,IF($D62<>0, COUNTRY_INFO!S62,0))","v":2184},{"$f":"IF(OR(COUNTRY_INFO!T62=\"Unknown\",COUNTRY_INFO!T62=\"Surveillance\",COUNTRY_INFO!T62=\"Not required\",COUNTRY_INFO!T62=0),0,IF($D62<>0, COUNTRY_INFO!T62,0))","v":6095},8940,"Yes",null,null,null,null,{"$f":"IF($I62<>\"Yes\",$F62*2,($F62+ROUND(J62*$F62/SUM(COUNTRY_INFO!$E62:$G62),0))*2)","v":4368},{"$f":"IF($I62<>\"Yes\",$G62*3,($G62+ROUND(J62*$G62/SUM(COUNTRY_INFO!$E62:$G62),0))*3)","v":18285},22653,null,22653]
[{"$f":"IF(INTRO!$E$43=\"Non-endemic\",\" \", IF(COUNTRY_INFO!A63=0,\" \",COUNTRY_INFO!A63))","v":"Eswatini"},{"$f":"IF(INTRO!$E$43=\"Non-endemic\",\" \", IF(COUNTRY_INFO!B63=0,\" \",COUNTRY_INFO!B63))","v":"SHISELWENI"},{"$f":"IF(INTRO!$E$43=\"Non-endemic\",\" \", IF(COUNTRY_INFO!C63=0,\" \",COUNTRY_INFO!C63))","v":"Nkwene"},{"$f":"IF(INTRO!$E$43=\"Non-endemic\", \"Not required\", COUNTRY_INFO!Y63)","v":1},{"$f":"IF(OR(COUNTRY_INFO!R63=\"Unknown\",COUNTRY_INFO!R63=\"Surveillance\",COUNTRY_INFO!R63=\"Not required\",COUNTRY_INFO!R63=0),0,IF($D63<>0, COUNTRY_INFO!R63,0))","v":504},{"$f":"IF(OR(COUNTRY_INFO!S63=\"Unknown\",COUNTRY_INFO!S63=\"Surveillance\",COUNTRY_INFO!S63=\"Not required\",COUNTRY_INFO!S63=0),0,IF($D63<>0, COUNTRY_INFO!S63,0))","v":1666},{"$f":"IF(OR(COUNTRY_INFO!T63=\"Unknown\",COUNTRY_INFO!T63=\"Surveillance\",COUNTRY_INFO!T63=\"Not required\",COUNTRY_INFO!T63=0),0,IF($D63<>0, COUNTRY_INFO!T63,0))","v":4650},6820,null,null,null,null,null,{"$f":"IF($I63<>\"Yes\",$F63*2,($F63+ROUND(J63*$F63/SUM(COUNTRY_INFO!$E63:$G63),0))*2)","v":3332},{"$f":"IF($I63<>\"Yes\",$G63*3,($G63+ROUND(J63*$G63/SUM(COUNTRY_INFO!$E63:$G63),0))*3)","v":13950},17282,null,17282]
[{"$f":"IF(INTRO!$E$43=\"Non-endemic\",\" \", IF(COUNTRY_INFO!A64=0,\" \",COUNTRY_INFO!A64))","v":"Eswatini"},{"$f":"IF(INTRO!$E$43=\"Non-endemic\",\" \", IF(COUNTRY_INFO!B64=0,\" \",COUNTRY_INFO!B64))","v":"SHISELWENI"},{"$f":"IF(INTRO!$E$43=\"Non-endemic\",\" \", IF(COUNTRY_INFO!C64=0,\" \",COUNTRY_INFO!C64))","v":"Sandleni"},{"$f":"IF(INTRO!$E$43=\"Non-endemic\", \"Not required\", COUNTRY_INFO!Y64)","v":1},{"$f":"IF(OR(COUNTRY_INFO!R64=\"Unknown\",COUNTRY_INFO!R64=\"Surveillance\",COUNTRY_INFO!R64=\"Not required\",COUNTRY_INFO!R64=0),0,IF($D64<>0, COUNTRY_INFO!R64,0))","v":1332},{"$f":"IF(OR(COUNTRY_INFO!S64=\"Unknown\",COUNTRY_INFO!S64=\"Surveillance\",COUNTRY_INFO!S64=\"Not required\",COUNTRY_INFO!S64=0),0,IF($D64<>0, COUNTRY_INFO!S64,0))","v":4402},{"$f":"IF(OR(COUNTRY_INFO!T64=\"Unknown\",COUNTRY_INFO!T64=\"Surveillance\",COUNTRY_INFO!T64=\"Not required\",COUNTRY_INFO!T64=0),0,IF($D64<>0, COUNTRY_INFO!T64,0))","v":12286},18020,null,null,null,null,null,{"$f":"IF($I64<>\"Yes\",$F64*2,($F64+ROUND(J64*$F64/SUM(COUNTRY_INFO!$E64:$G64),0))*2)","v":8804},{"$f":"IF($I64<>\"Yes\",$G64*3,($G64+ROUND(J64*$G64/SUM(COUNTRY_INFO!$E64:$G64),0))*3)","v":36858},45662,null,45662]
[{"$f":"IF(INTRO!$E$43=\"Non-endemic\",\" \", IF(COUNTRY_INFO!A65=0,\" \",COUNTRY_INFO!A65))","v":"Eswatini"},{"$f":"IF(INTRO!$E$43=\"Non-endemic\",\" \", IF(COUNTRY_INFO!B65=0,\" \",COUNTRY_INFO!B65))","v":"SHISELWENI"},{"$f":"IF(INTRO!$E$43=\"Non-endemic\",\" \", IF(COUNTRY_INFO!C65=0,\" \",COUNTRY_INFO!C65))","v":"Shiselweni 1"},{"$f":"IF(INTRO!$E$43=\"Non-endemic\", \"Not required\", COUNTRY_INFO!Y65)","v":1},{"$f":"IF(OR(COUNTRY_INFO!R65=\"Unknown\",COUNTRY_INFO!R65=\"Surveillance\",COUNTRY_INFO!R65=\"Not required\",COUNTRY_INFO!R65=0),0,IF($D65<>0, COUNTRY_INFO!R65,0))","v":691},{"$f":"IF(OR(COUNTRY_INFO!S65=\"Unknown\",COUNTRY_INFO!S65=\"Surveillance\",COUNTRY_INFO!S65=\"Not required\",COUNTRY_INFO!S65=0),0,IF($D65<>0, COUNTRY_INFO!S65,0))","v":2283},{"$f":"IF(OR(COUNTRY_INFO!T65=\"Unknown\",COUNTRY_INFO!T65=\"Surveillance\",COUNTRY_INFO!T65=\"Not required\",COUNTRY_INFO!T65=0),0,IF($D65<>0, COUNTRY_INFO!T65,0))","v":6370},9344,null,null,null,null,null,{"$f":"IF($I65<>\"Yes\",$F65*2,($F65+ROUND(J65*$F65/SUM(COUNTRY_INFO!$E65:$G65),0))*2)","v":4566},{"$f":"IF($I65<>\"Yes\",$G65*3,($G65+ROUND(J65*$G65/SUM(COUNTRY_INFO!$E65:$G65),0))*3)","v":19110},23676,null,23676]
[{"$f":"IF(INTRO!$E$43=\"Non-endemic\",\" \", IF(COUNTRY_INFO!A66=0,\" \",COUNTRY_INFO!A66))","v":"Eswatini"},{"$f":"IF(INTRO!$E$43=\"Non-endemic\",\" \", IF(COUNTRY_INFO!B66=0,\" \",COUNTRY_INFO!B66))","v":"SHISELWENI"},{"$f":"IF(INTRO!$E$43=\"Non-endemic\",\" \", IF(COUNTRY_INFO!C66=0,\" \",COUNTRY_INFO!C66))","v":"Sigwe"},{"$f":"IF(INTRO!$E$43=\"Non-endemic\", \"Not required\", COUNTRY_INFO!Y66)","v":1},{"$f":"IF(OR(COUNTRY_INFO!R66=\"Unknown\",COUNTRY_INFO!R66=\"Surveillance\",COUNTRY_INFO!R66=\"Not required\",COUNTRY_INFO!R66=0),0,IF($D66<>0, COUNTRY_INFO!R66,0))","v":733},{"$f":"IF(OR(COUNTRY_INFO!S66=\"Unknown\",COUNTRY_INFO!S66=\"Surveillance\",COUNTRY_INFO!S66=\"Not required\",COUNTRY_INFO!S66=0),0,IF($D66<>0, COUNTRY_INFO!S66,0))","v":2423},{"$f":"IF(OR(COUNTRY_INFO!T66=\"Unknown\",COUNTRY_INFO!T66=\"Surveillance\",COUNTRY_INFO!T66=\"Not required\",COUNTRY_INFO!T66=0),0,IF($D66<>0, COUNTRY_INFO!T66,0))","v":6762},9918,null,null,null,null,null,{"$f":"IF($I66<>\"Yes\",$F66*2,($F66+ROUND(J66*$F66/SUM(COUNTRY_INFO!$E66:$G66),0))*2)","v":4846},{"$f":"IF($I66<>\"Yes\",$G66*3,($G66+ROUND(J66*$G66/SUM(COUNTRY_INFO!$E66:$G66),0))*3)","v":20286},25132,null,25132]
[{"$f":"IF(INTRO!$E$43=\"Non-endemic\",\" \", IF(COUNTRY_INFO!A67=0,\" \",COUNTRY_INFO!A67))","v":"Eswatini"},{"$f":"IF(INTRO!$E$43=\"Non-endemic\",\" \", IF(COUNTRY_INFO!B67=0,\" \",COUNTRY_INFO!B67))","v":"SHISELWENI"},{"$f":"IF(INTRO!$E$43=\"Non-endemic\",\" \", IF(COUNTRY_INFO!C67=0,\" \",COUNTRY_INFO!C67))","v":"Somntongo"},{"$f":"IF(INTRO!$E$43=\"Non-endemic\", \"Not required\", COUNTRY_INFO!Y67)","v":0},{"$f":"IF(OR(COUNTRY_INFO!R67=\"Unknown\",COUNTRY_INFO!R67=\"Surveillance\",COUNTRY_INFO!R67=\"Not required\",COUNTRY_INFO!R67=0),0,IF($D67<>0, COUNTRY_INFO!R67,0))","v":0},{"$f":"IF(OR(COUNTRY_INFO!S67=\"Unknown\",COUNTRY_INFO!S67=\"Surveillance\",COUNTRY_INFO!S67=\"Not required\",COUNTRY_INFO!S67=0),0,IF($D67<>0, COUNTRY_INFO!S67,0))","v":0},{"$f":"IF(OR(COUNTRY_INFO!T67=\"Unknown\",COUNTRY_INFO!T67=\"Surveillance\",COUNTRY_INFO!T67=\"Not required\",COUNTRY_INFO!T67=0),0,IF($D67<>0, COUNTRY_INFO!T67,0))","v":0},0,null,null,null,null,null,{"$f":"IF($I67<>\"Yes\",$F67*2,($F67+ROUND(J67*$F67/SUM(COUNTRY_INFO!$E67:$G67),0))*2)","v":0},{"$f":"IF($I67<>\"Yes\",$G67*3,($G67+ROUND(J67*$G67/SUM(COUNTRY_INFO!$E67:$G67),0))*3)","v":0},0,null,0]
[{"$f":"IF(INTRO!$E$43=\"Non-endemic\",\" \", IF(COUNTRY_INFO!A68=0,\" \",COUNTRY_INFO!A68))","v":"Eswatini"},{"$f":"IF(INTRO!$E$43=\"Non-endemic\",\" \", IF(COUNTRY_INFO!B68=0,\" \",COUNTRY_INFO!B68))","v":"SHISELWENI"},{"$f":"IF(INTRO!$E$43=\"Non-endemic\",\" \", IF(COUNTRY_INFO!C68=0,\" \",COUNTRY_INFO!C68))","v":"Zombodze Emuva"},{"$f":"IF(INTRO!$E$43=\"Non-endemic\", \"Not required\", COUNTRY_INFO!Y68)","v":1},{"$f":"IF(OR(COUNTRY_INFO!R68=\"Unknown\",COUNTRY_INFO!R68=\"Surveillance\",COUNTRY_INFO!R68=\"Not required\",COUNTRY_INFO!R68=0),0,IF($D68<>0, COUNTRY_INFO!R68,0))","v":1061},{"$f":"IF(OR(COUNTRY_INFO!S68=\"Unknown\",COUNTRY_INFO!S68=\"Surveillance\",COUNTRY_INFO!S68=\"Not required\",COUNTRY_INFO!S68=0),0,IF($D68<>0, COUNTRY_INFO!S68,0))","v":3505},{"$f":"IF(OR(COUNTRY_INFO!T68=\"Unknown\",COUNTRY_INFO!T68=\"Surveillance\",COUNTRY_INFO!T68=\"Not required\",COUNTRY_INFO!T68=0),0,IF($D68<>0, COUNTRY_INFO!T68,0))","v":9781},14347,null,null,null,null,null,{"$f":"IF($I68<>\"Yes\",$F68*2,($F68+ROUND(J68*$F68/SUM(COUNTRY_INFO!$E68:$G68),0))*2)","v":7010},{"$f":"IF($I68<>\"Yes\",$G68*3,($G68+ROUND(J68*$G68/SUM(COUNTRY_INFO!$E68:$G68),0))*3)","v":29343},36353,null,36353]

{"sheet":"IVM","index":5,"n_rows":68,"n_cols":14,"rows_kept":68,"cut":false,"hidden":true,"merged":[[5,3,7,3],[6,13,7,13],[6,8,7,8],[6,6,7,6],[6,7,7,7],[6,9,7,9],[6,10,7,10],[6,11,7,11],[3,0,3,2],[3,4,3,5],[6,4,7,4],[6,5,7,5],[5,8,5,13],[6,0,7,0],[6,1,7,1],[6,2,7,2],[5,0,5,2],[5,4,5,5],[5,6,5,7],[6,12,7,12]]}
["Ivermectin (IVM)"]
["Administrative structure, eligible population by age group, treatment plan and information about tablets"]
[]
["TOTAL",null,null,{"$f":"SUBTOTAL(9,D$10:D$1010)","v":0},null,null,{"$f":"SUBTOTAL(9,G$10:G$1010)","v":0},0,0,0,0,0,0,0]
[]
["Country administrative structure",null,null,"Population requiring treatment with IVM","Treatment plan",null,"Target population",null,"Ivermectin (IVM)"]
["Country","Province/State","District",null,"LF","Oncho","LF","Oncho","LF only","Oncho only","LF+Oncho","Total required","Remaining in stock","Tablets to be procured"]
[]
[]
[{"$f":"IF(INTRO!$E$39=\"Non-endemic\",\" \",IF(COUNTRY_INFO!A10=0,\" \",COUNTRY_INFO!A10))","v":" "},{"$f":"IF(INTRO!$E$39=\"Non-endemic\",\" \",IF(COUNTRY_INFO!B10=0,\" \",COUNTRY_INFO!B10))","v":" "},{"$f":"IF(INTRO!$E$39=\"Non-endemic\",\" \",IF(COUNTRY_INFO!C10=0,\" \",COUNTRY_INFO!C10))","v":" "},{"$f":"IF(INTRO!$E$39=\"Non-endemic\",0,IF(INTRO!$E$39=\"Endemic but PC is not required\",IF(COUNTRY_INFO!$H10=1,COUNTRY_INFO!F10+COUNTRY_INFO!G10,0),IF(COUNTRY_INFO!$H10=1,COUNTRY_INFO!F10+COUNTRY_INFO!G10,IF(COUNTRY_INFO!$I10=1,IF(COUNTRY_INFO!M10>=(COUNTRY_INFO!F10+COUNTRY_INFO!G10),COUNTRY_INFO!F10+COUNTRY_INFO!G10,COUNTRY_INFO!$M10),0))))","v":0},{"$f":"IF(AND(INTRO!$E$39=\"Non-endemic\",INTRO!$E$37=\"Non-endemic\"),\"Not required\",IF(INTRO!$E$39=\"Non-endemic\",\"Treat with DEC\",COUNTRY_INFO!V10))","v":"Not required"},{"$f":"IF(INTRO!$E$39<>\"Non-endemic\",COUNTRY_INFO!W10,\"Not required\")","v":"Not required"},{"$f":"IF(COUNTRY_INFO!H10=1, IF($E10=1,$D10, 0),0)","v":0},{"$f":"IF(COUNTRY_INFO!I10=1, IF(AND(COUNTRY_INFO!$I10=1,$F10<>0),IF(COUNTRY_INFO!M10>=(COUNTRY_INFO!F10+COUNTRY_INFO!G10),COUNTRY_INFO!F10+COUNTRY_INFO!G10,COUNTRY_INFO!$M10), 0),0)","v":0},{"$f":"IF(G10<H10,0,IF($E10=1, (G10-H10)*2.8, 0))","v":0},{"$f":"IF($E10<$F10, H10*(F10-E10)*2.8, 0)","v":0},{"$f":"IF(AND($E10=1, $F10<>0), H10*2.8, 0)","v":0},{"$f":"SUM(I10:K10)","v":0},null,{"$f":"IF($L10>$M10,$L10-$M10,0)","v":0}]
[{"$f":"IF(INTRO!$E$39=\"Non-endemic\",\" \",IF(COUNTRY_INFO!A11=0,\" \",COUNTRY_INFO!A11))","v":" "},{"$f":"IF(INTRO!$E$39=\"Non-endemic\",\" \",IF(COUNTRY_INFO!B11=0,\" \",COUNTRY_INFO!B11))","v":" "},{"$f":"IF(INTRO!$E$39=\"Non-endemic\",\" \",IF(COUNTRY_INFO!C11=0,\" \",COUNTRY_INFO!C11))","v":" "},{"$f":"IF(INTRO!$E$39=\"Non-endemic\",0,IF(INTRO!$E$39=\"Endemic but PC is not required\",IF(COUNTRY_INFO!$H11=1,COUNTRY_INFO!F11+COUNTRY_INFO!G11,0),IF(COUNTRY_INFO!$H11=1,COUNTRY_INFO!F11+COUNTRY_INFO!G11,IF(COUNTRY_INFO!$I11=1,IF(COUNTRY_INFO!M11>=(COUNTRY_INFO!F11+COUNTRY_INFO!G11),COUNTRY_INFO!F11+COUNTRY_INFO!G11,COUNTRY_INFO!$M11),0))))","v":0},{"$f":"IF(AND(INTRO!$E$39=\"Non-endemic\",INTRO!$E$37=\"Non-endemic\"),\"Not required\",IF(INTRO!$E$39=\"Non-endemic\",\"Treat with DEC\",COUNTRY_INFO!V11))","v":"Not required"},{"$f":"IF(INTRO!$E$39<>\"Non-endemic\",COUNTRY_INFO!W11,\"Not required\")","v":"Not required"},{"$f":"IF(COUNTRY_INFO!H11=1, IF($E11=1,$D11, 0),0)","v":0},{"$f":"IF(COUNTRY_INFO!I11=1, IF(AND(COUNTRY_INFO!$I11=1,$F11<>0),IF(COUNTRY_INFO!M11>=(COUNTRY_INFO!F11+COUNTRY_INFO!G11),COUNTRY_INFO!F11+COUNTRY_INFO!G11,COUNTRY_INFO!$M11), 0),0)","v":0},0,0,{"$f":"IF(AND($E11=1, $F11<>0), H11*2.8, 0)","v":0},{"$f":"SUM(I11:K11)","v":0},null,0]
[{"$f":"IF(INTRO!$E$39=\"Non-endemic\",\" \",IF(COUNTRY_INFO!A12=0,\" \",COUNTRY_INFO!A12))","v":" "},{"$f":"IF(INTRO!$E$39=\"Non-endemic\",\" \",IF(COUNTRY_INFO!B12=0,\" \",COUNTRY_INFO!B12))","v":" "},{"$f":"IF(INTRO!$E$39=\"Non-endemic\",\" \",IF(COUNTRY_INFO!C12=0,\" \",COUNTRY_INFO!C12))","v":" "},{"$f":"IF(INTRO!$E$39=\"Non-endemic\",0,IF(INTRO!$E$39=\"Endemic but PC is not required\",IF(COUNTRY_INFO!$H12=1,COUNTRY_INFO!F12+COUNTRY_INFO!G12,0),IF(COUNTRY_INFO!$H12=1,COUNTRY_INFO!F12+COUNTRY_INFO!G12,IF(COUNTRY_INFO!$I12=1,IF(COUNTRY_INFO!M12>=(COUNTRY_INFO!F12+COUNTRY_INFO!G12),COUNTRY_INFO!F12+COUNTRY_INFO!G12,COUNTRY_INFO!$M12),0))))","v":0},{"$f":"IF(AND(INTRO!$E$39=\"Non-endemic\",INTRO!$E$37=\"Non-endemic\"),\"Not required\",IF(INTRO!$E$39=\"Non-endemic\",\"Treat with DEC\",COUNTRY_INFO!V12))","v":"Not required"},{"$f":"IF(INTRO!$E$39<>\"Non-endemic\",COUNTRY_INFO!W12,\"Not required\")","v":"Not required"},{"$f":"IF(COUNTRY_INFO!H12=1, IF($E12=1,$D12, 0),0)","v":0},{"$f":"IF(COUNTRY_INFO!I12=1, IF(AND(COUNTRY_INFO!$I12=1,$F12<>0),IF(COUNTRY_INFO!M12>=(COUNTRY_INFO!F12+COUNTRY_INFO!G12),COUNTRY_INFO!F12+COUNTRY_INFO!G12,COUNTRY_INFO!$M12), 0),0)","v":0},0,0,0,0,null,0]
[{"$f":"IF(INTRO!$E$39=\"Non-endemic\",\" \",IF(COUNTRY_INFO!A13=0,\" \",COUNTRY_INFO!A13))","v":" "},{"$f":"IF(INTRO!$E$39=\"Non-endemic\",\" \",IF(COUNTRY_INFO!B13=0,\" \",COUNTRY_INFO!B13))","v":" "},{"$f":"IF(INTRO!$E$39=\"Non-endemic\",\" \",IF(COUNTRY_INFO!C13=0,\" \",COUNTRY_INFO!C13))","v":" "},{"$f":"IF(INTRO!$E$39=\"Non-endemic\",0,IF(INTRO!$E$39=\"Endemic but PC is not required\",IF(COUNTRY_INFO!$H13=1,COUNTRY_INFO!F13+COUNTRY_INFO!G13,0),IF(COUNTRY_INFO!$H13=1,COUNTRY_INFO!F13+COUNTRY_INFO!G13,IF(COUNTRY_INFO!$I13=1,IF(COUNTRY_INFO!M13>=(COUNTRY_INFO!F13+COUNTRY_INFO!G13),COUNTRY_INFO!F13+COUNTRY_INFO!G13,COUNTRY_INFO!$M13),0))))","v":0},{"$f":"IF(AND(INTRO!$E$39=\"Non-endemic\",INTRO!$E$37=\"Non-endemic\"),\"Not required\",IF(INTRO!$E$39=\"Non-endemic\",\"Treat with DEC\",COUNTRY_INFO!V13))","v":"Not required"},{"$f":"IF(INTRO!$E$39<>\"Non-endemic\",COUNTRY_INFO!W13,\"Not required\")","v":"Not required"},{"$f":"IF(COUNTRY_INFO!H13=1, IF($E13=1,$D13, 0),0)","v":0},{"$f":"IF(COUNTRY_INFO!I13=1, IF(AND(COUNTRY_INFO!$I13=1,$F13<>0),IF(COUNTRY_INFO!M13>=(COUNTRY_INFO!F13+COUNTRY_INFO!G13),COUNTRY_INFO!F13+COUNTRY_INFO!G13,COUNTRY_INFO!$M13), 0),0)","v":0},0,0,0,0,null,0]
[{"$f":"IF(INTRO!$E$39=\"Non-endemic\",\" \",IF(COUNTRY_INFO!A14=0,\" \",COUNTRY_INFO!A14))","v":" "},{"$f":"IF(INTRO!$E$39=\"Non-endemic\",\" \",IF(COUNTRY_INFO!B14=0,\" \",COUNTRY_INFO!B14))","v":" "},{"$f":"IF(INTRO!$E$39=\"Non-endemic\",\" \",IF(COUNTRY_INFO!C14=0,\" \",COUNTRY_INFO!C14))","v":" "},{"$f":"IF(INTRO!$E$39=\"Non-endemic\",0,IF(INTRO!$E$39=\"Endemic but PC is not required\",IF(COUNTRY_INFO!$H14=1,COUNTRY_INFO!F14+COUNTRY_INFO!G14,0),IF(COUNTRY_INFO!$H14=1,COUNTRY_INFO!F14+COUNTRY_INFO!G14,IF(COUNTRY_INFO!$I14=1,IF(COUNTRY_INFO!M14>=(COUNTRY_INFO!F14+COUNTRY_INFO!G14),COUNTRY_INFO!F14+COUNTRY_INFO!G14,COUNTRY_INFO!$M14),0))))","v":0},{"$f":"IF(AND(INTRO!$E$39=\"Non-endemic\",INTRO!$E$37=\"Non-endemic\"),\"Not required\",IF(INTRO!$E$39=\"Non-endemic\",\"Treat with DEC\",COUNTRY_INFO!V14))","v":"Not required"},{"$f":"IF(INTRO!$E$39<>\"Non-endemic\",COUNTRY_INFO!W14,\"Not required\")","v":"Not required"},{"$f":"IF(COUNTRY_INFO!H14=1, IF($E14=1,$D14, 0),0)","v":0},{"$f":"IF(COUNTRY_INFO!I14=1, IF(AND(COUNTRY_INFO!$I14=1,$F14<>0),IF(COUNTRY_INFO!M14>=(COUNTRY_INFO!F14+COUNTRY_INFO!G14),COUNTRY_INFO!F14+COUNTRY_INFO!G14,COUNTRY_INFO!$M14), 0),0)","v":0},0,0,0,0,null,0]
[{"$f":"IF(INTRO!$E$39=\"Non-endemic\",\" \",IF(COUNTRY_INFO!A15=0,\" \",COUNTRY_INFO!A15))","v":" "},{"$f":"IF(INTRO!$E$39=\"Non-endemic\",\" \",IF(COUNTRY_INFO!B15=0,\" \",COUNTRY_INFO!B15))","v":" "},{"$f":"IF(INTRO!$E$39=\"Non-endemic\",\" \",IF(COUNTRY_INFO!C15=0,\" \",COUNTRY_INFO!C15))","v":" "},{"$f":"IF(INTRO!$E$39=\"Non-endemic\",0,IF(INTRO!$E$39=\"Endemic but PC is not required\",IF(COUNTRY_INFO!$H15=1,COUNTRY_INFO!F15+COUNTRY_INFO!G15,0),IF(COUNTRY_INFO!$H15=1,COUNTRY_INFO!F15+COUNTRY_INFO!G15,IF(COUNTRY_INFO!$I15=1,IF(COUNTRY_INFO!M15>=(COUNTRY_INFO!F15+COUNTRY_INFO!G15),COUNTRY_INFO!F15+COUNTRY_INFO!G15,COUNTRY_INFO!$M15),0))))","v":0},{"$f":"IF(AND(INTRO!$E$39=\"Non-endemic\",INTRO!$E$37=\"Non-endemic\"),\"Not required\",IF(INTRO!$E$39=\"Non-endemic\",\"Treat with DEC\",COUNTRY_INFO!V15))","v":"Not required"},{"$f":"IF(INTRO!$E$39<>\"Non-endemic\",COUNTRY_INFO!W15,\"Not required\")","v":"Not required"},{"$f":"IF(COUNTRY_INFO!H15=1, IF($E15=1,$D15, 0),0)","v":0},{"$f":"IF(COUNTRY_INFO!I15=1, IF(AND(COUNTRY_INFO!$I15=1,$F15<>0),IF(COUNTRY_INFO!M15>=(COUNTRY_INFO!F15+COUNTRY_INFO!G15),COUNTRY_INFO!F15+COUNTRY_INFO!G15,COUNTRY_INFO!$M15), 0),0)","v":0},0,0,0,0,null,0]
[{"$f":"IF(INTRO!$E$39=\"Non-endemic\",\" \",IF(COUNTRY_INFO!A16=0,\" \",COUNTRY_INFO!A16))","v":" "},{"$f":"IF(INTRO!$E$39=\"Non-endemic\",\" \",IF(COUNTRY_INFO!B16=0,\" \",COUNTRY_INFO!B16))","v":" "},{"$f":"IF(INTRO!$E$39=\"Non-endemic\",\" \",IF(COUNTRY_INFO!C16=0,\" \",COUNTRY_INFO!C16))","v":" "},{"$f":"IF(INTRO!$E$39=\"Non-endemic\",0,IF(INTRO!$E$39=\"Endemic but PC is not required\",IF(COUNTRY_INFO!$H16=1,COUNTRY_INFO!F16+COUNTRY_INFO!G16,0),IF(COUNTRY_INFO!$H16=1,COUNTRY_INFO!F16+COUNTRY_INFO!G16,IF(COUNTRY_INFO!$I16=1,IF(COUNTRY_INFO!M16>=(COUNTRY_INFO!F16+COUNTRY_INFO!G16),COUNTRY_INFO!F16+COUNTRY_INFO!G16,COUNTRY_INFO!$M16),0))))","v":0},{"$f":"IF(AND(INTRO!$E$39=\"Non-endemic\",INTRO!$E$37=\"Non-endemic\"),\"Not required\",IF(INTRO!$E$39=\"Non-endemic\",\"Treat with DEC\",COUNTRY_INFO!V16))","v":"Not required"},{"$f":"IF(INTRO!$E$39<>\"Non-endemic\",COUNTRY_INFO!W16,\"Not required\")","v":"Not required"},{"$f":"IF(COUNTRY_INFO!H16=1, IF($E16=1,$D16, 0),0)","v":0},{"$f":"IF(COUNTRY_INFO!I16=1, IF(AND(COUNTRY_INFO!$I16=1,$F16<>0),IF(COUNTRY_INFO!M16>=(COUNTRY_INFO!F16+COUNTRY_INFO!G16),COUNTRY_INFO!F16+COUNTRY_INFO!G16,COUNTRY_INFO!$M16), 0),0)","v":0},0,0,0,0,null,0]
[{"$f":"IF(INTRO!$E$39=\"Non-endemic\",\" \",IF(COUNTRY_INFO!A17=0,\" \",COUNTRY_INFO!A17))","v":" "},{"$f":"IF(INTRO!$E$39=\"Non-endemic\",\" \",IF(COUNTRY_INFO!B17=0,\" \",COUNTRY_INFO!B17))","v":" "},{"$f":"IF(INTRO!$E$39=\"Non-endemic\",\" \",IF(COUNTRY_INFO!C17=0,\" \",COUNTRY_INFO!C17))","v":" "},{"$f":"IF(INTRO!$E$39=\"Non-endemic\",0,IF(INTRO!$E$39=\"Endemic but PC is not required\",IF(COUNTRY_INFO!$H17=1,COUNTRY_INFO!F17+COUNTRY_INFO!G17,0),IF(COUNTRY_INFO!$H17=1,COUNTRY_INFO!F17+COUNTRY_INFO!G17,IF(COUNTRY_INFO!$I17=1,IF(COUNTRY_INFO!M17>=(COUNTRY_INFO!F17+COUNTRY_INFO!G17),COUNTRY_INFO!F17+COUNTRY_INFO!G17,COUNTRY_INFO!$M17),0))))","v":0},{"$f":"IF(AND(INTRO!$E$39=\"Non-endemic\",INTRO!$E$37=\"Non-endemic\"),\"Not required\",IF(INTRO!$E$39=\"Non-endemic\",\"Treat with DEC\",COUNTRY_INFO!V17))","v":"Not required"},{"$f":"IF(INTRO!$E$39<>\"Non-endemic\",COUNTRY_INFO!W17,\"Not required\")","v":"Not required"},{"$f":"IF(COUNTRY_INFO!H17=1, IF($E17=1,$D17, 0),0)","v":0},{"$f":"IF(COUNTRY_INFO!I17=1, IF(AND(COUNTRY_INFO!$I17=1,$F17<>0),IF(COUNTRY_INFO!M17>=(COUNTRY_INFO!F17+COUNTRY_INFO!G17),COUNTRY_INFO!F17+COUNTRY_INFO!G17,COUNTRY_INFO!$M17), 0),0)","v":0},0,0,0,0,null,0]
[{"$f":"IF(INTRO!$E$39=\"Non-endemic\",\" \",IF(COUNTRY_INFO!A18=0,\" \",COUNTRY_INFO!A18))","v":" "},{"$f":"IF(INTRO!$E$39=\"Non-endemic\",\" \",IF(COUNTRY_INFO!B18=0,\" \",COUNTRY_INFO!B18))","v":" "},{"$f":"IF(INTRO!$E$39=\"Non-endemic\",\" \",IF(COUNTRY_INFO!C18=0,\" \",COUNTRY_INFO!C18))","v":" "},{"$f":"IF(INTRO!$E$39=\"Non-endemic\",0,IF(INTRO!$E$39=\"Endemic but PC is not required\",IF(COUNTRY_INFO!$H18=1,COUNTRY_INFO!F18+COUNTRY_INFO!G18,0),IF(COUNTRY_INFO!$H18=1,COUNTRY_INFO!F18+COUNTRY_INFO!G18,IF(COUNTRY_INFO!$I18=1,IF(COUNTRY_INFO!M18>=(COUNTRY_INFO!F18+COUNTRY_INFO!G18),COUNTRY_INFO!F18+COUNTRY_INFO!G18,COUNTRY_INFO!$M18),0))))","v":0},{"$f":"IF(AND(INTRO!$E$39=\"Non-endemic\",INTRO!$E$37=\"Non-endemic\"),\"Not required\",IF(INTRO!$E$39=\"Non-endemic\",\"Treat with DEC\",COUNTRY_INFO!V18))","v":"Not required"},{"$f":"IF(INTRO!$E$39<>\"Non-endemic\",COUNTRY_INFO!W18,\"Not required\")","v":"Not required"},{"$f":"IF(COUNTRY_INFO!H18=1, IF($E18=1,$D18, 0),0)","v":0},{"$f":"IF(COUNTRY_INFO!I18=1, IF(AND(COUNTRY_INFO!$I18=1,$F18<>0),IF(COUNTRY_INFO!M18>=(COUNTRY_INFO!F18+COUNTRY_INFO!G18),COUNTRY_INFO!F18+COUNTRY_INFO!G18,COUNTRY_INFO!$M18), 0),0)","v":0},0,0,0,0,null,0]
[{"$f":"IF(INTRO!$E$39=\"Non-endemic\",\" \",IF(COUNTRY_INFO!A19=0,\" \",COUNTRY_INFO!A19))","v":" "},{"$f":"IF(INTRO!$E$39=\"Non-endemic\",\" \",IF(COUNTRY_INFO!B19=0,\" \",COUNTRY_INFO!B19))","v":" "},{"$f":"IF(INTRO!$E$39=\"Non-endemic\",\" \",IF(COUNTRY_INFO!C19=0,\" \",COUNTRY_INFO!C19))","v":" "},{"$f":"IF(INTRO!$E$39=\"Non-endemic\",0,IF(INTRO!$E$39=\"Endemic but PC is not required\",IF(COUNTRY_INFO!$H19=1,COUNTRY_INFO!F19+COUNTRY_INFO!G19,0),IF(COUNTRY_INFO!$H19=1,COUNTRY_INFO!F19+COUNTRY_INFO!G19,IF(COUNTRY_INFO!$I19=1,IF(COUNTRY_INFO!M19>=(COUNTRY_INFO!F19+COUNTRY_INFO!G19),COUNTRY_INFO!F19+COUNTRY_INFO!G19,COUNTRY_INFO!$M19),0))))","v":0},{"$f":"IF(AND(INTRO!$E$39=\"Non-endemic\",INTRO!$E$37=\"Non-endemic\"),\"Not required\",IF(INTRO!$E$39=\"Non-endemic\",\"Treat with DEC\",COUNTRY_INFO!V19))","v":"Not required"},{"$f":"IF(INTRO!$E$39<>\"Non-endemic\",COUNTRY_INFO!W19,\"Not required\")","v":"Not required"},{"$f":"IF(COUNTRY_INFO!H19=1, IF($E19=1,$D19, 0),0)","v":0},{"$f":"IF(COUNTRY_INFO!I19=1, IF(AND(COUNTRY_INFO!$I19=1,$F19<>0),IF(COUNTRY_INFO!M19>=(COUNTRY_INFO!F19+COUNTRY_INFO!G19),COUNTRY_INFO!F19+COUNTRY_INFO!G19,COUNTRY_INFO!$M19), 0),0)","v":0},0,0,0,0,null,0]
[{"$f":"IF(INTRO!$E$39=\"Non-endemic\",\" \",IF(COUNTRY_INFO!A20=0,\" \",COUNTRY_INFO!A20))","v":" "},{"$f":"IF(INTRO!$E$39=\"Non-endemic\",\" \",IF(COUNTRY_INFO!B20=0,\" \",COUNTRY_INFO!B20))","v":" "},{"$f":"IF(INTRO!$E$39=\"Non-endemic\",\" \",IF(COUNTRY_INFO!C20=0,\" \",COUNTRY_INFO!C20))","v":" "},{"$f":"IF(INTRO!$E$39=\"Non-endemic\",0,IF(INTRO!$E$39=\"Endemic but PC is not required\",IF(COUNTRY_INFO!$H20=1,COUNTRY_INFO!F20+COUNTRY_INFO!G20,0),IF(COUNTRY_INFO!$H20=1,COUNTRY_INFO!F20+COUNTRY_INFO!G20,IF(COUNTRY_INFO!$I20=1,IF(COUNTRY_INFO!M20>=(COUNTRY_INFO!F20+COUNTRY_INFO!G20),COUNTRY_INFO!F20+COUNTRY_INFO!G20,COUNTRY_INFO!$M20),0))))","v":0},{"$f":"IF(AND(INTRO!$E$39=\"Non-endemic\",INTRO!$E$37=\"Non-endemic\"),\"Not required\",IF(INTRO!$E$39=\"Non-endemic\",\"Treat with DEC\",COUNTRY_INFO!V20))","v":"Not required"},{"$f":"IF(INTRO!$E$39<>\"Non-endemic\",COUNTRY_INFO!W20,\"Not required\")","v":"Not required"},{"$f":"IF(COUNTRY_INFO!H20=1, IF($E20=1,$D20, 0),0)","v":0},{"$f":"IF(COUNTRY_INFO!I20=1, IF(AND(COUNTRY_INFO!$I20=1,$F20<>0),IF(COUNTRY_INFO!M20>=(COUNTRY_INFO!F20+COUNTRY_INFO!G20),COUNTRY_INFO!F20+COUNTRY_INFO!G20,COUNTRY_INFO!$M20), 0),0)","v":0},0,0,0,0,null,0]
[{"$f":"IF(INTRO!$E$39=\"Non-endemic\",\" \",IF(COUNTRY_INFO!A21=0,\" \",COUNTRY_INFO!A21))","v":" "},{"$f":"IF(INTRO!$E$39=\"Non-endemic\",\" \",IF(COUNTRY_INFO!B21=0,\" \",COUNTRY_INFO!B21))","v":" "},{"$f":"IF(INTRO!$E$39=\"Non-endemic\",\" \",IF(COUNTRY_INFO!C21=0,\" \",COUNTRY_INFO!C21))","v":" "},{"$f":"IF(INTRO!$E$39=\"Non-endemic\",0,IF(INTRO!$E$39=\"Endemic but PC is not required\",IF(COUNTRY_INFO!$H21=1,COUNTRY_INFO!F21+COUNTRY_INFO!G21,0),IF(COUNTRY_INFO!$H21=1,COUNTRY_INFO!F21+COUNTRY_INFO!G21,IF(COUNTRY_INFO!$I21=1,IF(COUNTRY_INFO!M21>=(COUNTRY_INFO!F21+COUNTRY_INFO!G21),COUNTRY_INFO!F21+COUNTRY_INFO!G21,COUNTRY_INFO!$M21),0))))","v":0},{"$f":"IF(AND(INTRO!$E$39=\"Non-endemic\",INTRO!$E$37=\"Non-endemic\"),\"Not required\",IF(INTRO!$E$39=\"Non-endemic\",\"Treat with DEC\",COUNTRY_INFO!V21))","v":"Not required"},{"$f":"IF(INTRO!$E$39<>\"Non-endemic\",COUNTRY_INFO!W21,\"Not required\")","v":"Not required"},{"$f":"IF(COUNTRY_INFO!H21=1, IF($E21=1,$D21, 0),0)","v":0},{"$f":"IF(COUNTRY_INFO!I21=1, IF(AND(COUNTRY_INFO!$I21=1,$F21<>0),IF(COUNTRY_INFO!M21>=(COUNTRY_INFO!F21+COUNTRY_INFO!G21),COUNTRY_INFO!F21+COUNTRY_INFO!G21,COUNTRY_INFO!$M21), 0),0)","v":0},0,0,0,0,null,0]
[{"$f":"IF(INTRO!$E$39=\"Non-endemic\",\" \",IF(COUNTRY_INFO!A22=0,\" \",COUNTRY_INFO!A22))","v":" "},{"$f":"IF(INTRO!$E$39=\"Non-endemic\",\" \",IF(COUNTRY_INFO!B22=0,\" \",COUNTRY_INFO!B22))","v":" "},{"$f":"IF(INTRO!$E$39=\"Non-endemic\",\" \",IF(COUNTRY_INFO!C22=0,\" \",COUNTRY_INFO!C22))","v":" "},{"$f":"IF(INTRO!$E$39=\"Non-endemic\",0,IF(INTRO!$E$39=\"Endemic but PC is not required\",IF(COUNTRY_INFO!$H22=1,COUNTRY_INFO!F22+COUNTRY_INFO!G22,0),IF(COUNTRY_INFO!$H22=1,COUNTRY_INFO!F22+COUNTRY_INFO!G22,IF(COUNTRY_INFO!$I22=1,IF(COUNTRY_INFO!M22>=(COUNTRY_INFO!F22+COUNTRY_INFO!G22),COUNTRY_INFO!F22+COUNTRY_INFO!G22,COUNTRY_INFO!$M22),0))))","v":0},{"$f":"IF(AND(INTRO!$E$39=\"Non-endemic\",INTRO!$E$37=\"Non-endemic\"),\"Not required\",IF(INTRO!$E$39=\"Non-endemic\",\"Treat with DEC\",COUNTRY_INFO!V22))","v":"Not required"},{"$f":"IF(INTRO!$E$39<>\"Non-endemic\",COUNTRY_INFO!W22,\"Not required\")","v":"Not required"},{"$f":"IF(COUNTRY_INFO!H22=1, IF($E22=1,$D22, 0),0)","v":0},{"$f":"IF(COUNTRY_INFO!I22=1, IF(AND(COUNTRY_INFO!$I22=1,$F22<>0),IF(COUNTRY_INFO!M22>=(COUNTRY_INFO!F22+COUNTRY_INFO!G22),COUNTRY_INFO!F22+COUNTRY_INFO!G22,COUNTRY_INFO!$M22), 0),0)","v":0},0,0,0,0,null,0]
[{"$f":"IF(INTRO!$E$39=\"Non-endemic\",\" \",IF(COUNTRY_INFO!A23=0,\" \",COUNTRY_INFO!A23))","v":" "},{"$f":"IF(INTRO!$E$39=\"Non-endemic\",\" \",IF(COUNTRY_INFO!B23=0,\" \",COUNTRY_INFO!B23))","v":" "},{"$f":"IF(INTRO!$E$39=\"Non-endemic\",\" \",IF(COUNTRY_INFO!C23=0,\" \",COUNTRY_INFO!C23))","v":" "},{"$f":"IF(INTRO!$E$39=\"Non-endemic\",0,IF(INTRO!$E$39=\"Endemic but PC is not required\",IF(COUNTRY_INFO!$H23=1,COUNTRY_INFO!F23+COUNTRY_INFO!G23,0),IF(COUNTRY_INFO!$H23=1,COUNTRY_INFO!F23+COUNTRY_INFO!G23,IF(COUNTRY_INFO!$I23=1,IF(COUNTRY_INFO!M23>=(COUNTRY_INFO!F23+COUNTRY_INFO!G23),COUNTRY_INFO!F23+COUNTRY_INFO!G23,COUNTRY_INFO!$M23),0))))","v":0},{"$f":"IF(AND(INTRO!$E$39=\"Non-endemic\",INTRO!$E$37=\"Non-endemic\"),\"Not required\",IF(INTRO!$E$39=\"Non-endemic\",\"Treat with DEC\",COUNTRY_INFO!V23))","v":"Not required"},{"$f":"IF(INTRO!$E$39<>\"Non-endemic\",COUNTRY_INFO!W23,\"Not required\")","v":"Not required"},{"$f":"IF(COUNTRY_INFO!H23=1, IF($E23=1,$D23, 0),0)","v":0},{"$f":"IF(COUNTRY_INFO!I23=1, IF(AND(COUNTRY_INFO!$I23=1,$F23<>0),IF(COUNTRY_INFO!M23>=(COUNTRY_INFO!F23+COUNTRY_INFO!G23),COUNTRY_INFO!F23+COUNTRY_INFO!G23,COUNTRY_INFO!$M23), 0),0)","v":0},0,0,0,0,null,0]
[{"$f":"IF(INTRO!$E$39=\"Non-endemic\",\" \",IF(COUNTRY_INFO!A24=0,\" \",COUNTRY_INFO!A24))","v":" "},{"$f":"IF(INTRO!$E$39=\"Non-endemic\",\" \",IF(COUNTRY_INFO!B24=0,\" \",COUNTRY_INFO!B24))","v":" "},{"$f":"IF(INTRO!$E$39=\"Non-endemic\",\" \",IF(COUNTRY_INFO!C24=0,\" \",COUNTRY_INFO!C24))","v":" "},{"$f":"IF(INTRO!$E$39=\"Non-endemic\",0,IF(INTRO!$E$39=\"Endemic but PC is not required\",IF(COUNTRY_INFO!$H24=1,COUNTRY_INFO!F24+COUNTRY_INFO!G24,0),IF(COUNTRY_INFO!$H24=1,COUNTRY_INFO!F24+COUNTRY_INFO!G24,IF(COUNTRY_INFO!$I24=1,IF(COUNTRY_INFO!M24>=(COUNTRY_INFO!F24+COUNTRY_INFO!G24),COUNTRY_INFO!F24+COUNTRY_INFO!G24,COUNTRY_INFO!$M24),0))))","v":0},{"$f":"IF(AND(INTRO!$E$39=\"Non-endemic\",INTRO!$E$37=\"Non-endemic\"),\"Not required\",IF(INTRO!$E$39=\"Non-endemic\",\"Treat with DEC\",COUNTRY_INFO!V24))","v":"Not required"},{"$f":"IF(INTRO!$E$39<>\"Non-endemic\",COUNTRY_INFO!W24,\"Not required\")","v":"Not required"},{"$f":"IF(COUNTRY_INFO!H24=1, IF($E24=1,$D24, 0),0)","v":0},{"$f":"IF(COUNTRY_INFO!I24=1, IF(AND(COUNTRY_INFO!$I24=1,$F24<>0),IF(COUNTRY_INFO!M24>=(COUNTRY_INFO!F24+COUNTRY_INFO!G24),COUNTRY_INFO!F24+COUNTRY_INFO!G24,COUNTRY_INFO!$M24), 0),0)","v":0},0,0,0,0,null,0]
[{"$f":"IF(INTRO!$E$39=\"Non-endemic\",\" \",IF(COUNTRY_INFO!A25=0,\" \",COUNTRY_INFO!A25))","v":" "},{"$f":"IF(INTRO!$E$39=\"Non-endemic\",\" \",IF(COUNTRY_INFO!B25=0,\" \",COUNTRY_INFO!B25))","v":" "},{"$f":"IF(INTRO!$E$39=\"Non-endemic\",\" \",IF(COUNTRY_INFO!C25=0,\" \",COUNTRY_INFO!C25))","v":" "},{"$f":"IF(INTRO!$E$39=\"Non-endemic\",0,IF(INTRO!$E$39=\"Endemic but PC is not required\",IF(COUNTRY_INFO!$H25=1,COUNTRY_INFO!F25+COUNTRY_INFO!G25,0),IF(COUNTRY_INFO!$H25=1,COUNTRY_INFO!F25+COUNTRY_INFO!G25,IF(COUNTRY_INFO!$I25=1,IF(COUNTRY_INFO!M25>=(COUNTRY_INFO!F25+COUNTRY_INFO!G25),COUNTRY_INFO!F25+COUNTRY_INFO!G25,COUNTRY_INFO!$M25),0))))","v":0},{"$f":"IF(AND(INTRO!$E$39=\"Non-endemic\",INTRO!$E$37=\"Non-endemic\"),\"Not required\",IF(INTRO!$E$39=\"Non-endemic\",\"Treat with DEC\",COUNTRY_INFO!V25))","v":"Not required"},{"$f":"IF(INTRO!$E$39<>\"Non-endemic\",COUNTRY_INFO!W25,\"Not required\")","v":"Not required"},{"$f":"IF(COUNTRY_INFO!H25=1, IF($E25=1,$D25, 0),0)","v":0},{"$f":"IF(COUNTRY_INFO!I25=1, IF(AND(COUNTRY_INFO!$I25=1,$F25<>0),IF(COUNTRY_INFO!M25>=(COUNTRY_INFO!F25+COUNTRY_INFO!G25),COUNTRY_INFO!F25+COUNTRY_INFO!G25,COUNTRY_INFO!$M25), 0),0)","v":0},0,0,0,0,null,0]
[{"$f":"IF(INTRO!$E$39=\"Non-endemic\",\" \",IF(COUNTRY_INFO!A26=0,\" \",COUNTRY_INFO!A26))","v":" "},{"$f":"IF(INTRO!$E$39=\"Non-endemic\",\" \",IF(COUNTRY_INFO!B26=0,\" \",COUNTRY_INFO!B26))","v":" "},{"$f":"IF(INTRO!$E$39=\"Non-endemic\",\" \",IF(COUNTRY_INFO!C26=0,\" \",COUNTRY_INFO!C26))","v":" "},{"$f":"IF(INTRO!$E$39=\"Non-endemic\",0,IF(INTRO!$E$39=\"Endemic but PC is not required\",IF(COUNTRY_INFO!$H26=1,COUNTRY_INFO!F26+COUNTRY_INFO!G26,0),IF(COUNTRY_INFO!$H26=1,COUNTRY_INFO!F26+COUNTRY_INFO!G26,IF(COUNTRY_INFO!$I26=1,IF(COUNTRY_INFO!M26>=(COUNTRY_INFO!F26+COUNTRY_INFO!G26),COUNTRY_INFO!F26+COUNTRY_INFO!G26,COUNTRY_INFO!$M26),0))))","v":0},{"$f":"IF(AND(INTRO!$E$39=\"Non-endemic\",INTRO!$E$37=\"Non-endemic\"),\"Not required\",IF(INTRO!$E$39=\"Non-endemic\",\"Treat with DEC\",COUNTRY_INFO!V26))","v":"Not required"},{"$f":"IF(INTRO!$E$39<>\"Non-endemic\",COUNTRY_INFO!W26,\"Not required\")","v":"Not required"},{"$f":"IF(COUNTRY_INFO!H26=1, IF($E26=1,$D26, 0),0)","v":0},{"$f":"IF(COUNTRY_INFO!I26=1, IF(AND(COUNTRY_INFO!$I26=1,$F26<>0),IF(COUNTRY_INFO!M26>=(COUNTRY_INFO!F26+COUNTRY_INFO!G26),COUNTRY_INFO!F26+COUNTRY_INFO!G26,COUNTRY_INFO!$M26), 0),0)","v":0},0,0,0,0,null,0]
[{"$f":"IF(INTRO!$E$39=\"Non-endemic\",\" \",IF(COUNTRY_INFO!A27=0,\" \",COUNTRY_INFO!A27))","v":" "},{"$f":"IF(INTRO!$E$39=\"Non-endemic\",\" \",IF(COUNTRY_INFO!B27=0,\" \",COUNTRY_INFO!B27))","v":" "},{"$f":"IF(INTRO!$E$39=\"Non-endemic\",\" \",IF(COUNTRY_INFO!C27=0,\" \",COUNTRY_INFO!C27))","v":" "},{"$f":"IF(INTRO!$E$39=\"Non-endemic\",0,IF(INTRO!$E$39=\"Endemic but PC is not required\",IF(COUNTRY_INFO!$H27=1,COUNTRY_INFO!F27+COUNTRY_INFO!G27,0),IF(COUNTRY_INFO!$H27=1,COUNTRY_INFO!F27+COUNTRY_INFO!G27,IF(COUNTRY_INFO!$I27=1,IF(COUNTRY_INFO!M27>=(COUNTRY_INFO!F27+COUNTRY_INFO!G27),COUNTRY_INFO!F27+COUNTRY_INFO!G27,COUNTRY_INFO!$M27),0))))","v":0},{"$f":"IF(AND(INTRO!$E$39=\"Non-endemic\",INTRO!$E$37=\"Non-endemic\"),\"Not required\",IF(INTRO!$E$39=\"Non-endemic\",\"Treat with DEC\",COUNTRY_INFO!V27))","v":"Not required"},{"$f":"IF(INTRO!$E$39<>\"Non-endemic\",COUNTRY_INFO!W27,\"Not required\")","v":"Not required"},{"$f":"IF(COUNTRY_INFO!H27=1, IF($E27=1,$D27, 0),0)","v":0},{"$f":"IF(COUNTRY_INFO!I27=1, IF(AND(COUNTRY_INFO!$I27=1,$F27<>0),IF(COUNTRY_INFO!M27>=(COUNTRY_INFO!F27+COUNTRY_INFO!G27),COUNTRY_INFO!F27+COUNTRY_INFO!G27,COUNTRY_INFO!$M27), 0),0)","v":0},0,0,0,0,null,0]
[{"$f":"IF(INTRO!$E$39=\"Non-endemic\",\" \",IF(COUNTRY_INFO!A28=0,\" \",COUNTRY_INFO!A28))","v":" "},{"$f":"IF(INTRO!$E$39=\"Non-endemic\",\" \",IF(COUNTRY_INFO!B28=0,\" \",COUNTRY_INFO!B28))","v":" "},{"$f":"IF(INTRO!$E$39=\"Non-endemic\",\" \",IF(COUNTRY_INFO!C28=0,\" \",COUNTRY_INFO!C28))","v":" "},{"$f":"IF(INTRO!$E$39=\"Non-endemic\",0,IF(INTRO!$E$39=\"Endemic but PC is not required\",IF(COUNTRY_INFO!$H28=1,COUNTRY_INFO!F28+COUNTRY_INFO!G28,0),IF(COUNTRY_INFO!$H28=1,COUNTRY_INFO!F28+COUNTRY_INFO!G28,IF(COUNTRY_INFO!$I28=1,IF(COUNTRY_INFO!M28>=(COUNTRY_INFO!F28+COUNTRY_INFO!G28),COUNTRY_INFO!F28+COUNTRY_INFO!G28,COUNTRY_INFO!$M28),0))))","v":0},{"$f":"IF(AND(INTRO!$E$39=\"Non-endemic\",INTRO!$E$37=\"Non-endemic\"),\"Not required\",IF(INTRO!$E$39=\"Non-endemic\",\"Treat with DEC\",COUNTRY_INFO!V28))","v":"Not required"},{"$f":"IF(INTRO!$E$39<>\"Non-endemic\",COUNTRY_INFO!W28,\"Not required\")","v":"Not required"},{"$f":"IF(COUNTRY_INFO!H28=1, IF($E28=1,$D28, 0),0)","v":0},{"$f":"IF(COUNTRY_INFO!I28=1, IF(AND(COUNTRY_INFO!$I28=1,$F28<>0),IF(COUNTRY_INFO!M28>=(COUNTRY_INFO!F28+COUNTRY_INFO!G28),COUNTRY_INFO!F28+COUNTRY_INFO!G28,COUNTRY_INFO!$M28), 0),0)","v":0},0,0,0,0,null,0]
[{"$f":"IF(INTRO!$E$39=\"Non-endemic\",\" \",IF(COUNTRY_INFO!A29=0,\" \",COUNTRY_INFO!A29))","v":" "},{"$f":"IF(INTRO!$E$39=\"Non-endemic\",\" \",IF(COUNTRY_INFO!B29=0,\" \",COUNTRY_INFO!B29))","v":" "},{"$f":"IF(INTRO!$E$39=\"Non-endemic\",\" \",IF(COUNTRY_INFO!C29=0,\" \",COUNTRY_INFO!C29))","v":" "},{"$f":"IF(INTRO!$E$39=\"Non-endemic\",0,IF(INTRO!$E$39=\"Endemic but PC is not required\",IF(COUNTRY_INFO!$H29=1,COUNTRY_INFO!F29+COUNTRY_INFO!G29,0),IF(COUNTRY_INFO!$H29=1,COUNTRY_INFO!F29+COUNTRY_INFO!G29,IF(COUNTRY_INFO!$I29=1,IF(COUNTRY_INFO!M29>=(COUNTRY_INFO!F29+COUNTRY_INFO!G29),COUNTRY_INFO!F29+COUNTRY_INFO!G29,COUNTRY_INFO!$M29),0))))","v":0},{"$f":"IF(AND(INTRO!$E$39=\"Non-endemic\",INTRO!$E$37=\"Non-endemic\"),\"Not required\",IF(INTRO!$E$39=\"Non-endemic\",\"Treat with DEC\",COUNTRY_INFO!V29))","v":"Not required"},{"$f":"IF(INTRO!$E$39<>\"Non-endemic\",COUNTRY_INFO!W29,\"Not required\")","v":"Not required"},{"$f":"IF(COUNTRY_INFO!H29=1, IF($E29=1,$D29, 0),0)","v":0},{"$f":"IF(COUNTRY_INFO!I29=1, IF(AND(COUNTRY_INFO!$I29=1,$F29<>0),IF(COUNTRY_INFO!M29>=(COUNTRY_INFO!F29+COUNTRY_INFO!G29),COUNTRY_INFO!F29+COUNTRY_INFO!G29,COUNTRY_INFO!$M29), 0),0)","v":0},0,0,0,0,null,0]
[{"$f":"IF(INTRO!$E$39=\"Non-endemic\",\" \",IF(COUNTRY_INFO!A30=0,\" \",COUNTRY_INFO!A30))","v":" "},{"$f":"IF(INTRO!$E$39=\"Non-endemic\",\" \",IF(COUNTRY_INFO!B30=0,\" \",COUNTRY_INFO!B30))","v":" "},{"$f":"IF(INTRO!$E$39=\"Non-endemic\",\" \",IF(COUNTRY_INFO!C30=0,\" \",COUNTRY_INFO!C30))","v":" "},{"$f":"IF(INTRO!$E$39=\"Non-endemic\",0,IF(INTRO!$E$39=\"Endemic but PC is not required\",IF(COUNTRY_INFO!$H30=1,COUNTRY_INFO!F30+COUNTRY_INFO!G30,0),IF(COUNTRY_INFO!$H30=1,COUNTRY_INFO!F30+COUNTRY_INFO!G30,IF(COUNTRY_INFO!$I30=1,IF(COUNTRY_INFO!M30>=(COUNTRY_INFO!F30+COUNTRY_INFO!G30),COUNTRY_INFO!F30+COUNTRY_INFO!G30,COUNTRY_INFO!$M30),0))))","v":0},{"$f":"IF(AND(INTRO!$E$39=\"Non-endemic\",INTRO!$E$37=\"Non-endemic\"),\"Not required\",IF(INTRO!$E$39=\"Non-endemic\",\"Treat with DEC\",COUNTRY_INFO!V30))","v":"Not required"},{"$f":"IF(INTRO!$E$39<>\"Non-endemic\",COUNTRY_INFO!W30,\"Not required\")","v":"Not required"},{"$f":"IF(COUNTRY_INFO!H30=1, IF($E30=1,$D30, 0),0)","v":0},{"$f":"IF(COUNTRY_INFO!I30=1, IF(AND(COUNTRY_INFO!$I30=1,$F30<>0),IF(COUNTRY_INFO!M30>=(COUNTRY_INFO!F30+COUNTRY_INFO!G30),COUNTRY_INFO!F30+COUNTRY_INFO!G30,COUNTRY_INFO!$M30), 0),0)","v":0},0,0,0,0,null,0]
[{"$f":"IF(INTRO!$E$39=\"Non-endemic\",\" \",IF(COUNTRY_INFO!A31=0,\" \",COUNTRY_INFO!A31))","v":" "},{"$f":"IF(INTRO!$E$39=\"Non-endemic\",\" \",IF(COUNTRY_INFO!B31=0,\" \",COUNTRY_INFO!B31))","v":" "},{"$f":"IF(INTRO!$E$39=\"Non-endemic\",\" \",IF(COUNTRY_INFO!C31=0,\" \",COUNTRY_INFO!C31))","v":" "},{"$f":"IF(INTRO!$E$39=\"Non-endemic\",0,IF(INTRO!$E$39=\"Endemic but PC is not required\",IF(COUNTRY_INFO!$H31=1,COUNTRY_INFO!F31+COUNTRY_INFO!G31,0),IF(COUNTRY_INFO!$H31=1,COUNTRY_INFO!F31+COUNTRY_INFO!G31,IF(COUNTRY_INFO!$I31=1,IF(COUNTRY_INFO!M31>=(COUNTRY_INFO!F31+COUNTRY_INFO!G31),COUNTRY_INFO!F31+COUNTRY_INFO!G31,COUNTRY_INFO!$M31),0))))","v":0},{"$f":"IF(AND(INTRO!$E$39=\"Non-endemic\",INTRO!$E$37=\"Non-endemic\"),\"Not required\",IF(INTRO!$E$39=\"Non-endemic\",\"Treat with DEC\",COUNTRY_INFO!V31))","v":"Not required"},{"$f":"IF(INTRO!$E$39<>\"Non-endemic\",COUNTRY_INFO!W31,\"Not required\")","v":"Not required"},{"$f":"IF(COUNTRY_INFO!H31=1, IF($E31=1,$D31, 0),0)","v":0},{"$f":"IF(COUNTRY_INFO!I31=1, IF(AND(COUNTRY_INFO!$I31=1,$F31<>0),IF(COUNTRY_INFO!M31>=(COUNTRY_INFO!F31+COUNTRY_INFO!G31),COUNTRY_INFO!F31+COUNTRY_INFO!G31,COUNTRY_INFO!$M31), 0),0)","v":0},0,0,0,0,null,0]
[{"$f":"IF(INTRO!$E$39=\"Non-endemic\",\" \",IF(COUNTRY_INFO!A32=0,\" \",COUNTRY_INFO!A32))","v":" "},{"$f":"IF(INTRO!$E$39=\"Non-endemic\",\" \",IF(COUNTRY_INFO!B32=0,\" \",COUNTRY_INFO!B32))","v":" "},{"$f":"IF(INTRO!$E$39=\"Non-endemic\",\" \",IF(COUNTRY_INFO!C32=0,\" \",COUNTRY_INFO!C32))","v":" "},{"$f":"IF(INTRO!$E$39=\"Non-endemic\",0,IF(INTRO!$E$39=\"Endemic but PC is not required\",IF(COUNTRY_INFO!$H32=1,COUNTRY_INFO!F32+COUNTRY_INFO!G32,0),IF(COUNTRY_INFO!$H32=1,COUNTRY_INFO!F32+COUNTRY_INFO!G32,IF(COUNTRY_INFO!$I32=1,IF(COUNTRY_INFO!M32>=(COUNTRY_INFO!F32+COUNTRY_INFO!G32),COUNTRY_INFO!F32+COUNTRY_INFO!G32,COUNTRY_INFO!$M32),0))))","v":0},{"$f":"IF(AND(INTRO!$E$39=\"Non-endemic\",INTRO!$E$37=\"Non-endemic\"),\"Not required\",IF(INTRO!$E$39=\"Non-endemic\",\"Treat with DEC\",COUNTRY_INFO!V32))","v":"Not required"},{"$f":"IF(INTRO!$E$39<>\"Non-endemic\",COUNTRY_INFO!W32,\"Not required\")","v":"Not required"},{"$f":"IF(COUNTRY_INFO!H32=1, IF($E32=1,$D32, 0),0)","v":0},{"$f":"IF(COUNTRY_INFO!I32=1, IF(AND(COUNTRY_INFO!$I32=1,$F32<>0),IF(COUNTRY_INFO!M32>=(COUNTRY_INFO!F32+COUNTRY_INFO!G32),COUNTRY_INFO!F32+COUNTRY_INFO!G32,COUNTRY_INFO!$M32), 0),0)","v":0},0,0,0,0,null,0]
[{"$f":"IF(INTRO!$E$39=\"Non-endemic\",\" \",IF(COUNTRY_INFO!A33=0,\" \",COUNTRY_INFO!A33))","v":" "},{"$f":"IF(INTRO!$E$39=\"Non-endemic\",\" \",IF(COUNTRY_INFO!B33=0,\" \",COUNTRY_INFO!B33))","v":" "},{"$f":"IF(INTRO!$E$39=\"Non-endemic\",\" \",IF(COUNTRY_INFO!C33=0,\" \",COUNTRY_INFO!C33))","v":" "},{"$f":"IF(INTRO!$E$39=\"Non-endemic\",0,IF(INTRO!$E$39=\"Endemic but PC is not required\",IF(COUNTRY_INFO!$H33=1,COUNTRY_INFO!F33+COUNTRY_INFO!G33,0),IF(COUNTRY_INFO!$H33=1,COUNTRY_INFO!F33+COUNTRY_INFO!G33,IF(COUNTRY_INFO!$I33=1,IF(COUNTRY_INFO!M33>=(COUNTRY_INFO!F33+COUNTRY_INFO!G33),COUNTRY_INFO!F33+COUNTRY_INFO!G33,COUNTRY_INFO!$M33),0))))","v":0},{"$f":"IF(AND(INTRO!$E$39=\"Non-endemic\",INTRO!$E$37=\"Non-endemic\"),\"Not required\",IF(INTRO!$E$39=\"Non-endemic\",\"Treat with DEC\",COUNTRY_INFO!V33))","v":"Not required"},{"$f":"IF(INTRO!$E$39<>\"Non-endemic\",COUNTRY_INFO!W33,\"Not required\")","v":"Not required"},{"$f":"IF(COUNTRY_INFO!H33=1, IF($E33=1,$D33, 0),0)","v":0},{"$f":"IF(COUNTRY_INFO!I33=1, IF(AND(COUNTRY_INFO!$I33=1,$F33<>0),IF(COUNTRY_INFO!M33>=(COUNTRY_INFO!F33+COUNTRY_INFO!G33),COUNTRY_INFO!F33+COUNTRY_INFO!G33,COUNTRY_INFO!$M33), 0),0)","v":0},0,0,0,0,null,0]
[{"$f":"IF(INTRO!$E$39=\"Non-endemic\",\" \",IF(COUNTRY_INFO!A34=0,\" \",COUNTRY_INFO!A34))","v":" "},{"$f":"IF(INTRO!$E$39=\"Non-endemic\",\" \",IF(COUNTRY_INFO!B34=0,\" \",COUNTRY_INFO!B34))","v":" "},{"$f":"IF(INTRO!$E$39=\"Non-endemic\",\" \",IF(COUNTRY_INFO!C34=0,\" \",COUNTRY_INFO!C34))","v":" "},{"$f":"IF(INTRO!$E$39=\"Non-endemic\",0,IF(INTRO!$E$39=\"Endemic but PC is not required\",IF(COUNTRY_INFO!$H34=1,COUNTRY_INFO!F34+COUNTRY_INFO!G34,0),IF(COUNTRY_INFO!$H34=1,COUNTRY_INFO!F34+COUNTRY_INFO!G34,IF(COUNTRY_INFO!$I34=1,IF(COUNTRY_INFO!M34>=(COUNTRY_INFO!F34+COUNTRY_INFO!G34),COUNTRY_INFO!F34+COUNTRY_INFO!G34,COUNTRY_INFO!$M34),0))))","v":0},{"$f":"IF(AND(INTRO!$E$39=\"Non-endemic\",INTRO!$E$37=\"Non-endemic\"),\"Not required\",IF(INTRO!$E$39=\"Non-endemic\",\"Treat with DEC\",COUNTRY_INFO!V34))","v":"Not required"},{"$f":"IF(INTRO!$E$39<>\"Non-endemic\",COUNTRY_INFO!W34,\"Not required\")","v":"Not required"},{"$f":"IF(COUNTRY_INFO!H34=1, IF($E34=1,$D34, 0),0)","v":0},{"$f":"IF(COUNTRY_INFO!I34=1, IF(AND(COUNTRY_INFO!$I34=1,$F34<>0),IF(COUNTRY_INFO!M34>=(COUNTRY_INFO!F34+COUNTRY_INFO!G34),COUNTRY_INFO!F34+COUNTRY_INFO!G34,COUNTRY_INFO!$M34), 0),0)","v":0},0,0,0,0,null,0]
[{"$f":"IF(INTRO!$E$39=\"Non-endemic\",\" \",IF(COUNTRY_INFO!A35=0,\" \",COUNTRY_INFO!A35))","v":" "},{"$f":"IF(INTRO!$E$39=\"Non-endemic\",\" \",IF(COUNTRY_INFO!B35=0,\" \",COUNTRY_INFO!B35))","v":" "},{"$f":"IF(INTRO!$E$39=\"Non-endemic\",\" \",IF(COUNTRY_INFO!C35=0,\" \",COUNTRY_INFO!C35))","v":" "},{"$f":"IF(INTRO!$E$39=\"Non-endemic\",0,IF(INTRO!$E$39=\"Endemic but PC is not required\",IF(COUNTRY_INFO!$H35=1,COUNTRY_INFO!F35+COUNTRY_INFO!G35,0),IF(COUNTRY_INFO!$H35=1,COUNTRY_INFO!F35+COUNTRY_INFO!G35,IF(COUNTRY_INFO!$I35=1,IF(COUNTRY_INFO!M35>=(COUNTRY_INFO!F35+COUNTRY_INFO!G35),COUNTRY_INFO!F35+COUNTRY_INFO!G35,COUNTRY_INFO!$M35),0))))","v":0},{"$f":"IF(AND(INTRO!$E$39=\"Non-endemic\",INTRO!$E$37=\"Non-endemic\"),\"Not required\",IF(INTRO!$E$39=\"Non-endemic\",\"Treat with DEC\",COUNTRY_INFO!V35))","v":"Not required"},{"$f":"IF(INTRO!$E$39<>\"Non-endemic\",COUNTRY_INFO!W35,\"Not required\")","v":"Not required"},{"$f":"IF(COUNTRY_INFO!H35=1, IF($E35=1,$D35, 0),0)","v":0},{"$f":"IF(COUNTRY_INFO!I35=1, IF(AND(COUNTRY_INFO!$I35=1,$F35<>0),IF(COUNTRY_INFO!M35>=(COUNTRY_INFO!F35+COUNTRY_INFO!G35),COUNTRY_INFO!F35+COUNTRY_INFO!G35,COUNTRY_INFO!$M35), 0),0)","v":0},0,0,0,0,null,0]
[{"$f":"IF(INTRO!$E$39=\"Non-endemic\",\" \",IF(COUNTRY_INFO!A36=0,\" \",COUNTRY_INFO!A36))","v":" "},{"$f":"IF(INTRO!$E$39=\"Non-endemic\",\" \",IF(COUNTRY_INFO!B36=0,\" \",COUNTRY_INFO!B36))","v":" "},{"$f":"IF(INTRO!$E$39=\"Non-endemic\",\" \",IF(COUNTRY_INFO!C36=0,\" \",COUNTRY_INFO!C36))","v":" "},{"$f":"IF(INTRO!$E$39=\"Non-endemic\",0,IF(INTRO!$E$39=\"Endemic but PC is not required\",IF(COUNTRY_INFO!$H36=1,COUNTRY_INFO!F36+COUNTRY_INFO!G36,0),IF(COUNTRY_INFO!$H36=1,COUNTRY_INFO!F36+COUNTRY_INFO!G36,IF(COUNTRY_INFO!$I36=1,IF(COUNTRY_INFO!M36>=(COUNTRY_INFO!F36+COUNTRY_INFO!G36),COUNTRY_INFO!F36+COUNTRY_INFO!G36,COUNTRY_INFO!$M36),0))))","v":0},{"$f":"IF(AND(INTRO!$E$39=\"Non-endemic\",INTRO!$E$37=\"Non-endemic\"),\"Not required\",IF(INTRO!$E$39=\"Non-endemic\",\"Treat with DEC\",COUNTRY_INFO!V36))","v":"Not required"},{"$f":"IF(INTRO!$E$39<>\"Non-endemic\",COUNTRY_INFO!W36,\"Not required\")","v":"Not required"},{"$f":"IF(COUNTRY_INFO!H36=1, IF($E36=1,$D36, 0),0)","v":0},{"$f":"IF(COUNTRY_INFO!I36=1, IF(AND(COUNTRY_INFO!$I36=1,$F36<>0),IF(COUNTRY_INFO!M36>=(COUNTRY_INFO!F36+COUNTRY_INFO!G36),COUNTRY_INFO!F36+COUNTRY_INFO!G36,COUNTRY_INFO!$M36), 0),0)","v":0},0,0,0,0,null,0]
[{"$f":"IF(INTRO!$E$39=\"Non-endemic\",\" \",IF(COUNTRY_INFO!A37=0,\" \",COUNTRY_INFO!A37))","v":" "},{"$f":"IF(INTRO!$E$39=\"Non-endemic\",\" \",IF(COUNTRY_INFO!B37=0,\" \",COUNTRY_INFO!B37))","v":" "},{"$f":"IF(INTRO!$E$39=\"Non-endemic\",\" \",IF(COUNTRY_INFO!C37=0,\" \",COUNTRY_INFO!C37))","v":" "},{"$f":"IF(INTRO!$E$39=\"Non-endemic\",0,IF(INTRO!$E$39=\"Endemic but PC is not required\",IF(COUNTRY_INFO!$H37=1,COUNTRY_INFO!F37+COUNTRY_INFO!G37,0),IF(COUNTRY_INFO!$H37=1,COUNTRY_INFO!F37+COUNTRY_INFO!G37,IF(COUNTRY_INFO!$I37=1,IF(COUNTRY_INFO!M37>=(COUNTRY_INFO!F37+COUNTRY_INFO!G37),COUNTRY_INFO!F37+COUNTRY_INFO!G37,COUNTRY_INFO!$M37),0))))","v":0},{"$f":"IF(AND(INTRO!$E$39=\"Non-endemic\",INTRO!$E$37=\"Non-endemic\"),\"Not required\",IF(INTRO!$E$39=\"Non-endemic\",\"Treat with DEC\",COUNTRY_INFO!V37))","v":"Not required"},{"$f":"IF(INTRO!$E$39<>\"Non-endemic\",COUNTRY_INFO!W37,\"Not required\")","v":"Not required"},{"$f":"IF(COUNTRY_INFO!H37=1, IF($E37=1,$D37, 0),0)","v":0},{"$f":"IF(COUNTRY_INFO!I37=1, IF(AND(COUNTRY_INFO!$I37=1,$F37<>0),IF(COUNTRY_INFO!M37>=(COUNTRY_INFO!F37+COUNTRY_INFO!G37),COUNTRY_INFO!F37+COUNTRY_INFO!G37,COUNTRY_INFO!$M37), 0),0)","v":0},0,0,0,0,null,0]
[{"$f":"IF(INTRO!$E$39=\"Non-endemic\",\" \",IF(COUNTRY_INFO!A38=0,\" \",COUNTRY_INFO!A38))","v":" "},{"$f":"IF(INTRO!$E$39=\"Non-endemic\",\" \",IF(COUNTRY_INFO!B38=0,\" \",COUNTRY_INFO!B38))","v":" "},{"$f":"IF(INTRO!$E$39=\"Non-endemic\",\" \",IF(COUNTRY_INFO!C38=0,\" \",COUNTRY_INFO!C38))","v":" "},{"$f":"IF(INTRO!$E$39=\"Non-endemic\",0,IF(INTRO!$E$39=\"Endemic but PC is not required\",IF(COUNTRY_INFO!$H38=1,COUNTRY_INFO!F38+COUNTRY_INFO!G38,0),IF(COUNTRY_INFO!$H38=1,COUNTRY_INFO!F38+COUNTRY_INFO!G38,IF(COUNTRY_INFO!$I38=1,IF(COUNTRY_INFO!M38>=(COUNTRY_INFO!F38+COUNTRY_INFO!G38),COUNTRY_INFO!F38+COUNTRY_INFO!G38,COUNTRY_INFO!$M38),0))))","v":0},{"$f":"IF(AND(INTRO!$E$39=\"Non-endemic\",INTRO!$E$37=\"Non-endemic\"),\"Not required\",IF(INTRO!$E$39=\"Non-endemic\",\"Treat with DEC\",COUNTRY_INFO!V38))","v":"Not required"},{"$f":"IF(INTRO!$E$39<>\"Non-endemic\",COUNTRY_INFO!W38,\"Not required\")","v":"Not required"},{"$f":"IF(COUNTRY_INFO!H38=1, IF($E38=1,$D38, 0),0)","v":0},{"$f":"IF(COUNTRY_INFO!I38=1, IF(AND(COUNTRY_INFO!$I38=1,$F38<>0),IF(COUNTRY_INFO!M38>=(COUNTRY_INFO!F38+COUNTRY_INFO!G38),COUNTRY_INFO!F38+COUNTRY_INFO!G38,COUNTRY_INFO!$M38), 0),0)","v":0},0,0,0,0,null,0]
[{"$f":"IF(INTRO!$E$39=\"Non-endemic\",\" \",IF(COUNTRY_INFO!A39=0,\" \",COUNTRY_INFO!A39))","v":" "},{"$f":"IF(INTRO!$E$39=\"Non-endemic\",\" \",IF(COUNTRY_INFO!B39=0,\" \",COUNTRY_INFO!B39))","v":" "},{"$f":"IF(INTRO!$E$39=\"Non-endemic\",\" \",IF(COUNTRY_INFO!C39=0,\" \",COUNTRY_INFO!C39))","v":" "},{"$f":"IF(INTRO!$E$39=\"Non-endemic\",0,IF(INTRO!$E$39=\"Endemic but PC is not required\",IF(COUNTRY_INFO!$H39=1,COUNTRY_INFO!F39+COUNTRY_INFO!G39,0),IF(COUNTRY_INFO!$H39=1,COUNTRY_INFO!F39+COUNTRY_INFO!G39,IF(COUNTRY_INFO!$I39=1,IF(COUNTRY_INFO!M39>=(COUNTRY_INFO!F39+COUNTRY_INFO!G39),COUNTRY_INFO!F39+COUNTRY_INFO!G39,COUNTRY_INFO!$M39),0))))","v":0},{"$f":"IF(AND(INTRO!$E$39=\"Non-endemic\",INTRO!$E$37=\"Non-endemic\"),\"Not required\",IF(INTRO!$E$39=\"Non-endemic\",\"Treat with DEC\",COUNTRY_INFO!V39))","v":"Not required"},{"$f":"IF(INTRO!$E$39<>\"Non-endemic\",COUNTRY_INFO!W39,\"Not required\")","v":"Not required"},{"$f":"IF(COUNTRY_INFO!H39=1, IF($E39=1,$D39, 0),0)","v":0},{"$f":"IF(COUNTRY_INFO!I39=1, IF(AND(COUNTRY_INFO!$I39=1,$F39<>0),IF(COUNTRY_INFO!M39>=(COUNTRY_INFO!F39+COUNTRY_INFO!G39),COUNTRY_INFO!F39+COUNTRY_INFO!G39,COUNTRY_INFO!$M39), 0),0)","v":0},0,0,0,0,null,0]
[{"$f":"IF(INTRO!$E$39=\"Non-endemic\",\" \",IF(COUNTRY_INFO!A40=0,\" \",COUNTRY_INFO!A40))","v":" "},{"$f":"IF(INTRO!$E$39=\"Non-endemic\",\" \",IF(COUNTRY_INFO!B40=0,\" \",COUNTRY_INFO!B40))","v":" "},{"$f":"IF(INTRO!$E$39=\"Non-endemic\",\" \",IF(COUNTRY_INFO!C40=0,\" \",COUNTRY_INFO!C40))","v":" "},{"$f":"IF(INTRO!$E$39=\"Non-endemic\",0,IF(INTRO!$E$39=\"Endemic but PC is not required\",IF(COUNTRY_INFO!$H40=1,COUNTRY_INFO!F40+COUNTRY_INFO!G40,0),IF(COUNTRY_INFO!$H40=1,COUNTRY_INFO!F40+COUNTRY_INFO!G40,IF(COUNTRY_INFO!$I40=1,IF(COUNTRY_INFO!M40>=(COUNTRY_INFO!F40+COUNTRY_INFO!G40),COUNTRY_INFO!F40+COUNTRY_INFO!G40,COUNTRY_INFO!$M40),0))))","v":0},{"$f":"IF(AND(INTRO!$E$39=\"Non-endemic\",INTRO!$E$37=\"Non-endemic\"),\"Not required\",IF(INTRO!$E$39=\"Non-endemic\",\"Treat with DEC\",COUNTRY_INFO!V40))","v":"Not required"},{"$f":"IF(INTRO!$E$39<>\"Non-endemic\",COUNTRY_INFO!W40,\"Not required\")","v":"Not required"},{"$f":"IF(COUNTRY_INFO!H40=1, IF($E40=1,$D40, 0),0)","v":0},{"$f":"IF(COUNTRY_INFO!I40=1, IF(AND(COUNTRY_INFO!$I40=1,$F40<>0),IF(COUNTRY_INFO!M40>=(COUNTRY_INFO!F40+COUNTRY_INFO!G40),COUNTRY_INFO!F40+COUNTRY_INFO!G40,COUNTRY_INFO!$M40), 0),0)","v":0},0,0,0,0,null,0]
[{"$f":"IF(INTRO!$E$39=\"Non-endemic\",\" \",IF(COUNTRY_INFO!A41=0,\" \",COUNTRY_INFO!A41))","v":" "},{"$f":"IF(INTRO!$E$39=\"Non-endemic\",\" \",IF(COUNTRY_INFO!B41=0,\" \",COUNTRY_INFO!B41))","v":" "},{"$f":"IF(INTRO!$E$39=\"Non-endemic\",\" \",IF(COUNTRY_INFO!C41=0,\" \",COUNTRY_INFO!C41))","v":" "},{"$f":"IF(INTRO!$E$39=\"Non-endemic\",0,IF(INTRO!$E$39=\"Endemic but PC is not required\",IF(COUNTRY_INFO!$H41=1,COUNTRY_INFO!F41+COUNTRY_INFO!G41,0),IF(COUNTRY_INFO!$H41=1,COUNTRY_INFO!F41+COUNTRY_INFO!G41,IF(COUNTRY_INFO!$I41=1,IF(COUNTRY_INFO!M41>=(COUNTRY_INFO!F41+COUNTRY_INFO!G41),COUNTRY_INFO!F41+COUNTRY_INFO!G41,COUNTRY_INFO!$M41),0))))","v":0},{"$f":"IF(AND(INTRO!$E$39=\"Non-endemic\",INTRO!$E$37=\"Non-endemic\"),\"Not required\",IF(INTRO!$E$39=\"Non-endemic\",\"Treat with DEC\",COUNTRY_INFO!V41))","v":"Not required"},{"$f":"IF(INTRO!$E$39<>\"Non-endemic\",COUNTRY_INFO!W41,\"Not required\")","v":"Not required"},{"$f":"IF(COUNTRY_INFO!H41=1, IF($E41=1,$D41, 0),0)","v":0},{"$f":"IF(COUNTRY_INFO!I41=1, IF(AND(COUNTRY_INFO!$I41=1,$F41<>0),IF(COUNTRY_INFO!M41>=(COUNTRY_INFO!F41+COUNTRY_INFO!G41),COUNTRY_INFO!F41+COUNTRY_INFO!G41,COUNTRY_INFO!$M41), 0),0)","v":0},0,0,0,0,null,0]
[{"$f":"IF(INTRO!$E$39=\"Non-endemic\",\" \",IF(COUNTRY_INFO!A42=0,\" \",COUNTRY_INFO!A42))","v":" "},{"$f":"IF(INTRO!$E$39=\"Non-endemic\",\" \",IF(COUNTRY_INFO!B42=0,\" \",COUNTRY_INFO!B42))","v":" "},{"$f":"IF(INTRO!$E$39=\"Non-endemic\",\" \",IF(COUNTRY_INFO!C42=0,\" \",COUNTRY_INFO!C42))","v":" "},{"$f":"IF(INTRO!$E$39=\"Non-endemic\",0,IF(INTRO!$E$39=\"Endemic but PC is not required\",IF(COUNTRY_INFO!$H42=1,COUNTRY_INFO!F42+COUNTRY_INFO!G42,0),IF(COUNTRY_INFO!$H42=1,COUNTRY_INFO!F42+COUNTRY_INFO!G42,IF(COUNTRY_INFO!$I42=1,IF(COUNTRY_INFO!M42>=(COUNTRY_INFO!F42+COUNTRY_INFO!G42),COUNTRY_INFO!F42+COUNTRY_INFO!G42,COUNTRY_INFO!$M42),0))))","v":0},{"$f":"IF(AND(INTRO!$E$39=\"Non-endemic\",INTRO!$E$37=\"Non-endemic\"),\"Not required\",IF(INTRO!$E$39=\"Non-endemic\",\"Treat with DEC\",COUNTRY_INFO!V42))","v":"Not required"},{"$f":"IF(INTRO!$E$39<>\"Non-endemic\",COUNTRY_INFO!W42,\"Not required\")","v":"Not required"},{"$f":"IF(COUNTRY_INFO!H42=1, IF($E42=1,$D42, 0),0)","v":0},{"$f":"IF(COUNTRY_INFO!I42=1, IF(AND(COUNTRY_INFO!$I42=1,$F42<>0),IF(COUNTRY_INFO!M42>=(COUNTRY_INFO!F42+COUNTRY_INFO!G42),COUNTRY_INFO!F42+COUNTRY_INFO!G42,COUNTRY_INFO!$M42), 0),0)","v":0},{"$f":"IF(G42<H42,0,IF($E42=1, (G42-H42)*2.8, 0))","v":0},{"$f":"IF($E42<$F42, H42*(F42-E42)*2.8, 0)","v":0},0,0,null,0]
[{"$f":"IF(INTRO!$E$39=\"Non-endemic\",\" \",IF(COUNTRY_INFO!A43=0,\" \",COUNTRY_INFO!A43))","v":" "},{"$f":"IF(INTRO!$E$39=\"Non-endemic\",\" \",IF(COUNTRY_INFO!B43=0,\" \",COUNTRY_INFO!B43))","v":" "},{"$f":"IF(INTRO!$E$39=\"Non-endemic\",\" \",IF(COUNTRY_INFO!C43=0,\" \",COUNTRY_INFO!C43))","v":" "},{"$f":"IF(INTRO!$E$39=\"Non-endemic\",0,IF(INTRO!$E$39=\"Endemic but PC is not required\",IF(COUNTRY_INFO!$H43=1,COUNTRY_INFO!F43+COUNTRY_INFO!G43,0),IF(COUNTRY_INFO!$H43=1,COUNTRY_INFO!F43+COUNTRY_INFO!G43,IF(COUNTRY_INFO!$I43=1,IF(COUNTRY_INFO!M43>=(COUNTRY_INFO!F43+COUNTRY_INFO!G43),COUNTRY_INFO!F43+COUNTRY_INFO!G43,COUNTRY_INFO!$M43),0))))","v":0},{"$f":"IF(AND(INTRO!$E$39=\"Non-endemic\",INTRO!$E$37=\"Non-endemic\"),\"Not required\",IF(INTRO!$E$39=\"Non-endemic\",\"Treat with DEC\",COUNTRY_INFO!V43))","v":"Not required"},{"$f":"IF(INTRO!$E$39<>\"Non-endemic\",COUNTRY_INFO!W43,\"Not required\")","v":"Not required"},{"$f":"IF(COUNTRY_INFO!H43=1, IF($E43=1,$D43, 0),0)","v":0},{"$f":"IF(COUNTRY_INFO!I43=1, IF(AND(COUNTRY_INFO!$I43=1,$F43<>0),IF(COUNTRY_INFO!M43>=(COUNTRY_INFO!F43+COUNTRY_INFO!G43),COUNTRY_INFO!F43+COUNTRY_INFO!G43,COUNTRY_INFO!$M43), 0),0)","v":0},0,0,0,0,null,0]
[{"$f":"IF(INTRO!$E$39=\"Non-endemic\",\" \",IF(COUNTRY_INFO!A44=0,\" \",COUNTRY_INFO!A44))","v":" "},{"$f":"IF(INTRO!$E$39=\"Non-endemic\",\" \",IF(COUNTRY_INFO!B44=0,\" \",COUNTRY_INFO!B44))","v":" "},{"$f":"IF(INTRO!$E$39=\"Non-endemic\",\" \",IF(COUNTRY_INFO!C44=0,\" \",COUNTRY_INFO!C44))","v":" "},{"$f":"IF(INTRO!$E$39=\"Non-endemic\",0,IF(INTRO!$E$39=\"Endemic but PC is not required\",IF(COUNTRY_INFO!$H44=1,COUNTRY_INFO!F44+COUNTRY_INFO!G44,0),IF(COUNTRY_INFO!$H44=1,COUNTRY_INFO!F44+COUNTRY_INFO!G44,IF(COUNTRY_INFO!$I44=1,IF(COUNTRY_INFO!M44>=(COUNTRY_INFO!F44+COUNTRY_INFO!G44),COUNTRY_INFO!F44+COUNTRY_INFO!G44,COUNTRY_INFO!$M44),0))))","v":0},{"$f":"IF(AND(INTRO!$E$39=\"Non-endemic\",INTRO!$E$37=\"Non-endemic\"),\"Not required\",IF(INTRO!$E$39=\"Non-endemic\",\"Treat with DEC\",COUNTRY_INFO!V44))","v":"Not required"},{"$f":"IF(INTRO!$E$39<>\"Non-endemic\",COUNTRY_INFO!W44,\"Not required\")","v":"Not required"},{"$f":"IF(COUNTRY_INFO!H44=1, IF($E44=1,$D44, 0),0)","v":0},{"$f":"IF(COUNTRY_INFO!I44=1, IF(AND(COUNTRY_INFO!$I44=1,$F44<>0),IF(COUNTRY_INFO!M44>=(COUNTRY_INFO!F44+COUNTRY_INFO!G44),COUNTRY_INFO!F44+COUNTRY_INFO!G44,COUNTRY_INFO!$M44), 0),0)","v":0},0,0,0,0,null,0]
[{"$f":"IF(INTRO!$E$39=\"Non-endemic\",\" \",IF(COUNTRY_INFO!A45=0,\" \",COUNTRY_INFO!A45))","v":" "},{"$f":"IF(INTRO!$E$39=\"Non-endemic\",\" \",IF(COUNTRY_INFO!B45=0,\" \",COUNTRY_INFO!B45))","v":" "},{"$f":"IF(INTRO!$E$39=\"Non-endemic\",\" \",IF(COUNTRY_INFO!C45=0,\" \",COUNTRY_INFO!C45))","v":" "},{"$f":"IF(INTRO!$E$39=\"Non-endemic\",0,IF(INTRO!$E$39=\"Endemic but PC is not required\",IF(COUNTRY_INFO!$H45=1,COUNTRY_INFO!F45+COUNTRY_INFO!G45,0),IF(COUNTRY_INFO!$H45=1,COUNTRY_INFO!F45+COUNTRY_INFO!G45,IF(COUNTRY_INFO!$I45=1,IF(COUNTRY_INFO!M45>=(COUNTRY_INFO!F45+COUNTRY_INFO!G45),COUNTRY_INFO!F45+COUNTRY_INFO!G45,COUNTRY_INFO!$M45),0))))","v":0},{"$f":"IF(AND(INTRO!$E$39=\"Non-endemic\",INTRO!$E$37=\"Non-endemic\"),\"Not required\",IF(INTRO!$E$39=\"Non-endemic\",\"Treat with DEC\",COUNTRY_INFO!V45))","v":"Not required"},{"$f":"IF(INTRO!$E$39<>\"Non-endemic\",COUNTRY_INFO!W45,\"Not required\")","v":"Not required"},{"$f":"IF(COUNTRY_INFO!H45=1, IF($E45=1,$D45, 0),0)","v":0},{"$f":"IF(COUNTRY_INFO!I45=1, IF(AND(COUNTRY_INFO!$I45=1,$F45<>0),IF(COUNTRY_INFO!M45>=(COUNTRY_INFO!F45+COUNTRY_INFO!G45),COUNTRY_INFO!F45+COUNTRY_INFO!G45,COUNTRY_INFO!$M45), 0),0)","v":0},0,0,0,0,null,0]
[{"$f":"IF(INTRO!$E$39=\"Non-endemic\",\" \",IF(COUNTRY_INFO!A46=0,\" \",COUNTRY_INFO!A46))","v":" "},{"$f":"IF(INTRO!$E$39=\"Non-endemic\",\" \",IF(COUNTRY_INFO!B46=0,\" \",COUNTRY_INFO!B46))","v":" "},{"$f":"IF(INTRO!$E$39=\"Non-endemic\",\" \",IF(COUNTRY_INFO!C46=0,\" \",COUNTRY_INFO!C46))","v":" "},{"$f":"IF(INTRO!$E$39=\"Non-endemic\",0,IF(INTRO!$E$39=\"Endemic but PC is not required\",IF(COUNTRY_INFO!$H46=1,COUNTRY_INFO!F46+COUNTRY_INFO!G46,0),IF(COUNTRY_INFO!$H46=1,COUNTRY_INFO!F46+COUNTRY_INFO!G46,IF(COUNTRY_INFO!$I46=1,IF(COUNTRY_INFO!M46>=(COUNTRY_INFO!F46+COUNTRY_INFO!G46),COUNTRY_INFO!F46+COUNTRY_INFO!G46,COUNTRY_INFO!$M46),0))))","v":0},{"$f":"IF(AND(INTRO!$E$39=\"Non-endemic\",INTRO!$E$37=\"Non-endemic\"),\"Not required\",IF(INTRO!$E$39=\"Non-endemic\",\"Treat with DEC\",COUNTRY_INFO!V46))","v":"Not required"},{"$f":"IF(INTRO!$E$39<>\"Non-endemic\",COUNTRY_INFO!W46,\"Not required\")","v":"Not required"},{"$f":"IF(COUNTRY_INFO!H46=1, IF($E46=1,$D46, 0),0)","v":0},{"$f":"IF(COUNTRY_INFO!I46=1, IF(AND(COUNTRY_INFO!$I46=1,$F46<>0),IF(COUNTRY_INFO!M46>=(COUNTRY_INFO!F46+COUNTRY_INFO!G46),COUNTRY_INFO!F46+COUNTRY_INFO!G46,COUNTRY_INFO!$M46), 0),0)","v":0},0,0,0,0,null,0]
[{"$f":"IF(INTRO!$E$39=\"Non-endemic\",\" \",IF(COUNTRY_INFO!A47=0,\" \",COUNTRY_INFO!A47))","v":" "},{"$f":"IF(INTRO!$E$39=\"Non-endemic\",\" \",IF(COUNTRY_INFO!B47=0,\" \",COUNTRY_INFO!B47))","v":" "},{"$f":"IF(INTRO!$E$39=\"Non-endemic\",\" \",IF(COUNTRY_INFO!C47=0,\" \",COUNTRY_INFO!C47))","v":" "},{"$f":"IF(INTRO!$E$39=\"Non-endemic\",0,IF(INTRO!$E$39=\"Endemic but PC is not required\",IF(COUNTRY_INFO!$H47=1,COUNTRY_INFO!F47+COUNTRY_INFO!G47,0),IF(COUNTRY_INFO!$H47=1,COUNTRY_INFO!F47+COUNTRY_INFO!G47,IF(COUNTRY_INFO!$I47=1,IF(COUNTRY_INFO!M47>=(COUNTRY_INFO!F47+COUNTRY_INFO!G47),COUNTRY_INFO!F47+COUNTRY_INFO!G47,COUNTRY_INFO!$M47),0))))","v":0},{"$f":"IF(AND(INTRO!$E$39=\"Non-endemic\",INTRO!$E$37=\"Non-endemic\"),\"Not required\",IF(INTRO!$E$39=\"Non-endemic\",\"Treat with DEC\",COUNTRY_INFO!V47))","v":"Not required"},{"$f":"IF(INTRO!$E$39<>\"Non-endemic\",COUNTRY_INFO!W47,\"Not required\")","v":"Not required"},{"$f":"IF(COUNTRY_INFO!H47=1, IF($E47=1,$D47, 0),0)","v":0},{"$f":"IF(COUNTRY_INFO!I47=1, IF(AND(COUNTRY_INFO!$I47=1,$F47<>0),IF(COUNTRY_INFO!M47>=(COUNTRY_INFO!F47+COUNTRY_INFO!G47),COUNTRY_INFO!F47+COUNTRY_INFO!G47,COUNTRY_INFO!$M47), 0),0)","v":0},0,0,0,0,null,0]
[{"$f":"IF(INTRO!$E$39=\"Non-endemic\",\" \",IF(COUNTRY_INFO!A48=0,\" \",COUNTRY_INFO!A48))","v":" "},{"$f":"IF(INTRO!$E$39=\"Non-endemic\",\" \",IF(COUNTRY_INFO!B48=0,\" \",COUNTRY_INFO!B48))","v":" "},{"$f":"IF(INTRO!$E$39=\"Non-endemic\",\" \",IF(COUNTRY_INFO!C48=0,\" \",COUNTRY_INFO!C48))","v":" "},{"$f":"IF(INTRO!$E$39=\"Non-endemic\",0,IF(INTRO!$E$39=\"Endemic but PC is not required\",IF(COUNTRY_INFO!$H48=1,COUNTRY_INFO!F48+COUNTRY_INFO!G48,0),IF(COUNTRY_INFO!$H48=1,COUNTRY_INFO!F48+COUNTRY_INFO!G48,IF(COUNTRY_INFO!$I48=1,IF(COUNTRY_INFO!M48>=(COUNTRY_INFO!F48+COUNTRY_INFO!G48),COUNTRY_INFO!F48+COUNTRY_INFO!G48,COUNTRY_INFO!$M48),0))))","v":0},{"$f":"IF(AND(INTRO!$E$39=\"Non-endemic\",INTRO!$E$37=\"Non-endemic\"),\"Not required\",IF(INTRO!$E$39=\"Non-endemic\",\"Treat with DEC\",COUNTRY_INFO!V48))","v":"Not required"},{"$f":"IF(INTRO!$E$39<>\"Non-endemic\",COUNTRY_INFO!W48,\"Not required\")","v":"Not required"},{"$f":"IF(COUNTRY_INFO!H48=1, IF($E48=1,$D48, 0),0)","v":0},{"$f":"IF(COUNTRY_INFO!I48=1, IF(AND(COUNTRY_INFO!$I48=1,$F48<>0),IF(COUNTRY_INFO!M48>=(COUNTRY_INFO!F48+COUNTRY_INFO!G48),COUNTRY_INFO!F48+COUNTRY_INFO!G48,COUNTRY_INFO!$M48), 0),0)","v":0},0,0,0,0,null,0]
[{"$f":"IF(INTRO!$E$39=\"Non-endemic\",\" \",IF(COUNTRY_INFO!A49=0,\" \",COUNTRY_INFO!A49))","v":" "},{"$f":"IF(INTRO!$E$39=\"Non-endemic\",\" \",IF(COUNTRY_INFO!B49=0,\" \",COUNTRY_INFO!B49))","v":" "},{"$f":"IF(INTRO!$E$39=\"Non-endemic\",\" \",IF(COUNTRY_INFO!C49=0,\" \",COUNTRY_INFO!C49))","v":" "},{"$f":"IF(INTRO!$E$39=\"Non-endemic\",0,IF(INTRO!$E$39=\"Endemic but PC is not required\",IF(COUNTRY_INFO!$H49=1,COUNTRY_INFO!F49+COUNTRY_INFO!G49,0),IF(COUNTRY_INFO!$H49=1,COUNTRY_INFO!F49+COUNTRY_INFO!G49,IF(COUNTRY_INFO!$I49=1,IF(COUNTRY_INFO!M49>=(COUNTRY_INFO!F49+COUNTRY_INFO!G49),COUNTRY_INFO!F49+COUNTRY_INFO!G49,COUNTRY_INFO!$M49),0))))","v":0},{"$f":"IF(AND(INTRO!$E$39=\"Non-endemic\",INTRO!$E$37=\"Non-endemic\"),\"Not required\",IF(INTRO!$E$39=\"Non-endemic\",\"Treat with DEC\",COUNTRY_INFO!V49))","v":"Not required"},{"$f":"IF(INTRO!$E$39<>\"Non-endemic\",COUNTRY_INFO!W49,\"Not required\")","v":"Not required"},{"$f":"IF(COUNTRY_INFO!H49=1, IF($E49=1,$D49, 0),0)","v":0},{"$f":"IF(COUNTRY_INFO!I49=1, IF(AND(COUNTRY_INFO!$I49=1,$F49<>0),IF(COUNTRY_INFO!M49>=(COUNTRY_INFO!F49+COUNTRY_INFO!G49),COUNTRY_INFO!F49+COUNTRY_INFO!G49,COUNTRY_INFO!$M49), 0),0)","v":0},0,0,0,0,null,0]
[{"$f":"IF(INTRO!$E$39=\"Non-endemic\",\" \",IF(COUNTRY_INFO!A50=0,\" \",COUNTRY_INFO!A50))","v":" "},{"$f":"IF(INTRO!$E$39=\"Non-endemic\",\" \",IF(COUNTRY_INFO!B50=0,\" \",COUNTRY_INFO!B50))","v":" "},{"$f":"IF(INTRO!$E$39=\"Non-endemic\",\" \",IF(COUNTRY_INFO!C50=0,\" \",COUNTRY_INFO!C50))","v":" "},{"$f":"IF(INTRO!$E$39=\"Non-endemic\",0,IF(INTRO!$E$39=\"Endemic but PC is not required\",IF(COUNTRY_INFO!$H50=1,COUNTRY_INFO!F50+COUNTRY_INFO!G50,0),IF(COUNTRY_INFO!$H50=1,COUNTRY_INFO!F50+COUNTRY_INFO!G50,IF(COUNTRY_INFO!$I50=1,IF(COUNTRY_INFO!M50>=(COUNTRY_INFO!F50+COUNTRY_INFO!G50),COUNTRY_INFO!F50+COUNTRY_INFO!G50,COUNTRY_INFO!$M50),0))))","v":0},{"$f":"IF(AND(INTRO!$E$39=\"Non-endemic\",INTRO!$E$37=\"Non-endemic\"),\"Not required\",IF(INTRO!$E$39=\"Non-endemic\",\"Treat with DEC\",COUNTRY_INFO!V50))","v":"Not required"},{"$f":"IF(INTRO!$E$39<>\"Non-endemic\",COUNTRY_INFO!W50,\"Not required\")","v":"Not required"},{"$f":"IF(COUNTRY_INFO!H50=1, IF($E50=1,$D50, 0),0)","v":0},{"$f":"IF(COUNTRY_INFO!I50=1, IF(AND(COUNTRY_INFO!$I50=1,$F50<>0),IF(COUNTRY_INFO!M50>=(COUNTRY_INFO!F50+COUNTRY_INFO!G50),COUNTRY_INFO!F50+COUNTRY_INFO!G50,COUNTRY_INFO!$M50), 0),0)","v":0},0,0,0,0,null,0]
[{"$f":"IF(INTRO!$E$39=\"Non-endemic\",\" \",IF(COUNTRY_INFO!A51=0,\" \",COUNTRY_INFO!A51))","v":" "},{"$f":"IF(INTRO!$E$39=\"Non-endemic\",\" \",IF(COUNTRY_INFO!B51=0,\" \",COUNTRY_INFO!B51))","v":" "},{"$f":"IF(INTRO!$E$39=\"Non-endemic\",\" \",IF(COUNTRY_INFO!C51=0,\" \",COUNTRY_INFO!C51))","v":" "},{"$f":"IF(INTRO!$E$39=\"Non-endemic\",0,IF(INTRO!$E$39=\"Endemic but PC is not required\",IF(COUNTRY_INFO!$H51=1,COUNTRY_INFO!F51+COUNTRY_INFO!G51,0),IF(COUNTRY_INFO!$H51=1,COUNTRY_INFO!F51+COUNTRY_INFO!G51,IF(COUNTRY_INFO!$I51=1,IF(COUNTRY_INFO!M51>=(COUNTRY_INFO!F51+COUNTRY_INFO!G51),COUNTRY_INFO!F51+COUNTRY_INFO!G51,COUNTRY_INFO!$M51),0))))","v":0},{"$f":"IF(AND(INTRO!$E$39=\"Non-endemic\",INTRO!$E$37=\"Non-endemic\"),\"Not required\",IF(INTRO!$E$39=\"Non-endemic\",\"Treat with DEC\",COUNTRY_INFO!V51))","v":"Not required"},{"$f":"IF(INTRO!$E$39<>\"Non-endemic\",COUNTRY_INFO!W51,\"Not required\")","v":"Not required"},{"$f":"IF(COUNTRY_INFO!H51=1, IF($E51=1,$D51, 0),0)","v":0},{"$f":"IF(COUNTRY_INFO!I51=1, IF(AND(COUNTRY_INFO!$I51=1,$F51<>0),IF(COUNTRY_INFO!M51>=(COUNTRY_INFO!F51+COUNTRY_INFO!G51),COUNTRY_INFO!F51+COUNTRY_INFO!G51,COUNTRY_INFO!$M51), 0),0)","v":0},0,0,0,0,null,0]
[{"$f":"IF(INTRO!$E$39=\"Non-endemic\",\" \",IF(COUNTRY_INFO!A52=0,\" \",COUNTRY_INFO!A52))","v":" "},{"$f":"IF(INTRO!$E$39=\"Non-endemic\",\" \",IF(COUNTRY_INFO!B52=0,\" \",COUNTRY_INFO!B52))","v":" "},{"$f":"IF(INTRO!$E$39=\"Non-endemic\",\" \",IF(COUNTRY_INFO!C52=0,\" \",COUNTRY_INFO!C52))","v":" "},{"$f":"IF(INTRO!$E$39=\"Non-endemic\",0,IF(INTRO!$E$39=\"Endemic but PC is not required\",IF(COUNTRY_INFO!$H52=1,COUNTRY_INFO!F52+COUNTRY_INFO!G52,0),IF(COUNTRY_INFO!$H52=1,COUNTRY_INFO!F52+COUNTRY_INFO!G52,IF(COUNTRY_INFO!$I52=1,IF(COUNTRY_INFO!M52>=(COUNTRY_INFO!F52+COUNTRY_INFO!G52),COUNTRY_INFO!F52+COUNTRY_INFO!G52,COUNTRY_INFO!$M52),0))))","v":0},{"$f":"IF(AND(INTRO!$E$39=\"Non-endemic\",INTRO!$E$37=\"Non-endemic\"),\"Not required\",IF(INTRO!$E$39=\"Non-endemic\",\"Treat with DEC\",COUNTRY_INFO!V52))","v":"Not required"},{"$f":"IF(INTRO!$E$39<>\"Non-endemic\",COUNTRY_INFO!W52,\"Not required\")","v":"Not required"},{"$f":"IF(COUNTRY_INFO!H52=1, IF($E52=1,$D52, 0),0)","v":0},{"$f":"IF(COUNTRY_INFO!I52=1, IF(AND(COUNTRY_INFO!$I52=1,$F52<>0),IF(COUNTRY_INFO!M52>=(COUNTRY_INFO!F52+COUNTRY_INFO!G52),COUNTRY_INFO!F52+COUNTRY_INFO!G52,COUNTRY_INFO!$M52), 0),0)","v":0},0,0,0,0,null,0]
[{"$f":"IF(INTRO!$E$39=\"Non-endemic\",\" \",IF(COUNTRY_INFO!A53=0,\" \",COUNTRY_INFO!A53))","v":" "},{"$f":"IF(INTRO!$E$39=\"Non-endemic\",\" \",IF(COUNTRY_INFO!B53=0,\" \",COUNTRY_INFO!B53))","v":" "},{"$f":"IF(INTRO!$E$39=\"Non-endemic\",\" \",IF(COUNTRY_INFO!C53=0,\" \",COUNTRY_INFO!C53))","v":" "},{"$f":"IF(INTRO!$E$39=\"Non-endemic\",0,IF(INTRO!$E$39=\"Endemic but PC is not required\",IF(COUNTRY_INFO!$H53=1,COUNTRY_INFO!F53+COUNTRY_INFO!G53,0),IF(COUNTRY_INFO!$H53=1,COUNTRY_INFO!F53+COUNTRY_INFO!G53,IF(COUNTRY_INFO!$I53=1,IF(COUNTRY_INFO!M53>=(COUNTRY_INFO!F53+COUNTRY_INFO!G53),COUNTRY_INFO!F53+COUNTRY_INFO!G53,COUNTRY_INFO!$M53),0))))","v":0},{"$f":"IF(AND(INTRO!$E$39=\"Non-endemic\",INTRO!$E$37=\"Non-endemic\"),\"Not required\",IF(INTRO!$E$39=\"Non-endemic\",\"Treat with DEC\",COUNTRY_INFO!V53))","v":"Not required"},{"$f":"IF(INTRO!$E$39<>\"Non-endemic\",COUNTRY_INFO!W53,\"Not required\")","v":"Not required"},{"$f":"IF(COUNTRY_INFO!H53=1, IF($E53=1,$D53, 0),0)","v":0},{"$f":"IF(COUNTRY_INFO!I53=1, IF(AND(COUNTRY_INFO!$I53=1,$F53<>0),IF(COUNTRY_INFO!M53>=(COUNTRY_INFO!F53+COUNTRY_INFO!G53),COUNTRY_INFO!F53+COUNTRY_INFO!G53,COUNTRY_INFO!$M53), 0),0)","v":0},0,0,0,0,null,0]
[{"$f":"IF(INTRO!$E$39=\"Non-endemic\",\" \",IF(COUNTRY_INFO!A54=0,\" \",COUNTRY_INFO!A54))","v":" "},{"$f":"IF(INTRO!$E$39=\"Non-endemic\",\" \",IF(COUNTRY_INFO!B54=0,\" \",COUNTRY_INFO!B54))","v":" "},{"$f":"IF(INTRO!$E$39=\"Non-endemic\",\" \",IF(COUNTRY_INFO!C54=0,\" \",COUNTRY_INFO!C54))","v":" "},{"$f":"IF(INTRO!$E$39=\"Non-endemic\",0,IF(INTRO!$E$39=\"Endemic but PC is not required\",IF(COUNTRY_INFO!$H54=1,COUNTRY_INFO!F54+COUNTRY_INFO!G54,0),IF(COUNTRY_INFO!$H54=1,COUNTRY_INFO!F54+COUNTRY_INFO!G54,IF(COUNTRY_INFO!$I54=1,IF(COUNTRY_INFO!M54>=(COUNTRY_INFO!F54+COUNTRY_INFO!G54),COUNTRY_INFO!F54+COUNTRY_INFO!G54,COUNTRY_INFO!$M54),0))))","v":0},{"$f":"IF(AND(INTRO!$E$39=\"Non-endemic\",INTRO!$E$37=\"Non-endemic\"),\"Not required\",IF(INTRO!$E$39=\"Non-endemic\",\"Treat with DEC\",COUNTRY_INFO!V54))","v":"Not required"},{"$f":"IF(INTRO!$E$39<>\"Non-endemic\",COUNTRY_INFO!W54,\"Not required\")","v":"Not required"},{"$f":"IF(COUNTRY_INFO!H54=1, IF($E54=1,$D54, 0),0)","v":0},{"$f":"IF(COUNTRY_INFO!I54=1, IF(AND(COUNTRY_INFO!$I54=1,$F54<>0),IF(COUNTRY_INFO!M54>=(COUNTRY_INFO!F54+COUNTRY_INFO!G54),COUNTRY_INFO!F54+COUNTRY_INFO!G54,COUNTRY_INFO!$M54), 0),0)","v":0},0,0,0,0,null,0]
[{"$f":"IF(INTRO!$E$39=\"Non-endemic\",\" \",IF(COUNTRY_INFO!A55=0,\" \",COUNTRY_INFO!A55))","v":" "},{"$f":"IF(INTRO!$E$39=\"Non-endemic\",\" \",IF(COUNTRY_INFO!B55=0,\" \",COUNTRY_INFO!B55))","v":" "},{"$f":"IF(INTRO!$E$39=\"Non-endemic\",\" \",IF(COUNTRY_INFO!C55=0,\" \",COUNTRY_INFO!C55))","v":" "},{"$f":"IF(INTRO!$E$39=\"Non-endemic\",0,IF(INTRO!$E$39=\"Endemic but PC is not required\",IF(COUNTRY_INFO!$H55=1,COUNTRY_INFO!F55+COUNTRY_INFO!G55,0),IF(COUNTRY_INFO!$H55=1,COUNTRY_INFO!F55+COUNTRY_INFO!G55,IF(COUNTRY_INFO!$I55=1,IF(COUNTRY_INFO!M55>=(COUNTRY_INFO!F55+COUNTRY_INFO!G55),COUNTRY_INFO!F55+COUNTRY_INFO!G55,COUNTRY_INFO!$M55),0))))","v":0},{"$f":"IF(AND(INTRO!$E$39=\"Non-endemic\",INTRO!$E$37=\"Non-endemic\"),\"Not required\",IF(INTRO!$E$39=\"Non-endemic\",\"Treat with DEC\",COUNTRY_INFO!V55))","v":"Not required"},{"$f":"IF(INTRO!$E$39<>\"Non-endemic\",COUNTRY_INFO!W55,\"Not required\")","v":"Not required"},{"$f":"IF(COUNTRY_INFO!H55=1, IF($E55=1,$D55, 0),0)","v":0},{"$f":"IF(COUNTRY_INFO!I55=1, IF(AND(COUNTRY_INFO!$I55=1,$F55<>0),IF(COUNTRY_INFO!M55>=(COUNTRY_INFO!F55+COUNTRY_INFO!G55),COUNTRY_INFO!F55+COUNTRY_INFO!G55,COUNTRY_INFO!$M55), 0),0)","v":0},0,0,0,0,null,0]
[{"$f":"IF(INTRO!$E$39=\"Non-endemic\",\" \",IF(COUNTRY_INFO!A56=0,\" \",COUNTRY_INFO!A56))","v":" "},{"$f":"IF(INTRO!$E$39=\"Non-endemic\",\" \",IF(COUNTRY_INFO!B56=0,\" \",COUNTRY_INFO!B56))","v":" "},{"$f":"IF(INTRO!$E$39=\"Non-endemic\",\" \",IF(COUNTRY_INFO!C56=0,\" \",COUNTRY_INFO!C56))","v":" "},{"$f":"IF(INTRO!$E$39=\"Non-endemic\",0,IF(INTRO!$E$39=\"Endemic but PC is not required\",IF(COUNTRY_INFO!$H56=1,COUNTRY_INFO!F56+COUNTRY_INFO!G56,0),IF(COUNTRY_INFO!$H56=1,COUNTRY_INFO!F56+COUNTRY_INFO!G56,IF(COUNTRY_INFO!$I56=1,IF(COUNTRY_INFO!M56>=(COUNTRY_INFO!F56+COUNTRY_INFO!G56),COUNTRY_INFO!F56+COUNTRY_INFO!G56,COUNTRY_INFO!$M56),0))))","v":0},{"$f":"IF(AND(INTRO!$E$39=\"Non-endemic\",INTRO!$E$37=\"Non-endemic\"),\"Not required\",IF(INTRO!$E$39=\"Non-endemic\",\"Treat with DEC\",COUNTRY_INFO!V56))","v":"Not required"},{"$f":"IF(INTRO!$E$39<>\"Non-endemic\",COUNTRY_INFO!W56,\"Not required\")","v":"Not required"},{"$f":"IF(COUNTRY_INFO!H56=1, IF($E56=1,$D56, 0),0)","v":0},{"$f":"IF(COUNTRY_INFO!I56=1, IF(AND(COUNTRY_INFO!$I56=1,$F56<>0),IF(COUNTRY_INFO!M56>=(COUNTRY_INFO!F56+COUNTRY_INFO!G56),COUNTRY_INFO!F56+COUNTRY_INFO!G56,COUNTRY_INFO!$M56), 0),0)","v":0},0,0,0,0,null,0]
[{"$f":"IF(INTRO!$E$39=\"Non-endemic\",\" \",IF(COUNTRY_INFO!A57=0,\" \",COUNTRY_INFO!A57))","v":" "},{"$f":"IF(INTRO!$E$39=\"Non-endemic\",\" \",IF(COUNTRY_INFO!B57=0,\" \",COUNTRY_INFO!B57))","v":" "},{"$f":"IF(INTRO!$E$39=\"Non-endemic\",\" \",IF(COUNTRY_INFO!C57=0,\" \",COUNTRY_INFO!C57))","v":" "},{"$f":"IF(INTRO!$E$39=\"Non-endemic\",0,IF(INTRO!$E$39=\"Endemic but PC is not required\",IF(COUNTRY_INFO!$H57=1,COUNTRY_INFO!F57+COUNTRY_INFO!G57,0),IF(COUNTRY_INFO!$H57=1,COUNTRY_INFO!F57+COUNTRY_INFO!G57,IF(COUNTRY_INFO!$I57=1,IF(COUNTRY_INFO!M57>=(COUNTRY_INFO!F57+COUNTRY_INFO!G57),COUNTRY_INFO!F57+COUNTRY_INFO!G57,COUNTRY_INFO!$M57),0))))","v":0},{"$f":"IF(AND(INTRO!$E$39=\"Non-endemic\",INTRO!$E$37=\"Non-endemic\"),\"Not required\",IF(INTRO!$E$39=\"Non-endemic\",\"Treat with DEC\",COUNTRY_INFO!V57))","v":"Not required"},{"$f":"IF(INTRO!$E$39<>\"Non-endemic\",COUNTRY_INFO!W57,\"Not required\")","v":"Not required"},{"$f":"IF(COUNTRY_INFO!H57=1, IF($E57=1,$D57, 0),0)","v":0},{"$f":"IF(COUNTRY_INFO!I57=1, IF(AND(COUNTRY_INFO!$I57=1,$F57<>0),IF(COUNTRY_INFO!M57>=(COUNTRY_INFO!F57+COUNTRY_INFO!G57),COUNTRY_INFO!F57+COUNTRY_INFO!G57,COUNTRY_INFO!$M57), 0),0)","v":0},0,0,0,0,null,0]
[{"$f":"IF(INTRO!$E$39=\"Non-endemic\",\" \",IF(COUNTRY_INFO!A58=0,\" \",COUNTRY_INFO!A58))","v":" "},{"$f":"IF(INTRO!$E$39=\"Non-endemic\",\" \",IF(COUNTRY_INFO!B58=0,\" \",COUNTRY_INFO!B58))","v":" "},{"$f":"IF(INTRO!$E$39=\"Non-endemic\",\" \",IF(COUNTRY_INFO!C58=0,\" \",COUNTRY_INFO!C58))","v":" "},{"$f":"IF(INTRO!$E$39=\"Non-endemic\",0,IF(INTRO!$E$39=\"Endemic but PC is not required\",IF(COUNTRY_INFO!$H58=1,COUNTRY_INFO!F58+COUNTRY_INFO!G58,0),IF(COUNTRY_INFO!$H58=1,COUNTRY_INFO!F58+COUNTRY_INFO!G58,IF(COUNTRY_INFO!$I58=1,IF(COUNTRY_INFO!M58>=(COUNTRY_INFO!F58+COUNTRY_INFO!G58),COUNTRY_INFO!F58+COUNTRY_INFO!G58,COUNTRY_INFO!$M58),0))))","v":0},{"$f":"IF(AND(INTRO!$E$39=\"Non-endemic\",INTRO!$E$37=\"Non-endemic\"),\"Not required\",IF(INTRO!$E$39=\"Non-endemic\",\"Treat with DEC\",COUNTRY_INFO!V58))","v":"Not required"},{"$f":"IF(INTRO!$E$39<>\"Non-endemic\",COUNTRY_INFO!W58,\"Not required\")","v":"Not required"},{"$f":"IF(COUNTRY_INFO!H58=1, IF($E58=1,$D58, 0),0)","v":0},{"$f":"IF(COUNTRY_INFO!I58=1, IF(AND(COUNTRY_INFO!$I58=1,$F58<>0),IF(COUNTRY_INFO!M58>=(COUNTRY_INFO!F58+COUNTRY_INFO!G58),COUNTRY_INFO!F58+COUNTRY_INFO!G58,COUNTRY_INFO!$M58), 0),0)","v":0},0,0,0,0,null,0]
[{"$f":"IF(INTRO!$E$39=\"Non-endemic\",\" \",IF(COUNTRY_INFO!A59=0,\" \",COUNTRY_INFO!A59))","v":" "},{"$f":"IF(INTRO!$E$39=\"Non-endemic\",\" \",IF(COUNTRY_INFO!B59=0,\" \",COUNTRY_INFO!B59))","v":" "},{"$f":"IF(INTRO!$E$39=\"Non-endemic\",\" \",IF(COUNTRY_INFO!C59=0,\" \",COUNTRY_INFO!C59))","v":" "},{"$f":"IF(INTRO!$E$39=\"Non-endemic\",0,IF(INTRO!$E$39=\"Endemic but PC is not required\",IF(COUNTRY_INFO!$H59=1,COUNTRY_INFO!F59+COUNTRY_INFO!G59,0),IF(COUNTRY_INFO!$H59=1,COUNTRY_INFO!F59+COUNTRY_INFO!G59,IF(COUNTRY_INFO!$I59=1,IF(COUNTRY_INFO!M59>=(COUNTRY_INFO!F59+COUNTRY_INFO!G59),COUNTRY_INFO!F59+COUNTRY_INFO!G59,COUNTRY_INFO!$M59),0))))","v":0},{"$f":"IF(AND(INTRO!$E$39=\"Non-endemic\",INTRO!$E$37=\"Non-endemic\"),\"Not required\",IF(INTRO!$E$39=\"Non-endemic\",\"Treat with DEC\",COUNTRY_INFO!V59))","v":"Not required"},{"$f":"IF(INTRO!$E$39<>\"Non-endemic\",COUNTRY_INFO!W59,\"Not required\")","v":"Not required"},{"$f":"IF(COUNTRY_INFO!H59=1, IF($E59=1,$D59, 0),0)","v":0},{"$f":"IF(COUNTRY_INFO!I59=1, IF(AND(COUNTRY_INFO!$I59=1,$F59<>0),IF(COUNTRY_INFO!M59>=(COUNTRY_INFO!F59+COUNTRY_INFO!G59),COUNTRY_INFO!F59+COUNTRY_INFO!G59,COUNTRY_INFO!$M59), 0),0)","v":0},0,0,0,0,null,0]
[{"$f":"IF(INTRO!$E$39=\"Non-endemic\",\" \",IF(COUNTRY_INFO!A60=0,\" \",COUNTRY_INFO!A60))","v":" "},{"$f":"IF(INTRO!$E$39=\"Non-endemic\",\" \",IF(COUNTRY_INFO!B60=0,\" \",COUNTRY_INFO!B60))","v":" "},{"$f":"IF(INTRO!$E$39=\"Non-endemic\",\" \",IF(COUNTRY_INFO!C60=0,\" \",COUNTRY_INFO!C60))","v":" "},{"$f":"IF(INTRO!$E$39=\"Non-endemic\",0,IF(INTRO!$E$39=\"Endemic but PC is not required\",IF(COUNTRY_INFO!$H60=1,COUNTRY_INFO!F60+COUNTRY_INFO!G60,0),IF(COUNTRY_INFO!$H60=1,COUNTRY_INFO!F60+COUNTRY_INFO!G60,IF(COUNTRY_INFO!$I60=1,IF(COUNTRY_INFO!M60>=(COUNTRY_INFO!F60+COUNTRY_INFO!G60),COUNTRY_INFO!F60+COUNTRY_INFO!G60,COUNTRY_INFO!$M60),0))))","v":0},{"$f":"IF(AND(INTRO!$E$39=\"Non-endemic\",INTRO!$E$37=\"Non-endemic\"),\"Not required\",IF(INTRO!$E$39=\"Non-endemic\",\"Treat with DEC\",COUNTRY_INFO!V60))","v":"Not required"},{"$f":"IF(INTRO!$E$39<>\"Non-endemic\",COUNTRY_INFO!W60,\"Not required\")","v":"Not required"},{"$f":"IF(COUNTRY_INFO!H60=1, IF($E60=1,$D60, 0),0)","v":0},{"$f":"IF(COUNTRY_INFO!I60=1, IF(AND(COUNTRY_INFO!$I60=1,$F60<>0),IF(COUNTRY_INFO!M60>=(COUNTRY_INFO!F60+COUNTRY_INFO!G60),COUNTRY_INFO!F60+COUNTRY_INFO!G60,COUNTRY_INFO!$M60), 0),0)","v":0},0,0,0,0,null,0]
[{"$f":"IF(INTRO!$E$39=\"Non-endemic\",\" \",IF(COUNTRY_INFO!A61=0,\" \",COUNTRY_INFO!A61))","v":" "},{"$f":"IF(INTRO!$E$39=\"Non-endemic\",\" \",IF(COUNTRY_INFO!B61=0,\" \",COUNTRY_INFO!B61))","v":" "},{"$f":"IF(INTRO!$E$39=\"Non-endemic\",\" \",IF(COUNTRY_INFO!C61=0,\" \",COUNTRY_INFO!C61))","v":" "},{"$f":"IF(INTRO!$E$39=\"Non-endemic\",0,IF(INTRO!$E$39=\"Endemic but PC is not required\",IF(COUNTRY_INFO!$H61=1,COUNTRY_INFO!F61+COUNTRY_INFO!G61,0),IF(COUNTRY_INFO!$H61=1,COUNTRY_INFO!F61+COUNTRY_INFO!G61,IF(COUNTRY_INFO!$I61=1,IF(COUNTRY_INFO!M61>=(COUNTRY_INFO!F61+COUNTRY_INFO!G61),COUNTRY_INFO!F61+COUNTRY_INFO!G61,COUNTRY_INFO!$M61),0))))","v":0},{"$f":"IF(AND(INTRO!$E$39=\"Non-endemic\",INTRO!$E$37=\"Non-endemic\"),\"Not required\",IF(INTRO!$E$39=\"Non-endemic\",\"Treat with DEC\",COUNTRY_INFO!V61))","v":"Not required"},{"$f":"IF(INTRO!$E$39<>\"Non-endemic\",COUNTRY_INFO!W61,\"Not required\")","v":"Not required"},{"$f":"IF(COUNTRY_INFO!H61=1, IF($E61=1,$D61, 0),0)","v":0},{"$f":"IF(COUNTRY_INFO!I61=1, IF(AND(COUNTRY_INFO!$I61=1,$F61<>0),IF(COUNTRY_INFO!M61>=(COUNTRY_INFO!F61+COUNTRY_INFO!G61),COUNTRY_INFO!F61+COUNTRY_INFO!G61,COUNTRY_INFO!$M61), 0),0)","v":0},0,0,0,0,null,0]
[{"$f":"IF(INTRO!$E$39=\"Non-endemic\",\" \",IF(COUNTRY_INFO!A62=0,\" \",COUNTRY_INFO!A62))","v":" "},{"$f":"IF(INTRO!$E$39=\"Non-endemic\",\" \",IF(COUNTRY_INFO!B62=0,\" \",COUNTRY_INFO!B62))","v":" "},{"$f":"IF(INTRO!$E$39=\"Non-endemic\",\" \",IF(COUNTRY_INFO!C62=0,\" \",COUNTRY_INFO!C62))","v":" "},{"$f":"IF(INTRO!$E$39=\"Non-endemic\",0,IF(INTRO!$E$39=\"Endemic but PC is not required\",IF(COUNTRY_INFO!$H62=1,COUNTRY_INFO!F62+COUNTRY_INFO!G62,0),IF(COUNTRY_INFO!$H62=1,COUNTRY_INFO!F62+COUNTRY_INFO!G62,IF(COUNTRY_INFO!$I62=1,IF(COUNTRY_INFO!M62>=(COUNTRY_INFO!F62+COUNTRY_INFO!G62),COUNTRY_INFO!F62+COUNTRY_INFO!G62,COUNTRY_INFO!$M62),0))))","v":0},{"$f":"IF(AND(INTRO!$E$39=\"Non-endemic\",INTRO!$E$37=\"Non-endemic\"),\"Not required\",IF(INTRO!$E$39=\"Non-endemic\",\"Treat with DEC\",COUNTRY_INFO!V62))","v":"Not required"},{"$f":"IF(INTRO!$E$39<>\"Non-endemic\",COUNTRY_INFO!W62,\"Not required\")","v":"Not required"},{"$f":"IF(COUNTRY_INFO!H62=1, IF($E62=1,$D62, 0),0)","v":0},{"$f":"IF(COUNTRY_INFO!I62=1, IF(AND(COUNTRY_INFO!$I62=1,$F62<>0),IF(COUNTRY_INFO!M62>=(COUNTRY_INFO!F62+COUNTRY_INFO!G62),COUNTRY_INFO!F62+COUNTRY_INFO!G62,COUNTRY_INFO!$M62), 0),0)","v":0},0,0,0,0,null,0]
[{"$f":"IF(INTRO!$E$39=\"Non-endemic\",\" \",IF(COUNTRY_INFO!A63=0,\" \",COUNTRY_INFO!A63))","v":" "},{"$f":"IF(INTRO!$E$39=\"Non-endemic\",\" \",IF(COUNTRY_INFO!B63=0,\" \",COUNTRY_INFO!B63))","v":" "},{"$f":"IF(INTRO!$E$39=\"Non-endemic\",\" \",IF(COUNTRY_INFO!C63=0,\" \",COUNTRY_INFO!C63))","v":" "},{"$f":"IF(INTRO!$E$39=\"Non-endemic\",0,IF(INTRO!$E$39=\"Endemic but PC is not required\",IF(COUNTRY_INFO!$H63=1,COUNTRY_INFO!F63+COUNTRY_INFO!G63,0),IF(COUNTRY_INFO!$H63=1,COUNTRY_INFO!F63+COUNTRY_INFO!G63,IF(COUNTRY_INFO!$I63=1,IF(COUNTRY_INFO!M63>=(COUNTRY_INFO!F63+COUNTRY_INFO!G63),COUNTRY_INFO!F63+COUNTRY_INFO!G63,COUNTRY_INFO!$M63),0))))","v":0},{"$f":"IF(AND(INTRO!$E$39=\"Non-endemic\",INTRO!$E$37=\"Non-endemic\"),\"Not required\",IF(INTRO!$E$39=\"Non-endemic\",\"Treat with DEC\",COUNTRY_INFO!V63))","v":"Not required"},{"$f":"IF(INTRO!$E$39<>\"Non-endemic\",COUNTRY_INFO!W63,\"Not required\")","v":"Not required"},{"$f":"IF(COUNTRY_INFO!H63=1, IF($E63=1,$D63, 0),0)","v":0},{"$f":"IF(COUNTRY_INFO!I63=1, IF(AND(COUNTRY_INFO!$I63=1,$F63<>0),IF(COUNTRY_INFO!M63>=(COUNTRY_INFO!F63+COUNTRY_INFO!G63),COUNTRY_INFO!F63+COUNTRY_INFO!G63,COUNTRY_INFO!$M63), 0),0)","v":0},0,0,0,0,null,0]
[{"$f":"IF(INTRO!$E$39=\"Non-endemic\",\" \",IF(COUNTRY_INFO!A64=0,\" \",COUNTRY_INFO!A64))","v":" "},{"$f":"IF(INTRO!$E$39=\"Non-endemic\",\" \",IF(COUNTRY_INFO!B64=0,\" \",COUNTRY_INFO!B64))","v":" "},{"$f":"IF(INTRO!$E$39=\"Non-endemic\",\" \",IF(COUNTRY_INFO!C64=0,\" \",COUNTRY_INFO!C64))","v":" "},{"$f":"IF(INTRO!$E$39=\"Non-endemic\",0,IF(INTRO!$E$39=\"Endemic but PC is not required\",IF(COUNTRY_INFO!$H64=1,COUNTRY_INFO!F64+COUNTRY_INFO!G64,0),IF(COUNTRY_INFO!$H64=1,COUNTRY_INFO!F64+COUNTRY_INFO!G64,IF(COUNTRY_INFO!$I64=1,IF(COUNTRY_INFO!M64>=(COUNTRY_INFO!F64+COUNTRY_INFO!G64),COUNTRY_INFO!F64+COUNTRY_INFO!G64,COUNTRY_INFO!$M64),0))))","v":0},{"$f":"IF(AND(INTRO!$E$39=\"Non-endemic\",INTRO!$E$37=\"Non-endemic\"),\"Not required\",IF(INTRO!$E$39=\"Non-endemic\",\"Treat with DEC\",COUNTRY_INFO!V64))","v":"Not required"},{"$f":"IF(INTRO!$E$39<>\"Non-endemic\",COUNTRY_INFO!W64,\"Not required\")","v":"Not required"},{"$f":"IF(COUNTRY_INFO!H64=1, IF($E64=1,$D64, 0),0)","v":0},{"$f":"IF(COUNTRY_INFO!I64=1, IF(AND(COUNTRY_INFO!$I64=1,$F64<>0),IF(COUNTRY_INFO!M64>=(COUNTRY_INFO!F64+COUNTRY_INFO!G64),COUNTRY_INFO!F64+COUNTRY_INFO!G64,COUNTRY_INFO!$M64), 0),0)","v":0},0,0,0,0,null,0]
[{"$f":"IF(INTRO!$E$39=\"Non-endemic\",\" \",IF(COUNTRY_INFO!A65=0,\" \",COUNTRY_INFO!A65))","v":" "},{"$f":"IF(INTRO!$E$39=\"Non-endemic\",\" \",IF(COUNTRY_INFO!B65=0,\" \",COUNTRY_INFO!B65))","v":" "},{"$f":"IF(INTRO!$E$39=\"Non-endemic\",\" \",IF(COUNTRY_INFO!C65=0,\" \",COUNTRY_INFO!C65))","v":" "},{"$f":"IF(INTRO!$E$39=\"Non-endemic\",0,IF(INTRO!$E$39=\"Endemic but PC is not required\",IF(COUNTRY_INFO!$H65=1,COUNTRY_INFO!F65+COUNTRY_INFO!G65,0),IF(COUNTRY_INFO!$H65=1,COUNTRY_INFO!F65+COUNTRY_INFO!G65,IF(COUNTRY_INFO!$I65=1,IF(COUNTRY_INFO!M65>=(COUNTRY_INFO!F65+COUNTRY_INFO!G65),COUNTRY_INFO!F65+COUNTRY_INFO!G65,COUNTRY_INFO!$M65),0))))","v":0},{"$f":"IF(AND(INTRO!$E$39=\"Non-endemic\",INTRO!$E$37=\"Non-endemic\"),\"Not required\",IF(INTRO!$E$39=\"Non-endemic\",\"Treat with DEC\",COUNTRY_INFO!V65))","v":"Not required"},{"$f":"IF(INTRO!$E$39<>\"Non-endemic\",COUNTRY_INFO!W65,\"Not required\")","v":"Not required"},{"$f":"IF(COUNTRY_INFO!H65=1, IF($E65=1,$D65, 0),0)","v":0},{"$f":"IF(COUNTRY_INFO!I65=1, IF(AND(COUNTRY_INFO!$I65=1,$F65<>0),IF(COUNTRY_INFO!M65>=(COUNTRY_INFO!F65+COUNTRY_INFO!G65),COUNTRY_INFO!F65+COUNTRY_INFO!G65,COUNTRY_INFO!$M65), 0),0)","v":0},0,0,0,0,null,0]
[{"$f":"IF(INTRO!$E$39=\"Non-endemic\",\" \",IF(COUNTRY_INFO!A66=0,\" \",COUNTRY_INFO!A66))","v":" "},{"$f":"IF(INTRO!$E$39=\"Non-endemic\",\" \",IF(COUNTRY_INFO!B66=0,\" \",COUNTRY_INFO!B66))","v":" "},{"$f":"IF(INTRO!$E$39=\"Non-endemic\",\" \",IF(COUNTRY_INFO!C66=0,\" \",COUNTRY_INFO!C66))","v":" "},{"$f":"IF(INTRO!$E$39=\"Non-endemic\",0,IF(INTRO!$E$39=\"Endemic but PC is not required\",IF(COUNTRY_INFO!$H66=1,COUNTRY_INFO!F66+COUNTRY_INFO!G66,0),IF(COUNTRY_INFO!$H66=1,COUNTRY_INFO!F66+COUNTRY_INFO!G66,IF(COUNTRY_INFO!$I66=1,IF(COUNTRY_INFO!M66>=(COUNTRY_INFO!F66+COUNTRY_INFO!G66),COUNTRY_INFO!F66+COUNTRY_INFO!G66,COUNTRY_INFO!$M66),0))))","v":0},{"$f":"IF(AND(INTRO!$E$39=\"Non-endemic\",INTRO!$E$37=\"Non-endemic\"),\"Not required\",IF(INTRO!$E$39=\"Non-endemic\",\"Treat with DEC\",COUNTRY_INFO!V66))","v":"Not required"},{"$f":"IF(INTRO!$E$39<>\"Non-endemic\",COUNTRY_INFO!W66,\"Not required\")","v":"Not required"},{"$f":"IF(COUNTRY_INFO!H66=1, IF($E66=1,$D66, 0),0)","v":0},{"$f":"IF(COUNTRY_INFO!I66=1, IF(AND(COUNTRY_INFO!$I66=1,$F66<>0),IF(COUNTRY_INFO!M66>=(COUNTRY_INFO!F66+COUNTRY_INFO!G66),COUNTRY_INFO!F66+COUNTRY_INFO!G66,COUNTRY_INFO!$M66), 0),0)","v":0},0,0,0,0,null,0]
[{"$f":"IF(INTRO!$E$39=\"Non-endemic\",\" \",IF(COUNTRY_INFO!A67=0,\" \",COUNTRY_INFO!A67))","v":" "},{"$f":"IF(INTRO!$E$39=\"Non-endemic\",\" \",IF(COUNTRY_INFO!B67=0,\" \",COUNTRY_INFO!B67))","v":" "},{"$f":"IF(INTRO!$E$39=\"Non-endemic\",\" \",IF(COUNTRY_INFO!C67=0,\" \",COUNTRY_INFO!C67))","v":" "},{"$f":"IF(INTRO!$E$39=\"Non-endemic\",0,IF(INTRO!$E$39=\"Endemic but PC is not required\",IF(COUNTRY_INFO!$H67=1,COUNTRY_INFO!F67+COUNTRY_INFO!G67,0),IF(COUNTRY_INFO!$H67=1,COUNTRY_INFO!F67+COUNTRY_INFO!G67,IF(COUNTRY_INFO!$I67=1,IF(COUNTRY_INFO!M67>=(COUNTRY_INFO!F67+COUNTRY_INFO!G67),COUNTRY_INFO!F67+COUNTRY_INFO!G67,COUNTRY_INFO!$M67),0))))","v":0},{"$f":"IF(AND(INTRO!$E$39=\"Non-endemic\",INTRO!$E$37=\"Non-endemic\"),\"Not required\",IF(INTRO!$E$39=\"Non-endemic\",\"Treat with DEC\",COUNTRY_INFO!V67))","v":"Not required"},{"$f":"IF(INTRO!$E$39<>\"Non-endemic\",COUNTRY_INFO!W67,\"Not required\")","v":"Not required"},{"$f":"IF(COUNTRY_INFO!H67=1, IF($E67=1,$D67, 0),0)","v":0},{"$f":"IF(COUNTRY_INFO!I67=1, IF(AND(COUNTRY_INFO!$I67=1,$F67<>0),IF(COUNTRY_INFO!M67>=(COUNTRY_INFO!F67+COUNTRY_INFO!G67),COUNTRY_INFO!F67+COUNTRY_INFO!G67,COUNTRY_INFO!$M67), 0),0)","v":0},0,0,0,0,null,0]
[{"$f":"IF(INTRO!$E$39=\"Non-endemic\",\" \",IF(COUNTRY_INFO!A68=0,\" \",COUNTRY_INFO!A68))","v":" "},{"$f":"IF(INTRO!$E$39=\"Non-endemic\",\" \",IF(COUNTRY_INFO!B68=0,\" \",COUNTRY_INFO!B68))","v":" "},{"$f":"IF(INTRO!$E$39=\"Non-endemic\",\" \",IF(COUNTRY_INFO!C68=0,\" \",COUNTRY_INFO!C68))","v":" "},{"$f":"IF(INTRO!$E$39=\"Non-endemic\",0,IF(INTRO!$E$39=\"Endemic but PC is not required\",IF(COUNTRY_INFO!$H68=1,COUNTRY_INFO!F68+COUNTRY_INFO!G68,0),IF(COUNTRY_INFO!$H68=1,COUNTRY_INFO!F68+COUNTRY_INFO!G68,IF(COUNTRY_INFO!$I68=1,IF(COUNTRY_INFO!M68>=(COUNTRY_INFO!F68+COUNTRY_INFO!G68),COUNTRY_INFO!F68+COUNTRY_INFO!G68,COUNTRY_INFO!$M68),0))))","v":0},{"$f":"IF(AND(INTRO!$E$39=\"Non-endemic\",INTRO!$E$37=\"Non-endemic\"),\"Not required\",IF(INTRO!$E$39=\"Non-endemic\",\"Treat with DEC\",COUNTRY_INFO!V68))","v":"Not required"},{"$f":"IF(INTRO!$E$39<>\"Non-endemic\",COUNTRY_INFO!W68,\"Not required\")","v":"Not required"},{"$f":"IF(COUNTRY_INFO!H68=1, IF($E68=1,$D68, 0),0)","v":0},{"$f":"IF(COUNTRY_INFO!I68=1, IF(AND(COUNTRY_INFO!$I68=1,$F68<>0),IF(COUNTRY_INFO!M68>=(COUNTRY_INFO!F68+COUNTRY_INFO!G68),COUNTRY_INFO!F68+COUNTRY_INFO!G68,COUNTRY_INFO!$M68), 0),0)","v":0},0,0,0,0,null,0]

{"sheet":"IVM+","index":6,"n_rows":68,"n_cols":8,"rows_kept":68,"cut":false,"hidden":true,"merged":[[6,0,7,0],[6,1,7,1],[6,2,7,2],[6,3,7,3],[3,0,3,2],[5,0,5,2],[6,5,7,5],[6,6,7,6],[6,7,7,7],[5,4,7,4],[5,5,5,7]]}
["Ivermectin (IVM) for IDA therapy"]
["Administrative structure, eligible population by age group, treatment plan and information about tablets"]
[]
["TOTAL",null,null,null,{"$f":"SUBTOTAL(9,E$10:E$1010)","v":0},0,0,0]
[]
["Country administrative structure",null,null,"Treatment plan","Population targeted for treatment with IVM \n(IDA therapy)","Ivermectin (IVM)"]
["Country","Province/State","District","LF",null,"Total required","Remaining in stock","Tablets to be procured"]
[]
[]
[{"$f":"IF(AND(INTRO!$E$37=\"Endemic\",INTRO!$E$39=\"Non-endemic\"),IF(COUNTRY_INFO!A10=0,\" \",COUNTRY_INFO!A10),\" \")","v":" "},{"$f":"IF(AND(INTRO!$E$37=\"Endemic\",INTRO!$E$39=\"Non-endemic\"),IF(COUNTRY_INFO!B10=0,\" \",COUNTRY_INFO!B10),\" \")","v":" "},{"$f":"IF(AND(INTRO!$E$37=\"Endemic\",INTRO!$E$39=\"Non-endemic\"),IF(COUNTRY_INFO!C10=0,\" \",COUNTRY_INFO!C10),\" \")","v":" "},{"$f":"IF(COUNTRY_INFO!Z10<>\"\",COUNTRY_INFO!V10,0)","v":0},{"$f":"IF(AND(COUNTRY_INFO!Z10<>\"\",COUNTRY_INFO!$H10=1),COUNTRY_INFO!F10+COUNTRY_INFO!G10,0)","v":0},{"$f":"E10*2.8","v":0},null,{"$f":"IF($F10>$G10,$F10-$G10,0)","v":0}]
[{"$f":"IF(AND(INTRO!$E$37=\"Endemic\",INTRO!$E$39=\"Non-endemic\"),IF(COUNTRY_INFO!A11=0,\" \",COUNTRY_INFO!A11),\" \")","v":" "},{"$f":"IF(AND(INTRO!$E$37=\"Endemic\",INTRO!$E$39=\"Non-endemic\"),IF(COUNTRY_INFO!B11=0,\" \",COUNTRY_INFO!B11),\" \")","v":" "},{"$f":"IF(AND(INTRO!$E$37=\"Endemic\",INTRO!$E$39=\"Non-endemic\"),IF(COUNTRY_INFO!C11=0,\" \",COUNTRY_INFO!C11),\" \")","v":" "},{"$f":"IF(COUNTRY_INFO!Z11<>\"\",COUNTRY_INFO!V11,0)","v":0},{"$f":"IF(AND(COUNTRY_INFO!Z11<>\"\",COUNTRY_INFO!$H11=1),COUNTRY_INFO!F11+COUNTRY_INFO!G11,0)","v":0},{"$f":"E11*2.8","v":0},null,0]
[{"$f":"IF(AND(INTRO!$E$37=\"Endemic\",INTRO!$E$39=\"Non-endemic\"),IF(COUNTRY_INFO!A12=0,\" \",COUNTRY_INFO!A12),\" \")","v":" "},{"$f":"IF(AND(INTRO!$E$37=\"Endemic\",INTRO!$E$39=\"Non-endemic\"),IF(COUNTRY_INFO!B12=0,\" \",COUNTRY_INFO!B12),\" \")","v":" "},{"$f":"IF(AND(INTRO!$E$37=\"Endemic\",INTRO!$E$39=\"Non-endemic\"),IF(COUNTRY_INFO!C12=0,\" \",COUNTRY_INFO!C12),\" \")","v":" "},{"$f":"IF(COUNTRY_INFO!Z12<>\"\",COUNTRY_INFO!V12,0)","v":0},{"$f":"IF(AND(COUNTRY_INFO!Z12<>\"\",COUNTRY_INFO!$H12=1),COUNTRY_INFO!F12+COUNTRY_INFO!G12,0)","v":0},0,null,0]
[{"$f":"IF(AND(INTRO!$E$37=\"Endemic\",INTRO!$E$39=\"Non-endemic\"),IF(COUNTRY_INFO!A13=0,\" \",COUNTRY_INFO!A13),\" \")","v":" "},{"$f":"IF(AND(INTRO!$E$37=\"Endemic\",INTRO!$E$39=\"Non-endemic\"),IF(COUNTRY_INFO!B13=0,\" \",COUNTRY_INFO!B13),\" \")","v":" "},{"$f":"IF(AND(INTRO!$E$37=\"Endemic\",INTRO!$E$39=\"Non-endemic\"),IF(COUNTRY_INFO!C13=0,\" \",COUNTRY_INFO!C13),\" \")","v":" "},{"$f":"IF(COUNTRY_INFO!Z13<>\"\",COUNTRY_INFO!V13,0)","v":0},{"$f":"IF(AND(COUNTRY_INFO!Z13<>\"\",COUNTRY_INFO!$H13=1),COUNTRY_INFO!F13+COUNTRY_INFO!G13,0)","v":0},0,null,0]
[{"$f":"IF(AND(INTRO!$E$37=\"Endemic\",INTRO!$E$39=\"Non-endemic\"),IF(COUNTRY_INFO!A14=0,\" \",COUNTRY_INFO!A14),\" \")","v":" "},{"$f":"IF(AND(INTRO!$E$37=\"Endemic\",INTRO!$E$39=\"Non-endemic\"),IF(COUNTRY_INFO!B14=0,\" \",COUNTRY_INFO!B14),\" \")","v":" "},{"$f":"IF(AND(INTRO!$E$37=\"Endemic\",INTRO!$E$39=\"Non-endemic\"),IF(COUNTRY_INFO!C14=0,\" \",COUNTRY_INFO!C14),\" \")","v":" "},{"$f":"IF(COUNTRY_INFO!Z14<>\"\",COUNTRY_INFO!V14,0)","v":0},{"$f":"IF(AND(COUNTRY_INFO!Z14<>\"\",COUNTRY_INFO!$H14=1),COUNTRY_INFO!F14+COUNTRY_INFO!G14,0)","v":0},0,null,0]
[{"$f":"IF(AND(INTRO!$E$37=\"Endemic\",INTRO!$E$39=\"Non-endemic\"),IF(COUNTRY_INFO!A15=0,\" \",COUNTRY_INFO!A15),\" \")","v":" "},{"$f":"IF(AND(INTRO!$E$37=\"Endemic\",INTRO!$E$39=\"Non-endemic\"),IF(COUNTRY_INFO!B15=0,\" \",COUNTRY_INFO!B15),\" \")","v":" "},{"$f":"IF(AND(INTRO!$E$37=\"Endemic\",INTRO!$E$39=\"Non-endemic\"),IF(COUNTRY_INFO!C15=0,\" \",COUNTRY_INFO!C15),\" \")","v":" "},{"$f":"IF(COUNTRY_INFO!Z15<>\"\",COUNTRY_INFO!V15,0)","v":0},{"$f":"IF(AND(COUNTRY_INFO!Z15<>\"\",COUNTRY_INFO!$H15=1),COUNTRY_INFO!F15+COUNTRY_INFO!G15,0)","v":0},0,null,0]
[{"$f":"IF(AND(INTRO!$E$37=\"Endemic\",INTRO!$E$39=\"Non-endemic\"),IF(COUNTRY_INFO!A16=0,\" \",COUNTRY_INFO!A16),\" \")","v":" "},{"$f":"IF(AND(INTRO!$E$37=\"Endemic\",INTRO!$E$39=\"Non-endemic\"),IF(COUNTRY_INFO!B16=0,\" \",COUNTRY_INFO!B16),\" \")","v":" "},{"$f":"IF(AND(INTRO!$E$37=\"Endemic\",INTRO!$E$39=\"Non-endemic\"),IF(COUNTRY_INFO!C16=0,\" \",COUNTRY_INFO!C16),\" \")","v":" "},{"$f":"IF(COUNTRY_INFO!Z16<>\"\",COUNTRY_INFO!V16,0)","v":0},{"$f":"IF(AND(COUNTRY_INFO!Z16<>\"\",COUNTRY_INFO!$H16=1),COUNTRY_INFO!F16+COUNTRY_INFO!G16,0)","v":0},0,null,0]
[{"$f":"IF(AND(INTRO!$E$37=\"Endemic\",INTRO!$E$39=\"Non-endemic\"),IF(COUNTRY_INFO!A17=0,\" \",COUNTRY_INFO!A17),\" \")","v":" "},{"$f":"IF(AND(INTRO!$E$37=\"Endemic\",INTRO!$E$39=\"Non-endemic\"),IF(COUNTRY_INFO!B17=0,\" \",COUNTRY_INFO!B17),\" \")","v":" "},{"$f":"IF(AND(INTRO!$E$37=\"Endemic\",INTRO!$E$39=\"Non-endemic\"),IF(COUNTRY_INFO!C17=0,\" \",COUNTRY_INFO!C17),\" \")","v":" "},{"$f":"IF(COUNTRY_INFO!Z17<>\"\",COUNTRY_INFO!V17,0)","v":0},{"$f":"IF(AND(COUNTRY_INFO!Z17<>\"\",COUNTRY_INFO!$H17=1),COUNTRY_INFO!F17+COUNTRY_INFO!G17,0)","v":0},0,null,0]
[{"$f":"IF(AND(INTRO!$E$37=\"Endemic\",INTRO!$E$39=\"Non-endemic\"),IF(COUNTRY_INFO!A18=0,\" \",COUNTRY_INFO!A18),\" \")","v":" "},{"$f":"IF(AND(INTRO!$E$37=\"Endemic\",INTRO!$E$39=\"Non-endemic\"),IF(COUNTRY_INFO!B18=0,\" \",COUNTRY_INFO!B18),\" \")","v":" "},{"$f":"IF(AND(INTRO!$E$37=\"Endemic\",INTRO!$E$39=\"Non-endemic\"),IF(COUNTRY_INFO!C18=0,\" \",COUNTRY_INFO!C18),\" \")","v":" "},{"$f":"IF(COUNTRY_INFO!Z18<>\"\",COUNTRY_INFO!V18,0)","v":0},{"$f":"IF(AND(COUNTRY_INFO!Z18<>\"\",COUNTRY_INFO!$H18=1),COUNTRY_INFO!F18+COUNTRY_INFO!G18,0)","v":0},0,null,0]
[{"$f":"IF(AND(INTRO!$E$37=\"Endemic\",INTRO!$E$39=\"Non-endemic\"),IF(COUNTRY_INFO!A19=0,\" \",COUNTRY_INFO!A19),\" \")","v":" "},{"$f":"IF(AND(INTRO!$E$37=\"Endemic\",INTRO!$E$39=\"Non-endemic\"),IF(COUNTRY_INFO!B19=0,\" \",COUNTRY_INFO!B19),\" \")","v":" "},{"$f":"IF(AND(INTRO!$E$37=\"Endemic\",INTRO!$E$39=\"Non-endemic\"),IF(COUNTRY_INFO!C19=0,\" \",COUNTRY_INFO!C19),\" \")","v":" "},{"$f":"IF(COUNTRY_INFO!Z19<>\"\",COUNTRY_INFO!V19,0)","v":0},{"$f":"IF(AND(COUNTRY_INFO!Z19<>\"\",COUNTRY_INFO!$H19=1),COUNTRY_INFO!F19+COUNTRY_INFO!G19,0)","v":0},0,null,0]
[{"$f":"IF(AND(INTRO!$E$37=\"Endemic\",INTRO!$E$39=\"Non-endemic\"),IF(COUNTRY_INFO!A20=0,\" \",COUNTRY_INFO!A20),\" \")","v":" "},{"$f":"IF(AND(INTRO!$E$37=\"Endemic\",INTRO!$E$39=\"Non-endemic\"),IF(COUNTRY_INFO!B20=0,\" \",COUNTRY_INFO!B20),\" \")","v":" "},{"$f":"IF(AND(INTRO!$E$37=\"Endemic\",INTRO!$E$39=\"Non-endemic\"),IF(COUNTRY_INFO!C20=0,\" \",COUNTRY_INFO!C20),\" \")","v":" "},{"$f":"IF(COUNTRY_INFO!Z20<>\"\",COUNTRY_INFO!V20,0)","v":0},{"$f":"IF(AND(COUNTRY_INFO!Z20<>\"\",COUNTRY_INFO!$H20=1),COUNTRY_INFO!F20+COUNTRY_INFO!G20,0)","v":0},0,null,0]
[{"$f":"IF(AND(INTRO!$E$37=\"Endemic\",INTRO!$E$39=\"Non-endemic\"),IF(COUNTRY_INFO!A21=0,\" \",COUNTRY_INFO!A21),\" \")","v":" "},{"$f":"IF(AND(INTRO!$E$37=\"Endemic\",INTRO!$E$39=\"Non-endemic\"),IF(COUNTRY_INFO!B21=0,\" \",COUNTRY_INFO!B21),\" \")","v":" "},{"$f":"IF(AND(INTRO!$E$37=\"Endemic\",INTRO!$E$39=\"Non-endemic\"),IF(COUNTRY_INFO!C21=0,\" \",COUNTRY_INFO!C21),\" \")","v":" "},{"$f":"IF(COUNTRY_INFO!Z21<>\"\",COUNTRY_INFO!V21,0)","v":0},{"$f":"IF(AND(COUNTRY_INFO!Z21<>\"\",COUNTRY_INFO!$H21=1),COUNTRY_INFO!F21+COUNTRY_INFO!G21,0)","v":0},0,null,0]
[{"$f":"IF(AND(INTRO!$E$37=\"Endemic\",INTRO!$E$39=\"Non-endemic\"),IF(COUNTRY_INFO!A22=0,\" \",COUNTRY_INFO!A22),\" \")","v":" "},{"$f":"IF(AND(INTRO!$E$37=\"Endemic\",INTRO!$E$39=\"Non-endemic\"),IF(COUNTRY_INFO!B22=0,\" \",COUNTRY_INFO!B22),\" \")","v":" "},{"$f":"IF(AND(INTRO!$E$37=\"Endemic\",INTRO!$E$39=\"Non-endemic\"),IF(COUNTRY_INFO!C22=0,\" \",COUNTRY_INFO!C22),\" \")","v":" "},{"$f":"IF(COUNTRY_INFO!Z22<>\"\",COUNTRY_INFO!V22,0)","v":0},{"$f":"IF(AND(COUNTRY_INFO!Z22<>\"\",COUNTRY_INFO!$H22=1),COUNTRY_INFO!F22+COUNTRY_INFO!G22,0)","v":0},0,null,0]
[{"$f":"IF(AND(INTRO!$E$37=\"Endemic\",INTRO!$E$39=\"Non-endemic\"),IF(COUNTRY_INFO!A23=0,\" \",COUNTRY_INFO!A23),\" \")","v":" "},{"$f":"IF(AND(INTRO!$E$37=\"Endemic\",INTRO!$E$39=\"Non-endemic\"),IF(COUNTRY_INFO!B23=0,\" \",COUNTRY_INFO!B23),\" \")","v":" "},{"$f":"IF(AND(INTRO!$E$37=\"Endemic\",INTRO!$E$39=\"Non-endemic\"),IF(COUNTRY_INFO!C23=0,\" \",COUNTRY_INFO!C23),\" \")","v":" "},{"$f":"IF(COUNTRY_INFO!Z23<>\"\",COUNTRY_INFO!V23,0)","v":0},{"$f":"IF(AND(COUNTRY_INFO!Z23<>\"\",COUNTRY_INFO!$H23=1),COUNTRY_INFO!F23+COUNTRY_INFO!G23,0)","v":0},0,null,0]
[{"$f":"IF(AND(INTRO!$E$37=\"Endemic\",INTRO!$E$39=\"Non-endemic\"),IF(COUNTRY_INFO!A24=0,\" \",COUNTRY_INFO!A24),\" \")","v":" "},{"$f":"IF(AND(INTRO!$E$37=\"Endemic\",INTRO!$E$39=\"Non-endemic\"),IF(COUNTRY_INFO!B24=0,\" \",COUNTRY_INFO!B24),\" \")","v":" "},{"$f":"IF(AND(INTRO!$E$37=\"Endemic\",INTRO!$E$39=\"Non-endemic\"),IF(COUNTRY_INFO!C24=0,\" \",COUNTRY_INFO!C24),\" \")","v":" "},{"$f":"IF(COUNTRY_INFO!Z24<>\"\",COUNTRY_INFO!V24,0)","v":0},{"$f":"IF(AND(COUNTRY_INFO!Z24<>\"\",COUNTRY_INFO!$H24=1),COUNTRY_INFO!F24+COUNTRY_INFO!G24,0)","v":0},0,null,0]
[{"$f":"IF(AND(INTRO!$E$37=\"Endemic\",INTRO!$E$39=\"Non-endemic\"),IF(COUNTRY_INFO!A25=0,\" \",COUNTRY_INFO!A25),\" \")","v":" "},{"$f":"IF(AND(INTRO!$E$37=\"Endemic\",INTRO!$E$39=\"Non-endemic\"),IF(COUNTRY_INFO!B25=0,\" \",COUNTRY_INFO!B25),\" \")","v":" "},{"$f":"IF(AND(INTRO!$E$37=\"Endemic\",INTRO!$E$39=\"Non-endemic\"),IF(COUNTRY_INFO!C25=0,\" \",COUNTRY_INFO!C25),\" \")","v":" "},{"$f":"IF(COUNTRY_INFO!Z25<>\"\",COUNTRY_INFO!V25,0)","v":0},{"$f":"IF(AND(COUNTRY_INFO!Z25<>\"\",COUNTRY_INFO!$H25=1),COUNTRY_INFO!F25+COUNTRY_INFO!G25,0)","v":0},0,null,0]
[{"$f":"IF(AND(INTRO!$E$37=\"Endemic\",INTRO!$E$39=\"Non-endemic\"),IF(COUNTRY_INFO!A26=0,\" \",COUNTRY_INFO!A26),\" \")","v":" "},{"$f":"IF(AND(INTRO!$E$37=\"Endemic\",INTRO!$E$39=\"Non-endemic\"),IF(COUNTRY_INFO!B26=0,\" \",COUNTRY_INFO!B26),\" \")","v":" "},{"$f":"IF(AND(INTRO!$E$37=\"Endemic\",INTRO!$E$39=\"Non-endemic\"),IF(COUNTRY_INFO!C26=0,\" \",COUNTRY_INFO!C26),\" \")","v":" "},{"$f":"IF(COUNTRY_INFO!Z26<>\"\",COUNTRY_INFO!V26,0)","v":0},{"$f":"IF(AND(COUNTRY_INFO!Z26<>\"\",COUNTRY_INFO!$H26=1),COUNTRY_INFO!F26+COUNTRY_INFO!G26,0)","v":0},0,null,0]
[{"$f":"IF(AND(INTRO!$E$37=\"Endemic\",INTRO!$E$39=\"Non-endemic\"),IF(COUNTRY_INFO!A27=0,\" \",COUNTRY_INFO!A27),\" \")","v":" "},{"$f":"IF(AND(INTRO!$E$37=\"Endemic\",INTRO!$E$39=\"Non-endemic\"),IF(COUNTRY_INFO!B27=0,\" \",COUNTRY_INFO!B27),\" \")","v":" "},{"$f":"IF(AND(INTRO!$E$37=\"Endemic\",INTRO!$E$39=\"Non-endemic\"),IF(COUNTRY_INFO!C27=0,\" \",COUNTRY_INFO!C27),\" \")","v":" "},{"$f":"IF(COUNTRY_INFO!Z27<>\"\",COUNTRY_INFO!V27,0)","v":0},{"$f":"IF(AND(COUNTRY_INFO!Z27<>\"\",COUNTRY_INFO!$H27=1),COUNTRY_INFO!F27+COUNTRY_INFO!G27,0)","v":0},0,null,0]
[{"$f":"IF(AND(INTRO!$E$37=\"Endemic\",INTRO!$E$39=\"Non-endemic\"),IF(COUNTRY_INFO!A28=0,\" \",COUNTRY_INFO!A28),\" \")","v":" "},{"$f":"IF(AND(INTRO!$E$37=\"Endemic\",INTRO!$E$39=\"Non-endemic\"),IF(COUNTRY_INFO!B28=0,\" \",COUNTRY_INFO!B28),\" \")","v":" "},{"$f":"IF(AND(INTRO!$E$37=\"Endemic\",INTRO!$E$39=\"Non-endemic\"),IF(COUNTRY_INFO!C28=0,\" \",COUNTRY_INFO!C28),\" \")","v":" "},{"$f":"IF(COUNTRY_INFO!Z28<>\"\",COUNTRY_INFO!V28,0)","v":0},{"$f":"IF(AND(COUNTRY_INFO!Z28<>\"\",COUNTRY_INFO!$H28=1),COUNTRY_INFO!F28+COUNTRY_INFO!G28,0)","v":0},0,null,0]
[{"$f":"IF(AND(INTRO!$E$37=\"Endemic\",INTRO!$E$39=\"Non-endemic\"),IF(COUNTRY_INFO!A29=0,\" \",COUNTRY_INFO!A29),\" \")","v":" "},{"$f":"IF(AND(INTRO!$E$37=\"Endemic\",INTRO!$E$39=\"Non-endemic\"),IF(COUNTRY_INFO!B29=0,\" \",COUNTRY_INFO!B29),\" \")","v":" "},{"$f":"IF(AND(INTRO!$E$37=\"Endemic\",INTRO!$E$39=\"Non-endemic\"),IF(COUNTRY_INFO!C29=0,\" \",COUNTRY_INFO!C29),\" \")","v":" "},{"$f":"IF(COUNTRY_INFO!Z29<>\"\",COUNTRY_INFO!V29,0)","v":0},{"$f":"IF(AND(COUNTRY_INFO!Z29<>\"\",COUNTRY_INFO!$H29=1),COUNTRY_INFO!F29+COUNTRY_INFO!G29,0)","v":0},0,null,0]
[{"$f":"IF(AND(INTRO!$E$37=\"Endemic\",INTRO!$E$39=\"Non-endemic\"),IF(COUNTRY_INFO!A30=0,\" \",COUNTRY_INFO!A30),\" \")","v":" "},{"$f":"IF(AND(INTRO!$E$37=\"Endemic\",INTRO!$E$39=\"Non-endemic\"),IF(COUNTRY_INFO!B30=0,\" \",COUNTRY_INFO!B30),\" \")","v":" "},{"$f":"IF(AND(INTRO!$E$37=\"Endemic\",INTRO!$E$39=\"Non-endemic\"),IF(COUNTRY_INFO!C30=0,\" \",COUNTRY_INFO!C30),\" \")","v":" "},{"$f":"IF(COUNTRY_INFO!Z30<>\"\",COUNTRY_INFO!V30,0)","v":0},{"$f":"IF(AND(COUNTRY_INFO!Z30<>\"\",COUNTRY_INFO!$H30=1),COUNTRY_INFO!F30+COUNTRY_INFO!G30,0)","v":0},0,null,0]
[{"$f":"IF(AND(INTRO!$E$37=\"Endemic\",INTRO!$E$39=\"Non-endemic\"),IF(COUNTRY_INFO!A31=0,\" \",COUNTRY_INFO!A31),\" \")","v":" "},{"$f":"IF(AND(INTRO!$E$37=\"Endemic\",INTRO!$E$39=\"Non-endemic\"),IF(COUNTRY_INFO!B31=0,\" \",COUNTRY_INFO!B31),\" \")","v":" "},{"$f":"IF(AND(INTRO!$E$37=\"Endemic\",INTRO!$E$39=\"Non-endemic\"),IF(COUNTRY_INFO!C31=0,\" \",COUNTRY_INFO!C31),\" \")","v":" "},{"$f":"IF(COUNTRY_INFO!Z31<>\"\",COUNTRY_INFO!V31,0)","v":0},{"$f":"IF(AND(COUNTRY_INFO!Z31<>\"\",COUNTRY_INFO!$H31=1),COUNTRY_INFO!F31+COUNTRY_INFO!G31,0)","v":0},0,null,0]
[{"$f":"IF(AND(INTRO!$E$37=\"Endemic\",INTRO!$E$39=\"Non-endemic\"),IF(COUNTRY_INFO!A32=0,\" \",COUNTRY_INFO!A32),\" \")","v":" "},{"$f":"IF(AND(INTRO!$E$37=\"Endemic\",INTRO!$E$39=\"Non-endemic\"),IF(COUNTRY_INFO!B32=0,\" \",COUNTRY_INFO!B32),\" \")","v":" "},{"$f":"IF(AND(INTRO!$E$37=\"Endemic\",INTRO!$E$39=\"Non-endemic\"),IF(COUNTRY_INFO!C32=0,\" \",COUNTRY_INFO!C32),\" \")","v":" "},{"$f":"IF(COUNTRY_INFO!Z32<>\"\",COUNTRY_INFO!V32,0)","v":0},{"$f":"IF(AND(COUNTRY_INFO!Z32<>\"\",COUNTRY_INFO!$H32=1),COUNTRY_INFO!F32+COUNTRY_INFO!G32,0)","v":0},0,null,0]
[{"$f":"IF(AND(INTRO!$E$37=\"Endemic\",INTRO!$E$39=\"Non-endemic\"),IF(COUNTRY_INFO!A33=0,\" \",COUNTRY_INFO!A33),\" \")","v":" "},{"$f":"IF(AND(INTRO!$E$37=\"Endemic\",INTRO!$E$39=\"Non-endemic\"),IF(COUNTRY_INFO!B33=0,\" \",COUNTRY_INFO!B33),\" \")","v":" "},{"$f":"IF(AND(INTRO!$E$37=\"Endemic\",INTRO!$E$39=\"Non-endemic\"),IF(COUNTRY_INFO!C33=0,\" \",COUNTRY_INFO!C33),\" \")","v":" "},{"$f":"IF(COUNTRY_INFO!Z33<>\"\",COUNTRY_INFO!V33,0)","v":0},{"$f":"IF(AND(COUNTRY_INFO!Z33<>\"\",COUNTRY_INFO!$H33=1),COUNTRY_INFO!F33+COUNTRY_INFO!G33,0)","v":0},0,null,0]
[{"$f":"IF(AND(INTRO!$E$37=\"Endemic\",INTRO!$E$39=\"Non-endemic\"),IF(COUNTRY_INFO!A34=0,\" \",COUNTRY_INFO!A34),\" \")","v":" "},{"$f":"IF(AND(INTRO!$E$37=\"Endemic\",INTRO!$E$39=\"Non-endemic\"),IF(COUNTRY_INFO!B34=0,\" \",COUNTRY_INFO!B34),\" \")","v":" "},{"$f":"IF(AND(INTRO!$E$37=\"Endemic\",INTRO!$E$39=\"Non-endemic\"),IF(COUNTRY_INFO!C34=0,\" \",COUNTRY_INFO!C34),\" \")","v":" "},{"$f":"IF(COUNTRY_INFO!Z34<>\"\",COUNTRY_INFO!V34,0)","v":0},{"$f":"IF(AND(COUNTRY_INFO!Z34<>\"\",COUNTRY_INFO!$H34=1),COUNTRY_INFO!F34+COUNTRY_INFO!G34,0)","v":0},0,null,0]
[{"$f":"IF(AND(INTRO!$E$37=\"Endemic\",INTRO!$E$39=\"Non-endemic\"),IF(COUNTRY_INFO!A35=0,\" \",COUNTRY_INFO!A35),\" \")","v":" "},{"$f":"IF(AND(INTRO!$E$37=\"Endemic\",INTRO!$E$39=\"Non-endemic\"),IF(COUNTRY_INFO!B35=0,\" \",COUNTRY_INFO!B35),\" \")","v":" "},{"$f":"IF(AND(INTRO!$E$37=\"Endemic\",INTRO!$E$39=\"Non-endemic\"),IF(COUNTRY_INFO!C35=0,\" \",COUNTRY_INFO!C35),\" \")","v":" "},{"$f":"IF(COUNTRY_INFO!Z35<>\"\",COUNTRY_INFO!V35,0)","v":0},{"$f":"IF(AND(COUNTRY_INFO!Z35<>\"\",COUNTRY_INFO!$H35=1),COUNTRY_INFO!F35+COUNTRY_INFO!G35,0)","v":0},0,null,0]
[{"$f":"IF(AND(INTRO!$E$37=\"Endemic\",INTRO!$E$39=\"Non-endemic\"),IF(COUNTRY_INFO!A36=0,\" \",COUNTRY_INFO!A36),\" \")","v":" "},{"$f":"IF(AND(INTRO!$E$37=\"Endemic\",INTRO!$E$39=\"Non-endemic\"),IF(COUNTRY_INFO!B36=0,\" \",COUNTRY_INFO!B36),\" \")","v":" "},{"$f":"IF(AND(INTRO!$E$37=\"Endemic\",INTRO!$E$39=\"Non-endemic\"),IF(COUNTRY_INFO!C36=0,\" \",COUNTRY_INFO!C36),\" \")","v":" "},{"$f":"IF(COUNTRY_INFO!Z36<>\"\",COUNTRY_INFO!V36,0)","v":0},{"$f":"IF(AND(COUNTRY_INFO!Z36<>\"\",COUNTRY_INFO!$H36=1),COUNTRY_INFO!F36+COUNTRY_INFO!G36,0)","v":0},0,null,0]
[{"$f":"IF(AND(INTRO!$E$37=\"Endemic\",INTRO!$E$39=\"Non-endemic\"),IF(COUNTRY_INFO!A37=0,\" \",COUNTRY_INFO!A37),\" \")","v":" "},{"$f":"IF(AND(INTRO!$E$37=\"Endemic\",INTRO!$E$39=\"Non-endemic\"),IF(COUNTRY_INFO!B37=0,\" \",COUNTRY_INFO!B37),\" \")","v":" "},{"$f":"IF(AND(INTRO!$E$37=\"Endemic\",INTRO!$E$39=\"Non-endemic\"),IF(COUNTRY_INFO!C37=0,\" \",COUNTRY_INFO!C37),\" \")","v":" "},{"$f":"IF(COUNTRY_INFO!Z37<>\"\",COUNTRY_INFO!V37,0)","v":0},{"$f":"IF(AND(COUNTRY_INFO!Z37<>\"\",COUNTRY_INFO!$H37=1),COUNTRY_INFO!F37+COUNTRY_INFO!G37,0)","v":0},0,null,0]
[{"$f":"IF(AND(INTRO!$E$37=\"Endemic\",INTRO!$E$39=\"Non-endemic\"),IF(COUNTRY_INFO!A38=0,\" \",COUNTRY_INFO!A38),\" \")","v":" "},{"$f":"IF(AND(INTRO!$E$37=\"Endemic\",INTRO!$E$39=\"Non-endemic\"),IF(COUNTRY_INFO!B38=0,\" \",COUNTRY_INFO!B38),\" \")","v":" "},{"$f":"IF(AND(INTRO!$E$37=\"Endemic\",INTRO!$E$39=\"Non-endemic\"),IF(COUNTRY_INFO!C38=0,\" \",COUNTRY_INFO!C38),\" \")","v":" "},{"$f":"IF(COUNTRY_INFO!Z38<>\"\",COUNTRY_INFO!V38,0)","v":0},{"$f":"IF(AND(COUNTRY_INFO!Z38<>\"\",COUNTRY_INFO!$H38=1),COUNTRY_INFO!F38+COUNTRY_INFO!G38,0)","v":0},0,null,0]
[{"$f":"IF(AND(INTRO!$E$37=\"Endemic\",INTRO!$E$39=\"Non-endemic\"),IF(COUNTRY_INFO!A39=0,\" \",COUNTRY_INFO!A39),\" \")","v":" "},{"$f":"IF(AND(INTRO!$E$37=\"Endemic\",INTRO!$E$39=\"Non-endemic\"),IF(COUNTRY_INFO!B39=0,\" \",COUNTRY_INFO!B39),\" \")","v":" "},{"$f":"IF(AND(INTRO!$E$37=\"Endemic\",INTRO!$E$39=\"Non-endemic\"),IF(COUNTRY_INFO!C39=0,\" \",COUNTRY_INFO!C39),\" \")","v":" "},{"$f":"IF(COUNTRY_INFO!Z39<>\"\",COUNTRY_INFO!V39,0)","v":0},{"$f":"IF(AND(COUNTRY_INFO!Z39<>\"\",COUNTRY_INFO!$H39=1),COUNTRY_INFO!F39+COUNTRY_INFO!G39,0)","v":0},0,null,0]
[{"$f":"IF(AND(INTRO!$E$37=\"Endemic\",INTRO!$E$39=\"Non-endemic\"),IF(COUNTRY_INFO!A40=0,\" \",COUNTRY_INFO!A40),\" \")","v":" "},{"$f":"IF(AND(INTRO!$E$37=\"Endemic\",INTRO!$E$39=\"Non-endemic\"),IF(COUNTRY_INFO!B40=0,\" \",COUNTRY_INFO!B40),\" \")","v":" "},{"$f":"IF(AND(INTRO!$E$37=\"Endemic\",INTRO!$E$39=\"Non-endemic\"),IF(COUNTRY_INFO!C40=0,\" \",COUNTRY_INFO!C40),\" \")","v":" "},{"$f":"IF(COUNTRY_INFO!Z40<>\"\",COUNTRY_INFO!V40,0)","v":0},{"$f":"IF(AND(COUNTRY_INFO!Z40<>\"\",COUNTRY_INFO!$H40=1),COUNTRY_INFO!F40+COUNTRY_INFO!G40,0)","v":0},0,null,0]
[{"$f":"IF(AND(INTRO!$E$37=\"Endemic\",INTRO!$E$39=\"Non-endemic\"),IF(COUNTRY_INFO!A41=0,\" \",COUNTRY_INFO!A41),\" \")","v":" "},{"$f":"IF(AND(INTRO!$E$37=\"Endemic\",INTRO!$E$39=\"Non-endemic\"),IF(COUNTRY_INFO!B41=0,\" \",COUNTRY_INFO!B41),\" \")","v":" "},{"$f":"IF(AND(INTRO!$E$37=\"Endemic\",INTRO!$E$39=\"Non-endemic\"),IF(COUNTRY_INFO!C41=0,\" \",COUNTRY_INFO!C41),\" \")","v":" "},{"$f":"IF(COUNTRY_INFO!Z41<>\"\",COUNTRY_INFO!V41,0)","v":0},{"$f":"IF(AND(COUNTRY_INFO!Z41<>\"\",COUNTRY_INFO!$H41=1),COUNTRY_INFO!F41+COUNTRY_INFO!G41,0)","v":0},0,null,0]
[{"$f":"IF(AND(INTRO!$E$37=\"Endemic\",INTRO!$E$39=\"Non-endemic\"),IF(COUNTRY_INFO!A42=0,\" \",COUNTRY_INFO!A42),\" \")","v":" "},{"$f":"IF(AND(INTRO!$E$37=\"Endemic\",INTRO!$E$39=\"Non-endemic\"),IF(COUNTRY_INFO!B42=0,\" \",COUNTRY_INFO!B42),\" \")","v":" "},{"$f":"IF(AND(INTRO!$E$37=\"Endemic\",INTRO!$E$39=\"Non-endemic\"),IF(COUNTRY_INFO!C42=0,\" \",COUNTRY_INFO!C42),\" \")","v":" "},{"$f":"IF(COUNTRY_INFO!Z42<>\"\",COUNTRY_INFO!V42,0)","v":0},{"$f":"IF(AND(COUNTRY_INFO!Z42<>\"\",COUNTRY_INFO!$H42=1),COUNTRY_INFO!F42+COUNTRY_INFO!G42,0)","v":0},0,null,0]
[{"$f":"IF(AND(INTRO!$E$37=\"Endemic\",INTRO!$E$39=\"Non-endemic\"),IF(COUNTRY_INFO!A43=0,\" \",COUNTRY_INFO!A43),\" \")","v":" "},{"$f":"IF(AND(INTRO!$E$37=\"Endemic\",INTRO!$E$39=\"Non-endemic\"),IF(COUNTRY_INFO!B43=0,\" \",COUNTRY_INFO!B43),\" \")","v":" "},{"$f":"IF(AND(INTRO!$E$37=\"Endemic\",INTRO!$E$39=\"Non-endemic\"),IF(COUNTRY_INFO!C43=0,\" \",COUNTRY_INFO!C43),\" \")","v":" "},{"$f":"IF(COUNTRY_INFO!Z43<>\"\",COUNTRY_INFO!V43,0)","v":0},{"$f":"IF(AND(COUNTRY_INFO!Z43<>\"\",COUNTRY_INFO!$H43=1),COUNTRY_INFO!F43+COUNTRY_INFO!G43,0)","v":0},0,null,0]
[{"$f":"IF(AND(INTRO!$E$37=\"Endemic\",INTRO!$E$39=\"Non-endemic\"),IF(COUNTRY_INFO!A44=0,\" \",COUNTRY_INFO!A44),\" \")","v":" "},{"$f":"IF(AND(INTRO!$E$37=\"Endemic\",INTRO!$E$39=\"Non-endemic\"),IF(COUNTRY_INFO!B44=0,\" \",COUNTRY_INFO!B44),\" \")","v":" "},{"$f":"IF(AND(INTRO!$E$37=\"Endemic\",INTRO!$E$39=\"Non-endemic\"),IF(COUNTRY_INFO!C44=0,\" \",COUNTRY_INFO!C44),\" \")","v":" "},{"$f":"IF(COUNTRY_INFO!Z44<>\"\",COUNTRY_INFO!V44,0)","v":0},{"$f":"IF(AND(COUNTRY_INFO!Z44<>\"\",COUNTRY_INFO!$H44=1),COUNTRY_INFO!F44+COUNTRY_INFO!G44,0)","v":0},0,null,0]
[{"$f":"IF(AND(INTRO!$E$37=\"Endemic\",INTRO!$E$39=\"Non-endemic\"),IF(COUNTRY_INFO!A45=0,\" \",COUNTRY_INFO!A45),\" \")","v":" "},{"$f":"IF(AND(INTRO!$E$37=\"Endemic\",INTRO!$E$39=\"Non-endemic\"),IF(COUNTRY_INFO!B45=0,\" \",COUNTRY_INFO!B45),\" \")","v":" "},{"$f":"IF(AND(INTRO!$E$37=\"Endemic\",INTRO!$E$39=\"Non-endemic\"),IF(COUNTRY_INFO!C45=0,\" \",COUNTRY_INFO!C45),\" \")","v":" "},{"$f":"IF(COUNTRY_INFO!Z45<>\"\",COUNTRY_INFO!V45,0)","v":0},{"$f":"IF(AND(COUNTRY_INFO!Z45<>\"\",COUNTRY_INFO!$H45=1),COUNTRY_INFO!F45+COUNTRY_INFO!G45,0)","v":0},0,null,0]
[{"$f":"IF(AND(INTRO!$E$37=\"Endemic\",INTRO!$E$39=\"Non-endemic\"),IF(COUNTRY_INFO!A46=0,\" \",COUNTRY_INFO!A46),\" \")","v":" "},{"$f":"IF(AND(INTRO!$E$37=\"Endemic\",INTRO!$E$39=\"Non-endemic\"),IF(COUNTRY_INFO!B46=0,\" \",COUNTRY_INFO!B46),\" \")","v":" "},{"$f":"IF(AND(INTRO!$E$37=\"Endemic\",INTRO!$E$39=\"Non-endemic\"),IF(COUNTRY_INFO!C46=0,\" \",COUNTRY_INFO!C46),\" \")","v":" "},{"$f":"IF(COUNTRY_INFO!Z46<>\"\",COUNTRY_INFO!V46,0)","v":0},{"$f":"IF(AND(COUNTRY_INFO!Z46<>\"\",COUNTRY_INFO!$H46=1),COUNTRY_INFO!F46+COUNTRY_INFO!G46,0)","v":0},0,null,0]
[{"$f":"IF(AND(INTRO!$E$37=\"Endemic\",INTRO!$E$39=\"Non-endemic\"),IF(COUNTRY_INFO!A47=0,\" \",COUNTRY_INFO!A47),\" \")","v":" "},{"$f":"IF(AND(INTRO!$E$37=\"Endemic\",INTRO!$E$39=\"Non-endemic\"),IF(COUNTRY_INFO!B47=0,\" \",COUNTRY_INFO!B47),\" \")","v":" "},{"$f":"IF(AND(INTRO!$E$37=\"Endemic\",INTRO!$E$39=\"Non-endemic\"),IF(COUNTRY_INFO!C47=0,\" \",COUNTRY_INFO!C47),\" \")","v":" "},{"$f":"IF(COUNTRY_INFO!Z47<>\"\",COUNTRY_INFO!V47,0)","v":0},{"$f":"IF(AND(COUNTRY_INFO!Z47<>\"\",COUNTRY_INFO!$H47=1),COUNTRY_INFO!F47+COUNTRY_INFO!G47,0)","v":0},0,null,0]
[{"$f":"IF(AND(INTRO!$E$37=\"Endemic\",INTRO!$E$39=\"Non-endemic\"),IF(COUNTRY_INFO!A48=0,\" \",COUNTRY_INFO!A48),\" \")","v":" "},{"$f":"IF(AND(INTRO!$E$37=\"Endemic\",INTRO!$E$39=\"Non-endemic\"),IF(COUNTRY_INFO!B48=0,\" \",COUNTRY_INFO!B48),\" \")","v":" "},{"$f":"IF(AND(INTRO!$E$37=\"Endemic\",INTRO!$E$39=\"Non-endemic\"),IF(COUNTRY_INFO!C48=0,\" \",COUNTRY_INFO!C48),\" \")","v":" "},{"$f":"IF(COUNTRY_INFO!Z48<>\"\",COUNTRY_INFO!V48,0)","v":0},{"$f":"IF(AND(COUNTRY_INFO!Z48<>\"\",COUNTRY_INFO!$H48=1),COUNTRY_INFO!F48+COUNTRY_INFO!G48,0)","v":0},0,null,0]
[{"$f":"IF(AND(INTRO!$E$37=\"Endemic\",INTRO!$E$39=\"Non-endemic\"),IF(COUNTRY_INFO!A49=0,\" \",COUNTRY_INFO!A49),\" \")","v":" "},{"$f":"IF(AND(INTRO!$E$37=\"Endemic\",INTRO!$E$39=\"Non-endemic\"),IF(COUNTRY_INFO!B49=0,\" \",COUNTRY_INFO!B49),\" \")","v":" "},{"$f":"IF(AND(INTRO!$E$37=\"Endemic\",INTRO!$E$39=\"Non-endemic\"),IF(COUNTRY_INFO!C49=0,\" \",COUNTRY_INFO!C49),\" \")","v":" "},{"$f":"IF(COUNTRY_INFO!Z49<>\"\",COUNTRY_INFO!V49,0)","v":0},{"$f":"IF(AND(COUNTRY_INFO!Z49<>\"\",COUNTRY_INFO!$H49=1),COUNTRY_INFO!F49+COUNTRY_INFO!G49,0)","v":0},0,null,0]
[{"$f":"IF(AND(INTRO!$E$37=\"Endemic\",INTRO!$E$39=\"Non-endemic\"),IF(COUNTRY_INFO!A50=0,\" \",COUNTRY_INFO!A50),\" \")","v":" "},{"$f":"IF(AND(INTRO!$E$37=\"Endemic\",INTRO!$E$39=\"Non-endemic\"),IF(COUNTRY_INFO!B50=0,\" \",COUNTRY_INFO!B50),\" \")","v":" "},{"$f":"IF(AND(INTRO!$E$37=\"Endemic\",INTRO!$E$39=\"Non-endemic\"),IF(COUNTRY_INFO!C50=0,\" \",COUNTRY_INFO!C50),\" \")","v":" "},{"$f":"IF(COUNTRY_INFO!Z50<>\"\",COUNTRY_INFO!V50,0)","v":0},{"$f":"IF(AND(COUNTRY_INFO!Z50<>\"\",COUNTRY_INFO!$H50=1),COUNTRY_INFO!F50+COUNTRY_INFO!G50,0)","v":0},0,null,0]
[{"$f":"IF(AND(INTRO!$E$37=\"Endemic\",INTRO!$E$39=\"Non-endemic\"),IF(COUNTRY_INFO!A51=0,\" \",COUNTRY_INFO!A51),\" \")","v":" "},{"$f":"IF(AND(INTRO!$E$37=\"Endemic\",INTRO!$E$39=\"Non-endemic\"),IF(COUNTRY_INFO!B51=0,\" \",COUNTRY_INFO!B51),\" \")","v":" "},{"$f":"IF(AND(INTRO!$E$37=\"Endemic\",INTRO!$E$39=\"Non-endemic\"),IF(COUNTRY_INFO!C51=0,\" \",COUNTRY_INFO!C51),\" \")","v":" "},{"$f":"IF(COUNTRY_INFO!Z51<>\"\",COUNTRY_INFO!V51,0)","v":0},{"$f":"IF(AND(COUNTRY_INFO!Z51<>\"\",COUNTRY_INFO!$H51=1),COUNTRY_INFO!F51+COUNTRY_INFO!G51,0)","v":0},0,null,0]
[{"$f":"IF(AND(INTRO!$E$37=\"Endemic\",INTRO!$E$39=\"Non-endemic\"),IF(COUNTRY_INFO!A52=0,\" \",COUNTRY_INFO!A52),\" \")","v":" "},{"$f":"IF(AND(INTRO!$E$37=\"Endemic\",INTRO!$E$39=\"Non-endemic\"),IF(COUNTRY_INFO!B52=0,\" \",COUNTRY_INFO!B52),\" \")","v":" "},{"$f":"IF(AND(INTRO!$E$37=\"Endemic\",INTRO!$E$39=\"Non-endemic\"),IF(COUNTRY_INFO!C52=0,\" \",COUNTRY_INFO!C52),\" \")","v":" "},{"$f":"IF(COUNTRY_INFO!Z52<>\"\",COUNTRY_INFO!V52,0)","v":0},{"$f":"IF(AND(COUNTRY_INFO!Z52<>\"\",COUNTRY_INFO!$H52=1),COUNTRY_INFO!F52+COUNTRY_INFO!G52,0)","v":0},0,null,0]
[{"$f":"IF(AND(INTRO!$E$37=\"Endemic\",INTRO!$E$39=\"Non-endemic\"),IF(COUNTRY_INFO!A53=0,\" \",COUNTRY_INFO!A53),\" \")","v":" "},{"$f":"IF(AND(INTRO!$E$37=\"Endemic\",INTRO!$E$39=\"Non-endemic\"),IF(COUNTRY_INFO!B53=0,\" \",COUNTRY_INFO!B53),\" \")","v":" "},{"$f":"IF(AND(INTRO!$E$37=\"Endemic\",INTRO!$E$39=\"Non-endemic\"),IF(COUNTRY_INFO!C53=0,\" \",COUNTRY_INFO!C53),\" \")","v":" "},{"$f":"IF(COUNTRY_INFO!Z53<>\"\",COUNTRY_INFO!V53,0)","v":0},{"$f":"IF(AND(COUNTRY_INFO!Z53<>\"\",COUNTRY_INFO!$H53=1),COUNTRY_INFO!F53+COUNTRY_INFO!G53,0)","v":0},0,null,0]
[{"$f":"IF(AND(INTRO!$E$37=\"Endemic\",INTRO!$E$39=\"Non-endemic\"),IF(COUNTRY_INFO!A54=0,\" \",COUNTRY_INFO!A54),\" \")","v":" "},{"$f":"IF(AND(INTRO!$E$37=\"Endemic\",INTRO!$E$39=\"Non-endemic\"),IF(COUNTRY_INFO!B54=0,\" \",COUNTRY_INFO!B54),\" \")","v":" "},{"$f":"IF(AND(INTRO!$E$37=\"Endemic\",INTRO!$E$39=\"Non-endemic\"),IF(COUNTRY_INFO!C54=0,\" \",COUNTRY_INFO!C54),\" \")","v":" "},{"$f":"IF(COUNTRY_INFO!Z54<>\"\",COUNTRY_INFO!V54,0)","v":0},{"$f":"IF(AND(COUNTRY_INFO!Z54<>\"\",COUNTRY_INFO!$H54=1),COUNTRY_INFO!F54+COUNTRY_INFO!G54,0)","v":0},0,null,0]
[{"$f":"IF(AND(INTRO!$E$37=\"Endemic\",INTRO!$E$39=\"Non-endemic\"),IF(COUNTRY_INFO!A55=0,\" \",COUNTRY_INFO!A55),\" \")","v":" "},{"$f":"IF(AND(INTRO!$E$37=\"Endemic\",INTRO!$E$39=\"Non-endemic\"),IF(COUNTRY_INFO!B55=0,\" \",COUNTRY_INFO!B55),\" \")","v":" "},{"$f":"IF(AND(INTRO!$E$37=\"Endemic\",INTRO!$E$39=\"Non-endemic\"),IF(COUNTRY_INFO!C55=0,\" \",COUNTRY_INFO!C55),\" \")","v":" "},{"$f":"IF(COUNTRY_INFO!Z55<>\"\",COUNTRY_INFO!V55,0)","v":0},{"$f":"IF(AND(COUNTRY_INFO!Z55<>\"\",COUNTRY_INFO!$H55=1),COUNTRY_INFO!F55+COUNTRY_INFO!G55,0)","v":0},0,null,0]
[{"$f":"IF(AND(INTRO!$E$37=\"Endemic\",INTRO!$E$39=\"Non-endemic\"),IF(COUNTRY_INFO!A56=0,\" \",COUNTRY_INFO!A56),\" \")","v":" "},{"$f":"IF(AND(INTRO!$E$37=\"Endemic\",INTRO!$E$39=\"Non-endemic\"),IF(COUNTRY_INFO!B56=0,\" \",COUNTRY_INFO!B56),\" \")","v":" "},{"$f":"IF(AND(INTRO!$E$37=\"Endemic\",INTRO!$E$39=\"Non-endemic\"),IF(COUNTRY_INFO!C56=0,\" \",COUNTRY_INFO!C56),\" \")","v":" "},{"$f":"IF(COUNTRY_INFO!Z56<>\"\",COUNTRY_INFO!V56,0)","v":0},{"$f":"IF(AND(COUNTRY_INFO!Z56<>\"\",COUNTRY_INFO!$H56=1),COUNTRY_INFO!F56+COUNTRY_INFO!G56,0)","v":0},0,null,0]
[{"$f":"IF(AND(INTRO!$E$37=\"Endemic\",INTRO!$E$39=\"Non-endemic\"),IF(COUNTRY_INFO!A57=0,\" \",COUNTRY_INFO!A57),\" \")","v":" "},{"$f":"IF(AND(INTRO!$E$37=\"Endemic\",INTRO!$E$39=\"Non-endemic\"),IF(COUNTRY_INFO!B57=0,\" \",COUNTRY_INFO!B57),\" \")","v":" "},{"$f":"IF(AND(INTRO!$E$37=\"Endemic\",INTRO!$E$39=\"Non-endemic\"),IF(COUNTRY_INFO!C57=0,\" \",COUNTRY_INFO!C57),\" \")","v":" "},{"$f":"IF(COUNTRY_INFO!Z57<>\"\",COUNTRY_INFO!V57,0)","v":0},{"$f":"IF(AND(COUNTRY_INFO!Z57<>\"\",COUNTRY_INFO!$H57=1),COUNTRY_INFO!F57+COUNTRY_INFO!G57,0)","v":0},0,null,0]
[{"$f":"IF(AND(INTRO!$E$37=\"Endemic\",INTRO!$E$39=\"Non-endemic\"),IF(COUNTRY_INFO!A58=0,\" \",COUNTRY_INFO!A58),\" \")","v":" "},{"$f":"IF(AND(INTRO!$E$37=\"Endemic\",INTRO!$E$39=\"Non-endemic\"),IF(COUNTRY_INFO!B58=0,\" \",COUNTRY_INFO!B58),\" \")","v":" "},{"$f":"IF(AND(INTRO!$E$37=\"Endemic\",INTRO!$E$39=\"Non-endemic\"),IF(COUNTRY_INFO!C58=0,\" \",COUNTRY_INFO!C58),\" \")","v":" "},{"$f":"IF(COUNTRY_INFO!Z58<>\"\",COUNTRY_INFO!V58,0)","v":0},{"$f":"IF(AND(COUNTRY_INFO!Z58<>\"\",COUNTRY_INFO!$H58=1),COUNTRY_INFO!F58+COUNTRY_INFO!G58,0)","v":0},0,null,0]
[{"$f":"IF(AND(INTRO!$E$37=\"Endemic\",INTRO!$E$39=\"Non-endemic\"),IF(COUNTRY_INFO!A59=0,\" \",COUNTRY_INFO!A59),\" \")","v":" "},{"$f":"IF(AND(INTRO!$E$37=\"Endemic\",INTRO!$E$39=\"Non-endemic\"),IF(COUNTRY_INFO!B59=0,\" \",COUNTRY_INFO!B59),\" \")","v":" "},{"$f":"IF(AND(INTRO!$E$37=\"Endemic\",INTRO!$E$39=\"Non-endemic\"),IF(COUNTRY_INFO!C59=0,\" \",COUNTRY_INFO!C59),\" \")","v":" "},{"$f":"IF(COUNTRY_INFO!Z59<>\"\",COUNTRY_INFO!V59,0)","v":0},{"$f":"IF(AND(COUNTRY_INFO!Z59<>\"\",COUNTRY_INFO!$H59=1),COUNTRY_INFO!F59+COUNTRY_INFO!G59,0)","v":0},0,null,0]
[{"$f":"IF(AND(INTRO!$E$37=\"Endemic\",INTRO!$E$39=\"Non-endemic\"),IF(COUNTRY_INFO!A60=0,\" \",COUNTRY_INFO!A60),\" \")","v":" "},{"$f":"IF(AND(INTRO!$E$37=\"Endemic\",INTRO!$E$39=\"Non-endemic\"),IF(COUNTRY_INFO!B60=0,\" \",COUNTRY_INFO!B60),\" \")","v":" "},{"$f":"IF(AND(INTRO!$E$37=\"Endemic\",INTRO!$E$39=\"Non-endemic\"),IF(COUNTRY_INFO!C60=0,\" \",COUNTRY_INFO!C60),\" \")","v":" "},{"$f":"IF(COUNTRY_INFO!Z60<>\"\",COUNTRY_INFO!V60,0)","v":0},{"$f":"IF(AND(COUNTRY_INFO!Z60<>\"\",COUNTRY_INFO!$H60=1),COUNTRY_INFO!F60+COUNTRY_INFO!G60,0)","v":0},0,null,0]
[{"$f":"IF(AND(INTRO!$E$37=\"Endemic\",INTRO!$E$39=\"Non-endemic\"),IF(COUNTRY_INFO!A61=0,\" \",COUNTRY_INFO!A61),\" \")","v":" "},{"$f":"IF(AND(INTRO!$E$37=\"Endemic\",INTRO!$E$39=\"Non-endemic\"),IF(COUNTRY_INFO!B61=0,\" \",COUNTRY_INFO!B61),\" \")","v":" "},{"$f":"IF(AND(INTRO!$E$37=\"Endemic\",INTRO!$E$39=\"Non-endemic\"),IF(COUNTRY_INFO!C61=0,\" \",COUNTRY_INFO!C61),\" \")","v":" "},{"$f":"IF(COUNTRY_INFO!Z61<>\"\",COUNTRY_INFO!V61,0)","v":0},{"$f":"IF(AND(COUNTRY_INFO!Z61<>\"\",COUNTRY_INFO!$H61=1),COUNTRY_INFO!F61+COUNTRY_INFO!G61,0)","v":0},0,null,0]
[{"$f":"IF(AND(INTRO!$E$37=\"Endemic\",INTRO!$E$39=\"Non-endemic\"),IF(COUNTRY_INFO!A62=0,\" \",COUNTRY_INFO!A62),\" \")","v":" "},{"$f":"IF(AND(INTRO!$E$37=\"Endemic\",INTRO!$E$39=\"Non-endemic\"),IF(COUNTRY_INFO!B62=0,\" \",COUNTRY_INFO!B62),\" \")","v":" "},{"$f":"IF(AND(INTRO!$E$37=\"Endemic\",INTRO!$E$39=\"Non-endemic\"),IF(COUNTRY_INFO!C62=0,\" \",COUNTRY_INFO!C62),\" \")","v":" "},{"$f":"IF(COUNTRY_INFO!Z62<>\"\",COUNTRY_INFO!V62,0)","v":0},{"$f":"IF(AND(COUNTRY_INFO!Z62<>\"\",COUNTRY_INFO!$H62=1),COUNTRY_INFO!F62+COUNTRY_INFO!G62,0)","v":0},0,null,0]
[{"$f":"IF(AND(INTRO!$E$37=\"Endemic\",INTRO!$E$39=\"Non-endemic\"),IF(COUNTRY_INFO!A63=0,\" \",COUNTRY_INFO!A63),\" \")","v":" "},{"$f":"IF(AND(INTRO!$E$37=\"Endemic\",INTRO!$E$39=\"Non-endemic\"),IF(COUNTRY_INFO!B63=0,\" \",COUNTRY_INFO!B63),\" \")","v":" "},{"$f":"IF(AND(INTRO!$E$37=\"Endemic\",INTRO!$E$39=\"Non-endemic\"),IF(COUNTRY_INFO!C63=0,\" \",COUNTRY_INFO!C63),\" \")","v":" "},{"$f":"IF(COUNTRY_INFO!Z63<>\"\",COUNTRY_INFO!V63,0)","v":0},{"$f":"IF(AND(COUNTRY_INFO!Z63<>\"\",COUNTRY_INFO!$H63=1),COUNTRY_INFO!F63+COUNTRY_INFO!G63,0)","v":0},0,null,0]
[{"$f":"IF(AND(INTRO!$E$37=\"Endemic\",INTRO!$E$39=\"Non-endemic\"),IF(COUNTRY_INFO!A64=0,\" \",COUNTRY_INFO!A64),\" \")","v":" "},{"$f":"IF(AND(INTRO!$E$37=\"Endemic\",INTRO!$E$39=\"Non-endemic\"),IF(COUNTRY_INFO!B64=0,\" \",COUNTRY_INFO!B64),\" \")","v":" "},{"$f":"IF(AND(INTRO!$E$37=\"Endemic\",INTRO!$E$39=\"Non-endemic\"),IF(COUNTRY_INFO!C64=0,\" \",COUNTRY_INFO!C64),\" \")","v":" "},{"$f":"IF(COUNTRY_INFO!Z64<>\"\",COUNTRY_INFO!V64,0)","v":0},{"$f":"IF(AND(COUNTRY_INFO!Z64<>\"\",COUNTRY_INFO!$H64=1),COUNTRY_INFO!F64+COUNTRY_INFO!G64,0)","v":0},0,null,0]
[{"$f":"IF(AND(INTRO!$E$37=\"Endemic\",INTRO!$E$39=\"Non-endemic\"),IF(COUNTRY_INFO!A65=0,\" \",COUNTRY_INFO!A65),\" \")","v":" "},{"$f":"IF(AND(INTRO!$E$37=\"Endemic\",INTRO!$E$39=\"Non-endemic\"),IF(COUNTRY_INFO!B65=0,\" \",COUNTRY_INFO!B65),\" \")","v":" "},{"$f":"IF(AND(INTRO!$E$37=\"Endemic\",INTRO!$E$39=\"Non-endemic\"),IF(COUNTRY_INFO!C65=0,\" \",COUNTRY_INFO!C65),\" \")","v":" "},{"$f":"IF(COUNTRY_INFO!Z65<>\"\",COUNTRY_INFO!V65,0)","v":0},{"$f":"IF(AND(COUNTRY_INFO!Z65<>\"\",COUNTRY_INFO!$H65=1),COUNTRY_INFO!F65+COUNTRY_INFO!G65,0)","v":0},0,null,0]
[{"$f":"IF(AND(INTRO!$E$37=\"Endemic\",INTRO!$E$39=\"Non-endemic\"),IF(COUNTRY_INFO!A66=0,\" \",COUNTRY_INFO!A66),\" \")","v":" "},{"$f":"IF(AND(INTRO!$E$37=\"Endemic\",INTRO!$E$39=\"Non-endemic\"),IF(COUNTRY_INFO!B66=0,\" \",COUNTRY_INFO!B66),\" \")","v":" "},{"$f":"IF(AND(INTRO!$E$37=\"Endemic\",INTRO!$E$39=\"Non-endemic\"),IF(COUNTRY_INFO!C66=0,\" \",COUNTRY_INFO!C66),\" \")","v":" "},{"$f":"IF(COUNTRY_INFO!Z66<>\"\",COUNTRY_INFO!V66,0)","v":0},{"$f":"IF(AND(COUNTRY_INFO!Z66<>\"\",COUNTRY_INFO!$H66=1),COUNTRY_INFO!F66+COUNTRY_INFO!G66,0)","v":0},0,null,0]
[{"$f":"IF(AND(INTRO!$E$37=\"Endemic\",INTRO!$E$39=\"Non-endemic\"),IF(COUNTRY_INFO!A67=0,\" \",COUNTRY_INFO!A67),\" \")","v":" "},{"$f":"IF(AND(INTRO!$E$37=\"Endemic\",INTRO!$E$39=\"Non-endemic\"),IF(COUNTRY_INFO!B67=0,\" \",COUNTRY_INFO!B67),\" \")","v":" "},{"$f":"IF(AND(INTRO!$E$37=\"Endemic\",INTRO!$E$39=\"Non-endemic\"),IF(COUNTRY_INFO!C67=0,\" \",COUNTRY_INFO!C67),\" \")","v":" "},{"$f":"IF(COUNTRY_INFO!Z67<>\"\",COUNTRY_INFO!V67,0)","v":0},{"$f":"IF(AND(COUNTRY_INFO!Z67<>\"\",COUNTRY_INFO!$H67=1),COUNTRY_INFO!F67+COUNTRY_INFO!G67,0)","v":0},0,null,0]
[{"$f":"IF(AND(INTRO!$E$37=\"Endemic\",INTRO!$E$39=\"Non-endemic\"),IF(COUNTRY_INFO!A68=0,\" \",COUNTRY_INFO!A68),\" \")","v":" "},{"$f":"IF(AND(INTRO!$E$37=\"Endemic\",INTRO!$E$39=\"Non-endemic\"),IF(COUNTRY_INFO!B68=0,\" \",COUNTRY_INFO!B68),\" \")","v":" "},{"$f":"IF(AND(INTRO!$E$37=\"Endemic\",INTRO!$E$39=\"Non-endemic\"),IF(COUNTRY_INFO!C68=0,\" \",COUNTRY_INFO!C68),\" \")","v":" "},{"$f":"IF(COUNTRY_INFO!Z68<>\"\",COUNTRY_INFO!V68,0)","v":0},{"$f":"IF(AND(COUNTRY_INFO!Z68<>\"\",COUNTRY_INFO!$H68=1),COUNTRY_INFO!F68+COUNTRY_INFO!G68,0)","v":0},0,null,0]

{"sheet":"SUMMARY","index":7,"n_rows":93,"n_cols":8,"rows_kept":93,"cut":false,"hidden":false,"merged":[[74,2,74,3],[74,4,74,5],[73,2,73,3],[73,4,73,5],[60,4,60,6],[61,4,61,6],[62,4,62,6],[72,2,72,3],[72,4,72,5],[25,1,27,1],[9,7,10,7],[32,2,35,4],[81,2,81,7],[83,3,83,7],[59,4,59,6],[50,1,50,7],[56,1,56,7],[51,1,51,7],[52,1,52,7],[80,1,80,7],[58,1,58,7],[78,1,78,7],[79,1,79,7],[66,1,66,7],[76,2,76,3],[9,1,10,1],[9,3,9,6],[9,2,10,2],[17,1,19,1],[21,1,23,1],[83,1,83,2],[0,1,0,7],[1,1,1,7],[2,1,2,5],[3,1,3,7],[4,1,4,7],[6,1,6,7],[5,2,5,5],[65,1,65,7],[54,1,54,7],[53,1,53,7],[36,1,36,7],[41,2,41,3],[41,4,41,5],[41,6,41,7],[55,1,55,7],[82,2,82,6],[63,4,63,6],[75,2,75,3],[97,1,97,7],[75,4,75,5],[70,4,70,5],[71,4,71,5],[70,2,70,3],[71,2,71,3],[92,1,92,7],[76,4,76,5],[87,1,87,7],[91,1,91,7],[86,1,86,7],[84,1,84,2],[84,3,84,7]]}
[]
[null,"Joint request for selected PC medicines v.4.1"]
[]
[null,"This form constitutes an official government request to WHO for the supply of the PC medicines. To ensure the medicines are delivered on time, the request for PC medicines should be submitted at least 9 months before the first date of MDA planned in the calendar year of the request. "]
[]
[null,"Country",{"$f":"IF(INTRO!$E$33<>0,INTRO!$E$33,\" \")","v":"Eswatini"},null,null,null,"Year",{"$f":"IF(INTRO!$E$35<>0,INTRO!$E$35,\" \")","v":2024}]
[]
[null,"Information on PC medicines requested to WHO"]
[]
[null,"PC medicine","Target group","Number of tablets",null,null,null,"Specify \nsource"]
[null,null,null,"Required","In stock","In pipeline","Requested"]
[null,"Diethylcarbamazine citrate","ALL",0,0,null,{"$f":"IF(D12>(E12+F12),D12-E12-F12, 0)","v":0}]
[null,null,null,null,null,null,0]
[null,"Ivermectin","ALL",0,0,null,0]
[]
[null,"Albendazole for LF","ALL",0,0,null,0]
[null,null,null,null,null,null,0]
[null,"Albendazole for STH","PreSAC",null,null,null,0]
[null,null,"SAC",19383,594000,null,0]
[null,null,"WRA",null,null,null,0]
[]
[null,"Mebendazole","PreSAC",null,null,null,0]
[null,null,"SAC",null,null,null,0]
[null,null,"WRA",null,null,null,0]
[]
[null,"Praziquantel","PreSAC",0,null,null,0]
[null,null,"SAC",423564,null,null,423564]
[null,null,"Adults",1773126,null,null,{"$f":"IF(D28>(E28+F28),D28-E28-F28, 0)","v":1773126}]
[]
[null,"Number of people to be treated with donated medicine ( see User Guide for details )"]
[]
[null,"Disease",null,null,null,"Round 1","Round 2","Round 3"]
[null,"Lymphatic filariasis","These figures are estimated only \nfor targeted age groups to be treated \nwith donated medicines in areas \nwhere treatment for \na specific disease is planned",null,null,0]
[null,"Onchocerciasis",null,null,null,0,0]
[null,"Schistosomiasis",null,null,null,802824,0]
[null,"Soil-transmitted helminthiases",null,null,null,48792,0,0]
[]
[]
[]
[null,"Information on planned PC interventions"]
[]
[null,"PC medicine","Planned date of the \n1st round of PC",null,"Planned date of the \n2nd round of PC",null,"Date by which the medicine should arrive to the national warehouse"]
[null,"Diethylcarbamazine citrate"]
[null,"Ivermectin"]
[null,"Albendazole for LF"]
[null,"Albendazole for STH","June",2024,null,null,"April",2024]
[null,"Mebendazole"]
[null,"Praziquantel","June",2024,null,null,"April",2024]
[]
[null,"Checklist"]
[null,"Submission"]
[null,"What should be submitted?"]
[null,"The supply of the requested medicines should be based on up-to-date epidemiological data, specific usage plans, and capacity for implementation. The following checklist ensures that all necessary forms and information are provided to WHO (in electronic format). "]
[null,"Joint request for selected PC medicines"]
[null,"Joint reporting form"]
[null,"PC epidemiological data reporting form"]
[]
[null,"Availability of funding for implementation in the year for which the medicines are requested"]
[]
[null,"Diseases \ntargeted for implementation","Total treatments","Funding secured for","Source",null,null,"Amount"]
[null,{"$f":"B33","v":"Lymphatic filariasis"},{"$f":"SUM(F33:H33)","v":0}]
[null,{"$f":"B34","v":"Onchocerciasis"},{"$f":"SUM(F34:H34)","v":0}]
[null,{"$f":"B35","v":"Schistosomiasis"},{"$f":"SUM(F35:H35)","v":802824},"no"]
[null,{"$f":"B36","v":"Soil-transmitted helminthiases"},{"$f":"SUM(F36:H36)","v":48792},"no"]
[]
[null,"Who should fill in the form? "]
[null,"National NTD coordinator should compile all required information needed to complete the request form. In the absence of such a coordinator, specific programme managers should coordinate their respective part. The final single request must be approved by the Ministry of Health."]
[]
[null,"Information on person(s) who has filled in the form"]
[]
[null,"Title ","Name",null,"Phone",null,"Email","Date"]
[null,"SCH Programme Manager","Quinton T. Dlamini",null,26876040060,null,"quintond50@gmail.com","2023-04-18"]
[null,"NTD/PC Coordinator","Mbongiseni N. Mathobela",null,26876286972,null,"kuhlase@yahoo.com","2023-04-18"]
[]
[]
[]
[]
[]
[null,"The WHO recommends that all serious adverse events suspected to be associated with use of PC medicines should be reported in accordance with national Pharmacovigilance guidelines. In the absence of a national Pharmacovigilance system, contact the WHO Neglected Tropical Disease department for guidance."]
[null,"The WHO is committed to facilitate PC medicines donation with a free-of-charge supply of a) albendazole, mebendazole and praziquantel to the MoH’s national warehouse; and b) diethylcarbamazine citrate to the entry port/airport of recipient countries."]
[null,"The institution submitting the present request is responsible for a) arranging the offloading of the medicines from the truck and storing it in the national warehouse and subsequent shipment to the final distribution centres; b) for registering the donated medicine, if required, by the relevant national regulatory authorities; and c) for informing about any changes of their PC campaigns (e.g. postpone of the planned MDA date, replacement of NTD coordinator, etc.)."]
[null,null,"I have read and accept WHO Data Sharing Policy"]
[null,null,"I confirm that all information provided in this form is complete and correct"]
[null,"Name and signature of NTD coordinator \nor Ministry of Health representative",null,"Mbongiseni Mathobela"]
[null,"Date:",null,"2023-04-18"]
[]
[null,"Please complete information on shipment and consignee in the worksheet SHIPMENT. Any additional details related to this Request should be provided in the \"Additional information\" box in the worksheet SHIPMENT."]
[null,"Please send the national request (signed and in electronic format) to the concerned WR with copy to:"]
[null,"WHO headquarters","PC_JointForms@who.int"]
[null,"WHO Regional Office","Regional Advisor for NTD"]
[null,"Mectizan donation program","Dr Yao Sodahlon, email: ysodahlon@taskforce.org"]
[]
[null,"Please note that your request will be reviewed by an independent panel before approval. The information in this form, joint reporting form and PC epidemiological data reporting form are essential for WHO to ensure efficient usage of medicines. As part of its ongoing monitoring and evaluation activities, and to meet its contractual obligations to donors and other partners, WHO and its appointed agents reserve the right to periodically inspect stocks of the medicines at country level."]

{"sheet":"SHIPMENT","index":8,"n_rows":46,"n_cols":8,"rows_kept":46,"cut":false,"hidden":false,"merged":[[34,1,34,7],[36,1,36,7],[0,1,0,7],[1,1,1,7],[2,1,2,5],[17,5,17,7],[18,5,18,7],[19,2,19,4],[19,5,19,7],[21,2,21,4],[3,2,3,5],[4,1,4,7],[22,2,22,4],[22,5,22,7],[15,2,15,4],[20,5,20,7],[15,5,15,7],[20,2,20,4],[18,2,18,4],[16,2,16,4],[47,1,56,7],[45,1,45,7],[37,1,37,6],[38,1,38,5],[40,1,40,7],[41,1,41,6],[39,1,39,6],[42,1,42,6],[43,1,43,7],[25,2,25,4],[25,5,25,7],[24,1,24,7],[6,1,6,7],[7,2,7,4],[7,5,7,7],[8,2,8,4],[8,5,8,7],[9,2,9,4],[9,5,9,7],[10,2,10,4],[10,5,10,7],[11,2,11,4],[11,5,11,7],[12,2,12,4],[12,5,12,7],[13,2,13,4],[13,5,13,7],[14,2,14,4],[14,5,14,7],[23,2,23,4],[23,5,23,7],[21,5,21,7],[16,5,16,7],[17,2,17,4],[26,2,26,4],[26,5,26,7],[27,2,27,4],[27,5,27,7],[28,2,28,4],[28,5,28,7],[32,2,32,4],[32,5,32,7],[29,2,29,4],[29,5,29,7],[30,2,30,4],[30,5,30,7],[31,2,31,4],[31,5,31,7]]}
[]
[null,"Joint request for selected PC medicines v.4.1"]
[]
[null,"Country",{"$f":"IF(INTRO!$E$33<>0,INTRO!$E$33,\" \")","v":"Eswatini"},null,null,null,"Year",{"$f":"IF(INTRO!$E$35<>0,INTRO!$E$35,\" \")","v":2024}]
[]
[null,"Information on shipment and consignee "]
[]
[null,null,"Consignee",null,null,"Delivery point / Final recipient\nif different from the consignee"]
[null,"Name","Dr Kevin Makadzange",null,null,"World Health Organization"]
[null,"Department/Unit","WHO Representative",null,null,"2nd Floor Lilunga House"]
[null,"Organization","World Health Organization",null,null,"Somhlolo Road"]
[null,"Phone",26824042928,null,null,"Mbabane "]
[null,"Fax",26824044566,null,null,"Swaziland"]
[null,"E-mail","Atsyorc@who.int"]
[null,"Mailing address","2nd Floor Liliunga House, Somhlolo Road, Mbabane, Swaziland"]
[]
[null,null,"Consignee",null,null,"Delivery point / Final recipient\nif different from the consignee"]
[null,"Name"]
[null,"Department/Unit"]
[null,"Organization"]
[null,"Phone"]
[null,"Fax"]
[null,"E-mail"]
[null,"Mailing address"]
[]
[null,null,"Consignee",null,null,"Delivery point / Final recipient\nif different from the consignee"]
[null,"Name"]
[null,"Department/Unit"]
[null,"Organization"]
[null,"Phone"]
[null,"Fax"]
[null,"E-mail"]
[null,"Mailing address"]
[]
[]
[null,"Information on import requirements"]
[]
[null,"Is the Import Permit required?",null,null,null,null,null,"Yes"]
[null,"How long does it take to obtain the Import Permit?",null,null,null,null,2,"Weeks"]
[null,"Do you require any documents to be submitted together with the Import Permit application?",null,null,null,null,null,"Yes"]
[null,"The invoice for the NTD Medicines"]
[null,"Does the consignee have to get customs clearance before the shipment can proceed?",null,null,null,null,null,"Yes"]
[null,"Is there any additional information may be helpful in ensuring timely clearance and delivery of medicines to your country? ",null,null,null,null,null,"Yes"]
[null,"Yes, tax exemption from Eswatini revenue services"]
[]
[null,"Additional information"]

{"sheet":"DATA_POLICY","index":9,"n_rows":39,"n_cols":8,"rows_kept":39,"cut":false,"hidden":true,"merged":[[55,1,55,2],[0,1,0,5],[1,1,1,7],[3,3,3,5],[6,1,6,7],[8,1,12,7],[13,1,16,7],[17,1,21,7],[22,1,25,7],[26,2,36,7],[38,1,45,7]]}
[]
[null,"Joint request for selected PC medicines v.4.1"]
[]
[null,"Country",null,{"$f":"IF(INTRO!$E$33<>0,INTRO!$E$33,\" \")","v":"Eswatini"},null,null,"Year",{"$f":"IF(INTRO!$E$35<>0,INTRO!$E$35,\" \")","v":2024}]
[]
[]
[null,"WHO Data Sharing Policy statement"]
[]
[null,"Data are the basis for all sound public health actions and the benefits of data sharing are widely recognized, including scientific and public health benefits. Whenever possible, WHO wishes to promote the sharing of health data, including but not restricted to surveillance and epidemiological data.  "]
[]
[]
[]
[]
[null,{"$f":"\"In this connection, and without prejudice to information sharing and publication pursuant to legally binding instruments, by providing data to WHO, the Ministry of Health of \" & D4 & \":\"","v":"In this connection, and without prejudice to information sharing and publication pursuant to legally binding instruments, by providing data to WHO, the Ministry of Health of Eswatini:"}]
[]
[]
[]
[null,"Confirms that all data to be supplied to WHO hereunder have been collected in accordance with applicable national laws, including data protection laws aimed at protecting the confidentiality of identifiable persons;"]
[]
[]
[]
[]
[null,{"$f":"\"Agrees that WHO shall be entitled, subject always to measures to ensure the ethical and secure use of the data, and subject always to an appropriate acknowledgement of \"&D4&\":\"","v":"Agrees that WHO shall be entitled, subject always to measures to ensure the ethical and secure use of the data, and subject always to an appropriate acknowledgement of Eswatini:"}]
[]
[]
[]
[null,null,"to publish the data, stripped of any personal identifiers and make the Data available to any interested party on request (to the extent they have not, or not yet, been published by WHO) on terms that allow non-commercial, not-for-profit use of the Data for public health purposes (provided always that publication of the Data shall remain under the control of WHO); \nto use, compile, aggregate, evaluate and analyse the Data and publish and disseminate the results thereof in conjunction with WHO’s work and in accordance with the Organization’s policies and practices."]
[]
[]
[]
[]
[]
[]
[]
[]
[]
[]
[]
[null,{"$f":"CONCATENATE(\"Except where data sharing and publication is required under legally binding instruments (IHR, WHO Nomenclature Regulations 1967, etc.), the Ministry of Health of \", D4,\" may in respect of certain data opt out of (any part of) the above,\" & \" by notifying WHO thereof in writing at the following address, provided that any such notification shall clearly identify the data in question and clearly indicate the scope of the opt-out (in reference to the  above), \" & \"and provided that specific reasons shall be given for the opt out.\")","v":"Except where data sharing and publication is required under legally binding instruments (IHR, WHO Nomenclature Regulations 1967, etc.), the Ministry of Health of Eswatini may in respect of certain data opt out of (any part of) the above, by notifying WHO thereof in writing at the following address, provided that any such notification shall clearly identify the data in question and clearly indicate the scope of the opt-out (in reference to the  above), and provided that specific reasons shall be given for the opt out."}]