{"text_format":"1","workbook":"xlsx","n_sheets":13,"sheets":["INTRO","COUNTRY_INFO","MDA1","MDA4","MDA3","T1","T2","T3_R1","T3_R2","DISTRICT","SUMMARY","PROFILE","DATA_POLICY"],"not_rendered":{"charts":8,"images":3,"macros":1,"external_links":0,"defined_names":5,"comments":11,"pivot_tables":0},"unopened":[],"bounds":{"document_bytes":16777216,"sheet_cells":100000,"rows_first":2000,"rows_last":500,"rows_between":2000,"halvings":0,"cell_chars":16384,"cell_head_chars":4096},"cells_cut":0,"cells_raw":0,"read":"whole","date_system":"1900"}

{"sheet":"INTRO","index":0,"n_rows":50,"n_cols":5,"rows_kept":50,"cut":false,"hidden":false,"merged":[[45,1,45,2],[10,2,10,4],[41,1,41,2],[43,1,43,2],[46,1,46,4],[33,1,33,2],[35,1,35,2],[26,2,27,4],[37,1,37,2],[39,1,39,2],[28,1,28,4],[29,2,29,4],[30,1,30,4],[31,1,31,4],[20,1,20,4],[21,2,21,4],[22,1,22,4],[23,2,24,4],[25,1,25,4],[15,1,15,4],[16,1,16,4],[17,1,17,4],[18,1,18,4],[19,2,19,4],[9,2,9,4],[11,2,11,4],[12,1,12,4],[13,1,13,4],[14,1,14,4],[0,2,0,4],[7,2,7,4],[8,2,8,4],[1,1,1,4],[2,1,2,4],[3,1,3,4],[4,1,4,4],[5,1,5,4]]}
[null,null,"Cette version sera utilisée par les pays endémiques à la Loase"]
[null,"Formulaire de Rapport Commun v.3.1 (L)"]
[]
[null,"Le but de ce formulaire de rapport commun - disponible sous forme de fichier Excel - est de mettre à disposition des autorités sanitaires nationales et des gestionnaires de données un outil standardisé qui réponde aux défis, facilite l'intégration et par conséquent contribue à améliorer la gestion de programme. Ce formulaire tend à standardiser le rapport de résultats des programmes nationaux, améliore la disponibilité et la coordination des données de chimioprévention à travers les Bureaux des Régions de l'Organisation mondiale de la Santé. \nLes autorités nationales sont priées de compléter ce formulaire et de le soumettre à l'Organisation mondiale de la Santé avant le 15 août de l'année en cours pour rapporter les données des activités de chimioprévention mises en oeuvre l'année précédente."]
[]
[null,"Structure de l'application (feuilles de travail) :"]
[]
[null,"INTRO","Cette feuille contient des instructions pour compléter le formulaire de rapport commun et des informations sur le statut de la chimioprévention pour les maladies d'endémie du pays. "]
[null,"COUNTRY_INFO","Cette feuille contient des informations sur la structure administrative du pays, la population par groupe d'âge, le statut d'endémicité pour chaque maladie, la population devant être traitée par chimioprévention, les interventions prévues et les interventions mises en oeuvre. "]
[null,"MDA1, MDA2, MDA3, T1, T2 et T3","Ces feuilles contiennent des informations sur l'endémicité des districts ciblés pour le traitement aux médicaments spécifiques pour la chimioprévention, les plans de traitement, et le nombre de personnes traitées par groupe d'âge. "]
[null,"DISTRICT","Cette feuille contient un résumé sur les personnes traitées, par maladie, au niveau de mise en oeuvre. Si les données par genre (sexe) sont disponibles, merci de les saisir.  "]
[null,"SUMMARY","Cette feuille contient un résumé sur les personnes traitées, par maladie et par type d'intervention de chimioprévention. Avant de générer le rapport (exécuter macro), veuillez sélectionner la maladie pour laquelle vous souhaitez un rapport. Veuillez suivre le même processus pour générer les divers rapports. \nCette feuille doit être imprimée et soumise comme formulaire de rapport commun (voir les instructions pour la soumission du formulaire sous la feuille SUMMARY). "]
[]
[null,"Instructions pour la saisie des données"]
[]
[null,"La plupart des cellules des feuilles de travail mentionnées ci-dessus contiennent des formules calculées automatiquement en fonction du protocole de traitement recommandé par l'OMS pour chaque maladie.\nVoir : http://www.who.int/neglected_diseases/preventive_chemotherapy/pct_manual/en/index.html"]
[]
[null,"Veuillez entrer vos données dans les cellules en fonction de leur code de couleur :"]
[]
[null,null,"Blanc - la cellule n'est pas protégée. Veuillez entrer la valeur de l'indicateur demandé."]
[]
[null,null,"Jaune - la cellule est protégée et inclut le nom de l'indicateur. Aucune entrée de données requise."]
[]
[null,null,"Orange - la cellule n'est pas protégée et contient un menu déroulant. Veuillez sélectionner la valeur dans le menu déroulant. "]
[]
[]
[null,null,"Vert - la cellule n'est pas protégée et contient des formules. Veuillez changer la valeur indiquée uniquement si vos données sont différentes de celles calculées automatiquement.  "]
[]
[]
[null,null,"Bleu - la cellule est protégée et contient des formules. Aucune entrée de données requise. "]
[]
[null,"Données pays"]
[]
[null,"PAYS",null,null,"CAR"]
[]
[null,"Année de rapport des données",null,null,2018]
[]
[null,"Le pays est-il endémique à la filariose lymphatique (FL) ?",null,null,"Endémique"]
[]
[null,"Le pays est-il endémique à l'onchocercose (ONCHO) ? ",null,null,"Endémique"]
[]
[null,"Le pays est-il endémique aux géohelminthiases (STH) ?",null,null,"Endémique"]
[]
[null,"Le pays est-il endémique à la schistosomiase (SCH) ?",null,null,"Endémique"]
[]
[null,"Combien d'unités administratives compte le pays ?",null,null,17]
[null,"Si les données démographiques par groupe d'âge ne sont pas disponibles au second niveau administratif, veuillez entrer la proportion (%) de population, par groupe d'âge, du pays. Si les données sont disponibles, veuillez laisser les cellules vierges."]
[null,"1-4 ans","Enfants d'âge pré-scolaire (EAPréS)",null,0.1381]
[null,"5-14 ans","Enfants d'âge scolaire (EAS)",null,0.22700000000000001]
[null,"15 ans et plus","Adultes",null,0.59989999999999999]

{"sheet":"COUNTRY_INFO","index":1,"n_rows":25,"n_cols":29,"rows_kept":25,"cut":false,"hidden":false,"merged":[[3,0,3,2],[3,7,3,11],[3,20,3,21],[5,0,5,2],[3,16,3,19],[5,16,5,19],[5,3,5,6],[5,7,5,11],[5,12,5,15],[5,20,5,21]]}
["INFORMATIONS PAYS"]
["Structure administrative, population par groupe d'âge, statut d'endémicité, interventions planifiées et interventions mises en oeuvre"]
[]
["TOTAL",null,null,{"$f":"SUM(D$9:D$1000)","v":5480402},{"$f":"SUM(E$9:E$1000)","v":756844},{"$f":"SUM(F$9:F$1000)","v":1244050},{"$f":"SUM(G$9:G$1000)","v":3287693},null,null,null,null,null,{"$f":"SUM(M$9:M$1000)","v":2633954},{"$f":"SUM(N$9:N$1000)","v":2688483},{"$f":"SUM(O$9:O$1000)","v":961656},{"$f":"SUM(P$9:P$1000)","v":951991.94000000006}]
[]
["Structure administrative du pays",null,null,"Population",null,null,null,"Endémicité",null,null,null,null,"Population nécessitant la CP",null,null,null,"Nombre de tournées de traitement prévues pour l'année",null,null,null,"Mise en oeuvre de la chimioprévention"]
["Pays","Région/Département","District","Total","EAPréS","EAS","Adultes","FL","Oncho","STH","SCH","Loa","FL","Oncho","STH","SCH","FL","Oncho","STH","SCH","TOURNEE 1","TOURNEE 2","IU_ID","IU_Name",null,"mda1","mda4","mda3","t2"]
[]
[{"$f":"IF(INTRO!$E$34<>0,INTRO!$E$34,\"\")","v":"CAR"},"Région Sanitaire N°1","Ombella-Mpoko",495965,{"$f":"IF(INTRO!$E$48=\"\",\"\",ROUND($D9*INTRO!$E$48,0))","v":68493},{"$f":"IF(INTRO!$E$49=\"\",\"\",ROUND($D9*INTRO!$E$49,0))","v":112584},{"$f":"IF(INTRO!$E$50=\"\",\"\",ROUND($D9*INTRO!$E$50,0))","v":297529},1,0,2,3,1,{"$f":"IF(INTRO!$E$38=\"Endémique\", IF($H9>0, IF($H9=4,\"Inconnu\", IF($H9=99,\"Interrompu\", $D9)), 0),\"Non requis\")","v":495965},{"$f":"IF(INTRO!$E$40=\"Endémique\", IF($I9>0, IF($I9=4,\"Inconnu\",IF($I9=99,\"Interrompu\", $D9)), 0),\"Non requis\")","v":0},{"$f":"IF(INTRO!$E$42=\"Endémique\", IF(AND($J9>1,$J9<5), IF($J9=4, \"Inconnu\", E9+F9), 0),\"Non requis\")","v":181077},{"$f":"IF(INTRO!$E$44=\"Endémique\", IF(AND($K9>0,$K9<5), IF($K9=4,\"Inconnu\", IF($K9=1, $F9*0.33, IF($K9=2, $F9*0.5+$G9*0.2, SUM(F9:G9)))), 0),\"Non requis\")","v":410113},1,0,1,1,"MDA4 (ALB/2*ALB)","T2 (PZQ)",9654,"Ombella-Mpoko",null,{"$f":"'MDA1'!M9","v":0},{"$f":"'MDA4'!U9","v":265656},{"$f":"'MDA3'!Q9","v":0},{"$f":"'T2'!M9","v":63962}]
[{"$f":"IF(INTRO!$E$34<>0,INTRO!$E$34,\"\")","v":"CAR"},"Région Sanitaire N°1","Lobaye",343237,{"$f":"IF(INTRO!$E$48=\"\",\"\",ROUND($D10*INTRO!$E$48,0))","v":47401},{"$f":"IF(INTRO!$E$49=\"\",\"\",ROUND($D10*INTRO!$E$49,0))","v":77915},{"$f":"IF(INTRO!$E$50=\"\",\"\",ROUND($D10*INTRO!$E$50,0))","v":205908},1,0,2,1,1,{"$f":"IF(INTRO!$E$38=\"Endémique\", IF($H10>0, IF($H10=4,\"Inconnu\", IF($H10=99,\"Interrompu\", $D10)), 0),\"Non requis\")","v":343237},{"$f":"IF(INTRO!$E$40=\"Endémique\", IF($I10>0, IF($I10=4,\"Inconnu\",IF($I10=99,\"Interrompu\", $D10)), 0),\"Non requis\")","v":0},{"$f":"IF(INTRO!$E$42=\"Endémique\", IF(AND($J10>1,$J10<5), IF($J10=4, \"Inconnu\", E10+F10), 0),\"Non requis\")","v":125316},{"$f":"IF(INTRO!$E$44=\"Endémique\", IF(AND($K10>0,$K10<5), IF($K10=4,\"Inconnu\", IF($K10=1, $F10*0.33, IF($K10=2, $F10*0.5+$G10*0.2, SUM(F10:G10)))), 0),\"Non requis\")","v":25711.95},1,0,1,1,"MDA4 (ALB/2*ALB)","T2 (PZQ)",9649,"Lobaye",null,{"$f":"'MDA1'!M10","v":0},{"$f":"'MDA4'!U10","v":195964},{"$f":"'MDA3'!Q10","v":0},{"$f":"'T2'!M10","v":48898}]
[{"$f":"IF(INTRO!$E$34<>0,INTRO!$E$34,\"\")","v":"CAR"},"Région Sanitaire N°2","Mambéré-Kadéï",507184,{"$f":"IF(INTRO!$E$48=\"\",\"\",ROUND($D11*INTRO!$E$48,0))","v":70042},{"$f":"IF(INTRO!$E$49=\"\",\"\",ROUND($D11*INTRO!$E$49,0))","v":115131},{"$f":"IF(INTRO!$E$50=\"\",\"\",ROUND($D11*INTRO!$E$50,0))","v":304260},1,0,3,1,1,{"$f":"IF(INTRO!$E$38=\"Endémique\", IF($H11>0, IF($H11=4,\"Inconnu\", IF($H11=99,\"Interrompu\", $D11)), 0),\"Non requis\")","v":507184},{"$f":"IF(INTRO!$E$40=\"Endémique\", IF($I11>0, IF($I11=4,\"Inconnu\",IF($I11=99,\"Interrompu\", $D11)), 0),\"Non requis\")","v":0},{"$f":"IF(INTRO!$E$42=\"Endémique\", IF(AND($J11>1,$J11<5), IF($J11=4, \"Inconnu\", E11+F11), 0),\"Non requis\")","v":185173},{"$f":"IF(INTRO!$E$44=\"Endémique\", IF(AND($K11>0,$K11<5), IF($K11=4,\"Inconnu\", IF($K11=1, $F11*0.33, IF($K11=2, $F11*0.5+$G11*0.2, SUM(F11:G11)))), 0),\"Non requis\")","v":37993.230000000003},1,0,1,1,"MDA4 (ALB/2*ALB)","T2 (PZQ)",9650,"Mambéré-Kadéï",null,{"$f":"'MDA1'!M11","v":0},{"$f":"'MDA4'!U11","v":339746},{"$f":"'MDA3'!Q11","v":0},{"$f":"'T2'!M11","v":38280}]
[{"$f":"IF(INTRO!$E$34<>0,INTRO!$E$34,\"\")","v":"CAR"},"Région Sanitaire N°2","Sangha-Mbaéré",140526,{"$f":"IF(INTRO!$E$48=\"\",\"\",ROUND($D12*INTRO!$E$48,0))","v":19407},{"$f":"IF(INTRO!$E$49=\"\",\"\",ROUND($D12*INTRO!$E$49,0))","v":31899},{"$f":"IF(INTRO!$E$50=\"\",\"\",ROUND($D12*INTRO!$E$50,0))","v":84302},1,0,2,0,1,{"$f":"IF(INTRO!$E$38=\"Endémique\", IF($H12>0, IF($H12=4,\"Inconnu\", IF($H12=99,\"Interrompu\", $D12)), 0),\"Non requis\")","v":140526},{"$f":"IF(INTRO!$E$40=\"Endémique\", IF($I12>0, IF($I12=4,\"Inconnu\",IF($I12=99,\"Interrompu\", $D12)), 0),\"Non requis\")","v":0},{"$f":"IF(INTRO!$E$42=\"Endémique\", IF(AND($J12>1,$J12<5), IF($J12=4, \"Inconnu\", E12+F12), 0),\"Non requis\")","v":51306},{"$f":"IF(INTRO!$E$44=\"Endémique\", IF(AND($K12>0,$K12<5), IF($K12=4,\"Inconnu\", IF($K12=1, $F12*0.33, IF($K12=2, $F12*0.5+$G12*0.2, SUM(F12:G12)))), 0),\"Non requis\")","v":0},1,0,1,0,"MDA4 (ALB/2*ALB)",null,9658,"Sangha-Mbaéré",null,{"$f":"'MDA1'!M12","v":0},{"$f":"'MDA4'!U12","v":108646},{"$f":"'MDA3'!Q12","v":0},{"$f":"'T2'!M12","v":0}]
[{"$f":"IF(INTRO!$E$34<>0,INTRO!$E$34,\"\")","v":"CAR"},"Région Sanitaire N°2","Nana-Mambéré",324872,{"$f":"IF(INTRO!$E$48=\"\",\"\",ROUND($D13*INTRO!$E$48,0))","v":44865},{"$f":"IF(INTRO!$E$49=\"\",\"\",ROUND($D13*INTRO!$E$49,0))","v":73746},{"$f":"IF(INTRO!$E$50=\"\",\"\",ROUND($D13*INTRO!$E$50,0))","v":194891},4,0,4,4,1,{"$f":"IF(INTRO!$E$38=\"Endémique\", IF($H13>0, IF($H13=4,\"Inconnu\", IF($H13=99,\"Interrompu\", $D13)), 0),\"Non requis\")","v":"Inconnu"},{"$f":"IF(INTRO!$E$40=\"Endémique\", IF($I13>0, IF($I13=4,\"Inconnu\",IF($I13=99,\"Interrompu\", $D13)), 0),\"Non requis\")","v":0},{"$f":"IF(INTRO!$E$42=\"Endémique\", IF(AND($J13>1,$J13<5), IF($J13=4, \"Inconnu\", E13+F13), 0),\"Non requis\")","v":"Inconnu"},{"$f":"IF(INTRO!$E$44=\"Endémique\", IF(AND($K13>0,$K13<5), IF($K13=4,\"Inconnu\", IF($K13=1, $F13*0.33, IF($K13=2, $F13*0.5+$G13*0.2, SUM(F13:G13)))), 0),\"Non requis\")","v":"Inconnu"},0,0,0,0,null,null,9653,"Nana-Mambéré",null,{"$f":"'MDA1'!M13","v":0},{"$f":"'MDA4'!U13","v":0},{"$f":"'MDA3'!Q13","v":0},{"$f":"'T2'!M13","v":0}]
[{"$f":"IF(INTRO!$E$34<>0,INTRO!$E$34,\"\")","v":"CAR"},"Région Sanitaire N°3","Ouham",513337,{"$f":"IF(INTRO!$E$48=\"\",\"\",ROUND($D14*INTRO!$E$48,0))","v":70892},{"$f":"IF(INTRO!$E$49=\"\",\"\",ROUND($D14*INTRO!$E$49,0))","v":116527},{"$f":"IF(INTRO!$E$50=\"\",\"\",ROUND($D14*INTRO!$E$50,0))","v":307951},4,1,4,4,1,{"$f":"IF(INTRO!$E$38=\"Endémique\", IF($H14>0, IF($H14=4,\"Inconnu\", IF($H14=99,\"Interrompu\", $D14)), 0),\"Non requis\")","v":"Inconnu"},{"$f":"IF(INTRO!$E$40=\"Endémique\", IF($I14>0, IF($I14=4,\"Inconnu\",IF($I14=99,\"Interrompu\", $D14)), 0),\"Non requis\")","v":513337},{"$f":"IF(INTRO!$E$42=\"Endémique\", IF(AND($J14>1,$J14<5), IF($J14=4, \"Inconnu\", E14+F14), 0),\"Non requis\")","v":"Inconnu"},{"$f":"IF(INTRO!$E$44=\"Endémique\", IF(AND($K14>0,$K14<5), IF($K14=4,\"Inconnu\", IF($K14=1, $F14*0.33, IF($K14=2, $F14*0.5+$G14*0.2, SUM(F14:G14)))), 0),\"Non requis\")","v":"Inconnu"},0,1,0,0,"MDA3 (IVM)",null,9656,"Ouham",null,{"$f":"'MDA1'!M14","v":0},{"$f":"'MDA4'!U14","v":0},{"$f":"'MDA3'!Q14","v":376955},{"$f":"'T2'!M14","v":0}]
[{"$f":"IF(INTRO!$E$34<>0,INTRO!$E$34,\"\")","v":"CAR"},"Région Sanitaire N°3","Ouham-Pendé",598545,{"$f":"IF(INTRO!$E$48=\"\",\"\",ROUND($D15*INTRO!$E$48,0))","v":82659},{"$f":"IF(INTRO!$E$49=\"\",\"\",ROUND($D15*INTRO!$E$49,0))","v":135870},{"$f":"IF(INTRO!$E$50=\"\",\"\",ROUND($D15*INTRO!$E$50,0))","v":359067},4,1,4,4,0,{"$f":"IF(INTRO!$E$38=\"Endémique\", IF($H15>0, IF($H15=4,\"Inconnu\", IF($H15=99,\"Interrompu\", $D15)), 0),\"Non requis\")","v":"Inconnu"},{"$f":"IF(INTRO!$E$40=\"Endémique\", IF($I15>0, IF($I15=4,\"Inconnu\",IF($I15=99,\"Interrompu\", $D15)), 0),\"Non requis\")","v":598545},{"$f":"IF(INTRO!$E$42=\"Endémique\", IF(AND($J15>1,$J15<5), IF($J15=4, \"Inconnu\", E15+F15), 0),\"Non requis\")","v":"Inconnu"},{"$f":"IF(INTRO!$E$44=\"Endémique\", IF(AND($K15>0,$K15<5), IF($K15=4,\"Inconnu\", IF($K15=1, $F15*0.33, IF($K15=2, $F15*0.5+$G15*0.2, SUM(F15:G15)))), 0),\"Non requis\")","v":"Inconnu"},0,1,0,0,"MDA3 (IVM)",null,9657,"Ouham-Pendé",null,{"$f":"'MDA1'!M15","v":0},{"$f":"'MDA4'!U15","v":0},{"$f":"'MDA3'!Q15","v":368364},{"$f":"'T2'!M15","v":0}]
[{"$f":"IF(INTRO!$E$34<>0,INTRO!$E$34,\"\")","v":"CAR"},"Région Sanitaire N°4","Ouaka",392681,{"$f":"IF(INTRO!$E$48=\"\",\"\",ROUND($D16*INTRO!$E$48,0))","v":54229},{"$f":"IF(INTRO!$E$49=\"\",\"\",ROUND($D16*INTRO!$E$49,0))","v":89139},{"$f":"IF(INTRO!$E$50=\"\",\"\",ROUND($D16*INTRO!$E$50,0))","v":235569},1,1,2,1,0,{"$f":"IF(INTRO!$E$38=\"Endémique\", IF($H16>0, IF($H16=4,\"Inconnu\", IF($H16=99,\"Interrompu\", $D16)), 0),\"Non requis\")","v":392681},{"$f":"IF(INTRO!$E$40=\"Endémique\", IF($I16>0, IF($I16=4,\"Inconnu\",IF($I16=99,\"Interrompu\", $D16)), 0),\"Non requis\")","v":392681},{"$f":"IF(INTRO!$E$42=\"Endémique\", IF(AND($J16>1,$J16<5), IF($J16=4, \"Inconnu\", E16+F16), 0),\"Non requis\")","v":143368},{"$f":"IF(INTRO!$E$44=\"Endémique\", IF(AND($K16>0,$K16<5), IF($K16=4,\"Inconnu\", IF($K16=1, $F16*0.33, IF($K16=2, $F16*0.5+$G16*0.2, SUM(F16:G16)))), 0),\"Non requis\")","v":29415.870000000003},1,1,1,1,null,null,9655,"Ouaka",null,{"$f":"'MDA1'!M16","v":0},{"$f":"'MDA4'!U16","v":0},{"$f":"'MDA3'!Q16","v":0},{"$f":"'T2'!M16","v":0}]
[{"$f":"IF(INTRO!$E$34<>0,INTRO!$E$34,\"\")","v":"CAR"},"Région Sanitaire N°4","Kémo",168045,{"$f":"IF(INTRO!$E$48=\"\",\"\",ROUND($D17*INTRO!$E$48,0))","v":23207},{"$f":"IF(INTRO!$E$49=\"\",\"\",ROUND($D17*INTRO!$E$49,0))","v":38146},{"$f":"IF(INTRO!$E$50=\"\",\"\",ROUND($D17*INTRO!$E$50,0))","v":100810},1,1,2,3,0,{"$f":"IF(INTRO!$E$38=\"Endémique\", IF($H17>0, IF($H17=4,\"Inconnu\", IF($H17=99,\"Interrompu\", $D17)), 0),\"Non requis\")","v":168045},{"$f":"IF(INTRO!$E$40=\"Endémique\", IF($I17>0, IF($I17=4,\"Inconnu\",IF($I17=99,\"Interrompu\", $D17)), 0),\"Non requis\")","v":168045},{"$f":"IF(INTRO!$E$42=\"Endémique\", IF(AND($J17>1,$J17<5), IF($J17=4, \"Inconnu\", E17+F17), 0),\"Non requis\")","v":61353},{"$f":"IF(INTRO!$E$44=\"Endémique\", IF(AND($K17>0,$K17<5), IF($K17=4,\"Inconnu\", IF($K17=1, $F17*0.33, IF($K17=2, $F17*0.5+$G17*0.2, SUM(F17:G17)))), 0),\"Non requis\")","v":138956},1,1,1,1,"MDA1 (IVM+ALB)",null,9648,"Kémo",null,{"$f":"'MDA1'!M17","v":101806},{"$f":"'MDA4'!U17","v":0},{"$f":"'MDA3'!Q17","v":0},{"$f":"'T2'!M17","v":0}]
[{"$f":"IF(INTRO!$E$34<>0,INTRO!$E$34,\"\")","v":"CAR"},"Région Sanitaire N°4","Nana-Gribizi",163803,{"$f":"IF(INTRO!$E$48=\"\",\"\",ROUND($D18*INTRO!$E$48,0))","v":22621},{"$f":"IF(INTRO!$E$49=\"\",\"\",ROUND($D18*INTRO!$E$49,0))","v":37183},{"$f":"IF(INTRO!$E$50=\"\",\"\",ROUND($D18*INTRO!$E$50,0))","v":98265},4,1,4,4,1,{"$f":"IF(INTRO!$E$38=\"Endémique\", IF($H18>0, IF($H18=4,\"Inconnu\", IF($H18=99,\"Interrompu\", $D18)), 0),\"Non requis\")","v":"Inconnu"},{"$f":"IF(INTRO!$E$40=\"Endémique\", IF($I18>0, IF($I18=4,\"Inconnu\",IF($I18=99,\"Interrompu\", $D18)), 0),\"Non requis\")","v":163803},{"$f":"IF(INTRO!$E$42=\"Endémique\", IF(AND($J18>1,$J18<5), IF($J18=4, \"Inconnu\", E18+F18), 0),\"Non requis\")","v":"Inconnu"},{"$f":"IF(INTRO!$E$44=\"Endémique\", IF(AND($K18>0,$K18<5), IF($K18=4,\"Inconnu\", IF($K18=1, $F18*0.33, IF($K18=2, $F18*0.5+$G18*0.2, SUM(F18:G18)))), 0),\"Non requis\")","v":"Inconnu"},0,1,0,0,"MDA3 (IVM)",null,9652,"Nana-Gribizi",null,{"$f":"'MDA1'!M18","v":0},{"$f":"'MDA4'!U18","v":0},{"$f":"'MDA3'!Q18","v":74355},{"$f":"'T2'!M18","v":0}]
[{"$f":"IF(INTRO!$E$34<>0,INTRO!$E$34,\"\")","v":"CAR"},"Région Sanitaire N°5","Haute-Kotto",125568,{"$f":"IF(INTRO!$E$48=\"\",\"\",ROUND($D19*INTRO!$E$48,0))","v":17341},{"$f":"IF(INTRO!$E$49=\"\",\"\",ROUND($D19*INTRO!$E$49,0))","v":28504},{"$f":"IF(INTRO!$E$50=\"\",\"\",ROUND($D19*INTRO!$E$50,0))","v":75328},4,1,4,4,0,{"$f":"IF(INTRO!$E$38=\"Endémique\", IF($H19>0, IF($H19=4,\"Inconnu\", IF($H19=99,\"Interrompu\", $D19)), 0),\"Non requis\")","v":"Inconnu"},{"$f":"IF(INTRO!$E$40=\"Endémique\", IF($I19>0, IF($I19=4,\"Inconnu\",IF($I19=99,\"Interrompu\", $D19)), 0),\"Non requis\")","v":125568},{"$f":"IF(INTRO!$E$42=\"Endémique\", IF(AND($J19>1,$J19<5), IF($J19=4, \"Inconnu\", E19+F19), 0),\"Non requis\")","v":"Inconnu"},{"$f":"IF(INTRO!$E$44=\"Endémique\", IF(AND($K19>0,$K19<5), IF($K19=4,\"Inconnu\", IF($K19=1, $F19*0.33, IF($K19=2, $F19*0.5+$G19*0.2, SUM(F19:G19)))), 0),\"Non requis\")","v":"Inconnu"},0,1,0,0,null,null,9647,"Haute-Kotto",null,{"$f":"'MDA1'!M19","v":0},{"$f":"'MDA4'!U19","v":0},{"$f":"'MDA3'!Q19","v":0},{"$f":"'T2'!M19","v":0}]
[{"$f":"IF(INTRO!$E$34<>0,INTRO!$E$34,\"\")","v":"CAR"},"Région Sanitaire N°5","Bamingui-Bangoran",60103,{"$f":"IF(INTRO!$E$48=\"\",\"\",ROUND($D20*INTRO!$E$48,0))","v":8300},{"$f":"IF(INTRO!$E$49=\"\",\"\",ROUND($D20*INTRO!$E$49,0))","v":13643},{"$f":"IF(INTRO!$E$50=\"\",\"\",ROUND($D20*INTRO!$E$50,0))","v":36056},4,1,4,4,0,{"$f":"IF(INTRO!$E$38=\"Endémique\", IF($H20>0, IF($H20=4,\"Inconnu\", IF($H20=99,\"Interrompu\", $D20)), 0),\"Non requis\")","v":"Inconnu"},{"$f":"IF(INTRO!$E$40=\"Endémique\", IF($I20>0, IF($I20=4,\"Inconnu\",IF($I20=99,\"Interrompu\", $D20)), 0),\"Non requis\")","v":60103},{"$f":"IF(INTRO!$E$42=\"Endémique\", IF(AND($J20>1,$J20<5), IF($J20=4, \"Inconnu\", E20+F20), 0),\"Non requis\")","v":"Inconnu"},{"$f":"IF(INTRO!$E$44=\"Endémique\", IF(AND($K20>0,$K20<5), IF($K20=4,\"Inconnu\", IF($K20=1, $F20*0.33, IF($K20=2, $F20*0.5+$G20*0.2, SUM(F20:G20)))), 0),\"Non requis\")","v":"Inconnu"},0,1,0,0,null,null,9636,"Bamingui-Bangoran",null,{"$f":"'MDA1'!M20","v":0},{"$f":"'MDA4'!U20","v":0},{"$f":"'MDA3'!Q20","v":0},{"$f":"'T2'!M20","v":0}]
[{"$f":"IF(INTRO!$E$34<>0,INTRO!$E$34,\"\")","v":"CAR"},"Région Sanitaire N°5","Vakaga",72651,{"$f":"IF(INTRO!$E$48=\"\",\"\",ROUND($D21*INTRO!$E$48,0))","v":10033},{"$f":"IF(INTRO!$E$49=\"\",\"\",ROUND($D21*INTRO!$E$49,0))","v":16492},{"$f":"IF(INTRO!$E$50=\"\",\"\",ROUND($D21*INTRO!$E$50,0))","v":43583},4,0,4,4,4,{"$f":"IF(INTRO!$E$38=\"Endémique\", IF($H21>0, IF($H21=4,\"Inconnu\", IF($H21=99,\"Interrompu\", $D21)), 0),\"Non requis\")","v":"Inconnu"},{"$f":"IF(INTRO!$E$40=\"Endémique\", IF($I21>0, IF($I21=4,\"Inconnu\",IF($I21=99,\"Interrompu\", $D21)), 0),\"Non requis\")","v":0},{"$f":"IF(INTRO!$E$42=\"Endémique\", IF(AND($J21>1,$J21<5), IF($J21=4, \"Inconnu\", E21+F21), 0),\"Non requis\")","v":"Inconnu"},{"$f":"IF(INTRO!$E$44=\"Endémique\", IF(AND($K21>0,$K21<5), IF($K21=4,\"Inconnu\", IF($K21=1, $F21*0.33, IF($K21=2, $F21*0.5+$G21*0.2, SUM(F21:G21)))), 0),\"Non requis\")","v":"Inconnu"},0,0,0,0,null,null,9659,"Vakaga",null,{"$f":"'MDA1'!M21","v":0},{"$f":"'MDA4'!U21","v":0},{"$f":"'MDA3'!Q21","v":0},{"$f":"'T2'!M21","v":0}]
[{"$f":"IF(INTRO!$E$34<>0,INTRO!$E$34,\"\")","v":"CAR"},"Région Sanitaire N°6","Mbomou",232746,{"$f":"IF(INTRO!$E$48=\"\",\"\",ROUND($D22*INTRO!$E$48,0))","v":32142},{"$f":"IF(INTRO!$E$49=\"\",\"\",ROUND($D22*INTRO!$E$49,0))","v":52833},{"$f":"IF(INTRO!$E$50=\"\",\"\",ROUND($D22*INTRO!$E$50,0))","v":139624},1,1,2,1,0,{"$f":"IF(INTRO!$E$38=\"Endémique\", IF($H22>0, IF($H22=4,\"Inconnu\", IF($H22=99,\"Interrompu\", $D22)), 0),\"Non requis\")","v":232746},{"$f":"IF(INTRO!$E$40=\"Endémique\", IF($I22>0, IF($I22=4,\"Inconnu\",IF($I22=99,\"Interrompu\", $D22)), 0),\"Non requis\")","v":232746},{"$f":"IF(INTRO!$E$42=\"Endémique\", IF(AND($J22>1,$J22<5), IF($J22=4, \"Inconnu\", E22+F22), 0),\"Non requis\")","v":84975},{"$f":"IF(INTRO!$E$44=\"Endémique\", IF(AND($K22>0,$K22<5), IF($K22=4,\"Inconnu\", IF($K22=1, $F22*0.33, IF($K22=2, $F22*0.5+$G22*0.2, SUM(F22:G22)))), 0),\"Non requis\")","v":17434.89},1,1,1,1,null,null,9651,"Mbomou",null,{"$f":"'MDA1'!M22","v":0},{"$f":"'MDA4'!U22","v":0},{"$f":"'MDA3'!Q22","v":0},{"$f":"'T2'!M22","v":0}]
[{"$f":"IF(INTRO!$E$34<>0,INTRO!$E$34,\"\")","v":"CAR"},"Région Sanitaire N°6","Basse-Kotto",353570,{"$f":"IF(INTRO!$E$48=\"\",\"\",ROUND($D23*INTRO!$E$48,0))","v":48828},{"$f":"IF(INTRO!$E$49=\"\",\"\",ROUND($D23*INTRO!$E$49,0))","v":80260},{"$f":"IF(INTRO!$E$50=\"\",\"\",ROUND($D23*INTRO!$E$50,0))","v":212107},1,1,3,3,0,{"$f":"IF(INTRO!$E$38=\"Endémique\", IF($H23>0, IF($H23=4,\"Inconnu\", IF($H23=99,\"Interrompu\", $D23)), 0),\"Non requis\")","v":353570},{"$f":"IF(INTRO!$E$40=\"Endémique\", IF($I23>0, IF($I23=4,\"Inconnu\",IF($I23=99,\"Interrompu\", $D23)), 0),\"Non requis\")","v":353570},{"$f":"IF(INTRO!$E$42=\"Endémique\", IF(AND($J23>1,$J23<5), IF($J23=4, \"Inconnu\", E23+F23), 0),\"Non requis\")","v":129088},{"$f":"IF(INTRO!$E$44=\"Endémique\", IF(AND($K23>0,$K23<5), IF($K23=4,\"Inconnu\", IF($K23=1, $F23*0.33, IF($K23=2, $F23*0.5+$G23*0.2, SUM(F23:G23)))), 0),\"Non requis\")","v":292367},1,1,1,1,null,null,9645,"Basse-Kotto",null,{"$f":"'MDA1'!M23","v":0},{"$f":"'MDA4'!U23","v":0},{"$f":"'MDA3'!Q23","v":0},{"$f":"'T2'!M23","v":0}]
[{"$f":"IF(INTRO!$E$34<>0,INTRO!$E$34,\"\")","v":"CAR"},"Région Sanitaire N°6","Haut-Mbomou",80085,{"$f":"IF(INTRO!$E$48=\"\",\"\",ROUND($D24*INTRO!$E$48,0))","v":11060},{"$f":"IF(INTRO!$E$49=\"\",\"\",ROUND($D24*INTRO!$E$49,0))","v":18179},{"$f":"IF(INTRO!$E$50=\"\",\"\",ROUND($D24*INTRO!$E$50,0))","v":48043},4,1,4,4,1,{"$f":"IF(INTRO!$E$38=\"Endémique\", IF($H24>0, IF($H24=4,\"Inconnu\", IF($H24=99,\"Interrompu\", $D24)), 0),\"Non requis\")","v":"Inconnu"},{"$f":"IF(INTRO!$E$40=\"Endémique\", IF($I24>0, IF($I24=4,\"Inconnu\",IF($I24=99,\"Interrompu\", $D24)), 0),\"Non requis\")","v":80085},{"$f":"IF(INTRO!$E$42=\"Endémique\", IF(AND($J24>1,$J24<5), IF($J24=4, \"Inconnu\", E24+F24), 0),\"Non requis\")","v":"Inconnu"},{"$f":"IF(INTRO!$E$44=\"Endémique\", IF(AND($K24>0,$K24<5), IF($K24=4,\"Inconnu\", IF($K24=1, $F24*0.33, IF($K24=2, $F24*0.5+$G24*0.2, SUM(F24:G24)))), 0),\"Non requis\")","v":"Inconnu"},0,1,0,0,null,null,9646,"Haut-Mbomou",null,{"$f":"'MDA1'!M24","v":0},{"$f":"'MDA4'!U24","v":0},{"$f":"'MDA3'!Q24","v":0},{"$f":"'T2'!M24","v":0}]
[{"$f":"IF(INTRO!$E$34<>0,INTRO!$E$34,\"\")","v":"CAR"},"Région Sanitaire N°7","BANGUI (8 Unités adm.)",907484,{"$f":"IF(INTRO!$E$48=\"\",\"\",ROUND($D25*INTRO!$E$48,0))","v":125324},{"$f":"IF(INTRO!$E$49=\"\",\"\",ROUND($D25*INTRO!$E$49,0))","v":205999},{"$f":"IF(INTRO!$E$50=\"\",\"\",ROUND($D25*INTRO!$E$50,0))","v":544400},4,4,4,4,4,{"$f":"IF(INTRO!$E$38=\"Endémique\", IF($H25>0, IF($H25=4,\"Inconnu\", IF($H25=99,\"Interrompu\", $D25)), 0),\"Non requis\")","v":"Inconnu"},{"$f":"IF(INTRO!$E$40=\"Endémique\", IF($I25>0, IF($I25=4,\"Inconnu\",IF($I25=99,\"Interrompu\", $D25)), 0),\"Non requis\")","v":"Inconnu"},{"$f":"IF(INTRO!$E$42=\"Endémique\", IF(AND($J25>1,$J25<5), IF($J25=4, \"Inconnu\", E25+F25), 0),\"Non requis\")","v":"Inconnu"},{"$f":"IF(INTRO!$E$44=\"Endémique\", IF(AND($K25>0,$K25<5), IF($K25=4,\"Inconnu\", IF($K25=1, $F25*0.33, IF($K25=2, $F25*0.5+$G25*0.2, SUM(F25:G25)))), 0),\"Non requis\")","v":"Inconnu"},0,0,0,0,null,null,9660,"BANGUI (8 Unités adm.)",null,{"$f":"'MDA1'!M25","v":0},{"$f":"'MDA4'!U25","v":0},{"$f":"'MDA3'!Q25","v":0},{"$f":"'T2'!M25","v":0}]

{"sheet":"MDA1","index":2,"n_rows":25,"n_cols":17,"rows_kept":25,"cut":false,"hidden":false,"merged":[[5,13,5,16],[3,0,3,2],[5,0,5,2],[5,5,5,8],[5,9,5,12],[5,3,6,3],[5,4,6,4]]}
["MDA 1 - Ivermectine (IVM) et Albendazole (ALB)"]
["Structure administrative, population nécessitant une chimioprévention par groupe d'âge, population traitée par groupe d'âge et couverture"]
[]
["TOTAL",null,null,null,null,null,{"$f":"SUM(G$9:G$1000)","v":38146},{"$f":"SUM(H$9:H$1000)","v":82596},{"$f":"SUM(I$9:I$1000)","v":120742},null,{"$f":"SUM(K$9:K$1000)","v":37829},{"$f":"SUM(L$9:L$1000)","v":63977},{"$f":"SUM(M$9:M$1000)","v":101806},null,{"$f":"IF(G4<>0, IF(K4/G4*100=0, \"-\", K4/G4*100), \" \")","v":99.168982331043892},{"$f":"IF(H4<>0, IF(L4/H4*100=0, \"-\", L4/H4*100), \" \")","v":77.457746137827499},{"$f":"IF(I4<>0, IF(M4/I4*100=0, \"-\", M4/I4*100), \" \")","v":84.316973381259217}]
[]
["Structure administrative du pays",null,null,"Mise en oeuvre \nde la CP","Date","Population ciblée pour MDA 1",null,null,null,"Population traitée",null,null,null,"Couverture du Programme (%)"]
["Pays","Région/Département","District",null,null,"EAPréS","EAS","Adultes","Total","EAPréS","EAS","Adultes","Total","EAPréS","EAS","Adultes","Total"]
[]
[{"$f":"IF(COUNTRY_INFO!A9=0,\" \",COUNTRY_INFO!A9)","v":"CAR"},{"$f":"IF(COUNTRY_INFO!B9=0,\" \",COUNTRY_INFO!B9)","v":"Région Sanitaire N°1"},{"$f":"IF(COUNTRY_INFO!C9=0,\" \",COUNTRY_INFO!C9)","v":"Ombella-Mpoko"},{"$f":"IF(COUNTRY_INFO!$U$9:$U$1000=\"MDA1 (IVM+ALB)\", COUNTRY_INFO!$U$9:$U$1000, \" \")","v":" "},null,null,null,null,{"$f":"SUM(F9:H9)","v":0},null,null,null,{"$f":"SUM(J9:L9)","v":0},null,{"$f":"IF(G9<>0, IF(K9/G9*100=0, \"-\", K9/G9*100), \" \")","v":" "},{"$f":"IF(H9<>0, IF(L9/H9*100=0, \"-\", L9/H9*100), \" \")","v":" "}," "]
[{"$f":"IF(COUNTRY_INFO!A10=0,\" \",COUNTRY_INFO!A10)","v":"CAR"},{"$f":"IF(COUNTRY_INFO!B10=0,\" \",COUNTRY_INFO!B10)","v":"Région Sanitaire N°1"},{"$f":"IF(COUNTRY_INFO!C10=0,\" \",COUNTRY_INFO!C10)","v":"Lobaye"},{"$f":"IF(COUNTRY_INFO!$U$9:$U$1000=\"MDA1 (IVM+ALB)\", COUNTRY_INFO!$U$9:$U$1000, \" \")","v":" "},null,null,null,null,{"$f":"SUM(F10:H10)","v":0},null,null,null,{"$f":"SUM(J10:L10)","v":0},null,{"$f":"IF(G10<>0, IF(K10/G10*100=0, \"-\", K10/G10*100), \" \")","v":" "},{"$f":"IF(H10<>0, IF(L10/H10*100=0, \"-\", L10/H10*100), \" \")","v":" "},{"$f":"IF(I10<>0, IF(M10/I10*100=0, \"-\", M10/I10*100), \" \")","v":" "}]
[{"$f":"IF(COUNTRY_INFO!A11=0,\" \",COUNTRY_INFO!A11)","v":"CAR"},{"$f":"IF(COUNTRY_INFO!B11=0,\" \",COUNTRY_INFO!B11)","v":"Région Sanitaire N°2"},{"$f":"IF(COUNTRY_INFO!C11=0,\" \",COUNTRY_INFO!C11)","v":"Mambéré-Kadéï"},{"$f":"IF(COUNTRY_INFO!$U$9:$U$1000=\"MDA1 (IVM+ALB)\", COUNTRY_INFO!$U$9:$U$1000, \" \")","v":" "},null,null,null,null,0,null,null,null,0,null," "," "," "]
[{"$f":"IF(COUNTRY_INFO!A12=0,\" \",COUNTRY_INFO!A12)","v":"CAR"},{"$f":"IF(COUNTRY_INFO!B12=0,\" \",COUNTRY_INFO!B12)","v":"Région Sanitaire N°2"},{"$f":"IF(COUNTRY_INFO!C12=0,\" \",COUNTRY_INFO!C12)","v":"Sangha-Mbaéré"},{"$f":"IF(COUNTRY_INFO!$U$9:$U$1000=\"MDA1 (IVM+ALB)\", COUNTRY_INFO!$U$9:$U$1000, \" \")","v":" "},null,null,null,null,0,null,null,null,0,null," "," "," "]
[{"$f":"IF(COUNTRY_INFO!A13=0,\" \",COUNTRY_INFO!A13)","v":"CAR"},{"$f":"IF(COUNTRY_INFO!B13=0,\" \",COUNTRY_INFO!B13)","v":"Région Sanitaire N°2"},{"$f":"IF(COUNTRY_INFO!C13=0,\" \",COUNTRY_INFO!C13)","v":"Nana-Mambéré"},{"$f":"IF(COUNTRY_INFO!$U$9:$U$1000=\"MDA1 (IVM+ALB)\", COUNTRY_INFO!$U$9:$U$1000, \" \")","v":" "},null,null,null,null,0,null,null,null,0,null," "," "," "]
[{"$f":"IF(COUNTRY_INFO!A14=0,\" \",COUNTRY_INFO!A14)","v":"CAR"},{"$f":"IF(COUNTRY_INFO!B14=0,\" \",COUNTRY_INFO!B14)","v":"Région Sanitaire N°3"},{"$f":"IF(COUNTRY_INFO!C14=0,\" \",COUNTRY_INFO!C14)","v":"Ouham"},{"$f":"IF(COUNTRY_INFO!$U$9:$U$1000=\"MDA1 (IVM+ALB)\", COUNTRY_INFO!$U$9:$U$1000, \" \")","v":" "},null,null,null,null,0,null,null,null,0,null," "," "," "]
[{"$f":"IF(COUNTRY_INFO!A15=0,\" \",COUNTRY_INFO!A15)","v":"CAR"},{"$f":"IF(COUNTRY_INFO!B15=0,\" \",COUNTRY_INFO!B15)","v":"Région Sanitaire N°3"},{"$f":"IF(COUNTRY_INFO!C15=0,\" \",COUNTRY_INFO!C15)","v":"Ouham-Pendé"},{"$f":"IF(COUNTRY_INFO!$U$9:$U$1000=\"MDA1 (IVM+ALB)\", COUNTRY_INFO!$U$9:$U$1000, \" \")","v":" "},null,null,null,null,0,null,null,null,0,null," "," "," "]
[{"$f":"IF(COUNTRY_INFO!A16=0,\" \",COUNTRY_INFO!A16)","v":"CAR"},{"$f":"IF(COUNTRY_INFO!B16=0,\" \",COUNTRY_INFO!B16)","v":"Région Sanitaire N°4"},{"$f":"IF(COUNTRY_INFO!C16=0,\" \",COUNTRY_INFO!C16)","v":"Ouaka"},{"$f":"IF(COUNTRY_INFO!$U$9:$U$1000=\"MDA1 (IVM+ALB)\", COUNTRY_INFO!$U$9:$U$1000, \" \")","v":" "},null,null,null,null,0,null,null,null,0,null," "," "," "]
[{"$f":"IF(COUNTRY_INFO!A17=0,\" \",COUNTRY_INFO!A17)","v":"CAR"},{"$f":"IF(COUNTRY_INFO!B17=0,\" \",COUNTRY_INFO!B17)","v":"Région Sanitaire N°4"},{"$f":"IF(COUNTRY_INFO!C17=0,\" \",COUNTRY_INFO!C17)","v":"Kémo"},{"$f":"IF(COUNTRY_INFO!$U$9:$U$1000=\"MDA1 (IVM+ALB)\", COUNTRY_INFO!$U$9:$U$1000, \" \")","v":"MDA1 (IVM+ALB)"},"novembre 2018",null,{"$f":"COUNTRY_INFO!F17","v":38146},82596,120742,null,37829,63977,101806,null,99.168982331043892,77.457746137827499,84.316973381259217]
[{"$f":"IF(COUNTRY_INFO!A18=0,\" \",COUNTRY_INFO!A18)","v":"CAR"},{"$f":"IF(COUNTRY_INFO!B18=0,\" \",COUNTRY_INFO!B18)","v":"Région Sanitaire N°4"},{"$f":"IF(COUNTRY_INFO!C18=0,\" \",COUNTRY_INFO!C18)","v":"Nana-Gribizi"},{"$f":"IF(COUNTRY_INFO!$U$9:$U$1000=\"MDA1 (IVM+ALB)\", COUNTRY_INFO!$U$9:$U$1000, \" \")","v":" "},null,null,null,null,0,null,null,null,0,null," "," "," "]
[{"$f":"IF(COUNTRY_INFO!A19=0,\" \",COUNTRY_INFO!A19)","v":"CAR"},{"$f":"IF(COUNTRY_INFO!B19=0,\" \",COUNTRY_INFO!B19)","v":"Région Sanitaire N°5"},{"$f":"IF(COUNTRY_INFO!C19=0,\" \",COUNTRY_INFO!C19)","v":"Haute-Kotto"},{"$f":"IF(COUNTRY_INFO!$U$9:$U$1000=\"MDA1 (IVM+ALB)\", COUNTRY_INFO!$U$9:$U$1000, \" \")","v":" "},null,null,null,null,0,null,null,null,0,null," "," "," "]
[{"$f":"IF(COUNTRY_INFO!A20=0,\" \",COUNTRY_INFO!A20)","v":"CAR"},{"$f":"IF(COUNTRY_INFO!B20=0,\" \",COUNTRY_INFO!B20)","v":"Région Sanitaire N°5"},{"$f":"IF(COUNTRY_INFO!C20=0,\" \",COUNTRY_INFO!C20)","v":"Bamingui-Bangoran"},{"$f":"IF(COUNTRY_INFO!$U$9:$U$1000=\"MDA1 (IVM+ALB)\", COUNTRY_INFO!$U$9:$U$1000, \" \")","v":" "},null,null,null,null,0,null,null,null,0,null," "," "," "]
[{"$f":"IF(COUNTRY_INFO!A21=0,\" \",COUNTRY_INFO!A21)","v":"CAR"},{"$f":"IF(COUNTRY_INFO!B21=0,\" \",COUNTRY_INFO!B21)","v":"Région Sanitaire N°5"},{"$f":"IF(COUNTRY_INFO!C21=0,\" \",COUNTRY_INFO!C21)","v":"Vakaga"},{"$f":"IF(COUNTRY_INFO!$U$9:$U$1000=\"MDA1 (IVM+ALB)\", COUNTRY_INFO!$U$9:$U$1000, \" \")","v":" "},null,null,null,null,0,null,null,null,0,null," "," "," "]
[{"$f":"IF(COUNTRY_INFO!A22=0,\" \",COUNTRY_INFO!A22)","v":"CAR"},{"$f":"IF(COUNTRY_INFO!B22=0,\" \",COUNTRY_INFO!B22)","v":"Région Sanitaire N°6"},{"$f":"IF(COUNTRY_INFO!C22=0,\" \",COUNTRY_INFO!C22)","v":"Mbomou"},{"$f":"IF(COUNTRY_INFO!$U$9:$U$1000=\"MDA1 (IVM+ALB)\", COUNTRY_INFO!$U$9:$U$1000, \" \")","v":" "},null,null,null,null,0,null,null,null,0,null," "," "," "]
[{"$f":"IF(COUNTRY_INFO!A23=0,\" \",COUNTRY_INFO!A23)","v":"CAR"},{"$f":"IF(COUNTRY_INFO!B23=0,\" \",COUNTRY_INFO!B23)","v":"Région Sanitaire N°6"},{"$f":"IF(COUNTRY_INFO!C23=0,\" \",COUNTRY_INFO!C23)","v":"Basse-Kotto"},{"$f":"IF(COUNTRY_INFO!$U$9:$U$1000=\"MDA1 (IVM+ALB)\", COUNTRY_INFO!$U$9:$U$1000, \" \")","v":" "},null,null,null,null,0,null,null,null,0,null," "," "," "]
[{"$f":"IF(COUNTRY_INFO!A24=0,\" \",COUNTRY_INFO!A24)","v":"CAR"},{"$f":"IF(COUNTRY_INFO!B24=0,\" \",COUNTRY_INFO!B24)","v":"Région Sanitaire N°6"},{"$f":"IF(COUNTRY_INFO!C24=0,\" \",COUNTRY_INFO!C24)","v":"Haut-Mbomou"},{"$f":"IF(COUNTRY_INFO!$U$9:$U$1000=\"MDA1 (IVM+ALB)\", COUNTRY_INFO!$U$9:$U$1000, \" \")","v":" "},null,null,null,null,0,null,null,null,0,null," "," "," "]
[{"$f":"IF(COUNTRY_INFO!A25=0,\" \",COUNTRY_INFO!A25)","v":"CAR"},{"$f":"IF(COUNTRY_INFO!B25=0,\" \",COUNTRY_INFO!B25)","v":"Région Sanitaire N°7"},{"$f":"IF(COUNTRY_INFO!C25=0,\" \",COUNTRY_INFO!C25)","v":"BANGUI (8 Unités adm.)"},{"$f":"IF(COUNTRY_INFO!$U$9:$U$1000=\"MDA1 (IVM+ALB)\", COUNTRY_INFO!$U$9:$U$1000, \" \")","v":" "},null,null,null,null,0,null,null,null,0,null," "," "," "]

{"sheet":"MDA4","index":3,"n_rows":25,"n_cols":25,"rows_kept":25,"cut":false,"hidden":false,"merged":[[5,5,5,8],[5,13,5,16],[5,21,5,24],[3,0,3,2],[5,0,5,2],[5,3,6,3],[5,4,6,4],[5,9,5,12],[5,17,5,20]]}
["MDA 4 - Albendazole (ALB) ou 2 x Albendazole (ALB)"]
["Structure administrative, population nécessitant une chimioprévention par groupe d'âge, population traitée par groupe d'âge et couverture"]
[]
["TOTAL",null,null,null,null,{"$f":"SUM(F$9:F$1000)","v":0},{"$f":"SUM(G$9:G$1000)","v":298979},726978,1025957,0,301877,608135,910012,0,0,0,0,0,301877,608135,910012,{"$f":"IF(F4<>0, IF(N4/F4*100=0, \"-\", N4/F4*100), \" \")","v":" "},{"$f":"IF(G4<>0, IF(O4/G4*100=0, \"-\", O4/G4*100), \" \")","v":"-"},{"$f":"IF(H4<>0, IF(P4/H4*100=0, \"-\", P4/H4*100), \" \")","v":"-"},{"$f":"IF(I4<>0, IF(U4/I4*100=0, \"-\", U4/I4*100), \" \")","v":88.698844103602781}]
[]
["Structure administrative du pays",null,null,"Mise en oeuvre \nde la CP","Date","Population ciblée pour MDA 4",null,null,null,"Population traitée - tournée 1",null,null,null,"Population traitée - tournée 2",null,null,null,"Population traitée",null,null,null,"Couverture du Programme (%)"]
["Pays","Région/Département","District",null,null,"EAPréS","EAS","Adultes","Total","EAPréS","EAS","Adultes","Total","EAPréS","EAS","Adultes","Total","EAPréS","EAS","Adultes","Total","EAPréS","EAS","Adultes","Total"]
[]
[{"$f":"IF(COUNTRY_INFO!A9=0,\" \",COUNTRY_INFO!A9)","v":"CAR"},{"$f":"IF(COUNTRY_INFO!B9=0,\" \",COUNTRY_INFO!B9)","v":"Région Sanitaire N°1"},{"$f":"IF(COUNTRY_INFO!C9=0,\" \",COUNTRY_INFO!C9)","v":"Ombella-Mpoko"},{"$f":"IF(COUNTRY_INFO!$U$9:$U$1000=\"MDA4 (ALB/2*ALB)\", COUNTRY_INFO!$U$9:$U$1000, \" \")","v":"MDA4 (ALB/2*ALB)"},"avril 2018",null,112584,177948,{"$f":"SUM(F9:H9)","v":290532},null,120855,144801,{"$f":"SUM(J9:L9)","v":265656},null,null,null,{"$f":"SUM(N9:P9)","v":0},{"$f":"MAX(J9,N9)","v":0},{"$f":"MAX(K9,O9)","v":120855},{"$f":"MAX(L9,P9)","v":144801},{"$f":"SUM(R9:T9)","v":265656},{"$f":"IF(F9<>0, IF(R9/F9*100=0, \"-\",R9/F9*100), \" \")","v":" "},{"$f":"IF(G9<>0, IF(S9/G9*100=0, \"-\", S9/G9*100), \" \")","v":107.34651460243019},{"$f":"IF(H9<>0, IF(T9/H9*100=0, \"-\", T9/H9*100), \" \")","v":81.372648189358685},{"$f":"IF(I9<>0, IF(U9/I9*100=0, \"-\", U9/I9*100), \" \")","v":91.437776217421828}]
[{"$f":"IF(COUNTRY_INFO!A10=0,\" \",COUNTRY_INFO!A10)","v":"CAR"},{"$f":"IF(COUNTRY_INFO!B10=0,\" \",COUNTRY_INFO!B10)","v":"Région Sanitaire N°1"},{"$f":"IF(COUNTRY_INFO!C10=0,\" \",COUNTRY_INFO!C10)","v":"Lobaye"},{"$f":"IF(COUNTRY_INFO!$U$9:$U$1000=\"MDA4 (ALB/2*ALB)\", COUNTRY_INFO!$U$9:$U$1000, \" \")","v":"MDA4 (ALB/2*ALB)"},"avril 2018",null,68160,160582,{"$f":"SUM(F10:H10)","v":228742},null,63320,132644,{"$f":"SUM(J10:L10)","v":195964},null,null,null,{"$f":"SUM(N10:P10)","v":0},0,63320,132644,195964," ",92.899061032863855,82.602035097333442,85.670318524800877]
[{"$f":"IF(COUNTRY_INFO!A11=0,\" \",COUNTRY_INFO!A11)","v":"CAR"},{"$f":"IF(COUNTRY_INFO!B11=0,\" \",COUNTRY_INFO!B11)","v":"Région Sanitaire N°2"},{"$f":"IF(COUNTRY_INFO!C11=0,\" \",COUNTRY_INFO!C11)","v":"Mambéré-Kadéï"},{"$f":"IF(COUNTRY_INFO!$U$9:$U$1000=\"MDA4 (ALB/2*ALB)\", COUNTRY_INFO!$U$9:$U$1000, \" \")","v":"MDA4 (ALB/2*ALB)"},"juin 2018",null,86484,304146,390630,null,86248,253498,339746,null,null,null,0,0,86248,253498,339746," ",99.727117154618199,83.347471280240413,86.973862734556988]
[{"$f":"IF(COUNTRY_INFO!A12=0,\" \",COUNTRY_INFO!A12)","v":"CAR"},{"$f":"IF(COUNTRY_INFO!B12=0,\" \",COUNTRY_INFO!B12)","v":"Région Sanitaire N°2"},{"$f":"IF(COUNTRY_INFO!C12=0,\" \",COUNTRY_INFO!C12)","v":"Sangha-Mbaéré"},{"$f":"IF(COUNTRY_INFO!$U$9:$U$1000=\"MDA4 (ALB/2*ALB)\", COUNTRY_INFO!$U$9:$U$1000, \" \")","v":"MDA4 (ALB/2*ALB)"},"mai 2018",null,31751,{"$f":"COUNTRY_INFO!G12","v":84302},116053,null,31454,77192,108646,null,null,null,0,0,31454,77192,108646," ",99.06459639066486,91.566036392968144,93.617571282086629]
[{"$f":"IF(COUNTRY_INFO!A13=0,\" \",COUNTRY_INFO!A13)","v":"CAR"},{"$f":"IF(COUNTRY_INFO!B13=0,\" \",COUNTRY_INFO!B13)","v":"Région Sanitaire N°2"},{"$f":"IF(COUNTRY_INFO!C13=0,\" \",COUNTRY_INFO!C13)","v":"Nana-Mambéré"},{"$f":"IF(COUNTRY_INFO!$U$9:$U$1000=\"MDA4 (ALB/2*ALB)\", COUNTRY_INFO!$U$9:$U$1000, \" \")","v":" "},null,null,null,null,0,null,null,null,0,null,null,null,0,0,0,0,0," "," "," "," "]
[{"$f":"IF(COUNTRY_INFO!A14=0,\" \",COUNTRY_INFO!A14)","v":"CAR"},{"$f":"IF(COUNTRY_INFO!B14=0,\" \",COUNTRY_INFO!B14)","v":"Région Sanitaire N°3"},{"$f":"IF(COUNTRY_INFO!C14=0,\" \",COUNTRY_INFO!C14)","v":"Ouham"},{"$f":"IF(COUNTRY_INFO!$U$9:$U$1000=\"MDA4 (ALB/2*ALB)\", COUNTRY_INFO!$U$9:$U$1000, \" \")","v":" "},null,null,null,null,0,null,null,null,0,null,null,null,0,0,0,0,0," "," "," "," "]
[{"$f":"IF(COUNTRY_INFO!A15=0,\" \",COUNTRY_INFO!A15)","v":"CAR"},{"$f":"IF(COUNTRY_INFO!B15=0,\" \",COUNTRY_INFO!B15)","v":"Région Sanitaire N°3"},{"$f":"IF(COUNTRY_INFO!C15=0,\" \",COUNTRY_INFO!C15)","v":"Ouham-Pendé"},{"$f":"IF(COUNTRY_INFO!$U$9:$U$1000=\"MDA4 (ALB/2*ALB)\", COUNTRY_INFO!$U$9:$U$1000, \" \")","v":" "},null,null,null,null,0,null,null,null,0,null,null,null,0,0,0,0,0," "," "," "," "]
[{"$f":"IF(COUNTRY_INFO!A16=0,\" \",COUNTRY_INFO!A16)","v":"CAR"},{"$f":"IF(COUNTRY_INFO!B16=0,\" \",COUNTRY_INFO!B16)","v":"Région Sanitaire N°4"},{"$f":"IF(COUNTRY_INFO!C16=0,\" \",COUNTRY_INFO!C16)","v":"Ouaka"},{"$f":"IF(COUNTRY_INFO!$U$9:$U$1000=\"MDA4 (ALB/2*ALB)\", COUNTRY_INFO!$U$9:$U$1000, \" \")","v":" "},null,null,null,null,0,null,null,null,0,null,null,null,0,0,0,0,0," "," "," "," "]
[{"$f":"IF(COUNTRY_INFO!A17=0,\" \",COUNTRY_INFO!A17)","v":"CAR"},{"$f":"IF(COUNTRY_INFO!B17=0,\" \",COUNTRY_INFO!B17)","v":"Région Sanitaire N°4"},{"$f":"IF(COUNTRY_INFO!C17=0,\" \",COUNTRY_INFO!C17)","v":"Kémo"},{"$f":"IF(COUNTRY_INFO!$U$9:$U$1000=\"MDA4 (ALB/2*ALB)\", COUNTRY_INFO!$U$9:$U$1000, \" \")","v":" "},null,null,null,null,0,null,null,null,0,null,null,null,0,0,0,0,0," "," "," "," "]
[{"$f":"IF(COUNTRY_INFO!A18=0,\" \",COUNTRY_INFO!A18)","v":"CAR"},{"$f":"IF(COUNTRY_INFO!B18=0,\" \",COUNTRY_INFO!B18)","v":"Région Sanitaire N°4"},{"$f":"IF(COUNTRY_INFO!C18=0,\" \",COUNTRY_INFO!C18)","v":"Nana-Gribizi"},{"$f":"IF(COUNTRY_INFO!$U$9:$U$1000=\"MDA4 (ALB/2*ALB)\", COUNTRY_INFO!$U$9:$U$1000, \" \")","v":" "},null,null,null,null,0,null,null,null,0,null,null,null,0,0,0,0,0," "," "," "," "]
[{"$f":"IF(COUNTRY_INFO!A19=0,\" \",COUNTRY_INFO!A19)","v":"CAR"},{"$f":"IF(COUNTRY_INFO!B19=0,\" \",COUNTRY_INFO!B19)","v":"Région Sanitaire N°5"},{"$f":"IF(COUNTRY_INFO!C19=0,\" \",COUNTRY_INFO!C19)","v":"Haute-Kotto"},{"$f":"IF(COUNTRY_INFO!$U$9:$U$1000=\"MDA4 (ALB/2*ALB)\", COUNTRY_INFO!$U$9:$U$1000, \" \")","v":" "},null,null,null,null,0,null,null,null,0,null,null,null,0,0,0,0,0," "," "," "," "]
[{"$f":"IF(COUNTRY_INFO!A20=0,\" \",COUNTRY_INFO!A20)","v":"CAR"},{"$f":"IF(COUNTRY_INFO!B20=0,\" \",COUNTRY_INFO!B20)","v":"Région Sanitaire N°5"},{"$f":"IF(COUNTRY_INFO!C20=0,\" \",COUNTRY_INFO!C20)","v":"Bamingui-Bangoran"},{"$f":"IF(COUNTRY_INFO!$U$9:$U$1000=\"MDA4 (ALB/2*ALB)\", COUNTRY_INFO!$U$9:$U$1000, \" \")","v":" "},null,null,null,null,0,null,null,null,0,null,null,null,0,0,0,0,0," "," "," "," "]
[{"$f":"IF(COUNTRY_INFO!A21=0,\" \",COUNTRY_INFO!A21)","v":"CAR"},{"$f":"IF(COUNTRY_INFO!B21=0,\" \",COUNTRY_INFO!B21)","v":"Région Sanitaire N°5"},{"$f":"IF(COUNTRY_INFO!C21=0,\" \",COUNTRY_INFO!C21)","v":"Vakaga"},{"$f":"IF(COUNTRY_INFO!$U$9:$U$1000=\"MDA4 (ALB/2*ALB)\", COUNTRY_INFO!$U$9:$U$1000, \" \")","v":" "},null,null,null,null,0,null,null,null,0,null,null,null,0,0,0,0,0," "," "," "," "]
[{"$f":"IF(COUNTRY_INFO!A22=0,\" \",COUNTRY_INFO!A22)","v":"CAR"},{"$f":"IF(COUNTRY_INFO!B22=0,\" \",COUNTRY_INFO!B22)","v":"Région Sanitaire N°6"},{"$f":"IF(COUNTRY_INFO!C22=0,\" \",COUNTRY_INFO!C22)","v":"Mbomou"},{"$f":"IF(COUNTRY_INFO!$U$9:$U$1000=\"MDA4 (ALB/2*ALB)\", COUNTRY_INFO!$U$9:$U$1000, \" \")","v":" "},null,null,null,null,0,null,null,null,0,null,null,null,0,0,0,0,0," "," "," "," "]
[{"$f":"IF(COUNTRY_INFO!A23=0,\" \",COUNTRY_INFO!A23)","v":"CAR"},{"$f":"IF(COUNTRY_INFO!B23=0,\" \",COUNTRY_INFO!B23)","v":"Région Sanitaire N°6"},{"$f":"IF(COUNTRY_INFO!C23=0,\" \",COUNTRY_INFO!C23)","v":"Basse-Kotto"},{"$f":"IF(COUNTRY_INFO!$U$9:$U$1000=\"MDA4 (ALB/2*ALB)\", COUNTRY_INFO!$U$9:$U$1000, \" \")","v":" "},null,null,null,null,0,null,null,null,0,null,null,null,0,0,0,0,0," "," "," "," "]
[{"$f":"IF(COUNTRY_INFO!A24=0,\" \",COUNTRY_INFO!A24)","v":"CAR"},{"$f":"IF(COUNTRY_INFO!B24=0,\" \",COUNTRY_INFO!B24)","v":"Région Sanitaire N°6"},{"$f":"IF(COUNTRY_INFO!C24=0,\" \",COUNTRY_INFO!C24)","v":"Haut-Mbomou"},{"$f":"IF(COUNTRY_INFO!$U$9:$U$1000=\"MDA4 (ALB/2*ALB)\", COUNTRY_INFO!$U$9:$U$1000, \" \")","v":" "},null,null,null,null,0,null,null,null,0,null,null,null,0,0,0,0,0," "," "," "," "]
[{"$f":"IF(COUNTRY_INFO!A25=0,\" \",COUNTRY_INFO!A25)","v":"CAR"},{"$f":"IF(COUNTRY_INFO!B25=0,\" \",COUNTRY_INFO!B25)","v":"Région Sanitaire N°7"},{"$f":"IF(COUNTRY_INFO!C25=0,\" \",COUNTRY_INFO!C25)","v":"BANGUI (8 Unités adm.)"},{"$f":"IF(COUNTRY_INFO!$U$9:$U$1000=\"MDA4 (ALB/2*ALB)\", COUNTRY_INFO!$U$9:$U$1000, \" \")","v":" "},null,null,null,null,0,null,null,null,0,null,null,null,0,0,0,0,0," "," "," "," "]

{"sheet":"MDA3","index":4,"n_rows":25,"n_cols":20,"rows_kept":25,"cut":false,"hidden":false,"merged":[[5,5,5,7],[5,17,5,19],[3,0,3,2],[5,0,5,2],[5,3,6,3],[5,4,6,4],[5,8,5,10],[5,11,5,13],[5,14,5,16]]}
["MDA 3 - Ivermectine (IVM) "]
["Structure administrative, population nécessitant une chimioprévention par groupe d'âge, population traitée par groupe d'âge et couverture"]
[]
["TOTAL",null,null,null,null,{"$f":"SUM(F$9:F$1000)","v":223547},731965,955512,185484,634190,819674,0,0,0,185484,634190,819674,{"$f":"IF(F4<>0, IF(O4/F4*100=0, \"-\", O4/F4*100), \" \")","v":82.973155533288306},{"$f":"IF(G4<>0, IF(P4/G4*100=0, \"-\", P4/G4*100), \" \")","v":86.642120866434865},{"$f":"IF(H4<>0, IF(Q4/H4*100=0, \"-\", Q4/H4*100), \" \")","v":85.783747352204884}]
[]
["Structure administrative du pays",null,null,"Mise en oeuvre \nde la CP","Date","Population ciblée pour MDA 3",null,null,"Population traitée - tournée 1",null,null,"Population traitée - tournée 2",null,null,"Population traitée",null,null,"Couverture du Programme (%)"]
["Pays","Région/Département","District",null,null,"EAS","Adultes","Total","EAS","Adultes","Total","EAS","Adultes","Total","EAS","Adultes","Total","EAS","Adultes","Total"]
[]
[{"$f":"IF(COUNTRY_INFO!A9=0,\" \",COUNTRY_INFO!A9)","v":"CAR"},{"$f":"IF(COUNTRY_INFO!B9=0,\" \",COUNTRY_INFO!B9)","v":"Région Sanitaire N°1"},{"$f":"IF(COUNTRY_INFO!C9=0,\" \",COUNTRY_INFO!C9)","v":"Ombella-Mpoko"},{"$f":"IF(COUNTRY_INFO!$U$9:$U$1000=\"MDA3 (IVM)\", COUNTRY_INFO!$U$9:$U$1000, \" \")","v":" "},null,null,null,{"$f":"SUM(F9:G9)","v":0},null,null,{"$f":"SUM(I9:J9)","v":0},null,null,{"$f":"SUM(L9:M9)","v":0},{"$f":"MAX(I9,L9)","v":0},0,{"$f":"SUM(O9:P9)","v":0},{"$f":"IF(F9<>0, IF(MAX(I9,L9)/F9*100=0, \"-\", MAX(I9,L9)/F9*100), \" \")","v":" "}," ",{"$f":"IF(H9<>0, IF((MAX(I9,L9)+MAX(J9,M9))/H9*100=0, \"-\",(MAX(I9,L9)+MAX(J9,M9))/H9*100), \" \")","v":" "}]
[{"$f":"IF(COUNTRY_INFO!A10=0,\" \",COUNTRY_INFO!A10)","v":"CAR"},{"$f":"IF(COUNTRY_INFO!B10=0,\" \",COUNTRY_INFO!B10)","v":"Région Sanitaire N°1"},{"$f":"IF(COUNTRY_INFO!C10=0,\" \",COUNTRY_INFO!C10)","v":"Lobaye"},{"$f":"IF(COUNTRY_INFO!$U$9:$U$1000=\"MDA3 (IVM)\", COUNTRY_INFO!$U$9:$U$1000, \" \")","v":" "},null,null,null,{"$f":"SUM(F10:G10)","v":0},null,null,{"$f":"SUM(I10:J10)","v":0},null,null,{"$f":"SUM(L10:M10)","v":0},{"$f":"MAX(I10,L10)","v":0},{"$f":"MAX(J10,M10)","v":0},{"$f":"SUM(O10:P10)","v":0},{"$f":"IF(F10<>0, IF(MAX(I10,L10)/F10*100=0, \"-\", MAX(I10,L10)/F10*100), \" \")","v":" "},{"$f":"IF(G10<>0, IF(MAX(J10,M10)/G10*100=0, \"-\", MAX(J10,M10)/G10*100), \" \")","v":" "},{"$f":"IF(H10<>0, IF((MAX(I10,L10)+MAX(J10,M10))/H10*100=0, \"-\",(MAX(I10,L10)+MAX(J10,M10))/H10*100), \" \")","v":" "}]
[{"$f":"IF(COUNTRY_INFO!A11=0,\" \",COUNTRY_INFO!A11)","v":"CAR"},{"$f":"IF(COUNTRY_INFO!B11=0,\" \",COUNTRY_INFO!B11)","v":"Région Sanitaire N°2"},{"$f":"IF(COUNTRY_INFO!C11=0,\" \",COUNTRY_INFO!C11)","v":"Mambéré-Kadéï"},{"$f":"IF(COUNTRY_INFO!$U$9:$U$1000=\"MDA3 (IVM)\", COUNTRY_INFO!$U$9:$U$1000, \" \")","v":" "},null,null,null,0,null,null,0,null,null,0,0,0,0," "," "," "]
[{"$f":"IF(COUNTRY_INFO!A12=0,\" \",COUNTRY_INFO!A12)","v":"CAR"},{"$f":"IF(COUNTRY_INFO!B12=0,\" \",COUNTRY_INFO!B12)","v":"Région Sanitaire N°2"},{"$f":"IF(COUNTRY_INFO!C12=0,\" \",COUNTRY_INFO!C12)","v":"Sangha-Mbaéré"},{"$f":"IF(COUNTRY_INFO!$U$9:$U$1000=\"MDA3 (IVM)\", COUNTRY_INFO!$U$9:$U$1000, \" \")","v":" "},null,null,null,0,null,null,0,null,null,0,0,0,0," "," "," "]
[{"$f":"IF(COUNTRY_INFO!A13=0,\" \",COUNTRY_INFO!A13)","v":"CAR"},{"$f":"IF(COUNTRY_INFO!B13=0,\" \",COUNTRY_INFO!B13)","v":"Région Sanitaire N°2"},{"$f":"IF(COUNTRY_INFO!C13=0,\" \",COUNTRY_INFO!C13)","v":"Nana-Mambéré"},{"$f":"IF(COUNTRY_INFO!$U$9:$U$1000=\"MDA3 (IVM)\", COUNTRY_INFO!$U$9:$U$1000, \" \")","v":" "},null,null,null,0,null,null,0,null,null,0,0,0,0," "," "," "]
[{"$f":"IF(COUNTRY_INFO!A14=0,\" \",COUNTRY_INFO!A14)","v":"CAR"},{"$f":"IF(COUNTRY_INFO!B14=0,\" \",COUNTRY_INFO!B14)","v":"Région Sanitaire N°3"},{"$f":"IF(COUNTRY_INFO!C14=0,\" \",COUNTRY_INFO!C14)","v":"Ouham"},{"$f":"IF(COUNTRY_INFO!$U$9:$U$1000=\"MDA3 (IVM)\", COUNTRY_INFO!$U$9:$U$1000, \" \")","v":"MDA3 (IVM)"},"septembre 2018",100880,{"$f":"COUNTRY_INFO!G14","v":307951},408831,84629,292326,376955,null,null,0,84629,292326,376955,83.890761300555113,94.92614084708282,92.203135280837316]
[{"$f":"IF(COUNTRY_INFO!A15=0,\" \",COUNTRY_INFO!A15)","v":"CAR"},{"$f":"IF(COUNTRY_INFO!B15=0,\" \",COUNTRY_INFO!B15)","v":"Région Sanitaire N°3"},{"$f":"IF(COUNTRY_INFO!C15=0,\" \",COUNTRY_INFO!C15)","v":"Ouham-Pendé"},{"$f":"IF(COUNTRY_INFO!$U$9:$U$1000=\"MDA3 (IVM)\", COUNTRY_INFO!$U$9:$U$1000, \" \")","v":"MDA3 (IVM)"},"décembre 2018",101791,352018,453809,83898,284466,368364,null,null,0,83898,284466,368364,82.421825112239787,80.810072212216426,81.171594216950311]
[{"$f":"IF(COUNTRY_INFO!A16=0,\" \",COUNTRY_INFO!A16)","v":"CAR"},{"$f":"IF(COUNTRY_INFO!B16=0,\" \",COUNTRY_INFO!B16)","v":"Région Sanitaire N°4"},{"$f":"IF(COUNTRY_INFO!C16=0,\" \",COUNTRY_INFO!C16)","v":"Ouaka"},{"$f":"IF(COUNTRY_INFO!$U$9:$U$1000=\"MDA3 (IVM)\", COUNTRY_INFO!$U$9:$U$1000, \" \")","v":" "},null,null,null,0,null,null,0,null,null,0,0,0,0," "," "," "]
[{"$f":"IF(COUNTRY_INFO!A17=0,\" \",COUNTRY_INFO!A17)","v":"CAR"},{"$f":"IF(COUNTRY_INFO!B17=0,\" \",COUNTRY_INFO!B17)","v":"Région Sanitaire N°4"},{"$f":"IF(COUNTRY_INFO!C17=0,\" \",COUNTRY_INFO!C17)","v":"Kémo"},{"$f":"IF(COUNTRY_INFO!$U$9:$U$1000=\"MDA3 (IVM)\", COUNTRY_INFO!$U$9:$U$1000, \" \")","v":" "},null,null,null,0,null,null,0,null,null,0,0,0,0," "," "," "]
[{"$f":"IF(COUNTRY_INFO!A18=0,\" \",COUNTRY_INFO!A18)","v":"CAR"},{"$f":"IF(COUNTRY_INFO!B18=0,\" \",COUNTRY_INFO!B18)","v":"Région Sanitaire N°4"},{"$f":"IF(COUNTRY_INFO!C18=0,\" \",COUNTRY_INFO!C18)","v":"Nana-Gribizi"},{"$f":"IF(COUNTRY_INFO!$U$9:$U$1000=\"MDA3 (IVM)\", COUNTRY_INFO!$U$9:$U$1000, \" \")","v":"MDA3 (IVM)"},"novembre 2018",20876,71996,92872,16957,57398,74355,null,null,0,16957,57398,74355,81.227246598965323,79.723873548530477,80.061805495736067]
[{"$f":"IF(COUNTRY_INFO!A19=0,\" \",COUNTRY_INFO!A19)","v":"CAR"},{"$f":"IF(COUNTRY_INFO!B19=0,\" \",COUNTRY_INFO!B19)","v":"Région Sanitaire N°5"},{"$f":"IF(COUNTRY_INFO!C19=0,\" \",COUNTRY_INFO!C19)","v":"Haute-Kotto"},{"$f":"IF(COUNTRY_INFO!$U$9:$U$1000=\"MDA3 (IVM)\", COUNTRY_INFO!$U$9:$U$1000, \" \")","v":" "},null,null,null,0,null,null,0,null,null,0,0,0,0," "," "," "]
[{"$f":"IF(COUNTRY_INFO!A20=0,\" \",COUNTRY_INFO!A20)","v":"CAR"},{"$f":"IF(COUNTRY_INFO!B20=0,\" \",COUNTRY_INFO!B20)","v":"Région Sanitaire N°5"},{"$f":"IF(COUNTRY_INFO!C20=0,\" \",COUNTRY_INFO!C20)","v":"Bamingui-Bangoran"},{"$f":"IF(COUNTRY_INFO!$U$9:$U$1000=\"MDA3 (IVM)\", COUNTRY_INFO!$U$9:$U$1000, \" \")","v":" "},null,null,null,0,null,null,0,null,null,0,0,0,0," "," "," "]
[{"$f":"IF(COUNTRY_INFO!A21=0,\" \",COUNTRY_INFO!A21)","v":"CAR"},{"$f":"IF(COUNTRY_INFO!B21=0,\" \",COUNTRY_INFO!B21)","v":"Région Sanitaire N°5"},{"$f":"IF(COUNTRY_INFO!C21=0,\" \",COUNTRY_INFO!C21)","v":"Vakaga"},{"$f":"IF(COUNTRY_INFO!$U$9:$U$1000=\"MDA3 (IVM)\", COUNTRY_INFO!$U$9:$U$1000, \" \")","v":" "},null,null,null,0,null,null,0,null,null,0,0,0,0," "," "," "]
[{"$f":"IF(COUNTRY_INFO!A22=0,\" \",COUNTRY_INFO!A22)","v":"CAR"},{"$f":"IF(COUNTRY_INFO!B22=0,\" \",COUNTRY_INFO!B22)","v":"Région Sanitaire N°6"},{"$f":"IF(COUNTRY_INFO!C22=0,\" \",COUNTRY_INFO!C22)","v":"Mbomou"},{"$f":"IF(COUNTRY_INFO!$U$9:$U$1000=\"MDA3 (IVM)\", COUNTRY_INFO!$U$9:$U$1000, \" \")","v":" "},null,null,null,0,null,null,0,null,null,0,0,0,0," "," "," "]
[{"$f":"IF(COUNTRY_INFO!A23=0,\" \",COUNTRY_INFO!A23)","v":"CAR"},{"$f":"IF(COUNTRY_INFO!B23=0,\" \",COUNTRY_INFO!B23)","v":"Région Sanitaire N°6"},{"$f":"IF(COUNTRY_INFO!C23=0,\" \",COUNTRY_INFO!C23)","v":"Basse-Kotto"},{"$f":"IF(COUNTRY_INFO!$U$9:$U$1000=\"MDA3 (IVM)\", COUNTRY_INFO!$U$9:$U$1000, \" \")","v":" "},null,null,null,0,null,null,0,null,null,0,0,0,0," "," "," "]
[{"$f":"IF(COUNTRY_INFO!A24=0,\" \",COUNTRY_INFO!A24)","v":"CAR"},{"$f":"IF(COUNTRY_INFO!B24=0,\" \",COUNTRY_INFO!B24)","v":"Région Sanitaire N°6"},{"$f":"IF(COUNTRY_INFO!C24=0,\" \",COUNTRY_INFO!C24)","v":"Haut-Mbomou"},{"$f":"IF(COUNTRY_INFO!$U$9:$U$1000=\"MDA3 (IVM)\", COUNTRY_INFO!$U$9:$U$1000, \" \")","v":" "},null,null,null,0,null,null,0,null,null,0,0,0,0," "," "," "]
[{"$f":"IF(COUNTRY_INFO!A25=0,\" \",COUNTRY_INFO!A25)","v":"CAR"},{"$f":"IF(COUNTRY_INFO!B25=0,\" \",COUNTRY_INFO!B25)","v":"Région Sanitaire N°7"},{"$f":"IF(COUNTRY_INFO!C25=0,\" \",COUNTRY_INFO!C25)","v":"BANGUI (8 Unités adm.)"},{"$f":"IF(COUNTRY_INFO!$U$9:$U$1000=\"MDA3 (IVM)\", COUNTRY_INFO!$U$9:$U$1000, \" \")","v":" "},null,null,null,0,null,null,0,null,null,0,0,0,0," "," "," "]

{"sheet":"T1","index":5,"n_rows":25,"n_cols":19,"rows_kept":25,"cut":false,"hidden":false,"merged":[[5,6,5,10],[5,11,5,14],[5,15,5,18],[3,0,3,2],[5,0,5,2],[5,3,6,3],[5,5,6,5],[5,4,6,4]]}
["T 1 - Praziquantel (PZQ) et Albendazole (ALB) ou Mebendazole (MBD)"]
["Structure administrative, population nécessitant une chimioprévention par groupe d'âge, population traitée par groupe d'âge et couverture"]
[]
["TOTAL",null,null,null,null,null,{"$f":"SUM(G$9:G$1000)","v":0},0,0,0,{"$f":"SUM(K$9:K$1000)","v":0},0,0,0,0,{"$f":"IF(G4<>0, IF(L4/G4*100=0, \"-\", L4/G4*100), \" \")","v":" "},{"$f":"IF(OR(I4<>0,H4<>0), IF(M4/MAX(H4,I4)*100=0, \"-\", M4/MAX(H4,I4)*100), \" \")","v":" "},{"$f":"IF(J4<>0, IF(N4/J4*100=0, \"-\", N4/J4*100), \" \")","v":" "},{"$f":"IF(K4<>0, IF(O4/K4*100=0, \"-\", O4/K4*100), \" \")","v":" "}]
[]
["Structure administrative du pays",null,null,"Mise en oeuvre \nde la CP","Médica-ment","Date","Population ciblée pour T1",null,null,null,null,"Population traitée",null,null,null,"Couverture du Programme (%)"]
["Pays","Région/Département","District",null,null,null,"EAPréS (ALB)","EAS (ALB)","EAS (PZQ)","Adultes (PZQ)","Total","EAPréS","EAS","Adultes","Total","EAPréS","EAS","Adultes","Total"]
[]
[{"$f":"IF(COUNTRY_INFO!A9=0,\" \",COUNTRY_INFO!A9)","v":"CAR"},{"$f":"IF(COUNTRY_INFO!B9=0,\" \",COUNTRY_INFO!B9)","v":"Région Sanitaire N°1"},{"$f":"IF(COUNTRY_INFO!C9=0,\" \",COUNTRY_INFO!C9)","v":"Ombella-Mpoko"},{"$f":"IF(OR(COUNTRY_INFO!$U$9:$U$1000=\"T1 (PZQ+ALB/MBD)\",COUNTRY_INFO!$V$9:$V$1000=\"T1 (PZQ+ALB/MBD)\"), \"T1 (PZQ+ALB/MBD)\", \" \")","v":" "},null,null,null,null,null,null,{"$f":"MAX(H9:I9)+G9+J9","v":0},null,null,null,{"$f":"SUM(L9:N9)","v":0},{"$f":"IF(G9<>0, IF(L9/G9*100=0, \"-\", L9/G9*100), \" \")","v":" "},{"$f":"IF(OR(I9<>0,H9<>0), IF(M9/MAX(H9,I9)*100=0, \"-\", M9/MAX(H9,I9)*100), \" \")","v":" "},{"$f":"IF(J9<>0, IF(N9/J9*100=0, \"-\", N9/J9*100), \" \")","v":" "}," "]
[{"$f":"IF(COUNTRY_INFO!A10=0,\" \",COUNTRY_INFO!A10)","v":"CAR"},{"$f":"IF(COUNTRY_INFO!B10=0,\" \",COUNTRY_INFO!B10)","v":"Région Sanitaire N°1"},{"$f":"IF(COUNTRY_INFO!C10=0,\" \",COUNTRY_INFO!C10)","v":"Lobaye"},{"$f":"IF(OR(COUNTRY_INFO!$U$9:$U$1000=\"T1 (PZQ+ALB/MBD)\",COUNTRY_INFO!$V$9:$V$1000=\"T1 (PZQ+ALB/MBD)\"), \"T1 (PZQ+ALB/MBD)\", \" \")","v":" "},null,null,null,null,null,null,{"$f":"MAX(H10:I10)+G10+J10","v":0},null,null,null,{"$f":"SUM(L10:N10)","v":0},{"$f":"IF(G10<>0, IF(L10/G10*100=0, \"-\", L10/G10*100), \" \")","v":" "},{"$f":"IF(OR(I10<>0,H10<>0), IF(M10/MAX(H10,I10)*100=0, \"-\", M10/MAX(H10,I10)*100), \" \")","v":" "},{"$f":"IF(J10<>0, IF(N10/J10*100=0, \"-\", N10/J10*100), \" \")","v":" "},{"$f":"IF(K10<>0, IF(O10/K10*100=0, \"-\", O10/K10*100), \" \")","v":" "}]
[{"$f":"IF(COUNTRY_INFO!A11=0,\" \",COUNTRY_INFO!A11)","v":"CAR"},{"$f":"IF(COUNTRY_INFO!B11=0,\" \",COUNTRY_INFO!B11)","v":"Région Sanitaire N°2"},{"$f":"IF(COUNTRY_INFO!C11=0,\" \",COUNTRY_INFO!C11)","v":"Mambéré-Kadéï"},{"$f":"IF(OR(COUNTRY_INFO!$U$9:$U$1000=\"T1 (PZQ+ALB/MBD)\",COUNTRY_INFO!$V$9:$V$1000=\"T1 (PZQ+ALB/MBD)\"), \"T1 (PZQ+ALB/MBD)\", \" \")","v":" "},null,null,null,null,null,null,0,null,null,null,0," "," "," "," "]
[{"$f":"IF(COUNTRY_INFO!A12=0,\" \",COUNTRY_INFO!A12)","v":"CAR"},{"$f":"IF(COUNTRY_INFO!B12=0,\" \",COUNTRY_INFO!B12)","v":"Région Sanitaire N°2"},{"$f":"IF(COUNTRY_INFO!C12=0,\" \",COUNTRY_INFO!C12)","v":"Sangha-Mbaéré"},{"$f":"IF(OR(COUNTRY_INFO!$U$9:$U$1000=\"T1 (PZQ+ALB/MBD)\",COUNTRY_INFO!$V$9:$V$1000=\"T1 (PZQ+ALB/MBD)\"), \"T1 (PZQ+ALB/MBD)\", \" \")","v":" "},null,null,null,null,null,null,0,null,null,null,0," "," "," "," "]
[{"$f":"IF(COUNTRY_INFO!A13=0,\" \",COUNTRY_INFO!A13)","v":"CAR"},{"$f":"IF(COUNTRY_INFO!B13=0,\" \",COUNTRY_INFO!B13)","v":"Région Sanitaire N°2"},{"$f":"IF(COUNTRY_INFO!C13=0,\" \",COUNTRY_INFO!C13)","v":"Nana-Mambéré"},{"$f":"IF(OR(COUNTRY_INFO!$U$9:$U$1000=\"T1 (PZQ+ALB/MBD)\",COUNTRY_INFO!$V$9:$V$1000=\"T1 (PZQ+ALB/MBD)\"), \"T1 (PZQ+ALB/MBD)\", \" \")","v":" "},null,null,null,null,null,null,0,null,null,null,0," "," "," "," "]
[{"$f":"IF(COUNTRY_INFO!A14=0,\" \",COUNTRY_INFO!A14)","v":"CAR"},{"$f":"IF(COUNTRY_INFO!B14=0,\" \",COUNTRY_INFO!B14)","v":"Région Sanitaire N°3"},{"$f":"IF(COUNTRY_INFO!C14=0,\" \",COUNTRY_INFO!C14)","v":"Ouham"},{"$f":"IF(OR(COUNTRY_INFO!$U$9:$U$1000=\"T1 (PZQ+ALB/MBD)\",COUNTRY_INFO!$V$9:$V$1000=\"T1 (PZQ+ALB/MBD)\"), \"T1 (PZQ+ALB/MBD)\", \" \")","v":" "},null,null,null,null,null,null,0,null,null,null,0," "," "," "," "]
[{"$f":"IF(COUNTRY_INFO!A15=0,\" \",COUNTRY_INFO!A15)","v":"CAR"},{"$f":"IF(COUNTRY_INFO!B15=0,\" \",COUNTRY_INFO!B15)","v":"Région Sanitaire N°3"},{"$f":"IF(COUNTRY_INFO!C15=0,\" \",COUNTRY_INFO!C15)","v":"Ouham-Pendé"},{"$f":"IF(OR(COUNTRY_INFO!$U$9:$U$1000=\"T1 (PZQ+ALB/MBD)\",COUNTRY_INFO!$V$9:$V$1000=\"T1 (PZQ+ALB/MBD)\"), \"T1 (PZQ+ALB/MBD)\", \" \")","v":" "},null,null,null,null,null,null,0,null,null,null,0," "," "," "," "]
[{"$f":"IF(COUNTRY_INFO!A16=0,\" \",COUNTRY_INFO!A16)","v":"CAR"},{"$f":"IF(COUNTRY_INFO!B16=0,\" \",COUNTRY_INFO!B16)","v":"Région Sanitaire N°4"},{"$f":"IF(COUNTRY_INFO!C16=0,\" \",COUNTRY_INFO!C16)","v":"Ouaka"},{"$f":"IF(OR(COUNTRY_INFO!$U$9:$U$1000=\"T1 (PZQ+ALB/MBD)\",COUNTRY_INFO!$V$9:$V$1000=\"T1 (PZQ+ALB/MBD)\"), \"T1 (PZQ+ALB/MBD)\", \" \")","v":" "},null,null,null,null,null,null,0,null,null,null,0," "," "," "," "]
[{"$f":"IF(COUNTRY_INFO!A17=0,\" \",COUNTRY_INFO!A17)","v":"CAR"},{"$f":"IF(COUNTRY_INFO!B17=0,\" \",COUNTRY_INFO!B17)","v":"Région Sanitaire N°4"},{"$f":"IF(COUNTRY_INFO!C17=0,\" \",COUNTRY_INFO!C17)","v":"Kémo"},{"$f":"IF(OR(COUNTRY_INFO!$U$9:$U$1000=\"T1 (PZQ+ALB/MBD)\",COUNTRY_INFO!$V$9:$V$1000=\"T1 (PZQ+ALB/MBD)\"), \"T1 (PZQ+ALB/MBD)\", \" \")","v":" "},null,null,null,null,null,null,0,null,null,null,0," "," "," "," "]
[{"$f":"IF(COUNTRY_INFO!A18=0,\" \",COUNTRY_INFO!A18)","v":"CAR"},{"$f":"IF(COUNTRY_INFO!B18=0,\" \",COUNTRY_INFO!B18)","v":"Région Sanitaire N°4"},{"$f":"IF(COUNTRY_INFO!C18=0,\" \",COUNTRY_INFO!C18)","v":"Nana-Gribizi"},{"$f":"IF(OR(COUNTRY_INFO!$U$9:$U$1000=\"T1 (PZQ+ALB/MBD)\",COUNTRY_INFO!$V$9:$V$1000=\"T1 (PZQ+ALB/MBD)\"), \"T1 (PZQ+ALB/MBD)\", \" \")","v":" "},null,null,null,null,null,null,0,null,null,null,0," "," "," "," "]
[{"$f":"IF(COUNTRY_INFO!A19=0,\" \",COUNTRY_INFO!A19)","v":"CAR"},{"$f":"IF(COUNTRY_INFO!B19=0,\" \",COUNTRY_INFO!B19)","v":"Région Sanitaire N°5"},{"$f":"IF(COUNTRY_INFO!C19=0,\" \",COUNTRY_INFO!C19)","v":"Haute-Kotto"},{"$f":"IF(OR(COUNTRY_INFO!$U$9:$U$1000=\"T1 (PZQ+ALB/MBD)\",COUNTRY_INFO!$V$9:$V$1000=\"T1 (PZQ+ALB/MBD)\"), \"T1 (PZQ+ALB/MBD)\", \" \")","v":" "},null,null,null,null,null,null,0,null,null,null,0," "," "," "," "]
[{"$f":"IF(COUNTRY_INFO!A20=0,\" \",COUNTRY_INFO!A20)","v":"CAR"},{"$f":"IF(COUNTRY_INFO!B20=0,\" \",COUNTRY_INFO!B20)","v":"Région Sanitaire N°5"},{"$f":"IF(COUNTRY_INFO!C20=0,\" \",COUNTRY_INFO!C20)","v":"Bamingui-Bangoran"},{"$f":"IF(OR(COUNTRY_INFO!$U$9:$U$1000=\"T1 (PZQ+ALB/MBD)\",COUNTRY_INFO!$V$9:$V$1000=\"T1 (PZQ+ALB/MBD)\"), \"T1 (PZQ+ALB/MBD)\", \" \")","v":" "},null,null,null,null,null,null,0,null,null,null,0," "," "," "," "]
[{"$f":"IF(COUNTRY_INFO!A21=0,\" \",COUNTRY_INFO!A21)","v":"CAR"},{"$f":"IF(COUNTRY_INFO!B21=0,\" \",COUNTRY_INFO!B21)","v":"Région Sanitaire N°5"},{"$f":"IF(COUNTRY_INFO!C21=0,\" \",COUNTRY_INFO!C21)","v":"Vakaga"},{"$f":"IF(OR(COUNTRY_INFO!$U$9:$U$1000=\"T1 (PZQ+ALB/MBD)\",COUNTRY_INFO!$V$9:$V$1000=\"T1 (PZQ+ALB/MBD)\"), \"T1 (PZQ+ALB/MBD)\", \" \")","v":" "},null,null,null,null,null,null,0,null,null,null,0," "," "," "," "]
[{"$f":"IF(COUNTRY_INFO!A22=0,\" \",COUNTRY_INFO!A22)","v":"CAR"},{"$f":"IF(COUNTRY_INFO!B22=0,\" \",COUNTRY_INFO!B22)","v":"Région Sanitaire N°6"},{"$f":"IF(COUNTRY_INFO!C22=0,\" \",COUNTRY_INFO!C22)","v":"Mbomou"},{"$f":"IF(OR(COUNTRY_INFO!$U$9:$U$1000=\"T1 (PZQ+ALB/MBD)\",COUNTRY_INFO!$V$9:$V$1000=\"T1 (PZQ+ALB/MBD)\"), \"T1 (PZQ+ALB/MBD)\", \" \")","v":" "},null,null,null,null,null,null,0,null,null,null,0," "," "," "," "]
[{"$f":"IF(COUNTRY_INFO!A23=0,\" \",COUNTRY_INFO!A23)","v":"CAR"},{"$f":"IF(COUNTRY_INFO!B23=0,\" \",COUNTRY_INFO!B23)","v":"Région Sanitaire N°6"},{"$f":"IF(COUNTRY_INFO!C23=0,\" \",COUNTRY_INFO!C23)","v":"Basse-Kotto"},{"$f":"IF(OR(COUNTRY_INFO!$U$9:$U$1000=\"T1 (PZQ+ALB/MBD)\",COUNTRY_INFO!$V$9:$V$1000=\"T1 (PZQ+ALB/MBD)\"), \"T1 (PZQ+ALB/MBD)\", \" \")","v":" "},null,null,null,null,null,null,0,null,null,null,0," "," "," "," "]
[{"$f":"IF(COUNTRY_INFO!A24=0,\" \",COUNTRY_INFO!A24)","v":"CAR"},{"$f":"IF(COUNTRY_INFO!B24=0,\" \",COUNTRY_INFO!B24)","v":"Région Sanitaire N°6"},{"$f":"IF(COUNTRY_INFO!C24=0,\" \",COUNTRY_INFO!C24)","v":"Haut-Mbomou"},{"$f":"IF(OR(COUNTRY_INFO!$U$9:$U$1000=\"T1 (PZQ+ALB/MBD)\",COUNTRY_INFO!$V$9:$V$1000=\"T1 (PZQ+ALB/MBD)\"), \"T1 (PZQ+ALB/MBD)\", \" \")","v":" "},null,null,null,null,null,null,0,null,null,null,0," "," "," "," "]
[{"$f":"IF(COUNTRY_INFO!A25=0,\" \",COUNTRY_INFO!A25)","v":"CAR"},{"$f":"IF(COUNTRY_INFO!B25=0,\" \",COUNTRY_INFO!B25)","v":"Région Sanitaire N°7"},{"$f":"IF(COUNTRY_INFO!C25=0,\" \",COUNTRY_INFO!C25)","v":"BANGUI (8 Unités adm.)"},{"$f":"IF(OR(COUNTRY_INFO!$U$9:$U$1000=\"T1 (PZQ+ALB/MBD)\",COUNTRY_INFO!$V$9:$V$1000=\"T1 (PZQ+ALB/MBD)\"), \"T1 (PZQ+ALB/MBD)\", \" \")","v":" "},null,null,null,null,null,null,0,null,null,null,0," "," "," "," "]

{"sheet":"T2","index":6,"n_rows":25,"n_cols":17,"rows_kept":25,"cut":false,"hidden":false,"merged":[[5,5,5,8],[5,9,5,12],[5,13,5,16],[3,0,3,2],[5,0,5,2],[5,3,6,3],[5,4,6,4]]}
["T 2 - Praziquantel (PZQ) "]
["Structure administrative, population nécessitant une chimioprévention par groupe d'âge, population traitée par groupe d'âge et couverture"]
[]
["TOTAL",null,null,null,null,{"$f":"SUM(F$9:F$1000)","v":0},157241,0,157241,0,151140,0,151140,{"$f":"IF(F4<>0, IF(J4/F4*100=0, \"-\", J4/F4*100), \" \")","v":" "},{"$f":"IF(G4<>0, IF(K4/G4*100=0, \"-\", K4/G4*100), \" \")","v":96.119968710450834},{"$f":"IF(H4<>0, IF(L4/H4*100=0, \"-\", L4/H4*100), \" \")","v":" "},{"$f":"IF(I4<>0, IF(M4/I4*100=0, \"-\", M4/I4*100), \" \")","v":96.119968710450834}]
[]
["Structure administrative du pays",null,null,"Mise en oeuvre \nde la CP","Date","Population ciblée pour T2",null,null,null,"Population traitée",null,null,null,"Couverture du Programme (%)"]
["Pays","Région/Département","District",null,null,"EAPréS","EAS","Adultes","Total","EAPréS","EAS","Adultes","Total","EAPréS","EAS","Adultes","Total"]
[]
[{"$f":"IF(COUNTRY_INFO!A9=0,\" \",COUNTRY_INFO!A9)","v":"CAR"},{"$f":"IF(COUNTRY_INFO!B9=0,\" \",COUNTRY_INFO!B9)","v":"Région Sanitaire N°1"},{"$f":"IF(COUNTRY_INFO!C9=0,\" \",COUNTRY_INFO!C9)","v":"Ombella-Mpoko"},{"$f":"IF(OR(COUNTRY_INFO!$U$9:$U$1000=\"T2 (PZQ)\",COUNTRY_INFO!$V$9:$V$1000=\"T2 (PZQ)\"), \"T2 (PZQ)\", \" \")","v":"T2 (PZQ)"},"mai 2018",null,65924,null,{"$f":"SUM(F9:H9)","v":65924},null,63962,null,{"$f":"SUM(J9:L9)","v":63962},{"$f":"IF(F9<>0, IF(J9/F9*100=0, \"-\", J9/F9*100), \" \")","v":" "},97.02384564043443," ",97.02384564043443]
[{"$f":"IF(COUNTRY_INFO!A10=0,\" \",COUNTRY_INFO!A10)","v":"CAR"},{"$f":"IF(COUNTRY_INFO!B10=0,\" \",COUNTRY_INFO!B10)","v":"Région Sanitaire N°1"},{"$f":"IF(COUNTRY_INFO!C10=0,\" \",COUNTRY_INFO!C10)","v":"Lobaye"},{"$f":"IF(OR(COUNTRY_INFO!$U$9:$U$1000=\"T2 (PZQ)\",COUNTRY_INFO!$V$9:$V$1000=\"T2 (PZQ)\"), \"T2 (PZQ)\", \" \")","v":"T2 (PZQ)"},"mai 2018",null,53037,null,{"$f":"SUM(F10:H10)","v":53037},null,48898,null,{"$f":"SUM(J10:L10)","v":48898},{"$f":"IF(F10<>0, IF(J10/F10*100=0, \"-\", J10/F10*100), \" \")","v":" "},{"$f":"IF(G10<>0, IF(K10/G10*100=0, \"-\", K10/G10*100), \" \")","v":92.196014103361804},{"$f":"IF(H10<>0, IF(L10/H10*100=0, \"-\", L10/H10*100), \" \")","v":" "},{"$f":"IF(I10<>0, IF(M10/I10*100=0, \"-\", M10/I10*100), \" \")","v":92.196014103361804}]
[{"$f":"IF(COUNTRY_INFO!A11=0,\" \",COUNTRY_INFO!A11)","v":"CAR"},{"$f":"IF(COUNTRY_INFO!B11=0,\" \",COUNTRY_INFO!B11)","v":"Région Sanitaire N°2"},{"$f":"IF(COUNTRY_INFO!C11=0,\" \",COUNTRY_INFO!C11)","v":"Mambéré-Kadéï"},{"$f":"IF(OR(COUNTRY_INFO!$U$9:$U$1000=\"T2 (PZQ)\",COUNTRY_INFO!$V$9:$V$1000=\"T2 (PZQ)\"), \"T2 (PZQ)\", \" \")","v":"T2 (PZQ)"},"juillet 2018",null,38280,null,38280,null,38280,null,38280," ",100," ",100]
[{"$f":"IF(COUNTRY_INFO!A12=0,\" \",COUNTRY_INFO!A12)","v":"CAR"},{"$f":"IF(COUNTRY_INFO!B12=0,\" \",COUNTRY_INFO!B12)","v":"Région Sanitaire N°2"},{"$f":"IF(COUNTRY_INFO!C12=0,\" \",COUNTRY_INFO!C12)","v":"Sangha-Mbaéré"},{"$f":"IF(OR(COUNTRY_INFO!$U$9:$U$1000=\"T2 (PZQ)\",COUNTRY_INFO!$V$9:$V$1000=\"T2 (PZQ)\"), \"T2 (PZQ)\", \" \")","v":" "},null,null,null,null,0,null,null,null,0," "," "," "," "]
[{"$f":"IF(COUNTRY_INFO!A13=0,\" \",COUNTRY_INFO!A13)","v":"CAR"},{"$f":"IF(COUNTRY_INFO!B13=0,\" \",COUNTRY_INFO!B13)","v":"Région Sanitaire N°2"},{"$f":"IF(COUNTRY_INFO!C13=0,\" \",COUNTRY_INFO!C13)","v":"Nana-Mambéré"},{"$f":"IF(OR(COUNTRY_INFO!$U$9:$U$1000=\"T2 (PZQ)\",COUNTRY_INFO!$V$9:$V$1000=\"T2 (PZQ)\"), \"T2 (PZQ)\", \" \")","v":" "},null,null,null,null,0,null,null,null,0," "," "," "," "]
[{"$f":"IF(COUNTRY_INFO!A14=0,\" \",COUNTRY_INFO!A14)","v":"CAR"},{"$f":"IF(COUNTRY_INFO!B14=0,\" \",COUNTRY_INFO!B14)","v":"Région Sanitaire N°3"},{"$f":"IF(COUNTRY_INFO!C14=0,\" \",COUNTRY_INFO!C14)","v":"Ouham"},{"$f":"IF(OR(COUNTRY_INFO!$U$9:$U$1000=\"T2 (PZQ)\",COUNTRY_INFO!$V$9:$V$1000=\"T2 (PZQ)\"), \"T2 (PZQ)\", \" \")","v":" "},null,null,null,null,0,null,null,null,0," "," "," "," "]
[{"$f":"IF(COUNTRY_INFO!A15=0,\" \",COUNTRY_INFO!A15)","v":"CAR"},{"$f":"IF(COUNTRY_INFO!B15=0,\" \",COUNTRY_INFO!B15)","v":"Région Sanitaire N°3"},{"$f":"IF(COUNTRY_INFO!C15=0,\" \",COUNTRY_INFO!C15)","v":"Ouham-Pendé"},{"$f":"IF(OR(COUNTRY_INFO!$U$9:$U$1000=\"T2 (PZQ)\",COUNTRY_INFO!$V$9:$V$1000=\"T2 (PZQ)\"), \"T2 (PZQ)\", \" \")","v":" "},null,null,null,null,0,null,null,null,0," "," "," "," "]
[{"$f":"IF(COUNTRY_INFO!A16=0,\" \",COUNTRY_INFO!A16)","v":"CAR"},{"$f":"IF(COUNTRY_INFO!B16=0,\" \",COUNTRY_INFO!B16)","v":"Région Sanitaire N°4"},{"$f":"IF(COUNTRY_INFO!C16=0,\" \",COUNTRY_INFO!C16)","v":"Ouaka"},{"$f":"IF(OR(COUNTRY_INFO!$U$9:$U$1000=\"T2 (PZQ)\",COUNTRY_INFO!$V$9:$V$1000=\"T2 (PZQ)\"), \"T2 (PZQ)\", \" \")","v":" "},null,null,null,null,0,null,null,null,0," "," "," "," "]
[{"$f":"IF(COUNTRY_INFO!A17=0,\" \",COUNTRY_INFO!A17)","v":"CAR"},{"$f":"IF(COUNTRY_INFO!B17=0,\" \",COUNTRY_INFO!B17)","v":"Région Sanitaire N°4"},{"$f":"IF(COUNTRY_INFO!C17=0,\" \",COUNTRY_INFO!C17)","v":"Kémo"},{"$f":"IF(OR(COUNTRY_INFO!$U$9:$U$1000=\"T2 (PZQ)\",COUNTRY_INFO!$V$9:$V$1000=\"T2 (PZQ)\"), \"T2 (PZQ)\", \" \")","v":" "},null,null,null,null,0,null,null,null,0," "," "," "," "]
[{"$f":"IF(COUNTRY_INFO!A18=0,\" \",COUNTRY_INFO!A18)","v":"CAR"},{"$f":"IF(COUNTRY_INFO!B18=0,\" \",COUNTRY_INFO!B18)","v":"Région Sanitaire N°4"},{"$f":"IF(COUNTRY_INFO!C18=0,\" \",COUNTRY_INFO!C18)","v":"Nana-Gribizi"},{"$f":"IF(OR(COUNTRY_INFO!$U$9:$U$1000=\"T2 (PZQ)\",COUNTRY_INFO!$V$9:$V$1000=\"T2 (PZQ)\"), \"T2 (PZQ)\", \" \")","v":" "},null,null,null,null,0,null,null,null,0," "," "," "," "]
[{"$f":"IF(COUNTRY_INFO!A19=0,\" \",COUNTRY_INFO!A19)","v":"CAR"},{"$f":"IF(COUNTRY_INFO!B19=0,\" \",COUNTRY_INFO!B19)","v":"Région Sanitaire N°5"},{"$f":"IF(COUNTRY_INFO!C19=0,\" \",COUNTRY_INFO!C19)","v":"Haute-Kotto"},{"$f":"IF(OR(COUNTRY_INFO!$U$9:$U$1000=\"T2 (PZQ)\",COUNTRY_INFO!$V$9:$V$1000=\"T2 (PZQ)\"), \"T2 (PZQ)\", \" \")","v":" "},null,null,null,null,0,null,null,null,0," "," "," "," "]
[{"$f":"IF(COUNTRY_INFO!A20=0,\" \",COUNTRY_INFO!A20)","v":"CAR"},{"$f":"IF(COUNTRY_INFO!B20=0,\" \",COUNTRY_INFO!B20)","v":"Région Sanitaire N°5"},{"$f":"IF(COUNTRY_INFO!C20=0,\" \",COUNTRY_INFO!C20)","v":"Bamingui-Bangoran"},{"$f":"IF(OR(COUNTRY_INFO!$U$9:$U$1000=\"T2 (PZQ)\",COUNTRY_INFO!$V$9:$V$1000=\"T2 (PZQ)\"), \"T2 (PZQ)\", \" \")","v":" "},null,null,null,null,0,null,null,null,0," "," "," "," "]
[{"$f":"IF(COUNTRY_INFO!A21=0,\" \",COUNTRY_INFO!A21)","v":"CAR"},{"$f":"IF(COUNTRY_INFO!B21=0,\" \",COUNTRY_INFO!B21)","v":"Région Sanitaire N°5"},{"$f":"IF(COUNTRY_INFO!C21=0,\" \",COUNTRY_INFO!C21)","v":"Vakaga"},{"$f":"IF(OR(COUNTRY_INFO!$U$9:$U$1000=\"T2 (PZQ)\",COUNTRY_INFO!$V$9:$V$1000=\"T2 (PZQ)\"), \"T2 (PZQ)\", \" \")","v":" "},null,null,null,null,0,null,null,null,0," "," "," "," "]
[{"$f":"IF(COUNTRY_INFO!A22=0,\" \",COUNTRY_INFO!A22)","v":"CAR"},{"$f":"IF(COUNTRY_INFO!B22=0,\" \",COUNTRY_INFO!B22)","v":"Région Sanitaire N°6"},{"$f":"IF(COUNTRY_INFO!C22=0,\" \",COUNTRY_INFO!C22)","v":"Mbomou"},{"$f":"IF(OR(COUNTRY_INFO!$U$9:$U$1000=\"T2 (PZQ)\",COUNTRY_INFO!$V$9:$V$1000=\"T2 (PZQ)\"), \"T2 (PZQ)\", \" \")","v":" "},null,null,null,null,0,null,null,null,0," "," "," "," "]
[{"$f":"IF(COUNTRY_INFO!A23=0,\" \",COUNTRY_INFO!A23)","v":"CAR"},{"$f":"IF(COUNTRY_INFO!B23=0,\" \",COUNTRY_INFO!B23)","v":"Région Sanitaire N°6"},{"$f":"IF(COUNTRY_INFO!C23=0,\" \",COUNTRY_INFO!C23)","v":"Basse-Kotto"},{"$f":"IF(OR(COUNTRY_INFO!$U$9:$U$1000=\"T2 (PZQ)\",COUNTRY_INFO!$V$9:$V$1000=\"T2 (PZQ)\"), \"T2 (PZQ)\", \" \")","v":" "},null,null,null,null,0,null,null,null,0," "," "," "," "]
[{"$f":"IF(COUNTRY_INFO!A24=0,\" \",COUNTRY_INFO!A24)","v":"CAR"},{"$f":"IF(COUNTRY_INFO!B24=0,\" \",COUNTRY_INFO!B24)","v":"Région Sanitaire N°6"},{"$f":"IF(COUNTRY_INFO!C24=0,\" \",COUNTRY_INFO!C24)","v":"Haut-Mbomou"},{"$f":"IF(OR(COUNTRY_INFO!$U$9:$U$1000=\"T2 (PZQ)\",COUNTRY_INFO!$V$9:$V$1000=\"T2 (PZQ)\"), \"T2 (PZQ)\", \" \")","v":" "},null,null,null,null,0,null,null,null,0," "," "," "," "]
[{"$f":"IF(COUNTRY_INFO!A25=0,\" \",COUNTRY_INFO!A25)","v":"CAR"},{"$f":"IF(COUNTRY_INFO!B25=0,\" \",COUNTRY_INFO!B25)","v":"Région Sanitaire N°7"},{"$f":"IF(COUNTRY_INFO!C25=0,\" \",COUNTRY_INFO!C25)","v":"BANGUI (8 Unités adm.)"},{"$f":"IF(OR(COUNTRY_INFO!$U$9:$U$1000=\"T2 (PZQ)\",COUNTRY_INFO!$V$9:$V$1000=\"T2 (PZQ)\"), \"T2 (PZQ)\", \" \")","v":" "},null,null,null,null,0,null,null,null,0," "," "," "," "]

{"sheet":"T3_R1","index":7,"n_rows":25,"n_cols":18,"rows_kept":25,"cut":false,"hidden":false,"merged":[[5,6,5,9],[5,10,5,13],[5,14,5,17],[3,0,3,2],[5,0,5,2],[5,3,6,3],[5,5,6,5],[5,4,6,4]]}
["T 3 - Albendazole (ALB) ou Mebendazole (MBD) - Tournée 1"]
["Structure administrative, population nécessitant une chimioprévention par groupe d'âge, population traitée par groupe d'âge et couverture"]
[]
["TOTAL",null,null,null,null,null,{"$f":"SUM(G$9:G$1000)","v":0},0,0,0,0,0,0,0,{"$f":"IF(G4<>0, IF(K4/G4*100=0, \"-\", K4/G4*100), \" \")","v":" "},{"$f":"IF(H4<>0, IF(L4/H4*100=0, \"-\", L4/H4*100), \" \")","v":" "},{"$f":"IF(I4<>0, IF(M4/I4*100=0, \"-\", M4/I4*100), \" \")","v":" "},{"$f":"IF(J4<>0, IF(N4/J4*100=0, \"-\", N4/J4*100), \" \")","v":" "}]
[]
["Structure administrative du pays",null,null,"Mise en oeuvre \nde la CP","Médica-ment","Date","Population ciblée pour T3",null,null,null,"Population traitée",null,null,null,"Couverture du Programme (%)"]
["Pays","Région/Département","District",null,null,null,"EAPréS","EAS","Adultes","Total","EAPréS","EAS","Adultes","Total","EAPréS","EAS","Adultes","Total"]
[]
[{"$f":"IF(COUNTRY_INFO!A9=0,\" \",COUNTRY_INFO!A9)","v":"CAR"},{"$f":"IF(COUNTRY_INFO!B9=0,\" \",COUNTRY_INFO!B9)","v":"Région Sanitaire N°1"},{"$f":"IF(COUNTRY_INFO!C9=0,\" \",COUNTRY_INFO!C9)","v":"Ombella-Mpoko"},{"$f":"IF(OR(COUNTRY_INFO!$U$9:$U$1000=\"T3 (ALB/MBD)\",COUNTRY_INFO!$V$9:$V$1000=\"T3 (ALB/MBD)\"), \"T3 (ALB/MBD)\", \" \")","v":" "},null,null,null,null,null,{"$f":"SUM(G9:I9)","v":0},null,null,null,{"$f":"SUM(K9:M9)","v":0},{"$f":"IF(G9<>0, IF(K9/G9*100=0, \"-\", K9/G9*100), \" \")","v":" "}," "," "," "]
[{"$f":"IF(COUNTRY_INFO!A10=0,\" \",COUNTRY_INFO!A10)","v":"CAR"},{"$f":"IF(COUNTRY_INFO!B10=0,\" \",COUNTRY_INFO!B10)","v":"Région Sanitaire N°1"},{"$f":"IF(COUNTRY_INFO!C10=0,\" \",COUNTRY_INFO!C10)","v":"Lobaye"},{"$f":"IF(OR(COUNTRY_INFO!$U$9:$U$1000=\"T3 (ALB/MBD)\",COUNTRY_INFO!$V$9:$V$1000=\"T3 (ALB/MBD)\"), \"T3 (ALB/MBD)\", \" \")","v":" "},null,null,null,null,null,{"$f":"SUM(G10:I10)","v":0},null,null,null,{"$f":"SUM(K10:M10)","v":0},{"$f":"IF(G10<>0, IF(K10/G10*100=0, \"-\", K10/G10*100), \" \")","v":" "},{"$f":"IF(H10<>0, IF(L10/H10*100=0, \"-\", L10/H10*100), \" \")","v":" "},{"$f":"IF(I10<>0, IF(M10/I10*100=0, \"-\", M10/I10*100), \" \")","v":" "},{"$f":"IF(J10<>0, IF(N10/J10*100=0, \"-\", N10/J10*100), \" \")","v":" "}]
[{"$f":"IF(COUNTRY_INFO!A11=0,\" \",COUNTRY_INFO!A11)","v":"CAR"},{"$f":"IF(COUNTRY_INFO!B11=0,\" \",COUNTRY_INFO!B11)","v":"Région Sanitaire N°2"},{"$f":"IF(COUNTRY_INFO!C11=0,\" \",COUNTRY_INFO!C11)","v":"Mambéré-Kadéï"},{"$f":"IF(OR(COUNTRY_INFO!$U$9:$U$1000=\"T3 (ALB/MBD)\",COUNTRY_INFO!$V$9:$V$1000=\"T3 (ALB/MBD)\"), \"T3 (ALB/MBD)\", \" \")","v":" "},null,null,null,null,null,0,null,null,null,0," "," "," "," "]
[{"$f":"IF(COUNTRY_INFO!A12=0,\" \",COUNTRY_INFO!A12)","v":"CAR"},{"$f":"IF(COUNTRY_INFO!B12=0,\" \",COUNTRY_INFO!B12)","v":"Région Sanitaire N°2"},{"$f":"IF(COUNTRY_INFO!C12=0,\" \",COUNTRY_INFO!C12)","v":"Sangha-Mbaéré"},{"$f":"IF(OR(COUNTRY_INFO!$U$9:$U$1000=\"T3 (ALB/MBD)\",COUNTRY_INFO!$V$9:$V$1000=\"T3 (ALB/MBD)\"), \"T3 (ALB/MBD)\", \" \")","v":" "},null,null,null,null,null,0,null,null,null,0," "," "," "," "]
[{"$f":"IF(COUNTRY_INFO!A13=0,\" \",COUNTRY_INFO!A13)","v":"CAR"},{"$f":"IF(COUNTRY_INFO!B13=0,\" \",COUNTRY_INFO!B13)","v":"Région Sanitaire N°2"},{"$f":"IF(COUNTRY_INFO!C13=0,\" \",COUNTRY_INFO!C13)","v":"Nana-Mambéré"},{"$f":"IF(OR(COUNTRY_INFO!$U$9:$U$1000=\"T3 (ALB/MBD)\",COUNTRY_INFO!$V$9:$V$1000=\"T3 (ALB/MBD)\"), \"T3 (ALB/MBD)\", \" \")","v":" "},null,null,null,null,null,0,null,null,null,0," "," "," "," "]
[{"$f":"IF(COUNTRY_INFO!A14=0,\" \",COUNTRY_INFO!A14)","v":"CAR"},{"$f":"IF(COUNTRY_INFO!B14=0,\" \",COUNTRY_INFO!B14)","v":"Région Sanitaire N°3"},{"$f":"IF(COUNTRY_INFO!C14=0,\" \",COUNTRY_INFO!C14)","v":"Ouham"},{"$f":"IF(OR(COUNTRY_INFO!$U$9:$U$1000=\"T3 (ALB/MBD)\",COUNTRY_INFO!$V$9:$V$1000=\"T3 (ALB/MBD)\"), \"T3 (ALB/MBD)\", \" \")","v":" "},null,null,null,null,null,0,null,null,null,0," "," "," "," "]
[{"$f":"IF(COUNTRY_INFO!A15=0,\" \",COUNTRY_INFO!A15)","v":"CAR"},{"$f":"IF(COUNTRY_INFO!B15=0,\" \",COUNTRY_INFO!B15)","v":"Région Sanitaire N°3"},{"$f":"IF(COUNTRY_INFO!C15=0,\" \",COUNTRY_INFO!C15)","v":"Ouham-Pendé"},{"$f":"IF(OR(COUNTRY_INFO!$U$9:$U$1000=\"T3 (ALB/MBD)\",COUNTRY_INFO!$V$9:$V$1000=\"T3 (ALB/MBD)\"), \"T3 (ALB/MBD)\", \" \")","v":" "},null,null,null,null,null,0,null,null,null,0," "," "," "," "]
[{"$f":"IF(COUNTRY_INFO!A16=0,\" \",COUNTRY_INFO!A16)","v":"CAR"},{"$f":"IF(COUNTRY_INFO!B16=0,\" \",COUNTRY_INFO!B16)","v":"Région Sanitaire N°4"},{"$f":"IF(COUNTRY_INFO!C16=0,\" \",COUNTRY_INFO!C16)","v":"Ouaka"},{"$f":"IF(OR(COUNTRY_INFO!$U$9:$U$1000=\"T3 (ALB/MBD)\",COUNTRY_INFO!$V$9:$V$1000=\"T3 (ALB/MBD)\"), \"T3 (ALB/MBD)\", \" \")","v":" "},null,null,null,null,null,0,null,null,null,0," "," "," "," "]
[{"$f":"IF(COUNTRY_INFO!A17=0,\" \",COUNTRY_INFO!A17)","v":"CAR"},{"$f":"IF(COUNTRY_INFO!B17=0,\" \",COUNTRY_INFO!B17)","v":"Région Sanitaire N°4"},{"$f":"IF(COUNTRY_INFO!C17=0,\" \",COUNTRY_INFO!C17)","v":"Kémo"},{"$f":"IF(OR(COUNTRY_INFO!$U$9:$U$1000=\"T3 (ALB/MBD)\",COUNTRY_INFO!$V$9:$V$1000=\"T3 (ALB/MBD)\"), \"T3 (ALB/MBD)\", \" \")","v":" "},null,null,null,null,null,0,null,null,null,0," "," "," "," "]
[{"$f":"IF(COUNTRY_INFO!A18=0,\" \",COUNTRY_INFO!A18)","v":"CAR"},{"$f":"IF(COUNTRY_INFO!B18=0,\" \",COUNTRY_INFO!B18)","v":"Région Sanitaire N°4"},{"$f":"IF(COUNTRY_INFO!C18=0,\" \",COUNTRY_INFO!C18)","v":"Nana-Gribizi"},{"$f":"IF(OR(COUNTRY_INFO!$U$9:$U$1000=\"T3 (ALB/MBD)\",COUNTRY_INFO!$V$9:$V$1000=\"T3 (ALB/MBD)\"), \"T3 (ALB/MBD)\", \" \")","v":" "},null,null,null,null,null,0,null,null,null,0," "," "," "," "]
[{"$f":"IF(COUNTRY_INFO!A19=0,\" \",COUNTRY_INFO!A19)","v":"CAR"},{"$f":"IF(COUNTRY_INFO!B19=0,\" \",COUNTRY_INFO!B19)","v":"Région Sanitaire N°5"},{"$f":"IF(COUNTRY_INFO!C19=0,\" \",COUNTRY_INFO!C19)","v":"Haute-Kotto"},{"$f":"IF(OR(COUNTRY_INFO!$U$9:$U$1000=\"T3 (ALB/MBD)\",COUNTRY_INFO!$V$9:$V$1000=\"T3 (ALB/MBD)\"), \"T3 (ALB/MBD)\", \" \")","v":" "},null,null,null,null,null,0,null,null,null,0," "," "," "," "]
[{"$f":"IF(COUNTRY_INFO!A20=0,\" \",COUNTRY_INFO!A20)","v":"CAR"},{"$f":"IF(COUNTRY_INFO!B20=0,\" \",COUNTRY_INFO!B20)","v":"Région Sanitaire N°5"},{"$f":"IF(COUNTRY_INFO!C20=0,\" \",COUNTRY_INFO!C20)","v":"Bamingui-Bangoran"},{"$f":"IF(OR(COUNTRY_INFO!$U$9:$U$1000=\"T3 (ALB/MBD)\",COUNTRY_INFO!$V$9:$V$1000=\"T3 (ALB/MBD)\"), \"T3 (ALB/MBD)\", \" \")","v":" "},null,null,null,null,null,0,null,null,null,0," "," "," "," "]
[{"$f":"IF(COUNTRY_INFO!A21=0,\" \",COUNTRY_INFO!A21)","v":"CAR"},{"$f":"IF(COUNTRY_INFO!B21=0,\" \",COUNTRY_INFO!B21)","v":"Région Sanitaire N°5"},{"$f":"IF(COUNTRY_INFO!C21=0,\" \",COUNTRY_INFO!C21)","v":"Vakaga"},{"$f":"IF(OR(COUNTRY_INFO!$U$9:$U$1000=\"T3 (ALB/MBD)\",COUNTRY_INFO!$V$9:$V$1000=\"T3 (ALB/MBD)\"), \"T3 (ALB/MBD)\", \" \")","v":" "},null,null,null,null,null,0,null,null,null,0," "," "," "," "]
[{"$f":"IF(COUNTRY_INFO!A22=0,\" \",COUNTRY_INFO!A22)","v":"CAR"},{"$f":"IF(COUNTRY_INFO!B22=0,\" \",COUNTRY_INFO!B22)","v":"Région Sanitaire N°6"},{"$f":"IF(COUNTRY_INFO!C22=0,\" \",COUNTRY_INFO!C22)","v":"Mbomou"},{"$f":"IF(OR(COUNTRY_INFO!$U$9:$U$1000=\"T3 (ALB/MBD)\",COUNTRY_INFO!$V$9:$V$1000=\"T3 (ALB/MBD)\"), \"T3 (ALB/MBD)\", \" \")","v":" "},null,null,null,null,null,0,null,null,null,0," "," "," "," "]
[{"$f":"IF(COUNTRY_INFO!A23=0,\" \",COUNTRY_INFO!A23)","v":"CAR"},{"$f":"IF(COUNTRY_INFO!B23=0,\" \",COUNTRY_INFO!B23)","v":"Région Sanitaire N°6"},{"$f":"IF(COUNTRY_INFO!C23=0,\" \",COUNTRY_INFO!C23)","v":"Basse-Kotto"},{"$f":"IF(OR(COUNTRY_INFO!$U$9:$U$1000=\"T3 (ALB/MBD)\",COUNTRY_INFO!$V$9:$V$1000=\"T3 (ALB/MBD)\"), \"T3 (ALB/MBD)\", \" \")","v":" "},null,null,null,null,null,0,null,null,null,0," "," "," "," "]
[{"$f":"IF(COUNTRY_INFO!A24=0,\" \",COUNTRY_INFO!A24)","v":"CAR"},{"$f":"IF(COUNTRY_INFO!B24=0,\" \",COUNTRY_INFO!B24)","v":"Région Sanitaire N°6"},{"$f":"IF(COUNTRY_INFO!C24=0,\" \",COUNTRY_INFO!C24)","v":"Haut-Mbomou"},{"$f":"IF(OR(COUNTRY_INFO!$U$9:$U$1000=\"T3 (ALB/MBD)\",COUNTRY_INFO!$V$9:$V$1000=\"T3 (ALB/MBD)\"), \"T3 (ALB/MBD)\", \" \")","v":" "},null,null,null,null,null,0,null,null,null,0," "," "," "," "]
[{"$f":"IF(COUNTRY_INFO!A25=0,\" \",COUNTRY_INFO!A25)","v":"CAR"},{"$f":"IF(COUNTRY_INFO!B25=0,\" \",COUNTRY_INFO!B25)","v":"Région Sanitaire N°7"},{"$f":"IF(COUNTRY_INFO!C25=0,\" \",COUNTRY_INFO!C25)","v":"BANGUI (8 Unités adm.)"},{"$f":"IF(OR(COUNTRY_INFO!$U$9:$U$1000=\"T3 (ALB/MBD)\",COUNTRY_INFO!$V$9:$V$1000=\"T3 (ALB/MBD)\"), \"T3 (ALB/MBD)\", \" \")","v":" "},null,null,null,null,null,0,null,null,null,0," "," "," "," "]

{"sheet":"T3_R2","index":8,"n_rows":25,"n_cols":18,"rows_kept":25,"cut":false,"hidden":false,"merged":[[5,6,5,9],[5,10,5,13],[5,14,5,17],[3,0,3,2],[5,0,5,2],[5,3,6,3],[5,5,6,5],[5,4,6,4]]}
["T 3 - Albendazole (ALB) ou Mebendazole (MBD) - Tournée 2"]
["Structure administrative, population nécessitant une chimioprévention par groupe d'âge, population traitée par groupe d'âge et couverture"]
[]
["TOTAL",null,null,null,null,null,{"$f":"SUM(G$9:G$1000)","v":0},0,0,0,0,0,0,0,{"$f":"IF(G4<>0, IF(K4/G4*100=0, \"-\", K4/G4*100), \" \")","v":" "},{"$f":"IF(H4<>0, IF(L4/H4*100=0, \"-\", L4/H4*100), \" \")","v":" "},{"$f":"IF(I4<>0, IF(M4/I4*100=0, \"-\", M4/I4*100), \" \")","v":" "},{"$f":"IF(J4<>0, IF(N4/J4*100=0, \"-\", N4/J4*100), \" \")","v":" "}]
[]
["Structure administrative du pays",null,null,"Mise en oeuvre \nde la CP","Médica-ment","Date","Population ciblée pour T3",null,null,null,"Population traitée",null,null,null,"Couverture du Programme (%)"]
["Pays","Région/Département","District",null,null,null,"EAPréS","EAS","Adultes","Total","EAPréS","EAS","Adultes","Total","EAPréS","EAS","Adultes","Total"]
[]
[{"$f":"IF(COUNTRY_INFO!A9=0,\" \",COUNTRY_INFO!A9)","v":"CAR"},{"$f":"IF(COUNTRY_INFO!B9=0,\" \",COUNTRY_INFO!B9)","v":"Région Sanitaire N°1"},{"$f":"IF(COUNTRY_INFO!C9=0,\" \",COUNTRY_INFO!C9)","v":"Ombella-Mpoko"},{"$f":"IF(AND(COUNTRY_INFO!$U$9:$U$1000=\"T3 (ALB/MBD)\",COUNTRY_INFO!$V$9:$V$1000=\"T3 (ALB/MBD)\"), \"T3 (ALB/MBD)\", \" \")","v":" "},null,null,null,null,null,{"$f":"SUM(G9:I9)","v":0},null,null,null,{"$f":"SUM(K9:M9)","v":0},{"$f":"IF(G9<>0, IF(K9/G9*100=0, \"-\", K9/G9*100), \" \")","v":" "}," "," "," "]
[{"$f":"IF(COUNTRY_INFO!A10=0,\" \",COUNTRY_INFO!A10)","v":"CAR"},{"$f":"IF(COUNTRY_INFO!B10=0,\" \",COUNTRY_INFO!B10)","v":"Région Sanitaire N°1"},{"$f":"IF(COUNTRY_INFO!C10=0,\" \",COUNTRY_INFO!C10)","v":"Lobaye"},{"$f":"IF(AND(COUNTRY_INFO!$U$9:$U$1000=\"T3 (ALB/MBD)\",COUNTRY_INFO!$V$9:$V$1000=\"T3 (ALB/MBD)\"), \"T3 (ALB/MBD)\", \" \")","v":" "},null,null,null,null,null,{"$f":"SUM(G10:I10)","v":0},null,null,null,{"$f":"SUM(K10:M10)","v":0},{"$f":"IF(G10<>0, IF(K10/G10*100=0, \"-\", K10/G10*100), \" \")","v":" "},{"$f":"IF(H10<>0, IF(L10/H10*100=0, \"-\", L10/H10*100), \" \")","v":" "},{"$f":"IF(I10<>0, IF(M10/I10*100=0, \"-\", M10/I10*100), \" \")","v":" "},{"$f":"IF(J10<>0, IF(N10/J10*100=0, \"-\", N10/J10*100), \" \")","v":" "}]
[{"$f":"IF(COUNTRY_INFO!A11=0,\" \",COUNTRY_INFO!A11)","v":"CAR"},{"$f":"IF(COUNTRY_INFO!B11=0,\" \",COUNTRY_INFO!B11)","v":"Région Sanitaire N°2"},{"$f":"IF(COUNTRY_INFO!C11=0,\" \",COUNTRY_INFO!C11)","v":"Mambéré-Kadéï"},{"$f":"IF(AND(COUNTRY_INFO!$U$9:$U$1000=\"T3 (ALB/MBD)\",COUNTRY_INFO!$V$9:$V$1000=\"T3 (ALB/MBD)\"), \"T3 (ALB/MBD)\", \" \")","v":" "},null,null,null,null,null,0,null,null,null,0," "," "," "," "]
[{"$f":"IF(COUNTRY_INFO!A12=0,\" \",COUNTRY_INFO!A12)","v":"CAR"},{"$f":"IF(COUNTRY_INFO!B12=0,\" \",COUNTRY_INFO!B12)","v":"Région Sanitaire N°2"},{"$f":"IF(COUNTRY_INFO!C12=0,\" \",COUNTRY_INFO!C12)","v":"Sangha-Mbaéré"},{"$f":"IF(AND(COUNTRY_INFO!$U$9:$U$1000=\"T3 (ALB/MBD)\",COUNTRY_INFO!$V$9:$V$1000=\"T3 (ALB/MBD)\"), \"T3 (ALB/MBD)\", \" \")","v":" "},null,null,null,null,null,0,null,null,null,0," "," "," "," "]
[{"$f":"IF(COUNTRY_INFO!A13=0,\" \",COUNTRY_INFO!A13)","v":"CAR"},{"$f":"IF(COUNTRY_INFO!B13=0,\" \",COUNTRY_INFO!B13)","v":"Région Sanitaire N°2"},{"$f":"IF(COUNTRY_INFO!C13=0,\" \",COUNTRY_INFO!C13)","v":"Nana-Mambéré"},{"$f":"IF(AND(COUNTRY_INFO!$U$9:$U$1000=\"T3 (ALB/MBD)\",COUNTRY_INFO!$V$9:$V$1000=\"T3 (ALB/MBD)\"), \"T3 (ALB/MBD)\", \" \")","v":" "},null,null,null,null,null,0,null,null,null,0," "," "," "," "]
[{"$f":"IF(COUNTRY_INFO!A14=0,\" \",COUNTRY_INFO!A14)","v":"CAR"},{"$f":"IF(COUNTRY_INFO!B14=0,\" \",COUNTRY_INFO!B14)","v":"Région Sanitaire N°3"},{"$f":"IF(COUNTRY_INFO!C14=0,\" \",COUNTRY_INFO!C14)","v":"Ouham"},{"$f":"IF(AND(COUNTRY_INFO!$U$9:$U$1000=\"T3 (ALB/MBD)\",COUNTRY_INFO!$V$9:$V$1000=\"T3 (ALB/MBD)\"), \"T3 (ALB/MBD)\", \" \")","v":" "},null,null,null,null,null,0,null,null,null,0," "," "," "," "]
[{"$f":"IF(COUNTRY_INFO!A15=0,\" \",COUNTRY_INFO!A15)","v":"CAR"},{"$f":"IF(COUNTRY_INFO!B15=0,\" \",COUNTRY_INFO!B15)","v":"Région Sanitaire N°3"},{"$f":"IF(COUNTRY_INFO!C15=0,\" \",COUNTRY_INFO!C15)","v":"Ouham-Pendé"},{"$f":"IF(AND(COUNTRY_INFO!$U$9:$U$1000=\"T3 (ALB/MBD)\",COUNTRY_INFO!$V$9:$V$1000=\"T3 (ALB/MBD)\"), \"T3 (ALB/MBD)\", \" \")","v":" "},null,null,null,null,null,0,null,null,null,0," "," "," "," "]
[{"$f":"IF(COUNTRY_INFO!A16=0,\" \",COUNTRY_INFO!A16)","v":"CAR"},{"$f":"IF(COUNTRY_INFO!B16=0,\" \",COUNTRY_INFO!B16)","v":"Région Sanitaire N°4"},{"$f":"IF(COUNTRY_INFO!C16=0,\" \",COUNTRY_INFO!C16)","v":"Ouaka"},{"$f":"IF(AND(COUNTRY_INFO!$U$9:$U$1000=\"T3 (ALB/MBD)\",COUNTRY_INFO!$V$9:$V$1000=\"T3 (ALB/MBD)\"), \"T3 (ALB/MBD)\", \" \")","v":" "},null,null,null,null,null,0,null,null,null,0," "," "," "," "]
[{"$f":"IF(COUNTRY_INFO!A17=0,\" \",COUNTRY_INFO!A17)","v":"CAR"},{"$f":"IF(COUNTRY_INFO!B17=0,\" \",COUNTRY_INFO!B17)","v":"Région Sanitaire N°4"},{"$f":"IF(COUNTRY_INFO!C17=0,\" \",COUNTRY_INFO!C17)","v":"Kémo"},{"$f":"IF(AND(COUNTRY_INFO!$U$9:$U$1000=\"T3 (ALB/MBD)\",COUNTRY_INFO!$V$9:$V$1000=\"T3 (ALB/MBD)\"), \"T3 (ALB/MBD)\", \" \")","v":" "},null,null,null,null,null,0,null,null,null,0," "," "," "," "]
[{"$f":"IF(COUNTRY_INFO!A18=0,\" \",COUNTRY_INFO!A18)","v":"CAR"},{"$f":"IF(COUNTRY_INFO!B18=0,\" \",COUNTRY_INFO!B18)","v":"Région Sanitaire N°4"},{"$f":"IF(COUNTRY_INFO!C18=0,\" \",COUNTRY_INFO!C18)","v":"Nana-Gribizi"},{"$f":"IF(AND(COUNTRY_INFO!$U$9:$U$1000=\"T3 (ALB/MBD)\",COUNTRY_INFO!$V$9:$V$1000=\"T3 (ALB/MBD)\"), \"T3 (ALB/MBD)\", \" \")","v":" "},null,null,null,null,null,0,null,null,null,0," "," "," "," "]
[{"$f":"IF(COUNTRY_INFO!A19=0,\" \",COUNTRY_INFO!A19)","v":"CAR"},{"$f":"IF(COUNTRY_INFO!B19=0,\" \",COUNTRY_INFO!B19)","v":"Région Sanitaire N°5"},{"$f":"IF(COUNTRY_INFO!C19=0,\" \",COUNTRY_INFO!C19)","v":"Haute-Kotto"},{"$f":"IF(AND(COUNTRY_INFO!$U$9:$U$1000=\"T3 (ALB/MBD)\",COUNTRY_INFO!$V$9:$V$1000=\"T3 (ALB/MBD)\"), \"T3 (ALB/MBD)\", \" \")","v":" "},null,null,null,null,null,0,null,null,null,0," "," "," "," "]
[{"$f":"IF(COUNTRY_INFO!A20=0,\" \",COUNTRY_INFO!A20)","v":"CAR"},{"$f":"IF(COUNTRY_INFO!B20=0,\" \",COUNTRY_INFO!B20)","v":"Région Sanitaire N°5"},{"$f":"IF(COUNTRY_INFO!C20=0,\" \",COUNTRY_INFO!C20)","v":"Bamingui-Bangoran"},{"$f":"IF(AND(COUNTRY_INFO!$U$9:$U$1000=\"T3 (ALB/MBD)\",COUNTRY_INFO!$V$9:$V$1000=\"T3 (ALB/MBD)\"), \"T3 (ALB/MBD)\", \" \")","v":" "},null,null,null,null,null,0,null,null,null,0," "," "," "," "]
[{"$f":"IF(COUNTRY_INFO!A21=0,\" \",COUNTRY_INFO!A21)","v":"CAR"},{"$f":"IF(COUNTRY_INFO!B21=0,\" \",COUNTRY_INFO!B21)","v":"Région Sanitaire N°5"},{"$f":"IF(COUNTRY_INFO!C21=0,\" \",COUNTRY_INFO!C21)","v":"Vakaga"},{"$f":"IF(AND(COUNTRY_INFO!$U$9:$U$1000=\"T3 (ALB/MBD)\",COUNTRY_INFO!$V$9:$V$1000=\"T3 (ALB/MBD)\"), \"T3 (ALB/MBD)\", \" \")","v":" "},null,null,null,null,null,0,null,null,null,0," "," "," "," "]
[{"$f":"IF(COUNTRY_INFO!A22=0,\" \",COUNTRY_INFO!A22)","v":"CAR"},{"$f":"IF(COUNTRY_INFO!B22=0,\" \",COUNTRY_INFO!B22)","v":"Région Sanitaire N°6"},{"$f":"IF(COUNTRY_INFO!C22=0,\" \",COUNTRY_INFO!C22)","v":"Mbomou"},{"$f":"IF(AND(COUNTRY_INFO!$U$9:$U$1000=\"T3 (ALB/MBD)\",COUNTRY_INFO!$V$9:$V$1000=\"T3 (ALB/MBD)\"), \"T3 (ALB/MBD)\", \" \")","v":" "},null,null,null,null,null,0,null,null,null,0," "," "," "," "]
[{"$f":"IF(COUNTRY_INFO!A23=0,\" \",COUNTRY_INFO!A23)","v":"CAR"},{"$f":"IF(COUNTRY_INFO!B23=0,\" \",COUNTRY_INFO!B23)","v":"Région Sanitaire N°6"},{"$f":"IF(COUNTRY_INFO!C23=0,\" \",COUNTRY_INFO!C23)","v":"Basse-Kotto"},{"$f":"IF(AND(COUNTRY_INFO!$U$9:$U$1000=\"T3 (ALB/MBD)\",COUNTRY_INFO!$V$9:$V$1000=\"T3 (ALB/MBD)\"), \"T3 (ALB/MBD)\", \" \")","v":" "},null,null,null,null,null,0,null,null,null,0," "," "," "," "]
[{"$f":"IF(COUNTRY_INFO!A24=0,\" \",COUNTRY_INFO!A24)","v":"CAR"},{"$f":"IF(COUNTRY_INFO!B24=0,\" \",COUNTRY_INFO!B24)","v":"Région Sanitaire N°6"},{"$f":"IF(COUNTRY_INFO!C24=0,\" \",COUNTRY_INFO!C24)","v":"Haut-Mbomou"},{"$f":"IF(AND(COUNTRY_INFO!$U$9:$U$1000=\"T3 (ALB/MBD)\",COUNTRY_INFO!$V$9:$V$1000=\"T3 (ALB/MBD)\"), \"T3 (ALB/MBD)\", \" \")","v":" "},null,null,null,null,null,0,null,null,null,0," "," "," "," "]
[{"$f":"IF(COUNTRY_INFO!A25=0,\" \",COUNTRY_INFO!A25)","v":"CAR"},{"$f":"IF(COUNTRY_INFO!B25=0,\" \",COUNTRY_INFO!B25)","v":"Région Sanitaire N°7"},{"$f":"IF(COUNTRY_INFO!C25=0,\" \",COUNTRY_INFO!C25)","v":"BANGUI (8 Unités adm.)"},{"$f":"IF(AND(COUNTRY_INFO!$U$9:$U$1000=\"T3 (ALB/MBD)\",COUNTRY_INFO!$V$9:$V$1000=\"T3 (ALB/MBD)\"), \"T3 (ALB/MBD)\", \" \")","v":" "},null,null,null,null,null,0,null,null,null,0," "," "," "," "]

{"sheet":"DISTRICT","index":9,"n_rows":25,"n_cols":56,"rows_kept":25,"cut":false,"hidden":false,"merged":[[5,26,5,34],[5,3,6,3],[5,9,6,9],[5,15,6,15],[5,25,6,25],[3,0,3,2],[5,0,5,2],[5,4,5,8],[5,10,5,14],[5,16,5,24]]}
["Nombre d'individus traités"]
["Structure administrative, population traitée par groupe d'âge et sexe"]
[]
["TOTAL",null,null,{"$f":"SUM(D$9:D$1000)","v":2633954},{"$f":"SUM(E$9:E$1000)","v":483278},{"$f":"SUM(F$9:F$1000)","v":528570},{"$f":"SUM(G$9:G$1000)","v":1011818},{"$f":"SUM(H$9:H$1000)","v":1011818},{"$f":"IF(D4>0, IF(H4/D4*100<>0, H4/D4*100, \"-\"),0)","v":38.414414222875571},{"$f":"SUM(J$9:J$1000)","v":2688483},{"$f":"SUM(K$9:K$1000)","v":0},{"$f":"SUM(L$9:L$1000)","v":0},{"$f":"SUM(M$9:M$1000)","v":921480},{"$f":"SUM(N$9:N$1000)","v":921480},{"$f":"IF(J4>0, IF(N4/J4*100<>0, N4/J4*100, \"-\"),0)","v":34.275091194550974},{"$f":"SUM(P$9:P$1000)","v":961656},{"$f":"SUM(Q$9:Q$1000)","v":164367},{"$f":"SUM(R$9:R$1000)","v":175339},{"$f":"SUM(S$9:S$1000)","v":1011818},{"$f":"SUM(T$9:T$1000)","v":0},null,331435,null,{"$f":"SUM(X$9:X$1000)","v":331435},{"$f":"IF(P4>0, IF(X4/P4*100<>0, X4/P4*100, \"-\"),0)","v":34.465026995100118},{"$f":"SUM(Z$9:Z$1000)","v":951991.94000000006},0,0,151140,127667.18,null,0,null,127667.18,{"$f":"IF(Z4>0, IF(AH4/Z4*100<>0, AH4/Z4*100, \"-\"),0)","v":13.410531605971368}]
[]
["Structure administrative du pays",null,null,"Population nécessitant la CP pour FL","Population traitée pour la filariose lymphatique",null,null,null,null,"Population nécessitant la CP pour ONCHO","Population traitée pour l'onchocercose",null,null,null,null,"Population nécessitant la CP pour STH","Population traitée pour les géohelminthiases",null,null,null,null,null,null,null,null,"Population nécessitant la CP pour SCH","Population traitée pour la schistosomiase",null,null,null,null,null,null,null,null,null,null,null,null,null,null,{"$f":"SUM(AP9:AP1000)","v":146139.53354607927},576622.41809633677,947813.76809000515,2504819.7060615262,{"$f":"SUM(AT9:AT1000)","v":4175395.4257939477},{"$f":"COUNTIF(AU9:AU1000,\"Y\")","v":7},{"$f":"SUM(AV9:AV1000)","v":0},525190,1306302,{"$f":"SUM(AY9:AY1000)","v":1831492},0,525190,1306302,1831492,{"$f":"IF(AT6<>0,BC6/AT6,0)","v":0.43863917383387552}]
["Pays","Région/Département","District",null,"Masculine","Féminine","Total traité","Total traité ayant besoin de CP","(%)",null,"Masculine","Féminine","Total traité","Total traité ayant besoin de CP","(%)",null,"Masculine","Féminine","Total traité","EAPréS traité ayant besoin de CP","EAPréS (%)","EAS traité ayant besoin de CP","EAS (%)","Total traité ayant besoin de CP","(%)",null,"Masculine","Féminine","Total traité","EAS traité ayant besoin de CP","EAS (%)","Adultes traité ayant besoin de CP","Adultes (%)","Total traité ayant besoin de CP","(%)",null,"LF","ONCHO","STH","SCH-SAC","SCH_Adults","<1","PreSAC","SAC","Adults","Total","Dis","PreSAC","SAC","Adults","Total","PreSAC","SAC","Adults","Total","Coverage"]
[]
[{"$f":"IF(COUNTRY_INFO!A9=0,\" \",COUNTRY_INFO!A9)","v":"CAR"},{"$f":"IF(COUNTRY_INFO!B9=0,\" \",COUNTRY_INFO!B9)","v":"Région Sanitaire N°1"},{"$f":"IF(COUNTRY_INFO!C9=0,\" \",COUNTRY_INFO!C9)","v":"Ombella-Mpoko"},{"$f":"COUNTRY_INFO!M9","v":495965},130661,134995,{"$f":"MAX('MDA1'!M9,'MDA4'!U9)","v":265656},{"$f":"IF(AND(COUNTRY_INFO!H9>0,COUNTRY_INFO!H9<4),IF(D9>MAX('MDA1'!M9,'MDA4'!U9),MAX('MDA1'!M9,'MDA4'!U9),D9),0)","v":265656},{"$f":"IF(AND(COUNTRY_INFO!H9>0,COUNTRY_INFO!H9<4), IF(G9/D9*100<>0, IF(G9/D9*100>100,100,G9/D9*100), \"-\"),0)","v":53.563457098787218},{"$f":"COUNTRY_INFO!N9","v":0},null,null,{"$f":"MAX('MDA1'!M9,MAX('MDA3'!I9,'MDA3'!L9)+MAX('MDA3'!J9,'MDA3'!M9))","v":0},{"$f":"IF(AND(COUNTRY_INFO!I9>0,COUNTRY_INFO!I9<4),IF(J9>MAX('MDA1'!M9,MAX('MDA3'!I9,'MDA3'!L9)+MAX('MDA3'!J9,'MDA3'!M9)),MAX('MDA1'!M9,MAX('MDA3'!I9,'MDA3'!L9)+MAX('MDA3'!J9,'MDA3'!M9)),J9),0)","v":0},{"$f":"IF(AND(COUNTRY_INFO!I9>0,COUNTRY_INFO!I9<4), IF(M9/J9*100<>0, IF(M9/J9*100>100,100,M9/J9*100), \"-\"),0)","v":0},{"$f":"COUNTRY_INFO!O9","v":181077},61170,59685,{"$f":"SUM(MAX('MDA4'!R9, 'T1'!L9, MAX(T3_R1!K9, T3_R2!K9)), MAX('MDA1'!K9, 'MDA4'!S9, 'T1'!M9, MAX(T3_R1!L9, T3_R2!L9)), MAX('MDA1'!L9, 'MDA4'!T9, 'T1'!N9, MAX(T3_R1!M9, T3_R2!M9)))","v":265656},{"$f":"IF(AND(COUNTRY_INFO!J9>1,COUNTRY_INFO!J9<4),IF(COUNTRY_INFO!E9>MAX('MDA4'!R9,'T1'!L9,MAX(T3_R1!K9,T3_R2!K9)),MAX('MDA4'!R9,'T1'!L9,MAX(T3_R1!K9,T3_R2!K9)),COUNTRY_INFO!E9),0)","v":0},{"$f":"IF(AND(COUNTRY_INFO!J9>1,COUNTRY_INFO!J9<4), IF(T9/COUNTRY_INFO!E9*100<>0, IF(T9/COUNTRY_INFO!E9*100>100,100,T9/COUNTRY_INFO!E9*100), \"-\"),0)","v":"-"},{"$f":"IF(AND(COUNTRY_INFO!J9>1,COUNTRY_INFO!J9<4),IF(COUNTRY_INFO!F9>MAX('MDA1'!K9,'MDA4'!S9,'T1'!M9,MAX(T3_R1!L9,T3_R2!L9)),MAX('MDA1'!K9,'MDA4'!S9,'T1'!M9,MAX(T3_R1!L9,T3_R2!L9)),COUNTRY_INFO!F9),0)","v":112584},{"$f":"IF(AND(COUNTRY_INFO!J9>1,COUNTRY_INFO!J9<4), IF(V9/COUNTRY_INFO!F9*100<>0, IF(V9/COUNTRY_INFO!F9*100>100,100,V9/COUNTRY_INFO!F9*100), \"-\"),0)","v":100},{"$f":"SUM(T9,V9)","v":112584},{"$f":"IF(AND(COUNTRY_INFO!J9>1,COUNTRY_INFO!J9<4), IF(S9/P9*100<>0, IF(X9/P9*100>100,100,X9/P9*100), \"-\"),0)","v":62.174654981030166},{"$f":"COUNTRY_INFO!P9","v":410113},null,null,{"$f":"MAX('T1'!L9,'T2'!J9)+MAX('T1'!M9,'T2'!K9)+MAX('T1'!N9,'T2'!L9)","v":63962},{"$f":"IF(COUNTRY_INFO!K9=1,IF(COUNTRY_INFO!F9*0.33>MAX('T1'!M9,'T2'!K9),MAX('T1'!M9,'T2'!K9),COUNTRY_INFO!F9*0.33),IF(COUNTRY_INFO!K9=2,IF(COUNTRY_INFO!F9*0.5>MAX('T1'!M9,'T2'!K9),MAX('T1'!M9,'T2'!K9),COUNTRY_INFO!F9*0.5),IF(COUNTRY_INFO!K9=3,IF(COUNTRY_INFO!F9>MAX('T1'!M9,'T2'!K9),MAX('T1'!M9,'T2'!K9),COUNTRY_INFO!F9),0)))","v":63962},{"$f":"IF(AND(COUNTRY_INFO!K9>0,COUNTRY_INFO!K9<4),IF(Z9>0,IF(COUNTRY_INFO!K9=1, AD9/(COUNTRY_INFO!F9*0.33)*100, IF(COUNTRY_INFO!K9=2, AD9/(COUNTRY_INFO!F9*0.5)*100, IF(COUNTRY_INFO!K9=3, AD9/COUNTRY_INFO!F9*100))),\"-\"),0)","v":56.812690968521281},{"$f":"IF(COUNTRY_INFO!K9=2,IF(COUNTRY_INFO!G9*0.2>MAX('T1'!N9,'T2'!L9),MAX('T1'!N9,'T2'!L9),COUNTRY_INFO!G9*0.2),IF(COUNTRY_INFO!K9=3,IF(COUNTRY_INFO!G9>MAX('T1'!N9,'T2'!L9),MAX('T1'!N9,'T2'!L9),COUNTRY_INFO!G9),0))","v":0},{"$f":"IF(AND(COUNTRY_INFO!K9>0,COUNTRY_INFO!K9<4),IF(Z9>0,IF(COUNTRY_INFO!K9=1, 0, IF(COUNTRY_INFO!K9=2, AF9/(COUNTRY_INFO!G9*0.2)*100, IF(COUNTRY_INFO!K9=3, AF9/COUNTRY_INFO!G9*100))),\"-\"),0)","v":0},{"$f":"SUM(AD9,AF9)","v":63962},{"$f":"IF(AND(COUNTRY_INFO!K9>0,COUNTRY_INFO!K9<4), IF(AC9/Z9*100<>0, IF(AH9/Z9*100>100,100,AH9/Z9*100), \"-\"),0)","v":15.596189342937192},null,{"$f":"IF(AND(D9<>0, D9<>\"Inconnu\",D9<>\"Interrompu\",D9<>\"Non requis\"),D9/COUNTRY_INFO!D9, 0)","v":1},{"$f":"IF(AND(J9<>0,J9<>\"Inconnu\",J9<>\"Interrompu\",J9<>\"Non requis\"),J9/COUNTRY_INFO!D9, 0)","v":0},{"$f":"IF(AND(P9<>0,P9<>\"Inconnu\",P9<>\"Non requis\"),P9/(COUNTRY_INFO!E9+COUNTRY_INFO!F9), 0)","v":1},{"$f":"IF(AND(Z9<>0,Z9<>\"Inconnu\",Z9<>\"Non requis\"),IF(COUNTRY_INFO!K9=1,1,IF(COUNTRY_INFO!K9=2,0.5*COUNTRY_INFO!F9/(0.5*COUNTRY_INFO!F9+0.2*COUNTRY_INFO!G9),IF(COUNTRY_INFO!K9=3,COUNTRY_INFO!F9/(COUNTRY_INFO!F9+COUNTRY_INFO!G9)))),0)","v":0.27451946170933378},{"$f":"IF(AND(Z9<>0,Z9<>\"Inconnu\",Z9<>\"Non requis\"),IF(COUNTRY_INFO!K9=1,0,IF(COUNTRY_INFO!K9=2,0.2*COUNTRY_INFO!G9/(0.5*COUNTRY_INFO!F9+0.2*COUNTRY_INFO!G9),IF(COUNTRY_INFO!K9=3,COUNTRY_INFO!G9/(COUNTRY_INFO!F9+COUNTRY_INFO!G9)))),0)","v":0.72548053829066628},{"$f":"MAX(COUNTRY_INFO!D9*AK9*PROFILE!$G$7,COUNTRY_INFO!D9*AL9*PROFILE!$G$7)","v":17358.859163068693},{"$f":"MAX(COUNTRY_INFO!D9*AK9*PROFILE!$G$8,COUNTRY_INFO!D9*AL9*PROFILE!$G$8,COUNTRY_INFO!D9*AM9*PROFILE!$G$8)","v":68492.810282895298},{"$f":"MAX(COUNTRY_INFO!D9*AK9*PROFILE!$G$9,COUNTRY_INFO!D9*AL9*PROFILE!$G$9,COUNTRY_INFO!D9*AM9*PROFILE!$G$9,IF(AND(DISTRICT!Z9<>\"Inconnu\",Z9<>\"Non requis\"),COUNTRY_INFO!P9*DISTRICT!AN9,0))","v":112584},{"$f":"MAX(COUNTRY_INFO!D9*AK9*PROFILE!$G$10,COUNTRY_INFO!D9*AL9*PROFILE!$G$10,IF(AND(DISTRICT!Z9<>\"Inconnu\",Z9<>\"Non requis\"),COUNTRY_INFO!P9*DISTRICT!AO9,0))","v":297529.38903843187},{"$f":"SUM(AP9:AS9)","v":495965.05848439585},{"$f":"IF(COUNTIFS(AK9:AN9,\">0\")=0,0, IF(COUNTIFS(AK9:AN9,\">0\")<=IF(AND(OR(D9>=0,D9=\"Non requis\",D9=\"Inconnu\",D9=\"Interrompu\"),D9>0,H9>0),1,0)+IF(AND(OR(J9>=0,J9=\"Non requis\",J9=\"Inconnu\",J9=\"Interrompu\"),J9>0,N9>0),1,0)+IF(AND(OR(P9>=0,P9=\"Non requis\",P9=\"Inconnu\"),P9>0,X9>0),1,0)+IF(AND(OR(Z9>=0,Z9=\"Non requis\",Z9=\"Inconnu\"),Z9>0,AH9>0),1,0),\"Y\",0))","v":"Y"},{"$f":"MAX('MDA4'!R9,'T1'!L9,'T2'!J9,T3_R1!K9,T3_R2!K9)","v":0},{"$f":"MAX('MDA1'!K9,'MDA4'!S9,'MDA3'!I9,'MDA3'!L9,'T1'!M9,'T2'!K9,T3_R1!L9,T3_R2!L9)","v":120855},{"$f":"MAX('MDA1'!L9,'MDA4'!T9,'MDA3'!J9,'MDA3'!M9,'T1'!N9,'T2'!L9,T3_R1!M9,T3_R2!M9)","v":144801},{"$f":"SUM(AV9:AX9)","v":265656},{"$f":"MAX('MDA4'!R9,T9)","v":0},{"$f":"MAX('MDA1'!K9,'MDA4'!S9,'MDA3'!I9,'MDA3'!L9,V9,AD9)","v":120855},{"$f":"MAX('MDA1'!L9,'MDA4'!T9,'MDA3'!J9,'MDA3'!M9,AF9)","v":144801},{"$f":"IF(AT9<SUM(AZ9:BB9), AT9,SUM(AZ9:BB9))","v":265656},{"$f":"IF(AT9<>0,BC9/AT9*100,0)","v":53.563450782563173}]
[{"$f":"IF(COUNTRY_INFO!A10=0,\" \",COUNTRY_INFO!A10)","v":"CAR"},{"$f":"IF(COUNTRY_INFO!B10=0,\" \",COUNTRY_INFO!B10)","v":"Région Sanitaire N°1"},{"$f":"IF(COUNTRY_INFO!C10=0,\" \",COUNTRY_INFO!C10)","v":"Lobaye"},{"$f":"COUNTRY_INFO!M10","v":343237},90328,105666,{"$f":"MAX('MDA1'!M10,'MDA4'!U10)","v":195964},{"$f":"IF(AND(COUNTRY_INFO!H10>0,COUNTRY_INFO!H10<4),IF(D10>MAX('MDA1'!M10,'MDA4'!U10),MAX('MDA1'!M10,'MDA4'!U10),D10),0)","v":195964},{"$f":"IF(AND(COUNTRY_INFO!H10>0,COUNTRY_INFO!H10<4), IF(G10/D10*100<>0, IF(G10/D10*100>100,100,G10/D10*100), \"-\"),0)","v":57.092912477384431},{"$f":"COUNTRY_INFO!N10","v":0},null,null,{"$f":"MAX('MDA1'!M10,MAX('MDA3'!I10,'MDA3'!L10)+MAX('MDA3'!J10,'MDA3'!M10))","v":0},{"$f":"IF(AND(COUNTRY_INFO!I10>0,COUNTRY_INFO!I10<4),IF(J10>MAX('MDA1'!M10,MAX('MDA3'!I10,'MDA3'!L10)+MAX('MDA3'!J10,'MDA3'!M10)),MAX('MDA1'!M10,MAX('MDA3'!I10,'MDA3'!L10)+MAX('MDA3'!J10,'MDA3'!M10)),J10),0)","v":0},{"$f":"IF(AND(COUNTRY_INFO!I10>0,COUNTRY_INFO!I10<4), IF(M10/J10*100<>0, IF(M10/J10*100>100,100,M10/J10*100), \"-\"),0)","v":0},{"$f":"COUNTRY_INFO!O10","v":125316},29378,33942,{"$f":"SUM(MAX('MDA4'!R10, 'T1'!L10, MAX(T3_R1!K10, T3_R2!K10)), MAX('MDA1'!K10, 'MDA4'!S10, 'T1'!M10, MAX(T3_R1!L10, T3_R2!L10)), MAX('MDA1'!L10, 'MDA4'!T10, 'T1'!N10, MAX(T3_R1!M10, T3_R2!M10)))","v":195964},{"$f":"IF(AND(COUNTRY_INFO!J10>1,COUNTRY_INFO!J10<4),IF(COUNTRY_INFO!E10>MAX('MDA4'!R10,'T1'!L10,MAX(T3_R1!K10,T3_R2!K10)),MAX('MDA4'!R10,'T1'!L10,MAX(T3_R1!K10,T3_R2!K10)),COUNTRY_INFO!E10),0)","v":0},{"$f":"IF(AND(COUNTRY_INFO!J10>1,COUNTRY_INFO!J10<4), IF(T10/COUNTRY_INFO!E10*100<>0, IF(T10/COUNTRY_INFO!E10*100>100,100,T10/COUNTRY_INFO!E10*100), \"-\"),0)","v":"-"},{"$f":"IF(AND(COUNTRY_INFO!J10>1,COUNTRY_INFO!J10<4),IF(COUNTRY_INFO!F10>MAX('MDA1'!K10,'MDA4'!S10,'T1'!M10,MAX(T3_R1!L10,T3_R2!L10)),MAX('MDA1'!K10,'MDA4'!S10,'T1'!M10,MAX(T3_R1!L10,T3_R2!L10)),COUNTRY_INFO!F10),0)","v":63320},{"$f":"IF(AND(COUNTRY_INFO!J10>1,COUNTRY_INFO!J10<4), IF(V10/COUNTRY_INFO!F10*100<>0, IF(V10/COUNTRY_INFO!F10*100>100,100,V10/COUNTRY_INFO!F10*100), \"-\"),0)","v":81.268048514406715},{"$f":"SUM(T10,V10)","v":63320},{"$f":"IF(AND(COUNTRY_INFO!J10>1,COUNTRY_INFO!J10<4), IF(S10/P10*100<>0, IF(X10/P10*100>100,100,X10/P10*100), \"-\"),0)","v":50.528264547224623},{"$f":"COUNTRY_INFO!P10","v":25711.95},null,null,{"$f":"MAX('T1'!L10,'T2'!J10)+MAX('T1'!M10,'T2'!K10)+MAX('T1'!N10,'T2'!L10)","v":48898},{"$f":"IF(COUNTRY_INFO!K10=1,IF(COUNTRY_INFO!F10*0.33>MAX('T1'!M10,'T2'!K10),MAX('T1'!M10,'T2'!K10),COUNTRY_INFO!F10*0.33),IF(COUNTRY_INFO!K10=2,IF(COUNTRY_INFO!F10*0.5>MAX('T1'!M10,'T2'!K10),MAX('T1'!M10,'T2'!K10),COUNTRY_INFO!F10*0.5),IF(COUNTRY_INFO!K10=3,IF(COUNTRY_INFO!F10>MAX('T1'!M10,'T2'!K10),MAX('T1'!M10,'T2'!K10),COUNTRY_INFO!F10),0)))","v":25711.95},{"$f":"IF(AND(COUNTRY_INFO!K10>0,COUNTRY_INFO!K10<4),IF(Z10>0,IF(COUNTRY_INFO!K10=1, AD10/(COUNTRY_INFO!F10*0.33)*100, IF(COUNTRY_INFO!K10=2, AD10/(COUNTRY_INFO!F10*0.5)*100, IF(COUNTRY_INFO!K10=3, AD10/COUNTRY_INFO!F10*100))),\"-\"),0)","v":100},{"$f":"IF(COUNTRY_INFO!K10=2,IF(COUNTRY_INFO!G10*0.2>MAX('T1'!N10,'T2'!L10),MAX('T1'!N10,'T2'!L10),COUNTRY_INFO!G10*0.2),IF(COUNTRY_INFO!K10=3,IF(COUNTRY_INFO!G10>MAX('T1'!N10,'T2'!L10),MAX('T1'!N10,'T2'!L10),COUNTRY_INFO!G10),0))","v":0},{"$f":"IF(AND(COUNTRY_INFO!K10>0,COUNTRY_INFO!K10<4),IF(Z10>0,IF(COUNTRY_INFO!K10=1, 0, IF(COUNTRY_INFO!K10=2, AF10/(COUNTRY_INFO!G10*0.2)*100, IF(COUNTRY_INFO!K10=3, AF10/COUNTRY_INFO!G10*100))),\"-\"),0)","v":0},{"$f":"SUM(AD10,AF10)","v":25711.95},{"$f":"IF(AND(COUNTRY_INFO!K10>0,COUNTRY_INFO!K10<4), IF(AC10/Z10*100<>0, IF(AH10/Z10*100>100,100,AH10/Z10*100), \"-\"),0)","v":100},null,{"$f":"IF(AND(D10<>0, D10<>\"Inconnu\",D10<>\"Interrompu\",D10<>\"Non requis\"),D10/COUNTRY_INFO!D10, 0)","v":1},{"$f":"IF(AND(J10<>0,J10<>\"Inconnu\",J10<>\"Interrompu\",J10<>\"Non requis\"),J10/COUNTRY_INFO!D10, 0)","v":0},{"$f":"IF(AND(P10<>0,P10<>\"Inconnu\",P10<>\"Non requis\"),P10/(COUNTRY_INFO!E10+COUNTRY_INFO!F10), 0)","v":1},{"$f":"IF(AND(Z10<>0,Z10<>\"Inconnu\",Z10<>\"Non requis\"),IF(COUNTRY_INFO!K10=1,1,IF(COUNTRY_INFO!K10=2,0.5*COUNTRY_INFO!F10/(0.5*COUNTRY_INFO!F10+0.2*COUNTRY_INFO!G10),IF(COUNTRY_INFO!K10=3,COUNTRY_INFO!F10/(COUNTRY_INFO!F10+COUNTRY_INFO!G10)))),0)","v":1},{"$f":"IF(AND(Z10<>0,Z10<>\"Inconnu\",Z10<>\"Non requis\"),IF(COUNTRY_INFO!K10=1,0,IF(COUNTRY_INFO!K10=2,0.2*COUNTRY_INFO!G10/(0.5*COUNTRY_INFO!F10+0.2*COUNTRY_INFO!G10),IF(COUNTRY_INFO!K10=3,COUNTRY_INFO!G10/(COUNTRY_INFO!F10+COUNTRY_INFO!G10)))),0)","v":0},{"$f":"MAX(COUNTRY_INFO!D10*AK10*PROFILE!$G$7,COUNTRY_INFO!D10*AL10*PROFILE!$G$7)","v":12013.35324580204},{"$f":"MAX(COUNTRY_INFO!D10*AK10*PROFILE!$G$8,COUNTRY_INFO!D10*AL10*PROFILE!$G$8,COUNTRY_INFO!D10*AM10*PROFILE!$G$8)","v":47401.060000343037},{"$f":"MAX(COUNTRY_INFO!D10*AK10*PROFILE!$G$9,COUNTRY_INFO!D10*AL10*PROFILE!$G$9,COUNTRY_INFO!D10*AM10*PROFILE!$G$9,IF(AND(DISTRICT!Z10<>\"Inconnu\",Z10<>\"Non requis\"),COUNTRY_INFO!P10*DISTRICT!AN10,0))","v":77914.720462112091},{"$f":"MAX(COUNTRY_INFO!D10*AK10*PROFILE!$G$10,COUNTRY_INFO!D10*AL10*PROFILE!$G$10,IF(AND(DISTRICT!Z10<>\"Inconnu\",Z10<>\"Non requis\"),COUNTRY_INFO!P10*DISTRICT!AO10,0))","v":205907.86629174286},{"$f":"SUM(AP10:AS10)","v":343237},"Y",{"$f":"MAX('MDA4'!R10,'T1'!L10,'T2'!J10,T3_R1!K10,T3_R2!K10)","v":0},{"$f":"MAX('MDA1'!K10,'MDA4'!S10,'MDA3'!I10,'MDA3'!L10,'T1'!M10,'T2'!K10,T3_R1!L10,T3_R2!L10)","v":63320},{"$f":"MAX('MDA1'!L10,'MDA4'!T10,'MDA3'!J10,'MDA3'!M10,'T1'!N10,'T2'!L10,T3_R1!M10,T3_R2!M10)","v":132644},{"$f":"SUM(AV10:AX10)","v":195964},{"$f":"MAX('MDA4'!R10,T10)","v":0},{"$f":"MAX('MDA1'!K10,'MDA4'!S10,'MDA3'!I10,'MDA3'!L10,V10,AD10)","v":63320},{"$f":"MAX('MDA1'!L10,'MDA4'!T10,'MDA3'!J10,'MDA3'!M10,AF10)","v":132644},195964,57.092912477384431]
[{"$f":"IF(COUNTRY_INFO!A11=0,\" \",COUNTRY_INFO!A11)","v":"CAR"},{"$f":"IF(COUNTRY_INFO!B11=0,\" \",COUNTRY_INFO!B11)","v":"Région Sanitaire N°2"},{"$f":"IF(COUNTRY_INFO!C11=0,\" \",COUNTRY_INFO!C11)","v":"Mambéré-Kadéï"},{"$f":"COUNTRY_INFO!M11","v":507184},159860,179886,{"$f":"MAX('MDA1'!M11,'MDA4'!U11)","v":339746},{"$f":"IF(AND(COUNTRY_INFO!H11>0,COUNTRY_INFO!H11<4),IF(D11>MAX('MDA1'!M11,'MDA4'!U11),MAX('MDA1'!M11,'MDA4'!U11),D11),0)","v":339746},{"$f":"IF(AND(COUNTRY_INFO!H11>0,COUNTRY_INFO!H11<4), IF(G11/D11*100<>0, IF(G11/D11*100>100,100,G11/D11*100), \"-\"),0)","v":66.986734597305912},{"$f":"COUNTRY_INFO!N11","v":0},null,null,{"$f":"MAX('MDA1'!M11,MAX('MDA3'!I11,'MDA3'!L11)+MAX('MDA3'!J11,'MDA3'!M11))","v":0},{"$f":"IF(AND(COUNTRY_INFO!I11>0,COUNTRY_INFO!I11<4),IF(J11>MAX('MDA1'!M11,MAX('MDA3'!I11,'MDA3'!L11)+MAX('MDA3'!J11,'MDA3'!M11)),MAX('MDA1'!M11,MAX('MDA3'!I11,'MDA3'!L11)+MAX('MDA3'!J11,'MDA3'!M11)),J11),0)","v":0},{"$f":"IF(AND(COUNTRY_INFO!I11>0,COUNTRY_INFO!I11<4), IF(M11/J11*100<>0, IF(M11/J11*100>100,100,M11/J11*100), \"-\"),0)","v":0},{"$f":"COUNTRY_INFO!O11","v":185173},40094,46154,{"$f":"SUM(MAX('MDA4'!R11, 'T1'!L11, MAX(T3_R1!K11, T3_R2!K11)), MAX('MDA1'!K11, 'MDA4'!S11, 'T1'!M11, MAX(T3_R1!L11, T3_R2!L11)), MAX('MDA1'!L11, 'MDA4'!T11, 'T1'!N11, MAX(T3_R1!M11, T3_R2!M11)))","v":339746},{"$f":"IF(AND(COUNTRY_INFO!J11>1,COUNTRY_INFO!J11<4),IF(COUNTRY_INFO!E11>MAX('MDA4'!R11,'T1'!L11,MAX(T3_R1!K11,T3_R2!K11)),MAX('MDA4'!R11,'T1'!L11,MAX(T3_R1!K11,T3_R2!K11)),COUNTRY_INFO!E11),0)","v":0},{"$f":"IF(AND(COUNTRY_INFO!J11>1,COUNTRY_INFO!J11<4), IF(T11/COUNTRY_INFO!E11*100<>0, IF(T11/COUNTRY_INFO!E11*100>100,100,T11/COUNTRY_INFO!E11*100), \"-\"),0)","v":"-"},{"$f":"IF(AND(COUNTRY_INFO!J11>1,COUNTRY_INFO!J11<4),IF(COUNTRY_INFO!F11>MAX('MDA1'!K11,'MDA4'!S11,'T1'!M11,MAX(T3_R1!L11,T3_R2!L11)),MAX('MDA1'!K11,'MDA4'!S11,'T1'!M11,MAX(T3_R1!L11,T3_R2!L11)),COUNTRY_INFO!F11),0)","v":86248},{"$f":"IF(AND(COUNTRY_INFO!J11>1,COUNTRY_INFO!J11<4), IF(V11/COUNTRY_INFO!F11*100<>0, IF(V11/COUNTRY_INFO!F11*100>100,100,V11/COUNTRY_INFO!F11*100), \"-\"),0)","v":74.912925276424247},86248,{"$f":"IF(AND(COUNTRY_INFO!J11>1,COUNTRY_INFO!J11<4), IF(S11/P11*100<>0, IF(X11/P11*100>100,100,X11/P11*100), \"-\"),0)","v":46.576984765597579},{"$f":"COUNTRY_INFO!P11","v":37993.230000000003},null,null,{"$f":"MAX('T1'!L11,'T2'!J11)+MAX('T1'!M11,'T2'!K11)+MAX('T1'!N11,'T2'!L11)","v":38280},{"$f":"IF(COUNTRY_INFO!K11=1,IF(COUNTRY_INFO!F11*0.33>MAX('T1'!M11,'T2'!K11),MAX('T1'!M11,'T2'!K11),COUNTRY_INFO!F11*0.33),IF(COUNTRY_INFO!K11=2,IF(COUNTRY_INFO!F11*0.5>MAX('T1'!M11,'T2'!K11),MAX('T1'!M11,'T2'!K11),COUNTRY_INFO!F11*0.5),IF(COUNTRY_INFO!K11=3,IF(COUNTRY_INFO!F11>MAX('T1'!M11,'T2'!K11),MAX('T1'!M11,'T2'!K11),COUNTRY_INFO!F11),0)))","v":37993.230000000003},{"$f":"IF(AND(COUNTRY_INFO!K11>0,COUNTRY_INFO!K11<4),IF(Z11>0,IF(COUNTRY_INFO!K11=1, AD11/(COUNTRY_INFO!F11*0.33)*100, IF(COUNTRY_INFO!K11=2, AD11/(COUNTRY_INFO!F11*0.5)*100, IF(COUNTRY_INFO!K11=3, AD11/COUNTRY_INFO!F11*100))),\"-\"),0)","v":100},{"$f":"IF(COUNTRY_INFO!K11=2,IF(COUNTRY_INFO!G11*0.2>MAX('T1'!N11,'T2'!L11),MAX('T1'!N11,'T2'!L11),COUNTRY_INFO!G11*0.2),IF(COUNTRY_INFO!K11=3,IF(COUNTRY_INFO!G11>MAX('T1'!N11,'T2'!L11),MAX('T1'!N11,'T2'!L11),COUNTRY_INFO!G11),0))","v":0},{"$f":"IF(AND(COUNTRY_INFO!K11>0,COUNTRY_INFO!K11<4),IF(Z11>0,IF(COUNTRY_INFO!K11=1, 0, IF(COUNTRY_INFO!K11=2, AF11/(COUNTRY_INFO!G11*0.2)*100, IF(COUNTRY_INFO!K11=3, AF11/COUNTRY_INFO!G11*100))),\"-\"),0)","v":0},37993.230000000003,{"$f":"IF(AND(COUNTRY_INFO!K11>0,COUNTRY_INFO!K11<4), IF(AC11/Z11*100<>0, IF(AH11/Z11*100>100,100,AH11/Z11*100), \"-\"),0)","v":100},null,{"$f":"IF(AND(D11<>0, D11<>\"Inconnu\",D11<>\"Interrompu\",D11<>\"Non requis\"),D11/COUNTRY_INFO!D11, 0)","v":1},{"$f":"IF(AND(J11<>0,J11<>\"Inconnu\",J11<>\"Interrompu\",J11<>\"Non requis\"),J11/COUNTRY_INFO!D11, 0)","v":0},{"$f":"IF(AND(P11<>0,P11<>\"Inconnu\",P11<>\"Non requis\"),P11/(COUNTRY_INFO!E11+COUNTRY_INFO!F11), 0)","v":1},{"$f":"IF(AND(Z11<>0,Z11<>\"Inconnu\",Z11<>\"Non requis\"),IF(COUNTRY_INFO!K11=1,1,IF(COUNTRY_INFO!K11=2,0.5*COUNTRY_INFO!F11/(0.5*COUNTRY_INFO!F11+0.2*COUNTRY_INFO!G11),IF(COUNTRY_INFO!K11=3,COUNTRY_INFO!F11/(COUNTRY_INFO!F11+COUNTRY_INFO!G11)))),0)","v":1},{"$f":"IF(AND(Z11<>0,Z11<>\"Inconnu\",Z11<>\"Non requis\"),IF(COUNTRY_INFO!K11=1,0,IF(COUNTRY_INFO!K11=2,0.2*COUNTRY_INFO!G11/(0.5*COUNTRY_INFO!F11+0.2*COUNTRY_INFO!G11),IF(COUNTRY_INFO!K11=3,COUNTRY_INFO!G11/(COUNTRY_INFO!F11+COUNTRY_INFO!G11)))),0)","v":0},{"$f":"MAX(COUNTRY_INFO!D11*AK11*PROFILE!$G$7,COUNTRY_INFO!D11*AL11*PROFILE!$G$7)","v":17751.526066883413},{"$f":"MAX(COUNTRY_INFO!D11*AK11*PROFILE!$G$8,COUNTRY_INFO!D11*AL11*PROFILE!$G$8,COUNTRY_INFO!D11*AM11*PROFILE!$G$8)","v":70042.155173288382},{"$f":"MAX(COUNTRY_INFO!D11*AK11*PROFILE!$G$9,COUNTRY_INFO!D11*AL11*PROFILE!$G$9,COUNTRY_INFO!D11*AM11*PROFILE!$G$9,IF(AND(DISTRICT!Z11<>\"Inconnu\",Z11<>\"Non requis\"),COUNTRY_INFO!P11*DISTRICT!AN11,0))","v":115130.65194852494},{"$f":"MAX(COUNTRY_INFO!D11*AK11*PROFILE!$G$10,COUNTRY_INFO!D11*AL11*PROFILE!$G$10,IF(AND(DISTRICT!Z11<>\"Inconnu\",Z11<>\"Non requis\"),COUNTRY_INFO!P11*DISTRICT!AO11,0))","v":304259.66681130329},507184,"Y",{"$f":"MAX('MDA4'!R11,'T1'!L11,'T2'!J11,T3_R1!K11,T3_R2!K11)","v":0},{"$f":"MAX('MDA1'!K11,'MDA4'!S11,'MDA3'!I11,'MDA3'!L11,'T1'!M11,'T2'!K11,T3_R1!L11,T3_R2!L11)","v":86248},{"$f":"MAX('MDA1'!L11,'MDA4'!T11,'MDA3'!J11,'MDA3'!M11,'T1'!N11,'T2'!L11,T3_R1!M11,T3_R2!M11)","v":253498},339746,{"$f":"MAX('MDA4'!R11,T11)","v":0},{"$f":"MAX('MDA1'!K11,'MDA4'!S11,'MDA3'!I11,'MDA3'!L11,V11,AD11)","v":86248},{"$f":"MAX('MDA1'!L11,'MDA4'!T11,'MDA3'!J11,'MDA3'!M11,AF11)","v":253498},339746,66.986734597305912]
[{"$f":"IF(COUNTRY_INFO!A12=0,\" \",COUNTRY_INFO!A12)","v":"CAR"},{"$f":"IF(COUNTRY_INFO!B12=0,\" \",COUNTRY_INFO!B12)","v":"Région Sanitaire N°2"},{"$f":"IF(COUNTRY_INFO!C12=0,\" \",COUNTRY_INFO!C12)","v":"Sangha-Mbaéré"},{"$f":"COUNTRY_INFO!M12","v":140526},54912,53734,{"$f":"MAX('MDA1'!M12,'MDA4'!U12)","v":108646},{"$f":"IF(AND(COUNTRY_INFO!H12>0,COUNTRY_INFO!H12<4),IF(D12>MAX('MDA1'!M12,'MDA4'!U12),MAX('MDA1'!M12,'MDA4'!U12),D12),0)","v":108646},{"$f":"IF(AND(COUNTRY_INFO!H12>0,COUNTRY_INFO!H12<4), IF(G12/D12*100<>0, IF(G12/D12*100>100,100,G12/D12*100), \"-\"),0)","v":77.313806697692954},{"$f":"COUNTRY_INFO!N12","v":0},null,null,{"$f":"MAX('MDA1'!M12,MAX('MDA3'!I12,'MDA3'!L12)+MAX('MDA3'!J12,'MDA3'!M12))","v":0},{"$f":"IF(AND(COUNTRY_INFO!I12>0,COUNTRY_INFO!I12<4),IF(J12>MAX('MDA1'!M12,MAX('MDA3'!I12,'MDA3'!L12)+MAX('MDA3'!J12,'MDA3'!M12)),MAX('MDA1'!M12,MAX('MDA3'!I12,'MDA3'!L12)+MAX('MDA3'!J12,'MDA3'!M12)),J12),0)","v":0},{"$f":"IF(AND(COUNTRY_INFO!I12>0,COUNTRY_INFO!I12<4), IF(M12/J12*100<>0, IF(M12/J12*100>100,100,M12/J12*100), \"-\"),0)","v":0},{"$f":"COUNTRY_INFO!O12","v":51306},15966,15488,{"$f":"SUM(MAX('MDA4'!R12, 'T1'!L12, MAX(T3_R1!K12, T3_R2!K12)), MAX('MDA1'!K12, 'MDA4'!S12, 'T1'!M12, MAX(T3_R1!L12, T3_R2!L12)), MAX('MDA1'!L12, 'MDA4'!T12, 'T1'!N12, MAX(T3_R1!M12, T3_R2!M12)))","v":108646},{"$f":"IF(AND(COUNTRY_INFO!J12>1,COUNTRY_INFO!J12<4),IF(COUNTRY_INFO!E12>MAX('MDA4'!R12,'T1'!L12,MAX(T3_R1!K12,T3_R2!K12)),MAX('MDA4'!R12,'T1'!L12,MAX(T3_R1!K12,T3_R2!K12)),COUNTRY_INFO!E12),0)","v":0},{"$f":"IF(AND(COUNTRY_INFO!J12>1,COUNTRY_INFO!J12<4), IF(T12/COUNTRY_INFO!E12*100<>0, IF(T12/COUNTRY_INFO!E12*100>100,100,T12/COUNTRY_INFO!E12*100), \"-\"),0)","v":"-"},{"$f":"IF(AND(COUNTRY_INFO!J12>1,COUNTRY_INFO!J12<4),IF(COUNTRY_INFO!F12>MAX('MDA1'!K12,'MDA4'!S12,'T1'!M12,MAX(T3_R1!L12,T3_R2!L12)),MAX('MDA1'!K12,'MDA4'!S12,'T1'!M12,MAX(T3_R1!L12,T3_R2!L12)),COUNTRY_INFO!F12),0)","v":31454},{"$f":"IF(AND(COUNTRY_INFO!J12>1,COUNTRY_INFO!J12<4), IF(V12/COUNTRY_INFO!F12*100<>0, IF(V12/COUNTRY_INFO!F12*100>100,100,V12/COUNTRY_INFO!F12*100), \"-\"),0)","v":98.604971942694135},31454,{"$f":"IF(AND(COUNTRY_INFO!J12>1,COUNTRY_INFO!J12<4), IF(S12/P12*100<>0, IF(X12/P12*100>100,100,X12/P12*100), \"-\"),0)","v":61.30666978521031},{"$f":"COUNTRY_INFO!P12","v":0},null,null,{"$f":"MAX('T1'!L12,'T2'!J12)+MAX('T1'!M12,'T2'!K12)+MAX('T1'!N12,'T2'!L12)","v":0},{"$f":"IF(COUNTRY_INFO!K12=1,IF(COUNTRY_INFO!F12*0.33>MAX('T1'!M12,'T2'!K12),MAX('T1'!M12,'T2'!K12),COUNTRY_INFO!F12*0.33),IF(COUNTRY_INFO!K12=2,IF(COUNTRY_INFO!F12*0.5>MAX('T1'!M12,'T2'!K12),MAX('T1'!M12,'T2'!K12),COUNTRY_INFO!F12*0.5),IF(COUNTRY_INFO!K12=3,IF(COUNTRY_INFO!F12>MAX('T1'!M12,'T2'!K12),MAX('T1'!M12,'T2'!K12),COUNTRY_INFO!F12),0)))","v":0},{"$f":"IF(AND(COUNTRY_INFO!K12>0,COUNTRY_INFO!K12<4),IF(Z12>0,IF(COUNTRY_INFO!K12=1, AD12/(COUNTRY_INFO!F12*0.33)*100, IF(COUNTRY_INFO!K12=2, AD12/(COUNTRY_INFO!F12*0.5)*100, IF(COUNTRY_INFO!K12=3, AD12/COUNTRY_INFO!F12*100))),\"-\"),0)","v":0},{"$f":"IF(COUNTRY_INFO!K12=2,IF(COUNTRY_INFO!G12*0.2>MAX('T1'!N12,'T2'!L12),MAX('T1'!N12,'T2'!L12),COUNTRY_INFO!G12*0.2),IF(COUNTRY_INFO!K12=3,IF(COUNTRY_INFO!G12>MAX('T1'!N12,'T2'!L12),MAX('T1'!N12,'T2'!L12),COUNTRY_INFO!G12),0))","v":0},{"$f":"IF(AND(COUNTRY_INFO!K12>0,COUNTRY_INFO!K12<4),IF(Z12>0,IF(COUNTRY_INFO!K12=1, 0, IF(COUNTRY_INFO!K12=2, AF12/(COUNTRY_INFO!G12*0.2)*100, IF(COUNTRY_INFO!K12=3, AF12/COUNTRY_INFO!G12*100))),\"-\"),0)","v":0},0,{"$f":"IF(AND(COUNTRY_INFO!K12>0,COUNTRY_INFO!K12<4), IF(AC12/Z12*100<>0, IF(AH12/Z12*100>100,100,AH12/Z12*100), \"-\"),0)","v":0},null,{"$f":"IF(AND(D12<>0, D12<>\"Inconnu\",D12<>\"Interrompu\",D12<>\"Non requis\"),D12/COUNTRY_INFO!D12, 0)","v":1},{"$f":"IF(AND(J12<>0,J12<>\"Inconnu\",J12<>\"Interrompu\",J12<>\"Non requis\"),J12/COUNTRY_INFO!D12, 0)","v":0},{"$f":"IF(AND(P12<>0,P12<>\"Inconnu\",P12<>\"Non requis\"),P12/(COUNTRY_INFO!E12+COUNTRY_INFO!F12), 0)","v":1},{"$f":"IF(AND(Z12<>0,Z12<>\"Inconnu\",Z12<>\"Non requis\"),IF(COUNTRY_INFO!K12=1,1,IF(COUNTRY_INFO!K12=2,0.5*COUNTRY_INFO!F12/(0.5*COUNTRY_INFO!F12+0.2*COUNTRY_INFO!G12),IF(COUNTRY_INFO!K12=3,COUNTRY_INFO!F12/(COUNTRY_INFO!F12+COUNTRY_INFO!G12)))),0)","v":0},{"$f":"IF(AND(Z12<>0,Z12<>\"Inconnu\",Z12<>\"Non requis\"),IF(COUNTRY_INFO!K12=1,0,IF(COUNTRY_INFO!K12=2,0.2*COUNTRY_INFO!G12/(0.5*COUNTRY_INFO!F12+0.2*COUNTRY_INFO!G12),IF(COUNTRY_INFO!K12=3,COUNTRY_INFO!G12/(COUNTRY_INFO!F12+COUNTRY_INFO!G12)))),0)","v":0},{"$f":"MAX(COUNTRY_INFO!D12*AK12*PROFILE!$G$7,COUNTRY_INFO!D12*AL12*PROFILE!$G$7)","v":4918.4338466411764},{"$f":"MAX(COUNTRY_INFO!D12*AK12*PROFILE!$G$8,COUNTRY_INFO!D12*AL12*PROFILE!$G$8,COUNTRY_INFO!D12*AM12*PROFILE!$G$8)","v":19406.653005381722},{"$f":"MAX(COUNTRY_INFO!D12*AK12*PROFILE!$G$9,COUNTRY_INFO!D12*AL12*PROFILE!$G$9,COUNTRY_INFO!D12*AM12*PROFILE!$G$9,IF(AND(DISTRICT!Z12<>\"Inconnu\",Z12<>\"Non requis\"),COUNTRY_INFO!P12*DISTRICT!AN12,0))","v":31899.369845496738},{"$f":"MAX(COUNTRY_INFO!D12*AK12*PROFILE!$G$10,COUNTRY_INFO!D12*AL12*PROFILE!$G$10,IF(AND(DISTRICT!Z12<>\"Inconnu\",Z12<>\"Non requis\"),COUNTRY_INFO!P12*DISTRICT!AO12,0))","v":84301.543302480379},140526,"Y",{"$f":"MAX('MDA4'!R12,'T1'!L12,'T2'!J12,T3_R1!K12,T3_R2!K12)","v":0},{"$f":"MAX('MDA1'!K12,'MDA4'!S12,'MDA3'!I12,'MDA3'!L12,'T1'!M12,'T2'!K12,T3_R1!L12,T3_R2!L12)","v":31454},{"$f":"MAX('MDA1'!L12,'MDA4'!T12,'MDA3'!J12,'MDA3'!M12,'T1'!N12,'T2'!L12,T3_R1!M12,T3_R2!M12)","v":77192},108646,{"$f":"MAX('MDA4'!R12,T12)","v":0},{"$f":"MAX('MDA1'!K12,'MDA4'!S12,'MDA3'!I12,'MDA3'!L12,V12,AD12)","v":31454},{"$f":"MAX('MDA1'!L12,'MDA4'!T12,'MDA3'!J12,'MDA3'!M12,AF12)","v":77192},108646,77.313806697692954]
[{"$f":"IF(COUNTRY_INFO!A13=0,\" \",COUNTRY_INFO!A13)","v":"CAR"},{"$f":"IF(COUNTRY_INFO!B13=0,\" \",COUNTRY_INFO!B13)","v":"Région Sanitaire N°2"},{"$f":"IF(COUNTRY_INFO!C13=0,\" \",COUNTRY_INFO!C13)","v":"Nana-Mambéré"},{"$f":"COUNTRY_INFO!M13","v":"Inconnu"},null,null,{"$f":"MAX('MDA1'!M13,'MDA4'!U13)","v":0},{"$f":"IF(AND(COUNTRY_INFO!H13>0,COUNTRY_INFO!H13<4),IF(D13>MAX('MDA1'!M13,'MDA4'!U13),MAX('MDA1'!M13,'MDA4'!U13),D13),0)","v":0},{"$f":"IF(AND(COUNTRY_INFO!H13>0,COUNTRY_INFO!H13<4), IF(G13/D13*100<>0, IF(G13/D13*100>100,100,G13/D13*100), \"-\"),0)","v":0},{"$f":"COUNTRY_INFO!N13","v":0},null,null,{"$f":"MAX('MDA1'!M13,MAX('MDA3'!I13,'MDA3'!L13)+MAX('MDA3'!J13,'MDA3'!M13))","v":0},{"$f":"IF(AND(COUNTRY_INFO!I13>0,COUNTRY_INFO!I13<4),IF(J13>MAX('MDA1'!M13,MAX('MDA3'!I13,'MDA3'!L13)+MAX('MDA3'!J13,'MDA3'!M13)),MAX('MDA1'!M13,MAX('MDA3'!I13,'MDA3'!L13)+MAX('MDA3'!J13,'MDA3'!M13)),J13),0)","v":0},{"$f":"IF(AND(COUNTRY_INFO!I13>0,COUNTRY_INFO!I13<4), IF(M13/J13*100<>0, IF(M13/J13*100>100,100,M13/J13*100), \"-\"),0)","v":0},{"$f":"COUNTRY_INFO!O13","v":"Inconnu"},null,null,{"$f":"SUM(MAX('MDA4'!R13, 'T1'!L13, MAX(T3_R1!K13, T3_R2!K13)), MAX('MDA1'!K13, 'MDA4'!S13, 'T1'!M13, MAX(T3_R1!L13, T3_R2!L13)), MAX('MDA1'!L13, 'MDA4'!T13, 'T1'!N13, MAX(T3_R1!M13, T3_R2!M13)))","v":0},{"$f":"IF(AND(COUNTRY_INFO!J13>1,COUNTRY_INFO!J13<4),IF(COUNTRY_INFO!E13>MAX('MDA4'!R13,'T1'!L13,MAX(T3_R1!K13,T3_R2!K13)),MAX('MDA4'!R13,'T1'!L13,MAX(T3_R1!K13,T3_R2!K13)),COUNTRY_INFO!E13),0)","v":0},{"$f":"IF(AND(COUNTRY_INFO!J13>1,COUNTRY_INFO!J13<4), IF(T13/COUNTRY_INFO!E13*100<>0, IF(T13/COUNTRY_INFO!E13*100>100,100,T13/COUNTRY_INFO!E13*100), \"-\"),0)","v":0},{"$f":"IF(AND(COUNTRY_INFO!J13>1,COUNTRY_INFO!J13<4),IF(COUNTRY_INFO!F13>MAX('MDA1'!K13,'MDA4'!S13,'T1'!M13,MAX(T3_R1!L13,T3_R2!L13)),MAX('MDA1'!K13,'MDA4'!S13,'T1'!M13,MAX(T3_R1!L13,T3_R2!L13)),COUNTRY_INFO!F13),0)","v":0},{"$f":"IF(AND(COUNTRY_INFO!J13>1,COUNTRY_INFO!J13<4), IF(V13/COUNTRY_INFO!F13*100<>0, IF(V13/COUNTRY_INFO!F13*100>100,100,V13/COUNTRY_INFO!F13*100), \"-\"),0)","v":0},0,{"$f":"IF(AND(COUNTRY_INFO!J13>1,COUNTRY_INFO!J13<4), IF(S13/P13*100<>0, IF(X13/P13*100>100,100,X13/P13*100), \"-\"),0)","v":0},{"$f":"COUNTRY_INFO!P13","v":"Inconnu"},null,null,{"$f":"MAX('T1'!L13,'T2'!J13)+MAX('T1'!M13,'T2'!K13)+MAX('T1'!N13,'T2'!L13)","v":0},{"$f":"IF(COUNTRY_INFO!K13=1,IF(COUNTRY_INFO!F13*0.33>MAX('T1'!M13,'T2'!K13),MAX('T1'!M13,'T2'!K13),COUNTRY_INFO!F13*0.33),IF(COUNTRY_INFO!K13=2,IF(COUNTRY_INFO!F13*0.5>MAX('T1'!M13,'T2'!K13),MAX('T1'!M13,'T2'!K13),COUNTRY_INFO!F13*0.5),IF(COUNTRY_INFO!K13=3,IF(COUNTRY_INFO!F13>MAX('T1'!M13,'T2'!K13),MAX('T1'!M13,'T2'!K13),COUNTRY_INFO!F13),0)))","v":0},{"$f":"IF(AND(COUNTRY_INFO!K13>0,COUNTRY_INFO!K13<4),IF(Z13>0,IF(COUNTRY_INFO!K13=1, AD13/(COUNTRY_INFO!F13*0.33)*100, IF(COUNTRY_INFO!K13=2, AD13/(COUNTRY_INFO!F13*0.5)*100, IF(COUNTRY_INFO!K13=3, AD13/COUNTRY_INFO!F13*100))),\"-\"),0)","v":0},{"$f":"IF(COUNTRY_INFO!K13=2,IF(COUNTRY_INFO!G13*0.2>MAX('T1'!N13,'T2'!L13),MAX('T1'!N13,'T2'!L13),COUNTRY_INFO!G13*0.2),IF(COUNTRY_INFO!K13=3,IF(COUNTRY_INFO!G13>MAX('T1'!N13,'T2'!L13),MAX('T1'!N13,'T2'!L13),COUNTRY_INFO!G13),0))","v":0},{"$f":"IF(AND(COUNTRY_INFO!K13>0,COUNTRY_INFO!K13<4),IF(Z13>0,IF(COUNTRY_INFO!K13=1, 0, IF(COUNTRY_INFO!K13=2, AF13/(COUNTRY_INFO!G13*0.2)*100, IF(COUNTRY_INFO!K13=3, AF13/COUNTRY_INFO!G13*100))),\"-\"),0)","v":0},0,{"$f":"IF(AND(COUNTRY_INFO!K13>0,COUNTRY_INFO!K13<4), IF(AC13/Z13*100<>0, IF(AH13/Z13*100>100,100,AH13/Z13*100), \"-\"),0)","v":0},null,{"$f":"IF(AND(D13<>0, D13<>\"Inconnu\",D13<>\"Interrompu\",D13<>\"Non requis\"),D13/COUNTRY_INFO!D13, 0)","v":0},{"$f":"IF(AND(J13<>0,J13<>\"Inconnu\",J13<>\"Interrompu\",J13<>\"Non requis\"),J13/COUNTRY_INFO!D13, 0)","v":0},{"$f":"IF(AND(P13<>0,P13<>\"Inconnu\",P13<>\"Non requis\"),P13/(COUNTRY_INFO!E13+COUNTRY_INFO!F13), 0)","v":0},{"$f":"IF(AND(Z13<>0,Z13<>\"Inconnu\",Z13<>\"Non requis\"),IF(COUNTRY_INFO!K13=1,1,IF(COUNTRY_INFO!K13=2,0.5*COUNTRY_INFO!F13/(0.5*COUNTRY_INFO!F13+0.2*COUNTRY_INFO!G13),IF(COUNTRY_INFO!K13=3,COUNTRY_INFO!F13/(COUNTRY_INFO!F13+COUNTRY_INFO!G13)))),0)","v":0},{"$f":"IF(AND(Z13<>0,Z13<>\"Inconnu\",Z13<>\"Non requis\"),IF(COUNTRY_INFO!K13=1,0,IF(COUNTRY_INFO!K13=2,0.2*COUNTRY_INFO!G13/(0.5*COUNTRY_INFO!F13+0.2*COUNTRY_INFO!G13),IF(COUNTRY_INFO!K13=3,COUNTRY_INFO!G13/(COUNTRY_INFO!F13+COUNTRY_INFO!G13)))),0)","v":0},{"$f":"MAX(COUNTRY_INFO!D13*AK13*PROFILE!$G$7,COUNTRY_INFO!D13*AL13*PROFILE!$G$7)","v":0},{"$f":"MAX(COUNTRY_INFO!D13*AK13*PROFILE!$G$8,COUNTRY_INFO!D13*AL13*PROFILE!$G$8,COUNTRY_INFO!D13*AM13*PROFILE!$G$8)","v":0},{"$f":"MAX(COUNTRY_INFO!D13*AK13*PROFILE!$G$9,COUNTRY_INFO!D13*AL13*PROFILE!$G$9,COUNTRY_INFO!D13*AM13*PROFILE!$G$9,IF(AND(DISTRICT!Z13<>\"Inconnu\",Z13<>\"Non requis\"),COUNTRY_INFO!P13*DISTRICT!AN13,0))","v":0},{"$f":"MAX(COUNTRY_INFO!D13*AK13*PROFILE!$G$10,COUNTRY_INFO!D13*AL13*PROFILE!$G$10,IF(AND(DISTRICT!Z13<>\"Inconnu\",Z13<>\"Non requis\"),COUNTRY_INFO!P13*DISTRICT!AO13,0))","v":0},0,0,{"$f":"MAX('MDA4'!R13,'T1'!L13,'T2'!J13,T3_R1!K13,T3_R2!K13)","v":0},{"$f":"MAX('MDA1'!K13,'MDA4'!S13,'MDA3'!I13,'MDA3'!L13,'T1'!M13,'T2'!K13,T3_R1!L13,T3_R2!L13)","v":0},{"$f":"MAX('MDA1'!L13,'MDA4'!T13,'MDA3'!J13,'MDA3'!M13,'T1'!N13,'T2'!L13,T3_R1!M13,T3_R2!M13)","v":0},0,{"$f":"MAX('MDA4'!R13,T13)","v":0},{"$f":"MAX('MDA1'!K13,'MDA4'!S13,'MDA3'!I13,'MDA3'!L13,V13,AD13)","v":0},{"$f":"MAX('MDA1'!L13,'MDA4'!T13,'MDA3'!J13,'MDA3'!M13,AF13)","v":0},0,0]
[{"$f":"IF(COUNTRY_INFO!A14=0,\" \",COUNTRY_INFO!A14)","v":"CAR"},{"$f":"IF(COUNTRY_INFO!B14=0,\" \",COUNTRY_INFO!B14)","v":"Région Sanitaire N°3"},{"$f":"IF(COUNTRY_INFO!C14=0,\" \",COUNTRY_INFO!C14)","v":"Ouham"},{"$f":"COUNTRY_INFO!M14","v":"Inconnu"},null,null,{"$f":"MAX('MDA1'!M14,'MDA4'!U14)","v":0},{"$f":"IF(AND(COUNTRY_INFO!H14>0,COUNTRY_INFO!H14<4),IF(D14>MAX('MDA1'!M14,'MDA4'!U14),MAX('MDA1'!M14,'MDA4'!U14),D14),0)","v":0},{"$f":"IF(AND(COUNTRY_INFO!H14>0,COUNTRY_INFO!H14<4), IF(G14/D14*100<>0, IF(G14/D14*100>100,100,G14/D14*100), \"-\"),0)","v":0},{"$f":"COUNTRY_INFO!N14","v":513337},null,null,{"$f":"MAX('MDA1'!M14,MAX('MDA3'!I14,'MDA3'!L14)+MAX('MDA3'!J14,'MDA3'!M14))","v":376955},{"$f":"IF(AND(COUNTRY_INFO!I14>0,COUNTRY_INFO!I14<4),IF(J14>MAX('MDA1'!M14,MAX('MDA3'!I14,'MDA3'!L14)+MAX('MDA3'!J14,'MDA3'!M14)),MAX('MDA1'!M14,MAX('MDA3'!I14,'MDA3'!L14)+MAX('MDA3'!J14,'MDA3'!M14)),J14),0)","v":376955},{"$f":"IF(AND(COUNTRY_INFO!I14>0,COUNTRY_INFO!I14<4), IF(M14/J14*100<>0, IF(M14/J14*100>100,100,M14/J14*100), \"-\"),0)","v":73.432267691594404},{"$f":"COUNTRY_INFO!O14","v":"Inconnu"},null,null,{"$f":"SUM(MAX('MDA4'!R14, 'T1'!L14, MAX(T3_R1!K14, T3_R2!K14)), MAX('MDA1'!K14, 'MDA4'!S14, 'T1'!M14, MAX(T3_R1!L14, T3_R2!L14)), MAX('MDA1'!L14, 'MDA4'!T14, 'T1'!N14, MAX(T3_R1!M14, T3_R2!M14)))","v":0},{"$f":"IF(AND(COUNTRY_INFO!J14>1,COUNTRY_INFO!J14<4),IF(COUNTRY_INFO!E14>MAX('MDA4'!R14,'T1'!L14,MAX(T3_R1!K14,T3_R2!K14)),MAX('MDA4'!R14,'T1'!L14,MAX(T3_R1!K14,T3_R2!K14)),COUNTRY_INFO!E14),0)","v":0},{"$f":"IF(AND(COUNTRY_INFO!J14>1,COUNTRY_INFO!J14<4), IF(T14/COUNTRY_INFO!E14*100<>0, IF(T14/COUNTRY_INFO!E14*100>100,100,T14/COUNTRY_INFO!E14*100), \"-\"),0)","v":0},{"$f":"IF(AND(COUNTRY_INFO!J14>1,COUNTRY_INFO!J14<4),IF(COUNTRY_INFO!F14>MAX('MDA1'!K14,'MDA4'!S14,'T1'!M14,MAX(T3_R1!L14,T3_R2!L14)),MAX('MDA1'!K14,'MDA4'!S14,'T1'!M14,MAX(T3_R1!L14,T3_R2!L14)),COUNTRY_INFO!F14),0)","v":0},{"$f":"IF(AND(COUNTRY_INFO!J14>1,COUNTRY_INFO!J14<4), IF(V14/COUNTRY_INFO!F14*100<>0, IF(V14/COUNTRY_INFO!F14*100>100,100,V14/COUNTRY_INFO!F14*100), \"-\"),0)","v":0},0,{"$f":"IF(AND(COUNTRY_INFO!J14>1,COUNTRY_INFO!J14<4), IF(S14/P14*100<>0, IF(X14/P14*100>100,100,X14/P14*100), \"-\"),0)","v":0},{"$f":"COUNTRY_INFO!P14","v":"Inconnu"},null,null,{"$f":"MAX('T1'!L14,'T2'!J14)+MAX('T1'!M14,'T2'!K14)+MAX('T1'!N14,'T2'!L14)","v":0},{"$f":"IF(COUNTRY_INFO!K14=1,IF(COUNTRY_INFO!F14*0.33>MAX('T1'!M14,'T2'!K14),MAX('T1'!M14,'T2'!K14),COUNTRY_INFO!F14*0.33),IF(COUNTRY_INFO!K14=2,IF(COUNTRY_INFO!F14*0.5>MAX('T1'!M14,'T2'!K14),MAX('T1'!M14,'T2'!K14),COUNTRY_INFO!F14*0.5),IF(COUNTRY_INFO!K14=3,IF(COUNTRY_INFO!F14>MAX('T1'!M14,'T2'!K14),MAX('T1'!M14,'T2'!K14),COUNTRY_INFO!F14),0)))","v":0},{"$f":"IF(AND(COUNTRY_INFO!K14>0,COUNTRY_INFO!K14<4),IF(Z14>0,IF(COUNTRY_INFO!K14=1, AD14/(COUNTRY_INFO!F14*0.33)*100, IF(COUNTRY_INFO!K14=2, AD14/(COUNTRY_INFO!F14*0.5)*100, IF(COUNTRY_INFO!K14=3, AD14/COUNTRY_INFO!F14*100))),\"-\"),0)","v":0},{"$f":"IF(COUNTRY_INFO!K14=2,IF(COUNTRY_INFO!G14*0.2>MAX('T1'!N14,'T2'!L14),MAX('T1'!N14,'T2'!L14),COUNTRY_INFO!G14*0.2),IF(COUNTRY_INFO!K14=3,IF(COUNTRY_INFO!G14>MAX('T1'!N14,'T2'!L14),MAX('T1'!N14,'T2'!L14),COUNTRY_INFO!G14),0))","v":0},{"$f":"IF(AND(COUNTRY_INFO!K14>0,COUNTRY_INFO!K14<4),IF(Z14>0,IF(COUNTRY_INFO!K14=1, 0, IF(COUNTRY_INFO!K14=2, AF14/(COUNTRY_INFO!G14*0.2)*100, IF(COUNTRY_INFO!K14=3, AF14/COUNTRY_INFO!G14*100))),\"-\"),0)","v":0},0,{"$f":"IF(AND(COUNTRY_INFO!K14>0,COUNTRY_INFO!K14<4), IF(AC14/Z14*100<>0, IF(AH14/Z14*100>100,100,AH14/Z14*100), \"-\"),0)","v":0},null,{"$f":"IF(AND(D14<>0, D14<>\"Inconnu\",D14<>\"Interrompu\",D14<>\"Non requis\"),D14/COUNTRY_INFO!D14, 0)","v":0},{"$f":"IF(AND(J14<>0,J14<>\"Inconnu\",J14<>\"Interrompu\",J14<>\"Non requis\"),J14/COUNTRY_INFO!D14, 0)","v":1},{"$f":"IF(AND(P14<>0,P14<>\"Inconnu\",P14<>\"Non requis\"),P14/(COUNTRY_INFO!E14+COUNTRY_INFO!F14), 0)","v":0},{"$f":"IF(AND(Z14<>0,Z14<>\"Inconnu\",Z14<>\"Non requis\"),IF(COUNTRY_INFO!K14=1,1,IF(COUNTRY_INFO!K14=2,0.5*COUNTRY_INFO!F14/(0.5*COUNTRY_INFO!F14+0.2*COUNTRY_INFO!G14),IF(COUNTRY_INFO!K14=3,COUNTRY_INFO!F14/(COUNTRY_INFO!F14+COUNTRY_INFO!G14)))),0)","v":0},{"$f":"IF(AND(Z14<>0,Z14<>\"Inconnu\",Z14<>\"Non requis\"),IF(COUNTRY_INFO!K14=1,0,IF(COUNTRY_INFO!K14=2,0.2*COUNTRY_INFO!G14/(0.5*COUNTRY_INFO!F14+0.2*COUNTRY_INFO!G14),IF(COUNTRY_INFO!K14=3,COUNTRY_INFO!G14/(COUNTRY_INFO!F14+COUNTRY_INFO!G14)))),0)","v":0},{"$f":"MAX(COUNTRY_INFO!D14*AK14*PROFILE!$G$7,COUNTRY_INFO!D14*AL14*PROFILE!$G$7)","v":17966.882111020321},{"$f":"MAX(COUNTRY_INFO!D14*AK14*PROFILE!$G$8,COUNTRY_INFO!D14*AL14*PROFILE!$G$8,COUNTRY_INFO!D14*AM14*PROFILE!$G$8)","v":70891.885016464119},{"$f":"MAX(COUNTRY_INFO!D14*AK14*PROFILE!$G$9,COUNTRY_INFO!D14*AL14*PROFILE!$G$9,COUNTRY_INFO!D14*AM14*PROFILE!$G$9,IF(AND(DISTRICT!Z14<>\"Inconnu\",Z14<>\"Non requis\"),COUNTRY_INFO!P14*DISTRICT!AN14,0))","v":116527.38154062421},{"$f":"MAX(COUNTRY_INFO!D14*AK14*PROFILE!$G$10,COUNTRY_INFO!D14*AL14*PROFILE!$G$10,IF(AND(DISTRICT!Z14<>\"Inconnu\",Z14<>\"Non requis\"),COUNTRY_INFO!P14*DISTRICT!AO14,0))","v":307950.85133189138},513337,"Y",{"$f":"MAX('MDA4'!R14,'T1'!L14,'T2'!J14,T3_R1!K14,T3_R2!K14)","v":0},{"$f":"MAX('MDA1'!K14,'MDA4'!S14,'MDA3'!I14,'MDA3'!L14,'T1'!M14,'T2'!K14,T3_R1!L14,T3_R2!L14)","v":84629},{"$f":"MAX('MDA1'!L14,'MDA4'!T14,'MDA3'!J14,'MDA3'!M14,'T1'!N14,'T2'!L14,T3_R1!M14,T3_R2!M14)","v":292326},376955,{"$f":"MAX('MDA4'!R14,T14)","v":0},{"$f":"MAX('MDA1'!K14,'MDA4'!S14,'MDA3'!I14,'MDA3'!L14,V14,AD14)","v":84629},{"$f":"MAX('MDA1'!L14,'MDA4'!T14,'MDA3'!J14,'MDA3'!M14,AF14)","v":292326},376955,73.432267691594404]
[{"$f":"IF(COUNTRY_INFO!A15=0,\" \",COUNTRY_INFO!A15)","v":"CAR"},{"$f":"IF(COUNTRY_INFO!B15=0,\" \",COUNTRY_INFO!B15)","v":"Région Sanitaire N°3"},{"$f":"IF(COUNTRY_INFO!C15=0,\" \",COUNTRY_INFO!C15)","v":"Ouham-Pendé"},{"$f":"COUNTRY_INFO!M15","v":"Inconnu"},null,null,{"$f":"MAX('MDA1'!M15,'MDA4'!U15)","v":0},{"$f":"IF(AND(COUNTRY_INFO!H15>0,COUNTRY_INFO!H15<4),IF(D15>MAX('MDA1'!M15,'MDA4'!U15),MAX('MDA1'!M15,'MDA4'!U15),D15),0)","v":0},{"$f":"IF(AND(COUNTRY_INFO!H15>0,COUNTRY_INFO!H15<4), IF(G15/D15*100<>0, IF(G15/D15*100>100,100,G15/D15*100), \"-\"),0)","v":0},{"$f":"COUNTRY_INFO!N15","v":598545},null,null,{"$f":"MAX('MDA1'!M15,MAX('MDA3'!I15,'MDA3'!L15)+MAX('MDA3'!J15,'MDA3'!M15))","v":368364},{"$f":"IF(AND(COUNTRY_INFO!I15>0,COUNTRY_INFO!I15<4),IF(J15>MAX('MDA1'!M15,MAX('MDA3'!I15,'MDA3'!L15)+MAX('MDA3'!J15,'MDA3'!M15)),MAX('MDA1'!M15,MAX('MDA3'!I15,'MDA3'!L15)+MAX('MDA3'!J15,'MDA3'!M15)),J15),0)","v":368364},{"$f":"IF(AND(COUNTRY_INFO!I15>0,COUNTRY_INFO!I15<4), IF(M15/J15*100<>0, IF(M15/J15*100>100,100,M15/J15*100), \"-\"),0)","v":61.543242362729622},{"$f":"COUNTRY_INFO!O15","v":"Inconnu"},null,null,{"$f":"SUM(MAX('MDA4'!R15, 'T1'!L15, MAX(T3_R1!K15, T3_R2!K15)), MAX('MDA1'!K15, 'MDA4'!S15, 'T1'!M15, MAX(T3_R1!L15, T3_R2!L15)), MAX('MDA1'!L15, 'MDA4'!T15, 'T1'!N15, MAX(T3_R1!M15, T3_R2!M15)))","v":0},{"$f":"IF(AND(COUNTRY_INFO!J15>1,COUNTRY_INFO!J15<4),IF(COUNTRY_INFO!E15>MAX('MDA4'!R15,'T1'!L15,MAX(T3_R1!K15,T3_R2!K15)),MAX('MDA4'!R15,'T1'!L15,MAX(T3_R1!K15,T3_R2!K15)),COUNTRY_INFO!E15),0)","v":0},{"$f":"IF(AND(COUNTRY_INFO!J15>1,COUNTRY_INFO!J15<4), IF(T15/COUNTRY_INFO!E15*100<>0, IF(T15/COUNTRY_INFO!E15*100>100,100,T15/COUNTRY_INFO!E15*100), \"-\"),0)","v":0},{"$f":"IF(AND(COUNTRY_INFO!J15>1,COUNTRY_INFO!J15<4),IF(COUNTRY_INFO!F15>MAX('MDA1'!K15,'MDA4'!S15,'T1'!M15,MAX(T3_R1!L15,T3_R2!L15)),MAX('MDA1'!K15,'MDA4'!S15,'T1'!M15,MAX(T3_R1!L15,T3_R2!L15)),COUNTRY_INFO!F15),0)","v":0},{"$f":"IF(AND(COUNTRY_INFO!J15>1,COUNTRY_INFO!J15<4), IF(V15/COUNTRY_INFO!F15*100<>0, IF(V15/COUNTRY_INFO!F15*100>100,100,V15/COUNTRY_INFO!F15*100), \"-\"),0)","v":0},0,{"$f":"IF(AND(COUNTRY_INFO!J15>1,COUNTRY_INFO!J15<4), IF(S15/P15*100<>0, IF(X15/P15*100>100,100,X15/P15*100), \"-\"),0)","v":0},{"$f":"COUNTRY_INFO!P15","v":"Inconnu"},null,null,{"$f":"MAX('T1'!L15,'T2'!J15)+MAX('T1'!M15,'T2'!K15)+MAX('T1'!N15,'T2'!L15)","v":0},{"$f":"IF(COUNTRY_INFO!K15=1,IF(COUNTRY_INFO!F15*0.33>MAX('T1'!M15,'T2'!K15),MAX('T1'!M15,'T2'!K15),COUNTRY_INFO!F15*0.33),IF(COUNTRY_INFO!K15=2,IF(COUNTRY_INFO!F15*0.5>MAX('T1'!M15,'T2'!K15),MAX('T1'!M15,'T2'!K15),COUNTRY_INFO!F15*0.5),IF(COUNTRY_INFO!K15=3,IF(COUNTRY_INFO!F15>MAX('T1'!M15,'T2'!K15),MAX('T1'!M15,'T2'!K15),COUNTRY_INFO!F15),0)))","v":0},{"$f":"IF(AND(COUNTRY_INFO!K15>0,COUNTRY_INFO!K15<4),IF(Z15>0,IF(COUNTRY_INFO!K15=1, AD15/(COUNTRY_INFO!F15*0.33)*100, IF(COUNTRY_INFO!K15=2, AD15/(COUNTRY_INFO!F15*0.5)*100, IF(COUNTRY_INFO!K15=3, AD15/COUNTRY_INFO!F15*100))),\"-\"),0)","v":0},{"$f":"IF(COUNTRY_INFO!K15=2,IF(COUNTRY_INFO!G15*0.2>MAX('T1'!N15,'T2'!L15),MAX('T1'!N15,'T2'!L15),COUNTRY_INFO!G15*0.2),IF(COUNTRY_INFO!K15=3,IF(COUNTRY_INFO!G15>MAX('T1'!N15,'T2'!L15),MAX('T1'!N15,'T2'!L15),COUNTRY_INFO!G15),0))","v":0},{"$f":"IF(AND(COUNTRY_INFO!K15>0,COUNTRY_INFO!K15<4),IF(Z15>0,IF(COUNTRY_INFO!K15=1, 0, IF(COUNTRY_INFO!K15=2, AF15/(COUNTRY_INFO!G15*0.2)*100, IF(COUNTRY_INFO!K15=3, AF15/COUNTRY_INFO!G15*100))),\"-\"),0)","v":0},0,{"$f":"IF(AND(COUNTRY_INFO!K15>0,COUNTRY_INFO!K15<4), IF(AC15/Z15*100<>0, IF(AH15/Z15*100>100,100,AH15/Z15*100), \"-\"),0)","v":0},null,{"$f":"IF(AND(D15<>0, D15<>\"Inconnu\",D15<>\"Interrompu\",D15<>\"Non requis\"),D15/COUNTRY_INFO!D15, 0)","v":0},{"$f":"IF(AND(J15<>0,J15<>\"Inconnu\",J15<>\"Interrompu\",J15<>\"Non requis\"),J15/COUNTRY_INFO!D15, 0)","v":1},{"$f":"IF(AND(P15<>0,P15<>\"Inconnu\",P15<>\"Non requis\"),P15/(COUNTRY_INFO!E15+COUNTRY_INFO!F15), 0)","v":0},{"$f":"IF(AND(Z15<>0,Z15<>\"Inconnu\",Z15<>\"Non requis\"),IF(COUNTRY_INFO!K15=1,1,IF(COUNTRY_INFO!K15=2,0.5*COUNTRY_INFO!F15/(0.5*COUNTRY_INFO!F15+0.2*COUNTRY_INFO!G15),IF(COUNTRY_INFO!K15=3,COUNTRY_INFO!F15/(COUNTRY_INFO!F15+COUNTRY_INFO!G15)))),0)","v":0},{"$f":"IF(AND(Z15<>0,Z15<>\"Inconnu\",Z15<>\"Non requis\"),IF(COUNTRY_INFO!K15=1,0,IF(COUNTRY_INFO!K15=2,0.2*COUNTRY_INFO!G15/(0.5*COUNTRY_INFO!F15+0.2*COUNTRY_INFO!G15),IF(COUNTRY_INFO!K15=3,COUNTRY_INFO!G15/(COUNTRY_INFO!F15+COUNTRY_INFO!G15)))),0)","v":0},{"$f":"MAX(COUNTRY_INFO!D15*AK15*PROFILE!$G$7,COUNTRY_INFO!D15*AL15*PROFILE!$G$7)","v":20949.176570441363},{"$f":"MAX(COUNTRY_INFO!D15*AK15*PROFILE!$G$8,COUNTRY_INFO!D15*AL15*PROFILE!$G$8,COUNTRY_INFO!D15*AM15*PROFILE!$G$8)","v":82659.117338472613},{"$f":"MAX(COUNTRY_INFO!D15*AK15*PROFILE!$G$9,COUNTRY_INFO!D15*AL15*PROFILE!$G$9,COUNTRY_INFO!D15*AM15*PROFILE!$G$9,IF(AND(DISTRICT!Z15<>\"Inconnu\",Z15<>\"Non requis\"),COUNTRY_INFO!P15*DISTRICT!AN15,0))","v":135869.57804372747},{"$f":"MAX(COUNTRY_INFO!D15*AK15*PROFILE!$G$10,COUNTRY_INFO!D15*AL15*PROFILE!$G$10,IF(AND(DISTRICT!Z15<>\"Inconnu\",Z15<>\"Non requis\"),COUNTRY_INFO!P15*DISTRICT!AO15,0))","v":359067.12804735859},598545,"Y",{"$f":"MAX('MDA4'!R15,'T1'!L15,'T2'!J15,T3_R1!K15,T3_R2!K15)","v":0},{"$f":"MAX('MDA1'!K15,'MDA4'!S15,'MDA3'!I15,'MDA3'!L15,'T1'!M15,'T2'!K15,T3_R1!L15,T3_R2!L15)","v":83898},{"$f":"MAX('MDA1'!L15,'MDA4'!T15,'MDA3'!J15,'MDA3'!M15,'T1'!N15,'T2'!L15,T3_R1!M15,T3_R2!M15)","v":284466},368364,{"$f":"MAX('MDA4'!R15,T15)","v":0},{"$f":"MAX('MDA1'!K15,'MDA4'!S15,'MDA3'!I15,'MDA3'!L15,V15,AD15)","v":83898},{"$f":"MAX('MDA1'!L15,'MDA4'!T15,'MDA3'!J15,'MDA3'!M15,AF15)","v":284466},368364,61.543242362729622]
[{"$f":"IF(COUNTRY_INFO!A16=0,\" \",COUNTRY_INFO!A16)","v":"CAR"},{"$f":"IF(COUNTRY_INFO!B16=0,\" \",COUNTRY_INFO!B16)","v":"Région Sanitaire N°4"},{"$f":"IF(COUNTRY_INFO!C16=0,\" \",COUNTRY_INFO!C16)","v":"Ouaka"},{"$f":"COUNTRY_INFO!M16","v":392681},null,null,{"$f":"MAX('MDA1'!M16,'MDA4'!U16)","v":0},{"$f":"IF(AND(COUNTRY_INFO!H16>0,COUNTRY_INFO!H16<4),IF(D16>MAX('MDA1'!M16,'MDA4'!U16),MAX('MDA1'!M16,'MDA4'!U16),D16),0)","v":0},{"$f":"IF(AND(COUNTRY_INFO!H16>0,COUNTRY_INFO!H16<4), IF(G16/D16*100<>0, IF(G16/D16*100>100,100,G16/D16*100), \"-\"),0)","v":"-"},{"$f":"COUNTRY_INFO!N16","v":392681},null,null,{"$f":"MAX('MDA1'!M16,MAX('MDA3'!I16,'MDA3'!L16)+MAX('MDA3'!J16,'MDA3'!M16))","v":0},{"$f":"IF(AND(COUNTRY_INFO!I16>0,COUNTRY_INFO!I16<4),IF(J16>MAX('MDA1'!M16,MAX('MDA3'!I16,'MDA3'!L16)+MAX('MDA3'!J16,'MDA3'!M16)),MAX('MDA1'!M16,MAX('MDA3'!I16,'MDA3'!L16)+MAX('MDA3'!J16,'MDA3'!M16)),J16),0)","v":0},{"$f":"IF(AND(COUNTRY_INFO!I16>0,COUNTRY_INFO!I16<4), IF(M16/J16*100<>0, IF(M16/J16*100>100,100,M16/J16*100), \"-\"),0)","v":"-"},{"$f":"COUNTRY_INFO!O16","v":143368},null,null,{"$f":"SUM(MAX('MDA4'!R16, 'T1'!L16, MAX(T3_R1!K16, T3_R2!K16)), MAX('MDA1'!K16, 'MDA4'!S16, 'T1'!M16, MAX(T3_R1!L16, T3_R2!L16)), MAX('MDA1'!L16, 'MDA4'!T16, 'T1'!N16, MAX(T3_R1!M16, T3_R2!M16)))","v":0},{"$f":"IF(AND(COUNTRY_INFO!J16>1,COUNTRY_INFO!J16<4),IF(COUNTRY_INFO!E16>MAX('MDA4'!R16,'T1'!L16,MAX(T3_R1!K16,T3_R2!K16)),MAX('MDA4'!R16,'T1'!L16,MAX(T3_R1!K16,T3_R2!K16)),COUNTRY_INFO!E16),0)","v":0},{"$f":"IF(AND(COUNTRY_INFO!J16>1,COUNTRY_INFO!J16<4), IF(T16/COUNTRY_INFO!E16*100<>0, IF(T16/COUNTRY_INFO!E16*100>100,100,T16/COUNTRY_INFO!E16*100), \"-\"),0)","v":"-"},{"$f":"IF(AND(COUNTRY_INFO!J16>1,COUNTRY_INFO!J16<4),IF(COUNTRY_INFO!F16>MAX('MDA1'!K16,'MDA4'!S16,'T1'!M16,MAX(T3_R1!L16,T3_R2!L16)),MAX('MDA1'!K16,'MDA4'!S16,'T1'!M16,MAX(T3_R1!L16,T3_R2!L16)),COUNTRY_INFO!F16),0)","v":0},{"$f":"IF(AND(COUNTRY_INFO!J16>1,COUNTRY_INFO!J16<4), IF(V16/COUNTRY_INFO!F16*100<>0, IF(V16/COUNTRY_INFO!F16*100>100,100,V16/COUNTRY_INFO!F16*100), \"-\"),0)","v":"-"},0,{"$f":"IF(AND(COUNTRY_INFO!J16>1,COUNTRY_INFO!J16<4), IF(S16/P16*100<>0, IF(X16/P16*100>100,100,X16/P16*100), \"-\"),0)","v":"-"},{"$f":"COUNTRY_INFO!P16","v":29415.870000000003},null,null,{"$f":"MAX('T1'!L16,'T2'!J16)+MAX('T1'!M16,'T2'!K16)+MAX('T1'!N16,'T2'!L16)","v":0},{"$f":"IF(COUNTRY_INFO!K16=1,IF(COUNTRY_INFO!F16*0.33>MAX('T1'!M16,'T2'!K16),MAX('T1'!M16,'T2'!K16),COUNTRY_INFO!F16*0.33),IF(COUNTRY_INFO!K16=2,IF(COUNTRY_INFO!F16*0.5>MAX('T1'!M16,'T2'!K16),MAX('T1'!M16,'T2'!K16),COUNTRY_INFO!F16*0.5),IF(COUNTRY_INFO!K16=3,IF(COUNTRY_INFO!F16>MAX('T1'!M16,'T2'!K16),MAX('T1'!M16,'T2'!K16),COUNTRY_INFO!F16),0)))","v":0},{"$f":"IF(AND(COUNTRY_INFO!K16>0,COUNTRY_INFO!K16<4),IF(Z16>0,IF(COUNTRY_INFO!K16=1, AD16/(COUNTRY_INFO!F16*0.33)*100, IF(COUNTRY_INFO!K16=2, AD16/(COUNTRY_INFO!F16*0.5)*100, IF(COUNTRY_INFO!K16=3, AD16/COUNTRY_INFO!F16*100))),\"-\"),0)","v":0},{"$f":"IF(COUNTRY_INFO!K16=2,IF(COUNTRY_INFO!G16*0.2>MAX('T1'!N16,'T2'!L16),MAX('T1'!N16,'T2'!L16),COUNTRY_INFO!G16*0.2),IF(COUNTRY_INFO!K16=3,IF(COUNTRY_INFO!G16>MAX('T1'!N16,'T2'!L16),MAX('T1'!N16,'T2'!L16),COUNTRY_INFO!G16),0))","v":0},{"$f":"IF(AND(COUNTRY_INFO!K16>0,COUNTRY_INFO!K16<4),IF(Z16>0,IF(COUNTRY_INFO!K16=1, 0, IF(COUNTRY_INFO!K16=2, AF16/(COUNTRY_INFO!G16*0.2)*100, IF(COUNTRY_INFO!K16=3, AF16/COUNTRY_INFO!G16*100))),\"-\"),0)","v":0},0,{"$f":"IF(AND(COUNTRY_INFO!K16>0,COUNTRY_INFO!K16<4), IF(AC16/Z16*100<>0, IF(AH16/Z16*100>100,100,AH16/Z16*100), \"-\"),0)","v":"-"},null,{"$f":"IF(AND(D16<>0, D16<>\"Inconnu\",D16<>\"Interrompu\",D16<>\"Non requis\"),D16/COUNTRY_INFO!D16, 0)","v":1},{"$f":"IF(AND(J16<>0,J16<>\"Inconnu\",J16<>\"Interrompu\",J16<>\"Non requis\"),J16/COUNTRY_INFO!D16, 0)","v":1},{"$f":"IF(AND(P16<>0,P16<>\"Inconnu\",P16<>\"Non requis\"),P16/(COUNTRY_INFO!E16+COUNTRY_INFO!F16), 0)","v":1},{"$f":"IF(AND(Z16<>0,Z16<>\"Inconnu\",Z16<>\"Non requis\"),IF(COUNTRY_INFO!K16=1,1,IF(COUNTRY_INFO!K16=2,0.5*COUNTRY_INFO!F16/(0.5*COUNTRY_INFO!F16+0.2*COUNTRY_INFO!G16),IF(COUNTRY_INFO!K16=3,COUNTRY_INFO!F16/(COUNTRY_INFO!F16+COUNTRY_INFO!G16)))),0)","v":1},{"$f":"IF(AND(Z16<>0,Z16<>\"Inconnu\",Z16<>\"Non requis\"),IF(COUNTRY_INFO!K16=1,0,IF(COUNTRY_INFO!K16=2,0.2*COUNTRY_INFO!G16/(0.5*COUNTRY_INFO!F16+0.2*COUNTRY_INFO!G16),IF(COUNTRY_INFO!K16=3,COUNTRY_INFO!G16/(COUNTRY_INFO!F16+COUNTRY_INFO!G16)))),0)","v":0},{"$f":"MAX(COUNTRY_INFO!D16*AK16*PROFILE!$G$7,COUNTRY_INFO!D16*AL16*PROFILE!$G$7)","v":13743.901636230334},{"$f":"MAX(COUNTRY_INFO!D16*AK16*PROFILE!$G$8,COUNTRY_INFO!D16*AL16*PROFILE!$G$8,COUNTRY_INFO!D16*AM16*PROFILE!$G$8)","v":54229.280765170144},{"$f":"MAX(COUNTRY_INFO!D16*AK16*PROFILE!$G$9,COUNTRY_INFO!D16*AL16*PROFILE!$G$9,COUNTRY_INFO!D16*AM16*PROFILE!$G$9,IF(AND(DISTRICT!Z16<>\"Inconnu\",Z16<>\"Non requis\"),COUNTRY_INFO!P16*DISTRICT!AN16,0))","v":89138.497148566836},{"$f":"MAX(COUNTRY_INFO!D16*AK16*PROFILE!$G$10,COUNTRY_INFO!D16*AL16*PROFILE!$G$10,IF(AND(DISTRICT!Z16<>\"Inconnu\",Z16<>\"Non requis\"),COUNTRY_INFO!P16*DISTRICT!AO16,0))","v":235569.32045003271},392681,0,{"$f":"MAX('MDA4'!R16,'T1'!L16,'T2'!J16,T3_R1!K16,T3_R2!K16)","v":0},{"$f":"MAX('MDA1'!K16,'MDA4'!S16,'MDA3'!I16,'MDA3'!L16,'T1'!M16,'T2'!K16,T3_R1!L16,T3_R2!L16)","v":0},{"$f":"MAX('MDA1'!L16,'MDA4'!T16,'MDA3'!J16,'MDA3'!M16,'T1'!N16,'T2'!L16,T3_R1!M16,T3_R2!M16)","v":0},0,{"$f":"MAX('MDA4'!R16,T16)","v":0},{"$f":"MAX('MDA1'!K16,'MDA4'!S16,'MDA3'!I16,'MDA3'!L16,V16,AD16)","v":0},{"$f":"MAX('MDA1'!L16,'MDA4'!T16,'MDA3'!J16,'MDA3'!M16,AF16)","v":0},0,0]
[{"$f":"IF(COUNTRY_INFO!A17=0,\" \",COUNTRY_INFO!A17)","v":"CAR"},{"$f":"IF(COUNTRY_INFO!B17=0,\" \",COUNTRY_INFO!B17)","v":"Région Sanitaire N°4"},{"$f":"IF(COUNTRY_INFO!C17=0,\" \",COUNTRY_INFO!C17)","v":"Kémo"},{"$f":"COUNTRY_INFO!M17","v":168045},47517,54289,{"$f":"MAX('MDA1'!M17,'MDA4'!U17)","v":101806},{"$f":"IF(AND(COUNTRY_INFO!H17>0,COUNTRY_INFO!H17<4),IF(D17>MAX('MDA1'!M17,'MDA4'!U17),MAX('MDA1'!M17,'MDA4'!U17),D17),0)","v":101806},{"$f":"IF(AND(COUNTRY_INFO!H17>0,COUNTRY_INFO!H17<4), IF(G17/D17*100<>0, IF(G17/D17*100>100,100,G17/D17*100), \"-\"),0)","v":60.582582046475643},{"$f":"COUNTRY_INFO!N17","v":168045},null,null,{"$f":"MAX('MDA1'!M17,MAX('MDA3'!I17,'MDA3'!L17)+MAX('MDA3'!J17,'MDA3'!M17))","v":101806},{"$f":"IF(AND(COUNTRY_INFO!I17>0,COUNTRY_INFO!I17<4),IF(J17>MAX('MDA1'!M17,MAX('MDA3'!I17,'MDA3'!L17)+MAX('MDA3'!J17,'MDA3'!M17)),MAX('MDA1'!M17,MAX('MDA3'!I17,'MDA3'!L17)+MAX('MDA3'!J17,'MDA3'!M17)),J17),0)","v":101806},{"$f":"IF(AND(COUNTRY_INFO!I17>0,COUNTRY_INFO!I17<4), IF(M17/J17*100<>0, IF(M17/J17*100>100,100,M17/J17*100), \"-\"),0)","v":60.582582046475643},{"$f":"COUNTRY_INFO!O17","v":61353},17759,20070,{"$f":"SUM(MAX('MDA4'!R17, 'T1'!L17, MAX(T3_R1!K17, T3_R2!K17)), MAX('MDA1'!K17, 'MDA4'!S17, 'T1'!M17, MAX(T3_R1!L17, T3_R2!L17)), MAX('MDA1'!L17, 'MDA4'!T17, 'T1'!N17, MAX(T3_R1!M17, T3_R2!M17)))","v":101806},{"$f":"IF(AND(COUNTRY_INFO!J17>1,COUNTRY_INFO!J17<4),IF(COUNTRY_INFO!E17>MAX('MDA4'!R17,'T1'!L17,MAX(T3_R1!K17,T3_R2!K17)),MAX('MDA4'!R17,'T1'!L17,MAX(T3_R1!K17,T3_R2!K17)),COUNTRY_INFO!E17),0)","v":0},{"$f":"IF(AND(COUNTRY_INFO!J17>1,COUNTRY_INFO!J17<4), IF(T17/COUNTRY_INFO!E17*100<>0, IF(T17/COUNTRY_INFO!E17*100>100,100,T17/COUNTRY_INFO!E17*100), \"-\"),0)","v":"-"},{"$f":"IF(AND(COUNTRY_INFO!J17>1,COUNTRY_INFO!J17<4),IF(COUNTRY_INFO!F17>MAX('MDA1'!K17,'MDA4'!S17,'T1'!M17,MAX(T3_R1!L17,T3_R2!L17)),MAX('MDA1'!K17,'MDA4'!S17,'T1'!M17,MAX(T3_R1!L17,T3_R2!L17)),COUNTRY_INFO!F17),0)","v":37829},{"$f":"IF(AND(COUNTRY_INFO!J17>1,COUNTRY_INFO!J17<4), IF(V17/COUNTRY_INFO!F17*100<>0, IF(V17/COUNTRY_INFO!F17*100>100,100,V17/COUNTRY_INFO!F17*100), \"-\"),0)","v":99.168982331043892},37829,{"$f":"IF(AND(COUNTRY_INFO!J17>1,COUNTRY_INFO!J17<4), IF(S17/P17*100<>0, IF(X17/P17*100>100,100,X17/P17*100), \"-\"),0)","v":61.657946636676286},{"$f":"COUNTRY_INFO!P17","v":138956},null,null,{"$f":"MAX('T1'!L17,'T2'!J17)+MAX('T1'!M17,'T2'!K17)+MAX('T1'!N17,'T2'!L17)","v":0},{"$f":"IF(COUNTRY_INFO!K17=1,IF(COUNTRY_INFO!F17*0.33>MAX('T1'!M17,'T2'!K17),MAX('T1'!M17,'T2'!K17),COUNTRY_INFO!F17*0.33),IF(COUNTRY_INFO!K17=2,IF(COUNTRY_INFO!F17*0.5>MAX('T1'!M17,'T2'!K17),MAX('T1'!M17,'T2'!K17),COUNTRY_INFO!F17*0.5),IF(COUNTRY_INFO!K17=3,IF(COUNTRY_INFO!F17>MAX('T1'!M17,'T2'!K17),MAX('T1'!M17,'T2'!K17),COUNTRY_INFO!F17),0)))","v":0},{"$f":"IF(AND(COUNTRY_INFO!K17>0,COUNTRY_INFO!K17<4),IF(Z17>0,IF(COUNTRY_INFO!K17=1, AD17/(COUNTRY_INFO!F17*0.33)*100, IF(COUNTRY_INFO!K17=2, AD17/(COUNTRY_INFO!F17*0.5)*100, IF(COUNTRY_INFO!K17=3, AD17/COUNTRY_INFO!F17*100))),\"-\"),0)","v":0},{"$f":"IF(COUNTRY_INFO!K17=2,IF(COUNTRY_INFO!G17*0.2>MAX('T1'!N17,'T2'!L17),MAX('T1'!N17,'T2'!L17),COUNTRY_INFO!G17*0.2),IF(COUNTRY_INFO!K17=3,IF(COUNTRY_INFO!G17>MAX('T1'!N17,'T2'!L17),MAX('T1'!N17,'T2'!L17),COUNTRY_INFO!G17),0))","v":0},{"$f":"IF(AND(COUNTRY_INFO!K17>0,COUNTRY_INFO!K17<4),IF(Z17>0,IF(COUNTRY_INFO!K17=1, 0, IF(COUNTRY_INFO!K17=2, AF17/(COUNTRY_INFO!G17*0.2)*100, IF(COUNTRY_INFO!K17=3, AF17/COUNTRY_INFO!G17*100))),\"-\"),0)","v":0},0,{"$f":"IF(AND(COUNTRY_INFO!K17>0,COUNTRY_INFO!K17<4), IF(AC17/Z17*100<>0, IF(AH17/Z17*100>100,100,AH17/Z17*100), \"-\"),0)","v":"-"},null,{"$f":"IF(AND(D17<>0, D17<>\"Inconnu\",D17<>\"Interrompu\",D17<>\"Non requis\"),D17/COUNTRY_INFO!D17, 0)","v":1},{"$f":"IF(AND(J17<>0,J17<>\"Inconnu\",J17<>\"Interrompu\",J17<>\"Non requis\"),J17/COUNTRY_INFO!D17, 0)","v":1},{"$f":"IF(AND(P17<>0,P17<>\"Inconnu\",P17<>\"Non requis\"),P17/(COUNTRY_INFO!E17+COUNTRY_INFO!F17), 0)","v":1},{"$f":"IF(AND(Z17<>0,Z17<>\"Inconnu\",Z17<>\"Non requis\"),IF(COUNTRY_INFO!K17=1,1,IF(COUNTRY_INFO!K17=2,0.5*COUNTRY_INFO!F17/(0.5*COUNTRY_INFO!F17+0.2*COUNTRY_INFO!G17),IF(COUNTRY_INFO!K17=3,COUNTRY_INFO!F17/(COUNTRY_INFO!F17+COUNTRY_INFO!G17)))),0)","v":0.27451855263536656},{"$f":"IF(AND(Z17<>0,Z17<>\"Inconnu\",Z17<>\"Non requis\"),IF(COUNTRY_INFO!K17=1,0,IF(COUNTRY_INFO!K17=2,0.2*COUNTRY_INFO!G17/(0.5*COUNTRY_INFO!F17+0.2*COUNTRY_INFO!G17),IF(COUNTRY_INFO!K17=3,COUNTRY_INFO!G17/(COUNTRY_INFO!F17+COUNTRY_INFO!G17)))),0)","v":0.72548144736463338},{"$f":"MAX(COUNTRY_INFO!D17*AK17*PROFILE!$G$7,COUNTRY_INFO!D17*AL17*PROFILE!$G$7)","v":5881.6035164938621},{"$f":"MAX(COUNTRY_INFO!D17*AK17*PROFILE!$G$8,COUNTRY_INFO!D17*AL17*PROFILE!$G$8,COUNTRY_INFO!D17*AM17*PROFILE!$G$8)","v":23207.029334709387},{"$f":"MAX(COUNTRY_INFO!D17*AK17*PROFILE!$G$9,COUNTRY_INFO!D17*AL17*PROFILE!$G$9,COUNTRY_INFO!D17*AM17*PROFILE!$G$9,IF(AND(DISTRICT!Z17<>\"Inconnu\",Z17<>\"Non requis\"),COUNTRY_INFO!P17*DISTRICT!AN17,0))","v":38146.176548727628},{"$f":"MAX(COUNTRY_INFO!D17*AK17*PROFILE!$G$10,COUNTRY_INFO!D17*AL17*PROFILE!$G$10,IF(AND(DISTRICT!Z17<>\"Inconnu\",Z17<>\"Non requis\"),COUNTRY_INFO!P17*DISTRICT!AO17,0))","v":100810.19060006912},168045,0,{"$f":"MAX('MDA4'!R17,'T1'!L17,'T2'!J17,T3_R1!K17,T3_R2!K17)","v":0},{"$f":"MAX('MDA1'!K17,'MDA4'!S17,'MDA3'!I17,'MDA3'!L17,'T1'!M17,'T2'!K17,T3_R1!L17,T3_R2!L17)","v":37829},{"$f":"MAX('MDA1'!L17,'MDA4'!T17,'MDA3'!J17,'MDA3'!M17,'T1'!N17,'T2'!L17,T3_R1!M17,T3_R2!M17)","v":63977},101806,{"$f":"MAX('MDA4'!R17,T17)","v":0},{"$f":"MAX('MDA1'!K17,'MDA4'!S17,'MDA3'!I17,'MDA3'!L17,V17,AD17)","v":37829},{"$f":"MAX('MDA1'!L17,'MDA4'!T17,'MDA3'!J17,'MDA3'!M17,AF17)","v":63977},101806,60.582582046475643]
[{"$f":"IF(COUNTRY_INFO!A18=0,\" \",COUNTRY_INFO!A18)","v":"CAR"},{"$f":"IF(COUNTRY_INFO!B18=0,\" \",COUNTRY_INFO!B18)","v":"Région Sanitaire N°4"},{"$f":"IF(COUNTRY_INFO!C18=0,\" \",COUNTRY_INFO!C18)","v":"Nana-Gribizi"},{"$f":"COUNTRY_INFO!M18","v":"Inconnu"},null,null,{"$f":"MAX('MDA1'!M18,'MDA4'!U18)","v":0},{"$f":"IF(AND(COUNTRY_INFO!H18>0,COUNTRY_INFO!H18<4),IF(D18>MAX('MDA1'!M18,'MDA4'!U18),MAX('MDA1'!M18,'MDA4'!U18),D18),0)","v":0},{"$f":"IF(AND(COUNTRY_INFO!H18>0,COUNTRY_INFO!H18<4), IF(G18/D18*100<>0, IF(G18/D18*100>100,100,G18/D18*100), \"-\"),0)","v":0},{"$f":"COUNTRY_INFO!N18","v":163803},null,null,{"$f":"MAX('MDA1'!M18,MAX('MDA3'!I18,'MDA3'!L18)+MAX('MDA3'!J18,'MDA3'!M18))","v":74355},{"$f":"IF(AND(COUNTRY_INFO!I18>0,COUNTRY_INFO!I18<4),IF(J18>MAX('MDA1'!M18,MAX('MDA3'!I18,'MDA3'!L18)+MAX('MDA3'!J18,'MDA3'!M18)),MAX('MDA1'!M18,MAX('MDA3'!I18,'MDA3'!L18)+MAX('MDA3'!J18,'MDA3'!M18)),J18),0)","v":74355},{"$f":"IF(AND(COUNTRY_INFO!I18>0,COUNTRY_INFO!I18<4), IF(M18/J18*100<>0, IF(M18/J18*100>100,100,M18/J18*100), \"-\"),0)","v":45.392941521217558},{"$f":"COUNTRY_INFO!O18","v":"Inconnu"},null,null,{"$f":"SUM(MAX('MDA4'!R18, 'T1'!L18, MAX(T3_R1!K18, T3_R2!K18)), MAX('MDA1'!K18, 'MDA4'!S18, 'T1'!M18, MAX(T3_R1!L18, T3_R2!L18)), MAX('MDA1'!L18, 'MDA4'!T18, 'T1'!N18, MAX(T3_R1!M18, T3_R2!M18)))","v":0},{"$f":"IF(AND(COUNTRY_INFO!J18>1,COUNTRY_INFO!J18<4),IF(COUNTRY_INFO!E18>MAX('MDA4'!R18,'T1'!L18,MAX(T3_R1!K18,T3_R2!K18)),MAX('MDA4'!R18,'T1'!L18,MAX(T3_R1!K18,T3_R2!K18)),COUNTRY_INFO!E18),0)","v":0},{"$f":"IF(AND(COUNTRY_INFO!J18>1,COUNTRY_INFO!J18<4), IF(T18/COUNTRY_INFO!E18*100<>0, IF(T18/COUNTRY_INFO!E18*100>100,100,T18/COUNTRY_INFO!E18*100), \"-\"),0)","v":0},{"$f":"IF(AND(COUNTRY_INFO!J18>1,COUNTRY_INFO!J18<4),IF(COUNTRY_INFO!F18>MAX('MDA1'!K18,'MDA4'!S18,'T1'!M18,MAX(T3_R1!L18,T3_R2!L18)),MAX('MDA1'!K18,'MDA4'!S18,'T1'!M18,MAX(T3_R1!L18,T3_R2!L18)),COUNTRY_INFO!F18),0)","v":0},{"$f":"IF(AND(COUNTRY_INFO!J18>1,COUNTRY_INFO!J18<4), IF(V18/COUNTRY_INFO!F18*100<>0, IF(V18/COUNTRY_INFO!F18*100>100,100,V18/COUNTRY_INFO!F18*100), \"-\"),0)","v":0},0,{"$f":"IF(AND(COUNTRY_INFO!J18>1,COUNTRY_INFO!J18<4), IF(S18/P18*100<>0, IF(X18/P18*100>100,100,X18/P18*100), \"-\"),0)","v":0},{"$f":"COUNTRY_INFO!P18","v":"Inconnu"},null,null,{"$f":"MAX('T1'!L18,'T2'!J18)+MAX('T1'!M18,'T2'!K18)+MAX('T1'!N18,'T2'!L18)","v":0},{"$f":"IF(COUNTRY_INFO!K18=1,IF(COUNTRY_INFO!F18*0.33>MAX('T1'!M18,'T2'!K18),MAX('T1'!M18,'T2'!K18),COUNTRY_INFO!F18*0.33),IF(COUNTRY_INFO!K18=2,IF(COUNTRY_INFO!F18*0.5>MAX('T1'!M18,'T2'!K18),MAX('T1'!M18,'T2'!K18),COUNTRY_INFO!F18*0.5),IF(COUNTRY_INFO!K18=3,IF(COUNTRY_INFO!F18>MAX('T1'!M18,'T2'!K18),MAX('T1'!M18,'T2'!K18),COUNTRY_INFO!F18),0)))","v":0},{"$f":"IF(AND(COUNTRY_INFO!K18>0,COUNTRY_INFO!K18<4),IF(Z18>0,IF(COUNTRY_INFO!K18=1, AD18/(COUNTRY_INFO!F18*0.33)*100, IF(COUNTRY_INFO!K18=2, AD18/(COUNTRY_INFO!F18*0.5)*100, IF(COUNTRY_INFO!K18=3, AD18/COUNTRY_INFO!F18*100))),\"-\"),0)","v":0},{"$f":"IF(COUNTRY_INFO!K18=2,IF(COUNTRY_INFO!G18*0.2>MAX('T1'!N18,'T2'!L18),MAX('T1'!N18,'T2'!L18),COUNTRY_INFO!G18*0.2),IF(COUNTRY_INFO!K18=3,IF(COUNTRY_INFO!G18>MAX('T1'!N18,'T2'!L18),MAX('T1'!N18,'T2'!L18),COUNTRY_INFO!G18),0))","v":0},{"$f":"IF(AND(COUNTRY_INFO!K18>0,COUNTRY_INFO!K18<4),IF(Z18>0,IF(COUNTRY_INFO!K18=1, 0, IF(COUNTRY_INFO!K18=2, AF18/(COUNTRY_INFO!G18*0.2)*100, IF(COUNTRY_INFO!K18=3, AF18/COUNTRY_INFO!G18*100))),\"-\"),0)","v":0},0,{"$f":"IF(AND(COUNTRY_INFO!K18>0,COUNTRY_INFO!K18<4), IF(AC18/Z18*100<>0, IF(AH18/Z18*100>100,100,AH18/Z18*100), \"-\"),0)","v":0},null,{"$f":"IF(AND(D18<>0, D18<>\"Inconnu\",D18<>\"Interrompu\",D18<>\"Non requis\"),D18/COUNTRY_INFO!D18, 0)","v":0},{"$f":"IF(AND(J18<>0,J18<>\"Inconnu\",J18<>\"Interrompu\",J18<>\"Non requis\"),J18/COUNTRY_INFO!D18, 0)","v":1},{"$f":"IF(AND(P18<>0,P18<>\"Inconnu\",P18<>\"Non requis\"),P18/(COUNTRY_INFO!E18+COUNTRY_INFO!F18), 0)","v":0},{"$f":"IF(AND(Z18<>0,Z18<>\"Inconnu\",Z18<>\"Non requis\"),IF(COUNTRY_INFO!K18=1,1,IF(COUNTRY_INFO!K18=2,0.5*COUNTRY_INFO!F18/(0.5*COUNTRY_INFO!F18+0.2*COUNTRY_INFO!G18),IF(COUNTRY_INFO!K18=3,COUNTRY_INFO!F18/(COUNTRY_INFO!F18+COUNTRY_INFO!G18)))),0)","v":0},{"$f":"IF(AND(Z18<>0,Z18<>\"Inconnu\",Z18<>\"Non requis\"),IF(COUNTRY_INFO!K18=1,0,IF(COUNTRY_INFO!K18=2,0.2*COUNTRY_INFO!G18/(0.5*COUNTRY_INFO!F18+0.2*COUNTRY_INFO!G18),IF(COUNTRY_INFO!K18=3,COUNTRY_INFO!G18/(COUNTRY_INFO!F18+COUNTRY_INFO!G18)))),0)","v":0},{"$f":"MAX(COUNTRY_INFO!D18*AK18*PROFILE!$G$7,COUNTRY_INFO!D18*AL18*PROFILE!$G$7)","v":5733.1327966452091},{"$f":"MAX(COUNTRY_INFO!D18*AK18*PROFILE!$G$8,COUNTRY_INFO!D18*AL18*PROFILE!$G$8,COUNTRY_INFO!D18*AM18*PROFILE!$G$8)","v":22621.208760233279},{"$f":"MAX(COUNTRY_INFO!D18*AK18*PROFILE!$G$9,COUNTRY_INFO!D18*AL18*PROFILE!$G$9,COUNTRY_INFO!D18*AM18*PROFILE!$G$9,IF(AND(DISTRICT!Z18<>\"Inconnu\",Z18<>\"Non requis\"),COUNTRY_INFO!P18*DISTRICT!AN18,0))","v":37183.243519362266},{"$f":"MAX(COUNTRY_INFO!D18*AK18*PROFILE!$G$10,COUNTRY_INFO!D18*AL18*PROFILE!$G$10,IF(AND(DISTRICT!Z18<>\"Inconnu\",Z18<>\"Non requis\"),COUNTRY_INFO!P18*DISTRICT!AO18,0))","v":98265.41492375925},163803,"Y",{"$f":"MAX('MDA4'!R18,'T1'!L18,'T2'!J18,T3_R1!K18,T3_R2!K18)","v":0},{"$f":"MAX('MDA1'!K18,'MDA4'!S18,'MDA3'!I18,'MDA3'!L18,'T1'!M18,'T2'!K18,T3_R1!L18,T3_R2!L18)","v":16957},{"$f":"MAX('MDA1'!L18,'MDA4'!T18,'MDA3'!J18,'MDA3'!M18,'T1'!N18,'T2'!L18,T3_R1!M18,T3_R2!M18)","v":57398},74355,{"$f":"MAX('MDA4'!R18,T18)","v":0},{"$f":"MAX('MDA1'!K18,'MDA4'!S18,'MDA3'!I18,'MDA3'!L18,V18,AD18)","v":16957},{"$f":"MAX('MDA1'!L18,'MDA4'!T18,'MDA3'!J18,'MDA3'!M18,AF18)","v":57398},74355,45.392941521217558]
[{"$f":"IF(COUNTRY_INFO!A19=0,\" \",COUNTRY_INFO!A19)","v":"CAR"},{"$f":"IF(COUNTRY_INFO!B19=0,\" \",COUNTRY_INFO!B19)","v":"Région Sanitaire N°5"},{"$f":"IF(COUNTRY_INFO!C19=0,\" \",COUNTRY_INFO!C19)","v":"Haute-Kotto"},{"$f":"COUNTRY_INFO!M19","v":"Inconnu"},null,null,{"$f":"MAX('MDA1'!M19,'MDA4'!U19)","v":0},{"$f":"IF(AND(COUNTRY_INFO!H19>0,COUNTRY_INFO!H19<4),IF(D19>MAX('MDA1'!M19,'MDA4'!U19),MAX('MDA1'!M19,'MDA4'!U19),D19),0)","v":0},{"$f":"IF(AND(COUNTRY_INFO!H19>0,COUNTRY_INFO!H19<4), IF(G19/D19*100<>0, IF(G19/D19*100>100,100,G19/D19*100), \"-\"),0)","v":0},{"$f":"COUNTRY_INFO!N19","v":125568},null,null,{"$f":"MAX('MDA1'!M19,MAX('MDA3'!I19,'MDA3'!L19)+MAX('MDA3'!J19,'MDA3'!M19))","v":0},{"$f":"IF(AND(COUNTRY_INFO!I19>0,COUNTRY_INFO!I19<4),IF(J19>MAX('MDA1'!M19,MAX('MDA3'!I19,'MDA3'!L19)+MAX('MDA3'!J19,'MDA3'!M19)),MAX('MDA1'!M19,MAX('MDA3'!I19,'MDA3'!L19)+MAX('MDA3'!J19,'MDA3'!M19)),J19),0)","v":0},{"$f":"IF(AND(COUNTRY_INFO!I19>0,COUNTRY_INFO!I19<4), IF(M19/J19*100<>0, IF(M19/J19*100>100,100,M19/J19*100), \"-\"),0)","v":"-"},{"$f":"COUNTRY_INFO!O19","v":"Inconnu"},null,null,{"$f":"SUM(MAX('MDA4'!R19, 'T1'!L19, MAX(T3_R1!K19, T3_R2!K19)), MAX('MDA1'!K19, 'MDA4'!S19, 'T1'!M19, MAX(T3_R1!L19, T3_R2!L19)), MAX('MDA1'!L19, 'MDA4'!T19, 'T1'!N19, MAX(T3_R1!M19, T3_R2!M19)))","v":0},{"$f":"IF(AND(COUNTRY_INFO!J19>1,COUNTRY_INFO!J19<4),IF(COUNTRY_INFO!E19>MAX('MDA4'!R19,'T1'!L19,MAX(T3_R1!K19,T3_R2!K19)),MAX('MDA4'!R19,'T1'!L19,MAX(T3_R1!K19,T3_R2!K19)),COUNTRY_INFO!E19),0)","v":0},{"$f":"IF(AND(COUNTRY_INFO!J19>1,COUNTRY_INFO!J19<4), IF(T19/COUNTRY_INFO!E19*100<>0, IF(T19/COUNTRY_INFO!E19*100>100,100,T19/COUNTRY_INFO!E19*100), \"-\"),0)","v":0},{"$f":"IF(AND(COUNTRY_INFO!J19>1,COUNTRY_INFO!J19<4),IF(COUNTRY_INFO!F19>MAX('MDA1'!K19,'MDA4'!S19,'T1'!M19,MAX(T3_R1!L19,T3_R2!L19)),MAX('MDA1'!K19,'MDA4'!S19,'T1'!M19,MAX(T3_R1!L19,T3_R2!L19)),COUNTRY_INFO!F19),0)","v":0},{"$f":"IF(AND(COUNTRY_INFO!J19>1,COUNTRY_INFO!J19<4), IF(V19/COUNTRY_INFO!F19*100<>0, IF(V19/COUNTRY_INFO!F19*100>100,100,V19/COUNTRY_INFO!F19*100), \"-\"),0)","v":0},0,{"$f":"IF(AND(COUNTRY_INFO!J19>1,COUNTRY_INFO!J19<4), IF(S19/P19*100<>0, IF(X19/P19*100>100,100,X19/P19*100), \"-\"),0)","v":0},{"$f":"COUNTRY_INFO!P19","v":"Inconnu"},null,null,{"$f":"MAX('T1'!L19,'T2'!J19)+MAX('T1'!M19,'T2'!K19)+MAX('T1'!N19,'T2'!L19)","v":0},{"$f":"IF(COUNTRY_INFO!K19=1,IF(COUNTRY_INFO!F19*0.33>MAX('T1'!M19,'T2'!K19),MAX('T1'!M19,'T2'!K19),COUNTRY_INFO!F19*0.33),IF(COUNTRY_INFO!K19=2,IF(COUNTRY_INFO!F19*0.5>MAX('T1'!M19,'T2'!K19),MAX('T1'!M19,'T2'!K19),COUNTRY_INFO!F19*0.5),IF(COUNTRY_INFO!K19=3,IF(COUNTRY_INFO!F19>MAX('T1'!M19,'T2'!K19),MAX('T1'!M19,'T2'!K19),COUNTRY_INFO!F19),0)))","v":0},{"$f":"IF(AND(COUNTRY_INFO!K19>0,COUNTRY_INFO!K19<4),IF(Z19>0,IF(COUNTRY_INFO!K19=1, AD19/(COUNTRY_INFO!F19*0.33)*100, IF(COUNTRY_INFO!K19=2, AD19/(COUNTRY_INFO!F19*0.5)*100, IF(COUNTRY_INFO!K19=3, AD19/COUNTRY_INFO!F19*100))),\"-\"),0)","v":0},{"$f":"IF(COUNTRY_INFO!K19=2,IF(COUNTRY_INFO!G19*0.2>MAX('T1'!N19,'T2'!L19),MAX('T1'!N19,'T2'!L19),COUNTRY_INFO!G19*0.2),IF(COUNTRY_INFO!K19=3,IF(COUNTRY_INFO!G19>MAX('T1'!N19,'T2'!L19),MAX('T1'!N19,'T2'!L19),COUNTRY_INFO!G19),0))","v":0},{"$f":"IF(AND(COUNTRY_INFO!K19>0,COUNTRY_INFO!K19<4),IF(Z19>0,IF(COUNTRY_INFO!K19=1, 0, IF(COUNTRY_INFO!K19=2, AF19/(COUNTRY_INFO!G19*0.2)*100, IF(COUNTRY_INFO!K19=3, AF19/COUNTRY_INFO!G19*100))),\"-\"),0)","v":0},0,{"$f":"IF(AND(COUNTRY_INFO!K19>0,COUNTRY_INFO!K19<4), IF(AC19/Z19*100<>0, IF(AH19/Z19*100>100,100,AH19/Z19*100), \"-\"),0)","v":0},null,{"$f":"IF(AND(D19<>0, D19<>\"Inconnu\",D19<>\"Interrompu\",D19<>\"Non requis\"),D19/COUNTRY_INFO!D19, 0)","v":0},{"$f":"IF(AND(J19<>0,J19<>\"Inconnu\",J19<>\"Interrompu\",J19<>\"Non requis\"),J19/COUNTRY_INFO!D19, 0)","v":1},{"$f":"IF(AND(P19<>0,P19<>\"Inconnu\",P19<>\"Non requis\"),P19/(COUNTRY_INFO!E19+COUNTRY_INFO!F19), 0)","v":0},{"$f":"IF(AND(Z19<>0,Z19<>\"Inconnu\",Z19<>\"Non requis\"),IF(COUNTRY_INFO!K19=1,1,IF(COUNTRY_INFO!K19=2,0.5*COUNTRY_INFO!F19/(0.5*COUNTRY_INFO!F19+0.2*COUNTRY_INFO!G19),IF(COUNTRY_INFO!K19=3,COUNTRY_INFO!F19/(COUNTRY_INFO!F19+COUNTRY_INFO!G19)))),0)","v":0},{"$f":"IF(AND(Z19<>0,Z19<>\"Inconnu\",Z19<>\"Non requis\"),IF(COUNTRY_INFO!K19=1,0,IF(COUNTRY_INFO!K19=2,0.2*COUNTRY_INFO!G19/(0.5*COUNTRY_INFO!F19+0.2*COUNTRY_INFO!G19),IF(COUNTRY_INFO!K19=3,COUNTRY_INFO!G19/(COUNTRY_INFO!F19+COUNTRY_INFO!G19)))),0)","v":0},{"$f":"MAX(COUNTRY_INFO!D19*AK19*PROFILE!$G$7,COUNTRY_INFO!D19*AL19*PROFILE!$G$7)","v":4394.9013083346799},{"$f":"MAX(COUNTRY_INFO!D19*AK19*PROFILE!$G$8,COUNTRY_INFO!D19*AL19*PROFILE!$G$8,COUNTRY_INFO!D19*AM19*PROFILE!$G$8)","v":17340.951884916471},{"$f":"MAX(COUNTRY_INFO!D19*AK19*PROFILE!$G$9,COUNTRY_INFO!D19*AL19*PROFILE!$G$9,COUNTRY_INFO!D19*AM19*PROFILE!$G$9,IF(AND(DISTRICT!Z19<>\"Inconnu\",Z19<>\"Non requis\"),COUNTRY_INFO!P19*DISTRICT!AN19,0))","v":28503.907268116465},{"$f":"MAX(COUNTRY_INFO!D19*AK19*PROFILE!$G$10,COUNTRY_INFO!D19*AL19*PROFILE!$G$10,IF(AND(DISTRICT!Z19<>\"Inconnu\",Z19<>\"Non requis\"),COUNTRY_INFO!P19*DISTRICT!AO19,0))","v":75328.239538632391},125568,0,{"$f":"MAX('MDA4'!R19,'T1'!L19,'T2'!J19,T3_R1!K19,T3_R2!K19)","v":0},{"$f":"MAX('MDA1'!K19,'MDA4'!S19,'MDA3'!I19,'MDA3'!L19,'T1'!M19,'T2'!K19,T3_R1!L19,T3_R2!L19)","v":0},{"$f":"MAX('MDA1'!L19,'MDA4'!T19,'MDA3'!J19,'MDA3'!M19,'T1'!N19,'T2'!L19,T3_R1!M19,T3_R2!M19)","v":0},0,{"$f":"MAX('MDA4'!R19,T19)","v":0},{"$f":"MAX('MDA1'!K19,'MDA4'!S19,'MDA3'!I19,'MDA3'!L19,V19,AD19)","v":0},{"$f":"MAX('MDA1'!L19,'MDA4'!T19,'MDA3'!J19,'MDA3'!M19,AF19)","v":0},0,0]
[{"$f":"IF(COUNTRY_INFO!A20=0,\" \",COUNTRY_INFO!A20)","v":"CAR"},{"$f":"IF(COUNTRY_INFO!B20=0,\" \",COUNTRY_INFO!B20)","v":"Région Sanitaire N°5"},{"$f":"IF(COUNTRY_INFO!C20=0,\" \",COUNTRY_INFO!C20)","v":"Bamingui-Bangoran"},{"$f":"COUNTRY_INFO!M20","v":"Inconnu"},null,null,{"$f":"MAX('MDA1'!M20,'MDA4'!U20)","v":0},{"$f":"IF(AND(COUNTRY_INFO!H20>0,COUNTRY_INFO!H20<4),IF(D20>MAX('MDA1'!M20,'MDA4'!U20),MAX('MDA1'!M20,'MDA4'!U20),D20),0)","v":0},{"$f":"IF(AND(COUNTRY_INFO!H20>0,COUNTRY_INFO!H20<4), IF(G20/D20*100<>0, IF(G20/D20*100>100,100,G20/D20*100), \"-\"),0)","v":0},{"$f":"COUNTRY_INFO!N20","v":60103},null,null,{"$f":"MAX('MDA1'!M20,MAX('MDA3'!I20,'MDA3'!L20)+MAX('MDA3'!J20,'MDA3'!M20))","v":0},{"$f":"IF(AND(COUNTRY_INFO!I20>0,COUNTRY_INFO!I20<4),IF(J20>MAX('MDA1'!M20,MAX('MDA3'!I20,'MDA3'!L20)+MAX('MDA3'!J20,'MDA3'!M20)),MAX('MDA1'!M20,MAX('MDA3'!I20,'MDA3'!L20)+MAX('MDA3'!J20,'MDA3'!M20)),J20),0)","v":0},{"$f":"IF(AND(COUNTRY_INFO!I20>0,COUNTRY_INFO!I20<4), IF(M20/J20*100<>0, IF(M20/J20*100>100,100,M20/J20*100), \"-\"),0)","v":"-"},{"$f":"COUNTRY_INFO!O20","v":"Inconnu"},null,null,{"$f":"SUM(MAX('MDA4'!R20, 'T1'!L20, MAX(T3_R1!K20, T3_R2!K20)), MAX('MDA1'!K20, 'MDA4'!S20, 'T1'!M20, MAX(T3_R1!L20, T3_R2!L20)), MAX('MDA1'!L20, 'MDA4'!T20, 'T1'!N20, MAX(T3_R1!M20, T3_R2!M20)))","v":0},{"$f":"IF(AND(COUNTRY_INFO!J20>1,COUNTRY_INFO!J20<4),IF(COUNTRY_INFO!E20>MAX('MDA4'!R20,'T1'!L20,MAX(T3_R1!K20,T3_R2!K20)),MAX('MDA4'!R20,'T1'!L20,MAX(T3_R1!K20,T3_R2!K20)),COUNTRY_INFO!E20),0)","v":0},{"$f":"IF(AND(COUNTRY_INFO!J20>1,COUNTRY_INFO!J20<4), IF(T20/COUNTRY_INFO!E20*100<>0, IF(T20/COUNTRY_INFO!E20*100>100,100,T20/COUNTRY_INFO!E20*100), \"-\"),0)","v":0},{"$f":"IF(AND(COUNTRY_INFO!J20>1,COUNTRY_INFO!J20<4),IF(COUNTRY_INFO!F20>MAX('MDA1'!K20,'MDA4'!S20,'T1'!M20,MAX(T3_R1!L20,T3_R2!L20)),MAX('MDA1'!K20,'MDA4'!S20,'T1'!M20,MAX(T3_R1!L20,T3_R2!L20)),COUNTRY_INFO!F20),0)","v":0},{"$f":"IF(AND(COUNTRY_INFO!J20>1,COUNTRY_INFO!J20<4), IF(V20/COUNTRY_INFO!F20*100<>0, IF(V20/COUNTRY_INFO!F20*100>100,100,V20/COUNTRY_INFO!F20*100), \"-\"),0)","v":0},0,{"$f":"IF(AND(COUNTRY_INFO!J20>1,COUNTRY_INFO!J20<4), IF(S20/P20*100<>0, IF(X20/P20*100>100,100,X20/P20*100), \"-\"),0)","v":0},{"$f":"COUNTRY_INFO!P20","v":"Inconnu"},null,null,{"$f":"MAX('T1'!L20,'T2'!J20)+MAX('T1'!M20,'T2'!K20)+MAX('T1'!N20,'T2'!L20)","v":0},{"$f":"IF(COUNTRY_INFO!K20=1,IF(COUNTRY_INFO!F20*0.33>MAX('T1'!M20,'T2'!K20),MAX('T1'!M20,'T2'!K20),COUNTRY_INFO!F20*0.33),IF(COUNTRY_INFO!K20=2,IF(COUNTRY_INFO!F20*0.5>MAX('T1'!M20,'T2'!K20),MAX('T1'!M20,'T2'!K20),COUNTRY_INFO!F20*0.5),IF(COUNTRY_INFO!K20=3,IF(COUNTRY_INFO!F20>MAX('T1'!M20,'T2'!K20),MAX('T1'!M20,'T2'!K20),COUNTRY_INFO!F20),0)))","v":0},{"$f":"IF(AND(COUNTRY_INFO!K20>0,COUNTRY_INFO!K20<4),IF(Z20>0,IF(COUNTRY_INFO!K20=1, AD20/(COUNTRY_INFO!F20*0.33)*100, IF(COUNTRY_INFO!K20=2, AD20/(COUNTRY_INFO!F20*0.5)*100, IF(COUNTRY_INFO!K20=3, AD20/COUNTRY_INFO!F20*100))),\"-\"),0)","v":0},{"$f":"IF(COUNTRY_INFO!K20=2,IF(COUNTRY_INFO!G20*0.2>MAX('T1'!N20,'T2'!L20),MAX('T1'!N20,'T2'!L20),COUNTRY_INFO!G20*0.2),IF(COUNTRY_INFO!K20=3,IF(COUNTRY_INFO!G20>MAX('T1'!N20,'T2'!L20),MAX('T1'!N20,'T2'!L20),COUNTRY_INFO!G20),0))","v":0},{"$f":"IF(AND(COUNTRY_INFO!K20>0,COUNTRY_INFO!K20<4),IF(Z20>0,IF(COUNTRY_INFO!K20=1, 0, IF(COUNTRY_INFO!K20=2, AF20/(COUNTRY_INFO!G20*0.2)*100, IF(COUNTRY_INFO!K20=3, AF20/COUNTRY_INFO!G20*100))),\"-\"),0)","v":0},0,{"$f":"IF(AND(COUNTRY_INFO!K20>0,COUNTRY_INFO!K20<4), IF(AC20/Z20*100<>0, IF(AH20/Z20*100>100,100,AH20/Z20*100), \"-\"),0)","v":0},null,{"$f":"IF(AND(D20<>0, D20<>\"Inconnu\",D20<>\"Interrompu\",D20<>\"Non requis\"),D20/COUNTRY_INFO!D20, 0)","v":0},{"$f":"IF(AND(J20<>0,J20<>\"Inconnu\",J20<>\"Interrompu\",J20<>\"Non requis\"),J20/COUNTRY_INFO!D20, 0)","v":1},{"$f":"IF(AND(P20<>0,P20<>\"Inconnu\",P20<>\"Non requis\"),P20/(COUNTRY_INFO!E20+COUNTRY_INFO!F20), 0)","v":0},{"$f":"IF(AND(Z20<>0,Z20<>\"Inconnu\",Z20<>\"Non requis\"),IF(COUNTRY_INFO!K20=1,1,IF(COUNTRY_INFO!K20=2,0.5*COUNTRY_INFO!F20/(0.5*COUNTRY_INFO!F20+0.2*COUNTRY_INFO!G20),IF(COUNTRY_INFO!K20=3,COUNTRY_INFO!F20/(COUNTRY_INFO!F20+COUNTRY_INFO!G20)))),0)","v":0},{"$f":"IF(AND(Z20<>0,Z20<>\"Inconnu\",Z20<>\"Non requis\"),IF(COUNTRY_INFO!K20=1,0,IF(COUNTRY_INFO!K20=2,0.2*COUNTRY_INFO!G20/(0.5*COUNTRY_INFO!F20+0.2*COUNTRY_INFO!G20),IF(COUNTRY_INFO!K20=3,COUNTRY_INFO!G20/(COUNTRY_INFO!F20+COUNTRY_INFO!G20)))),0)","v":0},{"$f":"MAX(COUNTRY_INFO!D20*AK20*PROFILE!$G$7,COUNTRY_INFO!D20*AL20*PROFILE!$G$7)","v":2103.6151992134883},{"$f":"MAX(COUNTRY_INFO!D20*AK20*PROFILE!$G$8,COUNTRY_INFO!D20*AL20*PROFILE!$G$8,COUNTRY_INFO!D20*AM20*PROFILE!$G$8)","v":8300.2296057843923},{"$f":"MAX(COUNTRY_INFO!D20*AK20*PROFILE!$G$9,COUNTRY_INFO!D20*AL20*PROFILE!$G$9,COUNTRY_INFO!D20*AM20*PROFILE!$G$9,IF(AND(DISTRICT!Z20<>\"Inconnu\",Z20<>\"Non requis\"),COUNTRY_INFO!P20*DISTRICT!AN20,0))","v":13643.367247512135},{"$f":"MAX(COUNTRY_INFO!D20*AK20*PROFILE!$G$10,COUNTRY_INFO!D20*AL20*PROFILE!$G$10,IF(AND(DISTRICT!Z20<>\"Inconnu\",Z20<>\"Non requis\"),COUNTRY_INFO!P20*DISTRICT!AO20,0))","v":36055.787947489989},60103,0,{"$f":"MAX('MDA4'!R20,'T1'!L20,'T2'!J20,T3_R1!K20,T3_R2!K20)","v":0},{"$f":"MAX('MDA1'!K20,'MDA4'!S20,'MDA3'!I20,'MDA3'!L20,'T1'!M20,'T2'!K20,T3_R1!L20,T3_R2!L20)","v":0},{"$f":"MAX('MDA1'!L20,'MDA4'!T20,'MDA3'!J20,'MDA3'!M20,'T1'!N20,'T2'!L20,T3_R1!M20,T3_R2!M20)","v":0},0,{"$f":"MAX('MDA4'!R20,T20)","v":0},{"$f":"MAX('MDA1'!K20,'MDA4'!S20,'MDA3'!I20,'MDA3'!L20,V20,AD20)","v":0},{"$f":"MAX('MDA1'!L20,'MDA4'!T20,'MDA3'!J20,'MDA3'!M20,AF20)","v":0},0,0]
[{"$f":"IF(COUNTRY_INFO!A21=0,\" \",COUNTRY_INFO!A21)","v":"CAR"},{"$f":"IF(COUNTRY_INFO!B21=0,\" \",COUNTRY_INFO!B21)","v":"Région Sanitaire N°5"},{"$f":"IF(COUNTRY_INFO!C21=0,\" \",COUNTRY_INFO!C21)","v":"Vakaga"},{"$f":"COUNTRY_INFO!M21","v":"Inconnu"},null,null,{"$f":"MAX('MDA1'!M21,'MDA4'!U21)","v":0},{"$f":"IF(AND(COUNTRY_INFO!H21>0,COUNTRY_INFO!H21<4),IF(D21>MAX('MDA1'!M21,'MDA4'!U21),MAX('MDA1'!M21,'MDA4'!U21),D21),0)","v":0},{"$f":"IF(AND(COUNTRY_INFO!H21>0,COUNTRY_INFO!H21<4), IF(G21/D21*100<>0, IF(G21/D21*100>100,100,G21/D21*100), \"-\"),0)","v":0},{"$f":"COUNTRY_INFO!N21","v":0},null,null,{"$f":"MAX('MDA1'!M21,MAX('MDA3'!I21,'MDA3'!L21)+MAX('MDA3'!J21,'MDA3'!M21))","v":0},{"$f":"IF(AND(COUNTRY_INFO!I21>0,COUNTRY_INFO!I21<4),IF(J21>MAX('MDA1'!M21,MAX('MDA3'!I21,'MDA3'!L21)+MAX('MDA3'!J21,'MDA3'!M21)),MAX('MDA1'!M21,MAX('MDA3'!I21,'MDA3'!L21)+MAX('MDA3'!J21,'MDA3'!M21)),J21),0)","v":0},{"$f":"IF(AND(COUNTRY_INFO!I21>0,COUNTRY_INFO!I21<4), IF(M21/J21*100<>0, IF(M21/J21*100>100,100,M21/J21*100), \"-\"),0)","v":0},{"$f":"COUNTRY_INFO!O21","v":"Inconnu"},null,null,{"$f":"SUM(MAX('MDA4'!R21, 'T1'!L21, MAX(T3_R1!K21, T3_R2!K21)), MAX('MDA1'!K21, 'MDA4'!S21, 'T1'!M21, MAX(T3_R1!L21, T3_R2!L21)), MAX('MDA1'!L21, 'MDA4'!T21, 'T1'!N21, MAX(T3_R1!M21, T3_R2!M21)))","v":0},{"$f":"IF(AND(COUNTRY_INFO!J21>1,COUNTRY_INFO!J21<4),IF(COUNTRY_INFO!E21>MAX('MDA4'!R21,'T1'!L21,MAX(T3_R1!K21,T3_R2!K21)),MAX('MDA4'!R21,'T1'!L21,MAX(T3_R1!K21,T3_R2!K21)),COUNTRY_INFO!E21),0)","v":0},{"$f":"IF(AND(COUNTRY_INFO!J21>1,COUNTRY_INFO!J21<4), IF(T21/COUNTRY_INFO!E21*100<>0, IF(T21/COUNTRY_INFO!E21*100>100,100,T21/COUNTRY_INFO!E21*100), \"-\"),0)","v":0},{"$f":"IF(AND(COUNTRY_INFO!J21>1,COUNTRY_INFO!J21<4),IF(COUNTRY_INFO!F21>MAX('MDA1'!K21,'MDA4'!S21,'T1'!M21,MAX(T3_R1!L21,T3_R2!L21)),MAX('MDA1'!K21,'MDA4'!S21,'T1'!M21,MAX(T3_R1!L21,T3_R2!L21)),COUNTRY_INFO!F21),0)","v":0},{"$f":"IF(AND(COUNTRY_INFO!J21>1,COUNTRY_INFO!J21<4), IF(V21/COUNTRY_INFO!F21*100<>0, IF(V21/COUNTRY_INFO!F21*100>100,100,V21/COUNTRY_INFO!F21*100), \"-\"),0)","v":0},0,{"$f":"IF(AND(COUNTRY_INFO!J21>1,COUNTRY_INFO!J21<4), IF(S21/P21*100<>0, IF(X21/P21*100>100,100,X21/P21*100), \"-\"),0)","v":0},{"$f":"COUNTRY_INFO!P21","v":"Inconnu"},null,null,{"$f":"MAX('T1'!L21,'T2'!J21)+MAX('T1'!M21,'T2'!K21)+MAX('T1'!N21,'T2'!L21)","v":0},{"$f":"IF(COUNTRY_INFO!K21=1,IF(COUNTRY_INFO!F21*0.33>MAX('T1'!M21,'T2'!K21),MAX('T1'!M21,'T2'!K21),COUNTRY_INFO!F21*0.33),IF(COUNTRY_INFO!K21=2,IF(COUNTRY_INFO!F21*0.5>MAX('T1'!M21,'T2'!K21),MAX('T1'!M21,'T2'!K21),COUNTRY_INFO!F21*0.5),IF(COUNTRY_INFO!K21=3,IF(COUNTRY_INFO!F21>MAX('T1'!M21,'T2'!K21),MAX('T1'!M21,'T2'!K21),COUNTRY_INFO!F21),0)))","v":0},{"$f":"IF(AND(COUNTRY_INFO!K21>0,COUNTRY_INFO!K21<4),IF(Z21>0,IF(COUNTRY_INFO!K21=1, AD21/(COUNTRY_INFO!F21*0.33)*100, IF(COUNTRY_INFO!K21=2, AD21/(COUNTRY_INFO!F21*0.5)*100, IF(COUNTRY_INFO!K21=3, AD21/COUNTRY_INFO!F21*100))),\"-\"),0)","v":0},{"$f":"IF(COUNTRY_INFO!K21=2,IF(COUNTRY_INFO!G21*0.2>MAX('T1'!N21,'T2'!L21),MAX('T1'!N21,'T2'!L21),COUNTRY_INFO!G21*0.2),IF(COUNTRY_INFO!K21=3,IF(COUNTRY_INFO!G21>MAX('T1'!N21,'T2'!L21),MAX('T1'!N21,'T2'!L21),COUNTRY_INFO!G21),0))","v":0},{"$f":"IF(AND(COUNTRY_INFO!K21>0,COUNTRY_INFO!K21<4),IF(Z21>0,IF(COUNTRY_INFO!K21=1, 0, IF(COUNTRY_INFO!K21=2, AF21/(COUNTRY_INFO!G21*0.2)*100, IF(COUNTRY_INFO!K21=3, AF21/COUNTRY_INFO!G21*100))),\"-\"),0)","v":0},0,{"$f":"IF(AND(COUNTRY_INFO!K21>0,COUNTRY_INFO!K21<4), IF(AC21/Z21*100<>0, IF(AH21/Z21*100>100,100,AH21/Z21*100), \"-\"),0)","v":0},null,{"$f":"IF(AND(D21<>0, D21<>\"Inconnu\",D21<>\"Interrompu\",D21<>\"Non requis\"),D21/COUNTRY_INFO!D21, 0)","v":0},{"$f":"IF(AND(J21<>0,J21<>\"Inconnu\",J21<>\"Interrompu\",J21<>\"Non requis\"),J21/COUNTRY_INFO!D21, 0)","v":0},{"$f":"IF(AND(P21<>0,P21<>\"Inconnu\",P21<>\"Non requis\"),P21/(COUNTRY_INFO!E21+COUNTRY_INFO!F21), 0)","v":0},{"$f":"IF(AND(Z21<>0,Z21<>\"Inconnu\",Z21<>\"Non requis\"),IF(COUNTRY_INFO!K21=1,1,IF(COUNTRY_INFO!K21=2,0.5*COUNTRY_INFO!F21/(0.5*COUNTRY_INFO!F21+0.2*COUNTRY_INFO!G21),IF(COUNTRY_INFO!K21=3,COUNTRY_INFO!F21/(COUNTRY_INFO!F21+COUNTRY_INFO!G21)))),0)","v":0},{"$f":"IF(AND(Z21<>0,Z21<>\"Inconnu\",Z21<>\"Non requis\"),IF(COUNTRY_INFO!K21=1,0,IF(COUNTRY_INFO!K21=2,0.2*COUNTRY_INFO!G21/(0.5*COUNTRY_INFO!F21+0.2*COUNTRY_INFO!G21),IF(COUNTRY_INFO!K21=3,COUNTRY_INFO!G21/(COUNTRY_INFO!F21+COUNTRY_INFO!G21)))),0)","v":0},{"$f":"MAX(COUNTRY_INFO!D21*AK21*PROFILE!$G$7,COUNTRY_INFO!D21*AL21*PROFILE!$G$7)","v":0},{"$f":"MAX(COUNTRY_INFO!D21*AK21*PROFILE!$G$8,COUNTRY_INFO!D21*AL21*PROFILE!$G$8,COUNTRY_INFO!D21*AM21*PROFILE!$G$8)","v":0},{"$f":"MAX(COUNTRY_INFO!D21*AK21*PROFILE!$G$9,COUNTRY_INFO!D21*AL21*PROFILE!$G$9,COUNTRY_INFO!D21*AM21*PROFILE!$G$9,IF(AND(DISTRICT!Z21<>\"Inconnu\",Z21<>\"Non requis\"),COUNTRY_INFO!P21*DISTRICT!AN21,0))","v":0},{"$f":"MAX(COUNTRY_INFO!D21*AK21*PROFILE!$G$10,COUNTRY_INFO!D21*AL21*PROFILE!$G$10,IF(AND(DISTRICT!Z21<>\"Inconnu\",Z21<>\"Non requis\"),COUNTRY_INFO!P21*DISTRICT!AO21,0))","v":0},0,0,{"$f":"MAX('MDA4'!R21,'T1'!L21,'T2'!J21,T3_R1!K21,T3_R2!K21)","v":0},{"$f":"MAX('MDA1'!K21,'MDA4'!S21,'MDA3'!I21,'MDA3'!L21,'T1'!M21,'T2'!K21,T3_R1!L21,T3_R2!L21)","v":0},{"$f":"MAX('MDA1'!L21,'MDA4'!T21,'MDA3'!J21,'MDA3'!M21,'T1'!N21,'T2'!L21,T3_R1!M21,T3_R2!M21)","v":0},0,{"$f":"MAX('MDA4'!R21,T21)","v":0},{"$f":"MAX('MDA1'!K21,'MDA4'!S21,'MDA3'!I21,'MDA3'!L21,V21,AD21)","v":0},{"$f":"MAX('MDA1'!L21,'MDA4'!T21,'MDA3'!J21,'MDA3'!M21,AF21)","v":0},0,0]
[{"$f":"IF(COUNTRY_INFO!A22=0,\" \",COUNTRY_INFO!A22)","v":"CAR"},{"$f":"IF(COUNTRY_INFO!B22=0,\" \",COUNTRY_INFO!B22)","v":"Région Sanitaire N°6"},{"$f":"IF(COUNTRY_INFO!C22=0,\" \",COUNTRY_INFO!C22)","v":"Mbomou"},{"$f":"COUNTRY_INFO!M22","v":232746},null,null,{"$f":"MAX('MDA1'!M22,'MDA4'!U22)","v":0},{"$f":"IF(AND(COUNTRY_INFO!H22>0,COUNTRY_INFO!H22<4),IF(D22>MAX('MDA1'!M22,'MDA4'!U22),MAX('MDA1'!M22,'MDA4'!U22),D22),0)","v":0},{"$f":"IF(AND(COUNTRY_INFO!H22>0,COUNTRY_INFO!H22<4), IF(G22/D22*100<>0, IF(G22/D22*100>100,100,G22/D22*100), \"-\"),0)","v":"-"},{"$f":"COUNTRY_INFO!N22","v":232746},null,null,{"$f":"MAX('MDA1'!M22,MAX('MDA3'!I22,'MDA3'!L22)+MAX('MDA3'!J22,'MDA3'!M22))","v":0},{"$f":"IF(AND(COUNTRY_INFO!I22>0,COUNTRY_INFO!I22<4),IF(J22>MAX('MDA1'!M22,MAX('MDA3'!I22,'MDA3'!L22)+MAX('MDA3'!J22,'MDA3'!M22)),MAX('MDA1'!M22,MAX('MDA3'!I22,'MDA3'!L22)+MAX('MDA3'!J22,'MDA3'!M22)),J22),0)","v":0},{"$f":"IF(AND(COUNTRY_INFO!I22>0,COUNTRY_INFO!I22<4), IF(M22/J22*100<>0, IF(M22/J22*100>100,100,M22/J22*100), \"-\"),0)","v":"-"},{"$f":"COUNTRY_INFO!O22","v":84975},null,null,{"$f":"SUM(MAX('MDA4'!R22, 'T1'!L22, MAX(T3_R1!K22, T3_R2!K22)), MAX('MDA1'!K22, 'MDA4'!S22, 'T1'!M22, MAX(T3_R1!L22, T3_R2!L22)), MAX('MDA1'!L22, 'MDA4'!T22, 'T1'!N22, MAX(T3_R1!M22, T3_R2!M22)))","v":0},{"$f":"IF(AND(COUNTRY_INFO!J22>1,COUNTRY_INFO!J22<4),IF(COUNTRY_INFO!E22>MAX('MDA4'!R22,'T1'!L22,MAX(T3_R1!K22,T3_R2!K22)),MAX('MDA4'!R22,'T1'!L22,MAX(T3_R1!K22,T3_R2!K22)),COUNTRY_INFO!E22),0)","v":0},{"$f":"IF(AND(COUNTRY_INFO!J22>1,COUNTRY_INFO!J22<4), IF(T22/COUNTRY_INFO!E22*100<>0, IF(T22/COUNTRY_INFO!E22*100>100,100,T22/COUNTRY_INFO!E22*100), \"-\"),0)","v":"-"},{"$f":"IF(AND(COUNTRY_INFO!J22>1,COUNTRY_INFO!J22<4),IF(COUNTRY_INFO!F22>MAX('MDA1'!K22,'MDA4'!S22,'T1'!M22,MAX(T3_R1!L22,T3_R2!L22)),MAX('MDA1'!K22,'MDA4'!S22,'T1'!M22,MAX(T3_R1!L22,T3_R2!L22)),COUNTRY_INFO!F22),0)","v":0},{"$f":"IF(AND(COUNTRY_INFO!J22>1,COUNTRY_INFO!J22<4), IF(V22/COUNTRY_INFO!F22*100<>0, IF(V22/COUNTRY_INFO!F22*100>100,100,V22/COUNTRY_INFO!F22*100), \"-\"),0)","v":"-"},0,{"$f":"IF(AND(COUNTRY_INFO!J22>1,COUNTRY_INFO!J22<4), IF(S22/P22*100<>0, IF(X22/P22*100>100,100,X22/P22*100), \"-\"),0)","v":"-"},{"$f":"COUNTRY_INFO!P22","v":17434.89},null,null,{"$f":"MAX('T1'!L22,'T2'!J22)+MAX('T1'!M22,'T2'!K22)+MAX('T1'!N22,'T2'!L22)","v":0},{"$f":"IF(COUNTRY_INFO!K22=1,IF(COUNTRY_INFO!F22*0.33>MAX('T1'!M22,'T2'!K22),MAX('T1'!M22,'T2'!K22),COUNTRY_INFO!F22*0.33),IF(COUNTRY_INFO!K22=2,IF(COUNTRY_INFO!F22*0.5>MAX('T1'!M22,'T2'!K22),MAX('T1'!M22,'T2'!K22),COUNTRY_INFO!F22*0.5),IF(COUNTRY_INFO!K22=3,IF(COUNTRY_INFO!F22>MAX('T1'!M22,'T2'!K22),MAX('T1'!M22,'T2'!K22),COUNTRY_INFO!F22),0)))","v":0},{"$f":"IF(AND(COUNTRY_INFO!K22>0,COUNTRY_INFO!K22<4),IF(Z22>0,IF(COUNTRY_INFO!K22=1, AD22/(COUNTRY_INFO!F22*0.33)*100, IF(COUNTRY_INFO!K22=2, AD22/(COUNTRY_INFO!F22*0.5)*100, IF(COUNTRY_INFO!K22=3, AD22/COUNTRY_INFO!F22*100))),\"-\"),0)","v":0},{"$f":"IF(COUNTRY_INFO!K22=2,IF(COUNTRY_INFO!G22*0.2>MAX('T1'!N22,'T2'!L22),MAX('T1'!N22,'T2'!L22),COUNTRY_INFO!G22*0.2),IF(COUNTRY_INFO!K22=3,IF(COUNTRY_INFO!G22>MAX('T1'!N22,'T2'!L22),MAX('T1'!N22,'T2'!L22),COUNTRY_INFO!G22),0))","v":0},{"$f":"IF(AND(COUNTRY_INFO!K22>0,COUNTRY_INFO!K22<4),IF(Z22>0,IF(COUNTRY_INFO!K22=1, 0, IF(COUNTRY_INFO!K22=2, AF22/(COUNTRY_INFO!G22*0.2)*100, IF(COUNTRY_INFO!K22=3, AF22/COUNTRY_INFO!G22*100))),\"-\"),0)","v":0},0,{"$f":"IF(AND(COUNTRY_INFO!K22>0,COUNTRY_INFO!K22<4), IF(AC22/Z22*100<>0, IF(AH22/Z22*100>100,100,AH22/Z22*100), \"-\"),0)","v":"-"},null,{"$f":"IF(AND(D22<>0, D22<>\"Inconnu\",D22<>\"Interrompu\",D22<>\"Non requis\"),D22/COUNTRY_INFO!D22, 0)","v":1},{"$f":"IF(AND(J22<>0,J22<>\"Inconnu\",J22<>\"Interrompu\",J22<>\"Non requis\"),J22/COUNTRY_INFO!D22, 0)","v":1},{"$f":"IF(AND(P22<>0,P22<>\"Inconnu\",P22<>\"Non requis\"),P22/(COUNTRY_INFO!E22+COUNTRY_INFO!F22), 0)","v":1},{"$f":"IF(AND(Z22<>0,Z22<>\"Inconnu\",Z22<>\"Non requis\"),IF(COUNTRY_INFO!K22=1,1,IF(COUNTRY_INFO!K22=2,0.5*COUNTRY_INFO!F22/(0.5*COUNTRY_INFO!F22+0.2*COUNTRY_INFO!G22),IF(COUNTRY_INFO!K22=3,COUNTRY_INFO!F22/(COUNTRY_INFO!F22+COUNTRY_INFO!G22)))),0)","v":1},{"$f":"IF(AND(Z22<>0,Z22<>\"Inconnu\",Z22<>\"Non requis\"),IF(COUNTRY_INFO!K22=1,0,IF(COUNTRY_INFO!K22=2,0.2*COUNTRY_INFO!G22/(0.5*COUNTRY_INFO!F22+0.2*COUNTRY_INFO!G22),IF(COUNTRY_INFO!K22=3,COUNTRY_INFO!G22/(COUNTRY_INFO!F22+COUNTRY_INFO!G22)))),0)","v":0},{"$f":"MAX(COUNTRY_INFO!D22*AK22*PROFILE!$G$7,COUNTRY_INFO!D22*AL22*PROFILE!$G$7)","v":8146.1494959676311},{"$f":"MAX(COUNTRY_INFO!D22*AK22*PROFILE!$G$8,COUNTRY_INFO!D22*AL22*PROFILE!$G$8,COUNTRY_INFO!D22*AM22*PROFILE!$G$8)","v":32142.243146396922},{"$f":"MAX(COUNTRY_INFO!D22*AK22*PROFILE!$G$9,COUNTRY_INFO!D22*AL22*PROFILE!$G$9,COUNTRY_INFO!D22*AM22*PROFILE!$G$9,IF(AND(DISTRICT!Z22<>\"Inconnu\",Z22<>\"Non requis\"),COUNTRY_INFO!P22*DISTRICT!AN22,0))","v":52833.28874414687},{"$f":"MAX(COUNTRY_INFO!D22*AK22*PROFILE!$G$10,COUNTRY_INFO!D22*AL22*PROFILE!$G$10,IF(AND(DISTRICT!Z22<>\"Inconnu\",Z22<>\"Non requis\"),COUNTRY_INFO!P22*DISTRICT!AO22,0))","v":139624.31861348858},232746,0,{"$f":"MAX('MDA4'!R22,'T1'!L22,'T2'!J22,T3_R1!K22,T3_R2!K22)","v":0},{"$f":"MAX('MDA1'!K22,'MDA4'!S22,'MDA3'!I22,'MDA3'!L22,'T1'!M22,'T2'!K22,T3_R1!L22,T3_R2!L22)","v":0},{"$f":"MAX('MDA1'!L22,'MDA4'!T22,'MDA3'!J22,'MDA3'!M22,'T1'!N22,'T2'!L22,T3_R1!M22,T3_R2!M22)","v":0},0,{"$f":"MAX('MDA4'!R22,T22)","v":0},{"$f":"MAX('MDA1'!K22,'MDA4'!S22,'MDA3'!I22,'MDA3'!L22,V22,AD22)","v":0},{"$f":"MAX('MDA1'!L22,'MDA4'!T22,'MDA3'!J22,'MDA3'!M22,AF22)","v":0},0,0]
[{"$f":"IF(COUNTRY_INFO!A23=0,\" \",COUNTRY_INFO!A23)","v":"CAR"},{"$f":"IF(COUNTRY_INFO!B23=0,\" \",COUNTRY_INFO!B23)","v":"Région Sanitaire N°6"},{"$f":"IF(COUNTRY_INFO!C23=0,\" \",COUNTRY_INFO!C23)","v":"Basse-Kotto"},{"$f":"COUNTRY_INFO!M23","v":353570},null,null,{"$f":"MAX('MDA1'!M23,'MDA4'!U23)","v":0},{"$f":"IF(AND(COUNTRY_INFO!H23>0,COUNTRY_INFO!H23<4),IF(D23>MAX('MDA1'!M23,'MDA4'!U23),MAX('MDA1'!M23,'MDA4'!U23),D23),0)","v":0},{"$f":"IF(AND(COUNTRY_INFO!H23>0,COUNTRY_INFO!H23<4), IF(G23/D23*100<>0, IF(G23/D23*100>100,100,G23/D23*100), \"-\"),0)","v":"-"},{"$f":"COUNTRY_INFO!N23","v":353570},null,null,{"$f":"MAX('MDA1'!M23,MAX('MDA3'!I23,'MDA3'!L23)+MAX('MDA3'!J23,'MDA3'!M23))","v":0},{"$f":"IF(AND(COUNTRY_INFO!I23>0,COUNTRY_INFO!I23<4),IF(J23>MAX('MDA1'!M23,MAX('MDA3'!I23,'MDA3'!L23)+MAX('MDA3'!J23,'MDA3'!M23)),MAX('MDA1'!M23,MAX('MDA3'!I23,'MDA3'!L23)+MAX('MDA3'!J23,'MDA3'!M23)),J23),0)","v":0},{"$f":"IF(AND(COUNTRY_INFO!I23>0,COUNTRY_INFO!I23<4), IF(M23/J23*100<>0, IF(M23/J23*100>100,100,M23/J23*100), \"-\"),0)","v":"-"},{"$f":"COUNTRY_INFO!O23","v":129088},null,null,{"$f":"SUM(MAX('MDA4'!R23, 'T1'!L23, MAX(T3_R1!K23, T3_R2!K23)), MAX('MDA1'!K23, 'MDA4'!S23, 'T1'!M23, MAX(T3_R1!L23, T3_R2!L23)), MAX('MDA1'!L23, 'MDA4'!T23, 'T1'!N23, MAX(T3_R1!M23, T3_R2!M23)))","v":0},{"$f":"IF(AND(COUNTRY_INFO!J23>1,COUNTRY_INFO!J23<4),IF(COUNTRY_INFO!E23>MAX('MDA4'!R23,'T1'!L23,MAX(T3_R1!K23,T3_R2!K23)),MAX('MDA4'!R23,'T1'!L23,MAX(T3_R1!K23,T3_R2!K23)),COUNTRY_INFO!E23),0)","v":0},{"$f":"IF(AND(COUNTRY_INFO!J23>1,COUNTRY_INFO!J23<4), IF(T23/COUNTRY_INFO!E23*100<>0, IF(T23/COUNTRY_INFO!E23*100>100,100,T23/COUNTRY_INFO!E23*100), \"-\"),0)","v":"-"},{"$f":"IF(AND(COUNTRY_INFO!J23>1,COUNTRY_INFO!J23<4),IF(COUNTRY_INFO!F23>MAX('MDA1'!K23,'MDA4'!S23,'T1'!M23,MAX(T3_R1!L23,T3_R2!L23)),MAX('MDA1'!K23,'MDA4'!S23,'T1'!M23,MAX(T3_R1!L23,T3_R2!L23)),COUNTRY_INFO!F23),0)","v":0},{"$f":"IF(AND(COUNTRY_INFO!J23>1,COUNTRY_INFO!J23<4), IF(V23/COUNTRY_INFO!F23*100<>0, IF(V23/COUNTRY_INFO!F23*100>100,100,V23/COUNTRY_INFO!F23*100), \"-\"),0)","v":"-"},0,{"$f":"IF(AND(COUNTRY_INFO!J23>1,COUNTRY_INFO!J23<4), IF(S23/P23*100<>0, IF(X23/P23*100>100,100,X23/P23*100), \"-\"),0)","v":"-"},{"$f":"COUNTRY_INFO!P23","v":292367},null,null,{"$f":"MAX('T1'!L23,'T2'!J23)+MAX('T1'!M23,'T2'!K23)+MAX('T1'!N23,'T2'!L23)","v":0},{"$f":"IF(COUNTRY_INFO!K23=1,IF(COUNTRY_INFO!F23*0.33>MAX('T1'!M23,'T2'!K23),MAX('T1'!M23,'T2'!K23),COUNTRY_INFO!F23*0.33),IF(COUNTRY_INFO!K23=2,IF(COUNTRY_INFO!F23*0.5>MAX('T1'!M23,'T2'!K23),MAX('T1'!M23,'T2'!K23),COUNTRY_INFO!F23*0.5),IF(COUNTRY_INFO!K23=3,IF(COUNTRY_INFO!F23>MAX('T1'!M23,'T2'!K23),MAX('T1'!M23,'T2'!K23),COUNTRY_INFO!F23),0)))","v":0},{"$f":"IF(AND(COUNTRY_INFO!K23>0,COUNTRY_INFO!K23<4),IF(Z23>0,IF(COUNTRY_INFO!K23=1, AD23/(COUNTRY_INFO!F23*0.33)*100, IF(COUNTRY_INFO!K23=2, AD23/(COUNTRY_INFO!F23*0.5)*100, IF(COUNTRY_INFO!K23=3, AD23/COUNTRY_INFO!F23*100))),\"-\"),0)","v":0},{"$f":"IF(COUNTRY_INFO!K23=2,IF(COUNTRY_INFO!G23*0.2>MAX('T1'!N23,'T2'!L23),MAX('T1'!N23,'T2'!L23),COUNTRY_INFO!G23*0.2),IF(COUNTRY_INFO!K23=3,IF(COUNTRY_INFO!G23>MAX('T1'!N23,'T2'!L23),MAX('T1'!N23,'T2'!L23),COUNTRY_INFO!G23),0))","v":0},{"$f":"IF(AND(COUNTRY_INFO!K23>0,COUNTRY_INFO!K23<4),IF(Z23>0,IF(COUNTRY_INFO!K23=1, 0, IF(COUNTRY_INFO!K23=2, AF23/(COUNTRY_INFO!G23*0.2)*100, IF(COUNTRY_INFO!K23=3, AF23/COUNTRY_INFO!G23*100))),\"-\"),0)","v":0},0,{"$f":"IF(AND(COUNTRY_INFO!K23>0,COUNTRY_INFO!K23<4), IF(AC23/Z23*100<>0, IF(AH23/Z23*100>100,100,AH23/Z23*100), \"-\"),0)","v":"-"},null,{"$f":"IF(AND(D23<>0, D23<>\"Inconnu\",D23<>\"Interrompu\",D23<>\"Non requis\"),D23/COUNTRY_INFO!D23, 0)","v":1},{"$f":"IF(AND(J23<>0,J23<>\"Inconnu\",J23<>\"Interrompu\",J23<>\"Non requis\"),J23/COUNTRY_INFO!D23, 0)","v":1},{"$f":"IF(AND(P23<>0,P23<>\"Inconnu\",P23<>\"Non requis\"),P23/(COUNTRY_INFO!E23+COUNTRY_INFO!F23), 0)","v":1},{"$f":"IF(AND(Z23<>0,Z23<>\"Inconnu\",Z23<>\"Non requis\"),IF(COUNTRY_INFO!K23=1,1,IF(COUNTRY_INFO!K23=2,0.5*COUNTRY_INFO!F23/(0.5*COUNTRY_INFO!F23+0.2*COUNTRY_INFO!G23),IF(COUNTRY_INFO!K23=3,COUNTRY_INFO!F23/(COUNTRY_INFO!F23+COUNTRY_INFO!G23)))),0)","v":0.27451798595600735},{"$f":"IF(AND(Z23<>0,Z23<>\"Inconnu\",Z23<>\"Non requis\"),IF(COUNTRY_INFO!K23=1,0,IF(COUNTRY_INFO!K23=2,0.2*COUNTRY_INFO!G23/(0.5*COUNTRY_INFO!F23+0.2*COUNTRY_INFO!G23),IF(COUNTRY_INFO!K23=3,COUNTRY_INFO!G23/(COUNTRY_INFO!F23+COUNTRY_INFO!G23)))),0)","v":0.72548201404399271},{"$f":"MAX(COUNTRY_INFO!D23*AK23*PROFILE!$G$7,COUNTRY_INFO!D23*AL23*PROFILE!$G$7)","v":12375.009999266476},{"$f":"MAX(COUNTRY_INFO!D23*AK23*PROFILE!$G$8,COUNTRY_INFO!D23*AL23*PROFILE!$G$8,COUNTRY_INFO!D23*AM23*PROFILE!$G$8)","v":48828.048212521637},{"$f":"MAX(COUNTRY_INFO!D23*AK23*PROFILE!$G$9,COUNTRY_INFO!D23*AL23*PROFILE!$G$9,COUNTRY_INFO!D23*AM23*PROFILE!$G$9,IF(AND(DISTRICT!Z23<>\"Inconnu\",Z23<>\"Non requis\"),COUNTRY_INFO!P23*DISTRICT!AN23,0))","v":80260.309097763267},{"$f":"MAX(COUNTRY_INFO!D23*AK23*PROFILE!$G$10,COUNTRY_INFO!D23*AL23*PROFILE!$G$10,IF(AND(DISTRICT!Z23<>\"Inconnu\",Z23<>\"Non requis\"),COUNTRY_INFO!P23*DISTRICT!AO23,0))","v":212107.00000000003},353570.36730955145,0,{"$f":"MAX('MDA4'!R23,'T1'!L23,'T2'!J23,T3_R1!K23,T3_R2!K23)","v":0},{"$f":"MAX('MDA1'!K23,'MDA4'!S23,'MDA3'!I23,'MDA3'!L23,'T1'!M23,'T2'!K23,T3_R1!L23,T3_R2!L23)","v":0},{"$f":"MAX('MDA1'!L23,'MDA4'!T23,'MDA3'!J23,'MDA3'!M23,'T1'!N23,'T2'!L23,T3_R1!M23,T3_R2!M23)","v":0},0,{"$f":"MAX('MDA4'!R23,T23)","v":0},{"$f":"MAX('MDA1'!K23,'MDA4'!S23,'MDA3'!I23,'MDA3'!L23,V23,AD23)","v":0},{"$f":"MAX('MDA1'!L23,'MDA4'!T23,'MDA3'!J23,'MDA3'!M23,AF23)","v":0},0,0]
[{"$f":"IF(COUNTRY_INFO!A24=0,\" \",COUNTRY_INFO!A24)","v":"CAR"},{"$f":"IF(COUNTRY_INFO!B24=0,\" \",COUNTRY_INFO!B24)","v":"Région Sanitaire N°6"},{"$f":"IF(COUNTRY_INFO!C24=0,\" \",COUNTRY_INFO!C24)","v":"Haut-Mbomou"},{"$f":"COUNTRY_INFO!M24","v":"Inconnu"},null,null,{"$f":"MAX('MDA1'!M24,'MDA4'!U24)","v":0},{"$f":"IF(AND(COUNTRY_INFO!H24>0,COUNTRY_INFO!H24<4),IF(D24>MAX('MDA1'!M24,'MDA4'!U24),MAX('MDA1'!M24,'MDA4'!U24),D24),0)","v":0},{"$f":"IF(AND(COUNTRY_INFO!H24>0,COUNTRY_INFO!H24<4), IF(G24/D24*100<>0, IF(G24/D24*100>100,100,G24/D24*100), \"-\"),0)","v":0},{"$f":"COUNTRY_INFO!N24","v":80085},null,null,{"$f":"MAX('MDA1'!M24,MAX('MDA3'!I24,'MDA3'!L24)+MAX('MDA3'!J24,'MDA3'!M24))","v":0},{"$f":"IF(AND(COUNTRY_INFO!I24>0,COUNTRY_INFO!I24<4),IF(J24>MAX('MDA1'!M24,MAX('MDA3'!I24,'MDA3'!L24)+MAX('MDA3'!J24,'MDA3'!M24)),MAX('MDA1'!M24,MAX('MDA3'!I24,'MDA3'!L24)+MAX('MDA3'!J24,'MDA3'!M24)),J24),0)","v":0},{"$f":"IF(AND(COUNTRY_INFO!I24>0,COUNTRY_INFO!I24<4), IF(M24/J24*100<>0, IF(M24/J24*100>100,100,M24/J24*100), \"-\"),0)","v":"-"},{"$f":"COUNTRY_INFO!O24","v":"Inconnu"},null,null,{"$f":"SUM(MAX('MDA4'!R24, 'T1'!L24, MAX(T3_R1!K24, T3_R2!K24)), MAX('MDA1'!K24, 'MDA4'!S24, 'T1'!M24, MAX(T3_R1!L24, T3_R2!L24)), MAX('MDA1'!L24, 'MDA4'!T24, 'T1'!N24, MAX(T3_R1!M24, T3_R2!M24)))","v":0},{"$f":"IF(AND(COUNTRY_INFO!J24>1,COUNTRY_INFO!J24<4),IF(COUNTRY_INFO!E24>MAX('MDA4'!R24,'T1'!L24,MAX(T3_R1!K24,T3_R2!K24)),MAX('MDA4'!R24,'T1'!L24,MAX(T3_R1!K24,T3_R2!K24)),COUNTRY_INFO!E24),0)","v":0},{"$f":"IF(AND(COUNTRY_INFO!J24>1,COUNTRY_INFO!J24<4), IF(T24/COUNTRY_INFO!E24*100<>0, IF(T24/COUNTRY_INFO!E24*100>100,100,T24/COUNTRY_INFO!E24*100), \"-\"),0)","v":0},{"$f":"IF(AND(COUNTRY_INFO!J24>1,COUNTRY_INFO!J24<4),IF(COUNTRY_INFO!F24>MAX('MDA1'!K24,'MDA4'!S24,'T1'!M24,MAX(T3_R1!L24,T3_R2!L24)),MAX('MDA1'!K24,'MDA4'!S24,'T1'!M24,MAX(T3_R1!L24,T3_R2!L24)),COUNTRY_INFO!F24),0)","v":0},{"$f":"IF(AND(COUNTRY_INFO!J24>1,COUNTRY_INFO!J24<4), IF(V24/COUNTRY_INFO!F24*100<>0, IF(V24/COUNTRY_INFO!F24*100>100,100,V24/COUNTRY_INFO!F24*100), \"-\"),0)","v":0},0,{"$f":"IF(AND(COUNTRY_INFO!J24>1,COUNTRY_INFO!J24<4), IF(S24/P24*100<>0, IF(X24/P24*100>100,100,X24/P24*100), \"-\"),0)","v":0},{"$f":"COUNTRY_INFO!P24","v":"Inconnu"},null,null,{"$f":"MAX('T1'!L24,'T2'!J24)+MAX('T1'!M24,'T2'!K24)+MAX('T1'!N24,'T2'!L24)","v":0},{"$f":"IF(COUNTRY_INFO!K24=1,IF(COUNTRY_INFO!F24*0.33>MAX('T1'!M24,'T2'!K24),MAX('T1'!M24,'T2'!K24),COUNTRY_INFO!F24*0.33),IF(COUNTRY_INFO!K24=2,IF(COUNTRY_INFO!F24*0.5>MAX('T1'!M24,'T2'!K24),MAX('T1'!M24,'T2'!K24),COUNTRY_INFO!F24*0.5),IF(COUNTRY_INFO!K24=3,IF(COUNTRY_INFO!F24>MAX('T1'!M24,'T2'!K24),MAX('T1'!M24,'T2'!K24),COUNTRY_INFO!F24),0)))","v":0},{"$f":"IF(AND(COUNTRY_INFO!K24>0,COUNTRY_INFO!K24<4),IF(Z24>0,IF(COUNTRY_INFO!K24=1, AD24/(COUNTRY_INFO!F24*0.33)*100, IF(COUNTRY_INFO!K24=2, AD24/(COUNTRY_INFO!F24*0.5)*100, IF(COUNTRY_INFO!K24=3, AD24/COUNTRY_INFO!F24*100))),\"-\"),0)","v":0},{"$f":"IF(COUNTRY_INFO!K24=2,IF(COUNTRY_INFO!G24*0.2>MAX('T1'!N24,'T2'!L24),MAX('T1'!N24,'T2'!L24),COUNTRY_INFO!G24*0.2),IF(COUNTRY_INFO!K24=3,IF(COUNTRY_INFO!G24>MAX('T1'!N24,'T2'!L24),MAX('T1'!N24,'T2'!L24),COUNTRY_INFO!G24),0))","v":0},{"$f":"IF(AND(COUNTRY_INFO!K24>0,COUNTRY_INFO!K24<4),IF(Z24>0,IF(COUNTRY_INFO!K24=1, 0, IF(COUNTRY_INFO!K24=2, AF24/(COUNTRY_INFO!G24*0.2)*100, IF(COUNTRY_INFO!K24=3, AF24/COUNTRY_INFO!G24*100))),\"-\"),0)","v":0},0,{"$f":"IF(AND(COUNTRY_INFO!K24>0,COUNTRY_INFO!K24<4), IF(AC24/Z24*100<>0, IF(AH24/Z24*100>100,100,AH24/Z24*100), \"-\"),0)","v":0},null,{"$f":"IF(AND(D24<>0, D24<>\"Inconnu\",D24<>\"Interrompu\",D24<>\"Non requis\"),D24/COUNTRY_INFO!D24, 0)","v":0},{"$f":"IF(AND(J24<>0,J24<>\"Inconnu\",J24<>\"Interrompu\",J24<>\"Non requis\"),J24/COUNTRY_INFO!D24, 0)","v":1},{"$f":"IF(AND(P24<>0,P24<>\"Inconnu\",P24<>\"Non requis\"),P24/(COUNTRY_INFO!E24+COUNTRY_INFO!F24), 0)","v":0},{"$f":"IF(AND(Z24<>0,Z24<>\"Inconnu\",Z24<>\"Non requis\"),IF(COUNTRY_INFO!K24=1,1,IF(COUNTRY_INFO!K24=2,0.5*COUNTRY_INFO!F24/(0.5*COUNTRY_INFO!F24+0.2*COUNTRY_INFO!G24),IF(COUNTRY_INFO!K24=3,COUNTRY_INFO!F24/(COUNTRY_INFO!F24+COUNTRY_INFO!G24)))),0)","v":0},{"$f":"IF(AND(Z24<>0,Z24<>\"Inconnu\",Z24<>\"Non requis\"),IF(COUNTRY_INFO!K24=1,0,IF(COUNTRY_INFO!K24=2,0.2*COUNTRY_INFO!G24/(0.5*COUNTRY_INFO!F24+0.2*COUNTRY_INFO!G24),IF(COUNTRY_INFO!K24=3,COUNTRY_INFO!G24/(COUNTRY_INFO!F24+COUNTRY_INFO!G24)))),0)","v":0},{"$f":"MAX(COUNTRY_INFO!D24*AK24*PROFILE!$G$7,COUNTRY_INFO!D24*AL24*PROFILE!$G$7)","v":2802.9885900705822},{"$f":"MAX(COUNTRY_INFO!D24*AK24*PROFILE!$G$8,COUNTRY_INFO!D24*AL24*PROFILE!$G$8,COUNTRY_INFO!D24*AM24*PROFILE!$G$8)","v":11059.745569759298},{"$f":"MAX(COUNTRY_INFO!D24*AK24*PROFILE!$G$9,COUNTRY_INFO!D24*AL24*PROFILE!$G$9,COUNTRY_INFO!D24*AM24*PROFILE!$G$9,IF(AND(DISTRICT!Z24<>\"Inconnu\",Z24<>\"Non requis\"),COUNTRY_INFO!P24*DISTRICT!AN24,0))","v":18179.276675324181},{"$f":"MAX(COUNTRY_INFO!D24*AK24*PROFILE!$G$10,COUNTRY_INFO!D24*AL24*PROFILE!$G$10,IF(AND(DISTRICT!Z24<>\"Inconnu\",Z24<>\"Non requis\"),COUNTRY_INFO!P24*DISTRICT!AO24,0))","v":48042.989164845938},80085,0,{"$f":"MAX('MDA4'!R24,'T1'!L24,'T2'!J24,T3_R1!K24,T3_R2!K24)","v":0},{"$f":"MAX('MDA1'!K24,'MDA4'!S24,'MDA3'!I24,'MDA3'!L24,'T1'!M24,'T2'!K24,T3_R1!L24,T3_R2!L24)","v":0},{"$f":"MAX('MDA1'!L24,'MDA4'!T24,'MDA3'!J24,'MDA3'!M24,'T1'!N24,'T2'!L24,T3_R1!M24,T3_R2!M24)","v":0},0,{"$f":"MAX('MDA4'!R24,T24)","v":0},{"$f":"MAX('MDA1'!K24,'MDA4'!S24,'MDA3'!I24,'MDA3'!L24,V24,AD24)","v":0},{"$f":"MAX('MDA1'!L24,'MDA4'!T24,'MDA3'!J24,'MDA3'!M24,AF24)","v":0},0,0]
[{"$f":"IF(COUNTRY_INFO!A25=0,\" \",COUNTRY_INFO!A25)","v":"CAR"},{"$f":"IF(COUNTRY_INFO!B25=0,\" \",COUNTRY_INFO!B25)","v":"Région Sanitaire N°7"},{"$f":"IF(COUNTRY_INFO!C25=0,\" \",COUNTRY_INFO!C25)","v":"BANGUI (8 Unités adm.)"},{"$f":"COUNTRY_INFO!M25","v":"Inconnu"},null,null,{"$f":"MAX('MDA1'!M25,'MDA4'!U25)","v":0},{"$f":"IF(AND(COUNTRY_INFO!H25>0,COUNTRY_INFO!H25<4),IF(D25>MAX('MDA1'!M25,'MDA4'!U25),MAX('MDA1'!M25,'MDA4'!U25),D25),0)","v":0},{"$f":"IF(AND(COUNTRY_INFO!H25>0,COUNTRY_INFO!H25<4), IF(G25/D25*100<>0, IF(G25/D25*100>100,100,G25/D25*100), \"-\"),0)","v":0},{"$f":"COUNTRY_INFO!N25","v":"Inconnu"},null,null,{"$f":"MAX('MDA1'!M25,MAX('MDA3'!I25,'MDA3'!L25)+MAX('MDA3'!J25,'MDA3'!M25))","v":0},{"$f":"IF(AND(COUNTRY_INFO!I25>0,COUNTRY_INFO!I25<4),IF(J25>MAX('MDA1'!M25,MAX('MDA3'!I25,'MDA3'!L25)+MAX('MDA3'!J25,'MDA3'!M25)),MAX('MDA1'!M25,MAX('MDA3'!I25,'MDA3'!L25)+MAX('MDA3'!J25,'MDA3'!M25)),J25),0)","v":0},{"$f":"IF(AND(COUNTRY_INFO!I25>0,COUNTRY_INFO!I25<4), IF(M25/J25*100<>0, IF(M25/J25*100>100,100,M25/J25*100), \"-\"),0)","v":0},{"$f":"COUNTRY_INFO!O25","v":"Inconnu"},null,null,{"$f":"SUM(MAX('MDA4'!R25, 'T1'!L25, MAX(T3_R1!K25, T3_R2!K25)), MAX('MDA1'!K25, 'MDA4'!S25, 'T1'!M25, MAX(T3_R1!L25, T3_R2!L25)), MAX('MDA1'!L25, 'MDA4'!T25, 'T1'!N25, MAX(T3_R1!M25, T3_R2!M25)))","v":0},{"$f":"IF(AND(COUNTRY_INFO!J25>1,COUNTRY_INFO!J25<4),IF(COUNTRY_INFO!E25>MAX('MDA4'!R25,'T1'!L25,MAX(T3_R1!K25,T3_R2!K25)),MAX('MDA4'!R25,'T1'!L25,MAX(T3_R1!K25,T3_R2!K25)),COUNTRY_INFO!E25),0)","v":0},{"$f":"IF(AND(COUNTRY_INFO!J25>1,COUNTRY_INFO!J25<4), IF(T25/COUNTRY_INFO!E25*100<>0, IF(T25/COUNTRY_INFO!E25*100>100,100,T25/COUNTRY_INFO!E25*100), \"-\"),0)","v":0},{"$f":"IF(AND(COUNTRY_INFO!J25>1,COUNTRY_INFO!J25<4),IF(COUNTRY_INFO!F25>MAX('MDA1'!K25,'MDA4'!S25,'T1'!M25,MAX(T3_R1!L25,T3_R2!L25)),MAX('MDA1'!K25,'MDA4'!S25,'T1'!M25,MAX(T3_R1!L25,T3_R2!L25)),COUNTRY_INFO!F25),0)","v":0},{"$f":"IF(AND(COUNTRY_INFO!J25>1,COUNTRY_INFO!J25<4), IF(V25/COUNTRY_INFO!F25*100<>0, IF(V25/COUNTRY_INFO!F25*100>100,100,V25/COUNTRY_INFO!F25*100), \"-\"),0)","v":0},0,{"$f":"IF(AND(COUNTRY_INFO!J25>1,COUNTRY_INFO!J25<4), IF(S25/P25*100<>0, IF(X25/P25*100>100,100,X25/P25*100), \"-\"),0)","v":0},{"$f":"COUNTRY_INFO!P25","v":"Inconnu"},null,null,{"$f":"MAX('T1'!L25,'T2'!J25)+MAX('T1'!M25,'T2'!K25)+MAX('T1'!N25,'T2'!L25)","v":0},{"$f":"IF(COUNTRY_INFO!K25=1,IF(COUNTRY_INFO!F25*0.33>MAX('T1'!M25,'T2'!K25),MAX('T1'!M25,'T2'!K25),COUNTRY_INFO!F25*0.33),IF(COUNTRY_INFO!K25=2,IF(COUNTRY_INFO!F25*0.5>MAX('T1'!M25,'T2'!K25),MAX('T1'!M25,'T2'!K25),COUNTRY_INFO!F25*0.5),IF(COUNTRY_INFO!K25=3,IF(COUNTRY_INFO!F25>MAX('T1'!M25,'T2'!K25),MAX('T1'!M25,'T2'!K25),COUNTRY_INFO!F25),0)))","v":0},{"$f":"IF(AND(COUNTRY_INFO!K25>0,COUNTRY_INFO!K25<4),IF(Z25>0,IF(COUNTRY_INFO!K25=1, AD25/(COUNTRY_INFO!F25*0.33)*100, IF(COUNTRY_INFO!K25=2, AD25/(COUNTRY_INFO!F25*0.5)*100, IF(COUNTRY_INFO!K25=3, AD25/COUNTRY_INFO!F25*100))),\"-\"),0)","v":0},{"$f":"IF(COUNTRY_INFO!K25=2,IF(COUNTRY_INFO!G25*0.2>MAX('T1'!N25,'T2'!L25),MAX('T1'!N25,'T2'!L25),COUNTRY_INFO!G25*0.2),IF(COUNTRY_INFO!K25=3,IF(COUNTRY_INFO!G25>MAX('T1'!N25,'T2'!L25),MAX('T1'!N25,'T2'!L25),COUNTRY_INFO!G25),0))","v":0},{"$f":"IF(AND(COUNTRY_INFO!K25>0,COUNTRY_INFO!K25<4),IF(Z25>0,IF(COUNTRY_INFO!K25=1, 0, IF(COUNTRY_INFO!K25=2, AF25/(COUNTRY_INFO!G25*0.2)*100, IF(COUNTRY_INFO!K25=3, AF25/COUNTRY_INFO!G25*100))),\"-\"),0)","v":0},0,{"$f":"IF(AND(COUNTRY_INFO!K25>0,COUNTRY_INFO!K25<4), IF(AC25/Z25*100<>0, IF(AH25/Z25*100>100,100,AH25/Z25*100), \"-\"),0)","v":0},null,{"$f":"IF(AND(D25<>0, D25<>\"Inconnu\",D25<>\"Interrompu\",D25<>\"Non requis\"),D25/COUNTRY_INFO!D25, 0)","v":0},{"$f":"IF(AND(J25<>0,J25<>\"Inconnu\",J25<>\"Interrompu\",J25<>\"Non requis\"),J25/COUNTRY_INFO!D25, 0)","v":0},{"$f":"IF(AND(P25<>0,P25<>\"Inconnu\",P25<>\"Non requis\"),P25/(COUNTRY_INFO!E25+COUNTRY_INFO!F25), 0)","v":0},{"$f":"IF(AND(Z25<>0,Z25<>\"Inconnu\",Z25<>\"Non requis\"),IF(COUNTRY_INFO!K25=1,1,IF(COUNTRY_INFO!K25=2,0.5*COUNTRY_INFO!F25/(0.5*COUNTRY_INFO!F25+0.2*COUNTRY_INFO!G25),IF(COUNTRY_INFO!K25=3,COUNTRY_INFO!F25/(COUNTRY_INFO!F25+COUNTRY_INFO!G25)))),0)","v":0},{"$f":"IF(AND(Z25<>0,Z25<>\"Inconnu\",Z25<>\"Non requis\"),IF(COUNTRY_INFO!K25=1,0,IF(COUNTRY_INFO!K25=2,0.2*COUNTRY_INFO!G25/(0.5*COUNTRY_INFO!F25+0.2*COUNTRY_INFO!G25),IF(COUNTRY_INFO!K25=3,COUNTRY_INFO!G25/(COUNTRY_INFO!F25+COUNTRY_INFO!G25)))),0)","v":0},{"$f":"MAX(COUNTRY_INFO!D25*AK25*PROFILE!$G$7,COUNTRY_INFO!D25*AL25*PROFILE!$G$7)","v":0},{"$f":"MAX(COUNTRY_INFO!D25*AK25*PROFILE!$G$8,COUNTRY_INFO!D25*AL25*PROFILE!$G$8,COUNTRY_INFO!D25*AM25*PROFILE!$G$8)","v":0},{"$f":"MAX(COUNTRY_INFO!D25*AK25*PROFILE!$G$9,COUNTRY_INFO!D25*AL25*PROFILE!$G$9,COUNTRY_INFO!D25*AM25*PROFILE!$G$9,IF(AND(DISTRICT!Z25<>\"Inconnu\",Z25<>\"Non requis\"),COUNTRY_INFO!P25*DISTRICT!AN25,0))","v":0},{"$f":"MAX(COUNTRY_INFO!D25*AK25*PROFILE!$G$10,COUNTRY_INFO!D25*AL25*PROFILE!$G$10,IF(AND(DISTRICT!Z25<>\"Inconnu\",Z25<>\"Non requis\"),COUNTRY_INFO!P25*DISTRICT!AO25,0))","v":0},0,0,{"$f":"MAX('MDA4'!R25,'T1'!L25,'T2'!J25,T3_R1!K25,T3_R2!K25)","v":0},{"$f":"MAX('MDA1'!K25,'MDA4'!S25,'MDA3'!I25,'MDA3'!L25,'T1'!M25,'T2'!K25,T3_R1!L25,T3_R2!L25)","v":0},{"$f":"MAX('MDA1'!L25,'MDA4'!T25,'MDA3'!J25,'MDA3'!M25,'T1'!N25,'T2'!L25,T3_R1!M25,T3_R2!M25)","v":0},0,{"$f":"MAX('MDA4'!R25,T25)","v":0},{"$f":"MAX('MDA1'!K25,'MDA4'!S25,'MDA3'!I25,'MDA3'!L25,V25,AD25)","v":0},{"$f":"MAX('MDA1'!L25,'MDA4'!T25,'MDA3'!J25,'MDA3'!M25,AF25)","v":0},0,0]

{"sheet":"SUMMARY","index":10,"n_rows":71,"n_cols":8,"rows_kept":71,"cut":false,"hidden":false,"merged":[[15,1,15,3],[1,1,1,7],[5,1,11,7],[3,3,3,5],[0,3,0,7],[32,1,32,2],[33,1,33,2],[34,1,34,2],[35,1,35,2],[23,1,23,5],[31,1,31,2],[24,1,24,5],[25,1,25,5],[26,1,26,5],[27,1,27,5],[70,1,70,2],[36,1,36,2],[37,1,37,2],[38,1,38,2],[67,1,67,7],[54,1,60,7],[69,1,69,2],[49,1,49,7],[50,3,50,4],[63,1,63,3],[63,4,63,7],[64,4,65,7],[65,1,65,3],[62,1,62,7]]}
[null,null,null,"Cette version sera utilisée par les pays endémiques à la Loase"]
[null,"Formulaire de Rapport Commun v.3.1 (L)"]
[]
[null,"Pays",null,{"$f":"IF(INTRO!$E$34<>0,INTRO!$E$34,\" \")","v":"CAR"},null,null,"Année",{"$f":"IF(INTRO!$E$36<>0,INTRO!$E$36,\" \")","v":2018}]
[]
[null,"Les autorités nationales sont priées de compléter ce formulaire de rapport commun et de le soumettre à l'Organisation mondiale de la Santé avant le 15 août de l'année en cours pour rapporter les données des activités de chimioprévention mises en oeuvre l'année précédente. "]
[]
[]
[]
[]
[]
[]
[]
[null,"Nombre de personnes ayant reçu un traitement (au moins une fois) pour les maladies"]
[]
[null,null,null,null,"EAPréS","EAS","Adultes","Total"]
[null,"Filariose lymphatique",null,null,0,339706,672112,{"$f":"SUM(E17:G17)","v":1011818}]
[null,"Onchocercose",null,null,"Not eligible",223313,698167,{"$f":"SUM(E18:G18)","v":921480}]
[null,"Géohelminthiases",null,null,0,339706,672112,{"$f":"SUM(E19:G19)","v":1011818}]
[null,"Schistosomiase",null,null,"Not targeted",151140,0,{"$f":"SUM(E20:G20)","v":151140}]
[]
[null,"Couverture des interventions de CP contre les maladies (%) "]
[]
[null,null,null,null,null,null,"Géographique","National"]
[null,"Filariose lymphatique",null,null,null,null,62.5,38.414414222875571]
[null,"Onchocercose",null,null,null,null,40,34.275091194550974]
[null,"Géohelminthiases",null,null,null,null,62.5,34.465026995100118]
[null,"Schistosomiase",null,null,null,null,42.857142857142854,13.410531605971368]
[]
[null,"Nombre de personnes traitées et couverture du programme en pourcentage, par intervention de CP"]
[]
[null,null,null,"EAPréS","EAS","Adultes","Total","Couverture"]
[null,"MDA 1 (IVM+ALB)",null,"Non admissible",{"$f":"'MDA1'!$K$4","v":37829},{"$f":"'MDA1'!$L$4","v":63977},{"$f":"'MDA1'!$M$4","v":101806},{"$f":"'MDA1'!$Q$4","v":84.316973381259217}]
[null,"MDA 4 (ALB/2*ALB)",null,{"$f":"'MDA4'!$R$4","v":0},{"$f":"'MDA4'!$S$4","v":301877},{"$f":"'MDA4'!$T$4","v":608135},{"$f":"'MDA4'!$U$4","v":910012},{"$f":"'MDA4'!$Y$4","v":88.698844103602781}]
[null,"MDA 3 (IVM)",null,"Non admissible",{"$f":"'MDA3'!$O$4","v":185484},{"$f":"'MDA3'!$P$4","v":634190},{"$f":"'MDA3'!$Q$4","v":819674},{"$f":"'MDA3'!$T$4","v":85.783747352204884}]
[null,"T 1 (PZQ+ALB/MBD)",null,{"$f":"IF('T1'!$L$4<>0,'T1'!$L$4,\"Non ciblé\")","v":"Non ciblé"},{"$f":"'T1'!$M$4","v":0},{"$f":"IF('T1'!$N$4<>0,'T1'!$N$4,\"Non ciblé\")","v":"Non ciblé"},{"$f":"'T1'!$O$4","v":0},{"$f":"'T1'!$S$4","v":" "}]
[null,"T 2 (PZQ)",null,{"$f":"IF('T2'!$J$4<>0,'T2'!$J$4,\"Non ciblé\")","v":"Non ciblé"},{"$f":"'T2'!$K$4","v":151140},{"$f":"'T2'!$L$4","v":0},{"$f":"'T2'!$M$4","v":151140},{"$f":"'T2'!$Q$4","v":96.119968710450834}]
[null,"T 3 (ALB/MBD) - tournée 1",null,{"$f":"T3_R1!$K$4","v":0},{"$f":"T3_R1!$L$4","v":0},{"$f":"IF(T3_R1!$M$4<>0,T3_R1!$M$4,\"Non ciblé\")","v":"Non ciblé"},{"$f":"T3_R1!$N$4","v":0},{"$f":"T3_R1!$R$4","v":" "}]
[null,"T 3 (ALB/MBD) - tournée 2",null,{"$f":"T3_R2!$K$4","v":0},{"$f":"T3_R2!$L$4","v":0},{"$f":"IF(T3_R2!$M$4<>0,T3_R2!$M$4,\"Non ciblé\")","v":"Non ciblé"},{"$f":"T3_R2!$N$4","v":0},{"$f":"T3_R2!$R$4","v":" "}]
[]
[null,"Inventaire des médicaments pour la chimiothérapie préventive dans le pays"]
[]
[null,null,"IVM","DEC","ALB (FL)","ALB (STH)","MBD","PZQ"]
[null,"Disponible"]
[null,"Distribué"]
[null,"Gaspillé"]
[null,"Reçus"]
[null,"Restant",{"$f":"C44-C45-C46+C47","v":0},0,0,0,0,0]
[]
[null,"Veuillez indiquer le médicament qui a été utilisé pour traiter les EAPréS, et les mécanismes de distribution"]
[null,"Médicament",null,"Mécanismes de distribution",null,null,"Source"]
[]
[null,"Remarques supplémentaires évenuelles concernant le rapport"]
[]
[]
[]
[]
[]
[]
[]
[]
[]
[null,"         J’ai pris connaissance et accepté la politique de la communication de données de l’OMS"]
[null,"Nom et signature du Coordonnateur MTN \nou du Représentant du Ministère de la Santé :",null,null,"Dr Valery-Kévin NDORAM-DOMBOR"]
[null,null,null,null,"2019-08-15"]
[null,"Date:"]
[]
[null,"Veuillez envoyer le rapport national (signé et sous format électronique) au représentant de l'OMS du pays en mettant en copie :"]
[]
[null,"Siège de l'OMS ",null,"PC_JointForms@who.int"]
[null,"Bureau régional de l'OMS",null,"Conseiller régional MTN"]

{"sheet":"PROFILE","index":11,"n_rows":124,"n_cols":8,"rows_kept":124,"cut":false,"hidden":false,"merged":[[16,1,16,6],[18,1,18,6],[14,1,14,6],[15,1,15,6],[7,4,7,5],[8,4,8,5],[9,4,9,5],[7,1,7,3],[8,1,8,3],[9,1,9,3],[17,1,17,6],[63,1,63,3],[25,1,25,3],[0,1,0,5],[1,1,1,7],[3,3,3,5],[5,3,5,5],[4,1,4,7],[5,1,5,2],[11,1,11,6],[6,1,6,3],[6,4,6,5],[12,1,12,6],[47,1,47,3],[51,1,51,3],[13,1,13,6],[27,1,27,3],[28,1,28,3],[59,1,59,3],[30,1,30,3],[34,1,34,3],[42,1,42,3],[81,1,81,3],[19,1,19,6],[43,1,43,3],[77,1,77,3],[80,1,80,3],[78,1,78,3],[23,1,23,3],[20,1,20,6],[79,1,79,3],[55,1,55,3],[65,1,65,3],[29,1,29,3],[21,1,21,6],[69,1,69,3],[73,1,73,3],[26,1,26,3],[123,1,124,7],[85,6,85,7],[87,6,87,7],[89,6,89,7],[86,6,86,7],[88,6,88,7]]}
[]
[null,"Formulaire de Rapport Commun v.3.1 - CP"]
[]
[null,"Pays",null,{"$f":"IF(INTRO!$E$34<>0,INTRO!$E$34,\" \")","v":"CAR"},null,null,"Année",{"$f":"IF(INTRO!$E$36<>0,INTRO!$E$36,\" \")","v":2018}]
[null,"!!! ATTENTION !!!\nAvant d’analyser les données dans le profil du pays, merci de vous assurer que le rapport dans l’onglet SUMMARY est bien mis à jour"]
[null,"Population totale ",null,null,null,null,1,{"$f":"COUNTRY_INFO!D4","v":5480402}]
[null,"Population — autres groupes d’âge",null,null,null,null,{"$f":"IF($H$6<>0,H7/$H$6,0)","v":3.5000169695580723E-2},{"$f":"H6-SUM(H8:H10)","v":191815}]
[null,"Population — EAPréS",null,null,{"$f":"INTRO!B48","v":"1-4 ans"},null,{"$f":"IF($H$6<>0,H8/$H$6,0)","v":0.13810008827819564},{"$f":"COUNTRY_INFO!E4","v":756844}]
[null,"Population — EAS",null,null,{"$f":"INTRO!B49","v":"5-14 ans"},null,{"$f":"IF($H$6<>0,H9/$H$6,0)","v":0.22699977118466858},{"$f":"COUNTRY_INFO!F4","v":1244050}]
[null,"Population — Adults",null,null,{"$f":"INTRO!B50","v":"15 ans et plus"},null,0.59989997084155511,{"$f":"COUNTRY_INFO!G4","v":3287693}]
[]
[null,"Nombre total d’individus nécessitant une CP pour au moins une des maladies (FL, Oncho, STH, SCH)",null,null,null,null,null,{"$f":"DISTRICT!AT6","v":4175395.4257939477}]
[null,"Proportion du nombre d’individus nécessitant un CP pour au moins une maladie parmi la population totale",null,null,null,null,null,{"$f":"IF(H6<>0,H12/H6,0)","v":0.76187758230033997}]
[null,"Nombre d’UMOs nécessitant une CP pour au moins une des maladies (FL, Oncho, STH, SCH)",null,null,null,null,null,{"$f":"COUNTIF(DISTRICT!AT9:AT1000,\">0\")","v":14}]
[null,"Nombre d’UMOs ayant reçu une CP pour au moins une des maladies (FL, Oncho, STH, SCH)",null,null,null,null,null,{"$f":"COUNTIF(DISTRICT!AY9:AY1000,\">0\")","v":8}]
[null,"Proportion d’UMOs nécessitant une CP pour au moins une maladie et l’ayant reçue",null,null,null,null,null,{"$f":"IF(H14<>0,H15/H14,0)","v":0.5714285714285714}]
[null,"Nombre total d’individus ayant été traités pour au moins une maladie (FL, Oncho, STH, SCH)",null,null,null,null,null,{"$f":"DISTRICT!AY6","v":1831492}]
[null,"Nombre total d’individus nécessitant un traitement ayant reçu une CP pour au moins une maladie (FL, Oncho, STH, SCH)",null,null,null,null,null,{"$f":"DISTRICT!BC6","v":1831492}]
[null,"Couverture CP pour au moins une maladie (FL, Oncho, STH, SCH)",null,null,null,null,null,{"$f":"DISTRICT!BD6","v":0.43863917383387552}]
[null,"Nombre d’UMOs ayant été traitées pour toutes les maladies nécessitant une CP dans ces unités",null,null,null,null,null,{"$f":"DISTRICT!AU6","v":7}]
[null,"Population nécessitant une CP dans des UMOs qui ont été traitées pour toutes les maladies requérant une CP",null,null,null,null,null,{"$f":"SUMIF(DISTRICT!AU9:AU1000,\"Y\",DISTRICT!AT9:AT1000)","v":2762597.058484396}]
[null,"Population ayant reçu une CP dans des UMOs qui ont été traitées pour toutes les maladies nécessitant une CP",null,null,null,null,null,{"$f":"SUMIF(DISTRICT!AU9:AU1000,\"Y\",DISTRICT!AY9:AY1000)","v":1729686}]
[]
[null,null,null,null,"FL","ONCHO","STH","SCH"]
[]
[null,"Maladies nécessitant une CP dans la pays",null,null,{"$f":"IF(INTRO!E38=\"Endémique\",\"Yes\",\"No\")","v":"Yes"},{"$f":"IF(INTRO!E40=\"Endémique\",\"Yes\",\"No\")","v":"Yes"},{"$f":"IF(INTRO!E42=\"Endémique\",\"Yes\",\"No\")","v":"Yes"},{"$f":"IF(INTRO!E44=\"Endémique\",\"Yes\",\"No\")","v":"Yes"}]
[null,"Nombre d’UMOs dans le pays",null,null,{"$f":"IF(E26=\"Yes\",INTRO!$E$46,\"-\")","v":17},{"$f":"IF(F26=\"Yes\",INTRO!$E$46,\"-\")","v":17},{"$f":"IF(G26=\"Yes\",INTRO!$E$46,\"-\")","v":17},{"$f":"IF(H26=\"Yes\",INTRO!$E$46,\"-\")","v":17}]
[null,"Nombre d’UMOs dont le statut d’endémicité est connu",null,null,{"$f":"IF(E26=\"Yes\",E27-E29,\"-\")","v":8},{"$f":"IF(F26=\"Yes\",F27-F29,\"-\")","v":16},{"$f":"IF(G26=\"Yes\",G27-G29,\"-\")","v":8},{"$f":"IF(H26=\"Yes\",H27-H29,\"-\")","v":8}]
[null,"Nombre d’UMOs dont le statut d’endémicité est inconnu",null,null,{"$f":"IF(E26=\"Yes\",E27-(992-COUNTIF(COUNTRY_INFO!H$9:H$1000,\"\"))+COUNTIF(COUNTRY_INFO!H$9:H$1000,\"=4\"),\"-\")","v":9},{"$f":"IF(F26=\"Yes\",F27-(992-COUNTIF(COUNTRY_INFO!I$9:I$1000,\"\"))+COUNTIF(COUNTRY_INFO!I$9:I$1000,\"=4\"),\"-\")","v":1},{"$f":"IF(G26=\"Yes\",G27-(992-COUNTIF(COUNTRY_INFO!J$9:J$1000,\"\"))+COUNTIF(COUNTRY_INFO!J$9:J$1000,\"=4\")+COUNTIF(COUNTRY_INFO!J$9:J$1000,\"=5\"),\"-\")","v":9},{"$f":"IF(H26=\"Yes\",H27-(992-COUNTIF(COUNTRY_INFO!K$9:K$1000,\"\"))+COUNTIF(COUNTRY_INFO!K$9:K$1000,\"=4\")+COUNTIF(COUNTRY_INFO!K$9:K$1000,\"=5\"),\"-\")","v":9}]
[null,"Nombre d’UMOs non-endémiques",null,null,{"$f":"IF(E26=\"Yes\",COUNTIF(COUNTRY_INFO!H$9:H$1000,\"=0\"),\"-\")","v":0},{"$f":"IF(F26=\"Yes\",COUNTIF(COUNTRY_INFO!I$9:I$1000,\"=0\"),\"-\")","v":6},{"$f":"IF(G26=\"Yes\",COUNTIF(COUNTRY_INFO!J$9:J$1000,\"=0\"),\"-\")","v":0},{"$f":"IF(H26=\"Yes\",COUNTIF(COUNTRY_INFO!K$9:K$1000,\"=0\"),\"-\")","v":1}]
[null,"Nombre d’UMOs nécessitant une CP (total)",null,null,{"$f":"COUNTIF(COUNTRY_INFO!H$9:H$1000,\"=1\")","v":8},{"$f":"COUNTIF(COUNTRY_INFO!I$9:I$1000,\"=1\")","v":10},{"$f":"SUM(G33:G34)","v":8},{"$f":"SUM(H32:H34)","v":7}]
[null,null,null,"prevalence basse",null,null,{"$f":"COUNTIF(COUNTRY_INFO!J$9:J$1000,\"=1\")","v":0},{"$f":"COUNTIF(COUNTRY_INFO!K$9:K$1000,\"=1\")","v":4}]
[null,null,null,"prevalence modérée",null,null,{"$f":"COUNTIF(COUNTRY_INFO!J$9:J$1000,\"=2\")","v":6},{"$f":"COUNTIF(COUNTRY_INFO!K$9:K$1000,\"=2\")","v":0}]
[null,null,null,"prevalence haute",null,null,{"$f":"COUNTIF(COUNTRY_INFO!J$9:J$1000,\"=3\")","v":2},{"$f":"COUNTIF(COUNTRY_INFO!K$9:K$1000,\"=3\")","v":3}]
[null,"Population nécessitant une CP dans le pays (total) ",null,null,{"$f":"COUNTRY_INFO!M4","v":2633954},{"$f":"COUNTRY_INFO!N4","v":2688483},{"$f":"COUNTRY_INFO!O4","v":961656},{"$f":"COUNTRY_INFO!P4","v":951991.94000000006}]
[null,null,"EAPréS","prevalence modérée",null,null,{"$f":"SUMIF(COUNTRY_INFO!J$9:J$1000,\"=2\",COUNTRY_INFO!E$9:E$1000)","v":244879}]
[null,null,null,"prevalence haute",null,null,{"$f":"SUMIF(COUNTRY_INFO!J$9:J$1000,\"=3\",COUNTRY_INFO!E$9:E$1000)","v":118870}]
[null,null,"EAS","prevalence basse",null,null,null,{"$f":"SUMIF(COUNTRY_INFO!K$9:K$1000,\"=1\",COUNTRY_INFO!F$9:F$1000)*0.33","v":110555.94}]
[null,null,null,"prevalence modérée",null,null,{"$f":"SUMIF(COUNTRY_INFO!J$9:J$1000,\"=2\",COUNTRY_INFO!F$9:F$1000)","v":402516},{"$f":"SUMIF(COUNTRY_INFO!K$9:K$1000,\"=2\",COUNTRY_INFO!F$9:F$1000)*0.5","v":0}]
[null,null,null,"prevalence haute",null,null,{"$f":"SUMIF(COUNTRY_INFO!J$9:J$1000,\"=3\",COUNTRY_INFO!F$9:F$1000)","v":195391},{"$f":"SUMIF(COUNTRY_INFO!K$9:K$1000,\"=3\",COUNTRY_INFO!F$9:F$1000)","v":230990}]
[null,null,"Adults","prevalence modérée",null,null,null,{"$f":"SUMIF(COUNTRY_INFO!K$9:K$1000,\"=2\",COUNTRY_INFO!G$9:G$1000)*0.2","v":0}]
[null,null,null,"prevalence haute",null,null,null,{"$f":"SUMIF(COUNTRY_INFO!K$9:K$1000,\"=3\",COUNTRY_INFO!G$9:G$1000)","v":610446}]
[null,"Nombre d’UMOs où une CP a été mise en oeuvre (total)",null,null,{"$f":"COUNTIF(DISTRICT!G$9:G$1000,\">0\")","v":5},{"$f":"COUNTIF(DISTRICT!M$9:M$1000,\">0\")","v":4},{"$f":"COUNTIF(DISTRICT!S$9:S$1000,\">0\")","v":5},{"$f":"COUNTIF(DISTRICT!AC$9:AC$1000,\">0\")","v":3}]
[null,"Nombre d’UMOs nécessitant une CP et  où elle a été mise en oeuvre",null,null,{"$f":"COUNTIF(DISTRICT!H$9:H$1000,\">0\")","v":5},{"$f":"COUNTIF(DISTRICT!N$9:N$1000,\">0\")","v":4},{"$f":"COUNTIF(DISTRICT!X$9:X$1000,\">0\")","v":5},{"$f":"COUNTIF(DISTRICT!AH$9:AH$1000,\">0\")","v":3}]
[null,null,"EAPréS",null,null,null,{"$f":"COUNTIF(DISTRICT!T$9:T$1000,\">0\")","v":0}]
[null,null,"EAS",null,null,null,{"$f":"COUNTIF(DISTRICT!V$9:V$1000,\">0\")","v":5},{"$f":"COUNTIF(DISTRICT!AD$9:AD$1000,\">0\")","v":3}]
[null,null,"Adults",null,null,null,null,{"$f":"COUNTIF(DISTRICT!AF$9:AF$1000,\">0\")","v":0}]
[null,"Nombre d’individus traités (total)",null,null,{"$f":"DISTRICT!G4","v":1011818},{"$f":"DISTRICT!M4","v":921480},{"$f":"DISTRICT!S4","v":1011818},{"$f":"DISTRICT!AC4","v":151140}]
[null,null,"EAPréS",null,{"$f":"SUMMARY!$E17","v":0},{"$f":"SUMMARY!$E18","v":"Not eligible"},{"$f":"SUMMARY!$E19","v":0},{"$f":"SUMMARY!$E20","v":"Not targeted"}]
[null,null,"EAS",null,{"$f":"SUMMARY!$F17","v":339706},{"$f":"SUMMARY!$F18","v":223313},{"$f":"SUMMARY!$F19","v":339706},{"$f":"SUMMARY!$F20","v":151140}]
[null,null,"Adults",null,{"$f":"SUMMARY!$G17","v":672112},{"$f":"SUMMARY!$G18","v":698167},{"$f":"SUMMARY!$G19","v":672112},{"$f":"SUMMARY!$G20","v":0}]
[null,"Nombre d’individus nécessitant CP et traités (total)",null,null,{"$f":"DISTRICT!H4","v":1011818},{"$f":"DISTRICT!N4","v":921480},{"$f":"DISTRICT!X4","v":331435},{"$f":"DISTRICT!AH4","v":127667.18}]
[null,null,"EAPréS",null,null,null,{"$f":"DISTRICT!T4","v":0}]
[null,null,"EAS",null,null,null,{"$f":"DISTRICT!V4","v":331435},{"$f":"DISTRICT!AD4","v":127667.18}]
[null,null,"Adults",null,null,null,null,{"$f":"DISTRICT!AF4","v":0}]
[null,"Couverture géographique (tous âges)",null,null,{"$f":"IF(E31<>0,E44/E31,0)","v":0.625},{"$f":"IF(F31<>0,F44/F31,0)","v":0.4},{"$f":"IF(G31<>0,G44/G31,0)","v":0.625},{"$f":"IF(H31<>0,H44/H31,0)","v":0.42857142857142855}]
[null,null,"EAPréS",null,null,null,{"$f":"IF(G31<>0,G45/G31,0)","v":0}]
[null,null,"EAS",null,null,null,{"$f":"IF(G31<>0,G46/G31,0)","v":0.625},{"$f":"IF(H31<>0,H46/H31,0)","v":0.42857142857142855}]
[null,null,"Adults",null,null,null,null,{"$f":"IF(SUM(H33:H34)<>0,H47/SUM(H33:H34),0)","v":0}]
[null,"Couverture nationale (total)",null,null,{"$f":"IF(E35<>0,E52/E35,0)","v":0.3841441422287557},{"$f":"IF(F35<>0,F52/F35,0)","v":0.34275091194550977},{"$f":"IF(G35<>0,G52/G35,0)","v":0.34465026995100118},{"$f":"IF(H35<>0,H52/H35,0)","v":0.13410531605971368}]
[null,null,"EAPréS",null,null,null,{"$f":"IF(SUM(G36:G37)<>0,G53/SUM(G36:G37),0)","v":0}]
[null,null,"EAS",null,null,null,{"$f":"IF(SUM(G39:G40)<>0,G54/SUM(G39:G40),0)","v":0.55432533822149599},{"$f":"IF(SUM(H38:H40)<>0,H54/SUM(H38:H40),0)","v":0.37379211710143589}]
[null,null,"Adults",null,null,null,null,{"$f":"IF(SUM(H41:H42)<>0,H55/SUM(H41:H42),0)","v":0}]
[null,null,null,null,"FL","ONCHO","STH","SCH"]
[]
[null,"Nombre d’UMOs ayant réalisé une couverture efficace (tous âges)",null,null,{"$f":"COUNTIF(DISTRICT!I$9:I$1000,\">=65\")","v":2},{"$f":"COUNTIF(DISTRICT!O$9:O$1000,\">=65\")","v":1},{"$f":"COUNTIF(DISTRICT!Y$9:Y$1000,\">=75\")","v":0},{"$f":"COUNTIF(DISTRICT!AI$9:AI$1000,\">=75\")","v":2}]
[null,null,"EAPréS",null,null,null,{"$f":"COUNTIF(DISTRICT!U$9:U$1000,\">=75\")","v":0}]
[null,null,"EAS",null,null,null,{"$f":"COUNTIF(DISTRICT!W$9:W$1000,\">=75\")","v":4},{"$f":"COUNTIF(DISTRICT!AE$9:AE$1000,\">=75\")","v":2}]
[null,null,"Adults",null,null,null,null,{"$f":"COUNTIF(DISTRICT!AG$9:AG$1000,\">=75\")","v":0}]
[null,"Nombre d’individus nécessitant un traitement dans des UMOs ayant réalisé une couverture efficace (total)",null,null,{"$f":"SUMIF(DISTRICT!I9:I1000,\">=65\",DISTRICT!H9:H1000)","v":448392},{"$f":"SUMIF(DISTRICT!O9:O1000,\">=65\",DISTRICT!N9:N1000)","v":376955},{"$f":"SUMIF(DISTRICT!Y9:Y1000,\">=75\",DISTRICT!X9:X1000)","v":0},{"$f":"SUMIF(DISTRICT!AI9:AI1000,\">=75\",DISTRICT!AH9:AH1000)","v":63705.180000000008}]
[null,null,"EAPréS",null,null,null,{"$f":"SUMIF(DISTRICT!U9:U1000,\">=75\",DISTRICT!T9:T1000)","v":0}]
[null,null,"EAS",null,null,null,{"$f":"SUMIF(DISTRICT!W9:W1000,\">=75\",DISTRICT!V9:V1000)","v":245187},{"$f":"SUMIF(DISTRICT!AE9:AE1000,\">=75\",DISTRICT!AD9:AD1000)","v":63705.180000000008}]
[null,null,"Adults",null,null,null,null,{"$f":"SUMIF(DISTRICT!AG9:AG1000,\">=75\",DISTRICT!AF9:AF1000)","v":0}]
[null,"Proportion d’UMOs nécessitant une CP and ayant réalisé une couverture efficace (total)",null,null,{"$f":"IF(E44<>0,E66/E44,0)","v":0.4},{"$f":"IF(F44<>0,F66/F44,0)","v":0.25},{"$f":"IF(G44<>0,G66/G44,0)","v":0},{"$f":"IF(H44<>0,H66/H44,0)","v":0.66666666666666663}]
[null,null,"EAPréS",null,null,null,{"$f":"IF(G45<>0,G67/G45,0)","v":0}]
[null,null,"EAS",null,null,null,{"$f":"IF(G46<>0,G68/G46,0)","v":0.8},{"$f":"IF(H46<>0,H68/H46,0)","v":0.66666666666666663}]
[null,null,"Adults",null,null,null,null,{"$f":"IF(H47<>0,H69/H47,0)","v":0}]
[null,"Nombre d’UMOs où la CP a été stoppée (càd sous surveillance)",null,null,{"$f":"COUNTIF(COUNTRY_INFO!H$9:H$1000,\"=99\")","v":0},{"$f":"COUNTIF(COUNTRY_INFO!I$9:I$1000,\"=99\")","v":0}]
[null,"Nombre d’individus dans les UMOs ne nécessitant plus de CP (stoppée)",null,null,{"$f":"SUMIF(COUNTRY_INFO!H$9:H$1000,\"=99\",COUNTRY_INFO!D$9:D$1000)","v":0},{"$f":"SUMIF(COUNTRY_INFO!I$9:I$1000,\"=99\",COUNTRY_INFO!D$9:D$1000)","v":0}]
[null,"Nombre d’individus nécessitant une CP vivants dans des UMOs ciblées pour la CP",null,null,{"$f":"SUMIF(DISTRICT!H$9:H$1000,\">0\",DISTRICT!D$9:D$1000)","v":1654957},{"$f":"SUMIF(DISTRICT!N$9:N$1000,\">0\",DISTRICT!J$9:J$1000)","v":1443730},{"$f":"SUMIF(DISTRICT!X$9:X$1000,\">0\",DISTRICT!P$9:P$1000)","v":604225},{"$f":"SUMIF(DISTRICT!AH$9:AH$1000,\">0\",DISTRICT!Z$9:Z$1000)","v":473818.18}]
[null,"Nombre d’individus nécessitant une CP vivant dans des UMOs non ciblées pour la CP",null,null,{"$f":"SUMIF(DISTRICT!H$9:H$1000,\"=0\",DISTRICT!D$9:D$1000)","v":978997},{"$f":"SUMIF(DISTRICT!N$9:N$1000,\"=0\",DISTRICT!J$9:J$1000)","v":1244753},{"$f":"SUMIF(DISTRICT!X$9:X$1000,\"=0\",DISTRICT!P$9:P$1000)","v":357431},{"$f":"SUMIF(DISTRICT!AH$9:AH$1000,\"=0\",DISTRICT!Z$9:Z$1000)","v":478173.76}]
[null,null,null,null,{"$f":"E35-E52","v":1622136},{"$f":"F35-F52","v":1767003},630221,824324.76]
[null,"Nombre d’UMOs nécessitant et recevant la CP",null,null,{"$f":"E31-E44","v":3},{"$f":"F31-F44","v":6},3,4]
[null,null,null,null,{"$f":"E27-E31-E29","v":0},6,0,{"$f":"H27-H31-H29","v":1}]
[]
[null,null,null,null,null,null,"Nécessitant et recevant une CP"]
[null,null,null,null,null,null,"Nécessitant mais ne recevant pas de CP"]
[null,null,null,null,null,null,"Ne nécessitant pas de CP"]
[null,null,null,null,null,null,"Statut inconnu"]
[]
[]
[]
[]
[]
[]
[]
[]
[]
[]
[]
[]
[]
[]
[]
[]
[]
[]
[]
[]
[]
[]
[]
[]
[]
[]
[]
[]
[]
[]
[]
[]
[]
[]
[null,"Cliquer ici pour accéder au portail des données de la CP"]

{"sheet":"DATA_POLICY","index":12,"n_rows":39,"n_cols":8,"rows_kept":39,"cut":false,"hidden":true,"merged":[[55,1,55,2],[0,1,0,5],[1,1,1,7],[3,3,3,5],[6,1,6,7],[8,1,12,7],[13,1,16,7],[17,1,21,7],[22,1,25,7],[26,2,36,7],[38,1,45,7]]}
[]
[null,"Formulaire de Rapport Commun v.3.1"]
[]
[null,"Pays",null,{"$f":"IF(INTRO!$E$34<>0,INTRO!$E$34,\" \")","v":"CAR"},null,null,"Année",{"$f":"IF(INTRO!$E$36<>0,INTRO!$E$36,\" \")","v":2018}]
[]
[]
[null,"Déclaration de principe sur la communication de données par l’OMS"]
[]
[null,"Les données sont le fondement de toutes les mesures rationnelles de santé publique et les avantages de la communication de données, y compris pour la science et la santé publique, sont largement reconnus. L’OMS souhaite promouvoir autant que possible la communication de données sanitaires, y compris, mais pas uniquement, de données épidémiologiques et de surveillance."]
[]
[]
[]
[]
[null,{"$f":"\"À cet égard, et sans préjudice des instruments juridiquement contraignants régissant la communication et la publication d’informations, le Ministère de la santé de \" & D4 & \", en fournissant des données à l’OMS :\"","v":"À cet égard, et sans préjudice des instruments juridiquement contraignants régissant la communication et la publication d’informations, le Ministère de la santé de CAR, en fournissant des données à l’OMS :"}]
[]
[]
[]
[null,"confirme que toutes les données à fournir à l’OMS, ont été collectées conformément à la législation nationale applicable, y compris aux lois de protection des données visant à préserver l’anonymat des personnes identifiables ;"]
[]
[]
[]
[]
[null,{"$f":"\"convient que l’OMS aura le droit, toujours sous réserve des mesures visant à garantir l’utilisation éthique et sécurisée des données et toujours sous réserve d’une reconnaissance appropriée de la part de \"&D4&\":\"","v":"convient que l’OMS aura le droit, toujours sous réserve des mesures visant à garantir l’utilisation éthique et sécurisée des données et toujours sous réserve d’une reconnaissance appropriée de la part de CAR:"}]
[]
[]
[]
[null,null,"de publier les données, dépourvues de tout élément d’identification personnelle (ci-après dénommées « les données ») et de les mettre à la disposition de toute partie intéressée, sur demande (dans la mesure où elles n’ont pas, ou pas encore, été publiées par l’OMS), selon des modalités autorisant leur utilisation non commerciale et sans but lucratif à des fins de santé publique (pour autant que l’OMS garde la maîtrise de la publication des données) ;\nd’utiliser, de compiler, d’agréger, d’évaluer et d’analyser les données et de publier et de diffuser les résultats obtenus grâce à ces données en rapport avec des travaux de l’OMS et conformément aux politiques et pratiques de l’Organisation."]
[]
[]
[]
[]
[]
[]
[]
[]
[]
[]
[]
[null,{"$f":"CONCATENATE(\"Sauf lorsque des instruments juridiquement contraignants (RSI, Règlement de Nomenclature de l’OMS, de 1967, etc.) disposent que les données doivent être communiquées et publiées, le Ministère de la santé de \", D4,\" peut, pour certaines données, décider de ne pas appliquer (tout ou partie des) (les) dispositions qui précèdent,\" & \" en informant l’OMS par écrit à l’adresse suivante, à condition que cette notification précise clairement les données, \" & \"dont il s’agit et indique clairement lesquelles des dispositions qui précèdent ne seront pas appliquées, et pour quels motifs.\")","v":"Sauf lorsque des instruments juridiquement contraignants (RSI, Règlement de Nomenclature de l’OMS, de 1967, etc.) disposent que les données doivent être communiquées et publiées, le Ministère de la santé de CAR peut, pour certaines données, décider de ne pas appliquer (tout ou partie des) (les) dispositions qui précèdent, en informant l’OMS par écrit à l’adresse suivante, à condition que cette notification précise clairement les données, dont il s’agit et indique clairement lesquelles des dispositions qui précèdent ne seront pas appliquées, et pour quels motifs."}]